##TITLE=1H_Pr CS_T
 CDCl3
 8 sc, 
 4.05.2022
##JCAMPDX= 6.0         $$ Bruker NMR JCAMP-DX V2.0
##DATA TYPE= NMR FID
##DATA CLASS= NTUPLES
##ORIGIN= UXNMR, Bruker Analytische Messtechnik GmbH
##OWNER= root
$$ XWIN-NMR		Version 3.5
$$ Wed May  4 13:49:50 2022 Russian Standard Time (UT+4h)  she@DPX200
##.OBSERVE FREQUENCY= 200.13135
##.OBSERVE NUCLEUS= ^1H
##.DELAY= (6, 6)
##.ACQUISITION MODE= SIMULTANEOUS
##.ACQUISITION SCHEME= undefined
##.AVERAGES= 8
##.DIGITISER RES= 18
##SPECTROMETER/DATA SYSTEM= spect
##.PULSE SEQUENCE= zg30
##.SOLVENT NAME= CDCl3
##.SHIFT REFERENCE= (INTERNAL, CDCl3, 0, 15.7039)
##AUDIT TRAIL= $$ (NUMBER, WHEN, WHO, WHERE, WHAT)
$$ ##TITLE= Audit trail, XWIN-NMR		Version 3.5
$$ ##JCAMPDX= 5.01
$$ ##ORIGIN= Bruker BioSpin GmbH
$$ ##OWNER= she
$$ F:/spectra/data/she/nmr/H-F/1/audita.txt
$$ ##AUDIT TRAIL=  $$ (NUMBER, WHEN, WHO, WHERE, WHAT)
(   1,<2022-05-04 13:48:15.67 +0400>,<she>,<DPX200>,
      <created by zg, POWCHK disabled, PULCHK disabled
       configuration hash MD5:
       00 E9 B6 7A A2 85 ED C7 34 08 36 98 17 FE 4E 26
       data hash MD5: 16K
       5E A9 17 07 76 94 5E 0B 4A EB 2E 73 4B 65 09 C0>)
$$ ##END=
$$ 
$$ hash MD5
$$ 10 BF 49 89 D9 E0 EE 44 37 4F CA 36 75 59 13 F4
##$RELAX= 
##$RELAX= 
##$RELAX= 
##$RELAX= 
##$RELAX= 
##$RELAX= 
$$ Bruker specific parameters
$$ --------------------------
##$DU= <F:/spectra>
##$EXPNO= 1
##$NAME= <H-F>
##$PROCNO= 1
##$TYPE= <nmr>
##$USER= <she>
##$AMP= (0..31)
100 100 100 100 100 100 100 100 100 100 100 100 100 100 100 100 100 100 
100 100 100 100 100 100 100 100 100 100 100 100 100 100 
##$AQSEQ= 0
##$AQ_mod= 1
##$AUNM= <au_zg>
##$AUTOPOS= <>
##$BF1= 200.13
##$BF2= 200.13
##$BF3= 200.13
##$BF4= 200.13
##$BF5= 200.13
##$BF6= 200.13
##$BF7= 200.13
##$BF8= 200.13
##$BYTORDA= 1
##$CFDGTYP= 0
##$CFRGTYP= 5
##$CHEMSTR= <none>
##$CNST= (0..31)
1 1 145 1 1 1 1 1 1 1 1 1 1 1 1 1 1 1 1 1 1 1 1 1 1 1 1 1 1 1 1 1 
##$CPDPRG= <>
##$CPDPRG1= <>
##$CPDPRG2= <>
##$CPDPRG3= <>
##$CPDPRG4= <mlev>
##$CPDPRG5= <mlev>
##$CPDPRG6= <mlev>
##$CPDPRG7= <mlev>
##$CPDPRG8= <mlev>
##$CPDPRGB= <>
##$CPDPRGT= <>
##$D= (0..31)
0 1.2 0 0 0 0 0 0 0 0.06 0 0.03 0 0 0 0 0.0002 0 0 0 0 0 0 0 0 0 0 0 0 
0 0 0 
##$DATE= 1651657695
##$DBL= (0..7)
120 120 120 120 120 120 120 120 
##$DBP= (0..7)
150 150 150 150 150 150 150 150 
##$DBP07= 0
##$DBPNAM0= <>
##$DBPNAM1= <>
##$DBPNAM2= <>
##$DBPNAM3= <>
##$DBPNAM4= <>
##$DBPNAM5= <>
##$DBPNAM6= <>
##$DBPNAM7= <>
##$DBPOAL= (0..7)
0.5 0.5 0.5 0.5 0.5 0.5 0.5 0.5 
##$DBPOFFS= (0..7)
0 0 0 0 0 0 0 0 
##$DE= 6
##$DECBNUC= <off>
##$DECIM= 32
##$DECNUC= <off>
##$DECSTAT= 4
##$DIGMOD= 1
##$DIGTYP= 9
##$DL= (0..7)
0 120 120 120 120 120 120 120 
##$DP= (0..7)
150 150 150 150 150 150 150 150 
##$DP07= 0
##$DPNAME0= <>
##$DPNAME1= <>
##$DPNAME2= <>
##$DPNAME3= <>
##$DPNAME4= <>
##$DPNAME5= <>
##$DPNAME6= <>
##$DPNAME7= <>
##$DPOAL= (0..7)
0.5 0.5 0.5 0.5 0.5 0.5 0.5 0.5 
##$DPOFFS= (0..7)
0 0 0 0 0 0 0 0 
##$DQDMODE= 0
##$DR= 18
##$DS= 0
##$DSLIST= <SSSSSSSSSSSSSSS>
$$ [...]
##$SUBNAM2= <"">
##$SUBNAM3= <"">
##$SUBNAM4= <"">
##$SUBNAM5= <"">
##$SUBNAM6= <"">
##$SUBNAM7= <"">
##$SUBNAM8= <"">
##$SUBNAM9= <"">
##$SW= 18.05172834244
##$SWIBOX= (0..15)
0 0 2 0 0 0 0 0 0 0 0 0 0 0 0 0 
##$SW_h= 3612.71676300578
##$TD= 16384
##$TD0= 1
##$TE= 0
##$TE2= 300
##$TE3= 300
##$TEG= 300
##$TL= (0..7)
0 120 120 120 120 120 120 120 
##$TP= (0..7)
150 150 150 150 150 150 150 150 
##$TP07= 0
##$TPNAME0= <>
##$TPNAME1= <>
##$TPNAME2= <>
##$TPNAME3= <>
##$TPNAME4= <>
##$TPNAME5= <>
##$TPNAME6= <>
##$TPNAME7= <>
##$TPOAL= (0..7)
0.5 0.5 0.5 0.5 0.5 0.5 0.5 0.5 
##$TPOFFS= (0..7)
0 0 0 0 0 0 0 0 
##$TUNHIN= 0
##$TUNHOUT= 0
##$TUNXOUT= 0
##$USERA1= <user>
##$USERA2= <user>
##$USERA3= <user>
##$USERA4= <user>
##$USERA5= <user>
##$V9= 5
##$VALIST= <valist>
##$VCLIST= <CCCCCCCCCCCCCCC>
##$VD= 0
##$VDLIST= <DDDDDDDDDDDDDDD>
##$VPLIST= <PPPPPPPPPPPPPPP>
##$VTLIST= <TTTTTTTTTTTTTTT>
##$WBST= 1024
##$WBSW= 4
##$XGAIN= (0..3)
0 0 0 0 
##$XL= 0
##$YL= 0
##$YMAX_a= 361166
##$YMIN_a= -519065
##$ZGOPTNS= <>
##$ZL1= 120
##$ZL2= 120
##$ZL3= 120
##$ZL4= 120
##$ABSF1= 10
##$ABSF2= 0
##$ABSG= 5
##$ABSL= 3
##$ALPHA= 0
##$AQORDER= 0
##$ASSFAC= 0
##$ASSFACI= 0
##$ASSFACX= 0
##$ASSWID= 0
##$AUNMP= <proc_1d>
##$AZFE= 0.1
##$AZFW= 0.1
##$BCFW= 1
##$BC_mod= 2
##$BYTORDP= 1
##$COROFFS= 0
##$CY= 11.3945322036743
##$DATMOD= 1
##$DC= 2
##$DFILT= <>
##$DTYPP= 0
##$F1P= 2.36226072786647
##$F2P= -0.459571619588291
##$FCOR= 0.5
##$FTSIZE= 0
##$FT_mod= 4
##$GAMMA= 1
##$GB= 0.15
##$INTBC= 1
##$INTSCL= 1
##$ISEN= 128
##$LB= 0.24
##$LEV0= 0
##$LPBIN= 0
##$MAXI= 10000
##$MC2= 0
##$MEAN= 0
##$ME_mod= 0
##$MI= 1.114404
##$NCOEF= 0
##$NC_proc= 0
##$NLEV= 6
##$NOISF1= 3.799351
##$NOISF2= 2.8
##$NSP= 1
##$NTH_PI= 0
##$NZP= 0
##$OFFSET= 15.70392
##$PC= 1
##$PHC0= -18392.81
##$PHC1= 8.60075
##$PH_mod= 1
##$PKNL= yes
##$PPARMOD= 0
##$PSCAL= 0
##$PSIGN= 0
##$REVERSE= no
##$SF= 200.130013532006
##$SI= 16384
##$SIGF1= 3
##$SIGF2= 2
##$SINO= 400
##$SIOLD= 16384
##$SREGLST= <1H.CDCl3>
##$SSB= 0
##$STSI= 0
##$STSR= 0
##$SW_p= 3612.71676300578
##$SYMM= 0
##$S_DEV= 0
##$TDeff= 0
##$TDoff= 0
##$TI= <>
##$TILT= no
##$TM1= 0
##$TM2= 0
##$TOPLEV= 0
##$USERP1= <user>
##$USERP2= <user>
##$USERP3= <user>
##$USERP4= <user>
##$USERP5= <user>
##$WDW= 1
##$XDIM= 8192
##$YMAX_p= 0
##$YMIN_p= 0
$$ End of Bruker specific parameters
$$ ---------------------------------
##NTUPLES= NMR FID
##VAR_NAME=  TIME,          FID/REAL,        FID/IMAG
##SYMBOL=    X,             R,               I
##VAR_TYPE=  INDEPENDENT,   DEPENDENT,       DEPENDENT
##VAR_FORM=  AFFN,          ASDF,            ASDF
##VAR_DIM=   8192,          8192,            8192
##UNITS=     SECONDS,       ARBITRARY UNITS, ARBITRARY UNITS
##FACTOR=    0.0002768,     1,               1
##FIRST=     0,             0,               0
##LAST=      2.2672688,     0,               0
##MIN=       0,             -519065,         0
##MAX=       2.2672688,     361166,          0
$$ Real data points
##PAGE= N=1
##DATA TABLE= (X++(R..R)), XYDATA
0 0 0 0 0 0 0 0 0 0 0 8 -8 8 -16 16 -17 24 -32 40 -48 56 -70 80 -96 112 -136 158 -182 212 -244 278 -318
31 -318 366 -414 470 -530 599 -672 753 -842 940 -1046 1162 -1290 1427 -1578 1745 -1928
47 -1928 2125 -2342 2579 -2840 3131 -3450 3805 -4204 4652 -5163 5746 -6421 7219 -8173
61 -8173 9335 -10795 12684 -15241 18909 -24637 34901 -58943 237429 -80812 -452321 229790
73 229790 254238 -80685 -50001 102692 -81524 15333 193933 -28996 -196542 74785 136670
84 136670 -37734 -52003 13984 -41660 16149 69460 -64635 -104593 62691 54363 -66550
95 -66550 -39901 -2531 -46874 24378 55313 -89751 -95565 78040 36723 -114861 -36474 63661
107 63661 -31206 -54664 17636 -40865 -74400 49984 35852 -118450 -57854 99218 -12412
118 -12412 -156952 1742 130454 -53603 -157586 32416 109383 -59328 -94020 38411
128 38411 29819 -40370 17813 26597 -59896 -11699 83470 4198 -68449 24089 55528 -22653
140 -22653 279 46832 -23001 -30431 67934 48884 -50135 -26300 46479 38796 10857 -7779
152 -7779 -24409 21975 63237 -3861 -37394 35066 39189 -15275 19700 36251 -32031 1809
164 1809 85521 3163 -68929 46346 76076 -50412 -23212 87410 1210 -81684 42565
175 42565 88941 -50815 -69541 49701 44838 -32313 -21291 -39 -9959 14007 13251 -41241
187 -41241 -30757 33201 14413 -40771 -20643 11574 -2636 -5576 -710 -21301 -19819 12413 10371
200 10371 -19865 -18665 -3312 -3052 1036 -1594 -24573 -19928 13874 7634 -28315 -22963 5222 1817
214 1817 -11951 -10240 -14353 -10082 14033 1522 -34470 -10298 34424 2355 -39726 1741 37522
227 37522 -6992 -26093 18210 21493 -12220 1472 21026 -3208 -5407 25267 12142 -19347
239 -19347 5617 30687 213 -14809 12766 17445 -4602 -1403 13142 4099 -3998 7090 12483
252 12483 2838 -4067 1800 16173 13468 -8296 -7234 19827 20636 -8698 -8588 17981 14349 -5670
266 -5670 957 8262 -1162 3167 10981 -4411 -13422 7019 12773 -12659 -14634 8167 3469 -14571
280 -14571 -7901 2409 -5477 -9863 -1204 -2906 -9381 -4655 -1675 -6050 -2672 -1226 -7905 -4399 4905
295 4905 -2226 -13071 -1670 9894 -4179 -14013 -567 5542 -5188 -9032 -1843 -207 -5192 -4614
309 -4614 -2989 -6184 -4915 -251 -706 -5842 -6805 742 4141 -4851 -6509 4824 6981 -3836 -3825 8817
325 8817 6419 -5083 3133 13953 2317 -6402 7202 13671 -1273 -5204 10208 11111 -4230 -3835
339 -3835 8437 5493 -3202 867 6599 -171 -3294 4483 3996 -3772 60 8889 3434 -5600 -124
354 -124 9616 4852 -3412 1147 8207 4890 -2272 -911 6110 4365 -1109 422 3233 -426 -3606
369 -3606 370 2654 -3073 -4584 206 -959 -4992 -4684 -1931 -1545 -3437 -3125 -2163 -4542 -4635 -1175 2357
386 2357 -1318 -7012 -1540 5551 -924 -7572 101 6174 -100 -4475 184 244 -3756 508 4552 -2533
402 -2533 -7763 -1733 4536 -575 -8739 -4860 5007 2946 -6740 -7403 1566 2290 -2156 1425 1710 -5427
418 -5427 -1003 9126 2948 -7681 1387 12769 2590 -7228 2497 8782 1557 -919 4045 3672
432 3672 -1474 -914 3500 2740 -1491 -1995 1371 3441 -1506 -4912 370 3995 -820 -1837 2407 -594
448 -594 -5885 2326 10124 -1116 -8497 2910 9852 679 -4484 566 3791 3777 4419 -2112 -9264 1292
464 1292 11956 1731 -10518 -5941 3511 4382 -1286 -8561 -7864 4367 7827 -7382 -13501 674
478 674 6789 -748 -4384 -3675 -3846 3489 8377 -4509 -11705 5282 12908 -2678 -7249 2255 2032
493 2032 -1262 4871 3223 -6729 -3461 6360 1374 -5552 -914 2474 -269 -2781 -3852 -926 3218
508 3218 -1081 -6227 1842 8148 -5482 -10999 8644 13514 -7134 -10133 8576 9811 -3492 -2375
522 -2375 5055 669 271 7570 2220 -7357 -1006 9286 4139 -7605 -6054 5577 8138 -3450
536 -3450 -12425 -2555 11442 4537 -8785 -5642 920 -168 2618 6417 -4236 -11684 3950 15187
550 15187 -1228 -12841 1264 11936 2353 -6606 -1598 4884 3423 -1047 -2910 299 2174 -887
564 -887 -2416 554 -1955 -4447 -736 2221 -1255 -3989 -3210 -2596 77 4216 -191 -7747 -3092 6335
580 6335 4487 -3940 -4416 2809 6141 2095 -2551 -3351 2324 6951 3440 -4566 -5761 2033 7999 2217
596 2217 -7311 -6152 2906 6387 85 -7113 -5010 2125 4494 -377 -6095 -3541 3822 6162 -1385
611 -1385 -9110 -1417 11870 6987 -8907 -6827 8783 9524 -2549 -4104 2584 2711 1183 1764 486
626 486 -1319 -1057 884 3146 -349 -5785 -1589 5079 -1347 -8014 990 6395 -5193 -5886 5267
641 5267 1509 -6351 1050 6383 -1846 -3386 3529 1108 -2495 3043 4362 -890 -1916 -443 2551
656 2551 4281 -1729 -6312 2240 7078 -5347 -8070 5842 4002 -8583 -2516 4854 -2758 -3604 3599
671 3599 -2039 -6193 3787 5518 -4252 -2896 2556 -717 1524 6006 -1797 -4658 4777 4319 -2747
686 -2747 1417 3668 -3978 115 7736 -2832 -8226 5003 6133 -6598 -4132 4351 -903 -4572
700 -4572 1133 673 -3288 122 764 -1937 719 1187 -3011 1340 5179 -1992 -4085 4707 4130 -3938
716 -3938 498 5797 -1273 -2906 4421 1184 -4831 1016 5594 -2721 -6410 1452 3724 -3614 -4789
731 -4789 1277 2194 -2739 -4465 840 2335 -2219 -2305 2171 963 -2417 -368 3374 548 -1628 1539
747 1539 2721 146 -767 489 2200 1055 -1189 155 1447 -1071 -2524 1470 1228 -3649 -2030 3751
763 3751 -1704 -6330 1217 4536 -3169 -4329 2928 1979 -3436 -513 3027 244 145 1493 -332 779
779 779 2444 11 -269 3516 1245 -3224 961 3957 -2313 -2714 4166 629 -5414 -51 3211 -3810
795 -3810 -3341 3675 716 -5671 -297 3537 -1279 -2758 1487 2250 -417 -946 32 1823 2059 -347
811 -347 -626 3125 1899 -2950 -288 4347 -16 -3386 1863 2779 -3293 -3202 2857 547 -4069 -463
827 -463 2056 -2913 -3388 1412 1343 -2893 -1576 2452 732 -2799 -279 2619 1536 -1373 -521 2327
843 2327 1582 -1416 -333 2540 1678 -1378 -830 2113 203 -2150 180 1662 -1406 -2469 423 467
859 467 -2519 -1670 1831 -72 -3253 -483 2211 -138 -2728 676 2937 82 -1910 1061 2318 327
875 327 73 1990 1635 -919 280 2268 570 -1648 -339 2017 618 -2507 -1071 1106 -105 -1973
891 -1973 -883 766 -1064 -2805 373 1872 -2097 -2537 2196 2086 -2303 -1643 3247 1827 -2205 554
907 554 3282 -426 -1711 2252 2649 -1484 -1321 2578 1361 -1661 -1205 849 456 -1112 -1250 -585 -15
924 -15 -921 -1159 -312 -189 -2079 -877 2417 276 -3333 49 3883 28 -2904 1869 3311 -837 -840
941 -840 3220 189 -2176 2347 2789 -1962 -1487 2398 523 -2597 -351 591 -675 -300 -963 -2099 240
958 240 950 -2154 -1023 1683 -831 -2316 2468 2027 -3284 58 4789 -535 -3142 3285 3340 -2840
974 -2840 -372 4675 703 -2728 708 1699 -431 -410 -67 -530 -92 -646 -1232 251 -271 -2635 -598
991 -598 2234 -1905 -4044 2059 2763 -2794 -1893 3032 1413 -1916 -232 1960 1249 106 -367 783
1007 783 1890 -351 -856 2331 410 -3182 988 3618 -2736 -4121 2801 1594 -3971 -1379 2165
1022 2165 -1521 -2324 1121 -88 -1225 801 -827 -1793 1824 1389 -2186 1508 2886 -3257 -653 6328
1038 6328 258 -5119 3125 4560 -3978 -1631 4862 -817 -3909 3045 1466 -4455 63 2805 -2695
1053 -2695 -2402 2390 -614 -2523 1025 -55 -2130 1686 1141 -3521 785 4731 -1648 -3370 3778
1068 3778 2418 -2628 1249 3326 -2593 -1832 4747 1589 -3612 269 2462 -1916 -2297 1018 1189 -1632
1084 -1632 -1547 -527 -381 -53 -51 -720 -968 -507 -35 792 112 -566 -1071 1037 2657 532 -1980 885 2855
1103 2855 -532 -1737 2797 2261 -2980 -988 3886 -1111 -3879 2780 2252 -4217 -2255 3219 -1083
1118 -1083 -3912 1946 1431 -3802 -741 1952 -1465 -363 2346 -1728 -1392 3472 345 -3387 3470
1133 3470 4021 -4639 -1235 6823 -495 -5161 4377 3277 -5735 46 6756 -2499 -6308 3618 2701
1148 2701 -4815 112 3380 -3351 -2747 2805 -323 -2560 2265 632 -3613 1336 3373 -2659 -439
1163 -439 4853 -1053 -3792 3940 3919 -4052 -422 5354 -1217 -3701 3392 2599 -4374 -1125 3921 -1261
1179 -1261 -3466 1367 1153 -2605 -594 1352 -930 -1103 1025 -953 -1216 1220 513 -1377 918 2129
1195 2129 -1366 -1474 3366 1419 -2399 1435 3180 -1987 -2355 3662 1405 -4029 291 3480 -2301
1210 -2301 -3278 2593 1123 -4182 -961 2556 -1292 -2385 1460 248 -1890 840 784 -1309 660 1541
1226 1541 -1526 85 2817 -172 -2025 2983 1797 -3213 401 4152 -1764 -2835 3325 1562 -4259
1241 -4259 -520 3883 -1871 -3658 1864 1121 -2923 -379 1913 -1142 -1265 1262 -125 -1115 1038 340
1257 340 -1106 1332 1206 -1751 425 2856 -445 -2025 2346 2465 -2288 -603 2867 -299 -2936 1454
1273 1454 1818 -2646 -1853 2119 43 -2941 -137 1381 -1239 -1793 116 456 -601 -220 -46 -107 506
1290 506 -10 -457 1091 1672 -1271 -349 2641 594 -1941 1199 2451 -1467 -1832 2487 838 -3044
1306 -3044 -43 2102 -1876 -2578 1126 615 -2262 -876 1432 -753 -1557 588 404 -325 130 -11 131
1323 131 882 187 -584 994 1675 -800 -574 2115 502 -1602 624 1987 -1085 -1615 1324 409 -2366
1340 -2366 -545 1389 -917 -1986 439 644 -1164 -1070 486 477 -804 -112 97 373 485 -198 95 1152
1358 1152 149 -411 1049 1185 -559 -436 1409 982 -1813 -371 1554 -299 -1714 555 1135 -1375
1374 -1375 -1713 665 620 -1730 -1009 955 -10 -1372 -488 1078 36 -871 431 1144 241 -641 680
1391 680 1893 359 -797 825 1855 -322 -1066 1112 1463 -964 -1070 938 264 -1861 -318 1497
1407 1497 -569 -2241 -22 996 -1198 -1228 875 519 -1080 -319 694 134 -215 371 673 546 153
1424 153 -301 725 1295 -285 -414 1261 324 -1292 176 1484 -782 -1904 1021 517 -2267 -1270 1197
1441 1197 -42 -1953 -55 950 -441 -1038 518 713 -472 -64 710 796 -444 -318 732 1232 -196
1458 -196 -517 905 1133 -219 -677 639 545 -1224 -367 1058 -512 -1978 -135 1543 -803 -2047 488
1475 488 739 -1492 -938 1231 308 -1437 224 1235 -268 -868 627 898 368 -79 2 615 755 -351
1493 -351 -300 1134 135 -1466 113 1042 -1240 -1559 1555 478 -2710 -841 1639 -463 -1710 300
1509 300 452 -876 -109 768 -18 -557 583 798 737 158 -582 547 1416 65 -779 641 1393 -959
1527 -959 -456 1297 -341 -1799 430 1216 -1216 -1953 946 421 -1514 -639 803 -204 -1084 -190 142
1544 142 -92 -102 531 427 -122 -142 382 1153 852 -888 -11 1527 466 -1120 483 1042 -1342 -920 1922
1563 1922 -51 -2496 -223 1910 -907 -1637 647 383 -1246 -397 728 -500 -700 348 96 -50
1579 -50 -30 -372 410 1430 206 -1369 1122 1869 -932 -474 1821 87 -1389 773 1161 -1484 -1085
1596 -1085 1390 -63 -2062 3 694 -667 -661 -297 -335 -188 -173 -511 400 2 -998 353 1949 135
1614 135 -1330 806 1725 -548 -66 1343 287 -787 286 877 -52 -647 38 223 -150 -1000 -348 1293
1632 1293 -165 -2136 -241 1508 -637 -1452 1194 162 -1699 36 2323 -380 -1192 1330 932 -433
1648 -433 203 776 -515 515 453 -459 -106 862 -859 -226 1582 -857 -2256 1143 1391 -2150 -1155 1642
1666 1642 -745 -2454 1080 1235 -1781 -783 1609 -364 -882 753 394 -502 287 377 -43 887 687 -981
1684 -981 509 1713 -689 -825 1695 255 -2093 667 1735 -1154 -1866 993 322 -1610 -356 674
1700 674 -727 -719 -17 -102 -92 -230 -57 540 410 -515 2 1340 219 -719 675 1132 -487 -364 1279
1719 1279 559 -778 10 877 -222 -561 -146 432 -71 -899 -648 564 163 -1592 -235 1180 -564
1736 -564 -1038 905 996 -1347 -532 1549 110 -951 803 1093 -587 117 921 402 -83 198 10 56
1754 56 399 -642 -508 817 -101 -1657 242 989 -1560 -1226 1556 137 -1850 205 1333 -1284 -963
1771 -963 1446 584 -1106 433 936 -100 -88 968 27 399 721 -276 -323 867 -52 -1132 1105 470
1789 470 -1565 -293 1413 -575 -1895 670 867 -1192 -842 1012 62 -1235 59 688 -226 -313 380
1806 380 85 -141 -33 336 552 399 -228 412 719 403 -674 408 604 -618 -707 708 246 -1068 -329
1825 -329 890 -337 -1226 -262 583 -469 -671 291 712 -752 -686 890 771 -597 12 947 181 -603
1843 -603 450 886 79 -382 143 406 -141 -273 -131 560 -177 -797 -318 562 -701 -1198 508 699 -1031
1862 -1031 -789 710 57 -1281 116 1355 -216 -790 828 663 -544 -261 916 475 -127 153 289
1879 289 273 -26 -299 -10 390 -507 -685 204 274 -1213 -291 723 -435 -1548 208 551 -1277 -713 833
1898 833 218 -735 -130 1051 143 -601 484 805 257 -96 355 501 140 -293 340 394 -100 -726 15 404
1918 404 -651 -622 430 0 -1097 -736 306 -46 -857 -186 580 -128 -500 223 638 -331 -588 681 846
1937 846 -384 -356 1005 562 -391 148 882 309 -765 317 580 -489 -633 91 240 -706 -730 -52 257
1956 257 -383 -833 -78 325 -428 -632 270 446 -886 -95 999 274 -564 236 979 -216 -281 714 655 -426
1976 -426 -241 521 483 -878 -294 613 -485 -1055 -135 368 -36 -740 -272 23 -47 -327 -76 102 -221 -403
1996 -403 305 736 -84 -472 750 662 -351 -185 1300 799 -791 31 1311 -226 -752 734 570 -935
2014 -935 -425 748 -96 -893 -413 165 -358 -383 -200 -245 176 -53 -275 -12 232 -666 -188 808 131 -967
2034 -967 490 1301 -362 -535 992 590 -560 47 1035 -154 -628 357 574 -455 -680 314 193 -769
2052 -769 -565 -51 151 -161 -303 -12 198 50 -171 408 296 -620 -211 827 230 -652 -26 1216 307
2071 307 -403 345 624 -512 -423 816 535 -845 -296 628 -11 -634 -588 263 -297 -448 38 198 -414 -598
2091 -598 234 222 -130 -537 380 654 -81 -355 549 663 -299 -100 678 535 -260 -245 550 -113 -857 311
2111 311 779 -430 -911 216 315 -599 -266 267 -38 -688 -222 426 -371 -531 203 566 105 -76 -34 416
2131 416 354 -239 177 650 -15 -296 506 885 -477 -577 711 558 -906 -430 645 -261 -793 -126 493
2150 493 -848 -453 216 -36 -491 -50 359 214 -406 -155 389 746 -159 -174 710 361 -442 -64 869 353
2170 353 -215 265 772 -293 -761 119 325 -708 -705 415 215 -919 -387 534 -265 -901 351 362 -433
2189 -433 -359 592 148 -256 -48 327 245 114 205 174 514 367 -339 313 833 -383 -685 985 328 -1386
2209 -1386 -216 1080 -542 -1294 578 233 -1212 -58 670 -538 -667 15 521 -616 18 261 -185
2226 -185 246 518 -263 493 582 -190 -211 815 157 -880 510 954 -712 -800 790 25 -936 136 651
2245 651 -425 -611 13 -49 -388 -315 174 55 -68 -352 216 431 -173 -156 581 496 -348 -133 741 437 -419
2266 -419 124 417 -151 -348 45 334 -568 -642 82 132 -556 -527 174 220 -585 -742 600 -143 -588 326 803
2287 803 -125 -360 547 316 -386 308 138 145 131 -47 160 300 79 -300 154 630 -359 -623 469 413 -982
2308 -982 -260 868 -478 -1255 572 401 -981 -262 807 -117 -838 330 421 -256 150 327 93 -75
2326 -75 233 100 372 329 -381 -256 718 107 -883 215 783 -704 -570 619 72 -1074 -281 586 -366
2345 -366 -657 172 337 -474 -220 365 259 -126 117 70 281 133 -131 301 685 -133 76 562 537 -608
2365 -608 -79 604 43 -635 219 407 -586 -610 370 110 -531 -593 155 -55 -404 -415 28 107 -237 -100 438
2386 438 252 -232 316 728 9 -344 339 740 -170 -463 444 270 -179 -110 237 -236 -669 -237 419 -85
2406 -85 -635 -424 430 -479 -547 44 391 -196 -505 136 509 -363 119 765 26 -352 96 590 123 -301 151
2427 151 429 -105 197 265 205 -245 -496 -212 491 -413 -647 129 -95 -526 -434 525 7 -367 -124 583 -291
2448 -291 -381 372 551 -379 -367 624 504 35 135 392 206 171 -171 497 187 -294 -18 516 51 -607 -66
2469 -66 188 85 -607 -59 263 -214 -512 120 249 -337 -7 535 216 -508 169 396 295 -329 -28 550
2489 550 47 -45 505 323 -19 -145 275 230 -171 -162 281 -179 -630 -274 -78 236 -565 -445 110 -223 -782
2510 -782 117 414 -243 -397 594 551 -162 57 471 -18 -115 239 521 189 80 -69 -44 287 -308 -114 48
2531 48 -77 -438 -371 365 -23 -838 182 57 -577 -18 520 87 -619 361 571 23 -188 206 614 58
2551 58 151 283 491 -93 -94 41 247 -151 -339 378 -56 -541 -422 348 -175 -555 -224 350 -358 -286 12 87
2573 87 -324 -403 458 286 -287 -249 575 193 -256 -97 328 168 -139 486 517 139 -143 119 34 -258 7 6
2595 6 227 -274 -624 297 190 -130 -327 104 221 -553 36 443 -19 -471 298 511 -311 -460 423 410 -164
2616 -164 15 666 328 -37 221 186 38 -270 -76 318 266 -278 -399 372 10 -551 -81 512 -366 -594 566
2637 566 421 -479 -175 555 4 -664 331 404 -112 -266 185 100 44 -210 159 482 185 59 -58 329 -97
2658 -97 -439 272 -41 -660 -362 410 0 -459 -31 302 -406 -460 248 431 -402 -128 625 291 -80 168 245
2679 245 274 129 -67 239 184 -146 47 420 -20 -469 92 442 -149 -371 123 197 -361 -446 233 92 -369
2700 -369 -301 490 -92 -339 145 21 -28 -93 -165 435 108 -472 287 466 -114 -110 420 116 -105 -124 314 275 -396
2723 -396 21 54 96 -230 153 54 30 -345 -21 548 142 -484 105 400 -484 -325 508 -129 -368 -44 701
2744 701 97 -189 452 515 -54 -250 249 360 70 -145 15 -47 -157 -314 -236 419 -305 -586 181 450 -404
2765 -404 -147 458 -70 -428 212 459 -417 -294 75 -2 -245 10 253 196 18 23 143 14 -1 20 156 -34
2787 -34 -254 -180 242 -187 -499 164 133 -366 -390 145 89 -70 -387 249 17 -188 -60 312 132 -457 228 449
2809 449 218 165 197 464 -74 -147 182 139 -268 6 284 30 -46 -227 9 78 -289 -245 133 62 -411 20 347
2832 347 27 -641 331 353 -347 -184 461 458 -319 284 507 95 -86 131 164 -274 -165 139 131 -342 -172 -270
2854 -270 180 -124 -537 -43 299 -138 -464 -58 329 -548 -358 304 -132 -446 38 419 16 16 388 386 -206
2875 -206 -33 138 305 -92 209 248 134 -273 -150 77 82 -437 -213 114 -8 -445 -39 168 -123 -288 47
2896 47 150 -389 -145 92 349 -363 -203 692 361 -209 5 535 89 -398 408 311 38 -299 176 2 -230
2917 -230 139 165 -31 -288 -205 -108 115 -135 -345 196 283 -431 -279 340 -346 -499 229 347 -461 -353 550
2938 550 157 -402 47 391 -49 -212 213 264 -15 -183 -141 87 71 -178 -18 109 -144 -511 -71 176 -503
2959 -503 -231 268 101 -470 237 549 39 -267 206 180 -103 -107 189 262 56 203 103 289 -390 -126 347
2980 347 69 -225 -399 40 -77 -767 -106 20 75 -91 -77 19 -12 -197 155 206 -193 -36 401 252 -374 38
3002 38 534 12 -111 -206 196 67 -76 144 248 -92 -398 245 -3 -590 -297 130 1 -286 -101 23 -48
3023 -48 -272 -10 77 187 -351 94 518 78 -317 287 583 218 81 289 69 -113 58 231 206 -386 184
3044 184 325 74 -498 -155 149 -160 -378 119 92 -87 -133 163 90 -321 -290 274 358 -177 -114 282 328 -67
3066 -67 -115 344 38 -159 508 288 142 -365 131 50 -194 -214 119 -95 -633 -343 240 125 -241 -123 302
3087 302 -404 -244 181 -9 -78 -159 -60 156 -145 -336 88 81 -6 -196 453 235 -253 102 465 127 -310 242
3109 242 212 -104 -370 132 393 -328 -287 -92 -164 -233 -40 129 -120 -41 56 213 110 -216 -63 479 -29 -116
3131 -116 270 341 -67 -176 265 405 -388 44 337 -238 -221 -27 433 -161 -176 -165 301 -117 -234 -50 134
3152 134 -48 -553 125 185 -230 55 390 -97 -191 44 414 -46 -216 228 139 -121 85 -4 53 -9 -233 56
3174 56 154 27 -294 224 255 -238 -364 -96 43 -457 -272 320 -214 -213 73 46 -95 -56 98 221 59 -29 276
3197 276 99 -23 -165 281 160 -153 -261 314 2 -428 -136 648 -340 -109 75 180 -266 -159 6 -150
3217 -150 -68 -128 3 46 73 -146 239 223 220 116 208 315 -63 -130 206 -176 -436 103 229 -179 -185 203 120 -266
3241 -266 -131 -4 -206 -224 -6 124 161 -64 -246 134 25 -160 22 224 49 -88 518 121 -124 -66 476
3262 476 -85 -446 355 72 -172 -60 147 -2 12 -469 110 108 -385 -402 3 159 -92 -377 189 144 -339 -162
3284 -162 149 0 -269 155 463 -147 -160 453 206 -62 -122 283 58 32 -8 122 -100 165 -276 68 98 -245
3306 -245 -274 102 45 -673 196 343 -285 -438 334 190 -173 41 221 -65 -74 8 157 -61 -24 3 89 269 -48
3329 -48 19 250 213 -234 -246 416 90 -71 374 108 -224 -216 211 -146 -283 69 299 -313 -190 250 -190 145
3351 145 20 99 278 150 -258 120 187 38 50 302 62 -12 78 80 413 -350 -78 287 121 -169 265 -99
3373 -99 -276 -277 -29 -80 -153 -249 305 217 -359 -193 101 -130 -571 3 197 -14 -203 124 412 -2 95 398 -10
3396 -10 -205 -148 197 109 277 -361 189 112 -521 -239 216 220 -376 -230 46 -128 -300 271 177 -54 -93 361 154
3419 154 147 67 513 192 -19 -102 116 158 75 -145 58 -103 -203 -102 -65 -224 -197 195 164 -186 -64 523 103
3442 103 -303 -54 258 247 -121 201 -60 -235 -398 35 320 -28 135 211 42 -197 -152 -34 92 -238 -23
3463 -23 219 229 -221 201 248 -100 -302 -112 204 -248 -314 255 269 -233 -58 113 63 -148 -128 139 124 -504 -63
3486 -63 114 51 -99 164 599 111 74 201 233 66 -306 331 -77 -474 -379 -31 -82 -191 57 208 -59 -444
3508 -444 201 -107 -119 -370 322 427 -154 -278 -6 -64 -133 -96 312 132 -174 -455 111 520 -311 -55 279
3529 279 -152 -271 -68 33 -246 -65 -89 -132 -149 -293 -297 170 -141 -133 -108 104 -136 -305 386 84 2 -77 108
3552 108 259 117 119 35 -41 -119 470 300 -270 60 352 107 -310 -110 -150 -95 -203 -120 58 -43 -143 22 35
3575 35 -225 187 246 185 -106 -187 397 -10 -150 249 433 155 -207 69 186 39 -87 -93 40 119 -243 -91
3597 -91 187 -241 -406 43 -25 -110 35 103 73 -138 71 229 94 41 62 51 -132 -209 285 179 -173 -167 361 135
3621 135 -274 -4 99 152 -123 53 -49 -173 -15 229 -133 -232 -106 21 110 -51 -83 206 203 -37 -155 266
3643 266 -68 -138 -37 553 45 -406 -52 217 -15 -23 455 24 -61 -230 -90 361 -278 -166 -72 102 -67 -154
3665 -154 -147 -92 -270 -123 346 -149 -143 -202 148 -150 -111 174 -119 -124 -74 253 87 38 54 85 23 -90 -78 289 -67
3690 -67 10 68 302 2 -158 -239 90 -471 -293 238 356 -223 167 55 59 202 -66 78 109 -4 103 306
3712 306 13 124 23 377 -88 -64 91 -57 -123 -237 237 -152 -343 9 -40 -162 -262 21 -14 -80 -336 -50
3734 -50 -83 141 238 136 215 -195 -234 168 373 -350 31 234 3 44 23 368 70 7 -108 70 -32 -180 108
3757 108 22 -57 -265 35 70 -15 -20 30 46 -150 -210 202 61 -210 -18 279 28 -60 204 238 -346 90 159 231
3781 231 -160 -185 95 150 65 -131 78 -32 -360 -112 -114 -93 -226 14 108 -130 -179 114 182 -178 -80 241 -69
3804 -69 -284 258 117 -156 -171 195 309 -51 -26 92 -81 -191 -208 -8 -82 -60 -70 168 193 -169 62 -24 -34
3827 -34 -336 -245 271 51 -202 91 214 -23 0 52 257 -61 101 39 279 170 79 35 95 -262 -12 2 -205
3850 -205 -30 -20 103 119 8 -35 -72 -163 -85 239 -14 -333 27 131 -15 -90 -138 -101 149 -59 254 -130 121
3873 121 -494 38 98 1 -14 90 170 57 -30 36 -114 -180 -74 268 -146 -239 370 -21 -145 5 -121 -2 -211
3896 -211 -6 0 0 -46 -99 233 262 -157 -2 267 110 -165 100 186 -7 -259 215 150 -374 -119 187 -1 -250
3919 -250 -238 21 -71 46 -246 -183 268 -30 -250 78 39 -106 -8 226 204 -249 74 298 -177 39 283 200
3941 200 -148 2 94 5 -131 -118 -72 -109 -151 -87 117 79 -185 77 -59 67 -164 79 105 14 -327 107 -159
3964 -159 -171 -224 232 -70 23 -24 529 173 -129 128 203 -307 -174 128 108 92 -286 -22 -238 -119 -101 202 -105
3987 -105 -113 -138 98 -52 -99 112 59 -164 -30 253 130 -129 -140 136 106 4 -174 292 37 -39 74 202 -94
4010 -94 -164 87 289 -59 -242 249 -156 -24 26 -17 35 -231 10 112 29 69 -198 179 156 -206 1 260 -183
4033 -183 -126 85 -135 204 19 48 98 -72 -105 275 -99 -48 -247 116 -80 108 -121 -39 -4 -244 -54 70
4055 70 43 -85 81 245 -213 52 252 80 -283 -69 315 61 137 -149 211 255 -78 -210 -27 -104 -107 -190 250
4078 250 -154 20 227 318 -289 -122 -10 33 4 -130 248 209 -135 127 5 -40 -63 357 13 52 546 -53
4100 -53 35 -136 158 161 123 -159 -211 -96 137 -189 -43 249 24 -74 -25 185 63 32 -27 -15 -165 86 -6 -6 -148
4125 -148 -75 121 88 -162 44 -48 -189 -173 220 47 -84 -17 260 163 78 194 31 47 64 34 -41 -20 -191 29
4149 29 158 -133 -345 -9 330 134 -202 214 156 -164 34 195 45 -26 -97 61 20 -47 87 17 -70 -159 30
4172 30 -7 77 -63 84 18 -193 -194 -112 -2 76 -75 137 35 -349 -36 -43 27 -163 222 12 13 -199 174 125 190
4197 190 -128 -140 98 -256 -155 300 147 -297 -164 39 164 -194 -201 239 -41 102 -70 131 104 -113 60
4218 60 76 -3 -99 106 86 30 53 144 77 35 -45 -65 -183 -9 -10 171 279 115 -113 -209 -138 -7 -136 -88 -152 44
4244 44 -1 -153 -235 58 54 -25 -113 55 302 -279 -24 -6 256 -42 13 -174 307 49 106 246 105 33 -80 -48
4268 -48 8 12 -208 75 16 45 -145 153 -68 -176 100 -48 -357 -155 284 3 -184 -189 -37 -127 1 44 38 -46
4292 -46 7 204 310 287 -93 50 7 -1 21 -11 386 -95 -65 -82 -70 125 -155 144 -50 -57 66 129 -136 -138 241
4317 241 134 -52 179 36 -4 33 -43 13 87 3 -94 134 -18 -136 191 271 104 -133 -28 76 -69 3 176
4340 176 -249 -156 196 -103 -213 -8 80 87 113 -5 -40 90 185 -139 85 355 176 -194 110 92 111 -89 238
4363 238 3 -108 -194 186 157 -47 -150 -122 -266 -50 -53 41 -336 -388 -287 34 73 -47 303 -29 -110 -236 168
4386 168 263 18 158 223 -52 -351 -35 -97 -37 -170 -42 -29 97 130 -90 -164 -250 43 91 39 -250 -41 -51 8
4410 8 28 -98 303 -15 -64 91 58 -22 -42 -106 375 -9 -43 317 -67 -57 -335 177 -95 -285 3 18 -113 -84
4434 -84 9 123 -41 213 -192 -218 84 -42 -82 134 -144 37 58 57 66 59 106 -200 -145 63 229 43 -250 269
4458 269 -41 34 -118 -81 -108 -70 -253 -55 -221 -6 -3 153 -144 -97 -156 -68 -309 -246 -18 131 56 184 322 253
4482 253 -28 -186 -31 92 26 165 -150 -144 -114 217 -86 -136 225 69 199 -197 210 -186 291 -149 -126 119
4504 119 98 -213 -148 101 14 -192 304 46 -37 32 176 223 -235 195 -71 -9 107 -54 -63 99 -81 -92 293
4527 293 -166 -269 -79 -90 -59 -61 -90 7 44 -126 176 128 -126 -62 124 214 -87 -231 110 -73 -263 -157 138
4550 138 61 16 -4 192 -150 -35 85 238 -149 -132 -278 206 212 -84 55 -57 37 -90 40 -50 -313 -197 347
4573 347 -104 42 50 122 -69 130 126 167 53 -217 -113 31 -225 -118 23 17 -216 -45 182 -34 -73 -143 -144 -175
4597 -175 -243 144 72 -195 -101 -49 -26 -12 -22 84 -12 -214 -241 459 22 16 229 -18 122 -461 -145 -162 86 -229
4621 -229 164 52 -14 -279 24 -71 -16 -136 218 -152 -128 43 -32 -33 -239 41 -163 -2 -55 224 57 -90 -62
4644 -62 340 296 48 108 184 -103 -189 20 168 -239 -253 -96 172 -124 -47 -19 170 7 -267 151 123 -63 -348
4667 -348 61 -1 -183 -121 30 44 -105 77 129 24 -197 179 -68 13 -7 -35 209 116 22 183 -74 -137 141
4690 141 -4 20 -216 -104 147 -69 -81 -105 58 101 -162 -56 107 -179 -35 134 220 -245 36 302 92 122
4712 122 -65 385 82 16 69 196 -10 -264 125 -75 -113 -266 -30 110 5 -31 155 106 158 -208 50 21
4734 21 -145 249 72 -46 -86 114 128 -126 64 292 264 -105 -50 22 125 74 16 42 -130 -4 -100 325 -36
4757 -36 134 -21 132 41 -153 30 43 -204 -153 -42 181 62 0 48 -110 -127 -23 116 16 64 278 197 -233
4780 -233 -25 251 -89 118 79 176 -108 -99 153 98 89 -226 82 250 135 -237 159 155 -3 -52 223 70 -70
4803 -70 48 -14 82 -168 -79 232 -98 -266 80 3 -73 -34 -42 -25 -68 -163 -91 -194 226 -272 -112 140 93 -59 21
4828 21 22 -168 -80 156 43 -364 67 15 88 48 166 256 -76 -119 96 -6 -54 -345 -296 -129 -128 -252 48 -32 -122
4853 -122 137 38 -158 -406 13 258 19 -138 146 10 -162 215 67 -43 -43 -57 -105 92 -171 139 -73 -76
4875 -76 -109 -280 190 -308 -31 96 -15 -301 39 92 130 -138 -120 -20 70 -15 -213 183 -127 -183 94 137 273
4898 273 -184 41 -126 -58 56 166 129 -96 -82 57 22 184 -112 145 74 -84 239 6 113 122 -108 98
4920 98 189 152 -50 309 -135 145 75 -70 -121 -235 247 204 -33 -110 97 179 -4 137 -171 -108 10 -78 203
4943 203 24 192 262 156 187 -66 -88 -127 -184 -64 76 -42 64 147 23 -207 -35 230 257 -214 -191 85 303
4966 303 10 183 -26 25 29 1 -55 -9 -124 83 -35 -191 -71 132 185 78 -179 84 247 -35 212 50
4988 50 -144 -7 204 -41 -363 -100 -64 30 -43 -235 81 198 -32 35 -101 130 88 -83 -77 43 -175 -20 143
5011 143 -204 -6 19 52 -103 -224 116 -68 -45 -87 79 -11 -118 -132 144 -116 -6 149 183 212 24 66 187
5034 187 121 -30 -53 -236 -103 -45 51 35 -78 -102 345 -211 -144 -177 166 37 78 -51 259 -19 46 -84 19
5057 19 67 -301 239 137 87 -40 -163 23 10 -266 282 -32 -137 -111 188 108 -441 -107 293 33 21 92 149
5080 149 -288 -144 31 90 -133 38 131 -127 -93 -84 -49 134 -188 115 -132 -98 137 -52 112 -185 -63 89
5102 89 194 -66 151 24 250 -89 27 -30 61 -305 -310 22 -338 -87 -151 111 -147 24 -217 -92 354 24
5124 24 -99 0 177 -49 102 25 16 -203 49 -99 -154 -12 186 126 202 -58 -1 47 60 150 -64 -120 -264 45
5148 45 -29 -288 -36 236 -87 46 145 -49 -15 267 -10 30 66 -40 129 205 -245 -123 128 15 -129 -83 102
5171 102 -19 -165 -54 -30 -25 -295 -88 100 -99 -196 -73 169 -383 -80 -108 -60 3 147 47 237 -128 259
5193 259 139 70 139 -3 -34 151 64 11 132 -71 232 -115 78 -101 -42 -257 80 -66 14 -54 -8 -305 184
5216 184 4 10 -108 -73 154 162 -63 29 135 -140 -109 89 -161 -317 -103 147 -80 -6 60 -176 -100 -40 -201 -155
5240 -155 -128 -59 -120 11 -12 -56 72 -130 53 47 106 129 84 242 -26 -57 -222 241 13 -113 -157 -106 -244 -314 -99
5265 -99 57 136 36 159 0 39 -113 90 242 -24 -53 145 125 -193 17 50 204 98 98 148 37 -107 137
5288 137 -106 138 42 164 -112 -120 -265 -70 104 -205 11 26 -98 -71 -173 184 205 -65 -267 -23 5 3 139
5311 139 26 -4 -74 128 196 -212 -238 153 24 152 14 -213 -106 63 -27 64 56 126 -10 72 9 -288 71 -82
5335 -82 -32 124 -4 -142 81 -257 163 44 58 -179 84 361 -190 -215 219 21 10 138 -137 -36 -127 146
5357 146 -9 13 147 285 197 77 -321 -20 37 -108 -394 -62 53 -143 -247 298 -28 -177 91 37 -197
5378 -197 56 -27 -48 1 200 210 156 72 38 48 75 94 -115 -138 -104 -122 40 152 -204 -217 31 87 -87 -205 134
5403 134 -131 -142 -25 64 -268 202 -135 96 104 -129 26 -226 17 -306 5 103 166 57 -70 -26 -121 -119 2
5426 2 -33 -133 233 108 130 63 14 144 41 69 -137 107 -137 60 -59 138 15 110 -18 168 251 -88 19
5449 19 -7 -126 -32 130 166 -73 95 -55 -146 -113 43 -177 25 -149 197 -121 -149 -311 -176 134 17 -91
5471 -91 34 -152 -346 -9 -48 70 -208 66 162 -143 89 259 -89 -79 36 116 -42 -87 -301 26 -218 -177
5493 -177 -126 142 -87 -78 192 -187 32 -239 1 -17 -161 -15 -36 127 -119 -69 82 10 -11 38 -146 -145 102 223
5517 223 418 -100 -14 -125 -27 79 -298 79 -165 -58 -107 197 -23 -253 -75 157 -198 -184 188 171 91 52
5539 52 -1 66 94 40 92 343 -15 -95 129 201 70 12 223 27 87 -42 194 -247 -312 -101 18 -101 74 -124
5563 -124 -131 -57 176 -130 120 60 -106 302 52 -368 54 149 200 -132 -7 251 91 53 199 18 -21 -57 71
5586 71 159 -224 -86 233 111 -27 -22 112 6 -154 -159 -78 -5 212 209 -82 -92 97 227 201 113 24 110 36 -177
5611 -177 -128 -96 -7 -66 -17 -220 -117 135 27 260 -327 -320 223 110 -204 42 -68 -46 -146 -42 47 -160 21
5634 21 -44 187 -155 -2 88 -2 84 -118 -311 130 -47 -69 55 34 -150 -80 133 125 -241 -26 83 -172 111
5657 111 -30 -46 -25 -52 58 -55 -251 -122 -33 -44 -78 -38 -369 -67 125 136 -76 -36 -272 -24 323 110 -155
5680 -155 136 283 204 -270 194 41 -183 142 -162 173 -85 -193 -32 -38 -105 -21 -14 -39 -120 113 193 -114 -163 -91
5704 -91 190 27 -89 -2 95 -43 209 49 -45 13 -118 -67 107 91 76 5 -125 167 18 -155 -176 96 -63
5727 -63 155 -139 -58 96 -38 -266 81 17 -107 -301 -7 68 77 -221 -11 255 218 -111 135 88 -182 5 -234
5750 -234 -155 -75 -265 190 -44 -121 -89 160 -140 -127 -106 -146 169 -183 25 193 -92 -196 -88 256 -136 -224 172
5773 172 63 -20 -41 186 194 -262 -27 -13 -36 143 164 194 -64 -34 177 -172 -63 -262 1 -107 -303 -108 -190
5796 -190 41 22 74 57 19 -122 61 -47 -4 -60 327 -63 191 102 -89 181 -196 206 -46 24 -88 139 58
5819 58 169 -179 92 -54 -211 256 -113 -199 -240 -39 133 67 4 -156 140 33 16 0 -53 75 -78 -207 -204
5842 -204 -89 -94 231 -85 14 -265 266 -240 25 -159 -45 -118 18 -9 50 -266 -73 -4 175 338 19 -18 9
5865 9 -86 -188 -69 174 118 170 59 169 -374 89 243 -376 -213 -48 -37 -251 -27 -11 107 -263 -28 -28 196
5888 196 -242 -24 110 -211 -27 -103 62 36 -71 38 307 89 -72 73 -11 64 -88 -150 93 62 -6 191
5910 191 -93 145 -165 51 34 13 -35 124 4 -71 -164 0 -30 -249 62 193 -23 -111 -30 -91 -9 79 148 -156
5934 -156 22 -18 118 -85 87 -81 115 97 -38 55 50 -7 64 90 38 59 15 277 -108 -53 -108 -29 31 -192 14
5959 14 -2 13 137 61 -69 -200 348 266 -25 -218 18 51 -121 -163 -249 14 32 -162 -123 -122 96 9 -153 22
5983 22 -2 151 158 134 41 23 -101 135 24 172 79 119 25 117 -129 6 216 125 -83 -113 82 -31 -72 -226 44
6008 44 183 35 -95 32 27 -99 124 41 -93 -164 25 32 192 123 -3 -100 18 98 -29 -108 -10 103 84 66 23
6033 23 -250 -61 -85 -9 -192 -49 -99 -85 -226 232 101 -53 -317 73 34 -122 125 -85 -70 -140 162 104 44
6056 44 -67 -60 -1 -29 -88 161 91 123 29 109 -187 -114 101 170 -139 -87 0 37 -170 -17 5 106 -332 -104 -47 -114
6082 -114 -114 -446 35 -20 -180 -149 275 123 -303 13 -26 -111 292 132 -52 52 165 277 212 177 -59 57 -52
6105 -52 169 89 -117 -174 -68 -92 28 257 -256 -77 275 -45 172 -49 117 -93 -126 -34 -99 -78 -213 67 -11
6128 -11 -301 -231 -132 175 51 63 292 -110 -91 70 -11 -47 -163 212 12 91 -21 -177 125 60 -173 -252 117
6151 117 11 -49 -285 132 -70 196 -44 -42 -140 -55 -147 127 -53 42 117 24 -162 112 -20 24 -107 -133 -82 -37
6175 -37 -116 -99 -49 -79 187 -67 -221 -3 -12 144 42 -69 20 -179 190 25 -11 14 98 31 -72 202 136 65 -259
6200 -259 -182 264 52 -115 -2 59 164 73 -283 -148 -85 -29 326 164 67 -104 -20 -191 182 24 -45 297 111
6223 111 20 63 107 80 -45 69 85 -110 -140 131 148 59 9 102 102 -99 -309 332 274 -82 -152 47 198 101 20
6248 20 -92 39 -121 100 167 59 -57 2 102 -205 -117 -97 75 -74 14 69 188 -230 45 188 75 -198
6270 -198 -16 184 108 17 -166 -19 -182 -205 -62 -168 -76 -139 -109 295 265 -12 147 196 -26 -131 144 -78 99
6293 99 -43 -146 101 -199 119 -10 -102 -189 167 36 69 -92 45 -4 -23 53 -79 -57 169 0 -4 33 -324 -124
6317 -124 164 170 -33 147 -28 72 -133 -296 208 -44 -190 64 -106 100 70 165 -125 121 -190 39 71 -162
6339 -162 -107 37 -35 -41 -129 222 7 -91 -96 42 -271 -60 71 303 -366 45 189 10 81 30 82 20 -128 -109
6363 -109 59 -149 -236 -70 206 -193 11 14 128 -305 106 284 -84 -152 28 76 -24 -83 148 47 -133 66
6385 66 -27 3 29 4 250 -46 22 3 43 -65 -227 55 -25 6 -73 71 -121 -17 -56 -155 32 44 -158 121 75
6410 75 -137 -49 -191 48 -112 10 264 -78 0 -166 146 -33 71 -256 22 59 -54 18 61 -90 -50 -72 151
6433 151 -136 -30 150 -229 120 -93 48 112 37 31 110 -237 -32 118 204 -136 -96 189 78 -66 -164 -33 53
6456 53 -22 227 -34 47 75 23 -231 52 -171 60 -32 -97 32 127 -120 -44 -200 -22 13 46 19 -54 263 -53
6480 -53 324 -19 70 -119 116 91 -152 100 -81 115 -94 -90 108 139 -125 -1 -49 55 106 -44 -96 72 16
6503 16 48 96 -268 183 174 84 28 16 181 207 -102 190 -39 -65 -10 196 149 -109 -200 -143 166 -127 -69 -28 24 -65
6529 -65 -184 -29 -63 24 -186 24 119 -64 -16 59 27 37 152 53 340 112 -108 115 -208 73 400 -3 3 236
6553 236 -27 147 -88 57 -68 -9 -67 41 169 -90 80 121 -83 -140 -228 -126 -67 -36 -172 53 53 -78 -77 -41
6577 -41 -28 -92 -3 242 -79 -99 -114 100 -7 -145 168 -26 55 -158 235 39 -187 45 60 29 61 53 275 -13
6601 -13 60 -138 -52 -69 58 -197 39 4 -73 141 -137 -68 -84 207 91 -166 -67 -119 -51 142 111 200 157 -93 -123
6626 -123 -9 126 58 38 36 -97 -122 160 270 -74 -21 43 -331 16 296 0 -28 47 102 -9 -130 -75 162 255
6650 255 -268 -46 -51 -69 -44 -73 60 -98 -49 129 310 -273 99 145 20 -295 55 149 56 -3 37 110 -9 -55
6674 -55 75 313 177 -92 -74 62 -56 -186 34 191 -213 104 -24 -34 31 -79 -43 80 -32 195 107 156
6696 156 176 -69 -52 -279 -28 6 -28 73 65 116 226 -107 -120 66 -7 -198 -4 35 -145 -140 -17 -34 63 -47 161
6721 161 33 -313 -50 -96 -206 4 66 93 -103 37 145 144 -50 -22 -15 -48 102 -173 39 107 -134 31 -41 -327
6745 -327 142 -99 104 130 -88 11 274 -124 94 199 215 59 -29 16 71 1 -484 -58 -82 50 -222 218 -45
6768 -45 432 -38 180 421 -93 -90 227 -282 -116 -25 -39 131 -148 128 51 80 59 -234 10 -144 -103 12 -20
6791 -20 -188 -28 158 -246 -25 -123 -31 -64 -5 -8 70 85 -92 -93 -77 202 108 -26 -76 9 34 -129 261 -245 -91
6816 -91 -192 -2 135 -203 133 -138 -206 -115 -58 -57 122 72 -174 73 3 28 -123 63 -26 191 12 5 87 121 145
6841 145 -30 64 -90 -16 -101 39 107 61 -63 -11 -40 -11 -275 233 33 -154 387 5 11 -208 -28 48 -103 -51
6865 -51 -176 266 56 199 0 -49 -112 175 220 -67 157 -75 135 224 -183 344 -178 32 129 -25 64 15 -102
6888 -102 222 -33 -13 145 91 203 119 -147 160 70 -47 159 191 128 307 190 87 -228 119 290 -61 -226
6910 -226 91 165 203 36 156 -104 -146 2 26 15 -77 17 -47 -132 -123 -76 203 21 -155 39 168 75 -84 27
6934 27 73 127 23 -181 -128 -294 -50 131 -182 -89 -178 2 12 26 -65 -97 -143 25 60 182 -191 -2 270 144
6958 144 381 195 54 -122 61 178 25 26 173 221 -38 -61 216 -190 6 159 24 -226 -49 42 73 133
6980 133 -181 -161 -65 -3 -72 -65 -173 22 103 -105 26 45 83 -89 -76 104 62 2 17 119 -72 -202 47 91 -47
7005 -47 -135 -173 -71 -21 58 2 201 -60 89 335 -35 -104 -129 27 -76 -35 -88 73 238 110 94 -39 5 -44
7029 -44 -174 -81 158 198 -119 -164 45 -31 29 -156 191 32 -94 -109 -282 158 160 19 140 27 -54 -160 66
7052 66 -74 106 -223 -245 -74 144 -119 -102 7 167 78 -66 -53 -87 20 32 225 -190 -33 -20 64 40 66 -26
7076 -26 65 -77 -182 -137 -101 -171 55 138 117 -42 40 136 -95 -192 -56 125 147 118 249 130 31 50 -297 -95 -61
7101 -61 103 163 -222 65 -8 -62 49 35 -80 -149 75 -86 74 -49 89 129 18 132 -73 259 72 -47
7123 -47 -272 -123 -120 0 -174 -389 218 -101 59 25 -55 65 -134 179 -107 45 45 -210 -35 -73 41 -5 -13 139
7147 139 19 -55 7 -174 -6 48 -135 -154 -54 -142 -21 -60 -42 -11 172 54 65 -164 -223 148 -31 108 -87
7170 -87 -33 169 -119 -42 39 154 114 -162 173 -15 103 -66 -171 157 82 161 238 109 102 -79 351 -28 117
7193 117 -28 -34 19 -315 83 87 -158 -173 -157 -85 159 -189 -29 -245 236 -111 53 -153 -209 219 2 31 225
7216 225 38 72 -69 32 -44 -84 -47 -62 286 99 181 -87 18 212 238 42 101 26 -43 -222 -80 -10 174 196
7240 196 -53 15 -162 -10 70 -38 261 -95 -108 116 -8 -74 116 174 123 -12 87 13 95 -258 -52 -254 157
7263 157 141 71 18 10 -143 105 -92 -200 -14 -232 -42 -24 104 12 151 -74 137 -38 222 -140 -28 13 -3
7286 -3 50 4 214 225 123 18 197 39 59 -163 207 -34 111 -115 207 106 68 34 -94 8 65 141 64 -152
7310 -152 43 -86 -93 55 -10 35 11 231 15 141 -28 -322 -115 -24 -135 -242 -146 -9 31 -156 -19 25 -68
7333 -68 33 -85 -99 -177 -75 85 -166 -45 -1 117 -107 -150 238 26 -44 113 -124 -41 472 -252 53 -35 -175
7356 -175 -189 -93 -137 -242 12 -21 -118 56 -164 -107 129 33 28 343 153 -134 14 43 -45 213 26 -59 -61 -23 11
7381 11 -143 -266 -62 212 -114 -119 -24 179 140 -128 -30 -51 228 -241 -18 -161 112 -56 -201 41 16 -134 -53
7404 -53 -144 59 -12 49 30 53 42 -94 -73 -120 42 -114 -35 -28 246 34 -47 7 80 -68 -21 81 29 31 34 174 135
7431 135 -5 -87 74 -35 25 -191 -131 29 -54 214 -101 -84 -106 10 -62 -46 -206 -9 247 -198 -62 -188 -15
7454 -15 66 -43 -98 100 -174 -103 157 46 -67 136 -25 207 19 277 235 -84 -226 262 -88 -228 -31 86
7476 86 229 173 122 -130 145 23 -29 -45 -71 63 -271 328 57 -102 -41 -51 -210 -78 35 26 50 248 -35 11
7500 11 72 -102 -175 153 -9 -182 -58 -329 31 -51 212 -69 -85 23 272 68 -323 56 188 -15 145 187
7522 187 -110 227 81 270 0 -70 311 -84 -152 -62 -9 7 -134 161 57 56 -214 69 240 191 -116 12 289
7545 289 96 153 230 143 40 -46 216 166 -129 -52 124 -79 -179 130 -388 150 43 -110 -24 -54 -56 -51 -90 7 186
7570 186 116 232 64 90 -21 -16 37 192 105 -77 -58 -19 142 37 14 -47 86 189 12 137 176 -198 -233 -76
7594 -76 84 -140 217 -183 -88 12 43 -76 46 -58 -28 90 187 148 125 190 -218 172 -62 -18 -58 12 -19 -263
7618 -263 -24 0 -162 25 -159 -125 -60 -27 -42 -132 95 93 32 36 8 -350 92 97 77 65 -110 92 -149 91 62 56
7644 56 -1 -172 -129 96 -14 245 90 -259 -74 78 -307 -31 -236 -291 98 -160 160 131 -8 -156 -98 -31
7666 -31 112 -46 120 -73 -34 -339 -7 229 -188 -116 -136 30 -250 -272 91 273 -102 -195 112 -101 -293 -328
7688 -328 65 -163 25 -14 29 -46 293 -125 -73 -47 -109 76 170 -249 -173 174 -24 -14 169 362 -102 -233 -67
7711 -67 128 59 -123 -190 181 8 1 143 -26 -123 93 -6 72 -157 -161 -215 -340 -36 -114 40 113 -133 73 -126
7735 -126 146 -20 -27 278 63 -195 247 83 62 -5 161 -46 -47 -77 45 80 46 232 161 -50 -35 -10 -41 -119 69
7760 69 174 -94 -270 126 -136 -25 208 -55 -37 9 -257 289 114 67 -88 58 56 -145 -22 -142 316 -108
7782 -108 -44 50 -55 -125 -175 -93 34 -175 166 -139 169 38 29 55 189 -51 199 126 155 200 -15 55 -102 190
7806 190 64 -74 -304 -106 108 -30 -70 -112 263 -41 1 118 -73 146 -169 -21 91 -264 -89 -193 -87
7827 -87 -107 -1 -105 -119 37 2 -55 138 157 -52 -153 115 -38 106 42 -206 49 -125 48 4 2 104 -92
7850 -92 -168 8 -15 -4 -197 187 -212 -174 36 92 77 40 197 9 219 -1 1 237 110 -99 131 187 197 21
7874 21 -44 19 -71 -156 147 208 -76 -38 3 -34 215 -39 -17 62 -19 -71 -130 -8 -230 190 171 -47 -20 191 28
7899 28 66 48 60 65 -78 8 170 -113 -44 -162 294 151 410 32 138 -125 218 23 78 6 -66 68 -202 49
7923 49 134 126 -23 142 -69 -20 202 146 -28 -186 -8 -208 61 148 136 39 165 -214 -182 -229 223 -14 -104 22
7947 22 0 -75 -274 -109 -101 33 5 193 43 -97 -170 -20 137 -288 -138 144 33 55 -223 208 -50 -95 -136
7970 -136 67 -191 -282 13 211 81 41 98 131 -155 -57 -192 -84 121 -48 -178 35 -7 -5 -105 -96 -137 -244 12
7994 12 -69 -107 326 -73 -74 27 -190 4 -159 -98 -42 98 -69 99 129 98 -76 -15 -85 44 -204 146 114 -44
8018 -44 -133 81 -6 -135 -25 245 -128 -107 58 158 -180 -261 73 81 -57 -268 114 -166 4 -46 -40 -46 77 -6
8042 -6 -5 -112 103 -28 190 -136 146 159 -112 -45 -2 143 -103 -30 -53 45 86 -40 -1 166 110 83 -120 107 23
8067 23 -157 -227 145 46 -16 161 6 157 -148 -207 202 284 -10 -184 86 -189 9 -54 61 99 -103 218 61
8090 61 148 -164 -95 157 102 261 37 36 48 136 12 180 -33 290 28 -23 152 -229 168 204 -198 10 124
8113 124 60 107 59 17 109 -17 -144 -200 -85 -149 -172 105 28 63 285 -250 231 36 -306 178 -229 34 0 -42
8137 -42 28 88 150 -152 105 22 156 -55 -45 -101 -91 2 92 20 60 148 -188 90 -87 42 -38 148 113 85 -43
8162 -43 50 -17 -152 78 -96 71 74 -30 13 -157 210 156 -198 71 174 63 120 100 -89 172 4 3 -212 -121
8186 -121 158 70 -31 72 -103
8191a03
$$ Imaginary data points
##PAGE= N=2
##DATA TABLE= (X++(I..I)), XYDATA
0 0 0 0 0 0 0 0 0 0 0 0 8 -8 8 -8 8 -16 16 -16 24 -27 32 -40 48 -56 64 -75 88 -100 115 -132 151 -172 195
33 195 -220 248 -278 312 -350 390 -432 483 -534 593 -657 726 -798 883 -971 1071 -1180 1300
51 1300 -1432 1578 -1743 1929 -2140 2379 -2659 2985 -3375 3849 -4438 5197 -6211 7638 -9795
66 -9795 13403 -20550 39932 -200173 -519065 190313 361166 -153729 -198024 75721 -65359
77 -65359 -46551 145256 -28402 -218013 24841 136901 -85832 -117743 22683 -13229 -16541
88 -16541 28962 -76741 -121792 43281 65466 -83273 -71331 9469 -34145 -12291 34034 -71379
100 -71379 -88774 76450 55812 -113019 -50229 85671 810 -57445 30610 10452 -46606
111 -46606 47547 59956 -78156 -37372 123161 35628 -119689 14637 152325 -19750 -133264
122 -133264 58922 149519 -35356 -94820 56476 71347 -28974 8215 48760 -26634 -6165
133 -6165 87057 20373 -65098 26025 80709 -7329 -13305 49435 838 -25519 62550 54657 -48407
146 -48407 -26008 60566 40970 -11296 -16102 -12475 19204 48736 -12753 -55932 16037 37342
158 37342 -28591 -13988 21593 -32986 -26140 52248 -5977 -86733 15538 69040 -56046 -59587
170 -59587 61319 4348 -92530 16622 81486 -55069 -87697 44872 50262 -49766 -39884
181 -39884 9018 -3380 -1314 2854 -39030 -33065 29035 13786 -47866 -28017 17095 120 -16442
194 -16442 -5836 -14842 -15633 12934 11224 -20084 -16748 9036 10028 4002 3101 -10628 -6013 24996
208 24996 20520 -14741 -9061 23458 18873 -3369 -397 4774 6045 20284 11203 -19882 -1749
221 -1749 39201 11343 -32821 4211 43807 183 -28055 17852 29334 -10325 -4597 22946
233 22946 4039 -7389 21079 15988 -16035 3346 31858 2423 -17577 12077 20772 -5191
245 -5191 -6577 10699 3442 -8169 1751 6522 -5180 -11124 -4102 5868 1261 -17371 -15833 8738
259 8738 8206 -20417 -20537 8528 7100 -16298 -11244 2592 -5137 -5813 3099 -6076 -14563 3636 10596
274 10596 -13249 -17361 7851 6569 -14256 -9015 4353 -3834 -10783 -2387 -649 -8545 -5202 -597
288 -597 -5543 -4942 -1156 -5419 -3716 4793 73 -10137 -226 12489 326 -9532 5448 13491 896
303 896 -3701 5874 8956 3745 3500 5879 3109 2626 6420 5411 699 319 6380 7359 -1473 -4422
319 -4422 5892 8432 -2738 -3370 7911 6594 -5884 -523 11618 2459 -6663 6220 13021 -1696
333 -1696 -7022 9067 12068 -3502 -3633 9473 6216 -4693 -1261 6049 818 -4252 1971 1986 -6801
348 -6801 -5098 3435 -857 -9197 -4768 3644 -2177 -11566 -5370 2881 -208 -7124 -5549 1246 -74
363 -74 -5605 -3115 2332 -43 -3720 -911 1551 -2720 -4018 1949 2363 -2866 -3649 -920 -1071 -2743
379 -2743 -1903 -384 -2584 -3985 -1877 -249 -3322 -6233 -629 5496 -839 -8270 -1118 6187 643
394 643 -3099 2589 4579 -567 1279 6139 1067 -2174 4826 9603 2497 -5265 -547 8842 6630
409 6630 -3383 -3515 4475 4404 -2558 -982 2071 -2434 -765 7076 510 -10139 -1657 10961 2365
424 2365 -8617 998 8572 -533 -4410 3188 4773 237 -1 3861 2397 -1842 -1258 3136 4903
439 4903 -189 -5018 -619 2999 -2044 -3660 915 -942 -6427 -1962 4409 -4714 -11471 936 8057
454 8057 -3371 -10062 -2416 2712 1550 1027 -2440 -6561 1830 10436 189 -10583 -2177 9203
468 9203 6513 -2455 -7328 -3902 6412 8783 -5281 -11268 2975 8451 -3372 -7294 -2345 -253
482 -253 3009 4599 -6287 -12270 3966 12817 -2869 -9282 3183 4877 -1038 2412 4037 -3229
496 -3229 -595 9352 4124 -4904 437 5699 2543 -138 -316 1229 3017 -530 -5004 1559 7544
511 7544 -4152 -10575 5515 10189 -9836 -12832 7908 10091 -6238 -7155 3257 924 -1841 5164
525 5164 2374 -6216 -544 9213 3190 -7567 -3730 8463 8605 -4311 -10692 -369 11717 3485
539 3485 -10741 -6087 3646 1300 -990 375 -5973 -10981 2718 12790 -4438 -16570 -376 11375
553 11375 369 -8692 -1415 5879 2578 -2554 -2728 1696 4146 1379 -872 1703 799 -1886 1413
568 1413 4487 333 -3139 -1466 63 654 2484 -1233 -7115 -2277 5961 2470 -6612 -5781 2677 4751
584 4751 -382 -4096 -2367 2833 5945 1589 -4618 -2795 5331 9094 1709 -6307 -2800 6659 7791
599 7791 -184 -6240 -2132 5180 5144 -1768 -6117 -2354 4367 3955 -3674 -8518 -1477 8943 3158 -11699
615 -11699 -7605 8555 8077 -5957 -6952 2404 3935 851 845 605 -536 -10 1830 3014 280 -3223
631 -3223 469 6197 -19 -7207 604 6947 -3716 -6704 4121 2141 -7985 -2134 5066 -2626
645 -2626 -5562 1851 1349 -4151 311 3210 -1867 -2191 1490 3131 3015 -1469 -4754 3250 8727 -2262
661 -2262 -6743 6253 6220 -7324 -2927 7508 250 -4671 2727 -431 -6132 1981 5595 -5058 -5216
676 -5216 2867 -128 -1942 2733 -2014 -5546 4060 4905 -3689 -1326 3709 -1658 -441 7694 46
691 46 -7200 4808 8215 -4913 -4178 6622 2196 -4475 412 1905 -3158 -284 1718 -2314 -1182
706 -1182 32 -3637 -1363 3369 -2072 -5343 2864 3618 -5078 -2424 5442 -30 -3408 3716 2665
721 2665 -4075 938 6303 -634 -4568 3152 5867 -2533 -4067 2687 3694 -1890 -3639 1125 2310
736 2310 -2878 -3508 1169 945 -2868 -1433 1536 -560 -3223 200 2528 -68 -1466 467 1662 606
752 606 -497 1089 2792 417 -951 1828 2620 -1830 -585 5116 793 -5086 821 4881 -2886 -4989
768 -4989 3056 2838 -4178 -2432 1866 -879 -2128 710 -126 -685 1063 -1155 -1671 2489 1872 -2177
784 -2177 962 4513 -1403 -3182 4443 3154 -3284 1024 4189 -2124 -3179 3594 1994 -4710 -553
799 -553 3844 -1781 -4680 414 1497 -1899 -2151 -651 382 -267 -1800 -1432 1638 2002 -2432 -900
815 -900 3870 396 -3165 2428 4686 -1420 -2177 3782 2244 -3324 -44 3853 -821 -2945 1259 1203
831 1203 -2937 -2273 2504 875 -3605 -1797 1463 -147 -2689 -1444 1835 1158 -2059 -1050 2050 1293
847 1293 -1164 51 3092 1116 -1364 622 3007 548 -919 1444 1783 -1383 -1162 2020 533 -2501
863 -2501 -405 2224 -682 -3515 -787 1864 -843 -2943 -266 1142 -1242 -1570 585 947 -731 -427
879 -427 2078 595 -1562 288 2808 1334 -1388 85 2430 1150 -1378 -251 1572 373 -1839
894 -1839 -64 1520 -1934 -3061 1085 1341 -3103 -2950 1815 684 -3484 -857 2557 -961 -2730 1463
910 1463 2398 -1443 -1363 2931 2197 -1271 -280 2237 1592 -26 -217 746 861 47 -435 -50 184 -1243
928 -1243 -1042 1477 113 -3707 -951 2940 -670 -4239 61 2882 -1723 -2146 2192 864 -2292 1342
944 1342 3174 -1584 -1431 3420 2365 -1951 187 2138 259 360 448 -366 655 1252 -1788 -1468 1711
961 1711 -546 -3161 973 1368 -4147 -2078 3619 -707 -4570 2097 2984 -3167 -1643 3901 1223 -3352
977 -3352 665 2728 46 -310 855 224 504 647 -266 640 461 -1652 -460 2313 -1249 -3685 1379
994 1379 2711 -3537 -3225 2506 947 -3243 -1166 1488 357 -1235 -874 548 1730 -126 -1201 1583
1010 1583 1253 -1737 1369 4476 -1317 -3565 3047 3535 -2964 -1360 3358 -337 -2569 1124 561 -1504
1026 -1504 442 -223 -2193 575 632 -2556 -336 2213 -2699 -2125 4777 140 -5841 1977 5675 -3101
1042 -3101 -2366 5183 802 -3910 2600 4107 -3265 -231 4407 -1606 -2805 2770 820 -2473 369
1057 369 727 -2466 7 1024 -3454 -755 3659 -1970 -4797 2162 2461 -3535 -245 3542 -1701 -2730
1073 -2730 3873 2223 -3624 252 4019 -421 -1916 1775 1865 -1107 -810 593 733 128 -164 -1305
1089 -1305 -1091 -538 -17 57 -467 -1987 -1733 70 1234 -334 -2187 179 2192 -1093 -2392 1967 3298
1106 3298 -2089 -1130 4371 786 -3418 2260 4027 -2857 -1799 4545 665 -3813 1512 2448 -3020
1121 -3020 -1138 2675 -1256 -2295 1174 -1519 -2641 2400 526 -3792 1101 3512 -4396 -2370 6695
1136 6695 783 -5965 2890 4560 -4542 -759 7443 -523 -6320 3363 4490 -4067 -902 4349 -1663
1151 -1663 -2956 3442 733 -3804 611 1702 -3566 -646 3007 -2828 -2828 3156 -723 -4221 2788 4086
1167 4086 -4133 -2257 5107 187 -3859 3240 3764 -3544 -1206 4841 457 -3206 1607 2666 -2043
1182 -2043 -1141 1762 -373 -1583 639 -404 -1786 63 109 -1913 -262 1518 -1509 -2040 1957 1324
1198 1324 -2817 124 3142 -1255 -2295 3125 2507 -3205 -64 4608 -499 -3015 3294 2569 -3227
1213 -3227 -900 3294 -155 -2566 1047 887 -2562 -171 1017 -1618 -514 871 -1587 -1298 2223
1228 2223 -468 -2754 1721 2256 -3062 -640 4517 -528 -3126 3392 3084 -3158 -689 5047 -29
1243 -29 -3171 2099 2418 -2534 -750 2227 -883 -1802 815 94 -1849 195 34 -1821 -39 315 -1809
1260 -1809 -518 1814 -320 -2251 1536 2596 -1835 -1203 3175 603 -2280 1337 2820 -1452 -1084
1275 -1084 2689 1259 -2178 -18 2214 -687 -1679 415 227 -1031 -862 -282 -309 -369 -360 -962 -98 834
1293 834 -1115 -1151 1790 413 -2221 545 2640 -531 -1635 2601 1997 -2414 319 3216 -214 -2029
1309 -2029 1764 1589 -1932 -1116 1592 -198 -1977 -34 433 -984 -499 -414 -465 88 -334 -1122 79 1031
1327 1031 -804 -916 1577 1127 -1485 535 2293 -380 -1198 1767 1367 -1271 -181 2331 9 -1880
1343 -1880 681 1195 -1229 -938 509 292 -1113 -741 -38 -227 -195 -913 -401 202 -138 -1078 588 1018
1361 1018 -571 -754 1263 1152 -1141 -190 1873 491 -1478 950 1772 -625 -1013 1289 922 -1487
1377 -1487 -838 1280 42 -1369 -865 294 -284 -1569 -530 614 -269 -1211 21 524 -296 -902 284
1394 284 1474 -268 -819 1141 1474 -129 -435 1429 1357 -1099 -153 1900 -20 -1746 344 1658 -1117
1411 -1117 -2051 698 615 -1429 -640 393 -432 -1217 -413 478 28 -664 -412 384 565 -283 -371 1367 930
1430 930 -683 236 1904 -117 -943 1479 1548 -1032 -620 1657 359 -1777 -146 1056 -423 -1305 -100
1447 -100 275 -834 -1110 -27 -34 -734 -728 374 859 -427 -994 675 1338 -171 -605 797 850 -447 141
1466 141 1809 461 -1521 270 1805 -334 -1530 391 1231 -1216 -1307 802 -87 -2011 -290 1219
1482 1219 -802 -1458 195 365 -369 -496 -153 380 513 -458 -391 1138 806 -827 402 1717 -480 -1144
1500 -1144 1728 1320 -2008 -496 2173 76 -1992 -90 741 -1250 -588 367 -647 -1556 -136 671
1516 671 -91 -543 -638 -224 863 222 -879 658 1402 -412 -222 1550 376 -1170 680 1928 -571
1533 -571 -1321 1368 1088 -1493 -489 1299 -81 -958 -214 105 -378 -731 25 -70 -896 -677 132 554 44
1552 44 -1290 -405 1470 419 -869 172 1398 -244 -359 1892 755 -1674 -11 2493 -286 -1705
1568 -1705 852 1106 -1409 -728 1044 -433 -1082 184 -255 -977 -303 -438 -41 684 -447 -1570 518
1585 518 1673 -1291 -1305 1848 619 -1645 1021 2007 -907 -801 2214 861 -1529 117 1582 -264
1601 -264 -947 43 -71 -94 -245 -403 -177 -280 -1283 -552 1313 -545 -1947 136 1348 -542 -852 823
1619 823 255 -1193 474 1238 -32 -194 305 593 271 -162 -28 979 325 -1749 -447 1592 -313
1636 -313 -1674 819 512 -1760 -826 1675 -485 -2040 731 962 -1268 -381 572 -300 -86 483 -358
1653 -358 0 1168 -95 -416 1375 359 -1573 1231 2249 -1486 -1406 2195 353 -2163 475 1552
1669 1552 -1896 -1131 1393 -62 -1651 486 397 -1088 -42 233 -288 156 435 -1075 -243 1440 -510
1686 -510 -835 1575 1100 -1441 541 2263 -424 -1377 1295 1403 -1275 -140 980 -328 -688 147 248
1703 248 -453 -541 -415 -57 -131 -794 -684 610 156 -1487 65 1102 -438 -625 1418 702 -865 94
1721 94 1354 352 -466 224 698 221 -308 47 603 461 -1001 -523 937 -381 -1286 286 1062 -1466
1739 -1466 -963 1333 -309 -1404 131 1037 -708 -356 893 185 -405 540 557 185 733 -79 -234 1012
1757 1012 350 -1376 561 1389 -954 -1000 1298 437 -2010 -315 1692 -1355 -1566 800 43 -1692 -426
1774 -426 760 -522 -722 391 107 -369 583 90 -49 1173 80 -706 1122 972 -705 -254 1519
1791 1519 291 -1701 713 1289 -1368 -1095 953 133 -1205 -266 617 -656 -771 76 193 -580 -339
1808 -339 219 153 191 -235 179 765 47 -455 396 1030 181 -205 1204 665 -918 -330 839 414 -905
1827 -905 -37 956 -102 -1179 -52 855 -891 -848 266 231 -1066 -592 641 82 -997 32 764 30
1845 30 -381 405 583 334 -201 223 581 318 -25 50 1123 71 -972 484 837 -988 -874 866 205
1864 205 -1349 -372 871 -447 -1082 171 481 -633 -750 486 260 -875 -101 458 454 -104 112 209 574
1883 574 80 24 567 433 -518 -188 1059 184 -1100 250 1195 -504 -992 563 451 -1112 -255 680
1901 680 -339 -1116 -66 529 -145 -416 354 455 174 -354 241 468 174 -144 365 599 -244 -67 720
1920 720 523 -690 -324 602 -204 -883 -401 455 -237 -594 69 385 -732 -711 282 524 -698 -769 844
1939 844 269 -598 -224 786 388 -704 259 854 43 -230 492 779 -35 -173 296 647 -346 -456 103
1958 103 361 -524 -791 268 593 -880 -822 706 -475 -834 -108 567 -204 -759 326 1019 -390 -575
1976 -575 689 734 -631 192 979 194 -405 15 811 143 -499 -10 536 -35 -396 68 -101 -361 -719 -134
1996 -134 159 -277 -831 33 309 -760 -847 581 391 -1057 -124 1290 325 -464 815 910 -438 -375 1164
2015 1164 368 -559 -23 714 31 -448 75 -46 96 -224 -329 64 -14 -334 -510 408 15 -1030 77
2034 77 1056 -620 -639 675 814 -655 -84 1305 13 -709 752 921 -177 -372 594 485 -317 -245 -47
2053 -47 438 -232 -279 -188 71 -235 -548 164 -56 -583 -799 285 101 -800 -449 587 189 -566 79 833
2073 833 -249 -265 1042 488 -654 -127 975 224 -384 236 962 -39 -480 -204 2 -132 -407 -95 181
2092 181 -205 -498 -114 296 -189 -380 242 398 -278 -305 528 413 -402 24 851 115 -134 391 881 -114
2112 -114 -647 342 838 -580 -688 625 223 -697 -179 261 -231 -575 -66 49 -173 -699 -71 289 174
2131 174 -608 -195 523 -35 -200 284 686 -112 -340 895 640 -696 134 1030 42 -1027 165 752 -342
2150 -342 -508 311 26 -272 -133 164 -141 -375 -310 282 82 -354 -646 65 155 -525 -30 644 291 -167 212
2171 212 550 128 -411 522 889 -452 -587 820 479 -620 -455 707 -5 -1001 74 559 -758 -778
2189 -778 393 178 -749 -301 327 42 -124 234 45 198 58 -322 -35 824 -273 -630 917 620 -993
2208 -993 324 1294 -68 -909 621 1054 -1045 -239 1059 -425 -1144 77 288 -657 -372 -90 -223 -227
2226 -227 68 -428 -131 551 -234 -489 665 268 -801 432 1159 -444 -527 1339 435 -738 505 1081
2244 1081 -19 -484 271 218 -518 -27 21 27 -10 -382 -97 134 -84 -649 93 224 -510 -281 322 126 -488
2265 -488 80 724 -20 -220 307 555 287 -224 150 678 -189 -558 264 478 -613 -637 789 56 -822 -318
2285 -318 389 -481 -587 356 214 -363 -452 312 131 2 173 143 305 445 -506 78 510 -237 -482 767
2305 767 679 -616 -215 1032 158 -1040 491 721 -843 -815 645 44 -997 -35 700 -715 -485 -74
2323 -74 -236 -320 149 -247 120 442 -191 159 763 653 -438 336 1043 -102 -554 962 584 -827 -215
2342 -215 822 -160 -812 104 524 -669 -173 265 -229 -490 -213 -426 -133 -149 -433 -149 463 -96 -218 328
2362 328 465 -305 -174 904 347 -534 160 880 -179 -413 411 273 -113 163 259 -112 -501 -261 170 79
2382 79 -430 -282 -97 -44 -515 -145 302 -376 -577 191 338 -463 -95 358 458 -169 -154 685 339 -100 -125
2403 -125 712 306 -500 -194 367 -40 -335 -167 305 -252 -413 220 -27 -747 -587 466 69 -600 -206 460
2423 460 16 -348 -36 639 -232 106 406 590 -160 -193 349 489 -40 -151 226 357 -274 -374 458 -41
2443 -41 -355 -169 133 -139 -641 59 263 -458 -365 98 120 -353 -576 59 371 -42 -207 626 322 -186 75
2464 75 61 213 -542 250 340 19 -326 188 339 -432 -382 -94 127 -523 -320 79 -93 -694 -180 420 -188
2485 -188 -593 -112 432 -8 -232 212 266 -14 -103 508 380 121 118 382 317 -61 -62 159 306 -333 -274 469 -90
2508 -90 -689 -67 502 -521 -505 233 247 -497 -461 249 99 -544 12 140 154 -227 33 278 -5 210 94
2529 94 279 -32 -198 40 677 -136 -512 39 644 -306 -592 313 -12 -843 61 260 -325 -405 165 318 -125
2550 -125 -358 193 -57 22 -189 160 127 -175 141 216 69 -37 5 507 265 -551 144 529 186 -528 125
2571 125 -13 -167 -261 -57 270 -568 -443 230 195 -328 -275 336 266 -206 195 492 -93 -167 193 386 -84 -305
2593 -305 350 422 201 -294 178 87 -242 -298 182 289 -451 -405 198 -222 -758 -236 197 -532 -480 87 280 -472
2615 -472 -373 305 147 -12 -95 146 -8 126 -118 393 483 -45 147 745 275 -233 104 636 -303 -499 284
2636 284 98 -377 -370 449 -125 -672 -127 405 -134 -460 -26 125 -175 -118 183 70 187 -126 361 508 77
2657 77 -362 240 560 -308 -244 480 247 -331 -102 402 -340 -624 116 129 -281 -349 18 -130 -197 -224 212 -215
2679 -215 -252 15 393 210 -86 -127 352 218 -269 188 466 152 -235 405 521 -111 -195 306 153 -455 -212
2700 -212 126 243 -444 -57 -121 -174 -421 -332 98 58 -440 152 533 -64 -282 325 142 -119 162 446 331
2721 331 -109 116 350 458 -47 81 290 336 -307 199 216 -121 -519 -35 438 -537 -601 314 279 -610 -294
2742 -294 353 176 -596 258 481 47 -98 315 114 -101 117 139 347 87 111 250 307 225 -320 41 376
2763 376 -299 -256 443 -87 -562 -52 271 -471 -322 331 104 -312 -64 111 -89 -13 35 386 205 -143 85
2784 85 412 22 17 281 210 -28 -306 -149 410 -65 -200 -26 324 -336 -360 103 64 -358 -89 223 -119 -196
2806 -196 -244 220 -141 -342 90 143 -212 -116 264 329 -147 -113 254 171 -257 -71 193 306 -159 -125 435 -157
2828 -157 -115 83 81 -154 -517 -19 330 -488 -335 94 68 -97 52 304 98 -336 103 333 -395 110 102 231
2850 231 169 214 319 166 1 -86 -48 199 61 -491 118 61 -257 -275 161 -159 -391 -41 413 -45 -460 272
2872 272 248 -325 -22 559 296 -8 -109 279 137 -79 -18 253 111 -268 160 197 400 -321 74 305 141
2893 141 -390 -78 134 -267 -434 210 92 -556 -269 248 14 -615 -7 319 -180 -443 202 308 -64 34
2913 34 224 251 134 98 316 212 259 75 96 270 -160 -328 173 139 -228 -207 231 -366 -717 178 376 -571
2935 -571 -327 310 31 -280 -255 439 -246 -359 216 123 66 3 -101 306 -192 -131 -6 449 285 -210 212 734
2957 734 -207 -288 -43 114 -503 -185 408 -136 -325 -77 329 -143 -291 105 170 -238 79 -136 118 -14 -151
2978 -151 287 198 -148 126 288 265 -290 -67 492 36 -246 -126 70 -18 -356 144 311 -184 -242 16 213
2999 213 -497 -253 237 11 -339 -56 329 -42 -125 146 222 7 -65 136 373 46 -176 196 516 0 -48
3020 -48 257 140 -79 97 181 -173 -100 198 -48 -412 -284 148 265 -38 -251 178 61 -414 -180 616 125
3041 125 107 -97 501 136 -237 63 450 11 -252 199 192 62 -176 -45 27 -413 -170 9 -125 -399 -91
3062 -91 -37 -27 -174 -156 404 -278 -117 -234 494 -15 -275 91 254 23 -5 239 187 -520 42 99 132 -316 -66
3085 -66 105 -217 -187 60 93 -226 -390 46 216 -226 -224 -63 142 -32 -472 191 318 129 -205 218 0 -194
3107 -194 -147 356 -29 -510 223 125 -326 -96 191 -226 -393 -85 141 75 -304 -350 -76 108 -239 -273 559 55
3129 55 -180 36 227 -66 -293 134 290 -213 74 15 115 -96 189 311 133 -302 4 421 -141 -167 54
3150 54 267 12 -304 -101 186 -175 -517 60 10 -415 -296 355 -110 -237 80 -26 38 -276 259 254 232 -50
3172 -50 71 576 103 -261 326 69 -261 -309 368 138 -409 -196 337 -27 -344 14 -162 -222 -83 255 -154
3193 -154 -319 -174 -91 339 -43 25 163 72 -208 -426 236 275 -589 -77 473 7 -18 119 385 -367 -271 281
3215 281 -205 -574 -9 81 31 -95 -264 -149 38 -145 -43 186 158 -75 62 443 -49 6 293 338 -88 9
3237 9 289 102 -97 45 161 55 -144 130 -30 117 75 -255 120 -220 -275 -60 303 -128 -200 312 215 -273
3259 -273 -369 135 -49 -394 -57 331 57 -187 247 191 -9 117 -151 34 175 -104 91 216 70 -497 175
3280 175 290 -530 -212 487 -99 -436 192 205 -270 -261 41 206 -131 -47 -25 159 18 60 361 108 217 -37
3302 -37 129 458 3 131 416 363 -408 1 673 -302 -496 243 207 -438 -303 409 -316 -256 -77 138 32
3323 32 -225 71 -17 -126 55 117 142 76 -253 218 422 -6 -138 263 459 -56 -144 285 124 -329 122 35
3345 35 -306 -97 -91 -24 -45 -243 -61 -117 -163 89 -199 118 -73 -285 353 181 18 -189 365 95 111 202 166
3368 166 -44 -229 91 93 154 -82 -179 -3 -335 -328 205 -110 -237 -265 161 115 -141 -173 466 -167 -349 93 160
3391 160 -67 -24 19 18 113 6 8 77 -341 42 238 173 188 -73 155 140 -359 -350 72 -107 -208 61 262 -154
3415 -154 -220 155 39 -296 38 148 89 -132 64 248 -5 179 109 210 256 -325 239 350 -59 -148 183 339
3437 339 71 -112 185 278 -125 -304 304 -10 -392 3 -6 -57 -43 32 -28 199 -121 -81 32 -10 -315 213 108
3460 108 -173 -208 181 158 -262 5 226 70 -204 174 118 -269 -44 -71 73 -16 -233 92 -16 -380 76 202
3482 202 -12 58 -86 245 132 -130 49 197 -84 24 121 323 -85 -12 -18 177 -264 155 275 64 -17 -146
3504 -146 107 8 -118 -80 100 -419 -39 94 145 -102 -169 -59 79 -103 199 70 219 -125 78 83 261 -304
3526 -304 95 221 69 -216 18 203 4 -194 278 173 -174 44 8 98 -331 -21 1 11 -127 -271 -25
3547 -25 -71 -210 -52 298 196 -308 187 208 -181 9 170 251 -113 -51 278 67 -86 -173 242 189 62 -45
3569 -45 305 -173 -249 4 203 -76 -187 134 83 -104 -198 -215 -151 -313 -98 153 126 -92 166 396 4 -153
3591 -153 46 405 27 76 309 272 -148 -82 99 142 -47 -96 -37 -79 -299 -104 164 55 -275 -97 273 -43
3613 -43 -77 -116 265 -125 -224 211 406 -12 65 127 465 -356 -208 363 -137 -291 92 224 12 -104 -17 130
3635 130 326 -203 425 2 -199 -31 150 295 -119 134 628 -4 -225 2 346 -141 -8 240 -55 -229
3655 -229 -57 275 31 -171 -69 -265 210 -183 -323 169 105 -232 -157 156 -310 -375 6 250 -138 -329 -122
3676 -122 126 -17 -305 -98 8 -120 -4 170 214 -188 104 196 -55 -238 262 365 -61 -70 241 323 -455 -94
3698 -94 147 37 -347 -283 197 -151 -80 -194 128 33 -121 -18 43 -157 -89 5 214 -81 -88 -72 283 -96 -109 389
3722 389 376 -402 49 -214 49 -253 15 288 -21 -71 -20 205 42 -117 -199 -78 -372 103 -50 198 -374
3743 -374 -193 -72 -88 113 -4 240 242 -15 207 35 -99 -173 177 79 -81 -101 226 2 -171 50 125 -95
3765 -95 -373 -209 181 67 -121 8 -126 -212 -211 -30 -181 -160 -8 187 70 -53 -98 -41 56 116 145 343 100
3788 100 -94 -74 170 91 -260 105 93 -76 -187 170 116 -59 -264 -131 59 -129 27 8 -46 -477 98 389
3810 389 14 -186 47 236 -63 4 229 225 -14 -23 -47 211 -329 39 23 -33 -172 -100 178 72 -97 38 82
3833 82 -216 -179 -60 184 -119 -316 133 28 -99 -133 236 0 -210 60 215 53 -37 280 -42 100 -452
3854 -452 19 252 -277 -239 392 136 -20 -176 -22 -176 -246 -3 148 -7 -301 78 259 215 -429 -71 109
3875 109 122 -97 -24 380 -59 -34 287 85 -286 -63 313 -88 41 301 6 -67 85 -62 -132 -30 -177 -58
3897 -58 216 -101 -276 163 83 -131 -272 269 380 -110 22 278 -138 -147 176 459 -198 -49 13 -39 -150 140
3919 140 270 128 -117 4 209 138 -103 -369 110 -5 -147 -190 108 78 -5 143 128 -205 29 220 218 -259
3941 -259 32 65 -34 79 -80 253 188 -448 -292 142 13 -48 57 -58 -105 -185 171 116 -193 -148 14 7 -243
3964 -243 -150 170 -69 -142 25 19 201 -106 -304 156 6 -63 173 25 -175 -157 105 94 -116 136 178 -3 -129
3987 -129 -133 -162 -45 -151 272 -265 -182 -131 -67 46 -108 16 -198 -132 -40 -74 33 143 -165 -197 146 97 69 -16
4011 -16 308 248 -167 191 378 47 -107 32 -162 -148 -43 -57 -90 123 -100 120 -101 -310 -112 158 44 -229
4033 -229 51 153 61 80 182 249 -188 -12 16 -124 -296 118 -29 68 -66 142 26 163 -109 -17 -109 -315
4055 -315 -181 -168 207 -18 -129 -195 47 -121 -115 88 -45 -211 124 274 70 133 -49 185 134 12 339 -19
4077 -19 116 55 -41 141 18 -144 166 -1 -230 174 86 -85 -375 -212 221 -96 -31 113 215 -18 -275 241
4099 241 269 37 26 349 -146 -46 -33 321 22 -66 -87 -127 -12 -272 126 251 -173 -54 -144 177 6 21 -87
4122 -87 -377 -54 -58 57 103 -45 -19 192 -150 -239 92 275 -47 -60 42 76 74 -265 231 5 -142 194 56
4145 56 -199 213 -254 7 -41 -33 -18 4 -279 -160 116 148 -103 -54 263 250 -309 61 85 73 73 -156 158 114 190
4170 190 105 135 145 -135 62 164 -63 -256 213 102 -41 -102 258 -48 -151 50 104 1 72 -33 283 -197
4192 -197 -266 192 183 -190 -189 74 254 -302 -249 -17 84 -263 211 273 197 172 96 112 -94 -36 76 16 -190 -334
4216 -334 243 123 -254 -54 -76 118 -56 -154 -133 47 -23 208 190 -38 -142 29 67 144 14 134 80 -141 22
4239 22 297 265 -117 -237 49 -54 -75 -56 229 53 -183 -99 164 -148 -228 -73 310 -194 -205 96 -10 -157
4261 -157 -119 281 -31 27 125 98 -145 -151 152 176 43 -307 -38 278 -114 -32 163 -222 -79 -131 -225 -70 -111 146
4285 146 382 300 -33 -97 -70 -146 39 174 143 237 40 172 226 75 -206 -62 181 -192 -82 116 217 6
4307 6 -15 243 19 -124 -153 87 -210 27 -51 132 -45 -66 -21 -169 -265 -7 192 38 162 153 141 98 -147 -3
4331 -3 20 -169 -199 -129 -16 148 -64 253 121 19 -178 -9 -200 7 82 281 85 -105 -45 -8 -317 -181 -37
4354 -37 71 96 -339 102 71 42 -21 31 -232 -156 -143 36 -201 -268 -81 138 59 -42 -50 61 -171 -322 240 -120
4378 -120 31 -201 -67 -29 -164 -167 300 -79 -247 -108 351 192 -69 -27 111 145 -80 28 217 67 -6 263
4400 263 10 -52 -140 -109 98 -78 -12 106 -33 -45 26 -20 120 -246 -62 181 -194 -154 -51 -340 -172 -56 226
4423 226 -136 10 97 -85 54 -283 36 59 27 -83 399 140 -43 -137 -208 206 37 7 -56 117 -200 75
4445 75 -173 -223 -400 -119 18 -79 -366 -103 127 -202 49 191 -81 -66 205 232 10 -67 81 -92 -17 -71 -56
4468 -56 54 -151 -66 -67 -128 108 -203 -13 60 -44 -175 230 262 -320 188 181 -185 -79 190 124 -64 -55 263 -88
4492 -88 31 -63 24 147 -117 -171 216 110 -136 -32 -82 59 46 0 -41 -132 -186 -98 156 -73 -234 163 220 -11
4516 -11 -212 180 256 105 49 209 300 -300 -73 83 124 172 -120 322 135 -78 6 73 -113 -72 -36 123 -60
4539 -60 -196 -282 37 49 -228 214 47 -150 -206 -61 -10 -3 161 124 -83 -64 141 -45 -90 74 -136 171 -50
4562 -50 -81 316 147 -283 37 -185 31 -90 -127 -4 133 230 -323 -62 -143 -85 -104 75 0 242 2 70 -148
4585 -148 71 -48 41 -87 53 86 -22 37 201 123 119 -178 191 213 172 109 -22 43 59 -212 58 -96 -45 -87
4609 -87 -142 30 52 -12 199 106 -223 174 -103 183 -170 273 265 11 184 335 37 40 -260 -36 28 -122 -372
4632 -372 -109 -121 -374 11 26 -125 -100 -93 207 -296 -146 114 243 -159 -42 189 227 -14 72 -53 -57 -146 -17
4655 -17 114 -174 62 -211 55 48 89 8 216 -181 -23 -174 1 -297 63 68 -281 -366 -154 3 -71 216 226
4678 226 -157 -141 -188 -58 112 -16 -68 -83 103 -6 101 107 122 -273 119 100 -57 -48 -205 -189 -127 -29 44 -142 -56
4703 -56 -187 77 -98 -115 76 -107 159 -31 -302 40 99 -60 88 93 -187 -7 147 130 73 -19 81 134 -153
4726 -153 -110 -2 -159 -19 10 71 -163 -122 -66 -124 -139 278 -127 7 -68 154 -241 39 277 28 -201 -166 182
4749 182 76 -56 -35 -287 -114 82 14 -164 54 173 -213 -118 173 40 90 -173 -126 106 -267 34 -126 -17
4771 -17 -7 -254 252 -67 63 -369 -8 -135 81 343 225 -20 106 -210 258 199 -188 252 56 -221 -90
4792 -90 154 -143 -134 -113 -32 12 -205 -53 -135 -329 90 13 134 -100 -264 192 62 -37 108 85 -29 149 10
4815 10 -47 -67 -142 379 -74 -82 -44 -18 196 87 115 -114 -32 -123 -89 204 -52 -133 -8 -40 37 -29 66 46 54 -243 62
4842 62 90 -84 -121 89 84 125 -35 -28 -23 -265 -103 -17 37 -86 148 96 -87 -202 49 128 25 219 251 172 -33
4867 -33 -54 -234 -73 -83 -160 -127 -184 -244 211 139 -231 -90 230 221 137 -2 -71 48 -9 42 124 -149 18 -40 20 -28
4893 -28 193 104 -26 65 -227 28 106 -12 -242 -17 82 -217 -78 131 258 -60 82 89 -129 -34 57 377 -83
4916 -83 175 186 -55 15 108 105 37 -290 -251 110 -258 -181 54 343 145 -39 -200 -40 -270 -80 129 6 -2 99
4940 99 -141 -119 72 178 64 -146 7 36 24 229 -66 71 -51 9 72 -52 -11 -77 -19 70 -6 1 -119 127
4964 127 -142 -379 -42 82 -16 16 206 -51 129 45 76 86 28 98 122 72 -129 -117 137 -67 16 -134 245 -109
4988 -109 -218 -267 157 105 -224 54 356 115 -84 235 147 -4 26 126 -91 29 190 114 86 -29 -148 -10
5010 -10 15 -58 -23 -96 137 -353 19 -223 -58 -131 8 325 -161 -313 50 22 34 258 -86 100 -119 -140 -67
5033 -67 -202 -161 -78 196 -91 26 14 172 11 57 -176 -19 -1 16 110 33 -131 34 103 119 -109 -15 -5 -186
5057 -186 37 62 124 -46 -79 130 36 -106 138 41 344 17 139 264 10 -399 -30 113 -22 -185 79 7
5079 7 -155 -10 55 167 -178 31 124 -34 83 -89 166 133 -21 38 105 -201 -165 -42 176 163 -149 61 -131
5102 -131 -116 -52 345 252 64 -35 21 18 -136 -65 -2 242 134 -45 -189 170 -32 -46 145 -87 28 -139 -195 55
5126 55 -117 -124 227 32 -71 -47 -14 -19 -149 -81 179 -22 175 -41 24 -16 32 43 -210 120 27 -27 -298 190 -185
5151 -185 -69 -153 18 -12 -47 -333 85 206 169 -168 -28 255 -44 63 242 -45 -44 -134 46 99 -47 99 -63
5174 -63 29 -101 130 20 -182 -79 -68 274 90 -180 46 124 -23 113 126 -49 35 41 -39 54 -153 -25 78
5197 78 146 -197 264 327 -102 168 382 -28 48 -171 -134 233 32 -90 -175 -145 -79 109 7 164 -226 152 143
5220 143 -67 -210 63 -63 -157 -379 75 295 161 148 29 -20 29 -101 64 -33 318 4 59 -35 -170 107
5242 107 168 -99 -86 250 133 -69 -8 71 30 74 32 -248 -30 -19 -117 66 109 -250 25 123 -168 -187 144 181
5266 181 -13 149 122 -33 -185 -134 -26 -143 -83 -120 22 -270 -301 218 223 -95 107 -138 99 -165 83 -72
5288 -72 -44 -156 -210 130 166 -164 -60 64 -58 196 228 342 -53 146 -38 191 -42 -86 -82 -27 -152 86 85 -103
5312 -103 -321 30 329 -19 -171 -15 -307 -140 18 203 63 -13 -129 286 238 -286 -40 22 -168 -120 -82 -71
5334 -71 40 -102 66 234 83 -140 -102 -22 -132 -393 -68 228 -102 77 -21 -64 4 -68 71 -95 82 -77
5356 -77 137 -190 139 95 156 38 -31 -63 -56 87 -30 -14 77 -69 61 174 65 -85 17 109 -38 -142 142
5379 142 -97 -23 -152 -59 -81 -151 -109 -21 179 -33 22 57 -29 -22 153 -30 -188 -49 110 171 -89 -122 29 -89
5403 -89 -184 -292 11 69 53 -85 86 -209 -143 151 -105 41 -203 203 248 138 -36 -218 261 -39 16 197
5425 197 146 -370 -169 231 29 177 -138 -101 155 134 176 35 -155 -64 -11 -26 46 -19 28 -9 -118 58 -36 88
5449 88 -272 2 92 162 83 101 73 -146 186 74 302 -264 76 100 29 295 -99 99 32 91 38 120 62 -31 138
5474 138 22 52 -54 160 99 -184 -77 -87 -245 -7 117 129 104 14 -16 30 -9 -54 -288 170 -34 -85 123 -67
5498 -67 -190 81 -25 -21 6 -231 52 45 84 -58 112 -150 -188 -56 73 -103 -152 43 -99 64 10 70 64 6 -61
5523 -61 351 14 -92 -84 376 -84 -218 -31 -87 -173 -133 78 -50 159 41 -208 147 -138 28 75 121 158 -234
5546 -234 43 83 -66 46 130 266 29 -124 322 83 -47 165 83 299 -153 -22 109 2 122 15 -44
5567 -44 -159 124 -122 37 -93 134 -26 -96 -80 55 -39 158 -333 -60 334 -123 90 -256 -142 98 -12
5588 -12 113 -19 56 55 202 -108 -44 -208 216 -161 -42 219 42 -66 50 80 131 14 -251 116 -305 31
5610 31 -53 -43 8 53 -91 195 -137 225 -73 -152 -149 327 312 -54 90 -11 286 -34 -59 -58 185 -42 -162 -120
5634 -120 135 -35 -132 73 -95 14 -191 158 175 -97 175 11 58 13 -248 56 25 -57 13 164 5 -140
5656 -140 127 22 -129 -147 14 -43 -137 -278 -307 -50 21 36 28 -6 33 -118 171 -98 -126 74 107 -57 10 23 -153
5681 -153 -123 -37 -200 362 -52 -199 24 -77 13 19 176 -130 -22 59 -33 8 130 82 -129 -241 -204 37 193
5704 193 -101 -39 -120 -92 -217 -16 110 -190 74 93 -62 -103 -316 105 40 -111 -240 -9 68 -30 93 -49 -158
5727 -158 -182 -155 116 -55 -243 -2 -133 -242 -136 -10 -88 -81 220 76 -144 -38 -55 -86 138 -46 -58 -51 232
5750 232 -212 -308 181 -304 -11 -68 192 341 27 15 43 56 11 -150 172 41 -176 9 -235 -104 -37 -16 -26
5773 -26 88 47 122 -99 16 -146 -73 113 97 -84 220 61 -49 -42 86 -65 18 105 -37 -231 89 193 -56
5796 -56 -186 -77 23 -23 -37 -169 87 -207 36 114 63 -54 -186 159 -34 -55 -105 -15 -35 -23 56 26 29 -21 234
5821 234 -221 -124 -2 -117 91 -43 -144 6 84 49 -168 163 -157 -63 -131 -9 -362 -9 78 266 25 -262
5843 -262 225 17 -108 -162 249 287 42 73 143 40 106 -19 -65 107 -382 -305 -140 51 -77 138 -153 29
5865 29 152 -7 -49 69 19 -30 -33 -77 214 -34 170 -50 14 234 227 -32 130 187 -185 54 -50 -78 75 -61
5889 -61 283 -39 149 240 -4 -41 -122 59 -90 -135 -146 -203 135 203 -57 224 306 -95 175 203 -55 -142 125 51
5913 51 50 7 103 67 -77 -56 -144 -17 -14 -191 294 127 122 -120 120 160 -4 180 -159 21 -166 -49 219 43
5937 43 7 265 101 10 71 -193 -227 -70 -292 46 87 -152 208 94 135 75 -247 -31 -173 -34 137 -12 -163
5960 -163 -42 126 -53 -267 -181 34 36 -158 20 135 -43 -190 -88 -45 -147 -56 -123 74 -219 -83 126 151
5982 151 -67 42 43 198 39 91 130 -346 -335 -30 50 -175 63 -26 -89 -268 -17 83 21 134 128 22 128 -165
6006 -165 -57 116 45 -151 -94 226 129 113 -17 -29 -204 -46 24 -118 -63 -43 -126 -129 -21 16 -83 123 -149 -50 -8
6031 -8 132 -69 -173 118 13 -244 102 5 -111 -420 156 129 24 -77 -5 -41 135 -154 -59 -45 79 95 -80
6054 -80 -84 109 -12 -31 -57 8 149 133 -60 -87 -174 84 35 -39 107 63 32 117 514 -173 -91 -97 178 -111 -20 -20 8
6081 8 -206 117 -116 14 -29 -65 -8 -23 38 -34 -103 -86 -59 -78 311 -258 -47 -113 191 -102 52 114 64 -42 -137
6106 -137 -26 41 73 17 223 87 -114 -7 8 125 -64 250 115 106 62 -89 227 -77 -1 191 59 84 -208
6129 -208 105 66 -120 -53 235 -24 169 -85 238 -105 92 85 106 -25 -232 -176 -43 42 -167 58 348 104
6151 104 -185 34 -35 23 -90 26 -131 -152 -125 -64 34 83 235 -67 39 22 -151 248 146 -44 7 -18 -1 -35
6175 -35 5 117 92 -22 -124 229 -190 133 -17 -73 184 35 37 -154 128 -172 151 136 -9 111 -161 -146 201
6198 201 68 -119 -65 227 -5 83 88 142 173 -19 -143 5 -36 -72 107 38 1 -225 -243 -58 92 -125 -11 105
6222 105 295 -31 333 -12 -69 -77 -71 -130 168 -58 261 -87 -64 236 135 1 156 -33 -131 288 -100 -38 17
6245 17 143 112 67 239 -200 45 196 -205 -208 80 21 -220 0 -110 43 -29 -50 -31 142 65 42 -174 72 -227
6269 -227 -7 39 -126 -76 -107 -33 -201 43 276 138 4 -423 7 -56 178 -9 25 197 -75 -57 24 -219 -48
6292 -48 -4 60 20 -296 -80 141 -63 42 -83 -74 -271 -110 265 21 22 22 29 -51 -195 -152 284 -117 -210 113 22
6317 22 -3 -88 -27 -34 -128 256 -24 -14 48 233 41 -86 -210 -145 155 70 -37 -114 108 -4 -15 291 25 -6 238
6342 238 164 191 -134 -93 157 -54 -226 -233 84 -116 -25 49 188 -75 -133 48 -82 -70 126 -149 71 27 -172
6365 -172 149 -158 60 -51 -57 -215 -147 -250 81 38 -82 21 0 151 -209 139 -27 59 -41 -68 123 -26
6387 -26 -106 85 41 -158 50 300 194 -28 -104 136 -117 -84 48 -45 35 -85 -15 178 -5 -105 -22 -24 -1 258
6411 258 107 197 17 -73 189 33 -82 1 49 188 -147 217 49 -7 108 131 46 21 271 -53 179 -130 -146
6434 -146 -12 9 33 32 84 -79 41 3 257 -57 7 1 350 125 -202 -44 31 44 245 171 -223 -34 140 110
6458 110 -17 -109 110 -127 -42 60 12 -129 -111 -306 50 -126 31 -145 142 -75 -18 77 307 144 -134 -52
6480 -52 -1 -209 -88 253 -4 51 58 98 46 -47 -43 153 -70 -40 26 290 202 28 -135 182 79 40 142 10 -269
6505 -269 -52 63 59 51 -9 -83 9 -173 52 313 -152 83 207 1 -186 -163 -119 273 -21 -83 -81 18 127 12
6529 12 168 101 166 261 225 -135 -241 36 -109 -31 -133 6 101 -8 139 188 -30 110 -96 158 -219 -163 216
6552 216 41 -242 -51 187 273 -73 -220 -55 140 -34 -104 -227 -129 -9 -236 -29 -66 123 -219 -133 19 -172
6574 -172 68 90 -215 -156 70 189 77 -38 201 275 98 -81 357 34 51 -226 175 285 -73 -144 -7 56
6596 56 -135 132 63 -158 -97 -135 -80 -101 -215 35 76 158 75 158 60 -95 -39 -75 -83 -41 101 226 -61 75 5 -192
6622 -192 -169 -12 -31 -117 -164 45 -211 131 -140 272 86 -130 172 63 -171 22 -112 136 -135 119 -144
6643 -144 -13 -63 -145 -204 164 26 -92 70 -171 57 -60 -120 47 30 -20 -5 91 100 -7 -89 -125 13 79 228
6667 228 -105 -128 68 294 71 -255 132 6 177 -64 283 233 54 139 -36 -308 143 -20 -86 105 4
6688 4 -98 4 -278 -60 -78 -73 -101 -47 280 -133 -89 65 24 150 4 -432 135 31 -85 152 63 29 186 -104
6712 -104 -67 -14 31 -1 125 388 43 -110 28 33 -123 62 -49 -80 -369 255 -105 -103 48 90 12 -52 20 187
6736 187 -130 -60 -148 11 -24 294 -56 -36 -239 70 -76 162 -268 22 22 214 -65 9 50 54 -122 -139 -216 8
6760 8 11 69 9 252 68 132 148 296 -54 90 -83 46 -117 97 -30 127 -54 237 32 -295 70 56 95
6783 95 -325 -55 -159 74 82 67 -34 24 -166 88 78 -147 -26 87 -81 -30 -99 -29 -5 -48 142 314 -198 -332
6807 -332 160 225 126 -15 10 56 188 -79 129 -211 -210 219 184 -78 -149 -42 -29 -249 -127 -27 -134 -82 -120 117
6831 117 -6 -28 -178 279 -183 -247 -34 -157 -23 100 27 83 -38 -98 27 2 -96 82 175 34 -374 36 -263
6854 -263 194 132 -134 -125 -185 45 25 -46 -226 231 -57 97 96 171 169 -160 -40 -121 6 -53 -161 -158 50 -252 -16
6879 -16 88 -23 86 -232 -93 49 -74 -144 -93 239 -155 40 63 -178 104 -206 -235 17 -54 -52 -9 137 43
6902 43 -21 289 -75 -168 -29 -133 70 42 118 45 0 33 96 46 26 -201 151 25 -17 -74 87 172 217 -95 78
6927 78 240 -72 77 74 -106 106 114 7 -93 -154 -141 -54 -228 -227 103 -113 160 -109 194 -95 -3 -17 -251 63
6951 63 -135 56 121 -299 88 -68 10 -214 -135 -58 -50 -97 -168 59 -85 10 116 44 -44 -114 174 8 105 21 99
6976 99 84 -148 -65 167 46 -173 151 121 -126 110 32 -25 -224 -74 -66 -196 -202 -375 -202 64 151 108 108 45 -98
7001 -98 249 15 63 -309 89 32 114 134 -160 -183 -117 -115 303 111 -223 -227 118 -235 6 40 -101 75 -46 -50 -110
7026 -110 -69 -174 190 235 -151 -226 22 -36 -22 9 67 -34 -25 -87 64 79 32 -169 -39 51 128 -172 -42 93 5
7051 5 -33 19 -285 113 -81 -96 -47 -11 212 46 113 -178 364 -241 -63 20 89 -5 -65 -45 57 48 -204 92 -128
7076 -128 54 47 3 -149 116 83 316 94 -238 37 -320 63 73 30 -106 19 -164 -154 35 -44 23 92 68 44
7100 44 256 247 -229 208 -76 -125 -214 -107 -28 167 338 -93 221 -200 160 98 12 199 -153 39 128 -503 29
7123 29 164 71 -183 189 -116 101 -37 -9 -67 78 65 196 71 33 54 -139 -57 -144 -25 247 117 -65 -97
7146 -97 201 -96 -52 -6 39 41 -278 217 -6 72 144 22 -190 -66 -30 105 71 105 201 163 -78 -71 161 252 -69
7171 -69 -3 240 256 -108 -190 -124 80 -114 -81 -72 -177 66 103 117 87 129 151 19 2 -118 202 -198 21 20 -57 -153
7197 -153 -119 -141 -184 68 -134 74 206 258 -124 64 -105 -23 -163 9 -10 -327 -74 197 -162 62 -29 71
7219 71 286 54 -250 -57 -25 84 -58 150 -34 -315 -222 65 -49 -73 65 137 -101 -55 -62 -132 194 -165 -75
7242 -75 241 -110 -118 59 30 79 -185 -169 84 -92 204 124 153 -55 23 248 -76 -93 -8 -88 136 51 -45 182 -100
7267 -100 32 14 66 -77 131 -65 146 65 -172 8 -133 131 -65 182 -97 98 62 -78 -115 65 -28 101
7289 101 74 -82 69 64 80 -174 -8 -13 -29 -130 257 93 83 29 144 52 -13 -116 109 115 141 -9 -106 148 -218
7314 -218 64 119 -74 -137 -31 -10 38 28 -54 132 292 -12 -95 50 -190 1 -40 -275 133 -119 59 -102 -138
7337 -138 -23 -69 205 -132 -172 -38 -94 64 131 -241 4 -224 -266 58 -21 91 81 188 -52 188 71 18 -94
7360 -94 183 -151 -181 156 157 -74 181 14 151 89 128 149 166 -130 -20 157 0 220 -110 -64 76 39 65 -84
7384 -84 28 -105 -10 -149 -9 -103 346 -49 -279 152 -16 290 -165 -79 112 -33 -119 -41 -91 -100 91 -277 54
7407 54 124 58 -168 45 4 -29 -156 -274 -130 -259 -21 195 -26 -131 180 -51 -8 -50 16 -58 102 41 47 187
7431 187 -72 53 135 10 -132 -20 142 68 93 -15 -199 -107 106 25 -148 21 -133 -161 152 170 62 -151
7453 -151 47 59 145 -243 -151 166 30 112 2 -136 203 109 -99 -77 -44 -10 -24 131 -14 -92 -14 -59 67 59 -103
7478 -103 -97 -73 72 4 15 -329 215 24 -107 -201 67 135 -326 203 136 331 70 -102 36 -124 -50 -21 -146
7501 -146 -122 -318 -287 342 -182 -385 -4 -22 183 -228 -20 -160 134 -63 200 135 57 -197 -99 -111 36 68 51
7524 51 145 -58 172 23 -269 -196 149 198 -253 -171 -6 187 -108 5 76 62 -124 -18 334 -266 58 165
7546 165 -24 -129 58 -54 -230 -153 -20 60 65 -167 216 67 -64 79 44 -25 124 -70 95 189 133 -133 -11
7569 -11 115 194 -255 -310 255 151 5 120 -2 -41 22 10 220 82 -10 232 117 -150 198 -8 123 -100
7591 -100 225 153 32 59 93 89 -76 -6 16 -275 -149 85 63 -237 -29 245 -1 89 188 17 112 -213 -106 190
7615 190 68 -81 -105 -133 193 125 43 -160 -163 64 -117 -122 -172 -101 -31 -36 -126 17 229 16 197 -105 -188 42 113
7640 113 282 42 -4 -117 -133 19 161 198 -64 156 228 -14 142 164 175 -131 -65 14 -27 -8 65 168 58 -52
7664 -52 -109 -188 139 100 -7 -8 -223 -51 190 93 -20 258 1 60 -97 -1 143 59 -15 -10 8 -88 -166 100 11 -159
7690 -159 55 200 125 -319 -221 -82 -94 321 -67 -28 193 -134 287 -180 53 93 -43 -48 37 71 -30 140 44
7713 44 -26 128 237 -27 -23 59 -187 -17 87 176 49 232 91 153 -196 -148 120 -41 -205 2 30 183 -98
7736 -98 13 99 47 -175 235 100 290 15 -5 164 32 48 -80 139 18 -38 8 62 125 -27 -149 209 -84
7759 -84 30 85 71 -114 -156 38 -151 -111 113 -28 -66 -125 85 5 -83 -143 -134 117 51 123 121 -256 -77 60 121 41
7785 41 67 13 174 41 58 -41 0 193 -48 -45 -96 -182 -282 76 -36 -58 134 21 92 -69 -139 104 -84 -136 -88
7810 -88 73 -245 14 -33 45 -67 -100 -48 -144 -3 69 212 116 -33 137 165 113 -88 -104 -27 146 -165 63 -224
7834 -224 67 109 -70 -59 -229 137 -46 152 -63 -89 180 215 8 30 -82 49 -27 153 -20 -23 155 -125 56
7857 56 -11 40 90 -179 -40 -91 102 -11 -12 -9 -92 -207 -109 110 -74 53 101 156 -179 -98 151 -144 -76 -94 -44 102
7883 102 -103 -22 100 110 97 -127 -138 -167 -101 -2 -104 -59 -234 255 66 -72 -45 167 199 -82 -106 -145 20 -85
7907 -85 194 118 -281 -48 156 59 154 204 145 44 1 -115 134 -108 -41 91 -152 122 16 119 95 -13 169
7930 169 -211 57 109 -26 -120 146 -125 -159 -179 -19 32 74 -46 77 235 -54 -36 -24 214 0 -5 47 151 125
7954 125 14 -34 -67 -7 -111 11 172 24 -97 -347 1 -10 -3 -208 -138 20 156 -144 6 -74 142 37 205
7977 205 -198 -114 -168 -17 111 94 30 -6 139 -215 -231 -46 11 -156 56 -35 79 -47 -65 -48 57 7 184 247
8001 247 -97 -154 13 171 344 -102 -178 88 -3 177 -176 -37 41 120 133 33 -175 93 52 -433 -42 3 -3
8024 -3 150 -183 -55 88 182 -256 -86 -56 -60 22 204 -128 113 99 66 243 -18 -140 -138 -157 -127 49 -48 -35 -59
8049 -59 -187 98 -109 -57 -72 48 -81 67 -214 -8 41 19 -40 95 150 -205 103 154 -80 -41 12 1 -49 -11
8073 -11 -159 113 -99 90 -123 50 128 -98 -274 -13 -91 2 -59 -215 -10 -26 117 -87 79 -69 -46 90
8095 90 -28 13 70 -245 171 114 96 101 243 -35 90 -17 96 28 -137 88 87 -202 114 222 -142 -192 38 -131
8119 -131 19 111 -44 -44 -50 -120 54 -17 -81 53 -208 149 148 59 216 -281 161 246 84 169 2 -88 201 -86 29
8144 29 63 -253 -22 -133 112 42 133 -71 -22 -20 -73 -104 -60 -276 -82 86 -168 -49 285 172 -85 44 -167
8167 -167 84 -25 -90 -147 -12 63 -140 -7 -161 50 35 98 7 55 -151 245 83 29 -60 223 113 134 44 -163
8191a63
##END NTUPLES=NMR FID
##END=
