##TITLE=1H_Pr CS2
 200.13MHz,CDCl3,
 8 sc
 
 11.6.2025
##JCAMPDX= 6.0         $$ Bruker NMR JCAMP-DX V2.0
##DATA TYPE= NMR FID
##DATA CLASS= NTUPLES
##ORIGIN= UXNMR, Bruker Analytische Messtechnik GmbH
##OWNER= pz
$$ XWIN-NMR		Version 3.5
$$ Wed Jun 11 15:34:53 2025 Russian Standard Time (UT+4h)  she@DPX200
##.OBSERVE FREQUENCY= 200.1313
##.OBSERVE NUCLEUS= ^1H
##.DELAY= (6, 6)
##.ACQUISITION MODE= SIMULTANEOUS
##.ACQUISITION SCHEME= undefined
##.AVERAGES= 8
##.DIGITISER RES= 18
##SPECTROMETER/DATA SYSTEM= spect
##.PULSE SEQUENCE= zg30
##.SOLVENT NAME= CDCl3
##.SHIFT REFERENCE= (INTERNAL, CDCl3, 0, 14.3821)
##AUDIT TRAIL= $$ (NUMBER, WHEN, WHO, WHERE, WHAT)
$$ ##TITLE= Audit trail, XWIN-NMR		Version 3.5
$$ ##JCAMPDX= 5.01
$$ ##ORIGIN= Bruker BioSpin GmbH
$$ ##OWNER= she
$$ F:/spectra/data/she/nmr/H-C/1/audita.txt
$$ ##AUDIT TRAIL=  $$ (NUMBER, WHEN, WHO, WHERE, WHAT)
(   1,<2025-06-11 15:33:06.12 +0400>,<she>,<DPX200>,
      <created by zg, POWCHK disabled, PULCHK disabled
       configuration hash MD5:
       00 E9 B6 7A A2 85 ED C7 34 08 36 98 17 FE 4E 26
       data hash MD5: 16K
       BB B0 AB 30 F7 D3 66 05 BD 81 E3 B4 5D D6 7F D2>)
$$ ##END=
$$ 
$$ hash MD5
$$ 7C E1 F6 47 49 6D 0E D4 3D 10 A6 29 CC 45 97 F5
##$RELAX= 
##$RELAX= 
##$RELAX= 
##$RELAX= 
##$RELAX= 
##$RELAX= 
$$ Bruker specific parameters
$$ --------------------------
##$DU= <F:/spectra>
##$EXPNO= 1
##$NAME= <H-C>
##$PROCNO= 1
##$TYPE= <nmr>
##$USER= <she>
##$AMP= (0..31)
100 100 100 100 100 100 100 100 100 100 100 100 100 100 100 100 100 100 
100 100 100 100 100 100 100 100 100 100 100 100 100 100 
##$AQSEQ= 0
##$AQ_mod= 1
##$AUNM= <au_zg>
##$AUTOPOS= <>
##$BF1= 200.13
##$BF2= 200.13
##$BF3= 200.13
##$BF4= 200.13
##$BF5= 200.13
##$BF6= 200.13
##$BF7= 200.13
##$BF8= 200.13
##$BYTORDA= 1
##$CFDGTYP= 0
##$CFRGTYP= 5
##$CHEMSTR= <none>
##$CNST= (0..31)
1 1 145 1 1 1 1 1 1 1 1 1 1 1 1 1 1 1 1 1 1 1 1 1 1 1 1 1 1 1 1 1 
##$CPDPRG= <>
##$CPDPRG1= <>
##$CPDPRG2= <>
##$CPDPRG3= <>
##$CPDPRG4= <mlev>
##$CPDPRG5= <mlev>
##$CPDPRG6= <mlev>
##$CPDPRG7= <mlev>
##$CPDPRG8= <mlev>
##$CPDPRGB= <>
##$CPDPRGT= <>
##$D= (0..31)
0 0.7 0 0 0 0 0 0 0 0 0 0.03 0 0 0 0 0 0 0 0 0 0 0 0 0 0 0 0 0 0 0 0 
##$DATE= 1749641585
##$DBL= (0..7)
120 120 120 120 120 120 120 120 
##$DBP= (0..7)
150 150 150 150 150 150 150 150 
##$DBP07= 0
##$DBPNAM0= <>
##$DBPNAM1= <>
##$DBPNAM2= <>
##$DBPNAM3= <>
##$DBPNAM4= <>
##$DBPNAM5= <>
##$DBPNAM6= <>
##$DBPNAM7= <>
##$DBPOAL= (0..7)
0.5 0.5 0.5 0.5 0.5 0.5 0.5 0.5 
##$DBPOFFS= (0..7)
0 0 0 0 0 0 0 0 
##$DE= 6
##$DECBNUC= <off>
##$DECIM= 32
##$DECNUC= <off>
##$DECSTAT= 4
##$DIGMOD= 1
##$DIGTYP= 9
##$DL= (0..7)
0 120 120 120 120 120 120 120 
##$DP= (0..7)
150 150 150 150 150 150 150 150 
##$DP07= 0
##$DPNAME0= <>
##$DPNAME1= <>
##$DPNAME2= <>
##$DPNAME3= <>
##$DPNAME4= <>
##$DPNAME5= <>
##$DPNAME6= <>
##$DPNAME7= <>
##$DPOAL= (0..7)
0.5 0.5 0.5 0.5 0.5 0.5 0.5 0.5 
##$DPOFFS= (0..7)
0 0 0 0 0 0 0 0 
##$DQDMODE= 0
##$DR= 18
##$DS= 0
##$DSLIST= <SSSSSSSSSSSSSSS>
$$ [...]
##$SUBNAM0= <"">
##$SUBNAM1= <"">
##$SUBNAM2= <"">
##$SUBNAM3= <"">
##$SUBNAM4= <"">
##$SUBNAM5= <"">
##$SUBNAM6= <"">
##$SUBNAM7= <"">
##$SUBNAM8= <"">
##$SUBNAM9= <"">
##$SW= 18.0517328524113
##$SWIBOX= (0..15)
0 0 2 0 0 0 0 0 0 0 0 0 0 0 0 0 
##$SW_h= 3612.71676300578
##$TD= 16384
##$TD0= 1
##$TE= 0
##$TE2= 300
##$TE3= 300
##$TEG= 300
##$TL= (0..7)
0 120 120 120 120 120 120 120 
##$TP= (0..7)
150 150 150 150 150 150 150 150 
##$TP07= 0
##$TPNAME0= <>
##$TPNAME1= <>
##$TPNAME2= <>
##$TPNAME3= <>
##$TPNAME4= <>
##$TPNAME5= <>
##$TPNAME6= <>
##$TPNAME7= <>
##$TPOAL= (0..7)
0.5 0.5 0.5 0.5 0.5 0.5 0.5 0.5 
##$TPOFFS= (0..7)
0 0 0 0 0 0 0 0 
##$TUNHIN= 0
##$TUNHOUT= 0
##$TUNXOUT= 0
##$USERA1= <user>
##$USERA2= <user>
##$USERA3= <user>
##$USERA4= <user>
##$USERA5= <user>
##$V9= 5
##$VALIST= <valist>
##$VCLIST= <CCCCCCCCCCCCCCC>
##$VD= 0
##$VDLIST= <DDDDDDDDDDDDDDD>
##$VPLIST= <PPPPPPPPPPPPPPP>
##$VTLIST= <TTTTTTTTTTTTTTT>
##$WBST= 1024
##$WBSW= 4
##$XGAIN= (0..3)
0 0 0 0 
##$XL= 0
##$YL= 0
##$YMAX_a= 66546
##$YMIN_a= -57924
##$ZGOPTNS= <>
##$ZL1= 120
##$ZL2= 120
##$ZL3= 120
##$ZL4= 120
##$ABSF1= 10
##$ABSF2= 0
##$ABSG= 5
##$ABSL= 3
##$ALPHA= 0
##$AQORDER= 0
##$ASSFAC= 0
##$ASSFACI= 0
##$ASSFACX= 0
##$ASSWID= 0
##$AUNMP= <proc_1d>
##$AZFE= 0.1
##$AZFW= 0.1
##$BCFW= 1
##$BC_mod= 2
##$BYTORDP= 1
##$COROFFS= 0
##$CY= -3
##$DATMOD= 1
##$DC= 2
##$DFILT= <>
##$DTYPP= 0
##$F1P= 0
##$F2P= 0
##$FCOR= 0.5
##$FTSIZE= 0
##$FT_mod= 4
##$GAMMA= 1
##$GB= 0.15
##$INTBC= 1
##$INTSCL= 1
##$ISEN= 128
##$LB= 0.25
##$LEV0= 0
##$LPBIN= 0
##$MAXI= 10000
##$MC2= 0
##$MEAN= 0
##$ME_mod= 0
##$MI= 1.114404
##$NCOEF= 0
##$NC_proc= 0
##$NLEV= 6
##$NOISF1= 3.799351
##$NOISF2= 2.8
##$NSP= 1
##$NTH_PI= 0
##$NZP= 0
##$OFFSET= 14.38212
##$PC= 1
##$PHC0= -1356.381
##$PHC1= 13.9922
##$PH_mod= 1
##$PKNL= yes
##$PPARMOD= 0
##$PSCAL= 0
##$PSIGN= 0
##$REVERSE= no
##$SF= 200.129724274929
##$SI= 16384
##$SIGF1= 3
##$SIGF2= 2
##$SINO= 400
##$SIOLD= 16384
##$SREGLST= <1H.CDCl3>
##$SSB= 0
##$STSI= 0
##$STSR= 0
##$SW_p= 3205.1282051282
##$SYMM= 0
##$S_DEV= 0
##$TDeff= 0
##$TDoff= 0
##$TI= <>
##$TILT= no
##$TM1= 0
##$TM2= 0
##$TOPLEV= 0
##$USERP1= <user>
##$USERP2= <user>
##$USERP3= <user>
##$USERP4= <user>
##$USERP5= <user>
##$WDW= 1
##$XDIM= 8192
##$YMAX_p= 0
##$YMIN_p= 0
$$ End of Bruker specific parameters
$$ ---------------------------------
##NTUPLES= NMR FID
##VAR_NAME=  TIME,          FID/REAL,        FID/IMAG
##SYMBOL=    X,             R,               I
##VAR_TYPE=  INDEPENDENT,   DEPENDENT,       DEPENDENT
##VAR_FORM=  AFFN,          ASDF,            ASDF
##VAR_DIM=   8192,          8192,            8192
##UNITS=     SECONDS,       ARBITRARY UNITS, ARBITRARY UNITS
##FACTOR=    0.0002768,     1,               1
##FIRST=     0,             0,               0
##LAST=      2.2672688,     0,               0
##MIN=       0,             -57924,          0
##MAX=       2.2672688,     66546,           0
$$ Real data points
##PAGE= N=1
##DATA TABLE= (X++(R..R)), XYDATA
$$ plain form
0 0 0 0 0 0 0 0 0 0 0 0 0 0 0 0 0 0 0 0 0 0 0 0 0 0 0 0 0 0 0 -1 3 -4 8 -8 8 -8 8 -9 10 -11 15 -16 18 -19 20 -24 26 -28
48 -28 30 -35 38 -43 46 -52 56 -62 67 -74 81 -90 100 -110 120 -131 143 -149 131 -36 -447 5923 66546
71 66546 39613 -39823 -36730 15657 19884 -15671 -15723 10319 12886 -44 1696 -786 -17126 -13045
85 -13045 19446 27541 -4517 -22008 1099 15912 -3443 -15843 1733 14289 3528 -5754 -3716
98 -3716 -8097 -11693 5120 20700 3880 -19193 -8813 14451 7902 -12097 -6766 12096 11489 -1552
112 -1552 -4478 -3802 -7010 -978 12568 8216 -10654 -11266 5615 4393 -12620 -6817 16397 12578
126 12578 -13628 -12717 12345 10578 -14524 -9651 20963 19304 -14825 -21327 7190 16623 -5606
139 -5606 -13703 5475 12868 -3636 -13008 -4091 2150 749 4595 7397 -2690 -10145 184 9585
$$ packed form
0@%%%%%%%%%%%%%%%%%%%%%%%%%%%%%jMpJ2j6J6j6J6j7J9k1K6l1L4l7L9m4N0n4
48b8N8o5P3q1Q9r8J08j18J29j41J55j71J90k10K30k51K74k92K80j67m11O370O0623
71F6546k6933p9436L093N2387M227l5555n2K6042K567j2930J740k482j6340M081
85a3045L2491Q095l2058j7491K3107J4813j9355j2400J7576J2556j0761r282K038
98c716m381l596J6813J5580j6820k3073J0380K3264o549j9999N331J8862o07j3041
112a552k926O76l208O032J3546m352j8870o12J6881j222j7013N803K3214l819
126A2578k6206R11K5062j767k5102M873L0614j659l4129o502K8517R433k2229
139e606q097J9178P393j6504r372Q917O241j401L846K802j0087p455J0329R401
$$ plain form
153 9585 528 -7437 3991 13068 89 -13328 -4682 7059 1853 -5003 1427 5332 -4454 -9842
167 -9842 -445 5793 565 -1464 4193 3035 -5269 -4376 4583 5334 -824 322 4805 -81 -7226 -2829
183 -2829 4111 727 -3381 2138 3775 -6666 -9858 3716 10628 -1940 -9414 3703 12633 -1307
197 -1307 -13649 -1996 13160 7608 -5923 -6080 1779 2487 -1688 -2273 -1543 -861 2349 3803 -3327
212 -3327 -9685 -2107 9318 6269 -5222 -4736 4665 4903 -3100 -3462 3524 4336 -442 -681 721 -3122
228 -3122 -5260 1090 6204 170 -6401 -2642 3369 958 -3637 -1064 3690 3055 101 -766 -1282 -1843
244 -1843 1866 5773 2026 -4578 -2984 3314 1779 -5105 -3888 3935 4048 -3192 -4982 142 2001
259 2001 -674 73 2961 1790 -1859 -987 2022 860 -1195 769 2946 441 -2789 -1785 87 -679
$$ packed form
153I585r057p965J1428R077j2979j3417Q646J1741n206o856O430L905r786n388
167i842R397O238n228k029N657j158q304Q93Q959P51o158J146M483m886p145M397
183b829O940l384m108N519J637j0441l192J3574O912j2568p474J3117Q930j3940
197a307j2342J1653J5156n552j3531j57P859P08m175n85P30O82L210J454p130
212c327o358P578J1425l049j1491M86R401K38q003l62O986Q12m778k39J402l843
228c122k138O350N114o034o571L759O011k411m595K573M754o35k954q67n16n61
244a843L709L907l747o604J594O298j535o884J217P823J13p240j790N124J859
259B001k675P47K888j171l649Q72L009j162k055J964K177k505l230J004J872p66
$$ plain form
275 -679 -798 1081 756 -2457 -2428 1281 1541 -1897 -1179 3652 3727 -1718 -3425 1330 3658 445 -1601
292 -1601 491 1414 -798 -2130 -1137 -241 -237 532 608 -1409 -2673 -240 2041 704 -956 925 2489
309 2489 304 -1734 -182 1990 1033 -390 615 555 -1589 -2494 -63 1190 -700 -1498 114 780 -927
326 -927 -1651 466 1865 1047 355 565 351 -361 197 1304 735 -390 5 459 -936 -2473 -1094 1186
344 1186 415 -1443 -1006 232 -44 -875 212 1621 1309 356 281 533 -233 -234 885 1192 -151 -1080 -554
363 -554 -340 -955 -1203 -151 426 -143 -427 -461 -347 -256 972 1697 718 -522 165 1341 598 -868 -456
382 -456 1007 1043 -634 -1808 -1504 -416 407 130 -929 -1061 1 923 346 -872 -265 1771 2184 360
400 360 -1150 -444 1020 1031 -104 -615 -373 -330 -544 -728 -798 -835 -270 520 537 -435 -864 -2 1215 1294 523
$$ packed form
275f79j19J879l25l213K9L709K60l438P18M831P5n445j707M755K328l213k046
292a601K092R23k212j332R93Q96MP69P6k017j264K433K281j337j660J881J564
309B489k185k038J552K172r57j423J005o0k144r05K431J253j890p98J612O66j707
326i27p24K117J399q18o92K10k14p12N58J107n69j125L95M54j395j537J379K280
344A186p71j858M37J238k76q31J087J409l12r53p5K52p66jJ119L07j343r29N26
363e54K14o15k48J052N77n69k84l4J14R1J228P25r79j240O87J176p43j466M12
382d56J463L6j677j174L04J088Q23k77j059j32J062R22n77j218O07K036M13j824
400C60j510P06J464J1j135n11K42M3k14j84p0l7N65P90J7r72m29Q62J217P9p71
$$ plain form
421 523 7 280 602 476 -2 -227 -199 -1 61 -117 -834 -1497 -914 586 996 -201 -1625 -803 1446 1854
441 1854 -3 -1339 369 2367 1577 -856 -1706 -29 1690 1157 -777 -2061 -1416 619 1378 -539
457 -539 -2574 -1395 2076 2655 -964 -3237 -339 3562 2786 -1398 -2230 894 2737 496 -1689 -1317
473 -1317 553 808 -114 -945 -1368 -929 46 934 407 -1237 -1101 1134 2082 173 -1369 46 2233 1433
491 1433 -805 -1012 477 898 -370 -844 -21 2 -1206 -1340 385 1332 -440 -1691 -11 1932 827
508 827 -1263 -788 1555 1932 200 -708 -416 -202 257 973 347 -1882 -2362 749 2404 -616 -4067 -1517
526 -1517 3685 3165 -2388 -3901 1121 4444 1224 -2599 -1530 1902 2279 -218 -1529 -937 81 536
542 536 471 -596 -1987 -1416 921 1786 -616 -2635 -547 2632 2144 -1258 -1976 918 2701 835 -1490
$$ packed form
421E23n16K73L22j26m78k25K8J98O2j78p17o63N83J500M10j197j424Q22K249M08
441A854j857j336J708J998p90k433q50J677J719n33j934j284O45K035P59j917
457e39k035J179L471N79l619k273K898L901p76m184q32L124J843k241k185L72
473a317J870K55r22q31m23M39R75Q88n27j644J36K235R48j909j542J415K187q00
491A433k238k07J489M21j268m74Q23K3j208j34J725R47j772j251J680J943j105
508H27k090M75K343L77j732r08K92K14M59P16o26k229m80L111J655l020l451K550
526a517N202n20n553j513N022L323l220l823J069L432L77k497j311N92J018M55
542E36o5j067j391N71K337Q65k402k019K088L179m88l402p18K894J783j866k325
$$ plain form
559 -1490 -1103 954 1184 -626 -1050 -226 -31 -872 -530 408 -33 -1061 -534 1152 1053 -693 -922 688
577 688 1408 294 -162 705 307 -677 -204 1107 224 -1987 -1483 1566 1696 -2058 -3353 343 3205 759
595 759 -2612 -1333 1957 2338 -181 -1578 -87 1373 1376 128 -909 -1183 -79 1128 676 -1495 -2138
612 -2138 5 1728 597 -1741 -1603 792 2295 540 -1394 -963 1369 2232 126 -1447 -656 1016
628 1016 1207 -355 -1250 -610 233 342 -403 -954 -926 -12 1085 536 -775 -766 817 1523 47 -777 254
647 254 1406 351 -781 -410 583 -27 -1124 -604 508 -30 -982 -785 363 395 -442 -321 586 971 380
666 380 -62 63 328 421 405 89 -105 -298 -147 -30 -460 -532 -168 37 -232 -254 -224 -244 55 367 376 -15 -39
689 -39 472 700 235 -66 99 263 55 -403 -432 -181 -59 -205 -321 -520 -308 -73 108 -125 -47 377 600
$$ packed form
559a490L87K057K30j810m24Q24J95q41L42R38m41j028N27J686r9j746k29J610
577F88P20j114m56Q67l98r84M73J311q83k211N04L049J30l754j295L696K862k446
595G59l371J279L290L81k519j397J491J460Lj248j037k74J104J207m52k171o43
612b138K143J723j131k338J38K395J503j755j934M31K332Q63k106j573P91J672
628A016J91j562q95O40Q43J09p45n51K8R14J097n49j311RJ583P06j476q24J031
647B54J152j055j132L71R93o10j097N20J112n38r52J97J148L2q37J21R07L85n91
666C80m42J25K65R3j6l16j94j93J51J17m30p2L64K05k69k2L0k0K99L12Rl91k4
689c9N11K28m65l01J65J64k08m58k9K51J22j46j16j99K12K35J81k33P8M24K23
$$ plain form
710 600 232 -64 280 748 637 -309 -259 269 326 -318 -598 -354 12 -266 -523 -375 -25 31 10 -7 73 283
732 283 545 343 89 184 256 252 49 11 -73 -60 -243 -364 -418 -219 -374 -407 39 118 -315 -212 118 508 246 182
756 182 196 330 338 96 -82 108 137 40 -161 -543 -654 -246 -128 -274 -330 -254 23 71 44 400 338 320 233 344
780 344 390 95 94 191 109 -247 -260 -185 -52 -284 -372 -596 -195 -206 -60 -110 -46 253 378 140 11 272 506 416
804 416 49 -179 80 222 -111 -445 -259 -36 -89 -463 -412 -109 -34 84 -110 91 82 349 302 235 125 274 306
827 306 229 -133 -246 -138 4 -255 -358 -295 -396 -225 -257 -26 67 5 105 146 251 162 428 364 231 92 125
850 125 74 -73 -252 -34 -61 -309 -286 -282 -47 -28 -84 -153 -99 -105 222 401 214 -40 146 572 368 -165 -120 246
874 246 294 -194 -410 -293 -173 -249 -343 -271 -119 -205 -49 266 72 -94 223 452 248 60 203 234 88 99 183
$$ packed form
710F00l68k96L44M68j11r46N0N28N7o44k80K44L66k78k57J48L50N6k1j7Q0K10
732B83K62k02k54R5P2mk03l8q4J3j83j21n4J99j55l3M46P9m33J03L30L90k62o4
756A82J4J34Qk42j78J90K9r7k01l82j11M08J18j46n6P6K77M8k7L56o2j8q7J11
780C44M6k95jR7q2l56j3P5J33k32q8k24M01j1J46n0O4K99J25k38j29K61K34r0
804D16l67k28K59J42l33l34J86K23n3l74N1L03P5J18j94K01rK67m7o7j10J49L2
827C06p7l62j13J08J42k59j03O3j01J71l2K31R3o2J00M1J05q9K66o4j33j39L3
850A25n1j47j79K18k7k48K3MK35J9n6o9N4oL27J79j87k54J86M26k04n33M5L66
874B46M8m88k16J17J20p6r4P2J52q6J56L15j94j66L17K29k04j88J43L1j46J1Q4
$$ plain form
897 183 -35 -401 -350 121 34 -620 -503 -4 312 -81 -267 53 221 315 306 351 73 4 419 584 -87 -556 -143
920 -143 470 192 -727 -775 -32 266 -230 -417 -282 183 122 284 120 -249 -51 606 735 150 -356 -4 484
941 484 240 -325 -542 -154 -1 -165 -321 -473 -270 91 310 -206 -327 213 497 242 -44 157 401 34
961 34 -77 314 230 -304 -444 255 380 -573 -831 17 402 -297 -589 143 490 43 -233 494 522 -314 -255 899
983 899 835 -424 -863 321 871 -110 -999 -468 474 122 -576 -464 -7 97 134 163 -20 -163 -48 719 556
1004 556 -92 -270 322 515 162 -388 -463 -23 125 -23 -596 -566 150 524 9 -652 -42 690 442 -166 0
1025 0 631 306 -255 77 511 -98 -524 43 534 -188 -1031 -294 576 -14 -847 -132 691 181 -623 32 845
1046 845 177 -640 21 1060 422 -674 -385 690 290 -708 -549 126 121 -305 -166 4 -265 -208 282 453
$$ packed form
897A83k18l66N1M71q7o54J17M99L16l93j86L20J68R4rM5k78o9M15J65o71m69M13
920a43O13k78r19m8P43K98m96j87J35M65o1J62j64l69J98O57J29n85n06L52M88
941D84k44n65k17L88J53j64j56j52K03L61K19n16j21N40K84k55k86K01K44l67
961C4j11L91q4n34j40O99J25r53k58Q48L85o99k92P32L47m47k76P27K8q36N9J154
983H99o4j259m39J184N50r81q89N31R42l52o98J12M57J04L7K9j83j43J15P67j63
1004E56o48j78N92J93l53n50p5M40J48j48n73L0P16L74n15o61O10P32k48o08J66
1025@O31l25n61L32M34o09m26N67M91p22q43P37Q70n90q33P15Q23n10q04O55Q13
1046H45o68q17O61J039o38j096K89J075m00r98J59O75nm26J39J70k69N7M90J71
$$ plain form
1066 453 -27 -342 295 618 192 -361 -83 302 288 -7 -314 -299 -125 168 -91 -655 -564 239 378 -241 -533
1087 -533 104 568 24 -281 251 398 64 27 322 190 -517 -177 413 119 -666 -532 430 282 -562 -525 465
1108 465 500 -314 -342 343 466 -239 -81 519 496 -311 -222 432 248 -453 -256 229 -163 -441 -298 296 -48
1129 -48 -500 -121 327 10 -276 78 535 186 -174 103 289 -101 -110 202 78 -335 -105 159 -110 -585 -314
1150 -314 229 122 -319 -319 359 256 -62 143 418 161 -157 170 293 -41 -332 72 357 -316 -436 -12 172
1171 172 -276 -575 55 433 -203 -323 330 527 -4 -112 432 398 -164 -170 367 262 -208 -223 190 53 -437
1192 -437 -426 67 146 -398 -168 105 73 -207 31 344 145 -215 185 403 -33 -197 69 394 -125 -355 -127
1213 -127 211 -255 -401 -49 -7 -247 -342 239 260 -137 10 289 298 21 -111 397 200 -217 -54 213 15 -427
$$ packed form
1066D53m80l15O37L23m26n53K78L85j4k95l07J5J74K93k59n64R1Q03J39o19k92
1087e33O37M64n44l05N32J47l34l7K95j32p07L40N90k94p85J34R62j48q44L7R90
1108D65L5q14k8O85J23p05J58O00k3q07Q9O54j84p01J97M85l92k78J43N94l44
1129d8m52L79M48l17k86L54M57l49l60K77J86l90rL12j24m13K30K64k69m75K71
1150c14N43j07m41%O78j03l18K05K75k57l18L27J23l34k91M04K85o73j20M24J84
1171A72m48k99O30L78o36j20O53J97n31j08N44l4n62oN37j05m70j5M13j37m90
1192d37J1M93P9n44K30K73l2k80K38L13j99l60M00K18m36j64K66L25n19k30K28
1213a27L38m66j46L52M2k40r5N81K1l97J47K79Rk77j32N08j97m17J63K67j98m42
$$ plain form
1235 -427 -168 113 -72 -438 -88 256 -20 -307 -33 343 188 -156 109 296 146 -129 108 386 -67 -276
1255 -276 15 90 -210 -379 -17 132 -391 -309 124 160 -223 -81 330 135 -67 8 476 245 -101 -88 253 42
1277 42 -260 -95 72 -154 -383 -132 195 -210 -327 -120 219 -54 -226 170 297 169 -81 226 296 -99 -23
1298 -23 291 88 -140 -349 12 -56 -362 -225 47 63 -269 -106 221 179 5 126 334 252 -29 118 247 88
1320 88 -201 32 169 -204 -245 -27 23 -205 -370 -4 30 -211 -257 27 307 125 69 157 307 139 -23 240
1342 240 107 -132 -264 -123 -106 -261 -132 -83 -3 -297 -129 63 57 37 25 157 154 5 186 253 88 54 -20 83
1366 83 111 -155 -147 -103 -159 -168 -104 -105 -147 -112 11 70 22 -128 161 231 180 -32 207 197 12 12 12 -32 -145 -79 1 -83 -190
1395 -190 -71 9 63 -36 -3 165 185 77 140 206 246 173 131 52 152 -157 67 -76 -96 -146 -129 -124 -86 -161 31 -37
$$ packed form
1235d27K59K81j85l66L50L44k76k87K74L76j55l44K65J87j50k75K37K78m53k09
1255b76K91P5l00j69L62J49n23Q2M33L6l83J42M11j95k02P5M68k31l46J3L41k11
1277D2l02J65J67k26k29K51L27m05j17K07L39k73j72L96J27j28k50L07P0l95P6
1298b3L14k03k28k09L61o8l06J37K72J6l32J63L27m2j74J21K08q2k81J47J29j59
1320H8k89K33J37l73m1K18N0k28j65L66L4k41m6K84K80j82n6Q8J50j68j62K63
1342B40j33k39j32J41J7j55J29M9Q0k94J68J92ok0j2J32lj49J81O7j65l4p4J03
1366H3K8k66QM4n6rO4jm2L5J23N9m8j50K89P0n1k12K39j0j85%%m4j13O6Q0q4j07
1395a90J19Q0N4r9L3J68K0j08O3O6M0p3m2p9J00l09K24j43k0n0J7NL8p5J92o8
$$ plain form
1421 -37 -20 244 38 114 64 161 143 172 -6 176 209 8 -144 -91 -53 -157 -90 -126 -69 -225 -152 60 164 77 97
1446 97 36 158 96 132 63 132 146 49 -127 -76 26 -68 -120 -8 -74 -130 -159 -38 31 -103 -51 89 241 69 -41
1471 -41 156 235 168 -79 52 83 112 -96 -1 144 -79 -205 -122 -3 -70 -102 -54 15 119 33 -31 82 203 161 12
1496 12 93 49 146 -100 -86 -12 -53 -156 -194 -153 -117 -194 -204 -29 67 10 -84 71 223 169 -90 49 241 177 -68 -22
1522 -22 81 50 -162 -121 109 -121 -179 -183 21 -70 -158 -135 142 315 50 -86 294 338 140 54 120 137 96 -164 -70
1547 -70 -101 -108 -155 12 -37 -106 -48 -56 44 76 62 89 103 183 -1 -90 98 307 6 -4 38 42 -34 -275 -120 -21 -83 -96
1575 -96 -235 73 150 -78 -32 42 240 129 80 130 233 52 61 119 77 -134 -66 -152 41 -152 -183 28 51 -26 -25 111
1601 111 81 62 -6 72 106 109 51 139 120 147 -61 -71 -39 -21 -39 -88 4 -55 -139 -87 -108 -9 -29 43 162 219 84 150 190
$$ packed form
1421c7J7K64k06P6n0R7j8K9j78J82L3k01j52N3L8j04O7l6N7j56P3K12J04q7K0
1446I7o1J22o2L6o9O9J4r7j76N1J02r4n2J12o6n6k9J21O9j34N2J40J52j72j10
1471d1J97P9o7k47J31L1K9k08R5J45k23j26Q3J19o7l2M8O9J04q6o4J13J21m2j49
1496A2Q1m4R7k46J4P4m1j03l8M1L6p7j0J75R6n7r4J55J52n4k59J39J92o4k45M6
1522b2J03l1k12M1K30k30n8mK04r1q8K3K77J73k65j36L80M4j98q6O6J7m1k60R4
1547g0l1pm7J67m9o9N8qJ00L2j4K7J4Q0j84q9J88K09l01j0M2Mp6k41J55R9o2j3
1575i6j39L08P7k28M6P4J98j11m9N0J03j81RN8m2k11O8q6J93j93l1K11K3p7JJ36
1601A11l0j9o8P8L4Ln8Q8j9K7k08j0L2J8j8m9R2n9q4N2k1R9k0P2J19N7j35O6M0
$$ plain form
1630 190 -15 69 18 -6 -68 -95 12 -153 -148 -115 -42 -164 -156 -38 37 20 -22 96 127 112 103 199 186 -35 -77 18 -59 -164
1658 -164 -75 89 63 -181 -242 4 26 -235 -37 51 77 51 35 185 138 59 49 70 23 52 -96 57 9 -115 -220
1683 -220 -94 -14 -53 6 97 -83 -40 85 71 121 84 36 210 64 -33 39 69 -38 36 115 -124 -166 -53 -61 -45 -195
1709 -195 -39 49 -13 -45 87 133 12 113 84 129 92 65 188 -10 -46 60 -80 33 -66 -125 -39 3 -72 -178 5
1734 5 -27 -48 -41 76 133 0 22 41 124 2 18 111 1 -21 -162 -182 -97 -117 -85 -80 -95 -38 93 109 -42 16 161 191
1762 191 125 75 18 12 -69 -8 12 -28 -152 -135 -10 -140 -63 -130 -82 -37 -88 71 -11 124 87 28 133 155 26 75 118
1789 118 -43 -42 3 59 -113 -223 -81 -1 9 -15 -80 11 -64 108 -40 73 83 111 -45 38 -24 -66 88 -11 31 -86
1815 -86 -27 -2 -109 -174 -80 -50 10 37 -21 -15 -3 -7 184 135 -2 11 86 135 28 -78 -57 87 -44 -21 26 -91 -47
$$ packed form
1630A90k05Q4n1k4o2k7J07j65NL3P3j22QJ18P5j7m2J18L1j5rR6j3k21m2R5p7j05
1658a64Q9J64k6k44o1K46K2k61J98Q8K6k6j6J50m7p9j0K1m7K9j48J53m8j24j05
1683b20J26Q0l9N9R1j80M3J25j4N0l7m8J74j46r7P2L0j07P4P9k39m2J13qJ6j50
1709a95J56Q8o2l2J32M6j21J01k9M5l7k7J23j98l6J06j40J13r9n9Q6M2p5j06J83
1734El2k1PJ17N7j33K2J9Q3j22J6R3j10k2j41k0Q5k0L2Nj5N7J31J6j51N8J45L0
1762A91o6n0n7oq1O1K0m0j24J7J25j30P7o7M8M5n1J59q2J35l7n9J05K2j29M9M3
1789A18j61JM5N6j72j10J42Q0J0k4o5R1p5J72j48J13J0K8j56Q3o2m2J54r9M2j17
1815h6N9K5j07o5R4L0O0K7n8OJ2mJ91m9j37J3P5M9j07j06K1J44j31K3M7j17M4
$$ plain form
1842 -47 -236 -55 46 2 -34 63 96 158 62 51 103 180 124 157 -74 45 1 -109 -112 -64 -50 -104 -69 -107 -27 106 -87
1869 -87 113 87 36 -25 132 169 61 20 52 -70 -2 -45 139 41 -66 -216 -109 85 75 -103 -131 11 -19 -11 -27
1894 -27 71 90 -4 104 96 42 43 -34 -3 122 -31 -47 -25 39 -45 -133 27 -126 -89 -15 69 -77 39 -22 17 21 60 37
1922 37 -35 12 107 -117 -180 -80 -88 -133 -225 -150 -15 -88 -139 82 93 -3 -10 -60 59 113 12 98 73 103 -67 -60 6 13 -81
1951 -81 -187 -116 -72 -69 -72 27 -26 -1 3 43 137 46 30 -26 167 39 -106 -6 -71 -23 -43 -131 -18 -80 -182 -49 -130 -88
1979 -88 -31 -11 -21 130 159 -35 110 188 176 175 102 168 37 -94 -12 -78 -48 -83 -190 -92 -34 61 -53 -97 27 -5 15
2006 15 46 100 132 134 -131 116 83 -29 -61 53 -123 -30 -34 -128 43 -56 -181 -138 -18 -71 -44 -20 93 76 61 -31 114
2033 114 78 65 -57 -29 -77 -93 114 -77 -37 -43 -41 -42 44 -84 35 91 184 -6 12 35 74 48 91 -34 32 -31 -65 -10
$$ packed form
1842d7j89J81J01m4l6R7L3O2r6j1N2P7n6L3k31J19m4j10lM8J4n4L5l8Q0J33j93
1869h7K00k6n1o1J57L7j08m1L2j22O8m3J84r8j07j50J07J94j0j78k8J42l0Qj6
1894b7R8J9r4J08qn4Jp7L1J25j53j6K2O4q4q8J60j53L7P4Q4j46J16o1L9ML9k3
1922C7p2M7R5k24o3J00qm5r2P5J35p3n1K21J1r6pn0J19N4j01Q6k5L0j70PO6Pr4
1951h1j06P1M4LlR9n3K5MM0R4r1j6n6J93j28j45J00o5M8k0q8J13o2j02J33q1M2
1979h8N7K0j0J51K9j94J45P8j2jp3O6j31j31Q2o6L0l5j07R8N8R5j14m4J24l2K0
2006A5L1N4L2Kk65K47l3j12l2J14j76R3mr4J71r9j25M3J20n3K7K4J13j7j5r2J45
2033A14l6j3j22K8m8j6K07j91M0oKjQ6j28J19N6R3j90J8K3L9k6M3j25O6o3l4N5
$$ plain form
2061 -10 -201 -136 -75 -31 -94 -28 89 -64 29 -24 -49 61 64 79 99 14 -41 44 40 27 -101 18 -26 -191 -78 57 -134
2088 -134 -25 -146 -26 -5 -45 -60 89 141 13 74 63 51 -15 -119 -20 23 -43 33 -98 -83 -51 1 -14 -146 -192 15
2114 15 24 33 37 50 104 77 62 121 131 65 70 69 39 41 -109 -56 -110 -166 -126 -57 -70 -117 -132 -65 -80 88 32 221 44 44 28 119
2146 119 -3 -136 10 12 -93 -148 -145 -75 0 -57 -16 9 -45 -2 43 88 38 -17 68 145 66 101 74 36 -105 -7 117 16
2174 16 -159 -36 90 -98 -158 -77 40 -58 26 156 -1 -6 99 77 42 47 85 64 23 -41 -97 -7 153 -286 -99 47
2200 47 -13 -103 -212 -25 139 -24 54 99 102 -49 -72 235 146 -100 -17 -74 54 -90 -52 -124 -54 -22 -61 22 -88 -147
2226 -147 -56 65 4 -28 91 134 -43 90 105 62 18 -72 -30 -183 19 -144 8 -70 -148 -38 66 18 -11 71 189
2251 189 -159 -63 77 169 -24 -32 31 78 39 -82 -89 -7 -7 -170 -66 86 -22 -124 68 32 -11 -51 22 31 74 75 92
$$ packed form
2061a0j91O5O1M4o3O6J17j53R3n3k5J10LJ5K0q5n5Q5mj3j28J19m4j65J13J35j91
2088a34J09j21J20K1m0j5J49N2j28O1j1j2o6j04R9M3o6P6j31J5L2N2j5j32m6K07
2114A5RRMJ3N4k7j5N9J0o6Njl0Kj50N3n4n6M0O9j3m7j5O7j5J68n6J89j77%j6R1
2146A19j22j33J46Kj05n5LP0P5n7M1K5n4M3M5M5n0n5Q5P7p9L5k7l8j41R8J24j01
2174A6j75J23J26j88o0Q1J17r8Q4J30j57nJ05k2l5NL8k1m1o4n6R0J60m39J87J46
2200D7o0r0j09J87J64j63P8M5Lj51k3L07q9k46Q3n7J28j44L8p2P0L2l9Q3j10n9
2226a47R1J21o1l2J19M3j77J33J5m3m4r0M2j53K02j63J52p8p8J10J04m8k9Q2J18
2251A89l48R6J40R2j93qO3M7l9j21pQ2%j63J04J52j08j02J92l6m3m0P3RM3JJ7
$$ plain form
2278 92 -11 90 -17 107 -5 -45 -67 66 -2 -48 59 -111 -59 62 -41 104 87 85 126 99 32 -38 35 78 -4
2303 -4 22 90 88 -39 -105 -230 20 -80 -73 -51 101 -63 -29 90 139 -32 -98 184 110 -16 138 59 18 43 24 35
2329 35 60 -27 -48 13 26 -122 -56 74 -48 -83 28 132 19 72 113 125 -8 125 83 48 -73 -60 -1 -49 -86 -45
2355 -45 -174 42 -157 -49 48 -57 40 47 115 83 -23 24 204 52 -23 22 156 57 -40 -48 116 -51 -183 -4 -108
2380 -108 -125 46 -87 16 -36 62 48 15 63 -50 -14 90 89 27 -40 -78 12 49 -43 -129 -34 1 41 26 -49 101 59
2407 59 -6 -61 -29 100 79 22 46 -12 2 -43 45 51 -118 -74 69 -58 -149 -53 -73 -17 -37 -9 69 99 -21 -3 9 128
2435 128 100 75 76 -64 -6 8 -90 -61 -18 -161 -15 52 12 -4 -38 -50 117 -7 28 -51 -12 82 -97 31 79 -13 31
2462 31 -38 -9 20 -4 -58 -28 -40 -29 -36 -12 99 11 -40 63 21 -20 24 80 135 -70 -116 -20 44 -147 -75 -67 73 -80
$$ packed form
2278I2j03J01j07J24j12m0k2J33o8m6J07j70N2J21j03J45j7kM1k7o7p0P3M3q2
2303dK6O8kj27o6j25K50j00PK2J52j64L4J19M9j71o6K82p4j26J54p9m1K5j9J1
2329C5K5q7k1O1J3j48O6J30j22l5J11J04j13N3M1J2j33J33m2l5j21J3N9m8l7M1
2355d5j29K16j99J08R7j05R7PO8l2j06M7J80j52p5M5J34r9r7qJ64j67j32J79j04
2380a08j7J71j33J03n2R8j4l3M8j13L6J04jo2o7l8R0L7r2q6R5L5M0j5p5J50m2
2407E9o5n5L2J29k1n7K4n8J4m5Q8Oj69M4J43j27r1R6k0N6k0K8P8L0j20J8J2J19
2435A28k8k5Jj40N8J4r8K9M3j43J46O7m0j6l4j2J67j24L5p9L9R4j79J28M8r2M4
2462C1o9K9K9k4n4L0j2J1pK4J11q8n1J03m2m1M4N6N5k05m6R6O4j91P2QJ40j53
$$ plain form
2490 -80 -14 -30 63 20 -74 -90 -53 74 88 88 -2 18 20 124 33 -24 119 43 5 -97 -138 -18 -178 -132 4 -28 61 24
2518 24 104 21 31 95 -11 106 28 43 -13 -34 -94 53 -30 -106 -88 -80 -69 -92 -87 -38 4 -63 132 10 167 -38 153
2545 153 10 22 114 34 109 -65 -124 -84 80 -65 -80 -64 -90 -96 -17 69 74 90 13 31 -3 17 51 20 -24 -11 -113 90
2573 90 1 -107 -23 -43 -13 -72 8 -51 -2 -9 -76 40 46 37 -54 83 -148 -91 98 100 2 60 42 -71 -196 -43 35 -109
2601 -109 -77 -7 -47 -43 -39 37 114 -83 108 130 62 105 14 110 79 -18 26 -15 -107 -193 -62 50 102 19 -88 14 52 -59
2629 -59 30 2 156 53 47 135 56 -101 -10 -86 37 -6 -9 -107 -42 -11 -4 -4 -2 -8 -20 -36 -32 -3 -52 25 8 29 -9 -26 -10 113
2661 113 -12 -31 26 -32 32 -164 -58 -24 3 -30 42 50 145 38 36 -99 12 -50 -66 135 86 70 7 22 0 -117 -7
2688 -7 24 -105 -105 -138 0 48 -29 -156 48 -13 -11 58 -22 2 115 -16 78 17 -46 148 89 -19 -20 -27 97 30 14 -61
$$ packed form
2490h0O6j6R3m3r4j6L7J27J4%r0K0KJ04r1n7J43p6l8j02m1J20j60M6J36l2Q9l7
2518B4Q0q3J0O4j06J17p8J5n6k1o0J47q3p6J8QJ1k3NM9M2o7J95j22J57k05J91
2545A53j43J2R2q0P5j74n9M0J64j45j5J6k6oP9Q6NJ6p7J8l4K0L4l1m4J3j02K03
2573I0q9j08Q4k0L0n9Q0n9M9po7J16Orr1J37k31N7J89Kr8N8j8j13j25J53P8j44
2601a09L2P0m0MMP6P7j97J91K2o8M3r1R6l1r7M4m1r2q6J31J12N2q3j07J02L8j11
2629e9Q9k8J54j03oQ8p9j57R1p6J23m3lr8O5L1P%Koj2j6MK9m9P7j7K1l8j7J6J23
2661A13j25j9N7n8O4j96J06L4K7l3P2QR5j07kj35J11o2j6K01m9j6o3J5k2j17J10
2688gL1j29%l3J38M8p7j27K04o1KO9q0K4J13j31R4o1o3J94n9j08jpJ24o7j6p5
$$ plain form
2716 -61 -31 -143 -75 0 -14 -88 -59 49 -15 -66 -106 -14 140 -65 -71 12 -28 -56 -97 -37 29 -83 32 61 53 -122 -21
2743 -21 60 115 11 -15 -8 -6 -7 -46 -19 36 -60 -66 30 -35 -99 27 -26 -39 66 -5 100 96 -25 -10 48 110 38 -4 7 6 -19
2774 -19 142 -41 -180 -71 40 41 -2 -74 -18 -75 -10 -35 -82 -46 -1 54 26 120 56 36 106 71 1 19 -104 -44 -15 -89
2802 -89 -47 32 -140 -50 -4 38 10 122 -53 50 97 88 22 -35 77 -37 -114 -65 -15 92 32 -206 -49 -49 -83 140
2828 140 -18 -106 -41 79 -11 33 -36 107 90 148 -41 -14 25 80 -88 -49 16 49 -68 -99 33 23 66 -2 34 31 1
2855 1 3 0 104 52 -84 -108 110 -50 57 -19 -7 51 13 41 17 -103 -10 -2 115 0 109 89 34 38 -71 58 5
2882 5 -93 17 -11 56 -32 -37 -34 -25 -23 3 -78 92 -63 -21 16 -62 35 40 54 -34 10 -50 72 -78 -117 47 33 -49 -112 -118 -23
2913 -23 -4 -148 13 -41 -96 -61 34 19 -54 42 60 86 9 -59 -3 67 -64 33 -14 -10 -29 -11 -36 -37 -64 49 -71 -4 46
$$ packed form
2716f1L0j12O8P5j4p4K9J08o4n1m0R2J54k05oQ3m0k8m1O0O6j12J15K9qj75J01
2743b1Q1N5j04k6PKjl9K7N5r6oR6o5o4J26n3j3J05p1J05mj21J5N8O2p2m2J1jk5
2774a9J61j83j39J09J11Jm3p2N6n7O5k5m7L6M5N5k8R4o4k0P0l5p0J8j23O0K9p4
2802h9M2P9j72R0M6M2k8J12j75J03M7ro6n7J12j14p7M9N0J07o0k38J57%l4K23
2828A40j58q8O5J20r0M4o9J43j7N8j89K7L9N5j68L9O5L3j17l1J32j0M3o8L6ll0
2855AKlJ04n2j36k4K18j60J07p6J2N8l8K8k4j20R3QJ17j15J09k0n5Mj09J29n3
2882Er8J10k8O7q8nLRKK6q1J70j55M2L7p8R7NJ4q8M4o0J22j50l9J64j4q2o3oR5
2913b3J9j44J61n4n5L5R5j5p3R6J8K6p7o8N6P0j31R7m7Mj9J8k5jk7J13j20O7N0
$$ plain form
2942 46 78 130 0 25 -40 -92 40 79 71 15 -40 -36 -19 -71 -40 31 -26 9 -18 25 -14 -16 -34 47 47 -35 -106 74 -38 -69
2972 -69 -62 -74 76 -24 74 -18 -70 36 -23 -101 11 -184 -47 14 -111 -46 -134 70 115 122 64 -8 -51 -24 98 41 -8
2999 -8 32 -40 121 30 -7 105 37 -32 154 49 71 -23 50 -155 -27 50 -70 -82 -43 24 -26 27 60 24 -34 -24 -6
3026 -6 -150 31 73 45 56 50 -1 -114 63 76 191 -51 -30 61 46 -34 50 182 23 3 -70 47 -33 6 22 -147
3052 -147 -10 73 108 90 71 -12 -50 91 13 13 115 14 2 -137 78 -7 28 -16 -106 -32 -5 -26 -48 -99 -132 -55 61
3079 61 103 16 50 -44 -16 -2 28 31 30 29 0 3 -4 53 -8 36 -79 -62 17 90 -19 -89 20 94 -13 9 27 -18 -20 68 34
3110 34 30 -60 -18 -11 -6 -40 -35 3 -137 -19 49 69 24 13 7 -38 -100 62 39 136 -65 92 -109 -115 -51 -105 57 -55 -56 -9
3140 -9 -18 -57 19 34 -29 25 -40 38 -31 -101 -14 35 -154 -29 11 -76 -8 -12 -21 -38 -76 2 0 -18 -77 -41 -63 -44 -56 -72 26 44
$$ packed form
2942D6L2N2j30K5o5n2J32L9qn6n5MJ7n2L1P1n7L5k7M3l9kj8Q1%q2p1J80j12l1
2972f9Pj2J50j00R8r2n2J06n9p8J12j95J37O1j25O5q8K04M5Pn8p2m3K7J22n7m9
2999hM0p2J61r1l7J12o8o9J86j05K2r4P3k05J28P7j20j2L9O7n0N3L3l6n8J0J8
3026fj44J81M2k8J1on1j13J77J3J15k42K1R1j5q0Q4J32j59k0p3J17q0L9J6j69
3052a47J37Q3L5j8j9q3l8J41p8%J02j01j2j39K15q5L5m4r0P4K7k1k2n1l3P7J16
3079F1M2q7L4r4K8J4L0Ljjk9LpN7o1M4j15J7P9P3j09p0J09P4j07K2J8m5kQ8l4
3110C4mr0M2PNl4NL8j40J18O8K0m5j1om5o2J62k3R7k01J57k01oO4n4J62j12jM7
3140irl9P6J5o3N4o5P8o9p0Q7M9j89J25M0q7O8mrj7l8P8kj8n9L6k2J9j2j6R8J8
$$ plain form
3172 44 -21 39 58 60 199 -84 120 -27 69 -26 -102 66 -79 -29 67 -44 26 76 -113 15 -46 -8 -7 32 22 103 2
3199 2 45 -33 101 113 -82 -84 -76 16 -112 -50 29 82 13 -1 68 121 42 2 76 -5 -6 42 -19 -92 10 -89 9 13 35 8 51
3230 51 69 -138 89 -79 59 -61 -104 55 -43 -3 -23 -81 8 -120 27 80 -119 -41 -39 26 -15 20 -18 -45 45 51 81
3257 81 28 105 -100 89 87 81 36 58 93 -36 -25 75 -92 -6 0 25 -42 39 15 63 -58 -79 -21 12 18 -41 165 52
3285 52 55 5 23 -2 -37 -4 44 -88 -85 68 62 -54 54 0 -41 131 -32 -12 126 -21 83 7 35 14 15 86 11 14
3313 14 5 -102 35 64 -52 -29 -186 54 -202 -102 50 18 -36 50 2 -18 -36 -128 44 24 -33 11 81 -37 8 -24
3339 -24 -50 88 9 105 3 46 -95 -26 3 67 72 59 75 39 9 44 103 28 -37 -72 73 11 -29 58 -36 -18 -112 36
3367 36 -47 66 -60 49 32 -83 -74 -125 12 -8 79 30 -121 -14 39 -40 -32 96 -19 -68 111 -65 26 -13 74 -56
$$ packed form
3172D4o5O0J9KJ39k83K04j47R6r5p6J68j45N0R6j11P0N0j89J28o1L8JL9j0Q1j01
3199BM3p8J34J2j95kQR2j28O2P9N3o9j4O9N3p9m0P4q1jM8o1p3J02r9R8MK2k7M3
3230E1J8k07K27j68J38j20m3J59r8M0k0n8Q9j28J47N3j99P8KO5m1L5l8k7R0OL0
3257H1n3P7k05J89kom5K2L5j29J1J00j67Q6OK5o7Q1k4M8j21k1N8L3On9K06j13
3285E2Ln0J8k5l5L3M8j32LJ53oj16J08n4m1J72j63K0J38j47J04p6K8k1JP1p5L
3313A4rj07J37K9j16K3j57K40k56J00J52l2n4Q6m8k0j8r2J72k0n7M4P0j18M5l2
3339b4k6J38p9R6j02M3j41O9K9O4Nj3J6l6l0L5N9p5o5l5J45o2m0Q7r4J8r4J48
3367C6q3J13j26J09j7j15Rn1J37k0Q7m9j51J07N3p9QJ28j15m9J79j76R1l9Q7j30
$$ plain form
3393 -56 33 171 -84 79 35 -38 32 13 -26 15 -60 -29 3 -14 25 77 -23 -7 -126 -129 -5 50 88 -48 -5 30 -12
3420 -12 -21 29 25 76 -15 -26 1 55 47 78 47 -32 -67 0 -92 34 141 -53 131 55 -9 11 33 -54 -78 -61 -60 -44 85 19
3450 19 34 88 -44 20 -135 -36 204 -7 -71 18 -6 -61 60 10 62 44 143 -18 -6 124 -32 93 -8 -83 94
3475 94 59 -60 51 29 -11 13 83 95 13 111 45 -31 -74 37 -6 39 -123 -79 15 -80 -22 -14 -91 -12 56 79 -90 -32
3503 -32 -84 -49 117 -14 20 24 43 -43 -150 84 -30 -45 -72 40 22 12 83 -60 57 60 -23 29 -17 -31 4 47 77
3530 77 3 -6 10 -87 -13 -12 -69 -75 9 20 42 57 -3 45 -63 -5 -16 -72 64 -19 13 -104 29 -21 68 92 69 -16 45 -11
3560 -11 24 5 17 133 -83 8 59 14 2 -47 17 142 4 -87 4 -33 -30 -6 83 14 6 -8 57 -44 17 -46 -6 -105 -45
3589 -45 -39 13 54 -47 52 -8 -20 -45 38 19 -73 33 98 34 0 -1 -21 -52 -56 83 6 -37 43 -54 -19 67 44 -70 -12 99
$$ packed form
3393e6Q9J38k55J63m4p3P0j9l9M1p5L1L2j7L9N2j00J6j19lJ24N5L8j36M3L5m2
3420a2rN0mN1r1j1K7N4qL1l1p9l5O7r2J26J07j94J84p6o4K0K2q7k4J7JJ6J29o6
3450A9J5N4j32O4j55R9K40k11o4Q9k4n5J21n0N2j8R9j61J2J30j56J25j01p5J77
3475I4l5j19J11k2m0K4P0J2q2R8o6p6m3J11m3M5j62M4R4r5N8Qp7P9O8K3j69N8
3503c2n2L5J66j31L4MJ9q6j07K34j14j5k7J12j8j0P1j43J17Lq3N2m6j4L5M3L0
3530G7p4rJ6r7P4Jn7oQ4J1K2J5o0M8j08N8j1n6J36q3L2j17J33n0Q9K4k3q5O1n6
3560a1L5j9J2J16k16R1N1m5j2m9O4J25j38r1R1l7LK4Q9o9qj4O5j01O1o3M0r9O0
3589d5ON2M1j01R9o0j2k5Q3j9r2J06O5o4l4jk0l1mJ39p7m3Q0r7L5Q6k3j14N8J11
$$ plain form
3619 99 48 -30 47 -49 -106 -4 -45 -57 -129 44 99 -76 -99 -19 28 64 37 33 35 -1 38 110 -153 -89 85 -43 -65 54
3647 54 -44 0 -52 61 26 -80 99 17 7 -51 21 75 -74 -31 -36 69 115 -11 26 -63 28 58 -36 14 -30 -43 124
3674 124 24 -131 21 25 8 199 47 23 107 25 25 5 127 -33 102 -52 -12 35 2 -12 -131 -50 -17 -110 -12 42
3700 42 74 -26 -46 -37 -9 123 51 56 52 4 77 27 -7 -69 -72 66 77 -67 -30 32 -107 125 -14 15 -54 -3 1 7 69 27
3730 27 69 99 -113 182 -25 -69 -38 -30 -50 -94 -28 -5 28 -47 -58 0 1 18 -44 89 142 -40 87 12 82 34 73 -78
3758 -78 -94 -11 10 53 -9 22 39 -3 -66 50 75 67 -72 -32 -8 79 88 63 16 9 -41 26 -119 28 -39 -26 -38 1 41 -10
3788 -10 -34 -15 -35 34 75 -7 18 -22 -146 63 -147 122 71 18 49 49 78 -35 -63 -18 -76 -19 23 -33 46 107 -13 7
3816 7 -46 19 -45 -130 10 -46 57 -41 71 29 -149 35 -15 5 20 -14 121 -7 33 -11 -58 -89 66 2 -52 -15 -11
$$ packed form
3619I9n1p8P7r6n7J02m1j2p2J73N5j75k3Q0M7L6k7mKl6L9P2k63O4J74j28k2J19
3647E4r8M4n2J13l5j06J79q2j0n8P2N4j49M3nJ05M6j26L7q9R1L0r4N0m4j3J67
3674A24j00j55J52Mj7J91j52k4Q4q2%k0J22j60J35j54M0M7l3j4j19Q1L3r3R8N4
3700D2L2j00k0RK8J32p2Nmm8P3n0l4o2lJ38J1j44L7O2j39K32j39K9o9N1MOO2m2
3730B7M2L0k12K95k07m4L1Qk0m4O6K3L3p5j1N8JJ7o2J33N3j82J27p5P0m8L9j51
3758g8j6Q3K1M3o2L1J7m2o3J16K5qj39M0K4Q7Rk5m7pn0O7j45J47o7J3j2L9M0n1
3788a0k4J9k0O9M1q2K5m0j24K09k10K69n1n3L1%K9j13k8M5n8N7M2n6P9O1j20K0
3816Gn3O5o4q5J40n6J03r8J12m2j78J84n0K0J5l4J35j28M0m4m7l1J55o4n4L7M
$$ plain form
3843 -11 -57 -65 48 -90 62 16 15 27 -16 57 -31 -144 -63 -23 94 29 -93 38 -60 -86 46 22 -64 -3 -16 46 -92
3870 -92 -23 11 -146 -36 -50 -16 26 -76 88 15 -57 10 47 -183 -101 32 -50 28 -31 -53 -51 59 -28 89 -1 -41 15
3897 15 -39 112 -8 -104 -4 79 -121 13 -12 -14 -22 30 -35 -29 -132 42 -90 32 -100 -61 -53 -91 37 -18 -50 -94 -16
3924 -16 41 119 48 -86 14 -76 -36 6 -37 -48 -43 -26 142 3 -127 -131 -22 -39 17 8 -81 -80 -35 9 -16 7 57 89 -103
3953 -103 37 17 21 65 -93 10 67 -65 49 -1 23 80 19 56 16 -28 -20 -26 11 -5 -38 -30 -11 -172 85 16 12 8 1 63
3983 63 -29 58 88 69 -87 55 38 -42 90 77 23 18 -31 -93 16 -113 -54 -53 -104 37 119 -60 -23 -25 -9 -28 -19 -28 -89
4012 -89 -82 9 -39 -3 -111 64 -43 -97 -8 51 -53 -27 81 -85 10 93 -17 -10 -40 -108 -33 54 14 -29 28 -32 92
4039 92 -18 75 -106 -43 79 -44 -48 -76 -70 -52 0 -59 48 23 36 33 19 41 -60 22 119 -29 5 73 11 -1 -32 49
$$ packed form
3843a1m6qJ13j38J52m6jJ2m3P3q8j13Q1M0J17o5j22J31r8k6J32k4q6O1j3O2j38
3870i2O9L4j57J10j4L4M2j02J64p3p2O7L7k30Q2J33q2P8n9k2KJ10q7J17r0m0N6
3897A5n4J51j20r6J00Q3k00J34k5kqN2o5Oj03J74j32J22j32L9Ql8J28n5l2m4P8
3924a6N7P8p1j34J00r0M0M2m3j1NJ7J68j39j30mJ09j7N6rq9JM5M4k5K3N0L2j92
3953a03J40k0MM4j58J03N7j32J14n0K4N7o1L7m0m4QoL7j6l3QJ9j61K57o9mmpO2
3983F3r2Q7L0j9j56J42j7q0J32j3n4nm9o2J09j29N9Jn1J41Q2j79L7kJ6j9Rro1
4012h9PR1m8L6j08J75j07n4Q9N9j04K6J08j66R5Q3j10Pl0o8P5Q7m0m3N7o0J24
4039I2j10R3j81O3J22j23mk8OJ8N2n9J07k5J3lj4K2j01Q2R7j48L4O8o2j2l1Q1
$$ plain form
4067 49 33 46 65 -6 -14 -36 -48 12 69 -45 -31 -46 8 -55 -5 -44 25 25 -42 -51 15 -30 -32 36 -27 -22 -47 -24 -33 39 -3 22 110
4100 110 -28 -21 124 103 32 124 12 -41 8 -40 40 64 84 -95 -7 -64 23 1 94 -29 -15 86 -69 -8 1 74 79 -46
4128 -46 -58 -15 51 101 10 -5 71 -26 -41 15 -68 15 -24 7 -22 43 42 95 -54 67 34 147 22 -107 -134 20 -33 -22
4156 -22 -7 66 45 -54 79 94 41 -122 50 6 35 24 2 -10 -30 -20 -43 48 2 46 69 -50 5 -36 49 51 -98 -8
4184 -8 -32 -105 -5 37 26 -14 -41 -69 73 53 -41 -7 26 43 -96 26 -71 55 -25 -8 48 68 102 9 6 152 -22 126
4212 126 -135 -19 14 57 -18 5 9 -10 -33 -97 41 14 -68 43 22 70 -11 -40 89 46 189 44 90 79 -57 120
4238 120 79 -73 -35 45 29 -53 1 -103 123 34 108 68 -7 -54 -48 -30 6 79 22 21 -38 -41 77 72 25 -54 -21 80 -23
4267 -23 67 44 18 -13 130 34 41 -70 37 75 40 -90 -94 58 -5 -8 45 -43 -108 70 82 -15 13 -57 16 32 -66 30 2
$$ packed form
4067D9j6J3J9p1qk2j2O0N7j14J4j5N4o3N0l9O9%o7rO6m5kO8o3Nk5K3rP2m2K5Q8
4100A10j38PJ45k1p1R2j12n3M9m8Q0K4K0j79Q8n7Q7k2R3j23J4J01j55O1RP3Nj25
4128d6j2M3O6N0r1j5P6r7j5N6q3Q3l9L1k9O5jN3j49J21l3J13j25j29k7J54n3J1
4156b2J5P3k1r9J33J5n3j63J72m4K9j1k2j2k0J0k3R1m6M4K3j19N5m1Q5Kj49R0
4184hk4p3J00M2j1m0k7k8J42k0r4L4L3J7j39J22r7J26q0J7N6K0L4r3lJ46j74J48
4212A26k61J16L3M3p5K3Mj9k3o4J38k7q2J11k1M8q1k9J29m3J43j45M6j1j36J77
4238A20m1j52L8Q0j6q2N4j04K26q9P4m0p5m7OJ8L6P3n7jn9lJ18nm7p9L3J01j03
4267b3R0k3k6l1J43r6Pj11J07L8l5j30mJ52o3lN3q8o5J78J2r7K8p0P3J6r8R6k8
$$ plain form
4296 2 195 68 -77 69 -45 86 11 -32 -27 -47 11 -80 -88 -51 125 -4 -41 -49 -56 -127 35 -61 -43 61 -41 -34 64 -15
4324 -15 99 28 74 42 -23 -13 104 131 113 35 -56 -111 41 -87 12 99 65 -19 25 -149 13 -125 -127 -9 -41 -6 81
4351 81 -1 42 14 -116 12 -70 66 17 106 17 8 0 -41 82 -75 36 8 69 39 -60 68 60 -128 48 -62 -2 53
4378 53 23 24 -12 111 50 -42 -3 -57 85 -42 -55 17 -56 18 67 -12 -4 11 -87 124 -16 11 7 -80 -78 4 15 80 11 11
4408 11 63 -15 -26 31 74 -10 -57 20 63 22 81 37 -10 -10 106 72 9 11 -37 -43 -12 -61 -79 -25 -11 29 107 43 53 3 68
4439 68 11 83 61 -35 98 122 13 114 -2 -2 1 -1 -47 -96 -74 -17 43 79 -4 7 -131 53 33 -35 -167 -30 -8 -60
4467 -60 15 -4 60 -8 -2 -2 -28 41 75 -28 -68 -13 8 -68 93 38 51 97 -17 -95 -90 117 64 95 18 -30 -24 41 93 10
4497 10 -22 135 186 58 36 -28 61 -43 86 6 39 -86 -54 -23 -9 -56 -34 -43 85 -108 -33 -27 -41 23 -7 -82 35
$$ packed form
4296BJ93j27j45J46j14J31p5m3Nk0N8r1qL7J76j29l7qpp1J62r6J8J04j02PR8p9
4324a5J14p1M6l2o5J0J17K7j8p8r1n5J52j28R9Q7l4q4M4j74J62j38kJ18l2L5Q7
4351H1q2M3k8j30J28q2J36m9Q9q9rqm1J23j57J11k8O1l0r9J28qj88J76j10O0N5
4378E3l0Jl6J23o1r2L9n4J42j27j3P2p3P4M9p9QJ5r8K11j40K7mq7KQ2J1O5o9%
4408A1N2p8j1N7M3q4m7P7M3m1N9m4m7%J16l4o3Km8oL1m9j8N4J4M0P8o4J0n0O5
4439F8n7P2k2r6J33K4j09J01j16%Lkm6m9K2N7O0L6q3J1j38J84k0o8j32J37K2n2
4467f0P5j9O4o8O%k6O9L4j03m0N5K1p6J61n5J3M6j14p8NK07n3L1p7m8OO5N2q3
4497A0l2J57N1j28k2o4Q9j04J29q0L3j25L2L1J4m7K2rJ28j93P5Oj4O4l0p5J17
$$ plain form
4524 35 9 4 23 -43 14 -107 -115 117 16 47 -31 2 33 -106 -32 -4 93 57 -107 48 16 60 33 -100 -44 -17 8 -87
4552 -87 79 -46 3 -99 -52 -124 51 32 18 -148 -32 -62 58 55 23 14 38 -7 13 -41 10 89 -22 36 20 -52 -5
4579 -5 29 -77 -40 -142 -71 46 -81 96 23 38 -41 72 -63 -76 137 -130 -101 33 -31 -31 -21 -34 30 46 -55 -54
4605 -54 -4 -17 -10 -109 -80 19 56 44 35 87 10 60 72 -3 15 15 4 28 -73 -91 -26 -80 35 104 32 -56 -36 72 6 -34
4635 -34 -100 -32 -14 27 42 -45 -50 -4 -42 3 15 -59 117 38 -20 -29 26 -2 35 33 73 7 72 85 59 -24 70 26 47 -99 29
4666 29 109 67 -38 27 -120 26 41 -49 -38 -58 75 -8 54 -39 -63 65 14 17 -98 -4 110 46 -35 -30 21 9 4 0 -37
4695 -37 -71 42 -6 -12 35 94 65 -42 -58 26 156 47 18 -7 -43 122 -44 48 55 14 10 -26 -2 -19 -31 -20 2 31 14
4724 14 -81 -38 44 -20 100 90 -44 -29 48 25 -21 116 4 -25 -104 -45 -84 24 -75 11 -17 54 -95 -47 39 10 22
$$ packed form
4524C5k6nJ9o6N7j21qK32j01L1p8L3L1j39P4K8R7l6j64J55l2M4k7j33N6K7K5r5
4552h7J66j25M9j02M7p2J75j9j4j66J16l0J20ll2rK4m5K0n4N1P9j11N8j6p2M7
4579eL4j06L7j02P1J17j27J77p3J5p9J13j35j3K13k67K9J34o4%J0j3O4J6j01J
4605e4N0j3Pr9K9R9L7j2rN2p7N0J2p5J8%j1K4j01j8O5n4J15O9p2q8K0J08o6m0
4635c4o6O8J8M1J5q7nM6l8M5J2p4J76p9n8rN5k8L7kM0o6O5J3k6q3R4m4K1j46J28
4666B9Q0m2j05O5j47J46J5r0J1k0J33q3O2r3k4J28n1Lj15R4J14o4q1NN1j2nml7
4695c7l4J13m8oM7N9k9j07j6Q4J30j09k9k5l6J65j66R2Pm1ml6K4j7j2J1K2K9j7
4724A4r5M3Q2o4J20j0j34J5P7k3m6J37j12k9p9N9l9J08r9Q6k8P1j49M8Q6k9J2
$$ plain form
4751 22 55 -6 -46 2 34 -21 -25 104 5 4 27 50 36 46 -63 39 -78 -51 19 -66 -8 23 54 7 2 -41 -24 37 -117
4780 -117 57 18 -84 -25 -6 28 -35 -14 40 28 -40 27 21 -124 98 -12 -87 4 -83 -7 19 5 -32 -8 3 -93 -6 128
4808 128 34 59 43 -52 3 -42 62 38 -23 92 6 86 -84 -36 31 -45 -63 -15 63 -2 -41 -42 113 9 48 -137 49
4835 49 58 -101 -56 -73 60 -27 -81 27 66 -50 -32 -27 11 39 -6 -76 -46 -85 54 -2 63 -27 29 -71 22 -44 89 64
4863 64 -9 -32 -38 5 -66 60 108 -41 18 -100 -8 18 22 -16 -70 -28 85 -6 5 -87 -1 -7 24 36 35 0 41 11 22 92
4893 92 -90 51 -4 -57 30 -35 -170 -52 -42 -2 6 89 -29 93 -16 8 114 11 33 89 -11 -28 -34 -35 40 133 25
4920 25 100 -27 -29 -18 -85 58 -55 20 -81 82 -79 20 71 15 -16 4 59 -56 -10 82 61 -27 27 21 7 -120 15
4947 15 -20 37 65 -46 72 50 -4 29 138 72 -97 -5 -45 -17 -4 102 -43 28 -57 16 22 -73 0 105 47 -27 -130
$$ packed form
4751B2L3o1m0M8L2n5mJ29r9jK3K3j4J0j09J02j17K7P0q5N8L1L1m7nm3J7O1j54
4780a17J74l9j02N9J9L4o3K1N4j2o8O7oj45K22j10p5R1q7P6K6j4l7K4J1r6Q7J34
4808A28r4K5j6r5N5m5J04k4o1J15q6Q0j70M8O7p6j8M8P8o5l9jJ55j04L9j85J86
4835D9Rj59M5j7J33q7n4J08L9j16J8NL8K8m5p0L0l9J39n6O5r0N6j00R3o6J33k5
4863F4p3k3oM3p1J26M8j49N9j18R2K6Ml8n4M2J13r1J1r2Q6oL1J2jl5M1l0J1P0
4893I2j82J41n5n3Q7o5j35J18J0M0QQ3j18J22j09K4J06j03K2N6j00j7ojP5R3j08
4920B5P5j27kJ1o7J43j13P5j01J63j61R9N1n6l1K0N5j15M6R2k1q8N4oj4j27J35
4947A5l5N7K8j11J18k2n4L3J09o6j69R2m0K8J3J06j45P1q5P3Or5P3J05n8p4j03
$$ plain form
4974 -130 73 -51 -79 21 -78 -8 -92 31 -5 115 71 51 -13 44 50 87 53 15 4 15 -26 -21 11 33 83 -37 -71 99
5002 99 -50 17 -42 37 63 -16 53 54 38 96 -16 -71 -1 39 -53 -11 38 76 27 19 -15 -26 -83 4 18 73 -6 -4 -64 -42 64
5033 64 41 -42 -57 36 -45 76 -38 -29 -17 66 62 54 96 50 -8 -30 -13 79 97 -169 -8 -38 -16 -20 -43 -38 -47 0 46 47 13 38
5065 38 15 82 34 -21 36 -13 36 50 3 30 -41 85 -30 5 -50 31 -12 109 -40 60 -80 -7 55 -63 110 30
5091 30 8 -43 1 -7 35 -67 33 -149 -38 -86 -20 38 32 77 31 26 -78 -24 16 -39 -100 96 41 2 -62 58 15 86
5119 86 75 81 -86 -10 5 98 -3 -89 -24 61 16 -73 61 -26 5 -76 -107 55 41 -6 -27 55 88 -48 -106 71 -23 -60
5147 -60 -64 0 67 -4 50 73 -104 21 -2 -38 84 -32 33 0 57 33 61 63 -15 -70 -113 -58 91 12 27 -112 -7 -155
5175 -155 52 -90 -4 -39 85 19 31 -38 -97 18 21 57 -45 55 -17 41 -36 -50 6 38 -132 -75 117 165 -51 -30
$$ packed form
4974a30K03j24k8J00r9P0q4J23l6J20m4k0o4N7OL7l4l8j1J1m1NL2K2N0j20l4J70
5002I9j49O7n9P9K6p9O9Jj6N8j12n5P0M0r2M2M9L8m9ql4j1n7Q7J4N5p9Ko0K2J06
5033F4k3q3j5R3q1J21j14RJ2Q3mqM2m6n8k2J7R2J8k66J61l0K2mk3NrM7M6Jl4K5
5065C8k3O7m8n5N7m9M9J4m7K7p1J26j15L5n5Q1m3J21j49J00j40P3O2j18J73q0
5091C0k2n1M4qM2j02J00j82J11m8O6N8oM5m6nj04N4M0n5o1J96n5l9o4J20m3P1
5119H6j1Oj67P6J5R3j01q6O5Q5m5q9J34q7L1q1l1J62j4m7k1Q2L3j36n8J77r4l7
5147f0mO4O7p1N4K3j77J25k3l6J22j16O5l3N7k4K8Kp8n5m3N5J49p9J5j39J05j48
5175a55K07j42Q6l5J24o6J2o9n9J15LL6j02J00p2N8p7j4N6L2j70N7J92M8k16K1
$$ plain form
5201 -30 -83 15 6 -9 57 34 -32 -41 50 46 -20 77 61 103 -37 76 69 -21 150 43 -23 35 68 -76 -4 -39 -109 53 47 -169
5231 -169 -76 -50 43 -64 39 -39 -50 41 1 -25 0 32 9 45 -49 88 -70 -26 -43 37 -132 88 51 -13 -64 -55 -14
5258 -14 40 44 57 82 94 -8 19 27 -81 -4 -36 5 -90 -43 20 -69 66 -76 -11 -4 23 60 -64 -23 11 17 1 21 78 -88
5288 -88 9 29 -31 1 40 -65 69 -113 20 110 29 81 33 -84 -57 64 28 -49 14 32 -141 6 -43 -50 14 -96
5314 -96 -49 -6 -33 63 134 41 -124 -70 37 93 -54 43 -28 -73 -37 -24 7 -26 34 -51 61 52 -34 10 -20 50 -91 -57
5342 -57 -12 27 -32 27 28 -14 38 102 42 -29 126 27 5 68 -74 91 -23 -28 51 11 52 -97 35 13 119 -68 -75 27
5370 27 48 -75 31 13 -31 101 45 -135 80 -53 72 -52 45 151 28 -94 -67 -9 -20 -82 -24 -19 -88 -140 -14
5395 -14 -59 28 53 67 -37 -9 -76 45 115 -99 -55 -50 -46 58 -9 -18 72 80 37 -23 -18 9 -13 109 101 4 24 34 -8 37 2
$$ packed form
5201c0n3R8rj5O6k3o6rR1mo6R7j6M2j40J13pr0J71j07o6N8L3j44P2l5p0J62ok16
5231a69R3K6R3j07J03p8j1R1m0k6K5L2k3L6r4J37j58M4j7Q0j69K20l7o4n1RM1
5258a4N4MJ3K5J2j02K7Qj08P7l2M1r5M7O3q9J35j42O5PK7L7j24M1L4Oj6K0N7j66
5288h8R7K0o0L2L9j05J34j82J33R0q1N2m8j17K7J21l6p7O3J8j73J47m9pO4j10
5314i6M7M3k7R6P1r3j65N4J07N6j47R7p1m5L6J3L1l3O0q5J12rq6M4l0P0j41L4
5342e7M5L9n9N9Jm2N2O4o0p1J55r9k2O3j42J65j14nP9m0M1j49J32k2J06j87pJ02
5370B7K1j23J06j8m4J32n6j80K15j33J25j24R7J06j23j22K7N8j1o2N8No9n2J26
5395a4m5Q7K5J4j04K8o7J21P0k14M4NMJ04o7rR0Qm3o0NK7k2J22qr7K0J0m2M5l5
$$ plain form
5426 2 -50 -19 -3 -38 -16 3 113 7 -6 -16 -141 -128 -57 42 -34 -33 -110 -132 -13 -57 104 -21 110 17 16 38 -34 16
5454 16 11 -82 24 14 -120 -57 65 -37 -53 8 20 91 180 92 33 -2 59 79 33 -46 -68 -2 41 -70 -7 98 -54
5481 -54 -44 -103 -21 188 -69 -95 44 -25 -16 -95 9 -74 10 -42 20 20 -145 -18 23 -32 -20 -117 -81 55 -35 38 -83
5508 -83 13 37 -15 17 106 4 -67 160 74 16 80 68 57 17 -54 -104 -44 14 33 32 -120 -47 -89 43 26 -66 -62 -92 -1
5537 -1 -59 -55 -18 76 89 81 7 -13 83 20 0 66 65 87 -34 125 -1 65 -146 61 -5 -100 -27 -22 13 2 25 -89 1 12
5567 12 16 -99 64 -74 -107 53 32 -10 52 -19 21 100 63 -120 -121 152 41 -7 38 -4 -98 -90 -8 -7 -35 -80 115 51
5595 51 19 27 51 7 -50 11 78 -9 8 -100 11 -30 7 -79 19 -40 18 -55 -53 -23 -111 70 -38 -37 -101 39 50 -41 18
5624 18 16 -70 -37 14 -53 64 -21 -125 -11 99 -59 38 -93 21 -16 -19 -59 106 -58 -45 71 -4 -14 -81 17 23 69
$$ packed form
5426Bn2L1J6l5K2J9J10j06j3j0j25J3P1R9p6Jp7k2J19m4J61j25J31r3jK2p2N0
5454A6nr3J06j0j34O3J22j02j6O1J2P1Q9q8n9l5O1K0m6p9k2O6M3j11O3J05j52
5481e4J0n9Q2K09k57k6J39o9Rp9J04q3Q4n2O2%j65J27M1n5J2r7L6J36r0P3j21
5508h3R6K4n2L2Q9j02p1K27q6n8O4j2j1m0p1n0O0N8J9jj52P3m2J32j7r2Ml0R1
5537an8ML7R4J3qp4k0R6o3k0O6jK2j21J59j26O6k11K07o6r5P3NL5j1K3j14R0J1
5567A2Mj15J63j38l3J60k1m2O2p1M0P9l7j83jK73j11m8M5m2r4QQ2Jk8m5J95o4
5595E1l2QK4m4n7O1O7q7J7j08J11m1L7q6R8n9N8p3KL0q8J81j08Jo4J40J1r1N9
5624A8kq6L3N1o7J17q5j04J14J10j58R7j31J14l7lm0J65j64J3J16p5j0o7R8OM6
$$ plain form
5651 69 -66 -66 51 25 -33 66 -64 35 5 59 -84 14 28 52 7 58 28 85 63 20 135 -77 78 -29 115 -26
5677 -26 84 -69 -60 58 -18 -53 14 -34 62 -68 -68 20 41 -15 -17 -121 60 67 -108 -41 -28 86 8 81 -23 -5 13 -13
5705 -13 -51 -29 61 -8 87 -62 111 -32 61 42 -88 -19 -12 -97 8 22 24 97 65 47 30 -35 74 95 37 -40 -117 -56
5733 -56 -4 -16 -107 -47 -26 30 8 2 174 -30 40 153 -90 -107 -4 131 86 4 44 14 29 -3 61 -31 -58 -4 -80 -10
5761 -10 47 -8 -18 30 20 -54 6 -104 10 15 -37 -70 -48 -73 -9 -86 -28 108 -71 -7 -59 -84 68 -114 -55 11 -29 71
5789 71 -43 -17 57 -21 -63 -72 -131 -5 52 -43 -56 -18 -46 41 127 44 -8 77 76 34 34 16 -37 33 5 11 21 92 -72 88
5819 88 59 152 -40 123 -14 66 56 -19 57 129 -47 -56 101 42 -14 -73 26 -50 -18 -31 4 17 23 102 -18 56 13 -68
5847 -68 5 59 113 11 51 -72 5 -81 10 38 140 100 73 -20 33 44 -9 33 29 32 -22 -10 52 -159 -57 48 8 34
$$ packed form
5651F9j35%J17k6n8R9j30R9l0N4j43R8J4K4m5N1l0N7k2m3J15k12J55j07J44j41
5677b6J10j53RJ18p6l5O7m8R6j30%Q8K1n6kj04J81Pj75O7J3J14p8P3j04J8J8k6
5705a3l8K2R0o9R5j49J73j43R3j9j30O9Pq5J05J4KP3l2j8j7o5J09K1n8p7p7O1
5733e6N2j2r1O0K1N6k2oJ72k04P0J13k43j7J03J35m5q2M0l0J5l2O4r2k7N4p6P0
5761a0N7n5j0M8j0p4O0j10J14Nn2l3K2k5O4p7N8J36j79O4n2k5J52j82N9O6m0J00
5789G1j14K6P4p8m2rn9J26N7r5j3L8k8Q7Q6q3n2Q5jm2%j8n3P0k8OJ0P1j64J60
5819H8k9R3j92J63j37Q0j0p5P6P2j76rJ57n9n6n9R9p6L2j3L5J3OP9j20P4m3q1
5847f8P3N4N4j02M0j23P7q6R1K8J02m0k7r3N3J1n3M2mLn4J2O2k11J02J05m0K6
$$ plain form
5875 34 -38 -16 2 137 66 -41 2 35 13 55 46 138 1 -75 25 -29 -29 101 85 57 -28 -103 96 17 6 -90 31 -4
5903 -4 117 -23 -19 -71 -25 -81 -58 110 1 -40 -100 90 114 58 29 43 2 14 -17 -10 148 -15 30 58 -42 104 15
5930 15 7 7 -72 7 -68 28 126 -3 -13 76 13 42 -48 36 17 -136 -24 -93 -95 87 3 57 -17 -47 -8 -8 160 -7 -9 18
5960 18 -40 -44 92 -30 80 -23 -46 2 53 54 -16 -2 -12 -11 -55 -19 83 15 54 5 42 -180 37 16 37 -14 -11 132
5988 132 -7 -14 -1 -45 -144 -122 8 -37 58 3 -45 68 39 -87 94 39 4 94 -40 -4 -46 45 -19 23 5 -22 34
6015 34 -17 42 34 29 25 -1 86 -72 -17 7 -11 11 -15 47 -26 -52 2 -122 -69 -45 -54 -64 -47 -46 -67 26 -51 -18 44 40 42 15 -47
6048 -47 -63 107 53 12 43 35 96 5 66 8 -85 -1 33 12 15 11 12 -28 -55 -59 -68 -48 -57 -52 38 18 -78 -13 -138 -63 80 80 18
6081 18 -79 19 -18 -56 -16 -86 66 5 -72 69 83 116 41 -9 -25 -15 -49 -30 -61 -1 11 -107 128 92 64 -78 -164 48
$$ packed form
5875C4p2K2J8J35p1j07M3L3k2M2rR2j37p6J00n4%J30j6k8q5p5J99p9j1r6J21l5
5903dJ21j40Mn2M6n6K3J68j09m1o0J90K4n6k9J4m1J2l1PJ58j63M5K8j00J46q9
5930A5q%p9P9p5R6R8j29j0Q9o3K9r0Q4j9j53J12o9kJ82q4N4p4l0L9%J68j67kK7
5960A8n8mJ36j22J10j03k3M8N1Jp0J4j0Jm4L6J02o8L9m9L7k22K17k1K1n1LJ43
5988A32j39pJ3m4r9K2J30m5R5n5m8J13k9j26J81n5l5R0j34L6m2R1o4M2j8k7N6
6015C4n1N9qnmk6Q7j58N5K4j8K2k6O2p3k6N4j24N3K4rj0J7Jk1R3p7L3O2mKk7o2
6048d7j6J70n4m1L1qO1r1O1n8r3Q4L4k1LmJm0k7mrK0rNR0k0r6O5j25P5J43%o2
6081A8r7R8l7l8M0p0J52o1p7J41J4L3p5n0j6J0l4J9l1O0J2j18K35l6k8j42q6K12
$$ plain form
6109 48 -42 -53 70 8 4 23 -24 60 -47 -125 -127 -93 -61 -8 -73 -65 77 -91 110 -60 -27 -26 -3 -22 75 -30 1 -30 64
6138 64 105 -37 -11 4 3 63 83 -10 29 -7 -8 136 11 1 -55 30 69 10 134 3 84 42 -93 -36 80 -55 63
6165 63 26 -9 -21 -1 -44 49 38 -61 -89 56 -69 62 56 95 -51 -39 -45 61 34 69 -30 -83 73 -97 14 0 -118
6192 -118 -44 2 -18 -24 -55 19 -54 -48 36 -3 58 -54 -7 9 -52 -37 -24 62 85 -12 11 63 -77 16 -33 17 16 82 3 53
6222 53 34 79 18 -102 -70 19 12 22 61 35 84 65 38 25 24 28 -8 -30 18 -8 -28 -69 -103 -56 36 -72 6 -82 -101 5
6252 5 -42 -77 -26 -54 -69 -15 -50 1 168 2 28 -37 12 -47 108 3 -79 139 -46 -80 -2 33 -7 -10 -38 45 22 -62
6280 -62 32 -61 -51 -41 54 41 54 39 47 50 41 13 97 12 85 -129 -33 -15 1 -125 24 -46 19 26 9 -1 111 14 89 -17
6310 -17 -21 -45 51 -35 -55 -61 -61 46 -119 68 -54 28 19 -57 32 -16 -25 -50 -46 -9 79 76 -22 -53 -60 -2 -36 -13 74 131 70 32
$$ packed form
6109D8r0j1J23o2mJ9m7Q4j07p8kL4L2N3o5QJ42j68K01j70L3JK3j9R7j05L1l1R4
6138F4M1j42K6J5jO0K0r3L9l6jJ44j25j0n6Q5L9n9J24j31Q1m2j35N7J16j35J18
6165F3l7l5j2K0m3R3j1r9k8J45j25J31oL9j46J2oJ06k7L5r9n3J56j70J11j4j18
6192a18P4M6k0ol1P4p3OQ4l9O1j12M7J6o1J5J3Q6K3r7K3N2j40R3m9N0jO6p9N0
6222E3j9M5o1j20L2Q9pJ0L9k6M9j9k7j3jMl6k2M8k6k0m1l4M7R2j08P8q8j9J06
6252Em7l5N1k8j5N4l5N1J67j66K6o5M9n9J55j05q2K18j85l4P8L5m0lk8Q3k3q4
6280f2R4r3J0J0R5j3J3j5QLrk8Q4q5P3k14R6J8J6j26J49p0O5Pj7j0J12r7P5j06
6310a7mk4R6q6k0o%J07j65J87j22Q2rp6Q9m8rk5ML7Q8lr8l1pN8l4K3Q7N7o1l8
$$ plain form
6342 32 120 1 67 70 57 37 13 65 42 65 -62 56 -3 -66 18 137 -6 -120 -18 -130 -7 -47 -19 -63 -13 -49
6368 -49 -27 -115 68 -96 13 48 22 -53 -11 118 53 58 -48 24 131 26 -74 -52 9 156 18 130 19 -10 -22
6393 -22 34 61 36 -56 -4 -17 -69 19 -127 132 49 3 -13 6 52 -47 -14 52 -44 -17 -96 4 -34 23 23 -22 43 41 -65
6422 -65 24 -20 28 -12 85 29 14 -61 -6 11 122 -69 -8 85 3 -14 -44 -51 70 27 29 -68 91 50 -15 60 21 -110 33
6451 33 -54 84 -47 -74 -59 -55 -19 -51 -55 -70 -32 -92 -65 -48 -61 -25 -70 -49 -71 -22 74 -63 150 -45 -70 32 82 4
6479 4 -36 30 25 25 -66 -101 -99 119 -51 75 -24 30 32 -45 10 21 -79 26 -36 52 33 54 -36 -48 -16 -86 18 -96 36
6508 36 -12 58 34 -40 46 -1 -43 22 62 -62 -25 138 100 -79 -91 44 96 16 123 86 -23 99 42 106 -90 -23
6534 -23 130 -73 -80 29 -58 -41 -76 -65 13 34 75 61 -97 -13 -56 -34 20 31 40 -124 -26 26 -47 13 -61 -63 91 51 -1
$$ packed form
6342C2Q8j19O6Lj3k0k4N2k3K3j27J18n9o3Q4J19j43j14J02j12J23m0K8m4N0l6
6368d9K2q8J83j64J09L5k6p5M2J29o5Nj06P2J07j05j00K2O1J47j38J12j11k9j2
6393b2N6K7k5r2N2j3n2Q8j46K59q3m6j6J9M6r9L3O6r6K7p9J00l8N7%m5O5kj06
6422f5Q9m4M8m0R7n6j5p5N5J7J11j91O1R3q2j7l0pJ21m3Kr7J59m1o5P5l9j31J43
6451C3q7J38j31k7J5ML6l2mj5L8o0K7J7j3L6m5K1k2M9R6j37K13j95k5J02N0p8
6479Dm0O6n%r1l5KK18j70J26r9N4Kp7N5J1j00J05o2Q8j9K1r0j2L2p0J04j14J32
6508C6m8P0k4p4Q6m7m2O5M0j24L7J63l8j79j2J35N2q0J07l7j09J22n7O4j96O7
6534b3J53k03pJ09q7J7l5J1P8K1M1j4j58Q4m3K2N4J1Rj64R8N2p3O0p4kJ54m0n2
$$ plain form
6563 -1 -69 18 39 -1 41 -68 12 -69 -37 18 89 10 19 3 -50 -138 -109 -112 -26 3 -71 -63 21 -37 -2 33 15 82 -17 -108 -51 -31
6595 -31 -36 -45 46 -52 106 -124 -67 71 -11 -1 147 -107 58 0 -56 41 -103 -115 32 83 -39 9 5 -46 5 -28 -123
6622 -123 3 -17 -10 -50 71 -7 -121 3 -20 -28 27 8 -26 64 46 -57 16 -14 10 -40 21 -56 75 -25 -36 -19 -47
6649 -47 32 15 43 -99 -60 -2 -109 33 23 -60 -33 39 36 36 -74 -12 29 -41 -58 -5 -53 90 155 39 2 -54 107 4
6677 4 -51 12 -16 -7 -4 86 13 -51 20 40 129 -4 54 13 -64 132 -13 -29 -115 -3 -43 -42 -66 -79 24 -53 36 62 31 -12
6707 -12 -28 39 -59 112 64 10 -73 -20 15 11 19 -43 0 17 -9 -30 -7 -49 52 14 22 -9 0 85 1 159 92 -49 -1 -30
6737 -30 21 -4 50 -61 -37 57 41 -82 27 58 -71 -69 -87 82 126 -82 53 -104 14 78 35 83 21 -24 -6 -64
6763 -64 33 -81 34 -38 89 77 -39 31 38 -26 42 -2 -73 7 43 -16 19 11 9 -61 40 -56 -59 -34 14 -18 -44 67 5
$$ packed form
6563ao8Q7K1m0M2j09Q0q1L2N5P1p9Rj6n3q8K9lQ6K9p4QQ4n8L5L5j8O7r9r1N7K0
6595c1nrR1r8J58k30N7J38q2J0J48k54J65n8n6R7j44j2J47N1j22M8mn1N1l3r5
6622a23J26k0Pm0J21p8j14J24k3qN5j9l4R0j8j03P3l0K4n0O1p7J31j00j1J7k8
6649d7P9j7K8j42L9N8j07J42j0q3K7P2l%j10O2M1p0j7N3m8J43O5j16l7n6J61j03
6677Dn5O3k8RLR0p3o4P1K0Q9j33N8m1p7J96j45j6q6J12m0Jk4j3J03p7Q9K6l1m3
6707a2j6O7r8J71m8n4q3N3L5mQo2M3J7k6k1K3m2J01l8Ql1RQ5q4J58o7j41M8k9
6737c0N1k5N4j11K4R4j6j23J09L1j29Kj8J69M4k08J35j57J18O4m3M8o2m5J8n8
6763f4R7j14J15p2J27j2j16P0Po4O8m4p1Q0L6n9L5qkp0J01r6lK5M8l2k6J11o2
$$ plain form
6792 5 40 -88 -3 -123 2 -18 -22 53 -20 26 17 -82 -20 37 46 39 -11 -16 -6 39 -24 131 -63 -25 24 83 20 50 49 100 -57
6823 -57 30 62 62 -66 -10 131 -78 -9 -40 -21 -170 -10 -32 -90 -35 -56 22 -14 19 41 -69 -36 -17 -14 27 -75 -58 -16
6851 -16 27 -64 -12 21 49 -2 -72 33 40 -120 169 -11 -30 44 -183 -25 38 -7 16 -86 -74 -22 1 -25 -31 -118 54
6878 54 34 -63 40 -12 -51 -43 47 1 39 20 -63 29 28 26 56 3 -22 54 -35 -56 84 -40 63 37 65 50 -74 -20 17
6907 17 60 -56 -74 19 -90 93 -79 -94 -28 0 100 65 -6 10 15 -8 53 32 -57 -55 91 30 -161 -28 -97 84 -6
6934 -6 79 -66 -53 -56 3 55 -49 -81 -2 76 62 -34 20 -18 -151 -5 -31 43 -9 -75 28 -17 14 35 43 44 41 -52 41 -74
6964 -74 62 -8 66 -55 -33 9 -38 -2 54 89 -35 -32 -33 34 13 -1 8 5 23 42 -49 -51 28 91 44 102 -28 -1 -76 -55 -28
6995 -28 -65 -54 32 -15 42 78 -11 -64 73 -15 63 52 7 -20 -17 6 -162 -91 -48 -48 -6 120 -77 -42 -109 -34 -78 -41 16
$$ packed form
6792EL5j28Q5j20J25k0mP5p3M6rr9O2N7Rpn0nJ0M5o3J55j94L8M9N9o3L0jN1j57
6823e7Q7L2%j28N6J41k09O9l1J9j49J60k2n8N5k1P8l6L3K2j10L3J9LM1j02J7M2
6851a6M3r1N2L3K8n1p0J05Pj60K89j80j9P4k27J58O3m5K3j02J2N2K3k6oq7J72
6878E4k0r7J03n2l9QR0m6L8j9q3R2jkL0n3k5P6q9k1J40j24J03k6K8j5j24N4L7
6907A7M3j16j8R3j09J83j72j5O6K8J00l5p1J6Nk3O1k1q9KJ46o1j91J33o9J81r0
6934fQ5j45J3lN9N2j04l2P9P8j4r6N4l8j33J46k6P4n2o6J03m5L1K1QJlr3R3j15
6964g4J36p0P4j21K2M2m7L6N6L5j24LjO7k1j4RlJ8J9r1kP9O3m7N8j30K7p5K1K7
6995b8l7J1Q6m7N7L6q9n3J37q8P8j1m5k7LK3j68P1M3%M2J26j97L5o7P5m4L7N7
$$ plain form
7024 16 22 -20 11 -18 37 103 57 70 3 -89 -102 21 55 -54 -57 17 32 26 84 16 -31 -113 -69 73 -59 -74 -34 29 -159
7053 -159 -27 142 -20 72 16 -76 67 -52 92 24 -26 -13 -45 33 -85 -25 -31 24 10 -55 69 -32 72 88 58
7078 58 -65 51 25 -81 72 4 91 -49 -10 -77 -149 0 -48 26 -39 -54 11 -88 -94 37 28 21 -5 -83 134 -156 -35
7105 -35 -63 19 59 31 114 -50 77 94 43 32 -31 39 -39 -22 68 8 -26 136 -7 110 101 4 23 -55 28 -56 -77 82
7133 82 -145 17 24 -21 -112 20 -46 -18 68 15 -28 126 -109 -15 -131 2 3 -41 15 -22 126 53 -72 44 4 54
7159 54 67 -11 6 -61 46 -85 72 -72 83 -36 6 -73 84 84 48 14 -28 89 -6 19 16 69 61 13 52 26 133
7186 133 0 8 73 57 101 0 9 65 50 -26 77 59 -70 8 -130 -12 -52 67 19 1 104 -20 -64 -68 -84 23
7212 23 -44 59 40 -18 -45 -61 -17 53 128 12 -59 6 -53 26 109 -7 -29 -22 36 -96 26 136 55 -39 52 73 -7 22
$$ packed form
7024A6Om2L1k9N5O6m6J3o7r2j3J23L4j09lP4J5oN8o8m7q2M4J42j32j5M0O3j88
7053a59J32J69j62R2n6r2J43j19J44o8n0J3l2P8j18O0oN5j4o5J24j01J04J6l0
7078E8j23J16k6j06J53o8Q7j40L9o7p2J49m8P4o5j5O5r9oJ31rpk6p8K17k90J21
7105c5k8Q2M0k8Q3j64J27J7n1j1o3P0p8J7R0o0l4J62j43J17rr7J9p8Q3q4k1J59
7133H2k27J62Pm5r1J32o6K8Q6n3m3J54k35R4j16J33Jm4N6l7J48p3j25J16m0N0
7159E4J3p8J7o7J07j31J57j44J55j19M2p9J57%l6l4m2J17r5K5lN3qm8L9k6J07
7186A33j33QO5j6M4j01RN6j5p6J03j8j29P8j38J18m0J19m8j8J03j24m4mj6J07
7212B3o7J03j9n8k7j6M4P0P5j16p1O5n9P9Q3j16k2PN8j32J22J10q1r4R1K1q0K9
$$ plain form
7240 22 76 124 34 19 -51 -86 -71 34 108 -8 -100 -54 -73 77 -71 95 56 -5 -12 54 37 -84 97 -34 59 -55
7266 -55 1 -27 127 -63 -60 7 -25 -40 -16 -67 113 -41 -21 -60 73 27 -129 76 -35 26 9 61 -71 67 51 -75
7292 -75 -63 -16 -33 -30 44 -110 -31 -70 4 -33 -24 -53 74 -12 20 15 76 80 28 63 -32 51 -14 -49 -35 90 42 87 -5 44 37
7323 37 160 59 26 105 -68 38 -10 45 -40 -39 113 -7 8 -21 89 -22 -67 -62 11 12 -23 9 0 133 28 -95 -40
7350 -40 173 -15 0 6 46 -22 39 -35 -28 -82 6 84 -34 -71 -22 -159 49 -11 26 -62 -166 22 21 37 60 -31 -33 85
7378 85 -110 25 33 17 15 -77 -26 -7 -41 -73 -70 63 -10 -82 48 4 52 16 -16 -82 14 108 6 -13 -83 59 28 148
7406 148 -41 -31 30 63 62 27 48 -33 185 3 6 -27 18 -49 18 -78 108 8 9 -34 8 64 -101 62 -28 -5 28 -11
7434 -11 -61 -1 59 34 9 41 59 39 66 -20 -2 -26 44 108 -99 9 51 84 61 11 64 14 40 10 37 -78 -25 24 -32
$$ packed form
7240B2N4M8r0j5p0l5J5J05P4j16r2M6j9J50j48J66l9o1pO6j7j21J81j31R3j14
7266e5N6k8J54j90LO7l2j5K4n1J80j54K0l9J33m6j56K05j11O1j7N2j32J38j6j26
7292g5J2M7j7LP4j54P9l9P4l7Rk9J27q6L2nO1Mn2L5r5Q3o5l5J4J25m8M5r2M9p
7323C7J23j01l3P9j73J06m8N5q5JJ52j20J5k9J10j11m5NP3Jl5L2rJ33j05j23N5
7350d0K13j88J5OM0o8O1p4Pn4Q8P8j18l7M9j37K08o0L7q8j04J88jJ6K3r1kJ18
7378H5j95J35Qj6kr2N1J9l4l2LJ33p3p2J30m4M8l6l2o6R6R4j02j9p0J42l1J20
7406A48j89J0O1L3jl5K1q1K18j82Ll3M5o7O7r6J86j00Jm3M2N6j65J63r0K3L3l9
7434a1n0O0O0k5k5L2J8k0K7q6J8k4P0O4k07J08M2L3k3n0N3n0K6l0K7j15N3M9n6
$$ plain form
7463 -32 25 -22 -14 -44 -1 -72 -18 10 2 -60 28 -50 -137 -12 9 17 -34 13 4 75 15 48 37 -19 -5 66 -4 186 40 -19 37
7494 37 52 -111 10 -99 11 50 -41 59 -40 39 29 20 112 29 -21 -71 -54 -38 49 -56 99 0 -47 27 3 45 -136
7521 -136 30 -43 130 72 12 -14 62 -85 -4 -59 -13 36 6 8 -9 81 9 -46 -67 55 6 -58 82 130 13 -74 -14
7548 -14 -101 -73 87 38 -33 -68 53 52 -42 -78 -5 33 -46 34 15 44 -153 82 1 -19 -31 82 13 60 -18 -6 44 -20
7576 -20 21 -12 -27 71 -25 -80 27 -86 41 27 29 39 53 -36 26 -3 -182 11 -2 75 2 1 -35 78 -79 117 20
7603 20 3 85 54 93 -142 54 32 -2 -36 -100 -41 -28 25 32 21 102 3 133 56 73 87 -80 66 -32 58 -19 28 -61
7631 -61 37 51 6 -66 8 102 -151 -61 -37 -77 -158 -11 -54 16 32 -122 42 -16 36 9 29 56 -29 103 -1 43 40 -24
7659 -24 83 -50 -14 -70 -18 14 -1 108 17 0 38 109 98 77 10 100 -38 -30 -1 3 -48 33 -14 76 -45 51 27 13 -78
$$ packed form
7463c2N7m7Ql0M3p1N4K8qo2Q8p8q7J25K1Qn1M7rP1o0L3j1n6J4P1p0J90j46n9N6
7494C7J5j63J21j09J10L9r1J00r9P9j0rR2q3n0n0J7J6Q7j05J55r9m7P4k4M2j81
7521a36J66p3J73n8o0k6P6j47Q1n5M6M9l0Kj7R0p2n5k1J22m9o4J40M8j17q7O0
7548a4q7K8J60m9p1l5J21jr4l6P3L8p9Q0j9K9j97K35q1k0j2J13o9M7p8J2N0o4
7576b0M1l3j5R8r6n5J07j13J27j4KJ0J4q9O2k9j79J93j3P7p3jl6J13j57J96r7
7603B0j7Q2l1L9k35J96k2l4l4o4N9J3N3Pj1Q1r9J30p7J7J4j67J46r8R0p7M7q9
7631f1R8J4m5p2P4R4k53R0K4m0q1J47m3P0J6j54J64n8N2k7K0K7q5J32j04M4lo4
7659b4J07j33L6n6N2L2j5J09r1j7L8P1j1k1o7R0j38QK9Mn1Q1m7R0j21R6k4j4r1
$$ plain form
7688 -78 9 -83 6 -45 -90 -12 81 87 -3 50 -135 -19 11 -34 5 -13 -107 -113 -32 -94 67 -66 47 27 -90 -13 -16 0 87
7717 87 63 7 -59 0 26 -58 5 32 21 -58 37 33 4 55 -1 6 -3 -53 0 -28 -114 80 58 71 -48 78 40 66 -53 91
7747 91 53 -51 83 14 -50 -30 -59 -18 8 -80 132 -99 -12 -64 -24 -4 -121 -35 -5 -69 -56 -9 -44 -30 -11 -100 34
7774 34 5 -81 -42 79 51 -88 103 139 6 14 0 -59 16 26 -17 -88 -36 -37 84 9 -48 31 98 183 76 82 92 42 47
7803 47 -13 18 -124 -11 -44 174 -104 144 58 3 -71 21 112 -30 94 -47 11 -24 -32 -90 87 50 -66 61 18
7828 18 -41 100 -2 -45 -15 26 52 111 61 -3 -80 60 47 -131 -36 69 -100 -11 67 26 -1 -77 -52 -39 -75 32 -3
7855 -3 9 91 37 86 54 20 -23 -68 -26 14 36 -12 -28 -51 -47 106 -15 -20 -83 57 41 -36 -25 -57 -17 99 -57 3 -6 -83
7885 -83 14 -7 -48 49 -54 -45 33 5 24 -18 53 -99 -24 48 45 -44 -139 -9 82 41 7 64 3 41 60 -22 37 17 -1 83
$$ packed form
7688g8Q7r2Q9n1m5P8R3Or0N3j85J16L0m5L9j8r4oQ1o2J61j33J13k0j17P7lJ6Q7
7717H7k4n6o6N9K6q4O3K7j1p9R5mk9N1n6Prn0N3k8q6J94k2J3j19J26l8K6j19J44
7747I1l8j04J34o9o4K0k9M1K6q8K12k31Q7n2M0K0j17Q6L0o4J3M7l5J4J9q9J34
7774C4k9q6L9J21k8j39J91L6j33Qj4n9P5J0m3p1N2jJ21p5n7P9O7Q5j07OJ0n0N
7803D7o0L1j42J13l3K18k78K48q6n5p4R2R1j42J24j41N8l5qn8J77l7j16J27m3
7828A8n9J41j02m3L0M1K6N9n0o4p7J40j3j78R5J05j69Q9P8m1k7p6K5J3l6J07l5
7855cJ2Q2n4M9l2l4m3m5M2M0K2m8j6k3MJ53j21no3J40j6p7J1l2M0J16j56O0rp7
7885h3R7k1m1R7j03RP8k8J9m2P1j52P5P2lq9r5J30R1m1l4N7o1L8J9q2N9k0j8Q4
$$ plain form
7915 83 -38 25 -32 84 40 16 42 -31 -63 -33 29 58 -57 42 -24 22 65 81 -42 5 48 -67 -21 -39 39 -14 -21 50
7943 50 11 77 -48 7 -29 -120 -42 50 91 -33 -18 29 90 -67 12 118 20 -9 -78 89 -19 31 -34 -62 -33 -108 86
7970 86 -46 -132 -156 11 -37 28 -27 -39 18 2 -69 41 -87 -82 -23 -19 3 -38 -36 101 -3 -56 94 93 17 -47 -32 -21 -15
7999 -15 -33 -98 72 -67 8 -49 -16 -66 -40 -26 10 -18 -64 77 -35 16 13 -74 -35 17 -17 -89 30 32 42 54 53 -3 -59
8028 -59 -33 -99 68 154 38 -149 -70 -104 -102 1 97 74 23 -119 -90 -60 -37 24 -92 22 -80 34 -3 -27 -41 54
8054 54 73 -53 34 30 -97 71 14 -28 -69 32 23 125 17 1 71 14 110 -8 127 8 28 -20 -13 -28 21 -53 -27
8081 -27 2 -22 -30 121 38 -72 -26 16 14 102 60 87 2 -16 -51 -99 4 -84 -34 70 -67 -54 64 -42 30 18 -45 45
8109 45 3 29 -13 74 24 -55 26 14 -78 -11 40 107 2 51 70 -18 27 8 42 -25 77 12 -20 -33 64 -70 7 42 -36
$$ packed form
7915H3j21O3n7J16m4k4K6p3l2L0O2K9j15R9o6M6M3J6j23M7M3j15M6j8P8n3pP1
7943E0l9O6j25N5l6r1P8R2M1j24J5M7O1j57P9J06r8k9o9J67j08N0o5k8K9p5J94
7970H6j32q6k4J67m8O5n5j2N7j6p1J10j28NN9MK2m1KJ37j04n3J50jp6o4J5J1O
7999a5j8o5J70j39P5n7L3n0K6J4L6k8m6J41j12N1lq7L9N2l4p2J19KJ0J2jn6n6
8028e9K6o6J67Q6j16j87P9l4KJ03R6k3n1j42K9L0K3O1j16J14j02J14l7k4j4R5
8054E4J9j26Q7mj27J68n7m2m1J01rJ02j08j6P0n7R6j18J35j19K0m8Pj5M9p4K6
8081b7K9k4qJ51q3j10M6M2kQ8m2K7q5j8l5m8J03q8N0J04j37J3J18j06P2j2o3R0
8109D5m2K6m2Q7n0p9Q1j2r2O7N1O7j05M9J9q8M5j9L4o7J02o5l2j3R7j34P7L5p8
$$ plain form
8138 -36 6 74 63 -67 -42 1 -10 -5 -19 -51 -29 -64 51 -29 92 0 -101 -58 -16 -34 55 -16 -3 55 80 22 -66 -58 -85
8167 -85 -82 15 19 19 -18 -25 66 -89 -2 -28 -34 -22 20 20 37 -16 68 -26 -145 -21 -2 55 29 38
$$ packed form
8138c6M2O8j1j30K5M3j1Nj4l2K2l5J15q0J21r2j01M3M2j8Q9p1J3N8K5n8q8Qk7
8167h5LR7M%l7pR1j55Q7k6oJ2M2%J7n3Q4r4j19J24J9N7k6R
8191C8
$$ Imaginary data points
##PAGE= N=2
##DATA TABLE= (X++(I..I)), XYDATA
$$ plain form
0 0 0 0 0 0 0 0 0 0 0 0 0 0 0 0 0 0 -8 8 -8 8 -8 8 -16 16 -16 24 -24 26 -32 38 -40 48 -56 64 -71 80 -88 97
38 97 -110 122 -136 152 -168 186 -204 227 -250 276 -304 335 -368 406 -448 494 -547 606 -671 749
58 749 -838 944 -1070 1226 -1422 1680 -2031 2546 -3376 4921 -8816 42323 39263 -57924 -36711
73 -36711 23030 30244 -16571 -15695 11684 14684 -7975 -8195 -5040 -11249 -6744 20764 21314 -11472
87 -11472 -26197 2592 19515 73 -13442 5564 17251 2252 -10867 -5082 -2842 -3911 7237
100 7237 16343 -2428 -22863 -9208 15210 7408 -13455 -6957 13096 9859 -6445 -7961 -673
113 -673 582 4429 12669 6141 -11649 -10712 6934 7133 -9274 -5651 14101 8406 -17054 -14937 11234
128 11234 10845 -13132 -8948 19027 14958 -17961 -20245 11998 21069 -4178 -13334 6512 13226 -5509
$$ packed form
0@%%%%%%%%%%%%%%%%qJ6j6J6j6J6k4L2l2M0m8N0n8P0p8Q8j04J20j35J51j68J85
38I7k07K32k58K88l20L54l90M31m77N26n80O39p03P74q54R42j041J153j277J420
58G49j587J782k014K296k648L102l711M577n922Q297j3737N1139l060r7187K1213
73c6711N9741P214m6815Q76K7379L000k2659k20L155o209M505K7508N50l2786
87a1472j4725K8789J6923j9442j3515J9006J1687j4999j3119N785K240j069J1148
100G237R106j8771k0435J3655K4418p802k0863O498K0053l237j6304j516P288
113f73J255L847Q240o528j7790R37J7646J99j6407L623J9752n695k5460K117K6171
128A1234l89k3977M184K7975m069l2919k284L2243R071k5247r156J9846O714j8735
$$ plain form
142 -5509 -14356 -1607 7083 2511 1034 1977 -5774 -10800 155 9693 701 -7586 2697 10965 -1655
157 -1655 -12828 -1463 11775 5346 -4413 331 4698 -4048 -8731 1316 7511 165 -4450 452
171 452 526 -6119 -4332 5119 5711 -1628 -1586 3541 220 -5298 -287 7158 3272 -2837 730 2794 -5369
188 -5369 -7679 4469 9755 -3479 -11033 1644 9768 -3639 -13818 -225 14315 5967 -8862
201 -8862 -6424 4549 5311 -417 -1163 1027 1349 2132 1830 -3938 -7999 -145 9219 3689 -8212 -6686
217 -6686 3941 4354 -3973 -3864 4197 4787 -1078 -1844 1201 -344 -1998 3235 6658 -298 -6752 -2316
233 -2316 3990 920 -4339 -1690 2990 1290 -2752 -2913 -1279 -359 2340 4763 808 -4618 -1820 4776
249 4776 3257 -3286 -1979 5046 3951 -4092 -5448 684 2818 -990 -1583 1015 17 -3151 -1992 1846
$$ packed form
142e509q847J2749Q690m572j477R43p751n026J0955R538q992q287J0283Q268j2620
157a655j1173J1365J3238o429r759M744M367q746m683J0047O195p346m615M902
171D52P4o645J787R451N92p339M2N127l321n518N011P445l886o109L567K064q163
188e369k310J2148N286j3234p554J2677Q124j3407j0179J3593J4540q348j4829
201h862K438J0973P62n728p46K190L22P83l02n768m061P854R364n530j1901J526
217f686J0627M13q327J09Q061N90n865p66L045j545j654N233L423o956o454M436
233b316O306l070n259K649M680j700m042j61J634R20K699K423l955n426K798O596
249D776j519o543J307P025j095q043j356O132K134l808n93K598r98l168J159L838
$$ plain form
265 1846 1333 -891 841 2892 614 -2145 -445 2272 1403 111 951 406 -2559 -2389 941 1214 -2369
282 -2369 -2073 2258 1757 -3284 -4048 1667 4188 379 -1737 728 2307 125 -1175 544 1496 701
298 701 372 35 -1897 -2601 -242 1612 -155 -2198 -521 1209 -619 -2213 110 2552 1644 -305
314 -305 384 1246 -507 -903 1393 2097 -271 -1723 -290 324 -1533 -2056 28 1217 -78 -1216 -565
331 -565 -220 -179 554 1648 1117 -19 322 1138 122 -1018 365 2046 502 -1661 -1340 -15 -413 -1362
349 -1362 -523 743 45 -948 -638 107 49 75 1345 1516 190 -437 331 711 209 -159 477 584 -522
368 -522 -1135 -978 -711 -415 43 496 -557 -1361 -332 1085 626 -505 128 1798 1561 -145 -1087 -44
386 -44 1009 971 60 -1042 -1257 -319 322 -692 -1491 -765 965 970 -748 -1678 -206 1652 1605 241 -55
$$ packed form
265A846n13k224J732K051k278k759J700K717q69j292Q40n45k965J70L330K73l583
282b369K96M331n01n041p64N715K521l809k116K465J579k182j300J719R52p95
298G01l29l37j932p04K359J854j767k043J677J730j828j594K323K442r08j949
314c05O89Q62j753l96K296P04k368j452J433O14j857n23K084J189j295j138O51
331e65L45M1P33J094n31j136L41Q16j016j140J383J681j544k163L21J325l98r49
349a362Q39J266o98r93L10P45n8K6J270J71j326o27P68L80n02l68O36J07j106
368e22o13J57K67K96M58M53j053q04J029J417m59j131O33J670k37j706r42J043
386d4J053l8r11j102k15R38O41j014p99P26J730Nj718r30J472J858m7j364k96
$$ plain form
405 -55 408 635 401 188 -29 -131 -1 200 -366 -1152 -1586 -364 528 243 -535 -905 -69 690 555 300
425 300 344 638 840 722 403 -228 -525 2 910 586 -1074 -2199 -992 922 818 -1220 -1928 285 1975
444 1975 882 -1408 -1180 1240 2480 1360 -662 -1457 -169 1644 1549 -737 -2390 -967 1791 1259
460 1259 -2179 -3631 -137 3226 1558 -2606 -2526 1388 2969 576 -1727 -381 1845 1716 196 -693
476 -693 -658 -187 486 721 -469 -1786 -1357 565 1101 -854 -1796 -35 1810 961 -1117 -695 1151 1622
494 1622 206 -286 500 649 -595 -685 733 932 -1040 -2114 -411 1267 -164 -2013 -1112 1260 1456
511 1456 -484 -1059 -20 833 1004 1223 596 -1127 -1037 1403 2355 -880 -3655 -763 3597 1848 -3736
528 -3736 -4150 1275 3890 -90 -3502 -1342 2650 2387 -815 -1497 145 1526 1420 621 -359 -1121 -469
$$ packed form
405e5M63K27k34k13k17j02J30K01n66p86m34J222Q92k85p78l70Q36P59j35k55
425C00M4K94K02j18l19o31k97N27R08l24j660j125J207J914j04k038p08K213J690
444A975j093k290K28K420J240j120k022p95J288J813r5k286j653J423K758n32
460A259l438j452L494L363j668m164Q0L914J581k393k303J346K226j29j520q89
476f93L5M71O73K35j190j317M29J922N36j955r42J761J845q49k078M22J846M71
494A622j416m92P86J49j244r0J418J99j972j074J703J678j431j849R01K372J96
511A456j940n75J039Q53J71K19o27j723R0K440R52l235k775K892M360j749n584
528c736m14N425K615l980l412K160L992k63l202o82J642J381j06p99r80p62O52
$$ plain form
545 -469 1315 1317 -1354 -2846 -556 2123 803 -2299 -2352 965 2375 157 -1773 -508 1835 1594 -171
562 -171 -583 538 642 -138 -193 390 -65 -1139 -665 711 355 -1399 -1449 483 1027 -31 -597 312 585
581 585 -118 302 1340 805 -1062 -440 2098 1570 -2156 -2799 870 3019 -143 -3373 -1576 1987 1596
598 1596 -1283 -2047 147 1821 1171 -211 -740 -171 1078 1592 708 -1112 -1186 649 1783 -1 -2176
615 -2176 -1614 871 1584 -539 -2290 -1132 1358 1793 -321 -1648 -344 1712 1507 -313 -829 230
631 230 992 630 -365 -815 -613 134 788 -155 -1323 -1013 520 968 -525 -1144 227 1366 370 -553 77
650 77 1120 601 -455 99 949 344 -949 -556 246 12 -852 -785 26 162 -374 -724 -281 245 484 354
670 354 214 46 218 579 396 111 -43 56 112 -196 -455 -336 -217 -300 -239 -271 -350 -353 57 368 227 -161 166
$$ packed form
545d69J784Kk671j492K290K679j320l102n3L317J410k218j930J265K343k41j765
562a71m12J121J04p80n5N83m55j074M74J376l56j754n0J932N44j058n66R09K73
581E85p03M20J038n35j867O22K538n28l726o43L669K149l162l230J797L563l91
598A596k879p64K194J674o50j382n29N69J249N14q84j820p4J835J134j784k175
615b176N62K485P13k123j751J158K490M35k114j327J304K056k05j820n16J059
631B30P62l62r95m50K02P47O54r43j168L10J533M48j493o19J371J139r96r23O30
650G7J043n19j056N54Q50o05j293L93Q02k34q64O7Q11J36n36l50M43N26K39j30
670C54j40j68J72L61j83k85j54R9N6l08k59J19J19q3O1l2p9lM10L11j41l88L27
$$ plain form
693 166 566 419 160 155 464 468 193 -425 -245 -176 5 -60 -499 -627 -177 22 -304 -384 -6 512 289 -207 -26
716 -26 670 707 -22 -171 260 498 -45 -331 -232 -4 -30 -305 -539 -425 -146 -89 -183 -108 -63 198 268 189 206 337
740 337 439 284 219 65 239 -82 -179 -85 -151 -452 -557 -130 -94 -148 -453 -97 83 228 188 89 270 466 367
763 367 178 93 38 229 291 -99 -333 -267 -95 -279 -267 -275 -77 -174 -350 34 -8 21 205 339 384 210 108 370
787 370 382 176 -138 -169 -57 4 -244 -523 -322 -128 -63 -314 -320 -165 374 235 -52 -9 379 550 280 40 222
810 222 318 265 -100 -266 -156 -77 -219 -283 -381 -373 -96 -76 -139 -141 -19 321 302 178 171 421 334 127 52 145 132 4
836 4 -87 -145 -182 -265 -271 -234 -165 -187 -114 53 -4 108 212 334 159 249 252 411 117 -95 8 66 -35 -205 -271 -335 -317
863 -317 -33 -67 -94 -355 -68 250 171 -119 -104 653 645 112 -113 193 333 149 -87 -119 -240 -263 -201 -85 -268
$$ packed form
693A66M00j47k59nL09Mk75o18J80O9J81o5m39j28M50J99l26q0L78N18k23m96J81
716b6O96L7p29j49M31K38n43k86R9K28k6k75k34J14K79N7r4P5M5K61P0p9J7J31
740C37J02j55o5j54J74l21r7R4o6l01j05M27L6n4l05L56J80J45m0r9J81J96r9
763C67j89q5n5J91O2l90k34O6J72j84J2qJ98r7j76L84m2K9J84J34M5j74j02K62
787C70J2k06l14l1J12O1k48k79K01J94O5k51oJ55N39j39k87M3L88J71k70k40J82
810B22R6n3l65j66J10P9j42o4r8QK77K0o3kJ22L40j9j24pK50q7k07p5R3j3j28
836Dr1n8l7q3oL7O9k2P3J67n7J12J04J22j75R0LJ59k94k12J03N8j01j70o6o4J8
863c17K84l4k7k61K87L18p9k90J5P57qn33k25L06J40j84k36l2j21k3O2J16j83
$$ plain form
886 -268 -513 -193 60 5 -260 22 236 296 180 301 213 135 119 574 253 -281 -403 154 124 -389 -549 -328
908 -328 5 -142 -180 -204 -119 -245 259 519 15 -367 230 950 345 -457 -305 482 505 -295 -563 -261 75 -156
930 -156 -257 -314 -409 -275 293 393 -138 -437 299 751 408 -67 -101 338 450 271 -212 -281 -96 104 -23 -386
952 -386 -652 -114 160 -202 -399 -163 327 131 77 213 376 -75 -31 542 505 -267 -462 306 524 -359 -679
973 -679 -69 163 -292 -551 101 144 -377 -262 673 731 -348 -671 695 1165 64 -887 39 974 191 -543
993 -543 -462 87 16 -129 -198 -261 -414 -61 328 84 -356 -241 422 680 248 -221 2 430 442 108 -402 -262
1015 -262 228 389 -258 -738 -385 420 88 -702 -311 348 272 -251 -14 532 143 -393 362 876 198 -633
1035 -633 -15 800 14 -824 -287 422 -203 -905 -244 445 -145 -807 -153 1046 243 -686 55 1032 596 -430
$$ packed form
886b68k45L20K53n5k65K82K14O0j16J21q8p8j6M55l21n34j22N57l0n13j60K21
908c28L33j47l8k4Q5j26N04K60n04l82N97P20o05q02J52P87K3q00k68L02L36k31
930a56j01n7r5J34N68J00n31k99P36M52l43m75l4M39J12j79m83o9J85K00j27l63
952c86k66N38K74l62j97K36M90j96n4J36J63m51M4N73l7p72j95P68K18q83l20
973f79O10K32m55k59O52M3n21J15R35N8j079l23J366M70j101r51R26R35p83p34
993e43Q1N49p1j45o9o3j53L53L89k44m40J15O63K58m32m69K23M28J2l34n10J40
1015b62M90J61o47m80L53Q05l32p90L91O59p6n23K37N46l89n36P55N14o78q31
1035f33O18Q15p86q38N37P09o25p02O61O89n90o62O54J199q03r29P41R77m36j026
$$ plain form
1055 -430 -312 683 367 -257 -340 8 -92 -430 -38 81 -426 -539 96 309 -143 -427 -21 570 414 111
1075 111 -78 6 270 337 80 -549 -255 464 398 -463 -765 -47 303 -339 -623 -98 356 -123 -181 431 270
1096 270 -298 24 662 525 -415 -226 547 386 -645 -612 387 176 -573 -635 208 221 -374 -318 316 467 -292
1117 -292 -100 527 555 -308 -146 393 46 -211 -47 259 -12 -560 -121 163 -143 -606 -32 306 -103 -231
1137 -231 134 350 135 85 282 275 -109 122 365 267 -391 -171 260 146 -516 -162 98 -41 -450 -286 189
1158 189 113 -289 106 458 40 -151 293 353 7 -240 216 488 -171 -381 16 304 -271 -596 135 331 -354
1179 -354 -432 126 274 -301 -103 423 366 -76 -168 489 365 -257 -206 296 -23 -437 -203 130 -72 -508 -166
1200 -166 13 -112 -393 63 282 -21 -276 77 514 208 -133 193 464 18 -270 73 195 -177 -362 88
$$ packed form
1055d30J18R95l16o24q3L48j00l38L92J19n07j13O35K13m52k84M06N91j56l03
1075A11j89Q4K64O7k57o29K94P19o6q61l02P18L50o42k84N25M54m79n8O12j61
1096B70n68L22O38j37r40J89P73j61j031L3R99k11p49o2Q43J3n95N6O34J51p59
1117b92J92O27K8q63J62N39l47k57J64L06k71n48M39K84l06m63N74L38m09j28
1137b31L65K16k15n0J97pl84K31K43r8o58K20M31j14o62L54K60j39m09J64M75
1158A89p6m02L95L52m18j91M44O0l46k47M56K72o59k10L97K88n75l25P31J96o85
1179c54p8N58J48n75J98N26n7m42r2O57j24o22N1N02l19m14K34L33k02m36L42
1200a66J79j25k81M56K19l03k55L53M37l06l41L26K71m46k88L43J22l72j85M50
$$ plain form
1220 88 109 -263 -314 57 140 -297 -165 318 379 -51 97 361 160 -205 73 434 48 -293 -24 216 -154 -460
1242 -460 -175 131 -138 -385 -133 305 -68 -202 122 375 86 -21 286 412 -107 -149 290 196 -229 -209 17
1263 17 -68 -306 -366 37 35 -313 -148 414 111 -141 64 322 292 31 79 383 174 -133 32 279 -78 -255
1285 -255 -74 -8 -275 -385 -32 114 -136 -296 -27 281 21 -143 196 189 57 -41 355 133 -204 -126 57 12
1307 12 -367 -323 108 -57 -375 -259 104 -31 -157 168 211 139 -87 248 306 28 -206 106 154 -109 -270 -2
1329 -2 135 -209 -268 -75 49 -87 -119 -77 175 47 -66 183 229 -178 -128 286 238 -27 -73 103 16 -69 -149 -109
1353 -109 -75 -70 -234 -157 -215 -274 -7 135 -2 61 115 199 149 154 246 155 162 -23 130 77 -125 -157 71 -114 -208 -162 -12
1380 -12 59 -11 -81 -20 122 16 73 190 264 -33 84 238 -29 -96 -12 60 66 -143 -137 -71 6 -181 -233 -36 19 16 47
$$ packed form
1220H8K1l72n1L71Q3m37J32M83O1m30J48K64k01l65K78L61l86l41K69K40l70l06
1242d60K85L06k69k47K52M38l73j34L24K53k89j07L07J26n19m2M39r4m25K0K26
1263A7q5k38o0M03kl48J65N62l03k52K05K58l0k61M8L04k09l07J65K47l57j77
1285b55J81O6k67j10L53J46k50j60K69L08k60j64L39pj32r8L96k22l37P8J83m5
1307A2l79M4M31j65l18J16L63j35j26L25M3p2k26L35N8k78k34L12M8k63j61K68
1329bJ37l44n9J93J24j36l2M2K52j28j13K49M6m07N0M14m8k65m6J76q7q5q0M0
1353a09L4Nj64P7n8n9K67J42j37O3N4Q4n0NR2r1Pj85J53n3k02l2K28j85r4M6J50
1380a2P1p0p0O1J42j06N7J17P4k97J17J54k67o7Q4P2Ok09OO6P7j87n2J97N5lL1
$$ plain form
1407 47 109 87 182 229 136 98 -17 -48 40 85 -74 -232 -120 -63 -130 -136 -171 -143 -19 51 -12 -46 154 169 95 58 175
1434 175 159 134 -4 213 93 -111 -136 -161 37 -107 -161 -134 0 45 -139 13 67 220 110 107 211 211 71 35
1458 35 86 84 -67 -36 76 -67 -232 -203 -46 22 -145 -82 -89 137 110 -112 -7 155 191 49 100 133 98 24 14 58
1484 58 -77 -163 -145 -70 -88 -243 -297 -157 -112 -61 -124 128 128 207 85 -5 229 60 117 24 20 75 -157 -211 -110 -15 -273
1511 -273 -184 0 -22 -102 -105 -34 160 46 -40 94 194 118 -7 44 155 127 -63 129 148 -11 -81 -122 -26 111 -181
1536 -181 -251 32 157 29 -163 104 109 96 46 128 154 125 -33 -19 -48 -76 -147 -67 -11 -133 -99 -108 -25 -66 77 -56
1562 -56 45 261 255 96 222 145 200 -3 44 75 -8 -25 -157 -34 -154 -233 -220 9 88 -87 -123 80 66 -46 -42
1587 -42 115 172 99 -2 270 151 20 -194 50 4 -76 -340 -26 -13 -53 -190 -19 16 -39 -101 76 140 33 109
$$ packed form
1407D7O2k2R5M7r3l8j15l1Q8M5j59j58J12N7o7ol5K8J24P0o3l4K00J5p4l7J17
1434A75j6k5j38K17j20k04k5k5J98j44n4K7J34M5j84J52N4J53j10lJ04%j40l6
1458C5N1kj51L1J12j43j65K9J57O8j67O3pK26k7k22J05J62L6j42N1L3l5p4j0M4
1484E8j35q6J8P5j8j55n4J40M5N1o3K52%P9j22r0K34j69N7r3mN5k32n4J01R5k58
1511b73Q9J84k2q0lP1J94j14q6J34J00p6j25N1J11k8j90J92J9j59p0m1R6J37k92
1536a81p0K83J25j28j92K67Nj3n0Q2K6k9j58J4k9k8p1Q0N6j22L4rQ3m1J43j33
1562e6J01K16oj59J26p7N5k03M7L1q3j7j32J23j20p9J3K29P9j75l6K03j4j12M
1587d2J57N7p3j01K72j19j31k14K44m6q0k64L14J3m0j37J71L5n5o2J77O4j07P6
$$ plain form
1611 109 47 167 22 100 64 37 77 -22 -85 54 13 -90 -74 -113 -108 5 -55 55 53 93 122 100 21 97 131 130 4 116
1639 116 -1 -26 -12 -30 22 -147 -115 -130 -63 -102 5 24 4 115 17 181 232 129 24 146 148 -133 -126 37 26 -186
1665 -186 -66 -64 -26 -190 -86 -55 -103 -143 -141 127 48 -22 -4 53 170 41 87 83 -91 32 -23 18 -149 -51 -7 -21 -46
1692 -46 -96 12 -41 -51 -8 -26 130 136 73 195 18 -35 120 147 74 -169 47 52 -66 -183 -82 -86 -156 -129 -23 5
1718 5 -64 -48 94 54 109 -105 105 247 59 45 7 28 -71 -98 -34 -87 -188 -220 -105 1 20 -32 23 26 -35 63 -16
1745 -16 170 21 64 211 29 49 69 102 -136 -175 -83 -139 -97 -83 -110 160 -58 -73 125 6 -78 180 188 156 32
1770 32 71 76 103 -12 -19 -28 -35 -80 -13 -60 -39 -2 3 -65 56 -18 85 34 45 119 113 81 101 20 80 122 53 -20 -29 8 -63 -4
1802 -4 -85 -82 -70 -80 75 -88 67 39 173 179 -31 -130 90 -60 -78 84 -48 -58 -38 -102 -25 -103 -65 -137 -46 -21 -42
$$ packed form
1611A09o2J20j45P8l6k7M0r9o3J39m1j03J6l9NJ13o0J10kM0K9k2p9P6L4jj26J12
1639A16j17k5J4j8N2j69L2j5O7l9J07J9k0J11r8J64N1j03j05J22Kk81PJ63j1k12
1665a86J20KL8j64J04L1m8m0KK68p9p0J8N7J17j29M6mj74J23n5M1j67R8M4j4k5
1692d6n0J08n3j0M3j8J56Oo3J22j77n3J55K7p3k43K16Nj18j17J01mp0K7J06K8
1718Eo9J6J42m0N5k14K10J42j88j4l8K1r9k7O4n3j01l2J15J06J9n2N5Lo1R8p9
1745a6J86j49M3J47j82K0K0L3k38l9R2n6M2J4k7K70k18j5J98j19q4K58Ql2j24
1770C2L9NK7j15prpm5O7m7K1L7No8J21p4J03n1J1P4ol2K0q1O0M2o9p3rL7p1N9
1802dq1LJ2j0J55j63J55k8J34Ok10r9K20j50j8J62j32j0K0o4P7p8L8p2R1K5k1
$$ plain form
1829 -42 -9 99 175 12 189 38 174 27 35 139 39 31 13 7 -60 -38 -76 55 -88 -115 -95 34 4 47 -52 23
1855 23 148 75 82 37 109 -15 116 -30 69 -75 -5 -29 -117 -194 35 -125 -88 24 38 -46 -63 119 94 71 38 117
1881 117 152 51 114 -86 148 -105 -132 -73 -67 -88 16 -168 -30 -24 -153 101 -10 151 -17 104 -37 111 60
1904 60 65 28 7 22 0 -91 -20 -69 -64 -106 -128 -7 -13 -11 86 76 84 -78 9 22 80 97 144 45 20 12 -16 75 17 87 -2 -82
1936 -82 -50 -69 -174 1 -82 48 -56 -42 18 134 42 55 107 -31 -20 62 73 -30 -65 -43 31 -61 -48 14 31 30 -74
1963 -74 -45 100 -35 -26 32 104 171 14 -6 57 77 -18 80 -71 -51 -16 61 -104 -53 -86 -30 -97 101 -44 -20 4 62
1990 62 177 47 33 132 178 127 -139 -3 46 -68 -13 -113 -91 -83 -147 -109 -19 54 -1 -25 90 32 7 77 -170 133
2016 133 59 -112 -25 43 -26 -112 -78 -79 -71 -178 -15 68 28 -106 82 27 24 114 86 129 148 1 10 -28 60 -17 -111 82
$$ packed form
1829d2L3J08P6j63J77j51J36j47QJ04j00qj8oo7K2l8J31j43k7K0J29l0M3r9P5
1855B3J25p3Pm5P2j24J31j46R9j44P0k4q8p7K29j60L7J12J4q4j7J82k5k3l3P9
1881A17L5j01O3k00K34k53k7N9Ok1J04j84J38Oj29K54j11J61j68J21j41J48n1
1904F0Nl7k1J5k2r1P1m9Nm2k2J21oKR7j0Qj62Q7J3N8J7M7r9k5qk8R1n8P0q9q0
1936h2L2j9j05J75q3J30j04J4O0J16r2J3N2j38J1Q2J1j03l5K2P4r2J3O2J7jj04
1963g4K9J45j35RN8P2O7j57k0O3K0r5R8j51K0L5P7j65N1l3N6o7J98j45K4K4N8
1990F2J15j30j4R9M6n1k66J36M9j14N5j00K2Qo4L8R0P3n5k4J15n8k5P0k47L03
2016A33p4j71Q7O8o9q6L4jQj07J63Q3m0j34J88n5lR0k8M3J9j47Rl8Q8p7r4J93
$$ plain form
2044 82 11 -29 -85 -56 -184 -147 -3 68 -86 17 28 -4 96 -6 73 30 37 94 70 54 -10 -76 -108 -14 84 -90 -87 -87
2072 -87 -35 69 46 122 -116 77 188 145 127 83 -45 109 9 82 75 29 -111 19 2 -74 -70 35 10 -182 -42
2097 -42 -48 -41 152 -30 35 92 25 84 97 62 -68 -3 -35 18 -53 -132 -32 -115 -58 -27 -66 70 -51 34 89 27 45 120
2125 120 44 10 -33 165 -2 3 0 79 -60 -100 -50 -20 -75 53 -88 79 -8 -87 -14 -46 98 74 -12 71 34 -94 97
2152 97 102 -11 17 -15 -21 -17 -109 20 -13 -97 -15 113 45 36 24 -25 70 102 32 130 147 -21 2 -15 -41 -161 -49 41 -109
2181 -109 -124 -149 -44 -136 -35 21 64 53 -6 131 213 -18 -20 17 154 -4 50 32 123 -86 -75 -25 -86 -67 -120 11
2207 11 46 -145 -16 33 121 -113 -44 117 130 83 -46 96 -13 -69 -37 85 83 -89 -76 -16 -71 -37 -65 47 -15 26
2233 26 106 124 12 63 55 145 39 21 39 23 -57 -8 -84 -138 -66 -101 27 -13 -33 -103 -8 26 -30 14 54 51 80 137 156 -30
$$ packed form
2044H2p1m0n6K9j28L7J44P1j54J03J1l2J00j02P9m3PN7k4j6o4o6l2R4R8j74L%
2072h7N2J04k3P6k38J93J11m3j8m4j28J54j00P3pm6j40J30j7p6MJ05k5j92J40
2097d2oPJ93j82O5N7o7N9J3l5j30O5l2N3p1p9J00q3N7L1l9J36j21Q5N5o2J8P5
2125A20p6l4m3J98j67NlP9j39m0N0L0n5J28j41J67q7p9P3l2J44k4q6Q3l7j28J91
2152I7Nj13K8l2oMr2J29l3q4Q2J28o8rj2m9R5L2p0R8J7j68K3j7k6j20J12R0j50
2181a09j5k5J05r2J01N6M3j1n9J37Q2k31kL7J37j58N4j8R1k09J1N0o1J9n3J31
2207A1L5j91J29M9Q8k34O9J61J3m7j29J42j09n6L2J22kj72J3O0n5L4k8J12o2M1
2233B6Q0J8j12N1qR0j06j8J8j6q0M9p6n4P2l5J28m0k0p0R5L4n6M4M0lK9N7J9j86
$$ plain form
2263 -30 103 149 32 -4 -97 -109 -23 -53 -153 -74 -58 -163 -32 62 156 1 -24 103 48 71 32 116 34 -24 39 90 -142
2290 -142 -144 -37 95 -87 -165 -114 17 29 -91 -91 -54 138 78 149 127 35 34 74 4 -123 -25 13 135 -20 -196 -32
2316 -32 -48 -163 -74 21 49 -46 -6 34 -30 -7 35 105 132 50 104 42 55 -10 -34 28 -141 -126 -128 -29 62 -109 -44 -7 -100
2345 -100 131 38 -2 52 24 46 34 44 21 94 26 -165 39 -32 -127 -213 -18 -73 -14 -113 -51 76 -7 59 46 115 34
2372 34 29 67 78 40 -157 82 31 -89 -28 -120 -2 10 -57 -153 -45 -76 24 -31 43 96 19 74 12 116 -22 58 -7
2399 -7 -50 -29 -50 28 -108 20 -134 -120 -48 -128 -42 12 20 28 20 68 49 41 -3 77 -83 -30 158 33 -112 -60 -65 -188 -12
2428 -12 -78 50 -140 104 -6 -26 -12 -43 -55 72 69 -4 142 103 69 52 -8 17 -59 38 -22 -88 -95 -26 -13 -25 32 -62
2456 -62 81 60 4 51 83 22 47 42 -32 0 -95 -14 -43 -82 -5 63 -52 22 -103 50 -23 -169 -57 -43 25 -17 64 -18
$$ packed form
2263c0J33M6j17l6r3j2Q6l0j00P9J6j05J31R4R4j55k5J27n5K3l9Q4q2n8O3N1k32
2290a42kJ07J32j82p8N1J31J2j20%L7J92o0P1k2r2jM0p0j27R8L8J22j55j76J64
2316c2j6j15Q9R5K8r5M0M0o4K3M2P0K7q2N4o2J3o5k4O2j69J5kR9R1j71O5L7r3
2345a00K31r3m0N4k8K2j2J0k3P3o8j91K04p1r5q6J95n5N9r9O2J27q3O6j3O9q1
2372C4nL8J1l8j97K39n1j20O1r2J18J2o7r6J08l1J00n5P4N3p7N5o2J04j38Q0o5
2399gm3K1k1P8j36J28j54J4P2q0Q6N4QQqM8j9qm4Q0j60N3J88j25j45N2nj23J76
2428a2o6J28j90K44j10k0J4l1j2J27lp3J46l9l4j7o0K5p6R7o0o6pO9J3j2N7r4
2456f2J43k1n6M7L2o1K5np4L2r5Q1k9l9P7O8j15P4j25J53p3j46J12J4O8m2Q1q2
$$ plain form
2484 -18 66 75 53 60 97 -49 1 16 -145 -68 -68 -36 -3 -33 -102 -38 -70 -11 29 60 84 -45 88 33 105 79 60 118 32 -31
2514 -31 -114 -34 21 -9 -6 113 -68 -89 -34 50 41 -136 90 41 128 97 28 62 2 51 -201 -153 -64 -81 -45 -73 5 -101
2542 -101 -107 -34 -60 -44 -67 98 90 17 24 41 70 60 -57 45 -28 -86 -50 -66 -48 16 -109 -56 -39 -88 15 -9 -18 36 -16
2571 -16 9 119 120 -104 -34 -11 21 27 0 28 -38 -78 63 -166 68 23 -111 19 -45 79 8 160 -24 41 16 -90
2597 -90 13 112 -50 74 -76 -31 -54 -78 -8 -16 104 -42 -80 71 -14 31 32 36 25 87 112 16 34 54 -65 -45 -56 -82
2625 -82 80 5 -69 -69 -74 -69 39 -7 -7 38 -34 -9 37 -10 -26 -12 -4 49 -12 40 29 -29 10 -58 -81 -2 -105 38 -97 -40
2655 -40 -92 8 40 19 65 113 99 -24 28 27 -7 -101 -23 10 7 -123 -101 21 28 -23 -33 -5 -47 -33 -11 57 40 -14 -62 27
2685 27 3 -39 111 93 -41 58 50 11 27 0 -82 -77 -44 -74 71 -70 4 40 13 -108 -87 -2 -65 10 89 126 -67 5
$$ packed form
2484a8Q4Rk2PL7j46N0J5j61P7%L2L3l0o9O4l2N9M0L1K4j29J33n5P2k6j9N8q6o3
2514c1q3Q0N5l0LJ19j81k1N5Q4rj77K26m9Q7l1o9L4o0M9k52M8Q9j7L6k8P8j06
2542a01oP3k6J6k3J65qp3PJ7K9j0j17J02p3n8L6j6J8O4j25N3J7m9J03k4rN4n2
2571a6K5J10Jk24P0K3L2Ok7K8o6m0J41k29K34m5j34J30o4J24p1J52j84O5k5j06
2597i0J03R9j62J24j50M5k3k4P0qJ20j46l8J51q5M5JMj1O2K5r6J8K0j19K0j1k6
2625h2J62p5p4%nNJ08m6%M5p2K5M6m7j6J4QN3o1N2j1n8L9o8k3P9j03J43j35N7
2655d0n2J00L2k1M6M8j4j23N2jl4r4P8L3lj30K2J22Pn1j0K8m2J4K2O8j7n4m8Q9
2685B7k4m2J50j8j34R9ql9J6k7q2NL3l0J45j41P4L6k7j21K1Q5o3P5P9L7j93P2
$$ plain form
2713 5 29 -25 -24 4 -75 -137 -55 -107 24 -94 -73 49 -6 13 60 4 7 73 119 -44 125 -29 -40 5 -75 -57 -31 -64 -35
2742 -35 1 -21 -17 -33 -56 20 46 -66 41 148 -25 14 46 38 -36 -67 -74 5 -2 5 7 -81 -33 -10 7 -5 15 -22 -80 -84 67
2773 67 -4 68 -4 22 13 -58 -17 67 93 -60 -20 -83 -27 -8 31 -18 -1 89 -31 -1 65 20 -21 -32 69 9 -39 -2 34
2802 34 77 -137 -56 -8 64 -130 -29 -62 6 -86 30 -43 -3 120 7 19 58 -61 4 28 -44 78 29 -288 -9
2827 -9 -56 -12 33 -128 -46 -43 -55 24 25 52 75 -83 133 90 5 14 63 79 -159 18 106 -18 71 38 43 -10 -69 10 2 -122
2857 -122 -2 -57 -29 41 58 24 49 55 33 -69 122 -49 -75 -91 -11 -37 -107 61 14 13 -22 -36 66 22 -23 -28 -38 20
2885 20 -4 49 9 20 62 25 -236 -10 -13 -72 14 -42 -68 101 -17 -26 74 -6 4 -25 47 -3 55 30 221 10 -26 -144
2913 -144 11 -62 -85 -8 -86 17 -128 -109 2 -33 -100 -65 17 68 86 -2 0 -9 9 -15 15 61 -77 -22 -22 -42 -3 36 63
$$ packed form
2713EK4n4JK8p9o2Q2n2J31j18K1J22n5J9M7n6LO6M6j63J69j54j1M5q0J8K6l3K9
2742c5L6k2Mj6k3P6K6j12J07J07j73L9L2qp4l1pP9pPKq8M8K3J7j2K0l7n8mJ51
2773F7p1P2p2K6rp1M1Q4K6j53M0o3N6J9L9m9J7R0j20L0O6m5m1j1J01o0m8L7L6
2802C4M3k14Q1M8P2j94J01l3O8r2J16p3M0J23j13J2L9j19O5K4p2J22m9l17K79
2827im7M4M5j61Q2Lj2P9JK7K3j58K16m3q5RM9J6k38J77Q8j24Q9l3Nn3n9P9qj24
2857a22J20n5K8P0J7l4K5Ok2j02J91j71k6j6Q0k6p0J68m7jl5j4J02m4m5nj0N8
2885B0k4N3m0J1M2l7k61K26ln9Q6n6k6J69j18rJ00q0J0k9P2n0N8k5J91k11l6j18
2913a44J55p3k3P7p8J03j45J9J11l5o7L5Q2N1J8q8KrJ8k4L0M6j38N5%k0L9L9K7
$$ plain form
2942 63 -103 -78 -82 -26 -57 33 77 39 32 -57 -81 -39 68 -33 -1 -89 -95 26 5 19 -21 2 -42 75 -105 -60 -2 30 -8
2971 -8 -33 58 97 10 -81 42 10 40 19 -51 -8 1 -84 -56 -65 73 -136 107 -52 -12 36 24 -6 45 -3 86 59 28 141
3000 141 4 159 -18 106 71 17 129 68 50 20 105 13 -27 93 49 41 -1 -74 -35 -5 11 9 116 -30 79 55
3026 55 0 -81 -46 -9 -152 -90 -50 -62 -36 52 12 -98 152 130 41 26 -71 22 48 -49 100 -18 -45 -82 -165 43 -90
3053 -90 15 64 -27 37 -31 -24 -56 18 23 -85 22 -1 110 -26 46 37 -5 61 -30 -46 55 -36 -27 -11 -17 19 -49 16 -52 -58
3083 -58 -8 27 -22 59 -4 10 46 23 82 -96 76 209 18 -39 54 -80 44 -46 -46 31 -26 -64 2 54 -6 67 114 -27
3111 -27 -23 -81 24 -77 124 -32 -46 -24 94 65 -72 -22 42 -56 61 40 38 12 -45 67 -43 21 -64 -128 -87 -36 28
3138 28 67 -59 18 2 61 30 15 -42 -67 -46 2 -14 47 9 -91 22 -43 54 -98 53 54 23 -43 -30 54 43 46 -37 40
$$ packed form
2942F3j66K5mN6l1R0M4l8pq9k4M2J07j01L2q8oJ21k1J4m0K3m4J17j80M5N8L2l8
2971hk5R1L9q7r1J23l2L0k1p0M3Rq5K8rJ38k09K43j59M0M8j2l0N1m8Q9k7l1J13
3000A41j37J55j77J24l5n4J12o1j8l0Q5r2m0J20m4qm2p3L9L0J6kJ07j46J09k4
3026E5n5q1L5L7j43O2M0j2K6Q8m0j10K50k2q9j5r7R3K6r7J49j18k7l7q3K08j33
3053i0J05M9r1O4o8Pl2P4Nj08J07k3J11j36P2rm2O6r1j6J01r1RJ6oL6o8O5o8o
3083e8N0L5m9Q1o3J4L6k3N9j78J72J33j91n7R3j34J24r0%P7n7l8O6N2o0P3M7j41
3111b7Mn8J05j01K01j56j4K2J18k9j37N0O4r8J17k1kk6n7J12j10O4q5o4M1N1O4
3138B8L9j26P7j6N9l1j5n7k5K1M8j6O1l8j00J13o5R7j52J51Jl1o6J3Q4j1Lq3P7
$$ plain form
3167 40 -32 -80 76 72 -55 67 -42 10 106 -21 -13 135 -25 47 27 -26 37 26 -126 -14 -61 13 11 -77 -10 -70 -40
3194 -40 -39 -112 -13 -26 28 149 -44 38 -18 48 21 45 18 62 10 -44 -4 99 -10 -18 -17 -91 96 -54 86 54 57 45 -18
3223 -18 -1 -66 68 37 70 25 -34 64 -73 -70 -50 -80 -6 35 91 -14 -50 16 -15 7 4 -6 151 49 29 63 82 -1 -72
3252 -72 -111 5 -43 11 -30 -6 -15 -16 -20 62 -11 19 8 -5 -89 30 62 -118 69 -98 -23 -29 47 -80 -17 -25 13 19 45 -60
3282 -60 60 55 57 -33 -27 -5 -50 -7 -118 101 62 46 91 27 -13 29 -56 -26 55 -13 84 42 -8 -95 -38 12 55 19 -155 169
3312 169 -127 103 -15 -7 -45 4 92 3 -18 4 63 24 -23 -83 55 -26 21 31 10 -16 -2 -41 40 46 -50 -7 -63 -8 141
3341 141 30 -31 1 29 -78 32 -62 1 -81 94 -63 -25 13 14 47 90 75 68 -48 -11 16 15 39 9 0 46 -12 83 58
3370 58 22 71 -30 13 15 45 -50 -94 29 -34 14 27 38 -3 27 -53 0 -2 96 14 -42 -109 -52 29 70 13 -26 13 33 41 56
$$ packed form
3167D0p2m8J56mj27J22j09N2R6j27QJ48j60P2k0n3O3j1j52J12m7P4kq8O7o0L0
3194d0Jp3R9j3N4J21j93Q2n6O6k7K4k7M4n2n4M0J03j09qJp4J87j50J40l2Lj2o3
3223a8J7o5J34l1L3m5n9R8j37LK0l0P4M1N6j05l6O6l1K2lj0J57j02k0L4J9q3p1
3252g2l9J16m8N4m1K4rjmQ2p3L0j1j3q4J19L2j80J87j67P5oP6j27O3qL8OK6j05
3282f0J20nKr0OK2m5M3j11K19l9j6M5o4m0M2q5L0Q1o8R7m2n0q7N7N0M3l6j74L24
3312A69k96K30j18Ql8M9Q8q9k1K2N9l9m7o0J38q1M7J0k1k6J4l9Q1Or6M3n6N5J49
3341A41j11o1L2K8j07J10r4O3q2J75j57L8L8JL3M3j5pj16L7K7jK4l0rM6n8R5k5
3370E8l6M9j01M3KL0r5m4J23o3M8J3J1m1L0q0N3kR8q2n6o7N7Q1M1n7l9L9K0QJ5
$$ plain form
3401 56 30 168 -28 39 31 -78 10 58 -44 -106 61 2 -60 -46 22 -44 50 -47 100 60 28 -30 -81 -18 14 -49 -43 -62
3429 -62 -134 -18 -66 36 -107 -36 -42 -39 -54 22 -52 23 -83 24 -36 33 0 -34 65 -101 -103 -72 49 -8 -78 -15 58 8
3457 8 -25 -7 30 -12 15 23 -5 -20 47 53 -49 5 -80 35 -30 5 89 9 21 -14 -8 -23 -28 -11 -31 50 5 9 75 56 13 89
3489 89 -43 58 -129 58 -18 84 30 -10 -57 67 96 -143 17 -100 51 -115 27 -56 -26 48 -21 53 33 102
3513 102 -45 25 -22 28 -5 -17 41 -72 20 -109 -30 -62 -48 -8 -32 -28 -3 -91 35 -2 42 3 108 -25 -27 83 -61
3540 -61 0 4 -13 65 -104 -72 109 71 21 104 95 76 39 19 33 172 87 57 63 -22 28 -18 55 7 9 7 53 15 35 -88 50
3571 50 33 -20 -54 -68 -53 -88 -18 -24 78 25 12 7 -12 43 14 88 -83 -116 134 12 -28 29 -89 34 48 34 0 69
3599 69 149 -3 125 88 -61 -46 18 113 35 -84 56 -19 -71 -9 32 3 -50 -70 -60 -8 104 55 21 144 116 105 -94
$$ packed form
3401E6k6J38j96O7qj09Q8M8j02o2J67n9o2J4O8o6R4r7J47m0l2n8n1O3L2o3Oj9
3429f2p2J16m8J02j43P1oLj5P6p4P5j06J07o0O9l3l4R9j66kL1J21n7p0O3P3n0
3457Hl3J8L7m2K7Qk8j5O7Oj02N4q5J15o5L5Q4q0J2l5Oj5nJ7k0Q1m5MO6j9m3P6
3489H9j32J01j87J87p6J02n4m0m7J24K9k39J60j17J51j66J42q3L0P4o9P4k0O9
3513A02j47P0m7N0l3j2N8j13R2j29P9l2J4M0k4MK5q8J26l7M4l9J05j33kJ10j44
3540f1O1Mj7P8j69L2J81l8n0Q3rj9l7k0J4J39q5l0Oq5N0m6P3m8KkM6l8K0j23J38
3571E0j7n3l4j4J5l5P0oJ02n3j3nj9N5k9P4j71l3K50j22m0N7j18J23J4j4l4O9
3599F9Q0j52J28l7j49J5O4R5p8j19J40p5n2O2M1k9n3k0J0N2J12m9l4J23k8j1j99
$$ plain form
3626 -94 8 -36 -134 42 35 13 -17 -86 -85 10 -58 13 -45 -52 -56 72 -16 14 8 40 139 -113 -83 -11 10 -18 -47 42 -46 -51 15
3657 15 55 -67 19 -14 -94 -68 -56 18 15 26 -79 -16 -20 -40 -8 15 53 105 -34 -45 7 -20 -55 24 -4 80 -18 85 40
3686 40 -69 230 -26 26 49 59 8 -146 32 -57 5 10 -11 96 74 -74 -65 22 -5 30 -68 101 77 -67 50 -39
3712 -39 14 35 2 49 -31 -88 17 -6 75 -2 -2 -16 -62 9 -29 44 -153 40 -30 -37 36 0 -7 39 77 -62 -79 121 26
3741 26 -12 53 -38 14 -36 -55 -20 -125 -21 0 -87 16 -122 22 44 40 65 -63 17 -64 41 -11 -27 -6 -21 -16 76 86
3769 86 -9 6 85 121 -85 18 -63 13 -22 -22 -42 27 -62 12 -13 26 -89 -5 55 0 39 -64 -11 14 -87 40 -49 -22
3797 -22 -20 26 72 9 133 -10 -74 -21 -14 -78 1 97 10 -1 39 -34 13 -31 -17 -25 120 57 -15 21 100 -44 23 86 125 33
3827 33 -185 -40 52 -22 86 40 -61 -7 -68 29 -76 -61 11 -55 46 92 -77 24 -74 109 36 34 13 -107 -15 -29
$$ packed form
3626i4J02m4r8J76pk2l0o9JR5o8P1n8pmJ28q8L0oL2R9k52L0P2K1k8k9Q9q8nO6
3657A5M0j22Q6l3q0K6J2P4lJ1j05O3mk0L2K3L8N2j39j1N2k7l5P9k8Q4r8J03m5
3686D0j09K99k56N2K3J0n1j54J78q9O2Nk1J07k2j48RQ7k7L5r8J69k4j44J17q9
3712c9N3K1l3M7q0n7J05k3Q1p7%j4m6P1l8P3j97J93p0pP3l6pM6L8j39j7K00r5
3741B6l8O5r1N2n0j9L5j05J04K1q7J03j38J44K2mK5j28Q0q1J05n2j6K1j5NR2J0
3769H6r5J5P9L6k06J03q1P6l5%k0O9q9P4k5L9j15Q4O0n5L9j03N3K5j01J27q9K7
3797b2KM6M6o3J24j43o4N3Po4P9R6q7j1M0p3M7m4J4qJ45o3p2L6P9j44O7O3L9r2
3827C3k18J45R2p4J08m6j01N4o1R7j05J5P2o6J01M6j69J01r8J83p3kk1j20R2j4
$$ plain form
3853 -29 -40 65 -60 27 8 -3 -58 8 -68 39 115 -15 173 54 9 -38 17 59 -105 -25 94 -32 5 -21 59 114
3879 114 22 18 -49 -95 -64 12 3 70 60 -65 -55 121 39 -67 -31 28 17 -28 -40 54 59 69 -3 -39 65 53 -112 -16 6
3908 6 -176 -12 68 41 96 -75 30 75 104 50 57 -10 -71 -3 -21 -5 34 -74 -109 1 -86 -84 8 16 39 17 72 -51 3
3937 3 4 144 70 92 155 -52 11 -96 -103 142 -3 -69 -7 3 -19 61 -23 118 -88 24 -1 10 19 87 96 -89 2 -19
3965 -19 59 -100 -16 91 -39 25 -16 44 21 75 -25 54 44 67 37 82 13 87 74 -36 7 -7 -81 -15 -18 4 -19 17
3993 17 119 -15 15 -13 -159 98 56 -65 17 36 20 -14 46 -82 -103 -52 -16 -56 -60 -16 5 22 -93 -9 104 6 -40
4020 -40 56 21 -54 39 -45 -7 39 142 -77 -10 6 44 11 66 56 -122 -7 28 1 110 -56 -62 -15 -5 -39 -78 -1 5
4048 5 -79 -136 38 -67 -44 66 -67 -33 20 -62 -133 69 65 -24 5 -21 43 -49 48 60 81 -88 24 -35 -22 34 27 74
$$ packed form
3853b9j1J05j25Q7j9j1n5O6p6J07P6j30J88j19m5m7N5M2j64Q0J19j26L7k6Q0N5
3879A14r2mo7m6L1P6rO7j0j25J0J76q2j06L6N9j1m5j2R4NJ0p2l6J04j2j65R6K2
3908Fj82J64Q0k7N5j71J05M5K9n4Po7o1O8j8J6L9j08l5J10q7KR2QK3k2N5j23N4
3937CJJ40p4K2O3k07O3j07pK45j45o6O2J0k2Q0q4J41k06J12k5J1RO8Rj85R1k1
3965a9P8j59Q4J07j30O4m1O0k3N4j00P9j0K3l0M5o9P4j3j10M3j4p4O6lK2k3L6
3993A7J02j34L0k8j46K57m2j21Q2J9j6l4O0j28k1N1L6m0mM4K1J7j15Q4J13r8m6
4020d0R6l5p5R3q4L8M6J03k19O7J6L8l3N5j0j78J15L5k7J09j66oM7J0l4l9P7O
4048Eq4n7J74j05K3J10j33L4N3q2p1K02mq9K9k6O4r2R7J2K1j69J12n9J3N6pM7
$$ plain form
4076 74 -3 -49 -33 -34 -77 -2 -10 24 -41 80 -12 -63 48 22 72 119 20 10 99 -6 15 -4 -70 80 29 -81 -77 98 -10
4105 -10 -16 -49 -27 90 20 -25 1 14 67 -88 36 61 18 -29 -28 -63 -144 21 -60 -21 -56 -9 -72 -18 -43 -64 123 -119
4133 -119 -61 30 124 -8 -21 -72 11 -86 -34 -49 52 50 -20 5 -27 3 -53 -61 18 -15 44 49 80 -4 44 0 90 117 -16 -75
4163 -75 -44 -61 -55 74 -37 -107 24 111 -30 -27 41 47 -22 27 24 -34 11 -46 31 113 8 -29 -5 -7 -69 -108 -82 -56 8 107
4193 107 30 36 -27 12 69 -18 -84 39 -44 -46 20 -98 -2 102 -4 -38 -78 45 -61 -79 67 -82 -118 -139 97 -58
4219 -58 80 -31 0 1 -37 -9 69 44 66 -80 -113 -40 -99 -51 -71 -83 0 4 45 5 48 20 -17 38 79 25 -10 -10 -26 -92
4249 -92 -63 143 -37 -51 -29 -88 17 102 -44 -109 3 41 -19 -102 -12 48 -24 86 47 -9 98 103 -4 -3 -9 -69 -2 58
4277 58 10 3 -26 -37 103 -119 139 24 203 42 -70 32 10 64 -17 47 49 139 -69 -56 94 79 -11 65 -38 5
$$ packed form
4076G4p7m6J6jm3P5qL4o5J21r2n1J11k6N0M7r9j0Q9j05K1j9o6J50n1j10MJ75j08
4105a0ol3K2J17p0m5K6J3N3j55J24K5m3m7Jl5q1J65q1L9l5M7o3N4k5k1J87k42
4133a19N8R1R4j32j3n1Q3r7N2j5J01kp0K5l2L0n6qP9l3N9NL1q4M8m4R0K7j33n9
4163g5L1j7OJ29j11p0J31Q7j41LO8Oo9M9ln8M5n7P7Q2j05l7K4ko2l9K6K6O4R9
4193A07p7Oo3L9N7q7o6J23q3kO6j18R6J04j06l4m0J23j06j8J46j49l6k1K36j55
4219e8J38j11L1Jl8K8P8k5K2j46l3P3n9M8k0j2Q3MM1m0M3k8l7N5M1n4l5%j6o6
4249i2K9K06j80j4K2n9J05Q5j46o5J12L8o0q3R0O0p2J10l9n6J07Nj07Joo0O7O0
4277E8m8pk9j1J40k22K58j15J79j61j12J02k2N4q1O4KR0k08J3J50j5r0P6j03M3
$$ plain form
4303 5 16 91 -49 43 59 -27 -10 11 -85 19 -54 -30 -27 -44 31 2 -43 -20 0 -20 -87 149 -7 -18 64 34 38 -50 -3 21
4333 21 -39 83 -70 -38 -32 -3 -52 -41 -100 3 -88 -21 -10 38 23 82 69 -103 -6 35 36 6 33 173 -101 172 -73
4360 -73 57 -27 -29 -34 -14 -124 4 -65 -24 -45 -83 -76 -42 60 -62 6 -45 16 20 23 7 51 -41 50 -29 -26 -15 -28 -4 -64 -42
4391 -42 -22 -4 -66 -28 25 26 -4 -45 7 31 19 -60 -30 -40 -4 -1 -55 55 11 -9 -63 24 -14 -101 -62 -43 -57 2 7 48 -44
4422 -44 -30 75 -120 -33 11 24 -78 6 -50 -141 84 36 -65 -30 -2 52 -22 -61 53 47 -56 50 -2 -54 53 -86
4448 -86 73 138 -16 -125 62 -38 56 -67 12 -11 -30 70 -95 -76 -87 -4 32 28 16 -8 -15 -6 -10 43 -44 6 65 37
4476 37 115 -24 83 88 -51 12 -5 -1 -43 7 2 -91 103 23 2 85 94 7 -67 65 39 -3 103 18 -58 -17 28 -34 32
4505 32 -32 37 6 -54 -33 -37 1 15 -68 67 -3 -13 50 -8 -25 50 40 -46 -70 -8 -52 -92 36 0 16 -83 7 21 71 -36
$$ packed form
4303EJ1P5j40R2J6q6J7K1r6J04p3K4Lj7P5k9m5K3K0k0o7K36j56j1Q2l0Mq8M7K4
4333B1o0J22j53L2OK9m9J1n9J03r1O7J1M8j5N9j3j72R7M1Jl0K7J40k74K73k45
4360g3J30q4knK0j10J28o9M1k1l8PL4J02j22O8n1O1MLj6M4r2R1p9LJ1j3K4o0K2
4391d2K0J8o2L8N3Jl0m1N2K4j2p9L0j0L6Ln4J10m4k0n4Q7l8q7L9J9j4N9NM1r2
4422d4J4J05j95Q7M4J3j02Q4n6r1K25m8j01L5K8N4p4l9J14oj03J06n2n2J07j39
4448h6J59O5j54j09J87j00R4j23P9k3j9J00j65J9j1Q3L6mj2k4pRmN3q7N0N9k8
4476C7P8j39J07Nj39O3j7Mm2N0nr3J94q0k1Q3Rq7p4J32k6m2J06q5p6M1M5o2O6
4505C2o4O9l1o0K1mL8J4q3J35p0j0O3n8j7P5j0q6k4O2m4m0J28l6J6r9R0J4N0j07
$$ plain form
4535 -36 113 -57 -38 -2 46 60 -8 -81 51 -33 -130 -121 -101 -41 -2 34 -33 -94 37 4 -57 -63 26 -71 -177 24 -67 69
4563 69 36 -14 -27 -29 58 15 110 -35 -9 33 -34 11 76 -116 68 -71 -60 33 1 -67 -61 51 -74 -14 95 13 -106
4590 -106 20 -14 4 -131 -56 16 45 -14 -10 -98 -33 53 -25 19 9 -57 -65 -18 -9 29 5 15 -21 -36 -126 -19 -3 77 -38
4619 -38 80 -22 -18 -16 -166 45 80 10 -69 -51 22 -3 70 20 -96 -68 -107 5 -95 -33 -33 24 -82 34 -43 -31 1
4646 1 22 74 -58 -45 -24 23 -50 135 -22 -47 21 52 35 -71 -10 97 28 -16 -23 5 -40 13 -50 28 -28 -73 155 -22
4674 -22 7 -64 86 59 32 -10 -61 34 -63 -8 -31 40 -8 -21 17 -62 -38 -9 20 -13 1 87 0 -12 -63 -83 12 -99 19
4703 19 3 -39 -89 -30 -23 10 -119 6 96 155 -89 -26 59 -106 24 -49 4 -17 12 43 -46 5 17 1 -174 22 -60
4730 -60 -61 104 88 83 -79 81 28 30 75 36 -46 78 73 5 79 63 223 -19 -7 -22 -46 -11 11 80 14 -55 21 25 -27 -33
$$ packed form
4535c6J49j70J9L6M8J4o8p3J32q4r7RK0O0L9L6o7o1J31l3o1oQ9r7j06K01r1J36
4563F9l3n0j3kQ7m3R5j45K6M2o7M5O5j92J84j39J1R3l2o8OJ12j25O0J09q2j19
4590a06J26l4J8j35P5P2K9n9Mq8O5Q6p8M4j0o6qM7RL8k4J0l6j5r0J07J6Q0j15
4619c8J18j02MKj50K11L5p0p9J8P3k5P3n0j16K8l9J12j00O2%N7j06J16p7J2L2
4646AK1N2j32J3K1M7p3J85j57k5O8L1j7j06O1J07o9m4pK8m5N3o3P8n6m5K28j77
4674b2K9p1J50k7k7m2n1R5r7N5k3P1m8j3L8p9K4K9K9l3J4Q6q7j2n1k0R5j11J18
4703A9j6m2n0N9PL3j29J25R0N9k44O3Q5j65J30p3N3k1K9L1q9N1J2j6j75J96q2
4730f0jJ65j6nj62J60n3KM5l9q2J24no8P4j6J60k42J2j5k4L5K2O9o6o9P6Mn2o
$$ plain form
4760 -33 -78 14 14 -82 -27 33 -25 41 -2 -56 132 17 45 -1 40 37 20 -6 99 110 -16 70 9 111 64 -15 93 43
4788 43 -20 -11 27 -75 -40 -90 -15 -47 -105 -78 -73 -64 16 -12 30 -62 -114 -19 -40 -5 -35 -126 -3 -56 -11 40 0 -53 41 11 -1
4819 -1 -47 -1 -42 -68 67 26 131 53 93 22 82 -4 68 5 -4 2 62 45 -114 -23 59 6 66 86 77 -44 44 1 23 -45
4849 -45 30 38 -88 -58 -52 16 33 20 -120 64 -30 66 9 -51 90 83 -67 72 25 -14 -89 -29 -51 110 4 190 55
4876 55 -12 108 46 -74 -7 -26 7 34 -83 -45 -6 -58 -24 50 -26 -12 -82 1 18 69 -34 -4 10 34 66 -58 -23 -28
4904 -28 -60 -4 -112 73 -83 -14 -62 6 62 33 -12 27 -27 -23 34 114 37 46 27 -12 49 19 -19 -68 102 -28 -40 25 34
4933 34 -104 67 101 51 20 -85 -70 19 -44 94 79 21 111 22 -49 -30 -62 -3 -6 7 7 -30 66 -79 39 -43 -34 45 -33
4962 -33 26 -89 1 100 10 82 -54 129 13 -42 21 44 -36 1 104 -59 61 -47 -6 -96 59 79 -59 48 16
$$ packed form
4760c3m5R2%r6N5O0n8O6m3n4J88j15K8m6M1lj7k6J05J1j26Q6o1J02m7p9J08n0
4788D3o3RL8j02L5n0P5l2n8K7NRQ0k8M2r2n2R5k1L5l0r1J23n3M5N1m0n3R4l0j2
4819am6M6m1k6J35m1J05p8M0p1O0q6P2o3rOO0j7j59R1Q2n3O0K0rj21Q8m3K2o8
4849d5P5Qj26L0OO8J7j3j40J84r4R6n7o0J41pj50J39m7l9p5O0k2J61j06J86j35
4876E5o7J20o2j20O7j9L3K7j17L8L9n2L4P4p6J4p0Q3J7N1j03L0J4K4L2j24L5n
4904b8l2N6j08J85j56O9m8O8N6k9m5L9n4MN7Q0p7Rj9l9O1l0l8m9J70j30j2O5R
4933C4j38J71L4n0l1j05J5Q9o3J38j5n8R0q9p1J9l2N9lJ3%l7R6j45J18q2RP9p8
4962c3N9j15R0R9r0P2j36J83j16n5O3K3q0L7J03j63J20j08M1r0J55K0j38J07l2
$$ plain form
4987 16 -66 -33 -25 58 13 22 -30 -74 9 -58 -32 -60 31 51 -63 29 61 -4 -43 -6 -70 3 53 57 157 27 -74 4 6 38
5017 38 -51 -30 0 -105 -54 29 -123 69 62 -49 66 -97 -82 18 -81 9 -67 143 -30 -5 46 40 -1 -65 -69 20 41
5044 41 -99 -8 -93 -80 -90 -27 -80 94 -61 56 145 84 48 -9 -41 74 -27 43 16 12 20 67 48 -41 -73 1 -45 38
5072 38 -45 35 72 -59 -7 -67 71 49 -179 6 -25 -61 -31 -97 -9 -66 -67 -35 18 10 13 -79 47 146 24 58 31 -24 60
5101 60 -104 -83 32 -3 1 -32 195 -27 -66 26 -17 60 -19 -35 -58 -17 -36 7 -113 88 4 54 -22 -103 37 71 123
5128 123 -9 -85 22 61 -34 86 28 58 -136 -72 -128 8 10 -38 -48 -44 15 5 8 -93 15 19 22 38 -58 -44 2 67 -13
5157 -13 54 0 -27 68 137 -8 0 -43 45 -20 15 8 25 -10 -34 -2 -32 -20 52 -10 -50 19 131 157 -1 -21 20 22 65 -48
5187 -48 27 -11 50 -80 39 2 74 -16 -16 12 65 36 -37 58 54 -43 23 -82 122 48 46 2 -29 58 -71 51 32 36 45 -62
$$ packed form
4987A6q2L3QQ3m5Rn2m4Q3o7K6k8R1K0j14R2L2o5l9L7o4P3N0MJ00j30j01P8KL2
5017C8q9K1L0j05N1Q3j52J92pj11J15j63J5J00r9R0p6K10j73K5N1om1o4mQ9K1
5044D1j40R1q5J3j0O3n3J74j55J17Q9o1l6n7l2J15j01P0k7mQM7j9q9l2P4m6Q3
5072C8q3Q0L7j31N2o0J38k2k28J85l1l6L0o6Q8n7jL2N3qLr2J26R9j22L4k7n5Q4
5101F0j64K1J15l5Ml3K27k22l9R2m3P7p9j6k3M1j9M3j20K01q4N0p6q1J40L4N2
5128A23j32p6J07L9r5J20n8L0j94O4n6J36Km8j0MN9j0Lj01J08MLJ6r6J4M6O5q0
5157a3O7n4k7R5O9j45Qm3Q8o5L5pJ7l5k4L2l0J2P2o2m0O9J12K6j58k0M1KM3j13
5187d8P5l8O1j30J19l7P2r0%K8N3k9p3R5mr7O6j05K04p4km4l1Q7j29J22j9MRj07
$$ plain form
5217 -62 51 115 4 -95 -36 25 -110 -168 -31 -61 143 -77 1 0 -12 77 -61 -83 34 -45 11 63 -100 -32 6 -22
5243 -22 96 3 60 32 38 23 52 40 -12 -97 -25 -29 -26 -36 -6 -14 15 -76 105 50 -91 -157 -87 -70 128 73 -137 140 -11
5272 -11 46 44 31 -13 -6 -17 41 40 -31 -43 -20 -13 -57 -36 4 -2 -31 85 57 17 -74 83 -33 72 -37 59 -51 -9 -23 -70
5302 -70 -11 -6 -82 -47 -60 -57 -3 43 -108 -95 -16 -27 -73 -103 63 -61 -97 -24 -62 -38 34 44 18 -118 19 137 32 -81
5330 -81 22 -24 -44 -63 34 6 130 -6 -8 -89 35 23 -9 137 11 102 6 -10 29 -59 -61 5 -49 34 -5 -83 47 -32
5358 -32 -56 27 -60 38 13 50 -10 13 17 -163 43 10 70 -51 -1 54 -22 -11 64 -17 21 16 -11 88 49 -48 45 121 28 -50
5388 -50 -24 29 -15 -28 -51 -74 -57 -67 56 -14 -34 32 -28 73 -29 9 3 -60 51 -15 74 107 -36 -68 -24 25 -42 56
5416 56 -74 -96 -13 -71 -14 5 25 1 16 -82 -7 -81 -85 -19 84 -8 -94 -53 5 -74 -70 102 -52 -74 87 -12 92 17
$$ packed form
5217f2J13O4j11r9N9O1j35n8J37l0K04k20P8jj2Q9j38k2J17p9N6N2j63O8L8k8
5243b2J18r3N7k8Oj5K9j2n2q5P2mLj0L0qK9r1J81n5j41o6P0J7J98n5k10K77j51
5272a1N7kj3m4Pj1N8jp1j2K3Pm4K1M0ok9J16k8m0r1J57j16J05j09R6j10M2j4m7
5302g0N9Np6L5j3LN4M6j51J3P9j1m6l0J66j24l6P3l8K4P2J0k6j36J37J18j05j13
5330h1J03m6k0j9R7k8J24j36kq1J24j2l2J46j26R1r6j6L9q8kO6n4Q3l9p8J30p9
5358c2k4Q3q7R8k5L7o0K3Mj80K06l3O0j21N0N5p6J1P5q1L8nk7R9l9r7R3P6r3p8
5388e0K6N3m4j3k3k3J7j0J23p0k0O6o0J01j02L8oo3J11o6Q9L3j43l2M4M9o7R8
5416E6j30k2Q3n8N7J9K0k4J5r8P5p4mO6J03r2q6M1N8p9MJ72j54k2J61r9J04p5
$$ plain form
5444 17 -3 5 73 120 20 -10 1 90 -5 10 42 -30 11 46 42 7 -30 -166 -3 107 91 11 -8 31 -23 156 45 147
5472 147 -30 -30 0 19 -59 59 -7 -62 10 0 -26 23 5 25 -44 -19 -102 34 28 -59 41 44 -124 -3 -35 -10 -54 -12
5500 -12 22 -42 -107 25 -15 16 36 -61 -9 81 29 161 97 18 -30 -18 84 63 -126 1 107 75 -138 -23 -39 4
5526 4 -8 7 -2 7 -47 84 75 -24 63 45 69 -10 138 15 -51 -54 -31 12 -126 8 48 71 47 -39 37 48 50 32 21 -33 11
5557 11 -23 44 46 44 -4 53 23 -27 2 23 51 -104 -84 -28 21 6 -34 3 14 -43 -78 -168 69 8 108 8 117 16
5585 16 -67 -65 38 -87 -97 -20 70 44 -41 26 -13 64 74 -146 -39 -37 -60 18 123 22 1 -13 -140 -32 58 -27 -18 47
5613 47 -102 -218 -36 14 -108 -138 -35 26 52 31 -2 -16 59 34 12 -118 -20 55 13 84 -68 72 25 -59 62 5
5639 5 16 -14 76 -69 27 54 -22 23 75 60 -69 -5 95 161 13 124 72 32 27 -73 -100 136 18 -15 183 23
$$ packed form
5444A7k0QO8M7j00l0J1Q9r5J5L2p2M1L5ml5l7j36J63J10j6q0j9L9n4J79j11J02
5472A47j77%L0J9p8J18o6n5P2j0k6M9j8K0o9K5q3J36oq7J00Lj68J21l2K5m4M2
5500a2L4o4o5J32m0L1K0r7N2R0n2J32o4p9m8J2J02k1j89J27J06l2k13J15j6M3
5526Dj2J5rRn4J31rr9Q7j8K4p9J48j23o6lK3M3j38J34M0K3k4q6P6J1Kj8j1n4M4
5557A1l4O7Kkm8N7l0n0K9K1K8j55K0N6M9j5m0L7J1n7l5r0K37o1J00j00J09j01
5585A6q3KJ03j25j0P7R0k6q5O7l9P7J0k20J07Kk3P8J05j01k1j4j27J08R0q5RO5
5613D7j49j16J82N0j22l0J03O1K6k1l3j4P5k5k2j30R8P5m2P1j52J40m7q4J21n7
5639EJ1l0R0j45R6K7p6M5N2j5j29O4J00O6j48J11n2m0nj00k7K36j18l3J98j60
$$ plain form
5665 23 -19 96 6 -63 51 78 0 -12 53 -52 63 44 -23 13 84 -6 86 -38 -6 7 -17 -99 30 56 -77 -6 65
5692 65 -32 5 35 107 -50 49 -147 -74 127 4 -35 -26 16 5 -15 125 29 6 42 21 124 24 -33 4 90 -5 -17
5719 -17 89 152 109 38 -59 -1 -90 34 -30 -20 0 -3 61 94 -59 14 -4 -27 56 -2 -38 -26 -23 34 57 146 -49 -97 18
5748 18 23 -16 -76 125 -1 -65 26 -41 88 90 -57 84 -38 -24 -26 103 19 46 66 -37 -23 -1 -18 -119 -32 -24 -72 -10
5776 -10 77 -15 -12 -23 2 -30 7 11 -70 -63 -97 90 19 81 15 -32 44 13 -5 -59 -7 12 71 5 -31 47 59 -52 -120 68
5806 68 15 -24 -90 -9 94 1 -161 -8 74 -40 -63 -11 87 -19 -16 6 -42 41 -31 53 1 -55 103 -68 5 -72 72
5833 72 57 -40 55 35 -48 22 -51 -73 -15 -75 0 -34 67 -43 -36 36 -73 -49 147 120 -41 166 42 -3 53 23 45
$$ packed form
5665B3m2J15r0o9J14K7p8j2O5j05J15j9o7L6P1r0R2j24L2J3k4q2J29K6j33P1P1
5692F5r7L7L0P2j57R9j96P3K01j23l9RM2j1k0J40r6k3L6k1J03j00n7L7Q6r5j2
5719a7J06O3m3p1r7N8q9J24o4J0K0lO4L3j53P3j8k3Q3n8l6J2LN7K3Q9j95m8J15
5748A8Nl9o0K01j26o4R1o7J29Kj47J41j22J4kJ29q4K7K0j03J4K2j7j01Q7Qm8O2
5776a0Q7r2Lj1K5l2L7Mq1Pl4J87p1O2o6m7P6l1j8n4N2J9N9o6l6P8J2j11o8J88
5806F8n3l9o6Q1J03r3j62J53Q2j14k3N2R8j06LK2m8Q3p2Q4n2n6J58j71P3p7J44
5833G2j5r7R5k0q3P0p3k2N8o0P5l4J01j10PP2j09K4J96k7j61K07j24m5N6l0K2
$$ [...]
8191D8
##END NTUPLES=NMR FID
##END=
