##TITLE=1H_Pr CS2-TOl
 CDCl3
 8 sc, 
 6.05.2022
##JCAMPDX= 6.0         $$ Bruker NMR JCAMP-DX V2.0
##DATA TYPE= NMR FID
##DATA CLASS= NTUPLES
##ORIGIN= UXNMR, Bruker Analytische Messtechnik GmbH
##OWNER= root
$$ XWIN-NMR		Version 3.5
$$ Fri May  6 16:33:10 2022 Russian Standard Time (UT+4h)  she@DPX200
##.OBSERVE FREQUENCY= 200.1313499996
##.OBSERVE NUCLEUS= ^1H
##.DELAY= (6, 6)
##.ACQUISITION MODE= SIMULTANEOUS
##.ACQUISITION SCHEME= undefined
##.AVERAGES= 8
##.DIGITISER RES= 18
##SPECTROMETER/DATA SYSTEM= spect
##.PULSE SEQUENCE= zg30
##.SOLVENT NAME= CDCl3
##.SHIFT REFERENCE= (INTERNAL, CDCl3, 0, 15.7039)
##AUDIT TRAIL= $$ (NUMBER, WHEN, WHO, WHERE, WHAT)
$$ ##TITLE= Audit trail, XWIN-NMR		Version 3.5
$$ ##JCAMPDX= 5.01
$$ ##ORIGIN= Bruker BioSpin GmbH
$$ ##OWNER= she
$$ F:/spectra/data/she/nmr/H-F/1/audita.txt
$$ ##AUDIT TRAIL=  $$ (NUMBER, WHEN, WHO, WHERE, WHAT)
(   1,<2022-05-06 16:31:49.54 +0400>,<she>,<DPX200>,
      <created by zg, POWCHK disabled, PULCHK disabled
       configuration hash MD5:
       00 E9 B6 7A A2 85 ED C7 34 08 36 98 17 FE 4E 26
       data hash MD5: 16K
       0E 1E C5 3E 74 82 23 92 3C 9F 56 AC BD BF F7 D3>)
$$ ##END=
$$ 
$$ hash MD5
$$ DE 51 BA 15 F3 67 72 11 65 9C D9 F9 10 8D 40 EE
##$RELAX= 
##$RELAX= 
##$RELAX= 
##$RELAX= 
##$RELAX= 
##$RELAX= 
$$ Bruker specific parameters
$$ --------------------------
##$DU= <F:/spectra>
##$EXPNO= 1
##$NAME= <H-F>
##$PROCNO= 1
##$TYPE= <nmr>
##$USER= <she>
##$AMP= (0..31)
100 100 100 100 100 100 100 100 100 100 100 100 100 100 100 100 100 100 
100 100 100 100 100 100 100 100 100 100 100 100 100 100 
##$AQSEQ= 0
##$AQ_mod= 1
##$AUNM= <au_zg>
##$AUTOPOS= <>
##$BF1= 200.13
##$BF2= 200.13
##$BF3= 200.13
##$BF4= 200.13
##$BF5= 200.13
##$BF6= 200.13
##$BF7= 200.13
##$BF8= 200.13
##$BYTORDA= 1
##$CFDGTYP= 0
##$CFRGTYP= 5
##$CHEMSTR= <none>
##$CNST= (0..31)
1 1 145 1 1 1 1 1 1 1 1 1 1 1 1 1 1 1 1 1 1 1 1 1 1 1 1 1 1 1 1 1 
##$CPDPRG= <>
##$CPDPRG1= <>
##$CPDPRG2= <>
##$CPDPRG3= <>
##$CPDPRG4= <mlev>
##$CPDPRG5= <mlev>
##$CPDPRG6= <mlev>
##$CPDPRG7= <mlev>
##$CPDPRG8= <mlev>
##$CPDPRGB= <>
##$CPDPRGT= <>
##$D= (0..31)
0 1.2 0 0 0 0 0 0 0 0.06 0 0.03 0 0 0 0 0.0002 0 0 0 0 0 0 0 0 0 0 0 0 
0 0 0 
##$DATE= 1651840309
##$DBL= (0..7)
120 120 120 120 120 120 120 120 
##$DBP= (0..7)
150 150 150 150 150 150 150 150 
##$DBP07= 0
##$DBPNAM0= <>
##$DBPNAM1= <>
##$DBPNAM2= <>
##$DBPNAM3= <>
##$DBPNAM4= <>
##$DBPNAM5= <>
##$DBPNAM6= <>
##$DBPNAM7= <>
##$DBPOAL= (0..7)
0.5 0.5 0.5 0.5 0.5 0.5 0.5 0.5 
##$DBPOFFS= (0..7)
0 0 0 0 0 0 0 0 
##$DE= 6
##$DECBNUC= <off>
##$DECIM= 32
##$DECNUC= <off>
##$DECSTAT= 4
##$DIGMOD= 1
##$DIGTYP= 9
##$DL= (0..7)
0 120 120 120 120 120 120 120 
##$DP= (0..7)
150 150 150 150 150 150 150 150 
##$DP07= 0
##$DPNAME0= <>
##$DPNAME1= <>
##$DPNAME2= <>
##$DPNAME3= <>
##$DPNAME4= <>
##$DPNAME5= <>
##$DPNAME6= <>
##$DPNAME7= <>
##$DPOAL= (0..7)
0.5 0.5 0.5 0.5 0.5 0.5 0.5 0.5 
##$DPOFFS= (0..7)
0 0 0 0 0 0 0 0 
##$DQDMODE= 0
##$DR= 18
##$DS= 0
##$DSLIST= <SSSSSSSSSSSSSSS>
$$ [...]
##$SUBNAM2= <"">
##$SUBNAM3= <"">
##$SUBNAM4= <"">
##$SUBNAM5= <"">
##$SUBNAM6= <"">
##$SUBNAM7= <"">
##$SUBNAM8= <"">
##$SUBNAM9= <"">
##$SW= 18.0517283424761
##$SWIBOX= (0..15)
0 0 2 0 0 0 0 0 0 0 0 0 0 0 0 0 
##$SW_h= 3612.71676300578
##$TD= 16384
##$TD0= 1
##$TE= 0
##$TE2= 300
##$TE3= 300
##$TEG= 300
##$TL= (0..7)
0 120 120 120 120 120 120 120 
##$TP= (0..7)
150 150 150 150 150 150 150 150 
##$TP07= 0
##$TPNAME0= <>
##$TPNAME1= <>
##$TPNAME2= <>
##$TPNAME3= <>
##$TPNAME4= <>
##$TPNAME5= <>
##$TPNAME6= <>
##$TPNAME7= <>
##$TPOAL= (0..7)
0.5 0.5 0.5 0.5 0.5 0.5 0.5 0.5 
##$TPOFFS= (0..7)
0 0 0 0 0 0 0 0 
##$TUNHIN= 0
##$TUNHOUT= 0
##$TUNXOUT= 0
##$USERA1= <user>
##$USERA2= <user>
##$USERA3= <user>
##$USERA4= <user>
##$USERA5= <user>
##$V9= 5
##$VALIST= <valist>
##$VCLIST= <CCCCCCCCCCCCCCC>
##$VD= 0
##$VDLIST= <DDDDDDDDDDDDDDD>
##$VPLIST= <PPPPPPPPPPPPPPP>
##$VTLIST= <TTTTTTTTTTTTTTT>
##$WBST= 1024
##$WBSW= 4
##$XGAIN= (0..3)
0 0 0 0 
##$XL= 0
##$YL= 0
##$YMAX_a= 268551
##$YMIN_a= -385347
##$ZGOPTNS= <>
##$ZL1= 120
##$ZL2= 120
##$ZL3= 120
##$ZL4= 120
##$ABSF1= 10
##$ABSF2= 0
##$ABSG= 5
##$ABSL= 3
##$ALPHA= 0
##$AQORDER= 0
##$ASSFAC= 0
##$ASSFACI= 0
##$ASSFACX= 0
##$ASSWID= 0
##$AUNMP= <proc_1d>
##$AZFE= 0.1
##$AZFW= 0.1
##$BCFW= 1
##$BC_mod= 2
##$BYTORDP= 1
##$COROFFS= 0
##$CY= 11.3945322036743
##$DATMOD= 1
##$DC= 2
##$DFILT= <>
##$DTYPP= 0
##$F1P= 2.36226072786647
##$F2P= -0.459571619588291
##$FCOR= 0.5
##$FTSIZE= 0
##$FT_mod= 4
##$GAMMA= 1
##$GB= 0.15
##$INTBC= 1
##$INTSCL= 1
##$ISEN= 128
##$LB= 0.24
##$LEV0= 0
##$LPBIN= 0
##$MAXI= 10000
##$MC2= 0
##$MEAN= 0
##$ME_mod= 0
##$MI= 1.114404
##$NCOEF= 0
##$NC_proc= 0
##$NLEV= 6
##$NOISF1= 3.799351
##$NOISF2= 2.8
##$NSP= 1
##$NTH_PI= 0
##$NZP= 0
##$OFFSET= 15.70392
##$PC= 1
##$PHC0= -18031.88
##$PHC1= 11.40075
##$PH_mod= 1
##$PKNL= yes
##$PPARMOD= 0
##$PSCAL= 0
##$PSIGN= 0
##$REVERSE= no
##$SF= 200.130013532006
##$SI= 16384
##$SIGF1= 3
##$SIGF2= 2
##$SINO= 400
##$SIOLD= 16384
##$SREGLST= <1H.CDCl3>
##$SSB= 0
##$STSI= 0
##$STSR= 0
##$SW_p= 3612.71676300578
##$SYMM= 0
##$S_DEV= 0
##$TDeff= 0
##$TDoff= 0
##$TI= <>
##$TILT= no
##$TM1= 0
##$TM2= 0
##$TOPLEV= 0
##$USERP1= <user>
##$USERP2= <user>
##$USERP3= <user>
##$USERP4= <user>
##$USERP5= <user>
##$WDW= 1
##$XDIM= 8192
##$YMAX_p= 0
##$YMIN_p= 0
$$ End of Bruker specific parameters
$$ ---------------------------------
##NTUPLES= NMR FID
##VAR_NAME=  TIME,          FID/REAL,        FID/IMAG
##SYMBOL=    X,             R,               I
##VAR_TYPE=  INDEPENDENT,   DEPENDENT,       DEPENDENT
##VAR_FORM=  AFFN,          ASDF,            ASDF
##VAR_DIM=   8192,          8192,            8192
##UNITS=     SECONDS,       ARBITRARY UNITS, ARBITRARY UNITS
##FACTOR=    0.0002768,     1,               1
##FIRST=     0,             0,               0
##LAST=      2.2672688,     0,               0
##MIN=       0,             -385347,         0
##MAX=       2.2672688,     268551,          0
$$ Real data points
##PAGE= N=1
##DATA TABLE= (X++(R..R)), XYDATA
$$ [...]
2134A62M37j502K110j217n56K009j672L15K93r34J437r69n66J895j994K39J276
$$ 162 599 -903 1207 -10 -566 1443 -229 86 379 -555 882 -87 -653 1242 -752 -513 763
2151G63j738J009k41m84J378j502M86J382k210J381J63j073J251j047P53J157
$$ 763 -975 34 -207 -691 687 -815 -329 1053 -1157 224 387 -686 565 -482 271 1428
2167A428k556J267R86j545J063n17K0P00j947J514K44j880J747l86o77P74j118
$$ 1428 -1128 139 1125 -420 643 126 146 846 -1101 413 657 -1223 524 138 -539 235 -883
2184h83J220J73j904K097p06q21J445j375Q83J64j115J605n98j114K053j244r
$$ -883 337 510 -1394 703 -3 -824 621 -754 129 293 -822 783 185 -929 1124 -120 -129
2201a29R70j206J356p50r15J992k036K42J657k142J228k54n96J329j706K90J617
$$ -129 841 -365 991 241 -674 1318 -718 -476 1181 -961 267 13 -583 746 -960 -670 947
2218I47j900M09P11r82J296j144N73J131j957R06J122j830J246m21m07J369j911
$$ 947 -953 -544 167 -815 481 -663 -90 1041 -916 -10 1112 -718 528 107 -300 1069 -842
2235h42J214N63j803J429l43o12J227j405R93K0j689J793n22r13J212r03K05P80
$$ -842 372 935 -868 561 218 -394 833 -572 421 441 -1248 545 23 -890 322 -581 -376 404
2253D04j487J542l96j113K177j267m40J343j236J242n87r90K078j440l85J809
$$ 404 -1083 459 63 -1050 1127 -140 -580 763 -473 769 182 -808 1270 -170 -555 1254
2269A254j706P74K56j049J474j520j34J664j814K34Q81j145J364j090o4J469j947
$$ 1254 -452 322 578 -471 1003 -517 -651 1013 -801 -567 314 -831 533 -557 -621 848 -1099
2286a099R75Q96j402P50P3n80J064j414O43J182k120J479L3p88J243j316O12M83
$$ -1099 -124 772 -630 120 193 -387 677 -737 -94 1088 -1032 447 480 -308 935 -381 231 714
2304G14j439R65K31j386J609j067L15K56j219J512k77j583K096q71n05J170j006
$$ 714 -725 240 471 -915 694 -373 -58 198 -1021 491 214 -1369 727 -144 -649 521 -485
2321d85P97j74r09J941j315l97J612j191J31L57r25J644r77o39J647j726M86O50
$$ -485 312 138 -771 1170 -145 -542 1070 -121 10 367 -558 1086 109 -530 1117 -609 -123 527
2339E27j087J119p05l77J266j689M72J339j744Q96J29p57J389j421L97R75j659
$$ 527 -560 559 -146 -523 743 -946 -474 865 -879 17 146 -611 778 -643 -246 729 -930
2356i30J263J76j123J054o69L01R99j599J028K40j487J284m26m45P67r40Q37M1
$$ -930 333 509 -614 440 -229 72 1071 -528 500 740 -747 537 111 -334 433 -507 330 371
2374C71j379J816p38p66J254j142M95l1o05J401p17q92J807j170J06M17p57J419
$$ 371 -1008 808 70 -696 558 -584 -89 -120 -725 676 -41 -933 874 -296 -190 227 -530 889
2392H89p36q98J839j331R4P41j082J063o34m44J536j389j98J484j582R47l50q53
$$ 889 153 -745 1094 -237 -143 598 -484 579 -55 -499 1037 -352 -550 934 -648 299 -51 -904
2410i04J314j095K45J092j392Q83M02j288J286q05p8R29j081Q90N5j177J391l94
$$ -904 410 -685 -440 652 -740 143 545 -743 543 -262 -340 589 -492 398 453 -724 667 273
2428B73n35J062j317M94N34j415J570n24j127J510j076N31M75j245J404q05n95
$$ 273 -262 800 -517 -23 511 -904 666 142 -985 525 -551 -20 455 -790 614 -191 -786
2445g86J345j162M19O95j211Q93j02q49J731j106p3P29o76N72p7p99J520j079
$$ -786 559 -603 -184 511 -700 193 91 -758 973 -133 -206 523 -153 419 342 -457 1063 -16
2463a6j41J050j313P18r5j006J406p91j96R61j182P27P2j071J207l92p59J586
$$ -16 -157 893 -420 298 203 -803 603 -188 -384 577 -605 122 194 -877 330 -62 -821 765
2481G65j362O81M46j054J026l25o89J505j181K05R06j330J228p28k84R56j045
$$ 765 -597 84 530 -524 502 177 -512 993 -188 17 923 -407 821 93 -191 765 -280
2498b80R7Q58j172P32j03p12J244j149OJ054j135Q84m02p74J322p12j38J120j201
$$ -280 -183 675 -497 235 132 -580 664 -485 -479 575 -560 324 -78 -852 470 -242 -380 740 -461
2517d61O24J81q76J221r79l7Q98j190J020K65j229J419o30p70J390j407M95L44
$$ -461 163 344 -532 689 -290 -327 571 -619 401 666 -563 856 226 -544 846 -561 -66 278
2535B78j036J091m36m54J305r80l40J006j255J045m2q44J178j100L46J187j380
$$ 278 -758 333 -103 -557 748 -232 -572 434 -821 224 182 -662 516 -584 -238 949 -431
2552d31O88q7o29J277r38j43J134j294O66J08o94P57m61k46J046j537N16N67p93
$$ -431 257 170 -459 818 -120 -263 871 -423 243 351 -343 414 -47 -293 753 -784 -268 299 -494
2571d94O83l80k84Q78j195N65Q17j525J224k17o44J316j073N63M84j422J248n9
$$ -494 189 -191 -475 403 -792 -227 590 -935 289 72 -572 744 -329 234 718 -704 544 485
2589D85j051J239p80J0P99j139J042l80p13J093q55P2P16j120P03l4r32J257n45
$$ 485 -566 673 -107 -97 702 -437 605 225 -488 605 -250 -178 538 -582 121 87 -845 412 -133
2608a33n25J344j181O78K09j105J408r05L1J072j356N98M02r51P03n11J8J186
$$ -133 -658 686 -495 183 392 -713 695 -210 -179 893 -463 135 537 -414 289 -222 -204 982
2626I82j125K77M17j125P81m88o1Q25j277L13R66j258P74j40m68R50r05M65P95
$$ 982 -143 134 551 -574 207 -281 -342 483 -794 -481 485 -773 1 -139 -607 343 -562 -97 698
2645F98j568J062M2o32R28n97j85Q39j117P83K23r31J072p73m1O01q90P98j7q87
$$ 698 -870 192 234 -398 530 -67 -252 587 -530 253 476 -455 617 -156 -197 404 -486 312 295 -592
2665e92R22n57o0O99q56L76K0p37J049m71k65J104j179L98M10o27J050o93k72
$$ -592 330 -227 -287 412 -444 -68 -48 -785 264 -207 -472 632 -547 -149 261 -366 684 -9 -281
2684b81J244j325K77Q78r69N03N4o89J025j284O41N43j084M03K84l07L47r28K86
$$ -281 963 -362 -85 793 -176 327 381 -308 717 -567 74 617 -467 -64 220 -87 260 -668 -382
2703c82R88j390P98K40o50O46n64L81M82j307J055M23j376J343p90j47J061j304
$$ -382 606 -784 14 254 -396 250 -314 67 549 -758 297 720 -656 687 -103 -250 811 -493
2721d93P48J25p44O38l80j78O08o45j5L08o12R77m42m17J040j137L74M18p52P93
$$ -493 255 380 -364 274 -106 -284 324 -321 -336 -28 -640 337 -105 -522 518 -619 -245 173 -579 214
2741B14k29m39J157r39k51J067q21N45l1l36Q76j018j39J317j299L22M95p08Q57
$$ 214 -15 -454 703 -236 -487 580 -241 304 273 -63 813 -205 -344 973 -326 -4 491 -217 640
2760F40j127o0J161j316N08O75j132Q74m90J37P41j373N69Q69j284Q95q1m08P56
$$ 640 -487 -547 614 -702 -194 481 -651 223 -267 -130 611 -762 -193 676 -608 287 206 -202 554
2779E54n57P9O53r20N25k07n81J054m97p0L89q34R07l73m58R10r47j48P39p01
$$ 554 -3 76 729 -191 334 127 -454 600 103 33 422 -412 495 122 -336 574 -373 -521 218 -483
2799d83O36k72n81J300r89l3Q25p34M91p9k90P45q03L5N72n49K87M29o47Q64q10
$$ -483 153 -119 -700 600 -389 -422 403 -331 160 81 -209 536 -267 -232 340 -209 78 507 -140 724 -86
2820h6r2R59j466L57P63r21P56m44k20P26r33L39N00r82O32L13o22J112r21K85
$$ -86 -178 781 -685 -328 435 -486 270 -174 -394 332 -601 -262 238 -744 -112 201 -421 691 -230 55
2840E5N23q30N34N8o45P20p96L09O94r63N78ln76Q71o31k49O49n95O30k96p95
$$ 55 578 -252 282 340 -305 415 -381 -72 622 -341 237 234 -342 529 -102 -351 298 -297 333 37 -758
2861g58R03m20l62J158p49K34k5n33Q17j84k79R17j001K32N00n96L98L7k80O12
$$ -758 145 -275 -637 521 -228 6 -19 -552 265 81 -198 719 -282 -50 450 -146 252 289 9 621
2881F21n99j40P68r19N16k83l61P20o33n4P29j073P05K9n76P09n54J14P43j022
$$ 621 22 -118 650 -269 247 -36 -397 323 -310 -364 365 -708 -3 26 -550 159 -395 -281 462 -560
2901e60O67p2l51O28n66J3P38q57Q97l46m29Q51m85k38N68n47jK77m75P61n33
$$ -560 107 35 -316 312 -254 -241 497 -360 537 191 -238 613 128 -110 458 -89 -90 187 -288 473 -60
2922f0m99J199j002k28O43m99J001q45k84Q60n23j74Q00q69O82j59l88R68p68
$$ -60 -559 640 -362 -590 53 -446 555 -290 -574 286 -237 -411 389 -480 202 43 -345 623 -145
2941a45k36J104r01J89L71o17P07p47M8P62r34M04K38o63O20l73o55J397r76N87
$$ -145 -381 723 -178 11 382 -235 472 -275 -227 535 -399 5 243 -420 200 -173 -828 569 -407 180
2961A80p1q87R24l05j52P27q07J15P31p33O06m12j50J053j078K48L92p33P30j38
$$ 180 109 -778 146 -159 -311 416 -391 -276 455 -278 328 -84 -234 819 -259 -11 381 -352 378 240
2981B40o22J030p63k61O90q23N81k92j92Q45o68j71M38n24N31Ln91Q95o40J03
$$ 240 -382 648 -115 -376 314 -509 72 -220 -412 433 -235 -406 32 -492 39 42 -549 346 -294 -191
3001a91N77q16O56j7l49N56n57K11N41o64j03M87o22Q68o44j63N69n11j91Q93
$$ -191 386 -430 226 209 -140 416 -141 70 611 -53 -156 331 -291 577 -67 -230 339 -172 -363 530
3021E30j075P10k10k92Q66r74R6P76r24O52j62l95Q46r22N28L22o76N33j67k49
$$ 530 -545 165 -45 -337 529 -445 -349 427 -497 155 -7 -402 444 -478 50 372 -304 229 62 -187
3041a87O87m29p7N45r26N92K3n76Q08p51kR81j018M08J7p30O86m27J86O60p39
$$ -187 500 71 -6 539 -387 205 228 -348 460 -291 -293 688 -330 78 95 -635 51 -376 -190 470 -269
3062b69L0N48n97M97j79k75Q56n07K0M22q81O35j13l71Q15p38lM43r44O26k03
$$ -269 -239 309 -288 209 30 -245 611 104 124 546 -335 300 187 -184 631 -107 -110 333 -611 15 -188
3083a88k86O82m12j31P86q97M90K0o33R40o76J22N58o93J71L60m40M71k43j45
$$ -188 -474 208 -204 -335 451 -446 44 64 -569 371 -305 -183 375 -318 -147 213 -227 244 1 -144
3103a44O41q39M49J74q31R85n52k33Q41q55L29L55p81N26l49M5N05p36N15L41
$$ -144 497 -342 107 281 -550 435 -117 -350 491 -364 -35 320 -461 65 -284 -239 266 -470 45 386
3123C86r24P36j84j12N18q32K37L71l96L33K4m58M24N5n0O76j231Q22l59l34P42
$$ 386 -538 198 14 -98 420 -412 -175 196 -200 133 157 -301 123 178 128 804 -427 395 36 -298 444
3144D44o39J70K29n84O98k75p10Q83l70p5L11p45M42N75r30P49m06J78M70n16
$$ 444 -195 -25 204 -380 318 43 -667 216 -154 -229 82 -663 -221 354 -576 173 -233 -55 415 -101
3164a01J38M30q57N72k83j9P71q09J63O40j135N57j26j95P29o24O8N99q76N52
$$ -101 37 467 -390 182 -101 -120 651 -158 5 645 -490 67 -59 -254 475 -149 -81 518 -358 194
3184A94J8n99O42n65K27N62j068N93K73n83O21m34j37O90o57L70K35p68R54k15
$$ 194 212 -387 255 -310 -83 479 -589 4 277 -306 315 -119 -256 434 -223 147 382 -386 568 353
3204C53m40N29q24L02L19n70P13m28l57R31j056M61N19q46P04m98j77O61o86L03
$$ 353 -87 442 -382 -80 239 -331 382 -46 -403 528 -528 -67 452 -394 310 -188 -365 296 -390 -87
3224h7M81q25P45l68l92J031o79P0N29p81M62J30n37N06k16j41M82j120P07J82
$$ -87 394 -431 314 -54 -446 585 -94 -24 505 -276 186 316 -221 285 69 -72 410 -710 -3 179
3244A79l42N27p49J68P09j092N74J09o50N76J91o28Q12o85J22N77p18N62J47m29
$$ 179 -163 364 -385 -217 492 -600 -26 83 -567 9 200 -428 384 -301 -179 398 -320 242 389 -40
3264d0N04o47J80J82q38J103P0r91R07n74j1L18p03Q08p6m45N96m39l12O48m87
$$ -40 464 -183 -3 179 -659 444 514 -477 430 -144 -155 163 -540 268 192 -253 343 -96 -408 240 -247
3285b47L87j33l47O14n07K37M73q44L58K17n21O37k93j15N14p95M68L77j087R88
$$ -247 140 7 -340 274 -233 4 477 -367 -9 208 -313 324 31 -84 430 -365 103 480 -607 381
3305C81l46k4M25q55L34L48o59L24r8j33O34n67J44N75r62P10l55j53Q30o26j34
$$ 381 35 11 436 -419 -85 263 -396 -72 -170 -303 331 -236 -92 483 -479 231 -124 -277 553 -73 -207
3326b07O02n54K82M5k29M37l17J46L59o94N12k23o94R08q05K99J61o57N21j15
$$ -207 395 -159 123 168 -61 376 59 205 564 -130 382 159 -535 373 -432 -133 28 -629 -108 -223
3346b23k18O97l99l05J037q70J50K65o21O27l14k17R47p57L89J66o88P01l79q6
$$ -223 -441 256 -143 -448 589 -281 -131 134 -487 140 -174 -391 556 -201 188 354 -334 367 -12 -98
3366i8L49k10K31J59q27N56j04k06L92o81L85L48q33O09j32m36Q28o02J49L48
$$ -98 251 41 272 431 -396 160 56 -150 242 -439 -54 294 -539 70 -62 -498 330 -272 -123 225
3386B25n12K79J13l14O79m40M7L36n59J73K99o59Q68m63p1L93l71n7J66m38O71
$$ 225 -287 -8 105 -209 470 30 77 413 -146 27 326 -333 535 72 1 394 23 -34 132 -306 365
3407C65m79k16P82o76J46J2l49M57r1n19Q81n26j4L11j76K08p2l24Q56p59K55
$$ 365 -114 -330 452 -224 -78 -66 -415 42 -49 -568 313 -213 -227 84 -92 116 44 -280 576 -183 72
3428G2O36j079M25K64j04M15q49J60L94q81M63R3l36N74n26M2L40l96L36J47p22
$$ 72 708 -371 54 318 214 629 -220 -60 334 -547 -84 9 -327 247 -279 -237 103 -293 43 190 -532
3449e32Q33m69P6M61m76J01P1k96N79k04l71N66j70qK92n29N70n10l18R08p69
$$ -532 301 -168 -92 369 -107 -6 65 -231 348 144 -227 339 169 161 453 -76 494 -16 -334 574 -195
3470a95j22P23p99M22j54m05P06o10J12P14q19M57j42n24J074p00P6L71m08K59
$$ -195 -317 406 -393 29 -125 -530 176 -434 -322 392 -427 30 -112 -636 438 -262 -186 185 -223 36
3490C6L17o13O34l73ML65m29K23K11p67N49k61J64L36n54j9L91l69L53k06l02
$$ 36 353 -260 374 1 5 370 -59 164 375 -392 157 -104 60 396 -158 -177 214 -155 198 -8 -310
3511c10M16k18QK76l15L96m88m5O50n68J52K70n74N02p3m14O60m19K71J23l08
$$ -310 106 -112 -104 172 -143 253 -235 -280 370 -198 -46 224 -350 152 79 -335 325 -94 177 300 -8
3532hkL30m42M16m90j36M95n17K73K31p54O84k37J12N18p69L54l34K02K94l37
$$ -8 -10 320 -122 294 -196 -332 163 -354 -81 150 -604 80 -157 -45 473 -296 58 -276 -74 220 -117
3553a17j30M21m76M84K8k31L40k16k25O04m11L3J41m43J30q3q5K30k82l0L87k27
$$ -117 -247 174 -302 182 210 -21 319 103 -122 482 71 104 245 -198 -68 -151 -236 -6 -288 -318 69 -158
3575a58L24L5n16O99o07K10J55n64N05N6l08M75k93J34L35m45J9J54m94K44J15
$$ -158 166 201 -315 384 -223 -13 142 -422 83 139 -169 306 13 147 482 37 56 210 -284 -40 75
3596G5l11L97m29J83J71l27M54m74J7M95l75j23O93o78K94p8n02O23k39o8L90
$$ 75 -236 161 -268 -85 86 -241 213 -261 -244 251 -124 -247 446 -232 62 -16 -518 105 -134 -202 188
3617A88k21L23m04m3N47n90P2M84n67N42k12n86Q08n73J30J62k10R3Q6m08O31
$$ 188 -33 290 -114 -157 390 -200 -128 356 -211 331 119 -467 341 -232 -102 60 -150 -57 29 -379 252
3638B52n83L31M36q21J93N33o68M65k78J03J49m84M07kj77M70p8j82L82l62k22
$$ 252 -331 0 436 -385 -192 341 -327 138 -140 -37 112 -372 35 33 -144 326 248 66 448 86 -136
3659a36M46n08M88k50m98P83n80J74J58m78M69p5k53M64j36k51N29o56N35k87
$$ -136 310 -198 290 40 -458 325 -255 -81 77 -401 68 -7 -260 204 68 -183 346 -310 225 -62
3679f2j54O29k71o34O72k08J22J90p54O99l16K54l3o2l9k9k99M03k02k25N78m35
$$ -62 -216 413 142 -492 180 -28 94 284 -470 229 -87 167 134 72 33 4 -295 108 -94 -319 259 -176
3701a76N7J15k69L16k51r6P05o04K86J19l88M48j47n2K85n38K96Ll72K42K29k77
$$ -176 -119 -4 -273 43 -208 -304 401 -203 83 202 -186 262 115 63 348 -190 106 109 -263 -21 208 -69
3723f9Q1R4p3J78k76K76M8l87J66k3l74Q04n53J23O1k02LJ49k70L23j31J23P3
$$ -69 12 106 33 211 -65 211 259 -128 38 15 -359 445 -108 15 76 -126 -123 26 -244 79 -52 71 144
3746A44l55K65q0l14N51p4k2j44P8P3j5r5L47m76k7L45l41K80n4k12K12k75Q5
$$ 144 -211 54 -26 -340 211 137 115 -29 49 122 107 12 359 -117 -144 201 -140 140 86 -126 86 -189 -104
3769a04K33l93K20m9k89O37k29l12N72m91P01k98n36M08q8m7J85l20J78J25l62
$$ -104 129 -264 -44 -93 -382 255 26 -286 286 -205 496 198 -338 70 -18 -65 120 -200 -22 103 -259
3790b59O16n69L5J40j41K17r9k60K28l0L4M19m69J06K14k74J67N8m85M51j03K09
$$ -259 357 -212 -177 -37 -178 39 -60 -320 -92 -122 -88 331 -138 -32 182 -92 75 133 -352 99 -4 205
3812B05K18o28M40K7n24O58l76kJ55l06q0K11k60M79k92N6K11l22N9o1k02K20
$$ 205 423 -205 235 262 -262 396 20 18 173 -133 -213 -2 -262 217 -75 -19 192 -130 -71 -132 -334 -114
3834a14M7k23M95l49k72L62k11L03r0j00L27P5j30N9k78J1K22l24O33r67N38L5
$$ -114 -67 -290 205 -144 -416 -54 -265 38 -52 -152 175 250 120 179 -99 -88 134 -190 443 -524 14 49
3856D9k19L09O8n56N58l14j13K32k74J23K25k84L76m56J45L30l42L9K74m49L35
$$ 49 -170 139 207 -349 209 -105 -218 14 -260 -137 88 -196 180 -276 -131 199 -143 -104 170 -279 56
3877E6m1nK06l08o8M30l98L74l62j22M55k86n4L20k61K86l35j74N70n45K85J3
$$ 56 15 10 216 -92 -160 270 -128 246 -116 -238 217 -69 -123 197 -64 222 -113 -287 283 -262 23 36
3899C6K9J29l49l4N21k33n0K40m46J73j7j81K95R0j67k9o4Q7L29p92P40k99j64
$$ 36 65 194 -155 -189 332 99 49 289 -157 16 -1 -182 113 203 36 7 -57 30 359 -433 307 8 -156
3922a56O46p60K01J26n61N04l11L06J85m00j11N11l52L15nk03L47m46J80K37k67
$$ -156 490 -270 -69 57 -504 0 -311 -5 180 -220 -331 180 -172 143 138 -65 282 -164 16 253 -14
3943a4K90l07l77O05j60J56p0k08K11L4l93N83m78j3K81n11L89j01j6K36j77m1
$$ -14 276 -31 -408 197 37 193 123 -85 126 160 -233 350 -128 -141 140 -371 18 -83 -99 137 -40 -81
3965h1L95m84K23q6j54L23j90RL08m23j3N32o06J63K8k41M86j51N8J71n67K72
$$ -81 314 -170 53 -33 -187 136 -54 -45 263 -160 -173 359 -247 -84 -56 -297 189 38 96 267 -300 -28
3987b8j40n0L13q4JJ10m00L65J09n10M88m68J93M68m73L02m92n2M27j68p0L61
$$ -28 -168 -218 95 11 12 122 -278 87 196 -314 174 -294 -101 367 -106 196 -296 -348 79 -89 -159 202
4009B02l64J14J83m94N82n27O3M47m57J63j69O2L26n2l58K27j13J23M0j83K23
$$ 202 -162 -48 135 -359 223 -304 -241 206 -251 -88 -257 -195 131 79 -279 -52 -165 -42 -2 -185 38
4030C8j68q4M48r5j84K04k71J80M6j05J94k70P7K02k81J09J09l73M72k21k88N18
$$ 38 -130 -214 234 139 -45 159 -112 68 114 9 203 -67 10 212 -69 40 149 -224 248 27 -261 257
4052B57k82j5K28m30K96r6k68M41j72N2m0j85L21j78N9K92l10K66n8q1P3r8k16
$$ 257 -25 -40 188 -242 54 -42 -310 131 -41 11 -29 -214 107 -71 -12 280 -30 236 178 97 170 72 -144
4075a44L47k71m7LJ58J48j35k51K37j21R8Lk62L25r7k48N54n14j48P68l87J41
$$ -144 203 -68 -115 -112 46 194 59 -192 45 -76 22 25 -237 88 -9 -257 297 -217 -365 403 16 157
4097A57p8l18M52j53j88M67n02M60j5m05L70l31J34j12j91M85j23j55N1j18%R2
$$ 157 79 -239 213 60 -128 339 -163 297 282 -123 247 -84 50 -62 -253 232 109 -46 5 -113 -113 -21
4119b1o6Q3K19l19N22l28j91L00m02L18N8p33P04q1j06M15l74L52q1l82K13j0
$$ -21 -87 -4 215 -104 418 90 -101 199 -203 115 173 -560 144 63 -43 372 -2 350 269 -113 100 90
4141I0k41L21l9pp9K9j65K67l79L00j58k23M02k66K65j84K5Q7p9j35M82m27J62
$$ 90 -151 170 131 124 45 74 -91 176 -203 97 -61 -284 118 -148 117 -67 -42 45 -34 -169 313 -114 48
4164D8k1m00P17k28k34K54j63L0m4M0Q0j33K33j02l60J92J77l40J43J3R9Q8l2
$$ 48 27 -373 344 116 -118 136 -27 3 -41 -1 79 -54 179 77 -283 -91 86 -254 -111 -98 1 89 57
4187E7K2L3n13N98n3n15Q67n18R2K71m55J39p7M0M6p0j90M73m63L07j60k08M41
$$ 57 79 112 -401 197 144 -371 496 -22 70 341 -114 25 -52 -12 34 -36 -226 247 -216 91 -69 -277 164
4210A64j45j12Q1j37PK74o58M97p3n8K69k53L47k34R0q2K84l39J63l48L10K10
$$ 164 19 -93 -12 -149 -142 132 -526 -29 -102 -160 109 -144 203 -31 59 -23 261 -78 85 -263 47 257
4232B57o67M74O5k22K34l31J48L4k58L98Oj03J01l91M25J01l38j9j62N4N05n43
$$ 257 -410 64 129 -93 141 -190 -42 -8 -266 132 138 35 136 -255 170 271 -67 -86 -248 -194 311 -232
4254b32J9L4M1J83k03l9K40m4O1r6k09J92L0k62M66n4l22M61k77J40q0k21J05
$$ -232 -213 -179 -138 45 -158 -197 43 -1 60 -36 -245 -53 -23 -285 181 127 -195 266 -11 129 49 -172 -67
4277f7K23j81j79J6K02M3l28K21j65j27N54j14k72K19n6J99j60n5K54k43k11M75
$$ -67 156 -25 -204 -188 14 57 -271 -50 -215 -342 212 98 -174 45 -11 188 28 -27 227 -16 -227 248
4299B48o39P00k25m6K17k36j63K02j6%J08m67M04l97J31K46k36J89Q4j05K4k22
$$ 248 -391 309 84 38 255 19 -144 58 42 42 150 -317 87 -310 -179 67 -169 20 104 -1 23 -199
4321a99k7P37p76K13L67o84M38n1p1L5J52J09L3l76L07Rl49M45n60m5M64l61J67
$$ -199 -226 511 -265 -52 315 -369 69 18 -53 -18 134 243 276 -100 207 216 -133 312 -248 -293 171 -190 -23
4344b3Q0l79M54j96L6j0k0K24j93K3L03k81j86M00l70Q5K00l87L17J61l43J89
$$ -23 57 -322 132 -64 -28 -38 -58 166 -27 -4 299 18 -168 232 -138 -53 147 -240 77 238 -105 84
4366H4m30K75K12l12l8M17o14N41k51k30L59j70N21m95l4L09j54jK59k02P8k88
$$ 84 -346 -71 141 -171 -209 208 -406 135 -116 -346 13 -157 364 -131 -165 144 -10 -11 248 46 124 -164
4388a64L02m6j97K94m1j01J06j62j33L00j65P1P3k6L9J2o4k8J45k94M6j63N2K39
$$ -164 138 92 -105 189 148 47 153 -9 -142 158 -7 64 137 111 150 162 98 70 215 -79 -33 -196 -144 95
4412I5l58K78p6j71L52l95L43j12j65L76j35r7K12l0j90P6o2K05j91j18J56O1
$$ 95 -263 15 -61 -232 120 -275 68 -44 -209 167 32 -65 147 117 -73 3 -59 146 -45 -163 -7 54
4434E4n8j63o2M53k45k47N00k31K3K32m87P4R0j24L36k62N6M37n19OL17l36J78
$$ 54 -4 -167 -229 224 -21 -268 232 1 24 256 -231 -157 -67 -191 145 -117 -61 376 -143 -137 180 -156 22
4457B2o1J0J76j93O7R5n06O15l02M0K30m88K14N1m2M2r0L4J62j28J04Pk47K28
$$ 22 -39 -29 147 -46 21 116 -390 225 -77 -37 193 -295 -81 -30 -72 -30 -120 -86 76 -52 52 59 -188 40
4481D0J52l08L68j30q5J14k22j9J42k58K78j13j23K97j11P9M8k96K12lk97L20
$$ 40 192 -116 252 122 37 151 -71 -90 52 -206 72 -41 -164 133 22 101 149 -147 65 62 -235 85
4503H5l1r6J10k14J30r6J75J96m31o9M58m25M42r8l38L44j10q0L75m22N1k9p3
$$ 85 54 -42 68 -146 -16 -112 63 259 -172 -241 217 -208 234 136 -202 142 32 -48 327 -95 -44 -73 -146
4526a46M51l43J10k81N5K55O9n15O38j91k94o2L55p7q3J25J8Q6k18J39j81J88
$$ -146 305 -38 72 -209 -154 101 170 -345 293 102 -192 -254 101 24 -59 66 84 170 -48 91 -90 98
4548I8j56M9J80n9j47L36l02j8n4q8M26j22k25K81l16j66L94j9j40O6j37K40l84
$$ 98 -58 -9 171 112 -35 301 -1 -19 -73 -161 265 143 -82 199 -117 -283 111 92 -48 18 -119 121 -263
4571b63L07J46m22L59r9j45O4j08P2J28J14j87o8L41K01l04j44L05l92ML10l78
$$ -263 44 190 -232 127 28 -117 -53 -161 -89 39 153 -34 -102 239 440 136 -8 297 -95 -91 219 -159
4593a59K06L5k2m5j20O4J02l23M15j54m00O62k72J50k31l13M12O6K0j53J70r4
$$ -159 47 82 60 15 -105 -41 61 -262 153 -1 -401 261 -11 139 -92 -405 7 73 93 -60 110 16
4615A6j96N63j72r7J8J36o35M21qq7J54j56K25j16j98K29p2q8K18n4k44L38k56
$$ 16 -180 383 211 114 132 268 -367 54 46 -41 113 -43 182 66 -132 97 25 -63 155 101 -143 195 -61
4638f1j29K93j75J50rm9m2K46k09O4j20n2R3m0O6k8j80M03j64r0L20l87J10J2
$$ -61 -190 103 -72 78 69 20 -22 224 15 79 -41 -93 0 -40 26 -2 -182 221 57 -33 287 -100 10 22
4662B2k08L52k59J3R1j99L61k55m3J89k11L15j36j49J18Pl25L05r8n1J00r1L13
$$ 22 -186 166 -93 -80 11 -188 173 -82 -125 64 -147 168 32 -117 1 8 -317 -12 -110 -161 -61 -152 161
4685A61k41p2M52o07J82L92j87R6k35p9K99k72m8J94j09J21L1k87L73k11P9M7
$$ 161 -80 -152 300 -307 -125 267 80 176 -59 -138 161 -111 -159 35 -74 47 78 -209 164 -47 32 79
4707G9k36M83l46O1J06k09n1L14l27K24J23l52L07k40j9N3J32J3J1k01N2k0n0
$$ 79 -157 326 -20 41 147 -62 -113 201 -126 98 221 -131 176 -64 -83 -30 102 115 126 -75 -23 -43 -93
4730i3j9NL97l31j11J17J25p1KP8j30J75j42J19j7j24O0Q6k15L51p9k61j03J20
$$ -93 -112 -107 290 -41 -152 -35 90 19 21 99 -31 144 2 121 104 -20 40 126 -89 262 183 -78 -181 -61
4754f1K96o8k07k5PL3K11k32L1k05J65j2l8P4J23l13L51j46L3K43l16P8j67pJ35
$$ -61 235 167 -40 -65 -58 -25 186 -46 -15 -220 -55 -67 -105 -31 92 -221 130 -16 17 260 -56 22 -145 -152 -17
4779a7j90LM24k35k61N60l94O7nN5J55j13l09N00m69L60o6l26M37j40l77M74k04
$$ -17 -207 -204 220 -15 -276 284 -110 -43 -48 7 162 49 -260 240 -229 131 65 -261 176 36 -341 133 -71
4802g1J6J14l33K30L9k4J31j62P0j6k72O75k96j4N7l73L88j79m8K27k00O7p2n1
$$ -71 -55 59 -274 -44 -5 -29 102 -60 10 -6 -278 397 101 87 144 -229 159 -20 -68 159 -41 26 -46 -97
4826i7L10k02j67n6J87k19L59R1k57L79l52q1K79O1l57J31k12K90q8k19K97k17
$$ -97 213 11 -156 -212 -25 -244 115 206 -51 328 -24 -105 174 235 -122 9 -203 87 -1 -220 77 -140
4848a40k36K62J79N4M4m4m5pJ23k98M6J28j97l8L90l92L56k67L31p7p0j39K87
$$ -140 -376 -114 65 119 163 119 74 67 190 -108 -62 66 -131 -169 221 -171 185 -82 249 172 102 -37 250
4871B50m22L96k1l45J43K04k68J73j64j12L79k91J15lo3R4q1K9j30J66J22j46
$$ 250 -172 224 203 -142 1 205 -63 110 -54 -166 213 -78 37 34 -29 65 -16 13 -117 49 171 25
4893B5m2n0j07jJ75l47M72j72m8K6r6l4K29j11K07q9j95K54j40K05R3n89M31l1
$$ 25 -17 -67 -174 -175 0 -347 125 -47 -95 -69 -165 -199 30 -81 126 37 -158 96 -44 161 254 -335 96 65
4917F5j46K08j41n6J98k67J80k3l57L36p0j60M61n49L00r2k56J66M07j67m6kJ62
$$ 65 -81 127 -14 -70 128 -139 41 18 -339 -3 -73 -233 228 -321 -21 -113 -369 -203 204 37 -9 -11 151
4940A51ll04K59q1j82M40l76p9L25k08l8N5oJ56l3k48J75q4L10j85j78L18k77
$$ 151 148 -156 103 22 -160 280 -96 -175 150 -58 -96 -41 -47 109 76 -172 3 -81 229 44 -134 184 -93
4963i3K0J56o1K23k72k67M76k28q0P6K8k03K53R0J95n44J52J10J00j45K91l88
$$ -93 -73 83 22 245 -27 -294 182 -46 -126 -50 -22 -225 28 118 313 -231 -79 31 131 -14 277 -111
4985a11K43k17K4J16k33J41M1l44K76J38j07NR6J11j78J27j13L6m2J48j85R9j34
$$ -111 132 -85 -61 55 -178 -37 4 -340 -64 74 -33 -28 68 179 1 128 15 51 9 157 -28 71 -63
5008f3j54K79J26P3K9m84N2J88l7r3J75j64Kq7Q4J11k69K43p1O3J8k75J80J12
$$ -63 -217 62 188 261 290 -194 -142 46 9 -84 91 -73 -71 -158 -74 37 -232 11 -60 3 21 -254 -74 38
5032C8L8L4P8m1P5l48R3j71P9J28K5lk2K65k87J88k19J24q0M1P7l44M8K28J43
$$ 38 76 110 188 147 222 -126 -33 -204 -125 3 28 25 3 268 -19 169 -50 74 -6 35 112 -232 -184 44 187
5057A87k88n7N5q2J54j87L32o5q4mJ09N4o7l60L83J34k37Om3r3J12pK02J3l96
$$ 187 -101 -158 -103 -185 -31 -218 114 49 -35 -39 70 124 57 -303 80 214 -23 -17 -60 -153 -41 -48 154 167 -229
5082b29J20J8M9J54J3r6j76J66N9m23K29J88k9J47k22j81K61L1r8ml26N40k04
$$ -229 -109 -91 -42 112 125 29 -147 19 78 -345 -116 72 43 190 -32 -213 48 79 -19 -23 -349 191 -13
5105a3M3J68n8j85L29j98j8p6l1Q1j94p9J55j66K55J8j24Nl0K84N0j39j74R5k11
$$ -13 30 198 140 -45 284 86 68 -8 -39 42 -152 -231 -76 -242 13 31 -93 -88 -118 166 216 77 -97 -2 -213
5130b13N86m47m6qm0K57k46m1N85n38O1L69m18o1K27k13K90k34J46o1m8j18M59
$$ -213 373 -74 -120 -128 -168 89 -157 -198 387 -151 -90 279 -139 -200 27 -186 104 -130 16 -45 -93 -211 248
5153B48k51J9J41k30Qj30K73K24m73K34r0j38L45j97R4N3k26J84J88k63K6j18
$$ 248 -3 16 157 -73 -65 -195 78 302 -171 63 -27 -165 180 -17 77 130 -96 88 276 13 39 -79
5175g9M0K05j27qj71Q7K7O6j39J15o0O4rKk34J02j58L84j97Q3N0j67K76j12k41
$$ -79 -39 166 39 31 -140 -53 -26 40 -99 16 -44 20 11 13 -221 -119 -277 107 -90 -7 43 -124 152 40 -201
5200b01J87oj17L49k22M4K00k57J11J29l76K27l11L89j95j53J10O3J23N1j12M2
$$ -201 -14 -20 -137 212 -10 34 234 -23 88 217 -159 68 -243 146 -49 -202 -92 -29 94 145 33 75
5222G5J47l07L23j22q6K6QJ2q9R7M2Ok2K39m91J67Q4j15J35j09J2j13n4J77m9
$$ 75 222 -85 238 116 30 56 64 76 -13 84 126 132 110 349 -142 25 109 -6 129 20 32 -81 -135 42 -7
5247gj6k69M43n03K72J30j25j01r9J20K51l02M84k85J57j18qk2J59k29K08K7j96
$$ -7 -23 -292 151 -352 -80 50 -75 -176 -275 -155 96 -206 278 -7 150 32 24 2 161 -68 140 167 -29
5270b9J57J5n2k18K44O6k61kk6K12r4M9r1L6K77m08K18j31mq5j77K66k5j03K70
$$ -29 128 143 91 -127 117 183 -78 -80 -106 106 12 61 -30 6 283 -125 93 -38 -42 -127 -304 -38 -63 -166 104
5295A04m3k1P5j3J15nl39K75j62J27l50K87J3L9L5J8k9m01K39j09J91j74J14J60
$$ 104 61 40 115 102 217 212 -127 148 -14 113 -237 50 63 102 137 155 126 -275 -36 -145 46 -128 -14 146
5319A46j7m00L88j43Q4P7n9o2o0j9K17j89J76j47r3J32q2R3J12m4j75K28j97O4
$$ 146 129 -271 117 -26 58 135 76 14 -46 -65 152 -37 139 -8 -101 31 -51 42 154 110 -65 163 -34 30
5343C0q7k6L55j17k03J20m5k02Q3J06J09N8l22J42j66M48l24K82q6l36M0K64m0
$$ 30 -57 -83 272 155 -48 72 27 -175 -92 14 123 181 -141 1 -165 283 -41 241 155 -181 -141 123 83
5366H3k33K97l08L08o5k39J09J58o3k9J29l40P4J69J8j46j93K58N1L6k19P3Q0
$$ 83 -150 147 -161 147 82 -157 -48 110 47 18 147 -193 -119 50 68 -78 -271 -13 38 74 -145 -72 8
5389HK6j54K30m65M03k30K44N1m4J6m5Q1p1L73n82K76j78J47o6k84K9J37J3J70
$$ 8 34 -120 110 -355 48 -182 62 113 69 85 40 121 50 423 -159 117 -61 86 20 -264 -235 -98 -85 85
5413H5k85O2J56n2p0K29m9O7r5o8J2l89Q2J74J70q0j15J2K72o0j98K35k47K25
$$ 85 -200 -138 18 -34 -104 125 76 143 48 -20 -8 -397 -315 -141 29 -51 -166 -154 118 58 -140 95 -152 73
5437G3j37l0N0j65J13K26j96j90M27p4j90j48K63J67k43m7M1J5J06j19J81oq5
$$ 73 -64 -94 -44 -209 -96 130 -66 -256 171 97 -93 -241 22 189 -54 -101 -60 -45 61 -58 123 117 32
5460C2ql9p1O3k8m7J55K4O3m9l71L37j03J10om0r1J97j18J95j87m6k4j71K01m
$$ 32 24 -15 -86 -23 -51 -98 57 81 144 95 -276 61 -42 68 62 22 -69 128 10 205 18 -28 -52 -223 -22 -26
5486b6k7J40ok66K78j07J6K96n36K14m8P0J44l26L02l6k40L58j08k67M88m29M3
$$ -26 -53 87 81 -185 93 -14 2 298 -238 -24 -72 -2 142 -184 118 82 -158 200 92 -175 313 -116 -73
5509g3n9K98n2J04l78M84l32j96L8J04R3p1l18O52k66l1J96k04Q2Q4j88K59j68
$$ -73 -132 166 114 218 -160 324 -8 -204 -166 -62 31 -40 -358 294 28 -3 193 -11 71 155 -33 226 58
5532E8J6Q9j23j5O1m01M08k03J57J31Nl16M31m39J28m3j42L91j72l3n1K11k99
$$ 58 74 163 40 25 86 -315 93 -110 47 178 183 -133 298 -141 -13 -56 -198 193 21 -12 -63 148 -151
5555a51K63m7J80l23NJ00J46j53J35j98j22N8Q6J22q6j39K81Mk17QJ53p2j0J44
$$ -151 112 65 245 -78 -73 27 173 20 155 -43 -165 -107 -21 101 15 -124 157 161 -56 -48 105 33 23 167
5579A67j05l90K99k11J93R3k10J02K25k64J79j19J29M0j88J52J04m8j8p2l5J24
$$ 167 62 -328 -29 -240 -47 46 -164 -62 163 -101 78 -41 88 128 -60 92 196 148 130 58 23 147
5601A47j52n9O2n7R2J81l78J81n5n8K10j50K9P7l32M79n34K79J70j39j9PLl4K10
$$ 147 -5 -64 -2 -59 33 214 -164 17 -38 -96 114 -36 -7 70 -262 217 -317 -38 132 -7 -26 -19 -16 -50 160
5626A60j76J18j82j77O25n95L65p7j52J10k02J38jQ8r9J00j10M0P6N1k09J17n1
$$ 160 -16 102 -80 -257 368 -227 138 61 -91 19 -183 -45 -46 42 -57 43 -67 -27 49 100 -109 8 -43
5649d3J15j10j38J69q1K90l57K00k93K4K67k49K51N6n2l8j06j8L78j05o9j55r7
$$ -43 72 -38 -176 -7 -88 202 -155 45 -248 -224 43 -206 45 101 49 11 -95 -113 265 160 91 -64 -161
5672a61l3J35J76l7j76o9L54k42M15l78J41m3%j09J02k6j26M26m54K33j27%K53
$$ -161 -194 -59 117 80 -96 -165 189 -53 362 -16 125 82 82 -27 75 49 -77 349 -105 128 1 1 254
5695B54m48L80l4j27n0j55K25J30k71Q5Q4R3j78K12k67K67m7k88L58l33KRM5K09
$$ 254 -194 186 152 25 -25 -180 45 175 -96 -11 73 166 -12 200 -67 200 153 -135 223 -110 -108 -99 -54 155
5719A55J1k49L25l85j60Q8L62k13P9k02K41j61L29k67M5O3o8j12K27J28j90J92
$$ 155 166 -83 242 -143 -303 -215 147 -66 13 -189 52 -109 220 -47 -2 61 -7 -119 108 236 46 238
5741B38l37J04o0j48R4J62j48J27o3J77l23nM06j52O8l8k07K69l0k02PL6k20M95
$$ 238 -99 5 -55 -203 -109 53 -95 32 -31 146 -177 -182 224 72 140 102 -105 164 134 -68 -61 -25 -245 250
5765B50m51L78j72J38r6J05j93j11n6j27M81j97n1J52k51L88k13J45J9k00J80
$$ 250 -201 177 5 143 47 152 -41 -152 -208 -335 146 -51 -102 50 -201 187 -26 119 138 -62 118
5786A18j81l1R0k4j30J23j71N2J70j66J60j7j67N8K01j57J03l11L08l3j86J24
$$ 118 -63 -94 -4 -28 -158 -35 -206 -154 16 -150 10 -7 -174 -116 85 -72 31 -280 28 -5 -191 -67
5808f7p5R9J35m4J35k56Q2L38m09J44n7j64K92k24k4J44J94j9j70j67O7n3M10
$$ -67 -142 -43 92 48 183 -73 9 347 -62 82 25 -139 153 -71 -95 49 243 224 54 -113 -46 -99 311
5831C11m34K38q6m4k23L18Q3m8o3j60J67m5l47L12J94l61J12J28P3j40l7R4nj91
$$ 311 -123 115 29 -15 -238 80 163 115 52 -108 59 14 -333 -21 173 -188 -76 52 125 -15 -52 42 37 -154
5855a54K70r3k22N11m32m4J71p5J41m0k81L45l9m0j23OJ01R3j85k4K50m28M00
$$ -154 116 23 -199 312 -120 -164 7 -68 73 33 -248 97 58 18 -105 -99 2 95 -90 -114 136 -292 108
5878A08m14L71l2k73M07k56K02m5j18j37M28l33J57r6m1K9J91M9l38j1J66R0o3
$$ 108 -306 65 33 -240 167 -89 113 68 -50 -187 241 -92 65 -31 -72 -43 148 197 -141 -152 14 104 41
5901D1j58K53K1r8k89M23k06L8m8l7l9J62m0j74J52j53K61k6k94J45J45k00j3
$$ 41 -117 136 157 59 -230 193 -13 25 -23 -60 -99 63 23 -151 1 -152 109 83 -211 -66 79 -121 -134
5924a34J73J42m10M40j17r9K3K10l55K44%k7j52j83J19P6j07K46Q7k59K48n1j27
$$ -134 39 181 -229 211 94 -5 18 228 -127 117 117 90 -62 -245 -126 -50 -157 89 176 -83 165 114 -13
5947a3K91n32j8L83k71J13o3mL5j5J40j09l7J75O5q8Q6j46N7M8m9K59m57J25j20
$$ -13 278 -254 -272 111 -160 -47 -110 -114 -79 -94 46 -63 -100 75 140 52 138 -8 49 97 48 307 -150 -25 -145
5972a45J43K34j48m1L1r1J36M0j25k85J92J12K57m88j62Q0L95j9k70J02j4J5r3
$$ -145 -2 232 84 43 74 -17 119 159 34 -251 -59 53 310 -178 -340 -260 135 116 -154 -52 -66 -51 -144
5995a44L14l29L26o6k21KK31j17M2q3j5j06K09j34L53n67L58J6k38J48M6P8p8
$$ -144 170 -159 167 101 -120 -118 113 -4 38 -45 -60 -166 43 -91 262 -305 53 69 -169 -21 25 103 25
6018B5j7q8J78n0J41n0j2j22j02J41j09j10JJ78j18J11jK78k91Q5NK7qk21K0K54
$$ 25 8 -80 98 48 189 139 127 5 -97 44 -65 -175 -174 4 -114 -3 -4 274 -17 68 73 100 92 -129 -109 145
6044A45k04K8L03j64m4l03L46j37Jr2J29jo9J33j61K93j18n8J42m22L4L39r3J40
$$ 145 -59 -31 272 108 64 -239 107 -30 -29 -121 8 7 -62 71 -90 203 85 27 169 -253 -219 120 27 167
6068A67k76r4K51p2J88j30K04o2k82J85Ql05r4O57k95k67N47m08J81l87L54j77
$$ 167 -109 -203 48 -24 164 34 238 176 -106 79 87 -218 -312 345 50 -217 330 -78 103 -284 70 -107
6090a07q2J72L17j76J34j38l92N43j72J23l24J59J26o1k76J39k08L06n5J42n5
$$ -107 -189 -17 300 124 258 120 -272 271 99 222 -102 57 183 122 -154 -15 -223 83 28 170 115
6111A15j22Q4p8q7J20n4k69L75J22o0k73o1p2M14K6k81M0j26L00J00j24j73k2
$$ 115 -7 77 -1 -88 32 -22 -291 84 206 146 -127 -188 -260 154 180 -101 -61 -187 113 213 89 -84 -106
6134a06K61k15N5L1k8K9J20k17k78L77P1j91O7j56m8J32L88l20R8q3J03j54M00
$$ -106 155 -60 -5 26 -2 27 147 -70 -348 29 100 -91 -24 -180 -228 -96 292 -28 70 -13 90 -64 336
6157C36k60Nj0Lp0J21j03j7P2j06Q6r7j4Q5L5n7j79L19r9J81Nk42j01lO3r0J82
$$ 336 76 81 71 74 4 125 22 5 77 -29 57 -40 -54 31 66 9 -170 149 50 231 236 -6 -107 -110 -47 -137 45
6184D5k05J65l77J07L87j2j82L1QK15j57NJ76k64l8K14l43K60J85l95N33n25J83
$$ 45 -160 5 -372 -265 122 110 -72 -41 -33 182 25 30 206 -58 -96 118 -225 35 220 -175 358 -167 16
6207A6J9k31Q7J47l5j84jJ95L3K16p7L0l35J7Q0l0j21K80k26L9o3K3Q6J46O0j70
$$ 16 35 -196 -109 38 3 -181 -182 13 46 262 185 215 -120 -103 -23 -53 -174 106 -120 -81 -144 -121 -35 111 171 1
6233AkK2J19k52K98k96L07r7k52m3K82j50N8k8J05j87K5J02l5J02J9j72J80j18
$$ 1 -1 21 140 -112 186 -110 197 100 -152 -195 87 -63 -5 -33 72 -115 -90 12 -23 79 98 -74 106 -12
6257a2k5K41j28o7L1K87m78K22j8J5j46k11K86j6M6q3K10J47l71m0K30k51K39
$$ -12 -37 204 76 9 40 327 -151 71 53 68 -78 -289 -3 -19 27 -56 154 301 -70 -110 120 -131 108
6280A08l9j28K78l90K83M4j24l49N12l95N79m98P2J04O7j43K03j91L7O0j7ok17
$$ 108 69 -59 219 -171 112 156 32 -317 195 -200 379 -119 -47 57 124 -19 184 -7 30 90 73 67 -150
6303a50K40K07l04Jj05J5J52n36L55K01j49K13k99RQ6K26p3J12j57j26K29m24
$$ -150 90 297 -7 -6 -111 -96 56 -480 -125 76 -73 140 -159 -150 -64 162 89 201 44 -82 147 -277
6325b77J30J67pP9j75K69R1m87J79J14r0j52J3Q5J59k36q7N99l44J14J4Nk32J08
$$ -277 -147 20 13 92 -83 186 277 -210 -31 83 -7 -159 -146 -61 98 -138 -225 374 30 144 158 163 -69 39
6349C9O8j69K7K92j75r3J24j22k7K61q6j5q1J60M0l36r5K37r0K51k45N0J43l91
$$ 39 107 -62 -35 257 82 -11 113 -9 -36 225 139 124 43 203 243 -93 -188 49 -41 210 -35 15 158 -233
6373b33L21l85K78J12l88K69P0j78K54M3l90L67q5j38KJ6J51N7m37K41M8j99Q4
$$ -233 88 -297 -19 93 -295 -26 44 -134 120 163 -227 140 55 -83 -81 -65 86 143 -294 -53 -5 -204 -120
6396a20K31j86K79l9ok82R9N8j22M2lO4q2km5J72k2L0j74j11K87k46L07k57J17
$$ -120 111 -75 204 165 159 -123 -24 34 -88 -46 -49 15 -67 -69 -114 58 36 66 -108 -219 68 -178 129 -128 -11
6421a1r0lK57K69l23j43j03L53j73J59L1o1j78j33K77m7M4k86L09j67k05L5K48
$$ -11 -101 -104 153 422 99 -44 -147 206 33 192 223 162 -16 -149 128 81 125 -161 148 -19 -224 -189 59
6444E9n0l78M58k9l75K19N1P9j13m5J52k34J81K18j77J64k73q8M31l06R5j23J84
$$ 59 9 -369 89 60 -315 -96 -45 34 -79 -124 28 -206 -25 193 16 180 -93 -181 250 -56 39 -84 100
6467A00J8k46J37J13k63K8J58k80L27k17j03M04n9k86J2L2K06mj92L63o6m19L70
$$ 100 118 -128 9 122 -141 -113 45 -235 92 -125 -228 176 117 -169 -157 -125 81 77 -115 248 182 -237 133
6490A33k65q5K93l4j59j19K81j33lm9P1p0J71P7k20K74k12J18j05j6K38k6j40
$$ 133 -132 -217 76 42 -117 -236 45 -88 -91 -140 -69 -139 32 109 -111 163 -49 69 -36 -52 186 160 20
6513B0J03n6k59K7L70m27J68P0J52j24K47k71N9q0J69j40R4m4q8j54j74M82n5
$$ 20 123 67 -192 -165 205 -222 -54 16 168 44 291 20 79 -1 168 28 122 78 -10 -164 -338 144 89
6536H9k98J05k2J3L5j41P3%N5K06j18L3j00O1ko5q1J41K10j45K68l45J31k25N8
$$ 89 -209 -104 -126 -113 -78 -219 -146 -146 -91 115 -3 30 -70 -9 -11 -76 -157 -16 194 49 317 -28 103 -122 -64
6561f4NJ77j8K27k83N9j36j3J44q6j93J41Q7J69L4m24K87j78qL72p3l40O6k04
$$ -64 -59 118 100 327 44 103 -33 -46 98 12 -181 -40 47 216 250 -174 113 -65 -73 299 226 -114 -48 -252
6585b52R2K68j28O2K86k35J24j64J36m58K06J16k80P9M2K70J00k76k2J23k63J5
$$ -252 -160 108 -20 42 328 93 217 53 189 -269 -63 53 -227 -148 -106 164 264 -12 -34 89 -174 -159
6607a59J22J09k07J30k51RL03j68J07m0M7K04k19L2m0q3Q1Q0l4J5j43J99m3j31
$$ -159 -37 72 -135 -5 -256 -247 56 -112 -5 -45 2 206 -13 19 -21 -104 -23 57 23 38 -105 94 51 -80
6631h0K5K25k01L7K5J7j3J28j6k17n9J79k60M80j99k5o8Q4k10Q4J11j15J06k80
$$ -80 -55 170 -31 6 31 48 35 163 147 -70 -129 50 -210 270 71 46 -22 62 -148 -64 47 -68 38 -242
6655b42L47l7P6j79j05Q2K36n3j39J9L2Q5j21K6J00l43J74q9J37k62J22J16Q4
$$ -242 105 68 144 -35 -140 -58 178 125 -14 5 37 122 1 27 127 -216 -42 -131 6 -256 -134 -18 66
6678F6k29K12q2pJ21J0J14j55j23N4J00k25K38M8l40K0M06l84Q9K21k15J95j95
$$ 66 -163 49 -33 -40 81 91 205 50 -73 -19 81 -144 94 142 -198 -178 228 -156 -67 154 -61 134 -61
6701f1R2j21N4n8j16J99r2J79j67j49J76J98j81L0P9J2k3j18J36j89O6K82l85
$$ -61 31 -90 -36 -94 -210 -11 -103 76 -91 -240 -64 134 -47 -17 62 74 51 -67 69 -120 -54 228 -157
6724a57l0M57l81K83l1k39L4J00r7j53N44l95l8M43l10l50M42%l04J18O4j15K43
$$ -157 -187 270 -111 172 141 -98 -64 36 -61 -214 330 -65 -103 340 30 -320 122 122 -182 -64 0 -115 128
6747A28r8k30R5k26N10q3j62J48m2r1J1j97K34j19l8K15N1L1k10J46k23M47l97
$$ 128 30 -200 -105 -331 179 96 -66 82 40 -51 -40 -237 -3 -122 -160 55 106 137 -73 73 -150 297 -100
6770a00K9K42k28J84rk49J17K42l54K63j35N2K05k66q0J80K3j07j25J65N7j46
$$ -100 -71 171 -57 127 118 -131 -14 228 -126 137 2 54 259 -7 -87 93 116 9 -116 49 106 -40
6792d0O7k46L95l11M8J28M0j18J96n2k16M3O6on8j9K8J8l2p9O1J12j8q7J98k7
$$ -40 27 -219 176 -135 -87 41 81 -37 159 107 -109 -66 0 -6 -64 -83 -55 -37 -69 -148 -87 25 7 -80 118 91
6818I1K3o3K2j82J09j01K74j38l48L63k58K52r2n9K69l8j25J30j7k63mK10l0l4
$$ 91 114 51 73 -109 0 -101 173 35 -313 50 -208 44 -48 -107 162 124 -1 129 112 -151 -155 55 25 -9
6842io9O3Q4k07J39J23j9Q1j61j87R1Q1J39r2Q7p3k68J37K5J34q5k8J3K33k52
$$ -9 -78 -15 69 -138 1 124 105 186 25 -162 -71 10 149 57 144 71 -197 -60 -35 99 14 -14 -1 232 -20
6867b0JQ7j1R1l33M12l01p7O5P3p7M2M3r9K85j5l9K32n38J87N2k00j6N3j13L03
$$ -20 -19 68 57 148 -185 227 -74 -151 -86 -13 -90 -48 -5 -104 181 166 127 359 -179 8 60 -140 -156 -103 -216 87
6893H7j79R7q6K4K67k99j9K07j61J17o8j17J71J71l73K52j04k0J73j35J9M0L4
$$ 87 -92 5 -81 -57 210 -89 -108 99 -62 55 -13 -130 41 212 -161 91 -13 -33 140 5 24 64 98
6916I8J06k60J10k6j14j35L29p7r8k7J66l9o0J57r4K8M2j20p3L0M5J34L4j82N0
$$ 98 204 -56 54 28 -86 -221 108 31 -67 -94 72 33 -27 130 36 64 106 -14 -87 -57 -12 122 156 -26 24
6941B4j31k5N2K57j07J2l84L84l05L81j4l77J43k9N1P0L3J7J27j98k3K42n14N52
$$ 24 -107 -132 -80 177 70 82 -302 82 -223 158 144 -233 -90 -119 -68 2 35 52 179 -19 -42 200 -314 238
6965B38l55J41J4M6r3j3j23P8J80k7k56r8M29m1j51O3J28j41j15j72J33Q4j04
$$ 238 -117 24 38 84 -9 -22 -145 -67 113 86 -170 -268 161 120 -31 32 160 19 -96 -268 -135 -51 -155
6988a55N7J65k2k58J39K02k42M03m32J77j93K48Q3j63Q5j77J60j51j7J59p8j18
$$ -155 -98 67 45 -213 -74 128 -114 289 -143 34 -159 89 172 9 94 -83 77 -74 -91 68 -10 -128
7010a28L81k83K35k29q5m7J06m0n3J16l8Q2k98L97j41q5J90k75J82n9j50OK55
$$ -128 253 -30 205 -24 -109 -156 -50 -90 -143 -27 -65 17 -281 116 -25 -110 80 -195 -13 -72 -222 -216 39
7033C9J3j2kJ05k28J66l8oj1R6l24K24M9r5N8k53K36K3N7l44j6L38j56J10j04
$$ 39 52 40 38 143 -85 81 43 37 26 122 -202 22 71 -24 34 -219 17 40 97 -247 -263 75 -81 29 -75
7058g5R5L2j16K79l47L43j08K04j92m11L00L9j19K9J79j49K06q1N0j21P5j69J62
$$ -75 20 52 -64 215 -132 211 103 307 115 -296 4 43 -76 -47 132 -17 189 108 158 37 112 -57 105
7081A05q7r9j49J93R1j11O3N8J21k67K67j87m7N4K14J5m45J86J50j6M3r5p8K5
$$ 105 18 -81 -230 -37 54 -57 6 64 185 -82 185 -2 -49 5 219 234 -211 -25 125 109 152 57 -21 4
7105DN9j80L27n04L63n2K63n7m30L5K03q5J27j14J99l83L02k53K99n4o4K67k86
$$ 4 63 -117 210 -294 69 17 280 223 -207 -172 31 -54 73 -41 158 -225 77 -176 123 69 5 272 -14
7128a4P2l03L29j93J18l9P1k19L08k26j48K53j50RJ66j96M2MJ03J15l04J38L2
$$ -14 58 -245 84 -109 9 -30 41 -178 130 -96 -244 9 -141 -132 34 -162 -120 -116 -13 102 -202 -64 -32
7151c2j56k7m6K13K13j67L4P5j58n1L33k68O9p6J51k28K80o5K6j12O5Jk12J09
$$ -32 -188 -215 -261 -48 165 -2 32 107 -51 -102 231 -37 32 -44 107 -121 159 94 120 8 73 74 -138 -29
7175b9n0K2K30j43k3Q9J35j51J15l16L30k48R2k30J19K4Q2j66P2J28J04j13q4
$$ -29 -79 -57 173 30 7 96 231 80 195 -121 209 -39 53 -177 -58 -34 48 -118 -46 82 186 73 -11
7198a1l4M2q5R7m0m7K50k94L90l20o2L17j32j86K7Q2NJ65m64K52r8L05j71J34
$$ -11 -45 -3 -88 9 -31 -78 172 -122 268 -52 -114 203 71 -115 -88 -6 -1 164 -300 -48 -146 159 -12 122
7222A22L3m1j86j45J74j99K25J09k1r5k7O6j20L46l81m9K13l7k54L77q8J46k35
$$ 122 155 114 -72 -217 -43 -242 -17 92 71 -24 -51 15 -105 241 -140 -189 24 -13 -267 110 22 168 -67
7245f7J29j53J69o9k2m0K62l29J2K51j71K00n1o3m4J56k95m7M7O6q8J43J1L92
$$ -67 62 -91 78 9 -13 -53 209 -120 -108 143 -28 172 121 58 14 170 -125 -172 -125 -59 -147 -4 7 399
7269C99k72q7j50J81O4l03J60J10k12J92j87K05J37j52j01J99l41J41r7J78j32
$$ 399 127 40 -110 71 135 -168 -8 102 -110 82 -105 100 237 85 -16 183 -158 -17 -114 64 -68
7290f8N2j19J18j23K25K69k58k66J61p6J06J5m4j65J15N03l64j66K46l71K70L74
$$ -68 -16 -135 -17 -140 85 354 96 -170 -9 -85 21 36 -8 -173 -58 445 81 -85 161 -210 60 434
7312D34m84L40l42Q5j78j16L44J73m90K46R8l39K38MQ4M8m22M48k63J94k81K58
$$ 434 -50 290 -52 33 -145 -261 83 256 -234 12 110 -229 9 13 97 145 -277 171 -92 102 -179 79
7334G9q5k9L12p7l28P8J57k29o0K12M3j35K02k25J18J00m27K62j91J03r3M2L20
$$ 79 -6 -35 277 200 -128 -50 107 -122 -182 30 73 -62 140 -85 33 133 -294 -32 -223 -120 -213 -171 149
7357A49l00K50L0j32J33k8n9N5k4j37K61m13K97O8k21J71k86J36j0j72k3J01j91
$$ 149 -151 99 129 -3 130 102 43 98 74 -63 198 -215 82 150 -71 100 -186 -50 -60 -232 -255 -154 -345
7380c45J33L45l2k94O5L05J9n35K18J57N6k80N9L30n4m61L67n4j0K98k41o1lJ57
$$ -345 -212 133 101 -193 -128 177 196 -339 -121 36 92 -188 -129 201 147 -314 53 -1 -11 287 46 -15 -18 139
7404A39k37L68j53q4j07Q7K21j10R2j41N3q8N5k31J02m5k3L24l94N63n43K86m0
$$ 139 -98 270 117 33 -74 13 234 124 216 75 128 40 95 -136 -34 -79 -102 222 -172 391 -152 134 94
7427I4j26J18k03J97j98O8n7L09j64j02L6J04M9l12K59l30J35K07J29k60o2N1
$$ 94 -32 86 -117 80 -118 -50 -107 202 38 -64 -28 76 125 -187 72 -258 -123 84 213 -47 -109 -58
7449e8k54L91N9J7l3n4L2Q8n2L7k79J69j25j20L14l05J08J37K1n8j96J16J30l16
$$ -58 -312 79 138 155 122 68 100 188 136 173 -106 63 -62 -182 132 -173 -65 72 93 35 -161 -45 85 -231
7473b31Q9J69N8l26L36j66J39l39K32k7K1o2O3j5J79k93J99K14q8j29q1K12l04
$$ -231 -142 27 85 -241 95 -71 68 -271 -39 -66 -45 -107 -44 -59 120 -173 26 240 152 23 -58 154 -150
7496a50J36j12J44k60J00L91k02j58L57k04lp0J10l93K57j15P9K3O4r8J23L5j97
$$ -150 -14 -126 18 -242 -142 249 47 -111 246 42 39 -31 79 -314 -57 -172 -93 -70 -6 -104 19 54 -143
7519a43Q0O3k43O2J18L49Nl25L2P0j16q0K49j37K7r2j04J24K5K8QJ13J03j03j27
$$ -143 -63 0 -243 -181 -63 286 291 -34 -2 68 -48 -128 121 -16 11 -81 -185 -61 -36 -8 0 113 216 113 -14
7544a4j00k4J87Q6j51J99N7k47nJ00J37k4p6n7n7p9p0K93k75P7r5ML01j69MP6
$$ -14 -114 -138 49 135 -16 183 240 -7 -12 88 225 201 125 68 11 -68 -138 155 -120 -43 -138 -134 167 -2 2 78
7570G8r9k9J74R7j04j35J77j70J89k10J07j97L85J12k83k43K00Q7P2p8j00l74
$$ 78 -21 -50 124 221 117 -18 159 -11 178 -32 75 -122 263 375 92 -151 49 136 208 130 30 -344
7592c44N73n3j22Kj57j83L51j37L4r4J30Jj49J18L75n6k96k16J87J61q3Q6n9k63
$$ -344 229 176 54 56 -101 -284 67 -70 -36 -130 0 1 -148 -30 345 289 -7 -223 -36 125 42 128 69 -194
7616a94K51L6k81L79j88J26j29K01m2k52L17j80O5j65K40j61J27j86joJ75k79
$$ -194 57 93 -188 191 3 129 0 201 159 -93 224 44 109 -56 184 23 150 -36 -37 -43 132 -147
7638a47j96K98k61N41m36L77k76K04J85j83p0m5m1K40k14j67L15j32J12J38l21
$$ -147 -343 -45 -306 235 -201 176 -100 104 289 106 36 -9 -50 190 -24 -191 124 -8 104 242 -79
7659g9Nn0j3K14k40J00n1j05J33J18k1j90J01R9J22l26K79j2j14O5p3K2K15k94
$$ -79 -74 -124 -137 77 -163 -63 -114 -219 -86 32 11 -179 -78 21 143 -183 96 84 -30 35 -38 -16 199 -95
7683i5n1K60j22P7j35M7L13m27m4M36k88J72P0r6j62J61j39J1n0K22k95m3K52
$$ -95 -146 114 -8 69 -66 -19 294 -133 -177 259 -29 143 213 117 -45 116 -23 -12 -62 160 -135 -178 74
7706G4%j33J30j09L4k7Q0j13J93j18K04l51J21J40l41K09Q3n2K2r3K96j05k07
$$ 74 74 -59 71 -38 -4 -31 49 -64 129 11 215 -136 -15 125 -216 -7 76 24 46 -47 249 144 -63
7729f3K26m11K66O5j18J61k26J59q7o0MJ04k6j48J45j19J9P1m5J28m8q9L12j60
$$ -63 163 -248 18 83 -35 126 -100 59 -28 -88 -84 20 -6 -154 -9 -128 -109 -38 -83 45 -3 -92 220 60
7753F0M2l02J16J61k87K92j01K05l92J51N3J6k25L09k86M75k16k1P2k84n6K11
$$ 60 102 -200 -84 77 -210 82 -19 186 -206 -55 -2 14 -211 98 -188 287 71 50 122 -162 -218 -7
7775gn1N2Q0k43R9K22k41m6K97k86M8K80K6k21j53N1K16k96L32k42R6K11j90q2
$$ -7 -58 -6 74 -169 -70 152 -89 -135 162 -124 -76 204 230 9 -144 -93 123 -173 159 -83 13 224 34 -48
7799d8j4K4l03M38k25n2K41J6Oj37L10j63l73J20M4J62J4k17P7L50k64j11lK06
$$ -48 -62 -38 -341 97 -128 -180 61 77 83 -54 256 93 -280 -160 -116 46 60 -157 -80 270 6 -105 -108 98
7823I8j07k45J30K57k19L3J92J5K58m66J98k05J93l48N58l75P7j6O0l9j40j12
$$ 98 -9 -254 -124 133 -86 -53 139 154 412 -54 144 -61 132 -216 342 -33 44 28 88 49 -91 -203
7845b03J98J12Q5l12J13n3j01L0J15k53O6K22o0P4l8o1L8o2M8J55j74J34j5L2
$$ -203 -5 107 192 -120 -7 -60 -161 -131 -16 -269 -203 19 -41 33 -5 -66 -28 -90 -42 113 -61 73 58 90
7869I0J15k57N1O9k01J11m7R3K35n44L90j62n1k4L12k58M9K7qNj95J52Q4j15P8
$$ 90 205 -52 -1 68 -133 -22 -69 24 259 -285 105 -57 -108 -132 180 -78 -29 -2 -10 -5 -200 -48 36 -79 -1
7894al60L69q0R2J77l2k86J19K08k69K01L0j49o1nM5Q9k20K09j96K25K05l48j92
$$ -1 -361 8 -72 20 197 165 -121 -2 206 -63 138 168 19 -42 -47 -2 87 -133 76 -120 105 310 -38 -230
7918b30K39k37J99q1K48r0M2J05l41J19K14l00J77j54M8J2P6J79M3l23K59L3k00
$$ -230 9 -228 -29 -110 138 48 90 195 -146 -27 187 -113 64 -90 -42 -30 46 225 268 -55 204 237 37
7941C7n2j60J97J57l57J69o4K37n2k07K1K0j48J74K8k37K68j59J22J87j82J8k20
$$ 37 -15 -175 22 179 -178 -9 -73 164 112 -95 -74 -54 -202 -28 0 -237 31 -128 -6 181 -1 17 -203
7964b03L79O1k07K35m9m14J54J06n0K62k76j51K90L1j92J63o0n8j50J45mJ41k69
$$ -203 176 237 30 265 216 -198 -44 62 12 274 -2 -153 137 168 -24 139 79 21 -129 16 12 153 -116
7987a16L17k34J11L2j93L7J25J41l97P6J22n9J8J92k45J72m0k20J52j10K18p0
$$ -116 201 -33 78 110 -83 -46 79 220 -177 -101 21 -38 -20 172 -73 99 59 -161 -9 -119 99 29
8009B9j01j54M15Q7k45M7nJ19k34j2j27L02j49K4o3l8J23j74J99k48J20J45j03
$$ 29 -72 -226 189 276 31 78 73 192 -42 -54 -181 121 -28 -4 -67 -105 18 -156 43 -205 -85 60 -43
8032d3J01J7k27K73k8j65J77k69L85k17k63K65J14k11J59j53J30J59l13M7kj28
$$ -43 58 75 -152 121 93 -72 105 -164 221 4 -259 6 120 -91 68 -85 45 204 -109 -62 -64 -192
8054a92K81j45l18L96J49l77L57l87L39j36j94J71K23j41j1Mr6L68o24M86l66
$$ -192 89 -56 -374 22 171 -206 151 -236 103 -33 -227 -56 167 26 15 19 -77 291 -333 153 -213
8075b13Q5M79k60oj42J72j19n1K14l62K90M1j62K14o2K9k67R2P6l5j94L98j11
$$ -213 -128 351 91 85 -57 115 -4 -55 159 -203 87 128 -34 180 118 147 -120 -28 48 13 -181 217 106
8098A06j88Q6m4L2k53K37o6J99lk94K24j49P1Q1j56M03j72j03j23L40k94j48K39
$$ 106 -82 4 -40 -8 -261 -24 -90 109 106 -188 36 -113 -42 39 -117 286 114 11 -112 228 -66 -214 25
8121B5N9m7J66k2k32j37J80J0j3K83l42J13j16jM5J01q6J21o7J98r0P1j42k10
$$ 25 84 37 203 181 -51 -188 -8 2 -11 272 -70 43 -73 -74 -29 72 -14 107 40 238 148 219 77 -133
8145a33k9M51k38L4k78L58j42J06j18q8O8N4N7k53J44k22J90K73l06K03k31K35
$$ -133 -162 289 51 85 -193 165 23 129 11 -77 -9 45 102 -151 -7 -229 -39 234 -72 131 -100 135
8167A35j1j17J4p7L05m02K03J64j64k20K53j61l1n9K00j52J22j93K96L0k53j70
$$ 135 124 7 21 -56 249 -153 50 214 50 -170 83 -78 -109 -168 32 -120 2 -191 105 135 -118 -288
8189b88J99K2
$$ -288 -89 -67
8191f7
$$ Imaginary data points
##PAGE= N=2
##DATA TABLE= (X++(I..I)), XYDATA
0@%%%%%%%%%%%%%qJ6j6J6j8K6l2L9m7N3o1P2q7J00j14J32j50J70j94K20k50K82
$$ 0 0 0 0 0 0 0 0 0 0 0 0 0 0 -8 8 -8 8 -10 16 -16 23 -24 29 -32 40 -47 53 -61 71 -79 91 -103 117 -133 149
35A49l15L52l95M43m93N46o06O71p42Q20r06J000j104J217j337J472j622J786
$$ 149 -166 186 -209 234 -259 287 -319 352 -390 430 -476 524 -580 637 -700 772 -850 936
53I36j971K181k419K688k999L365l797M318m961N780o864Q367j0587J4185k0970
$$ 936 -1035 1146 -1273 1415 -1584 1781 -2016 2302 -2659 3121 -3743 4624 -5963 8222 -12748
68a2748L7955j55240k55314M41518K12380k63022j87443K04973J58972j78173
$$ -12748 25207 -130033 -385347 56171 268551 5529 -181914 23059 182031 3858
78C858j18574R4052J9548N9197O7809r7984j35567K3197J65925O197j94780N1204
$$ 3858 -114716 -20664 -1116 58081 125890 27906 -107661 -84464 81461 87658 -107122 -55918
90e5918J80272o3865j42371j5789Q0399N0453j5082L2140n5183r9316J05920O9863
$$ -55918 124354 60489 -81882 -97671 -17272 33181 18099 50239 -4944 -104260 1660 71523
102G1523j20000l0357J24403Q2262j25032j23720J05746O4358m9486K7682J891
$$ 71523 -48477 -78834 45569 127831 2799 -120921 -15175 49183 -303 27379 29270
113B9270l7959N662J4180j3290o1146N2745J34240r3776j32077Q6063P1043p8525
$$ 29270 -8689 -3027 11153 -2137 -63283 -10538 123702 29926 -102151 -16088 54955 -23570
125b3570o1182J21772R1620j79580p4158J81387J0327j52958J3669J67644J8022
$$ -23570 -84752 37020 128640 -50940 -125098 56289 66616 -86342 -72673 94971 112993
136A12993j95480k2514J63699j6400q2003L5829M4415j0889n0605L493J6204l5895
$$ 112993 -82487 -105001 58698 42298 -39705 -3876 40539 29650 -20955 -17462 -1258 -37153
148c7153O0261N7480r3302m2014N8186K5542m7965l5390R0285L4611j07081n186
$$ -37153 23108 80588 -12714 -54728 3458 29000 -18965 -54355 35930 70541 -36540 -41726
160d1726N6485k3607j7239K9872M2394l3392o0306N1198J3532n5357L7149M0582
$$ -41726 14759 -8848 -26087 3785 46179 12787 -47519 3679 17211 -38146 -997 39585
172C9585k0392k7913p224K6577k2981j5689O8830r573n2980K2535O522k4401j2292
$$ 39585 19193 -8720 -15944 10633 -12348 -28037 40793 31220 -21760 775 7297 -17104 -29396
185b9396L9955M4606p1742k9791Q5522k0935q0472K5623Q8742J1165j09116j4050
$$ -29396 10559 55165 -16577 -46368 39154 18219 -62253 -36630 52112 63277 -45839 -59889
197e9889J02358j8196o4655K1351M1154J8121l7416k8737J4076k693L5979K0148
$$ -59889 42469 24273 -40382 -19031 22123 40244 2828 -25909 -11833 -14526 21453 41601
209D1601o3175k32N0882o331m7171k5120P0222M2096p6507j8173L7531o610p691
$$ 41601 -21574 -21806 29076 22745 -24426 -49546 20676 62772 -13735 -31908 5623 -987 -8678
222h678P43J7809l54k5638K9373l921n4937L0497M7050q272l0672j8574L5968
$$ -8678 -7935 9874 9520 -16118 13255 9334 -45603 -15106 31944 23672 -7000 -25574 10394
235A0394L873l5677K2634R931p111J8619j9937k3913L238K3452L3788m1628l0936
$$ 10394 14267 -21410 1224 11155 4044 22663 2726 -21187 -17949 5503 39291 -2337 -33273
248c3273N4374J040m4832o259L0487L4404l4683k7356L5765j2462j7394K3331
$$ -33273 21101 22141 -22691 -28950 1537 35941 1258 -26098 9667 -2795 -20189 3142
260C142N45J294m630j556R807k8833O015L7034j7633n127P535j0046J074q913
$$ 3142 3687 4981 351 -1205 8602 -20231 -14216 22818 5185 58 7593 -2453 -1379 -10292
274a0292J3666J5748k8779J3046J8779l3809q474J5885K1548k929l6703K0994
$$ -10292 3374 19122 -9657 3389 22168 -11641 -20115 -4230 17318 14389 -22314 -1320
286a320K1963l6337j965J6675P598N800j9468L169L804j5087K1996n10j7071K1667
$$ -1320 20643 -15694 -17659 -984 6614 12414 -7054 -3885 -81 -15168 6828 6318 -10753 10914
300A0914j24j2522p903l810L0633m720k4063K1696k771j4505L110j893J6256o470
$$ 10914 10790 -1732 -9635 -13445 17188 12468 -11595 10101 7330 -7175 -4065 -5958 10298 3828
314C828j1233K2158j8064j7459K2324J091K86m191m782J6961j8160r077K2516
$$ 3828 -7405 14753 -3311 -20770 1554 2645 2931 -1260 -6042 10919 -7241 -16318 6198
327F198p510M049P205j4895M166l996K231J3626j7059Q018J5681k1658k738K889
$$ 6198 -1312 2737 9942 -4953 -787 -4783 -2552 11074 -5985 2033 17714 -3944 -6682 -3793
341c793N488J1002j9053O307J3346k2366K163O478l275J0263q575K085M160j8827
$$ -3793 1695 12697 -6356 -49 13297 -9069 -6906 -428 -3703 6560 -2015 70 4230 -14597
355a4597J2824O281j2625J3596k657l770L230j3578J2269N567j0432J4224p324
$$ -14597 -1773 4508 -8117 5479 2822 -948 2282 -11296 973 6540 -3892 10332 3008
368C008q780J0139p501N790N43q322J8645r120j7032J1882j040O431m86j3590
$$ 3008 -5772 4367 -3134 2656 3199 -5123 13522 4402 -12630 -748 -1788 4643 4157 -9433
382i433J4020l028q683Q159j1520Q150J5711j4984k563l016L463J6062j6874l231
$$ -9433 4587 1559 -7124 1035 -10485 -2335 13376 -1608 -4171 -7187 -3724 12338 -4536 -7767
396g767J6674n157J415r780o633K1163l814n013L931j2549R723M118j2552O416
$$ -7767 8907 3750 5165 -4615 -11248 9915 6101 1088 5019 -7530 2193 6311 -6241 175
410A75k894N947Q189k1847J430J0170l404Q873j0082m181J4036r396k32J983n679
$$ 175 -2719 3228 11417 -10430 -9000 1170 -2234 6639 -3443 -7624 6412 -2984 -3216 -1233 -6912
425f912J5356l908q401Q509j0806M594R569q462N700n638l508J4388j2285m600
$$ -6912 8444 4536 -3865 4644 -6162 -1568 8001 -461 5239 -399 -3907 10481 -1804 -6404
439f404Q673j970J0228r706j3202J3916k830J803N125j5494O425Q205l252j273
$$ -6404 2269 299 10527 821 -12381 1535 -1295 508 5633 -9861 -3436 4769 1517 244
453B44j7541J1534K7677j8241j6652K202J5165J5979k6277j2600K7333N177p624
$$ 244 -17297 -5763 21914 3673 -12979 -10777 4388 20367 -5910 -18510 8823 14000 6376
466F376j4948m950K4538k85j1139P51r875J2158J0555j7839l926J841J3000J1648
$$ 6376 -8572 -13522 11016 10731 -408 343 -9532 2626 13181 -4658 -8584 -6743 6257 17905
480A7905k8963q329K1617O545j990k0120n8K9207r742j6552L790M885J3856q249
$$ 17905 -11058 -19387 2230 8775 6785 -13335 -13393 15814 6072 -10480 -6690 -1805 12051 3802
494C802j1932J2208n433k16R509j0054K608O81n36R737j6566m019J9532n857n047
$$ 3802 -8130 4078 -1355 -1571 7938 -2116 492 1173 637 10374 -6192 -10211 9321 3464 -1583
509a583j086N34P916j5277L176K0772j7989r603J4262Q355l992k5492Q988L5370
$$ -1583 -2669 -2135 5781 -9496 -6320 14452 -3537 -13140 1122 9477 5485 -20007 -11019 24351
523B4351j5630k4944O265J6806J1064k3473j0629K4983r4n759k535j0441J0136
$$ 24351 8721 -16223 -9958 6848 17912 -5561 -16190 8793 8699 2940 405 -10036 100
536A00O349p35j208j9890R161K4456j4536j6321j173J8587J9224l0371j8351K4479
$$ 100 6449 5714 4506 -15384 -6223 18233 3697 -12624 -13797 4790 24014 -6357 -24708 -229
550b29J3833l778k2275m128L0379k145j8049m6Q21J4954J168j5033L059l338O567
$$ -229 13604 9826 -12449 -16577 13802 11657 -6392 -6438 -5617 9337 10505 -4528 -1469 -4807 1760
565A760J3494j9615p663J4046Q113j314k3816K505K8997j1408j5998P121O356
$$ 1760 15254 -4361 -12024 2022 10135 8821 -14995 -12490 16507 5099 -10899 -3778 2578
578B578K843j4367J988J9538j5890p730J6680P49o566j1689Q885K1242j7945j2128
$$ 2578 5421 -8946 -6958 12580 -3310 -11040 5640 6389 -177 -11866 -2981 18261 316 -11812
592a1812J4290K938K11q110l581J2967n457o24M863j4076M529R743k550q57j3816
$$ -11812 2478 5416 5627 -2483 -6064 6903 1446 822 5685 -8391 -3862 5881 3331 2474 -11342
607a1342N355J9063j2242j0449J330Q644J5127j7672j5014J7095P540lj1495r578
$$ -11342 -5987 13076 834 -9615 -8285 359 15486 -2186 -17200 -105 7435 7432 -4063 -13641
621a3641K0890M053j2704j749m279J2874Q155j5969l121J452Q729J0134k2103
$$ -13641 7249 11302 -1402 -3151 -7430 5444 13599 -2370 -5491 -4039 4690 14824 -7279
634g279o356K0300L082p903j4998M582K2554j1430j3067Q665J712M007n473o192
$$ -7279 -13635 6665 9747 1844 -13154 -8572 13982 2552 -10515 -1850 -138 3869 -1604 -7796
648g796J0959m334j29P569j0482J334N139j239M308r408J919J1450r961j021L612
$$ -7796 3163 -1171 -1300 6269 -4213 -2879 2260 1021 5329 -4079 -2160 9290 -671 -1692 1920
663A920l833P597n103m235P594o351K875J486p845Q646j756o035O170m607K763
$$ 1920 -1913 5684 581 -3654 3940 -2411 464 1950 -5895 2751 995 -5040 1130 -3477 -714
678g14K557q013Q654m61o507O308m163L037M150r210O325R35m747O855o606m57
$$ -714 1843 -6170 2484 2023 -4484 1824 -2339 698 4848 -4362 1963 2898 -1849 5006 -1600 -2057
694b057Q792o649N24j113j912Q938q541k852J0003o067J8ol485Q193n987k293
$$ -2057 6735 86 610 -503 -2415 6523 -2018 -4870 5133 -934 -916 -922 -4407 3786 -2201 -4494
710d494Q397o351J375J557m639P687l614l363P769n645J826K695p089O933K6m280
$$ -4494 3903 -2448 -1073 484 -4155 3532 -82 -3445 4324 -1321 505 3200 -3889 3044 3070 -1210
726a210M485n677L826L368r314N610J180m485M880n672J293M646p558N495Q3n553
$$ -1210 3275 -2402 1424 4792 -4522 1088 2268 -2217 2663 -3009 -1716 2930 -4628 867 950 -4603
742d603O636m256J64M730o924N339J601o026N935l904J33O508p230K370K398m714
$$ -4603 2033 -2223 -2059 2671 -4253 1086 2687 -3339 2596 -1308 -1175 5333 -1897 473 2871 -1843
758a843O157n374j619Q405o480l7K358m710O218m206k777P889o364M31L313n423
$$ -1843 4314 -1060 -2679 5726 -754 -791 1567 -3143 3075 -1131 -3908 3981 -2383 -1952 1361 -4062
774d062O133k691l705P976m578o97L460n358O187o96n397O879l348N14L032p654
$$ -4062 2071 -620 -4325 3651 -927 -1624 1836 -3522 2665 1969 -3428 3451 103 617 3649 -4005
790d005O847J198o976N216k648J57L852p935M380K613o040M947m035l46O189p255
$$ -4005 2842 4040 -2936 2280 -368 -211 3641 -4294 86 2699 -3341 1606 -2429 -2775 3414 -3841
806c841K744K834n435O003l441k461O987m873K144J433n538O807j840l905O687
$$ -3841 -1097 1737 -3698 2305 -1136 -3597 3390 -1483 661 2094 -3444 3363 1523 -2382 4305
821D305n007J106L469o582M873j782k591O664o489j91N484n919L242j306l162
$$ 4305 -702 404 3873 -2709 2164 382 -2209 4455 -2034 -2225 3259 -2660 582 -724 -3886
836c886P557n232j416M550n128M493Q1m958O624l132q76M800o924M431K882o650
$$ -3886 3671 -1561 -2977 1573 -3555 938 1019 -3939 2685 -447 -1323 3477 -3447 984 3866 -2784
852b784N305j746j030L860o628M701K353p859N383n19k421L713o272L957L027
$$ -2784 2521 775 -255 3605 -3023 1678 4031 -3828 1555 1036 -1385 2328 -3944 13 3040
867C040p468M906j084k526O030n450J019K919m729O236k401n162P320j979o97
$$ 3040 -4428 478 -606 -3132 2898 -2552 -1533 1386 -3343 2893 492 -4670 2650 671 -26
882b6K261n262N618j13m556N827n001L31N871o709J068R94j916O232o954j764
$$ -26 2235 -3027 2591 2478 -2078 3749 -1252 -921 4950 -1759 -691 303 -1613 4619 -2335 -4099
898d099P910n412N48R20l617O090l395j103N346p265K799N549n628J668j983J392
$$ -4099 3811 -1601 -1053 -133 -3750 2340 -1055 -2158 3188 -4077 -1278 4271 -1357 311 -1672 -280
914b80N853q062J185M827n058M318j299m252M996l253K612J130q172O047K295
$$ -280 5573 -2489 -1304 3523 -1535 2783 1484 -2768 2228 -1025 1587 2717 -5455 592 2887
929B887m895K483m512L333N106p493J886p9q30P312o529l643O545m04K164m674
$$ 2887 -2008 475 -4037 -704 4402 -3091 -1205 -1284 -2114 5198 -1331 -4974 1571 1167 3331 -1343
945a343m150J0834k661m806M062m034L590J842m084K173m325K067Q545j0252l377
$$ -1343 -5493 5341 2680 -2126 1936 -2098 1492 3334 -750 1423 -2902 -835 7710 -2542 -5919
960e919P390R43J25q211J130J1485q046l830N660j633K060k659Q7N416p896K303
$$ -5919 1471 2414 2539 -5672 -4542 6943 -1103 -4933 727 -906 1154 -1505 -1418 3998 -3898 -1595
976a595P770p690jK078O10L648p962J557P121o596J723N81l004M144l794N81M207
$$ -1595 6175 -1515 -1516 562 1172 4820 -3142 -1585 5536 -1060 663 1244 -1760 2384 -1410 -829 3378
993C378p095L097K516m164L895m736m23P890m881j690O8Q9Q102p001n651J0069
$$ 3378 -3717 -620 1896 -2268 1627 -3109 -3532 4358 -523 -2213 -2145 -2056 6046 -955 -6606 3463
1009C463q89j975j218j469O504l865k272O918p676j90P755l124k754m086N344
$$ 3463 2574 599 -619 -2088 4416 551 -1721 5197 -2479 -2669 5086 1962 -792 -4878 466
1024D66Q850j3340m338J1936k19m220m952L456Q906r263k026Q277n660L16L041
$$ 466 9316 -4024 -8362 3574 3355 -865 -5817 -2361 6545 -2718 -4744 3533 -2127 -1811 1230
1039A230r09J009n390M638O703j0557N54O381j930L14m771J792O237p250J062
$$ 1230 321 1330 -4060 578 7281 -3276 -2722 3659 1729 2043 -2728 -936 5301 -1949 -887
1054h87K485l443L988k628k263M870l723O12J547l687N486l385l671Q236k920
$$ -887 1598 -1845 2143 -485 -2748 2122 -1601 -989 558 -3129 2357 -1028 -4699 3537 617
1069F17l397K342o06N115n140l531R387l935l317N018k239O17j702P24N839q855
$$ 617 -2780 -438 -1044 4071 -1069 -4600 4787 852 -2465 2553 314 931 -771 -47 5792 -3063
1085c063j470J0781m622m740J97M124M551j0072j188J0498n121k490K633q55K188
$$ -3063 -4533 6248 1626 -3114 -2917 1207 5758 -4314 -5502 4996 -125 -2615 18 -837 1351
1100A351l807J901M312q429L272O879o470n00P45K610K433q026K999N451o163
$$ 1351 -2456 -555 3757 -4672 -1400 5479 -991 -1491 -746 1864 4297 -3729 -730 4721 -1442
1115a442K263q5k058L666l384J302O30m714O250o65o382N116l08q76O96l037N199
$$ -1442 821 736 -1322 2344 -1040 262 892 -3822 2428 1763 -4619 497 189 -687 9 -3028 2171
1132B171j615m584O694k092l360M442j712J502j977j196O604n429k694P470l689
$$ 2171 556 -4028 2666 574 -2786 1656 -56 1446 -531 -1727 4877 -552 -3246 4224 535
1147E35j662R02Q2L692o136M2P395o186j759M265j592J233l359J378M561p247
$$ 535 -1127 -225 -143 3549 -2587 -2545 4850 -1336 -3095 1170 -422 811 -2548 -1170 3391 -3856
1163c856K030N785o139R12J404L47J266n284M463L856q119L454K820l487J594
$$ -3856 -1826 3959 -2180 -1268 136 483 1749 -3535 928 4784 -3335 119 2939 -548 1046
1178A046k053K483J022o217N294J215o147L900Q5r96L81l137N084r41n846O569
$$ 1046 -1007 1476 2498 -3719 1575 2790 -3357 543 628 -368 13 -3124 1960 1019 -4827 1742
1194A742o07l734K898j367K293j385k837O126l092k894O254l010j164J993j258
$$ 1742 1135 -2599 299 -1068 1225 -160 -2997 3129 37 -2857 3397 387 -777 1216 -42
1209d2L345m269j273O972n199j847M360k375J446k404k8M582o418R68N301n447
$$ -42 3303 -966 -2239 4733 -466 -2313 2047 -328 1118 -1286 -1314 3268 -3150 -2182 3119 -2328
1225b328Q52J647n73J773m521K739M027o699K787K687l341J761j385J460J562
$$ -2328 -1476 171 -402 1371 -3150 -411 3616 -3083 -296 2391 -950 811 -574 886 2448
1240B448n377M762J734o380L337J033r03J73l455M194N32n939N048k63l363K851
$$ 2448 -2929 1833 3567 -2813 524 1557 654 827 -2628 1566 2098 -3841 1207 944 -2419 432
1256D32j326J407j052k836N944k179m080N550j688n23O80j644L725k355j926N166
$$ 432 -894 513 -539 -3375 2569 390 -3690 1860 172 -351 329 -1315 2410 55 -1871 3295
1272C295l748r42L895k675J012j125n26M648n295o58N102m036P7R99j190K834
$$ 3295 -453 -1395 2500 -175 837 -288 -814 3834 -1461 -2119 2983 -1053 -976 23 -1167 1667
1288A667l956J063L566n262K104K801l723J973p01L46K461m918L196K391n531
$$ 1667 -2289 -1226 2340 -2922 -818 1983 -1740 233 -468 -122 2339 -2579 617 3008 -2523
1303b523L642N5j309J560k850L014O34n498M951J50l626K527j529J336Ql702M612
$$ -2523 1119 1174 -135 1425 -1425 1589 2223 -3275 1676 1826 -1800 727 -802 534 542 -3160 1452
1320A452r14m053M816j522o61J518k650L554j120l047M983k496j143L222k490
$$ 1452 538 -3515 1301 -221 -882 636 -2014 1540 420 -2627 2356 -140 -1283 1939 -551
1335e51J466m4k224L966k712j131L778l420J021J101k503K838k865k04L734m364
$$ -551 915 871 -1353 2613 -99 -1230 2548 -872 149 1250 -1253 1585 -1280 -1484 2250 -2114
1351b114J392K012l347K711j137j012K867l469J853K148m591L493K13j846K119
$$ -2114 -722 1290 -2057 654 -483 -1495 1372 -2097 -244 1904 -2687 806 1019 -827 1292
1366A292k564K117J645m734L214M71k456K489j896R07Q51l296L111p6l755M039
$$ 1292 -1272 845 2490 -2244 970 1441 -1015 1474 -422 485 1336 -1960 1151 1075 -2680 1359
1382A359j485r00J872k936K493K25l375L665j553n02K690l190K068Q02k877L461
$$ 1359 -126 -1026 846 -2090 403 628 -2747 918 -635 -1137 1553 -1637 431 1233 -1644 1817
1398A817j569j305K923k652J180J459l478K930n22j650K764l691J870J558l271
$$ 1817 248 -1057 1866 -786 394 1853 -1625 1305 783 -867 1897 -1794 76 1634 -1637
1413a637J781j58j342K765l354R91K357l748K702j87k012K898j925M56K073l369
$$ -1637 144 -14 -1356 1409 -1945 -954 1403 -2345 357 170 -1842 1056 -869 -413 1660 -1709
1429a709K262Q05k240K266k139O16K890m337J533J430k296K308k059J54K503l638
$$ -1709 553 1358 -882 1384 -755 -139 2751 -1586 -53 1377 -919 1389 -670 -516 1987 -1651
1445a651J526J084k698K308j107o67K448l281J509J930l201K008j75r43K681l200
$$ -1651 -125 959 -1739 569 -538 -1205 1243 -2038 -529 1401 -1800 208 33 -910 1771 -1429
1461a429J431J920l190K068K01j823K675k544Q84J988l962K309K68j788K488k845
$$ -1429 2 1922 -1268 800 1001 -822 1853 -691 193 2181 -1781 528 796 -992 1496 -1349
1477a349Q84K744m056J081R18j463K349k577M1L286l420J065J329j956J834j304
$$ -1349 -465 2279 -1777 -696 222 -1241 1108 -1469 -1428 1858 -1562 -497 832 -1124 710 -594
1493e94J54K846l996J570K203k814J370j362P60K724m566J044K859k976J232q62
$$ -594 -440 2406 -1590 -20 2183 -631 739 -623 137 2861 -1705 -661 2198 -778 454 -408
1509d08j06K415l816Q85K514l481J541N98j119K016k914J377K310l688J762J160
$$ -408 -514 1901 -1915 -1030 1484 -1997 -456 142 -977 1039 -1875 -498 1812 -1876 -114 1046
1525A046j439J878k448N73K838l518J505O93j880K180k016J15K496l213J227R41
$$ 1046 -393 1485 -963 -390 2448 -1070 435 1128 -752 1428 -588 -473 2023 -1190 37 978
1541I78k378K083j639j26K847l324R00J540k395K125j410j91K714l421Q64K490
$$ 978 -1400 683 -956 -1082 1765 -1559 -659 881 -1514 611 -799 -990 1724 -1697 -833 1657
1557A657k479J536o83l15K460l616J212K689l166J086J44p19K117l358O25L020
$$ 1657 -822 714 31 -284 2176 -1440 -228 2461 -705 381 525 -194 1923 -1435 -810 2210
1573B210l497Q57Q62j370J619k050P60K038l709J875J336k345K162j374L69K033
$$ 2210 -1287 -430 432 -938 681 -1369 -609 1429 -2280 -405 931 -1414 748 -626 -257 1776
1589A776l250J779J091k641K303q66n92K292k550P89J307k581K405j157j313K559
$$ 1776 -1474 305 1396 -1245 1058 192 -400 1892 -658 131 1438 -1143 1262 105 -1208 1351
1605A351k287M61J494k391K093j069j503L095k351o7J741j651J181k0j443L121
$$ 1351 -936 -475 1019 -1372 721 -348 -1851 1244 -1107 -1174 567 -1084 97 77 -1366 1755
1621A755k680K15K653k653Q05O48j197K028k150L56K610l227P40J369k021J689
$$ 1755 -925 -710 1943 -710 95 743 -454 1574 -576 -220 2390 -837 -97 1272 -749 940
1637I40j612j14K424l228J020J747k403J087n79K18J353k586J580J410k876K305
$$ 940 -672 -786 1638 -1590 -570 1177 -1226 -139 -718 -500 853 -1733 -153 1257 -1619 686
1653F86m02r79J848k029J232R75k450K524n83j483K289j862J95J128k266K038
$$ 686 284 -695 1153 -876 356 1331 -1119 1405 822 -661 1628 -234 -39 1089 -1177 861
1669H61l53j837K536j718n69K025j947J081n96j178L043k012o94K520j874M26
$$ 861 508 -1329 1207 -511 -1080 945 -1002 79 -517 -1695 1348 -664 -1358 1162 -712 -286
1685b86N68j033K115j539n49K623k680P36J116j242J245j154k48K304l120P62
$$ -286 282 -751 1364 -175 -724 1899 -781 -45 1071 -171 1074 -80 -328 1976 -1144 -382
1701c82J698k582J450m48o87J843k579J204J547k645J758m3j355K058j826N41
$$ -382 1316 -1266 184 -264 -951 892 -1687 -483 1064 -1581 177 134 -1221 837 -989 -448
1717d48J641k701K048K17j879K228j284K05J548k510J682J0j702K470j630n14
$$ -448 1193 -1508 540 757 -1122 1106 -178 27 1575 -935 747 757 -945 1525 -105 -619
1733f19J565j639P88L7j496K353j527j038K356j606N19N54j317J764j258o37K764
$$ -619 946 -693 95 132 -1364 989 -538 -1576 780 -826 -307 247 -1070 694 -564 -1201 1563
1750A563k283L56J563j659J799r63j034K465k311K37J715j873J164m60r52K012
$$ 1563 -720 -364 1199 -460 1339 376 -658 1807 -504 -267 1448 -425 739 279 -673 1339
1766A339k112L18J772k805J588L06j483J498j340K80J542k378J498O43k015J995
$$ 1339 -773 -455 1317 -1488 100 406 -1077 421 -919 -639 903 -1475 23 666 -1349 646
1782F46j018j07J878k255J517K92k042K036l92j096J492j278J012M71k455K596
$$ 646 -372 -479 1399 -856 661 953 -1089 947 555 -541 951 -327 685 1156 -1299 1297
1798A297j045j616K222j531Q7P72j759K296q02j536K621j580k27J323j573J643
$$ 1297 252 -1364 858 -673 -586 186 -1573 723 -79 -1615 1006 -574 -801 522 -1051 592
1814E92l30j438K468j772J51J690j978J230n0j386K047j599J73J441k234J305
$$ 592 262 -1176 1292 -480 -329 1361 -617 613 563 -823 1224 -375 -202 1239 -995 310
1830C10K47j534J648q66m46J358k166J682M01k121J710k12q27J513j861J374P68
$$ 310 557 -977 671 -195 -641 717 -1449 233 634 -1487 223 11 -816 697 -1164 210 978
1847I78k557K316l98j215J749j188J083J76k270K442k09j880J731q34k4O51j790
$$ 978 -1579 737 339 -876 873 -315 768 944 -1326 1116 907 -973 758 -76 -100 551 -1239
1864a239K020m59j799K126j056k32Q80j539J343L83j642J883r89j98J636j913
$$ -1239 781 322 -1477 649 -407 -639 241 -1298 45 428 -1214 669 -320 -518 1118 -795
1880g95J501j97j512K337j342k77J851k410J343N35j939J692n87p16J457j804
$$ -795 706 509 -1003 1334 -8 -285 1566 -844 499 1034 -905 787 200 -516 941 -863
1896h63Q80P96k242J533K47j394J475j508J134P64k414J967Q5j517J532r37P09
$$ -863 17 813 -1429 104 351 -1043 432 -1076 58 822 -1592 375 460 -1057 475 -462 247
1913B47N45j813K160p6k130J974o67k12J127k268K060j15k130K205j147l41J118
$$ 247 792 -1021 1139 1063 -1067 907 240 28 1155 -1113 947 832 -1298 907 -240 -581 537
1930E37j571J065M53j964K085j054k30J313j784J042Q89k121J875n00n48J646
$$ 537 -1034 31 484 -1480 605 -449 -679 634 -1150 -108 781 -1340 535 35 -513 1133
1946A133k005J277P57k030J591k15p56J298j840J031J318k662J727k35j003J422
$$ 1133 -872 405 1162 -868 723 508 -248 1050 -790 241 1559 -1103 624 389 -614 808
1962H08j323L00J132k545J639L12j442J715j432O88R77k386J799O69j977J780
$$ 808 -515 -215 917 -1628 11 323 -1119 596 -836 -148 829 -1557 242 911 -1066 714
1978G14r43K4J287j850J080R43k057J676q12l40J390j829R56Q50k284J462k87
$$ 714 -229 -205 1082 -768 312 1255 -802 874 62 -278 1112 -717 239 1089 -1195 267 -20
1995b0q79J849k134J035Q60k132J264K60j119J797j704P26J238k365K061n2j240
$$ -20 -899 950 -1184 -149 711 -1421 -157 103 -1016 781 -923 -197 1041 -1324 737 685 -555
2012e55J444j167N46J068k158J404K35j576J596r25m7J035k153J329M47j842J970
$$ -555 889 -278 268 1336 -822 582 817 -759 837 -88 -135 900 -1253 76 523 -1319 651
2029F51r80k82J255j838J314K05j510J665r70q9J811k394J128J043j648J181k60
$$ 651 -329 -611 644 -1194 120 325 -1185 480 -490 -579 1232 -1162 -34 1009 -639 542 282
2046B82m32J574k150O08J456k285J342j80l86J219j890Q32J357k501J131L62j206
$$ 282 -150 1424 -726 -118 1338 -947 395 215 -171 1048 -842 -10 1347 -1154 -23 339 -867
2063h67J039q63M38R86k178J605M09j774J775p95L5J074j661J332M67j982K001
$$ -867 172 -691 -253 733 -1445 160 569 -1205 570 -225 -190 884 -777 555 1022 -960 1041
2080A041r11n98J614j717J054K55j869J938q20j001K117j800M79P79j652J768
$$ 1041 130 -468 1146 -571 483 738 -1131 807 -13 -1014 1103 -697 -218 561 -1091 677
2096F77j053m35J755j773L20J483j843J112j82n69J584j912P61J490k218R66L30
$$ 677 -376 -811 944 -829 -509 974 -869 243 61 -508 1076 -836 -75 1415 -803 163 493
2113D93q21J434j406K58J448k471J030M95r62J168q78K0J210k389J435M21j644
$$ 493 -328 1106 -300 -42 1406 -1065 -35 460 -502 666 -212 -192 1018 -1371 64 485 -1159
2130a159J480l44m59J008j390R45P81k066J693j98j131J836j227M70M96j745K073
$$ -1159 321 -23 -482 526 -864 81 862 -1204 489 291 -840 996 -231 239 735 -1010 1063
2147A063o99j216K042j394j92R61j305J462r63o63K099j935J21J461j637N34q
$$ 1063 364 -852 1190 -204 -396 565 -740 722 -241 -904 1195 -740 -619 842 -795 -261 -269
2164b69n31J790j900K96J675j950Q12O12q64J044j165L76J666k412J126N93j044
$$ -269 -800 990 -910 -614 1061 -889 -77 535 -329 715 -450 -74 1592 -820 306 899 -145
2181a45Q19q70k06J388j978R10Q74j857J277k92o68J237j412J030L30j651J724
$$ -145 674 -196 -402 986 -992 -82 792 -1065 212 -80 -748 489 -923 107 437 -1214 510
2198E10j51j342J615j023J45N52j129J590n19j286K143j081k18J112j408J278
$$ 510 359 -983 632 -391 -246 306 -823 767 248 -1038 1105 24 -194 918 -490 788
2214G88q42q71J802j088l53J757j951O88j0n93J638j566j29J847j849K69J117
$$ 788 -54 -925 877 -211 -564 1193 -758 -70 -80 -673 965 -601 -730 1117 -732 -463 654
2231F54j408J344j282J26J654j848Q93P94j363Q38l03r3J001j785Q95R65k030
$$ 654 -754 590 -692 -566 1088 -760 133 927 -436 402 99 6 1007 -778 117 1082 -948
2248i48J323Q6r00Q50j058N17O54j803J418J67j330J357m88l08Q59j496J628k92
$$ -948 375 461 -439 411 -647 -130 524 -1279 139 306 -1024 333 -155 -463 396 -1100 528 236
2266B36j384J891q08j96Q90q81P11k3j401K065j044o97J633j189J83K62j086J690
$$ 236 -1148 743 -65 -261 629 -252 459 436 -965 1100 56 -641 992 -197 -14 248 -838 852
2284H52j207p96K249j563k9Q84j015J013m74q32J675j668N38J252j500J211m73
$$ 852 -355 -1151 1098 -465 -494 390 -625 388 -86 -918 757 -911 -373 879 -621 590 117
2301A17o56J262j104K87J168j838J273R1j111J213j113O24O89j868J420L6j643
$$ 117 -539 723 -381 -94 1074 -764 509 600 -511 702 -411 213 902 -966 454 490 -1153
2318a153J607o74n3N29j402J196K33j616K091n09j298J778j225N07L30j289J957
$$ -1153 454 -220 -273 256 -1146 50 283 -1333 758 249 -1049 729 -496 11 341 -948 1009
2335A009p65j083J656o26M3L28j223J392n89q59J468j075O7Q86j410J134k25j081
$$ 1009 244 -839 817 191 234 562 -661 731 142 -717 751 -324 -257 629 -781 353 128 -953
2353i53J650j281K75J003j664R04J19q02J429j151M26Q13j431J016M21j374J184
$$ -953 697 -584 -309 694 -970 -66 53 -749 680 -471 -45 768 -663 353 774 -600 584
2370E84o31Q1O03j333J097L05j656J379r1o99J046j242R17K49j675J396l90q50
$$ 584 -47 34 637 -696 401 706 -950 429 338 -361 685 -557 360 609 -1066 330 -60 -910
2388i10J329o65L32P3j275J635l17j173J788j119L8N36j046J701q00r01J696r69
$$ -910 419 -246 86 159 -1116 519 202 -971 817 -302 -264 272 -774 927 127 -774 922 -47
2406d7k58J140j301J143k62j152J377q99k31J031j312P53J73r01J249q48K90M37
$$ -47 -305 835 -466 677 415 -737 640 -259 -490 541 -771 -18 155 -746 503 -345 -55 382
2424C82j033O03K08j082J568m90m34J225j472O62N93j472J251j74o13J064j192
$$ 382 -651 -48 160 -922 646 156 -278 947 -525 137 730 -742 509 335 -278 786 -406
2441d06O17L29j359J189m0r89J384j099j74R13j495J283J50j255J379p92J38O88
$$ -406 211 540 -819 370 330 -659 725 -374 -548 365 -1130 153 303 -952 427 -365 -227 461
2459D61j171J375m13q48J246p87k63J095j160Q41qp60J135p14j13P32j041M96
$$ 461 -710 665 252 -596 650 -137 -400 695 -465 376 368 -392 743 29 -84 648 -393 103
2477A03K95j216J443q94m84J223j018K50N56j183J499n77o17J299j069J33O01
$$ 103 398 -818 625 -269 -753 470 -548 -298 258 -925 574 -3 -620 679 -390 -257 344
2494C44r02J049o2r01J222r11K12M26j088R47J62r16J147r05J19L67j015R35N9
$$ 344 -558 491 429 -472 750 -161 51 477 -611 336 498 -418 729 -176 -57 310 -705 230 289
2513B89j144J278n05n24J163j251P64J20p55J253o03n44J013r67N62M41j426J387
$$ 289 -855 423 -82 -606 557 -694 70 190 -565 688 85 -459 554 -413 149 590 -836 551
2531E51j65r34J314j034L40N19j244J088k72o96J209j089J42N37j061J336o62
$$ 551 386 -548 766 -268 72 591 -653 435 163 -533 676 -413 -271 266 -795 541 -121
2548a21q08J481j106K92P08j273J010q9r43J563q92k48J259j136N55K56r27J045
$$ -121 -929 552 -554 -262 446 -827 183 94 -849 714 -178 -426 833 -303 252 508 -419 626
2566F26n23l76J158q83O8M08r06Q09n08k26Q95j126L70N11p62P94m88l49J142
$$ 626 103 -273 885 2 70 478 -428 381 -127 -353 542 -584 -214 297 -465 329 -159 -508 634
2585F34j093M15O26j325J109l68l13J015j153N58O08j110Q82j87q28J118o17k00
$$ 634 -459 -44 582 -743 366 -2 -315 700 -453 105 713 -397 485 298 -530 588 -29 -229
2603b29P75r17P00n0o86Q58o51m38Q40p13N72J82q84J172o17k61P45o01K27L23
$$ -229 546 -371 329 279 -407 451 -200 -638 202 -511 61 243 -641 531 -86 -347 398 -203 24 347
2623C47j175J079r2n99J387r90mR9m69J062n48k61J145j341J02Q11j028O93n38
$$ 347 -828 251 159 -440 947 -43 -47 52 -417 645 97 -164 981 -360 -258 553 -475 218 -320
2642c20l22J362j126J49N96r47O95j4l47O64p73K20R01j241Q38j63m11Q01o06
$$ -320 -642 720 -406 -257 339 -608 87 73 -274 390 -383 -163 738 -503 335 172 -239 562 -44
2661d4k5Q69j118O82K42j140J036p20k46Q45j000O07Q9o84J068l61r27J242p94
$$ -44 -69 800 -318 364 606 -534 502 -218 -464 381 -619 -12 77 -607 461 100 -827 415 -379
2680c79J10L54q20J013n20m04J312q09M4L99m19P78m99q20J676j267Q1R89j061
$$ -379 -269 85 -735 278 -242 -646 666 -143 -99 300 -119 659 160 -660 1016 -251 -170 819 -242
2699b42K93K1l48R74j066l30J266j097M08K7m08P87q59K3Q08p10K35N13q44Q91
$$ -242 51 72 -276 698 -368 -698 568 -529 -121 -94 -502 285 -574 -551 257 -453 -218 295 -549 342
2719C42k48k72J001q81P8N60j067R78n52k72R73r17O82m8q26P99l04p26J215n71
$$ 342 94 -178 823 -58 20 580 -487 491 -61 -333 640 -277 405 357 -469 330 26 -700 515 -56
2739e6j78N05r35Q18p6q22J011k79m44P28o51O74l39m94J110p32l39R20m61K62
$$ -56 -234 271 -664 154 78 -744 267 -12 -456 272 -379 295 -44 -538 572 -160 -499 421 -40 222
2759B22J30n11Q87q72l25J148q59J53K90o68O73n12k72J242q53j13O13q16O28
$$ 222 352 -159 728 -144 -469 679 -180 -27 263 -405 268 -244 -516 726 -127 -240 373 -443 185
2778A85k58m67J066q48lO48r15R83l19k99N96q23N16N44r60R47l54p26R02m21
$$ 185 -73 -540 526 -322 -325 323 -592 391 72 -227 369 -454 62 606 -354 593 239 -487 415 -6
2798fj44N32p69O73J13j213J079l30l26M95n62M96O7j173J619m20n98R29o21P4
$$ -6 -150 382 -387 286 399 -814 265 -65 -391 104 -458 38 105 -1068 551 131 -467 462 -159 -85
2818h5J89o53J426p08k07Q70j073Q6P66q71Q57p29l36J252q95k42P28o52O08m61
$$ -85 104 -549 877 169 -38 832 -241 -155 611 -260 597 -132 -468 784 -111 -353 375 -277 331 -130
2838a30n52Q88o49L48N87r72N43P7r33J250o28k45Q08q54Q85jj079J516p22l40
$$ -130 -682 206 -443 -95 492 -480 63 140 -793 457 -171 -416 392 -462 423 422 -657 859 137 -203
2858b03N15n48N73J10j114J057k86o22P50n10L29J07j007J018r5p07R33o79M17
$$ -203 312 -236 337 447 -667 390 104 -518 232 -278 51 158 -849 169 74 -633 300 -379 38
2877C8Q9o06R06k29p43J074o48R4L04m47O46l49o37J128n98l80P75n85M33j58
$$ 38 127 -479 427 198 -545 529 -119 -25 279 -168 478 129 -508 620 22 -358 417 -168 265 107
2897A07m94R21m94l27P10r14M79R3p64J137n84l7N93p76N35K81r35O62l37j22
$$ 107 -387 534 40 -287 423 -491 -12 81 -683 454 -130 -167 426 -350 185 466 -469 193 -144 -266
2917b66P35p58N64K86j003R61k45p03R80r33M19K2p93J091j53q26J068p53j79
$$ -266 469 -289 275 561 -442 519 274 -429 551 -382 37 59 -734 357 204 -622 446 -307 -486
2936d86P44q87P27j59p35J219o68J24Q1k74Q56m64l97R72l81n75P12n00K30j93
$$ -486 258 -629 98 -61 -796 423 -245 -121 -40 -314 542 78 -319 653 272 -303 409 -91 139 -54
2956e4l23P50k91n73Q93n98M39k51m67P29l57j58N49p68J12N80p31O46k21k72
$$ -54 -377 373 82 -491 402 -196 243 -8 -475 254 -103 -261 288 -480 -368 212 -519 127 -94 -366
2976c66O18l67J01N36j060Q88P9r20J179p20N8L01p61J123n14q56J185o99J81
$$ -366 252 -115 -14 522 -538 350 429 -491 688 -32 26 327 -434 689 175 -681 504 -195 -14
2995a4J77n48Q60l48p13Q21k37k15L79n37L71K31q27R33l60n64R67o22L74J49
$$ -14 163 -385 475 127 -586 235 -2 -217 162 -375 -4 227 -600 333 -27 -591 376 -246 128 277
3015B77p98J010n85l73J204q93K49J54q58J069l88m83O37n78R0O09r82Q82k80
$$ 277 -521 489 -96 -469 735 -158 91 245 -613 456 68 -415 222 -356 -266 343 -639 243 -37
3034c7k61O37m39p1K33l74L81p5m59J023o82J61M35q52O21j85m94R25m35j32P07
$$ -37 -298 339 -100 -171 62 -312 69 -6 -465 558 -124 37 472 -380 241 56 -438 487 52 -80 627
3055F27q31L54J26p24O41m64k7O95p98K74M04p88P82n00k75Q03n12K62M07r34
$$ 627 -204 150 276 -448 193 -271 -298 397 -401 -127 277 -511 271 -229 -504 299 -213 49 456 -478
3075d78P61P0m69O80q29J95L78o05O11o2n09Q86l19l95O53j078P88k77m70O54
$$ -478 283 353 -116 564 -265 -70 308 -297 314 252 -257 629 310 -85 568 -510 278 1 -469 185
3095A85m14J78L45q62L33M68o26P68n34j09Q78j111O57J76o59M77j57j46O18n88
$$ 185 -229 -51 294 -568 -235 233 -393 375 -159 -268 610 -501 156 332 -327 150 -7 -153 465 -123
3115a23J2L72r96O40J54l40Q16q56R1Q72j142O88l91l08O73p22N70l9m14M05l
$$ -123 -111 261 -735 -95 59 -281 535 -321 -230 642 -500 188 -203 -511 162 -560 10 -29 -443 -38 -41
3136d1k46L75k06j22O04p00N97n6l85M49l97k3N84m48J99L07o33M09n4m57P51
$$ -41 -287 88 -118 -240 364 -336 261 205 -180 269 -128 -151 433 -15 184 491 -142 267 213 -244 507
3157E07o37o5L77o73N75k67k50P24n79j7L93m95P92l36k93N99l74j51N34o46P04
$$ 507 -130 -195 182 -491 84 -183 -433 291 -288 -305 88 -407 385 49 -244 355 -19 -170 364 -282 422
3178D22j81m63P06n36mO26j014N77k17k47Q53o67j71O29q43M97K31m05L89m43
$$ 422 241 -222 484 -52 -56 570 -444 133 -84 -331 522 -145 -316 313 -530 -33 198 -207 182 -261
3198b61J57L43n84J21L08n84P75k81l73R75q99K28M67n52N68k26n21P28p07N44
$$ -261 -104 239 -345 -224 84 -500 275 -6 -379 596 -303 -75 392 -160 408 182 -339 389 -318 226
3218B26j77l88Q90n44n10N30j11l50O35q08Q39j98n91J071m75m36Q43o98K17M9
$$ 226 49 -339 551 7 -503 27 -84 -434 201 -607 232 34 -557 514 39 -397 446 -252 -35 14
3238A4j62N86p29n6N86m82M27J96o49N18j29m04N25m44K29O1m87R17m95j99L41
$$ 14 -148 438 -291 -347 239 -243 184 380 -269 249 120 -284 241 -203 26 87 -400 517 22 -177 164
3259A64o98L40M04o46L82R9k45O74r08M31N07q35P51k2o34P20p93K91L54p06P31
$$ 164 -534 -194 210 -436 -54 45 -200 474 -434 -3 504 -331 420 398 -236 484 -309 -18 336 -370 361
3280C61k66m07P17l26n56P57n85K37K63o18Q95o94J09L71n97K79M6k12P07o76
$$ 361 95 -312 405 79 -477 280 -305 -68 195 -423 472 -222 -113 258 -339 -60 -14 -226 481 -195
3300a95p9Q32n94nJ60n16P41m10K0O38q79K55K07l63L51n5l82O02o04K9N74o82
$$ -195 -274 558 -36 -41 119 -397 344 -66 -46 592 -287 -32 175 -188 163 108 -274 328 -276 -247 327 -355
3322c55L85Nl21N91n83n0O27p46N61R0o18P85l09o5M87q03M70J40m89M58k06r3
$$ -355 30 35 -286 305 -278 -328 299 -447 114 204 -414 371 62 -3 484 -319 151 291 -198 260 54 -39
3344c9K98l47L63m07l51Q23l94k80N45m41r5N89o08P25j96n90O73o57L16K83m51
$$ -39 259 -88 275 -132 -483 340 -54 -334 211 -230 -325 264 -344 381 185 -405 268 -389 -73 210 -241
3365b41L96j33l70Q32o72J1Q29j122N07j05k34O76m81K92M1p52Q91j06o58Q56
$$ -241 155 22 -348 484 -188 -177 652 -470 37 -68 -302 374 -107 185 226 -526 365 259 -399 457
3385D57o69j06N95o17M37k02l43Q78n45j16Q69q55L85M5o40P74k25n64J038p84
$$ 457 -212 -318 277 -340 97 -105 -448 430 -115 -231 638 -217 168 213 -427 347 122 -442 596 -188
3405a88K77J1m56J004o14l35P74q53M64J06m73N67m20l38O29l66J36J48l62M00
$$ -188 89 100 -356 648 34 -301 473 -380 84 190 -283 284 -136 -474 155 -211 -75 73 -289 111
3425A11J09p02Q11l79PN41q77M58J4l78P17l19r9N83o60O3j8l09Q10l47k25M93
$$ 111 220 -482 329 -50 -43 498 -379 79 93 -285 432 113 14 597 -63 0 -18 -327 483 136 -89 404
3447D04r28K53K73l58M84j54m61N08l18K90K15n94N33j72l3N09m70J68J32o03
$$ 404 -524 -271 2 -356 128 -26 -487 21 -297 -7 208 -386 147 -25 -58 451 -19 149 281 -322
3467c22O46j96o03O02m38J49M08l34M56l73l23O52m43K40J99o38N90k89m06M57
$$ -322 324 128 -475 127 -311 -162 246 -88 368 -5 -328 324 -119 121 320 -318 272 -17 -423 34
3487C4j06k65O26p66O33q8l39P60o44m5N60o63L31J54j20K15m5k92M72n51J50
$$ 34 -72 -337 289 -477 156 68 -271 489 -155 -200 360 -303 28 182 62 277 232 -60 412 -139 11
3508A1K20n22M01K32p55N43j52k25M77q37J000o18q6O78l47k54O64p65O70j12
$$ 11 231 -291 110 342 -413 130 -22 -247 230 -607 393 -225 -311 367 20 -234 430 -335 335 223
3528B23o08Q13l60KK84j69j39K88l81K91m00L82P0n11J93j00l51P05j85m73P55
$$ 223 -385 428 68 70 354 185 46 334 -47 244 -156 226 296 -215 -22 -122 -473 232 47 -426 329
3549C29n92K61L90q82M60J48n09Q51l92LN2k98N24k53q5J86l94L73M7l65M27j24
$$ 329 -263 -2 388 -494 -34 114 -395 456 64 67 119 -179 345 92 7 193 -201 172 219 -146 281 157
3571A57n42O87j98m43M76l95M95l17l65N22j31j07L39m42K17L50o83P11l85o5
$$ 157 -385 302 104 -339 137 -258 237 -80 -445 77 -54 -161 178 -264 -47 303 -380 331 -54 -119
3591a19N32m78K61O9n24N91k45j91K20m36L73L69n86L23O2l23N82n13j46L39o74
$$ -119 413 -65 196 265 -259 332 87 -104 116 -320 53 422 -164 159 221 -102 480 -33 -179 160 -514
3612e14L97N5j86N59m44K7L14m80K54r4k10P06o02K92J83m97N40l2o27Q01n11
$$ -514 -117 -62 -248 311 -133 -106 208 -272 -18 -112 -322 384 -218 74 257 -240 300 268 -359 442 -69
3633f9l45P90p20L75j7l52P15l04j99K12M9j14K46m79K22K7l36O94m01k85O19
$$ -69 -414 376 -344 31 14 -338 377 73 -126 86 135 21 267 -212 10 37 -299 395 -6 -291 328
3654C28q1j00M7l27K68q7j92K98p11O38J05l49M03k31o1K02l88N80l10m86N37
$$ 328 247 147 194 -133 135 48 -144 154 -557 81 186 -163 240 9 -52 150 -238 342 32 -454 83
3675H3k72j50K96l41K72R2j31N79o98nM18l43p1N79o70O80k95k9Q0l29L34K51
$$ 83 -189 -339 -43 -384 -112 -20 -151 428 -270 -275 143 -200 -271 308 -362 318 23 -6 74 -255 79 330
3697C30l35L09k24j93O12n64nN8l85M34r5l01O49l03j39M0k36L79K81l99M92k94
$$ 330 -5 304 80 -113 499 -65 -70 -12 -397 37 -58 -359 290 -13 -152 -112 -348 31 312 -87 405 111
3719A11l55L73m34M14O1r5K67l17l6K84n13N11Q3n25M30l31j49L98l84K12N0m35
$$ 111 -244 129 -305 109 170 75 342 25 -11 273 -240 271 354 -171 259 -72 -221 177 -207 5 55 -380
3741c80K62o2L3P5j67J33K74n19L37J82m77N92l02J47J54n82N48L5o08N35k05
$$ -380 -118 -180 -147 -72 -239 -106 168 -351 -14 168 -309 283 -19 128 282 -300 248 283 -325 210 5
3762Ej95L14k36L12n7n15O99n25p3N29n26J91K32l36L02l07M3L26l45J78L34n50
$$ 5 -190 124 -112 200 143 -372 327 -198 -271 258 -268 -77 155 -181 121 -186 -143 183 -162 16 350 -200
3784b00L99j92k17N63m13K64J2m72N22k52m05O78m84m4O21n50K89K72p58L80J2
$$ -200 199 7 -210 353 -60 204 216 -256 266 14 -391 287 -197 -241 380 -170 119 391 -367 13 25
3805B5p2J65k44J19K9k39M74j87k91M62l72J37J67l59O60k34k58L85o18Q4K46
$$ 25 -47 118 -126 -7 22 -217 257 70 -221 241 -131 6 173 -186 474 240 -18 367 -251 -167 79
3826G9k90M69l91l5L45l09m5M28o03L83j32q9N78m08J09n8m25N32j82r7L80l84
$$ 79 -211 258 -133 -168 177 -132 -177 251 -352 31 -101 -190 388 -20 89 31 -394 138 -44 -141 239 -145
3848a45K02N6l01N31k40k83N70o76K38K62m56M60r2o9J00l40N2M61m91K11l0j74
$$ -145 57 113 -188 343 103 -180 390 -286 -48 214 -242 218 126 57 157 -183 -131 330 -161 50 20 -154
3870a54M40l65k81M91k06O6J93l51J97l5l08L87k63L99O3m17M92m50j95L83m19
$$ -154 286 -79 -360 131 -75 -9 184 -167 30 -5 -313 74 -189 210 273 -144 348 -102 -297 86 -333
3891c33R0L61m45L91Pm60N40m14K51K62k55J7J33p04P32k50l1L37k99J87k32j18
$$ -333 -243 118 -327 64 71 -389 151 -263 -12 250 -5 12 145 -559 173 -77 -108 229 -70 117 -115 -233
3913b33L72j08nM7k40K13O7l47K10K64l31J29r9l0MK7K47k79K06l4m07N16l0m44
$$ -233 139 31 26 73 -167 46 113 -234 -24 240 -91 38 -61 -91 -87 -60 187 -92 114 80 -327 189 159 -285
3937b85M37j15j34L11m38J28J72j13J74j81j11K17k36R5J54k64J81K59n41N25
$$ -285 152 37 -97 214 -224 -96 76 -37 137 -44 -155 62 -174 -79 75 -189 -8 251 -290 235
3957B35j69k9L40n07K02j75q7L30k19J02L55m74J54oj29Q9j63J65K44l82M57j12
$$ 235 66 37 377 -130 72 -103 -190 140 -79 23 378 -96 58 52 -77 12 -151 14 258 -124 333 221
3979B21j79K58k00j81J07l43M95ml92M32j83j34L47m64K56kl57L07L8j64K90j66
$$ 221 42 300 100 -81 26 -317 178 174 -218 214 31 -103 244 -220 36 34 -323 -16 22 -142 148 -18
4001a8k33M31m60L37j11P8Q9k46J05R8l86O61Mo49N33k14j27M24l58J28Q6m81
$$ -18 -251 180 -280 57 -54 24 113 -133 -28 70 -316 345 349 -300 233 19 -108 316 -42 86 172 -309
4023c09N57k72p6L68m59J51Q3l63M90l15J76M3m69K75K58m08K13K35j95J42l09
$$ -309 248 -24 -100 268 -191 -40 43 -320 170 -145 31 74 -395 -120 138 -270 -57 178 -17 125 -184
4044a84J21K78l94L00j70P0l43K19K99om27K88J17n88L98l35L49J69j37j33L66
$$ -184 -63 215 -179 121 -49 21 -322 -103 196 190 -237 51 168 -420 -22 -357 -8 161 24 -109 257
4065B57p24L74J11k57M42m00l4K40k89N17j51l40M60l63J25K97n19L83k8m11M42
$$ 257 -467 -93 18 -239 203 -197 -231 9 -280 237 86 -254 206 -157 -32 265 -254 129 101 -310 132
4086A32k80J39K10l70M34m24n6K16q0M8J56l11L11k0n06M85k31P6J75n4J38k15
$$ 132 -148 -9 201 -169 265 -159 -215 1 -79 -31 125 -186 125 105 -401 84 -147 -71 104 50 188 -27
4108b7k27M13j48p1J46l18L30j22k54L79j66l5L53m03j42N81l71P3J31n00L33
$$ -27 -254 159 11 -60 86 -232 98 -24 -278 101 -65 -100 253 -150 -292 289 -82 -9 122 -378 -45
4129d5j29M62k32k54L21k66J24J57j06j04L58o56M30j88j45M97l70K47J85n30
$$ -45 -174 288 56 -198 123 -143 -19 138 32 -72 286 -370 60 -128 -273 224 -146 101 286 -244
4149b44J33J91j14K27k78J28J43j03K27k08l55L71k66j65M26j67j36K92j43K09
$$ -244 -111 80 -34 193 -85 43 186 83 310 102 -253 118 -148 -313 113 -54 -190 102 -41 168
4169A68j44j19R8k58M65k27j36L70k09p0N60n84K01R3n42N55J33m48J51l1k36
$$ 168 24 -95 3 -255 210 -17 -153 217 8 -62 498 -86 115 208 -334 221 354 -94 57 26 -210
4190b10L22j60K0N0k37L01m39L78R4l01K64l47L8K91l43J21L04j55J99k17j0J48
$$ -210 112 -48 -28 22 -215 86 -353 25 119 -182 82 -265 -227 64 -279 -158 146 -9 190 -27 -37 111
4212A11p9M8L8l65K37J93l84K15K6j82L43k62J10j18k91M41j71J6L82m00J80O9
$$ 111 32 80 118 -247 -10 183 -201 14 40 -142 201 -61 49 -69 -360 81 -90 -74 308 -92 88 157
4234A57k08r2K88l43J59J18r6P1k89L52k33o0M12l63m9J72l30M19j8k83K24j99
$$ 157 -51 -143 145 -198 -39 79 -17 54 -235 117 -116 -176 236 -127 -176 -4 -334 85 67 -216 8 -191
4256a91qK19l11O04n05J64L05l14l5L05m60O3M76k63j8j47j9K45j84J19R9m01
$$ -191 -199 20 -291 313 -192 -28 277 -37 -72 233 -227 -164 312 49 31 -116 -135 110 -74 45 144 -257
4278b57M6L19k19K73j14M4O8l97L66m25L81J13r5j15Q3k71K01m3m37J005p69K32
$$ -257 -211 108 -111 162 48 92 160 -237 129 -296 85 198 103 -12 71 -200 1 -42 -479 526 -243 -11
4300a1J8m14O43j72oQ9k08K88r2l74O5K35j15K57p7k63K14m03J69L57k01lj54
$$ -11 7 -407 236 64 58 147 -61 227 135 -239 -174 61 -54 203 126 -137 77 -326 -157 200 -1 -4 -158
4323a58K4P9o1m3K82j02n9k37J48L07q9r7K69k30J46j2k21J49k32J08L21n14K98
$$ -158 -134 -55 -116 -159 123 21 -38 -275 -127 180 91 -6 263 33 179 167 -54 95 -137 -29 292 -222 76
4346G6j57KL12j84L0N4l40J44K07k19jj35J61K84n05M97M9l26J33o3j29K14j76
$$ 76 -81 -79 233 49 79 133 -207 -63 144 -75 -76 -211 -50 234 -271 226 275 -51 82 19 -110 104 -72
4369g2R7J67k64O8J11j48L04m07J63J07n40N71j16j88J53q8j28K31k68M02l03
$$ -72 25 192 -72 -4 107 -41 263 -144 19 126 -414 157 41 -147 6 -82 -210 21 -247 155 -148
4390a48o0K55Q3k02R9r0J72Rj26J93k41J79O7k87J18L24n05K68j60k5L13q9l45
$$ -148 -208 47 130 -72 27 -63 109 118 -8 185 -56 123 190 -97 21 345 -160 108 -52 -77 236 147 -198
4413a98K33o3J16j65J47O9j41J14l2k14K35J75l97L77k71J04j16j56L97k04l5
$$ -198 35 -28 88 -77 70 139 -2 112 80 -134 101 276 -121 256 -15 89 -27 -183 214 10 -25
4434b5J82ml9r7k57M31n2k58p5PJ9N53m41J54J2rJ26j97j80p6J59O0J46k17M23
$$ -25 157 153 114 17 -240 191 139 -119 -194 -187 -168 385 -56 98 110 101 227 30 -150 -226 -67 -7 139 -78 345
4459C45l42l49M88p0J5k08j09K38kk25M22m52K23J16j4j22K07k45K25k79j47K20
$$ 345 3 -346 142 72 87 -121 -230 8 6 -219 203 -249 -26 90 76 -46 161 -84 141 -138 -285 -65
4481f5l56K72o5j29K75p2L08k24l48M73j55j64O05k72j65K98l94L09k04m2K61
$$ -65 -421 -149 -214 -343 -68 -140 168 -56 -404 69 -86 -250 355 83 -82 216 -178 131 -73 -115 146
4502A46j26k3O2k05K07o9nJ35J02m69K21j15K43j08n18N27j19M1K39j85Q3m1j70
$$ 146 20 -3 59 -146 61 -8 -13 122 224 -245 -24 -139 104 -4 -522 5 -114 -73 166 -19 64 23 -147
4525a47L85q4j16J54J4k33J04j70K08k7j34J22j46L7n4o9J94o6K32K2n54J75J72
$$ -147 238 154 38 192 206 -27 77 -93 115 88 -46 76 -70 -33 -87 -156 38 -28 204 226 -328 -153 19
4548A9l31J41K28m03M84j65j47K12L3J8k60j88P07l76j88L84l48Q9J40k78L96
$$ 19 -312 -171 57 -346 138 -27 -174 38 71 89 -171 -359 348 -28 -216 168 -180 -91 49 -229 167
4569A67j87m3K83k97J87J51m86L08k87jM48m79J23L12n23N13n2k69lr8K78M9k39
$$ 167 -20 -63 220 -77 110 261 -225 83 -204 -205 243 -236 -113 199 -324 189 137 -132 -135 -233 45 94 -145
4592a45L02j16j28K87k31j44K45j12J9L00l27K25l09J86j34J35l7O4o36O36j45
$$ -145 157 41 -87 200 -31 -175 70 -42 -23 277 -50 175 -134 52 -82 53 16 80 -556 80 -65
4613f5k34N50l63J63M8k43R0j4j39M74m85K95j49j41L94j80k2K51l31J4L79l94
$$ -65 -299 251 -112 51 99 -144 -54 -68 -207 267 -218 77 -72 -213 181 1 -21 230 -101 -87 292 -102
4635a02J04kJ48j19j30K76N0l64R3n8p1j10M46l58K8P4j93J30N1K53l67R4K73
$$ -102 2 0 148 29 -101 175 225 -139 -46 -104 -175 -285 161 -197 -169 -95 -288 -158 -107 146 -221 -127 146
4658A46n0k21L61l38J46N9m8Q6k39j03K67j84m9n3O0K67k95K22L4j97R3O1j60
$$ 146 96 -125 236 -102 44 103 55 141 -98 -201 66 -118 -167 -220 -160 107 -188 34 68 -129 -36 25 -135
4681a35J61j40P1M0K7j74K99l57L95j12m6K6k95K34J17l68K76Q7l31J62o7r8L68
$$ -135 26 -114 -43 -3 24 -150 149 -208 187 75 29 55 -240 -6 111 -257 19 106 -225 -63 -130 -228 140
4704A40l16L27K1n11M58m30L79m0m2R6j23j58L11j77L44m9j68N1r8k30N79m65
$$ 140 -176 151 172 -339 119 -311 68 28 -14 82 -41 -199 112 -65 279 230 62 113 15 -215 364 -101
4726a01R0K10j8r9j15J0N2j95J41o2J81k74J05l06K82m2k6Q8k60M29k73j4J65
$$ -101 -11 199 181 82 -33 -23 29 -166 -25 -87 94 -180 -75 -381 -99 -141 -167 -79 -339 90 -183 -197 -32
4749c2J13l20J11R3M3j01N7L19k70j39Q3j44J85J23l36M27j69k12K89j65L1R4
$$ -32 81 -239 -128 -35 8 -93 -36 283 13 -126 -43 -187 -2 121 -215 212 43 -169 120 -45 -14 80
4771H0J9L5k6p2K02m32L60j93Q2o0P7l35Q8mO6M18m18M2K52k95L36j16l67N99
$$ 80 99 134 108 36 238 -194 166 -27 55 -5 72 -263 -175 -179 -113 305 -113 -71 181 -114 222 106 -261 338
4795C38m84q2L26k60K74K5k25M11n57M1Q5j5K16p5O8j20k3m2K18j48K05J00l44
$$ 338 -146 -228 98 -162 112 137 -88 323 -234 -193 -108 -123 93 18 86 -34 -57 -99 119 -29 176 276 -68
4818f8M10m37j95K29j03P3R8N3l4J48n3qM9l28K17m86M40q2K43k7n25K43l3M7
$$ -68 342 -95 -290 -61 -164 -91 7 60 26 174 121 113 162 -166 51 -435 5 -77 166 139 -386 -143 -176 -129
4842a29M74k59j80J82j62JJ86%mN3k27L01k15J65r0j15J91j76J22p3j67J32P1
$$ -129 345 86 -94 88 -74 -73 113 113 109 162 -65 236 21 186 96 -19 172 -4 118 45 -122 10 81
4865H1l01K09pn0J65j12P9J7k81M99j42k85Q7L5J75l24K55j9n4k15N67l11j1k86
$$ 81 -220 -11 -18 -68 97 -15 64 81 -200 299 157 -128 -41 -6 169 -155 100 81 27 -188 379 68 57 -229
4889b29P9J43O8q4J66k1n01N38m16L24p0k44J60Mq2K72l80K05j97K47Q2l07P7
$$ -229 -150 -7 61 -23 143 122 -379 159 -257 67 -3 -247 -87 -83 -165 107 -273 -68 -265 -18 64 -243 -166
4912a66K16p8k93O08p04M41L2j37J32pj71M02j39q5j62q4J52K30l27L0LJ7J37
$$ -166 50 -28 -321 287 -417 24 56 -81 51 44 -127 275 136 51 -111 -195 -43 187 -140 -110 -107 -90 47
4935D7m15L62R0j36L0k4M8M4N2q2K12j44L3o0qo9k94M25r5j7r4J19NLk02KJ05
$$ 47 -368 -6 84 -52 -22 -46 2 46 98 16 228 84 117 57 49 -20 -314 111 16 -1 -95 24 29 32 -170 -168 -63
4962f3m9K39k6q3n5k22K61J85j22P4j45N0L0l04K44K83m81L00J45r0j13n9j18
$$ -63 -112 127 101 18 -37 -259 2 187 65 139 -6 44 74 -230 14 297 -184 116 261 171 58 -1 -119
4985a19K65j7l02L9j69M98k07Q0Q8m82L94q5K4j9k02Q4K24n3K9m9k39K54k33P5
$$ -119 146 129 -173 -134 -303 195 -12 68 156 -326 68 -17 7 -12 -214 -130 94 41 70 21 -218 36 -197 -122
5009a22Oj04Q0J79K3J75l41K90r6m1j05K20j98m2J02P5rk81J70Q0k70M35j99o9
$$ -122 -116 -220 -140 39 62 237 -104 186 90 49 -56 164 -34 -76 26 101 92 -189 -19 61 -209 226 27 -42
5033d2J3N0k12L17k97J40R8l09L59q6N6j6q5J32J5L1l9l65M23o9j6l7o6L8M6P3
$$ -42 -29 21 -191 126 -171 -31 67 -242 117 31 87 71 -14 118 133 164 125 -240 183 114 98 61 -5 33 79 152
5059A52j60n1J65k37M9j62M96j85k32J06k0j70L10k72M79k22j5J46l51L11j70
$$ 152 -8 -59 106 -131 -82 -244 252 67 -165 -59 -79 -249 61 -211 268 46 31 177 -174 137 -33
5080c3L1K3j49Q6K10j95M8j60J37J24j73J57Q7r4j26R6M8Q1rr5j02k77L50j60
$$ -33 -2 21 -128 -42 168 -27 21 -139 -2 122 -51 106 193 99 -27 69 117 198 189 94 -8 -285 65 -95
5104i5P0RK54n41L91J32k48J41k34L60j97K46l70J06J9M4j83JL5MJ54j67M00k91
$$ -95 -25 -16 238 -303 88 220 -28 113 -121 239 42 288 -82 24 43 87 -96 -95 -60 -56 98 -69 331 40
5128D0q7L4q2o2k11K86J86n1J53k98L02l34L53m33J85L2k78K59J35j27J67j46
$$ 40 -47 -13 -95 -157 -368 -82 104 53 206 -92 210 -124 229 -204 -19 13 -265 -6 129 2 169 23
5150B3l8J51l76J27JL64q5j07j98O4K5J37k5o5K4J5k55K26J6J15o6j15P5j5j27
$$ 23 -15 136 -240 -113 -112 252 167 60 -138 -74 -49 88 63 -2 22 37 -218 8 24 139 73 -42 33 18 -109
5175a09K67n16N07j29r6K63j61j69L61m06K72j43J18J0J2k05M09k85L4Q8k03j34
$$ -109 158 -358 149 20 -76 187 26 -143 218 -188 84 -59 59 69 81 -124 285 0 34 122 -81 -215
5197b15L99j48K8j79K30k30L6K3P2m5K66k45Q6M9J20k48J12j26J14N6l65L81k22
$$ -215 184 36 64 -115 115 -115 -79 -56 16 -29 237 -8 78 127 247 -1 111 -15 99 155 -210 171 -51
5220e1j7J62k46J5K01k15J80Nj44q8J40J40k7J5J7j45L76m04j8J58J27j30l0J08
$$ -51 -68 94 -152 -137 64 -151 29 34 -110 -198 -58 82 55 70 87 -58 318 -86 -104 54 181 51 21 129
5244A29k24L12k88J91J9j81J50O0k15K00k92j63L53r4K39j48m83M65Q1k10L46
$$ 129 -95 217 -71 120 139 -42 108 168 -47 153 -139 -302 51 -43 196 48 -435 30 111 -99 247
5265B47m95J75k5l4R4N4p0J62m92M83P2q2J13j05p7oj31J52o1l6K03l10R1J36
$$ 247 -248 -73 -98 -132 -38 16 -54 108 -384 99 171 89 202 97 20 14 -117 35 -26 -62 141 -169 -78 58
5289E8j78J85j41K84m30J90P0J36m48M43k0o80N80J65l34K03J19j73R6k99K37
$$ 58 -120 65 -76 208 -222 -32 38 174 -274 169 149 -531 49 214 -120 83 202 29 125 -174 63
5310F3j33L9J57K9n4J69l55J70j01j4J89r9k67J80K4K54k46j56L3ok95M54j39
$$ 63 -70 -31 126 155 101 270 -85 85 -16 -30 159 60 -207 -27 -3 251 5 -151 -118 -124 -419 35 -104
5333a04P5l9J39r8j50M04j60j99K14l6j70J02P5j87M26k29j29M02o48J66J67j50
$$ -104 -29 -68 71 -27 -177 227 67 -132 82 46 -124 -22 53 -134 292 63 -66 336 -312 -146 21 -129
5355a29K27l5r2O8k83N21l65k68K97J50k01K13k67J92J89l80L30Qk53J49j30N3
$$ -129 98 63 -29 39 -244 277 -88 -356 -59 91 -110 103 -164 28 217 -163 167 175 -78 71 -59 -6
5377fj12k2J29j93K47q4pj1L6p9K94j91l56N57j42P5j46J67M3k88l8J23r3J34
$$ -6 -118 -140 -11 -204 43 -41 -48 -59 -23 -102 192 1 -355 202 60 135 -11 156 199 -89 -127 -4 -97 37
5401C7j8r7K52k07r1P3q4J06n9L0p2K65j02l8M00n32Q8j91P4M49m95O53l42m7
$$ 37 19 -78 174 -33 -124 -51 -135 -29 -88 -58 -130 135 33 -5 395 -137 -49 -240 -166 283 -212 441 99 52
5425E2l7k64K13j63J31J54n6j64M07k81M5l9J2j06M2J62J24m67K67k50K32Q3r1
$$ 52 15 -249 -36 -199 -68 86 30 -134 273 -8 37 -2 10 -96 -54 108 232 -235 32 -218 14 97 6
$$ [...]
8191b
##END NTUPLES=NMR FID
##END=
