##TITLE=1H_Pr CS2-2D
 CDCl3
 8 sc, 
 6.05.2022
##JCAMPDX= 6.0         $$ Bruker NMR JCAMP-DX V2.0
##DATA TYPE= NMR FID
##DATA CLASS= NTUPLES
##ORIGIN= UXNMR, Bruker Analytische Messtechnik GmbH
##OWNER= root
$$ XWIN-NMR		Version 3.5
$$ Fri May  6 11:25:13 2022 Russian Standard Time (UT+4h)  she@DPX200
##.OBSERVE FREQUENCY= 200.1313499996
##.OBSERVE NUCLEUS= ^1H
##.DELAY= (6, 6)
##.ACQUISITION MODE= SIMULTANEOUS
##.ACQUISITION SCHEME= undefined
##.AVERAGES= 8
##.DIGITISER RES= 18
##SPECTROMETER/DATA SYSTEM= spect
##.PULSE SEQUENCE= zg30
##.SOLVENT NAME= CDCl3
##.SHIFT REFERENCE= (INTERNAL, CDCl3, 0, 15.7039)
##AUDIT TRAIL= $$ (NUMBER, WHEN, WHO, WHERE, WHAT)
$$ ##TITLE= Audit trail, XWIN-NMR		Version 3.5
$$ ##JCAMPDX= 5.01
$$ ##ORIGIN= Bruker BioSpin GmbH
$$ ##OWNER= she
$$ F:/spectra/data/she/nmr/H-F/1/audita.txt
$$ ##AUDIT TRAIL=  $$ (NUMBER, WHEN, WHO, WHERE, WHAT)
(   1,<2022-05-06 11:23:47.95 +0400>,<she>,<DPX200>,
      <created by zg, POWCHK disabled, PULCHK disabled
       configuration hash MD5:
       00 E9 B6 7A A2 85 ED C7 34 08 36 98 17 FE 4E 26
       data hash MD5: 16K
       E6 81 AB E0 7B 38 E0 B4 07 7C 88 3F 0B 26 15 E6>)
$$ ##END=
$$ 
$$ hash MD5
$$ F2 73 FB EA EF F2 19 65 A7 D5 0E 04 DC 2B 0A D6
##$RELAX= 
##$RELAX= 
##$RELAX= 
##$RELAX= 
##$RELAX= 
##$RELAX= 
$$ Bruker specific parameters
$$ --------------------------
##$DU= <F:/spectra>
##$EXPNO= 1
##$NAME= <H-F>
##$PROCNO= 1
##$TYPE= <nmr>
##$USER= <she>
##$AMP= (0..31)
100 100 100 100 100 100 100 100 100 100 100 100 100 100 100 100 100 100 
100 100 100 100 100 100 100 100 100 100 100 100 100 100 
##$AQSEQ= 0
##$AQ_mod= 1
##$AUNM= <au_zg>
##$AUTOPOS= <>
##$BF1= 200.13
##$BF2= 200.13
##$BF3= 200.13
##$BF4= 200.13
##$BF5= 200.13
##$BF6= 200.13
##$BF7= 200.13
##$BF8= 200.13
##$BYTORDA= 1
##$CFDGTYP= 0
##$CFRGTYP= 5
##$CHEMSTR= <none>
##$CNST= (0..31)
1 1 145 1 1 1 1 1 1 1 1 1 1 1 1 1 1 1 1 1 1 1 1 1 1 1 1 1 1 1 1 1 
##$CPDPRG= <>
##$CPDPRG1= <>
##$CPDPRG2= <>
##$CPDPRG3= <>
##$CPDPRG4= <mlev>
##$CPDPRG5= <mlev>
##$CPDPRG6= <mlev>
##$CPDPRG7= <mlev>
##$CPDPRG8= <mlev>
##$CPDPRGB= <>
##$CPDPRGT= <>
##$D= (0..31)
0 1.2 0 0 0 0 0 0 0 0.06 0 0.03 0 0 0 0 0.0002 0 0 0 0 0 0 0 0 0 0 0 0 
0 0 0 
##$DATE= 1651821827
##$DBL= (0..7)
120 120 120 120 120 120 120 120 
##$DBP= (0..7)
150 150 150 150 150 150 150 150 
##$DBP07= 0
##$DBPNAM0= <>
##$DBPNAM1= <>
##$DBPNAM2= <>
##$DBPNAM3= <>
##$DBPNAM4= <>
##$DBPNAM5= <>
##$DBPNAM6= <>
##$DBPNAM7= <>
##$DBPOAL= (0..7)
0.5 0.5 0.5 0.5 0.5 0.5 0.5 0.5 
##$DBPOFFS= (0..7)
0 0 0 0 0 0 0 0 
##$DE= 6
##$DECBNUC= <off>
##$DECIM= 32
##$DECNUC= <off>
##$DECSTAT= 4
##$DIGMOD= 1
##$DIGTYP= 9
##$DL= (0..7)
0 120 120 120 120 120 120 120 
##$DP= (0..7)
150 150 150 150 150 150 150 150 
##$DP07= 0
##$DPNAME0= <>
##$DPNAME1= <>
##$DPNAME2= <>
##$DPNAME3= <>
##$DPNAME4= <>
##$DPNAME5= <>
##$DPNAME6= <>
##$DPNAME7= <>
##$DPOAL= (0..7)
0.5 0.5 0.5 0.5 0.5 0.5 0.5 0.5 
##$DPOFFS= (0..7)
0 0 0 0 0 0 0 0 
##$DQDMODE= 0
##$DR= 18
##$DS= 0
##$DSLIST= <SSSSSSSSSSSSSSS>
$$ [...]
##$SUBNAM2= <"">
##$SUBNAM3= <"">
##$SUBNAM4= <"">
##$SUBNAM5= <"">
##$SUBNAM6= <"">
##$SUBNAM7= <"">
##$SUBNAM8= <"">
##$SUBNAM9= <"">
##$SW= 18.0517283424761
##$SWIBOX= (0..15)
0 0 2 0 0 0 0 0 0 0 0 0 0 0 0 0 
##$SW_h= 3612.71676300578
##$TD= 16384
##$TD0= 1
##$TE= 0
##$TE2= 300
##$TE3= 300
##$TEG= 300
##$TL= (0..7)
0 120 120 120 120 120 120 120 
##$TP= (0..7)
150 150 150 150 150 150 150 150 
##$TP07= 0
##$TPNAME0= <>
##$TPNAME1= <>
##$TPNAME2= <>
##$TPNAME3= <>
##$TPNAME4= <>
##$TPNAME5= <>
##$TPNAME6= <>
##$TPNAME7= <>
##$TPOAL= (0..7)
0.5 0.5 0.5 0.5 0.5 0.5 0.5 0.5 
##$TPOFFS= (0..7)
0 0 0 0 0 0 0 0 
##$TUNHIN= 0
##$TUNHOUT= 0
##$TUNXOUT= 0
##$USERA1= <user>
##$USERA2= <user>
##$USERA3= <user>
##$USERA4= <user>
##$USERA5= <user>
##$V9= 5
##$VALIST= <valist>
##$VCLIST= <CCCCCCCCCCCCCCC>
##$VD= 0
##$VDLIST= <DDDDDDDDDDDDDDD>
##$VPLIST= <PPPPPPPPPPPPPPP>
##$VTLIST= <TTTTTTTTTTTTTTT>
##$WBST= 1024
##$WBSW= 4
##$XGAIN= (0..3)
0 0 0 0 
##$XL= 0
##$YL= 0
##$YMAX_a= 486737
##$YMIN_a= -653608
##$ZGOPTNS= <>
##$ZL1= 120
##$ZL2= 120
##$ZL3= 120
##$ZL4= 120
##$ABSF1= 10
##$ABSF2= 0
##$ABSG= 5
##$ABSL= 3
##$ALPHA= 0
##$AQORDER= 0
##$ASSFAC= 0
##$ASSFACI= 0
##$ASSFACX= 0
##$ASSWID= 0
##$AUNMP= <proc_1d>
##$AZFE= 0.1
##$AZFW= 0.1
##$BCFW= 1
##$BC_mod= 2
##$BYTORDP= 1
##$COROFFS= 0
##$CY= 11.3945322036743
##$DATMOD= 1
##$DC= 2
##$DFILT= <>
##$DTYPP= 0
##$F1P= 2.36226072786647
##$F2P= -0.459571619588291
##$FCOR= 0.5
##$FTSIZE= 0
##$FT_mod= 4
##$GAMMA= 1
##$GB= 0.15
##$INTBC= 1
##$INTSCL= 1
##$ISEN= 128
##$LB= 0.24
##$LEV0= 0
##$LPBIN= 0
##$MAXI= 10000
##$MC2= 0
##$MEAN= 0
##$ME_mod= 0
##$MI= 1.114404
##$NCOEF= 0
##$NC_proc= 0
##$NLEV= 6
##$NOISF1= 3.799351
##$NOISF2= 2.8
##$NSP= 1
##$NTH_PI= 0
##$NZP= 0
##$OFFSET= 15.70392
##$PC= 1
##$PHC0= -18034.85
##$PHC1= 16.00075
##$PH_mod= 1
##$PKNL= yes
##$PPARMOD= 0
##$PSCAL= 0
##$PSIGN= 0
##$REVERSE= no
##$SF= 200.130013532006
##$SI= 16384
##$SIGF1= 3
##$SIGF2= 2
##$SINO= 400
##$SIOLD= 16384
##$SREGLST= <1H.CDCl3>
##$SSB= 0
##$STSI= 0
##$STSR= 0
##$SW_p= 3612.71676300578
##$SYMM= 0
##$S_DEV= 0
##$TDeff= 0
##$TDoff= 0
##$TI= <>
##$TILT= no
##$TM1= 0
##$TM2= 0
##$TOPLEV= 0
##$USERP1= <user>
##$USERP2= <user>
##$USERP3= <user>
##$USERP4= <user>
##$USERP5= <user>
##$WDW= 1
##$XDIM= 8192
##$YMAX_p= 0
##$YMIN_p= 0
$$ End of Bruker specific parameters
$$ ---------------------------------
##NTUPLES= NMR FID
##VAR_NAME=  TIME,          FID/REAL,        FID/IMAG
##SYMBOL=    X,             R,               I
##VAR_TYPE=  INDEPENDENT,   DEPENDENT,       DEPENDENT
##VAR_FORM=  AFFN,          ASDF,            ASDF
##VAR_DIM=   8192,          8192,            8192
##UNITS=     SECONDS,       ARBITRARY UNITS, ARBITRARY UNITS
##FACTOR=    0.0002768,     1,               1
##FIRST=     0,             0,               0
##LAST=      2.2672688,     0,               0
##MIN=       0,             -653608,         0
##MAX=       2.2672688,     486737,          0
$$ Real data points
##PAGE= N=1
##DATA TABLE= (X++(R..R)), XYDATA
$$ [...]
2177e72j7N15k88q41Q19J201q80p42J476K8j762O80J491j632n48J353P73p86M52
$$ -572 -589 -74 -362 -1203 -384 817 -63 -805 671 699 -1063 -383 1108 -524 -1072 281 1054 268 720
2196G20j036N68j22j166J887k17j140K39J171j149o44P20K0q91J041K9j68k47
$$ 720 -316 252 130 -1036 851 634 -506 -267 904 -245 -889 -169 -149 -1040 1 30 -138 -385
2214c85J158j094m24L91J100j285L79j91N95o34k85L26O31N4k3L96k06q87L76
$$ -385 773 -321 -745 -354 746 -539 -160 -351 244 -390 -675 -349 282 336 313 709 503 -384 -8
2233hP61r59k93R28J063k355P74k89K09m06m41R03M02j144M02J062k85q02P86
$$ -8 753 -206 -499 429 1492 -863 -89 -378 -169 -575 -1016 -113 289 -855 -453 609 324 -478 308
2252C08j6r01j9J083J34j510J405J47j021L76L84m00l61L68L30l62l8m01K90N20
$$ 308 292 -609 -628 455 589 -921 484 631 -390 -14 370 -30 -391 -23 307 -55 -93 -494 -204 316
2272C16j442J001R32j111P1Q56r93q76J262L04o79j60P08l79k91O30O0J7p32L57
$$ 316 -1126 -125 807 -304 -233 623 -370 -1246 16 320 -359 -519 189 -190 -481 149 209 226 -506 -149
2292a49R80o38n26K81P52p92o31J407j16j095N19N25o45k86L93J46m37KL47K1
$$ -149 831 193 -333 -52 700 -92 -723 684 568 -527 -8 517 -128 -414 -21 125 -312 -310 37 58
2312E8Q2m43J14N78o95k7N54j04l56N11k9l70M03L64n59m36R45k47m66L81L2l12
$$ 58 140 -303 -189 389 -306 -333 221 117 -239 272 243 -127 276 640 81 -355 590 343 -123 258 290 -22
2334b2l03J95L81j22o31L36M15m55l26Q50j18o75J39J008o29o40R17j08k80k58
$$ -22 -325 -130 251 129 -502 -166 249 -206 -532 318 200 -475 -336 672 43 -597 320 212 -68 -326
2354c26N63J26k37j30J64K37o94p5Q05j25o88N19K87l89m56J009m44n35K45J77
$$ -326 237 363 126 -4 160 397 -297 -372 433 308 -380 139 426 37 -419 590 146 -389 -144 33
2374C3l58J50K13l12K0J32O7p3J73l5O2k09j53O05j52l16L41N36m71o43P22J97
$$ 33 -325 -175 38 -274 -254 -122 -55 -128 45 10 72 -137 -290 315 163 -153 188 724 253 -390 332 529
2396E29p75j63P78j81o36N23L6k47k47P9N88m59n18O12J80l28l41Q53k01o66M08
$$ 529 -246 -409 369 188 -448 75 111 -136 -383 -304 284 -175 -693 -81 99 -229 -570 283 82 -584 -176
2417a76N49l82j70M23Q4l68R0J50J15k05l14M08j8km64L02R3l68J43J92l56K20
$$ -176 373 -9 -179 244 328 -40 50 200 315 110 -204 204 186 184 -280 22 115 -253 -110 82 -274 -54
2439e4K52o16J38L18n4m49M91O5j04p2J61k84K26j4J90J50m77P6M93k52l36M92
$$ -54 198 -418 -280 38 -16 -465 26 91 -13 -85 76 -208 18 4 194 344 -133 -57 436 184 -152 340
2461C40J04m37k52M58K03p30M2N04l22j65j47N86l34j6o1K15k96l0N30K11l65
$$ 340 444 7 -245 213 416 -314 -272 232 -90 -255 -402 184 -150 -166 -227 -12 -308 -338 192 403 38
2482C8k63M16R4l56J80K36k24j20J79o4J37r7l50J28J81q0Q6K7l29M2n7P5J82
$$ 38 -225 191 285 -71 109 345 121 1 180 116 253 156 -194 -66 115 35 121 148 -181 -139 -196 -121 61
2505F1k42K06k81J49N7k42M71p4j19r3M57j35j95J23J91k19j46J55J89k56k14
$$ 61 -181 25 -256 -107 -50 -292 179 105 -14 -107 350 215 20 143 334 115 -31 124 313 57 -157
2526a57L20j46M7K61j11Q4n50K21k23L61m76O39m21J8M14k82m22P14n08l58N19
$$ -157 163 17 64 325 214 298 -252 -31 -254 107 -369 270 -151 -133 281 -1 -423 291 -217 -575 -56
2547e6m10M85j28K98l72k54k34M64n23L87L89p4m50O55j053J328l67J82l3n41
$$ -56 -466 19 -109 189 -183 -437 -671 -207 -730 -343 46 -28 -478 177 -876 452 85 267 234 -307
2567c07K06o7n13P07k84j49j30K85l33l66J564j424P21J19r19R32m46O72k79M24
$$ -307 -101 -168 -681 26 -258 -407 -537 -252 -585 -951 613 -811 -90 29 -890 42 -404 268 -11 413
2587D13r9Q7k51l73L39O13p31m68M35K66k55k35M71p71O17q38J91N25j69J08m40
$$ 413 314 401 150 -223 116 729 -2 -470 -35 231 -24 -259 212 -559 58 -780 -589 -64 -233 -125 -565
2608e65O09n83O56J57J38l37M1m2L6l92Q58l77j79J4R3K30l54N21p43K62l9k66
$$ -565 44 -539 117 274 412 75 116 74 110 -282 576 199 20 34 127 357 3 524 -219 43 4 -262
2630b62J84O0m56M70P2l64K5QL99l04J74k47j74L68K80l41L77J46l63M6J51Q4
$$ -262 -78 -18 -474 -4 68 -296 -271 -263 136 -168 6 -241 -415 -47 233 -108 269 415 52 98 249 333
2652C33n29Q7K05j74Q1m2J57J33m63J27L38n57m9M26N8m19L07j18k6R2p4KL4j0
$$ 333 -196 -109 96 -78 3 -39 118 251 -212 -85 253 -304 -353 73 131 -288 19 -99 -125 -33 -107 -105 -71 -81
2676h1l47M75K90m63J29K89j65l7LK00l07J15q9p5q2M3k24M82O9m71l51Q42j20
$$ -81 -428 47 337 -126 3 292 127 90 93 293 -14 101 12 -63 -145 -102 -326 156 225 -246 -597 245 125
2699A25l91K48L0l02K56q3L71j03k36j74O19j27p34N01N40n86k50M80J53k70l
$$ 125 -266 -18 12 -290 -34 -117 254 151 -85 -259 360 233 -501 0 540 -46 -296 184 337 67 64
2720F4l7K90m55j11Q6J89l82k4O84m6n44J79L58l47k06M81J48l56Oj27K19N5k56
$$ 64 27 317 -138 -249 -163 26 -356 -380 304 258 -286 -107 251 -96 -302 179 327 -29 -23 -150 69 124 -132
2743a32J64K72L6o72O58Mk17q9M66n57k45K72n2j73N16j84l29Q9k8k38L28o8l22
$$ -132 32 304 340 -332 326 330 113 24 490 -67 -312 -40 -92 -265 251 67 -262 -173 -201 -439 -111 -179 -501
2766e01O59j52j80M19k36m4m1J04m93O41J81l19n17P07l1n02K59L42o64M87J21
$$ -501 158 6 -174 245 9 -35 -76 28 -465 176 357 38 -479 228 197 -305 -46 296 -368 119 240
2787B40k82K30q47L35K37M06n86J31L83k57j70P1K03k19j78O95p16k06O61l34
$$ 240 -42 188 -659 -324 -87 319 -267 -136 247 -10 -180 -109 94 -125 -303 392 -324 -530 131 -203
2807b03m1K19J85j97L17m01l51R34n06j21k81L68j98L23K89o34P65r21L81r4K09
$$ -203 -244 -25 160 -37 280 -121 -472 462 -44 -165 -446 -78 -276 47 336 -298 467 -454 -73 -167 42
2828D2m63J53M60m40p30L67J175j252P07L50l59L23l62o56M56N96n30k51J528
$$ 42 -421 -268 192 -248 -978 -611 564 -688 19 369 10 333 -29 -685 -229 367 -163 -414 1114
2847A114j139k98J53j09j09l9R1j25R12m01M4o15J34J61R05o23k33j21K76n44
$$ 1114 -25 -323 -170 -279 -388 -427 -336 -461 451 50 94 -521 -387 -226 679 56 -177 -298 -22 -566
2867e66K5J96O26m43k71J79L49l44q9K96n3Q89q13K67m54J60k54L66k38j02K49
$$ -566 -541 -345 281 -162 -433 -254 95 -249 -338 -42 -95 794 -19 248 -206 -46 -300 66 -172 -274 -25
2888b5l09J84K94k85k07N75j4o68M45M8n5j68L03o9p6p0N8J30k31L06j56L71l06
$$ -25 -334 -150 144 -141 -348 227 213 -455 -10 38 -17 -185 118 49 -27 -97 -39 91 -140 166 10 381 75
2911G5j90N02p6m58j68O58j22l88M7k3j32K38OJ41k68P7P5K56n43N2J87J94n63
$$ 75 -115 387 311 -147 -315 343 221 -167 -120 -143 -275 -37 -31 110 -158 -81 -6 250 -293 -241 -54 140 -423
2934d23M86K89m82Q7MK59L0n9np4J84j16J2Q8q1l17J38J66j87l04Q3k70o3M78
$$ -423 63 352 -130 -43 -39 220 250 191 186 112 296 180 192 280 199 -118 20 186 -1 -305 -222 -492 -555 -77
2958g7j01P73J92j002J92o90O54M8o01J055p19j11J045r70j31l09J47K41M21l15
$$ -77 -178 595 787 -215 -23 -713 -59 -11 -612 443 -276 -387 658 -312 -443 -752 -605 -364 57 -258
2978b58P23o47Q9j64M46Nl60k53R22o58n60O99J87m97k64P66m67L36k95L75J51
$$ -258 465 -182 -93 -257 189 194 -166 -419 503 -155 -715 -16 171 -326 -590 176 -291 45 -250 125 276
2999B76n3m55J17J51j77M94m9j9j50k40q7R9p9O1J7P6Q6q7q7Kn3l7J25j5l18J73
$$ 276 223 -232 -115 36 -141 353 304 285 135 -105 -192 -93 -172 -111 -94 -18 68 -19 -106 -104 -157 -194 -69 -84 -402 -229
3025b29J06M2K5Jj51K23j21n6L40o8j9j52M74l85j26R4K5n8J43j15j64K6K48N8
$$ -229 -123 -81 -56 -55 -206 17 -104 -160 180 112 93 -59 415 30 -96 -2 23 -35 108 -7 -171 -145 103 161
3049A61n0k17r6K8K63k11RJ89j66j0j64N77m46j56Q0K9K57l05L85l9j40k7P1J16
$$ 161 111 -106 -202 -174 89 -122 -113 76 -90 -100 -264 313 -133 -289 -209 -180 77 -228 157 118 -22 -49 22 138
3073A38r4Q0R2j69k45L89k35J13j79N4m6j48j09K05MN3qR3K40k65O3P8j39o3N9
$$ 138 44 124 216 47 -198 191 -44 69 -110 -56 -102 -250 -359 -154 -150 -97 -105 -12 228 -37 26 104 -35 -98 -39
3098c9k3J58M9m5J70j27Q4j06O0j93J22k97J71J62j21j1j10kL43l01N5j71L7P7
$$ -39 -62 96 145 100 270 143 227 121 181 -12 110 -187 -16 146 25 14 -96 -98 245 -56 -1 -172 -135 -58
3122e8jK75l76j27M32k44r9O67o73J50L63k73j19K17j26rN03m12k84p7l1J17j77
$$ -58 -59 216 -160 -287 145 -99 -198 469 -204 -54 309 36 -83 134 8 -1 502 90 -194 -271 -302 -185 -362
3145c62O57j01o07M33k38L06l34R5l21N33p8J11j55P6J23j73N5K11m35M91k6k54
$$ -362 295 194 -413 20 -218 88 -246 -151 -472 61 -17 94 -61 15 138 -35 20 231 -204 287 261 7
3167GK53J94l35j74O5M1M16n15j21J77k50J00l6L93j92k43m0J54M0K8K32m89O11
$$ 7 260 454 119 -55 10 51 467 -48 -169 8 -242 -142 -178 215 23 -220 -260 -106 -66 -38 194 -295 316
3190C16n34L27j85l0M71m59j86J33p8K56K35O5m66J15K0m55J28N03K74j50l09
$$ 316 -218 109 -76 -106 365 -94 -280 -147 -225 31 266 331 -135 -20 0 -455 -327 176 450 300 -9
3211io3M12K08j260Q50m90k5L38k90J95M3L09l7j95o57J47P92k26J76j001J351
$$ -9 -72 340 548 -712 138 -352 -377 -39 -329 -134 -91 218 181 -14 -671 -524 268 42 218 -783 568
3232E68j119J2J030r79L86M0O98p22j179R27L13L81o5q6m35P7o9M81m78l00J485
$$ 568 -551 -539 491 -488 -102 -62 636 -86 -1265 -338 -25 356 291 205 -230 -153 -222 259 -219 -519 966
3253I66o68m12o67Q57j032J064P0R36k29m78m06k71O49j97j14O58q95K20p76P59
$$ 966 298 -114 -781 76 -956 108 178 1114 885 407 1 -270 379 182 68 726 -169 51 -725 34
3273C4r8J73O8l85K20q0K69j90j46O02j272P90N58q06M07j80L30M9m26L57p4k39
$$ 34 -64 109 177 -208 12 -68 201 11 -135 467 -805 -15 543 -263 144 -36 294 343 -83 274 200 -39
3295c9K2m65R18lm35J90l6l90L28L5j64O2K78n05j77L97j39K16p7m5J47J4qq1
$$ -39 -17 -482 436 433 -2 188 152 -238 90 125 -39 23 301 -204 -381 16 -123 93 16 -29 118 132 124 43
3319D3j0J95j61j72L8O5l8J67k80nM37j53m6k31L47k08L96l31J24m26L5J32j14
$$ 43 33 228 67 -105 -67 -2 -40 127 -153 -158 279 126 80 -151 196 -12 384 53 177 -249 -214 -82 -196
3342a96R9n6L27o6j51k74L69M96l01L37l26O9o50O63l97K31m70O58n21q3L98n15
$$ -196 -97 -153 174 108 -43 -317 52 548 247 584 258 327 -323 340 -57 174 -296 362 -159 -242 156 -359
3364c59O28q48J052o80Q69q33N15k91n70j34J15R04o75K83N1M26j040j39Q59k65
$$ -359 269 -579 473 -207 662 -171 344 53 -517 -651 -536 368 -307 -24 27 453 -587 -726 133 -132
3384a32N74l99j03n83O36j26K03n10K58J82P0p6n25J41O17k96J31N68m33q09N61
$$ -132 442 43 -60 -643 -7 -133 70 -440 -182 0 70 -6 -531 -390 227 -69 62 630 197 -612 -51
3405e1J86n2K18k35k02oN26n02j66Q06n74m8OJ35k89J61O5J79m64k80L81k32Q5
$$ -51 135 83 301 66 -136 -142 384 -118 -284 522 -52 -100 -94 41 -248 -87 -22 157 -307 -587 -206 -438 -353
3428c53L44j41L08m57J36J0K16o7J64j76j67L96o97M27n61O37K05n22J37N2l28
$$ -353 -9 -150 158 -299 -163 -153 63 -4 160 -16 -183 213 -484 -57 -618 19 224 -298 -161 -109 -437
3449d37M16K44k96J72K62m22K9L94m97N40L26r03q0M21l80K57J16j09k64N1R9
$$ -437 -21 223 -73 99 361 -61 -32 362 -135 405 731 -172 -252 169 -211 46 162 53 -211 -160 -61
3470f1j64K69p7J75l8l31M67o5j66k07j24M28J11l61J65P7n3m5Pp5N6j48j93N29
$$ -61 -225 44 -33 142 104 -227 240 175 9 -198 -322 106 217 -144 21 98 45 0 7 -68 -12 -160 -353 176
3494A76l42n2p8K63q4R3j73K98j09m7K43j85l24M03j44K05j80l1j2K74j64j69
$$ 176 -166 -218 -296 -33 -117 -24 -197 101 -8 -55 188 3 -321 82 -62 143 -37 -68 -80 194 30 -139
3516a39M56n06K15L6j38J33J56k57J42J9j24K4K4J56l26j32K21l0k19K48P3o5
$$ -139 317 -189 26 62 -76 57 213 -44 98 117 -7 17 41 197 -129 -261 -40 -70 -289 -41 32 -33
3538c3J06j45J63q9rj73J41J35o0K2j60J18J14p7J30k90k6K25P1rJ3J94m77P7
$$ -33 73 -72 91 2 -7 -180 -39 96 36 58 -102 16 130 53 183 -107 -133 92 163 154 167 361 -116 -39
3562c9j23L79j16k4Nk72J84j67J74m6R1oO2k09L87m71L4J76P7q6q8K54jk45J0
$$ -39 -162 217 101 77 82 -190 -6 -173 1 -45 46 40 102 -107 280 -191 -157 19 96 10 -78 176 175 -70 -60
3587f0J86lk2q3p8j22K59j96p9m7M88m18J58k37K53J08k81N2J07n9J10j53J0J50
$$ -60 126 123 101 18 -60 -182 77 -119 -198 -245 243 -175 -17 -254 -1 107 -174 -122 -15 -74 36 -117 -107 43
3611D3k18J18J05qk75K96r1k2J97k31L14n1j59Q9j70O0k24J92J9j76K76j06L68
$$ 43 -175 -57 48 40 -235 61 -30 -52 145 -86 228 177 18 107 -63 -3 -227 -35 -16 -192 84 -22 346
3634C46k29k84K50K6Np1r4j5l4PRJ0K5L01j50n4j39J48N4L9Lj52j72M33r7k68
$$ 346 117 -167 83 109 114 43 -51 -66 -100 -93 -84 -74 -49 252 102 48 -91 57 111 150 153 1 -171 262 165 -103
3660a03jJ76J3o2j41J36k7k00J09M46l79J17k02J83m1k08K88k74L85l24K06j5
$$ -103 -104 72 85 23 -118 18 -9 -209 -100 346 -33 84 -118 65 24 -184 104 -170 215 -109 97 82
3682H2j46P0K09q9j02rJ20o0k49L49j99R8m9N7k65L21l46K27k9r6N3J67l36J35
$$ 82 -64 6 215 126 24 15 135 75 -174 175 -24 74 25 82 -183 138 -208 19 -10 -106 -53 114 -222 -87
3706h7p1J81o1R1R5M4j11j4K6j43k23J92N7P9J95l01j40K83j37m9K55k44j26K12
$$ -87 -158 23 -38 53 148 192 81 67 93 -50 -273 -81 -24 55 250 -51 -191 92 -45 -94 161 -83 -209 3
3730Ck51k7J50J56J7k7kK25l90J42J4j00R0L31k02J97m75k22L4O28r6j19J22n48
$$ 3 -248 -275 -125 31 48 21 19 244 -146 -4 10 -90 0 331 129 326 -149 -371 -337 291 195 76 198 -350
3754c50L99P67n43m56M11J02N37p28m86N04k96m76J038o53L43k16M2K9qk99J76
$$ -350 49 816 273 -183 228 330 867 139 -347 157 -139 -615 423 -230 113 -103 -61 -32 -40 -339 -163
3775a63J12P4J69M74l14qK31p31m7L54p4j72K30L2k63j30j05L03K10m47L51m68
$$ -163 -51 23 192 666 352 344 575 -156 -203 151 77 -95 135 167 -96 -226 -331 -28 182 -265 86 -382
3797c82J04n43N88L85m25M12L08o28P63j014L21N56m25m6L61m24k87R76l62o06
$$ -382 -278 -821 -233 152 -273 139 447 -181 582 -432 -111 445 20 -26 335 -89 -376 600 238 -368
3817c68N55k2L63q54M49j85K04K1m83J05J14P9qn5J23l9J27n5J48l49K12J54j83
$$ -368 187 165 528 -326 123 -62 142 163 -320 -215 -101 -22 -30 -85 38 -1 126 71 219 -130 82 236 53
3840E3K15j9m32J52M01o08P14o93k31O15j68M7k81O15K7l84l96L04Kj24J17L8
$$ 53 268 249 -183 -31 370 -238 476 -217 -448 167 -1 46 -235 380 407 23 -373 -69 -67 -191 -74 -36
3862c6J30M61p23J86L61q64N6O95O2m2J76k87m55k11M72M54m53k9J5K18l88P78
$$ -36 94 555 -168 18 379 -485 -429 266 328 286 462 175 -280 -491 -19 435 -18 -47 -32 186 -202 576
3884E76J75m71k73j28N23k21p8L62k07j18K18J26q22J65K68M02j388J592p63P2
$$ 576 751 280 7 -121 402 181 103 465 258 140 358 484 -338 -173 95 497 -891 701 -62 10
3904A0L2k9p9L67q6m60J14M51l77m37K81l33O86n79N09J49o5L6L3o9Q7l58J57
$$ 10 42 13 -66 301 215 -245 -131 320 -57 -494 -213 -546 140 -439 70 219 154 190 223 154 241 -117 40
3927D0j65J70j26J57j24K02j82J7r7J47K04j12j14m7k82K67q0J52l57M08l39J57
$$ 40 -125 45 -81 76 -48 154 -28 -11 -108 39 243 131 17 -30 -312 -45 -125 27 -330 78 -261 -104
3949a04j19M21l89L1M06j53O0j03l26M04n9j48k06L81j32J65J4k73J90n1j45o9
$$ -104 -223 198 -191 -160 246 93 153 50 -276 128 69 -79 -285 96 -36 129 143 -130 60 9 -136 -205
3971b05K97p1Q7mj20J28J03J13k20k2j05m2J10P3k02J11N93q97J04J07K9l0n43
$$ -205 92 21 108 104 -16 112 215 328 108 86 -19 -61 49 122 -80 31 624 -273 -169 -62 -33 -63 -606
3994f06J069r52N37Lj97M28n77O81n66p4M58l78j84O13l22O01k59p34J83M36l01
$$ -606 463 -489 48 51 -146 282 -295 386 -180 -254 204 -174 -358 255 -67 534 275 -459 -276 160 -141
4015a41k9J61K59k08o0L10m58J60j41L6N34k16k94M21p79P1J70N91o52M03l56
$$ -141 -170 -9 250 42 -18 292 -166 -6 -147 -111 423 207 -87 334 -445 -374 -204 387 -265 138 -218
4036b18J71p0N87o81M23K57n89M39q88M99j07J46J72M05r11J299j051m81K87l9
$$ -218 -47 -117 470 -211 212 469 -120 319 -569 -70 -177 -31 141 546 -365 934 -117 -598 -311 -350
4056c50J72J80r1j56L33k53q27J247j70k65J25K43n56K17L71n05N37j82Q0o51
$$ -350 -178 2 -89 -245 88 -165 -992 255 85 -180 -55 188 -368 -151 220 -285 252 70 150 -501
4076e01J415r97k90j72P73J2J28l77m61p0K77j32O1O58m31J11k54J60M41p08L72
$$ -501 914 -83 -373 -545 228 240 368 -9 -470 -540 -263 -395 -334 324 -107 4 -250 -90 351 -357 15
4097A5o11J088r66R75o8n14j1L56M3J160r27j156p6k58L24J73P11m8m40L21j311
$$ 15 -596 492 -474 501 433 -81 -92 264 307 1467 540 -616 -692 -950 -626 -453 258 210 -230 91 -1220
4118a220J657K39p97N5J33J12m18KN8p25J273J15n01L5%j5k05O32j96q3o8j74
$$ -1220 437 676 -121 -66 67 179 -239 -237 -179 -904 369 484 -17 18 18 3 -202 430 234 151 83 -91
4140i1R0J39o55m59J750o56R0J7J87P8j288J022n29N1m7Q05m06k17j09P2l92J035
$$ -91 -1 138 -517 -976 774 118 208 225 412 490 -798 224 -305 -254 -301 504 98 -119 -228 -156 -548 487
4162D87l68o0m54K64L88K59%q8m60r0l33O15PK56k67p35O89j13K72m26K75m12
$$ 487 119 59 -395 -131 257 516 516 428 -32 -122 -455 160 167 423 156 -579 110 -3 269 -157 118 -294
4184b94K6M31j94j63J03K53k74j78N97k80L42K86q97N86m64K63J46m75k30L67
$$ -294 -268 163 -31 -194 -91 162 -112 -290 307 27 369 655 -242 344 -120 143 289 -186 -416 -49
4204d9K15M28q92q2O22m49O97j024O93K57n88M39l65k03P7R31j221J11N10K58
$$ -49 166 594 -298 -380 242 -207 490 -534 159 416 -172 267 -98 -301 -224 707 -514 -403 107 365
4224C65m90p6K82k37O16k29p30O7L48j93P09l50m91k52j52R58L10p75o85O53Q27
$$ 365 -125 -201 81 -156 460 231 -499 -432 -84 -277 432 82 -409 -661 -813 145 455 -320 -1005 -352 475
4245D75m64K87k96M91k76j195O35K97j35O12o5P8k00R5k84K13j147K315o23m11
$$ 475 11 298 2 493 217 -978 -343 -46 -181 431 366 444 244 339 55 268 -879 1436 813 402
4265D02k0m37L09m18R11q77j09K90J581j971R86j20J05n59O7P03q9n08L00p76
$$ 402 382 -55 254 -164 747 -130 -239 51 1632 -339 647 527 632 73 140 843 754 246 546 -230
4285b30M90p62K46R4L7P19m7k72k1k54q09J179K72l92j30K84q34J260R1q31n58
$$ -230 260 -502 -256 -162 -125 594 547 275 254 0 -809 370 642 250 120 404 -430 830 921 90 -468
4306d68J69j002J106m7N2P33K41o27J45J04p18N78N37p21k22L17o7j47P30q9O62
$$ -468 -299 -1301 -195 -242 -190 543 784 157 302 406 -312 266 803 82 -140 177 110 -37 693 604 1266
4327A266o99j886P67J21Q36j054Q34k53p20J50J032J68o98p03K003j349l23R83
$$ 1266 567 -1319 -552 -431 405 -649 185 -68 -788 -638 394 562 -136 -839 1164 -185 -508 475
4345D75k13l99j434J987n97o0n52R32J014m83p44P29p54N15j267J141j25n54K38
$$ 475 262 -137 -1571 416 -181 -241 -793 139 1153 670 -74 655 -99 416 -851 290 165 -389 -151
4364a51N70p95Q03j061R55M9q15M05J96j152Q73k44Q51n14M62N71m84o31J4N53
$$ -151 419 -376 427 -634 321 370 -445 -40 156 -996 -123 -367 484 -30 432 1003 519 -112 -98 455
4384D55j158m69J217J94M09p12J06O70l92k3p51Q1R19j27k5q48N96n17m26J521
$$ 455 -703 -1172 45 239 648 -64 42 712 320 297 -454 -373 546 419 394 -454 142 -375 -801 720
4404G20J12r30Q32j1j178N94j88k08O69n53K82J59p98J45m4R28j630J187K28j82
$$ 720 832 -98 734 723 -455 139 -49 -257 412 -141 141 300 -498 -353 -397 531 -1099 88 316 134
4424A34M9m14K77q04J209q60J21M25o96L95JP5j71J93M75R9p97L74j93j09L51
$$ 134 183 -231 46 -758 451 -409 -288 137 -559 -164 -163 -88 -259 -66 409 508 -289 85 -108 -217 134
4445A34L08j152L18O59o0p7l7M69K19k84p56N99k03l26L08J1k74K33j71P3M17
$$ 134 442 -710 -392 267 207 130 93 562 781 497 -259 340 137 -189 119 130 -144 89 -82 -9 408
4466D08n11K74m46L62l10K05J68l37q8J19Q5j41r2L95n45J78K02k33P42m13L85
$$ 408 -103 171 -275 87 -223 -18 150 -187 -275 -156 -71 -212 -304 91 -454 -276 -74 -307 435 22 407
4487D07k47O5q7p6l23M51m68N95j77N43r19k47O21J85j702R27J65J014o49k78
$$ 407 160 225 138 62 -261 190 -278 317 140 683 -236 -483 138 323 -1379 -452 -287 727 78 -200
4507b00L06r0l34J96l01Pj10O57Q9n90n61J120o2q53P50N32K01j530J283j010
$$ -200 106 16 -318 -122 -423 -416 -526 131 220 -370 -931 189 127 -726 24 556 757 -773 510 -500
4527e00J210r37J36P31o26J33L73l81P06q33j63pK29K05N32r08P11j854J127L52
$$ -500 710 -227 -91 640 14 147 520 139 845 12 -151 -158 71 276 808 -100 611 -1243 -116 236
4547B36o03Q81j57K42k6o71J26l19R17j558P76o16Q10J86K59l84o13J85n9j42
$$ 236 -367 514 357 599 573 -98 28 -291 626 -932 -156 -772 38 224 483 99 -514 -329 -388 -530
4567e30N2Q2R85r33O67M72j217J157j189J36j579K067r93J670K42j433K32j27
$$ -530 -478 -396 589 -344 323 795 -422 735 -454 -318 -1897 170 -823 847 1089 -344 -112 -239
4585b39J55l5R80q09N05m65P24j116Q1N54m66P01o63N7O35r57m52J303L55n17
$$ -239 -84 -119 861 52 557 92 816 -300 -219 335 -131 570 -93 -36 599 -358 -810 493 848 331
4605C31k80L14j230Q02K57O51j692J091N8p10M31J96k40l22o8N1N74K80l15m97
$$ 331 51 365 -865 -63 194 845 -847 244 302 -408 23 219 -21 -343 -411 -360 214 494 179 -318
4625c18J48J008r93j04P3k07P53n64j62M92K57j244J647j311p3J319p82Q5p4L55
$$ -318 -170 838 -155 -259 -186 -393 360 -204 -366 126 383 -861 786 -525 -598 721 -61 24 -50 305
4645C05j60n62m70P32J5r47L58R45Q24o38n84j93k67R79o58m11Q38j10p78M15
$$ 305 145 -417 -887 -155 -140 -1087 -729 216 1040 402 -182 -375 -642 337 -321 -732 106 -4 -782 -367
4665c67Q48l44l79j54j60M97J18k2N4l67L17J6j47l25Q63n59n00M36K39o2K59
$$ -367 481 137 -242 -396 -556 -59 59 37 91 -276 41 57 -90 -415 448 -111 -611 -175 64 2 261
4686B61p35J90L40o92M91J32j84M48m35J38N9N05p89L51j56j77L66o3n05N24l31
$$ 261 -474 -284 56 -636 -145 -13 -197 251 -184 -46 13 518 -271 80 -76 -253 113 50 -455 69 -262
4707b62M30l92J51N22p35O34L7n80M92%r78N71N70n57J89O7k68k27qM21L19m95
$$ -262 168 -224 -73 449 -286 348 385 -195 297 297 -681 -110 460 -97 92 159 -109 -336 -344 77 396 -99
4729i9K24l62P96l49L48o31j62K01R1l77M52n24N12K67k88m40K49Qj80K7k74M53
$$ -99 125 -237 559 210 558 -73 -235 -34 57 -320 132 -392 120 387 99 -341 -92 -84 -264 -237 -511 -58
4751e8j86l03K01O22K3M7p85K21M33K8k35m18M28L57M07j085j24J56j7L49k73
$$ -58 -244 -547 -346 276 299 346 -439 -218 215 243 8 -410 18 375 782 -303 -427 -271 -288 61 -212
4772b12K28l39M86k75K02K21k52O2l05N77m47O38q02k17P32Mn28j69L98k22j64
$$ -212 16 -323 163 -112 90 311 59 121 -184 393 -54 584 -218 -435 297 301 -227 -396 2 -220 -384
4793c84M82k64J55K16k25K8P7p90N37Q92p42J42K43J91l86Rj52M68k58N9J40P5
$$ -384 98 -166 -11 205 -20 8 85 -705 -168 724 -18 124 367 558 172 181 29 497 239 298 438 513
4815E13k58k16l66L21Ro82R69k09K13m68N31M16j129N71o31N5M10Q03q67l49J111
$$ 513 255 39 -327 -6 3 -679 290 81 294 -174 357 773 -356 215 -416 -361 49 852 -15 -364 747
4836G47p24K16k74R70j328k01O26N68o47P4J07J15k62K29j92L74o49O14l39K04
$$ 747 23 239 -35 935 -393 -594 32 600 -47 27 134 249 -13 216 24 398 -251 363 24 228
4856B28o93P4N2L82k54M23k90j15J67p5j77M36l19L27j36K4n52J531j374O45r4
$$ 228 -465 -391 -339 43 -211 212 -78 -193 -26 -101 -278 158 -161 166 30 54 -498 1033 -341 304 210
4877B10k42K30k58R4J24O12j202N05l80M51j66j42J174j088n82N34L09o03L05
$$ 210 -32 198 -60 34 158 770 -432 73 -307 144 -22 -164 1010 -78 -660 -126 183 -420 -115
4896a15j07K4M05K30r63Q30k31n96N43J40J03l57J10o4K56p5o55K04J113r39L96
$$ -115 -222 -198 207 437 -526 304 73 -523 20 160 263 -94 16 -48 208 133 -522 -318 795 -144 252
4917B52j53j57O1k94M96L3l8k32o5o9p0j29N16o62j9Q00M45l00o95O7J92m77R72
$$ 252 99 -58 3 -291 205 238 200 -32 -97 -166 -236 -365 151 -511 -530 270 715 415 -280 -213 -21 -498 474
4940D74o45L65l23K96k67k26j71L25O39m59L00n80L51j66Q51m01k28l45q9q4M35
$$ 474 -171 194 -129 167 -100 -326 -497 -172 467 8 308 -272 79 -87 764 363 135 -210 -299 -383 52
4961E2j5m07K10J75m84Q16J07o96N8P31m95L9m7k20N57k98j13o2K3O05l71l14
$$ 52 37 -370 -160 15 -469 347 454 -242 -184 547 52 91 44 -176 381 83 -30 -92 -69 536 165 -149
4983a49L69J58j53m79N54J4l14M08k51l28P9j40N71j19m70K97k96P31n48K94l27
$$ -149 220 378 225 -254 300 314 0 408 157 -171 -92 -232 339 220 -250 47 -249 482 -66 228 -99
5004i9j08K53N59l58n14P29r89M61L30L8n63J34l4O3m08P35j03m2j25J38o97P25
$$ -99 -207 46 605 247 -267 462 -527 -66 264 302 -261 -127 -161 -98 -506 229 126 84 -41 97 -600 125
5026A25n01N31L20o62P00J11p20j53Q38n76k08l89J06N55j84l43j57L72q9L46
$$ 125 -376 155 475 -187 513 624 -96 -249 589 13 -195 -584 -478 77 -107 -450 -607 -235 -324 22
5046B2r3O98p78J63K14m58J32K44m08J72k43M21o28P56K37n84J90K54M8n11L05
$$ 22 -71 627 -151 12 226 -232 -100 144 -264 -92 -335 86 -542 214 451 -133 57 311 359 -152 153
5067A53L58n78j29L77m28L23j34l35M20k42J35K39L84m60L00n12m9j33P70q1J08
$$ 153 511 -67 -196 181 -247 76 -58 -393 27 -215 -80 159 543 83 383 -129 -178 -311 459 378 486
5088D86j210j4P69j81L07j61K5J9M98o92o0J09j09m41N61O85j36q99L07R3J08
$$ 486 -724 -738 31 -150 157 -4 21 40 538 -154 -214 -105 -214 -655 -94 591 455 -444 -137 -44 64
5109F4o7j51J13p38M45N74n37k53M92n6n3J15L63l46K6k06J41K86o85K31K31J19
$$ 64 -3 -154 -41 -779 -334 240 -297 -550 -58 -114 -167 -52 311 -35 -9 -215 -74 212 -473 -242 -11 108
5131A08K20o87M46l53L90j38J23p95N57O15m21k35K65k12J20K05l57P23m20o60
$$ 108 328 -359 87 -266 124 -14 109 -686 -129 486 65 -170 95 -117 3 208 -149 574 154 -506
5151e06M97L4q5k10r5K88l47L37M65m75K54P6l65O9q2Lj7K79k22O1K18j66j57
$$ -506 -9 25 -60 -270 -365 -77 -424 -87 378 -97 157 233 -132 -63 -145 -142 -159 120 -102 -41 177 11 -146
5174a46P9o9j91Q9J26M73n16j55J80O2L72p61Q79l95K14o41P91k53K6k10L50k70
$$ -146 -67 -136 -327 -238 -112 361 -155 -310 -130 -68 304 -457 422 27 241 -400 391 138 164 -46 304 34
5196C4L80p59O53m74k7j73K47N31n54l76L03r4J26O0k41J64M81k35R3N6k54J07
$$ 34 414 -345 308 -166 -193 -366 -119 412 -142 -518 -215 -309 -183 -123 -364 -200 281 46 139 195 -59 48
5218D8j19J47k60O3N3M48p56N13k3j62O79o43j90K11j75O4K13k06M09l16K13n63
$$ 48 -71 76 -184 -121 -68 380 -376 137 114 -48 631 -12 -202 9 -166 -102 111 -95 314 -2 211 -352
5240c52K97L15k16K27k92o4K24N3j02q7n4L71n78O0M84k46j55K2l6L74j76J01
$$ -352 -55 260 44 271 -21 -85 139 192 90 3 -51 320 -258 -198 286 40 -115 -93 -129 245 69 170
5262A70p0Q9j98p1l1m57P78o8r1j47J93m39K27l4Q94o02k93J67j59N55n21K64
$$ 170 100 189 -9 -80 -111 -568 210 142 51 -96 97 -342 -115 -149 745 143 -150 17 -142 413 -108 156
5284A56l78K18N00q58L15j18O37l08J77l28M1j10M58j71k60J06P3k8o07L8N59
$$ 156 -222 -4 496 -362 -47 -165 472 164 341 13 54 -56 402 231 -29 77 150 122 -485 -447 112
5305A12l20K62K29r6l37L49j94Q4k56m1K62O0l49K98j06k72K88j53k67P4J41J70
$$ 112 -208 54 283 187 -150 199 5 89 -167 -208 54 114 -235 63 -43 -315 -27 -180 -447 -373 -232 -62
5327f2K18l44P09q19K87J62k58L63l63K81K88m68J26J10p2k00j27J11Q9m2K39
$$ -62 156 -188 521 -298 -11 151 -107 256 -107 174 462 -6 120 230 158 -42 -169 -58 31 -11 228
5348B28o58M97N1j11J39L8k26M3j01J51j46L00j74J52J00o42K65K54J21l83O6
$$ 228 -430 67 118 7 146 184 -42 1 -100 51 -95 205 31 183 283 -359 -94 160 281 -102 -36
5369c6K20n02N32k05j21K72l49K50k64J84n0K4K47m10q2J34L87o84M60J1K3L63
$$ -36 184 -318 214 9 -112 160 -189 61 -203 -19 -69 -45 202 -208 -290 -156 231 -453 7 18 41 404
5391D04m60K21m03M02j72M5m4j93K98j08o9K36r2k96K01K33m92M77N1j45J58p30
$$ 404 -56 165 -238 164 -8 37 -7 -200 98 -10 -79 157 65 -231 -30 203 -289 188 239 94 252 -478
5413d78M93k3L6J63l44J95N4%k83J95k41L72J0l70M26Jn13LL94P0r0Lj0k93k75
$$ -478 15 -8 28 191 -153 42 96 96 -187 8 -233 139 149 -221 205 206 -307 -304 90 160 70 73 63 -230 -505
5438e05L30K78l69K00n1k58L22o2r4K40j03K94j71L77l64n0j15j78L44j25J44
$$ -505 -175 103 -266 -66 -117 -375 -53 -115 -209 31 -72 222 51 428 64 14 -101 -279 65 -60 84
5459H4j49j88K93j28PJ79m72J22J90L8j40L14l9p6K48j93j43L27j55K4k98j72
$$ 84 -65 -253 40 -88 -81 98 -374 -252 -62 -24 -164 150 111 35 283 90 -53 274 119 143 -155 -327
5481c27J74L78n12K88N0N8Pk51QJ65J48j64J02k39K04J61l98L68k12k4j7J08j44
$$ -327 -153 225 -287 1 51 109 116 -135 -127 38 186 22 124 -115 89 250 -148 220 8 -16 -33 75 -69
5504f9L05m10J7J03%L6p2l93M98J21j55rm5l21M09k2rL1p8K05j78K0J39j75p6
$$ -69 236 -174 -157 -54 -54 -18 -90 -483 15 136 -19 -28 -73 -394 15 -7 -16 15 -63 142 -36 -16 123 -52 -128
5529a28J25R5K5n5P2m47N21n02J50M11N0j44j5k31j59L62n2l9L3j17K43q4l87
$$ -128 -3 92 117 62 134 -313 208 -294 -144 267 317 173 158 -73 -232 130 78 39 72 -45 198 114 -273
5552b73L67l22M12J41m10k97K73N7L12m20j7J9k61O69l32l2L49j08j4j6K21R2
$$ -273 94 -228 184 325 -85 -382 -109 -52 260 -160 -177 -158 -419 250 -82 -114 235 127 113 97 318 410
5574D10n30J10K6l87J79J70k57K88n45P33m35L71J67l26j66J81J3k81K35j4K54
$$ 410 -120 -10 16 -371 -192 -22 -279 9 -536 197 -238 133 300 -26 -192 -11 2 -279 -44 -58 196
5595A96j06N1n5k60J89J58k59k30M20j61K3j68K03l4K95j19l75L51j45L76l31
$$ 196 90 141 86 -174 15 173 -86 -316 104 -57 -34 -202 1 -33 262 143 -232 119 -26 350 19
5616A9L04l11Kl5J74k97L30l5k65J37k43L26j3j81J11Q6k55lK1J98J97O7m72K28
$$ 19 323 12 14 -21 153 -144 186 151 -114 23 -220 106 93 -88 23 109 -146 -149 -128 70 267 334 -138 90
5640I0j18L00l38J62N0k18J8J02o2K92o56M47k1k03M6J71l4o5J2k13M32k09R7
$$ 90 -28 272 -66 96 146 -72 -54 48 -14 278 -378 69 48 -155 -109 62 28 -37 -25 -238 194 -15 82
5663H2j42r1L7L9J87k39o7L68k46M6K6J76k65j5J2L75k53K8j30K49O0j54k12L58
$$ 82 -60 -151 -114 -75 112 -127 -194 174 -72 -26 0 176 -89 -104 -92 283 30 58 -72 177 237 83 -129 229
5687B29k25j42L16l44J21k99M29o7q0r1P6L77n31K72N8k15j3J42K35k07L65l98
$$ 229 4 -138 178 -166 -45 -344 85 18 -62 -153 -77 300 -231 41 99 -116 -129 13 248 41 406 8
5709HJ94j12r1j22J38k9K16k95K06j17qn8j48o4J72J53j3l2K13j14k42J88n6o
$$ 8 202 90 -1 -123 15 -14 202 -93 113 -4 -12 -70 -218 -282 -110 43 30 -2 211 97 -145 43 -13 -19
5733a9J23r6KJ30j57J3j40K7J90J15n5k07l0K54j89j56K73K26l69J50L5P6k0j10
$$ -19 104 8 10 140 -17 -4 -144 -117 73 188 133 -74 -104 150 -39 -195 78 304 -65 85 120 196 176 66
5757F6j01j48Q2j20N31p9j80R4O9k55J12m1j4j87O7J16J41j81L6k02J58K99k66
$$ 66 -35 -183 -101 -221 310 231 51 145 214 -41 71 30 16 -171 -104 12 153 -28 8 -194 -36 263 -3
5780cl1M9j23K3J61J91l43l2K7P1M8M4J70k38J15o6j00J67q3j18N7J14j29O1n2
$$ -3 -34 15 -108 -85 76 267 -76 -108 -81 -10 38 82 252 14 129 63 -37 130 47 -71 -14 100 -29 32 -20
5805b0Q7l33K05J50j3K2j19n3J54m9j46L1N6k58K26J71r2Nn5J51k82L12p6j15
$$ -20 67 -266 -61 89 76 98 -21 -74 80 31 -115 -84 -28 -286 -60 111 19 24 -31 120 -162 150 74 -41
5829d1K50k65R9j86J1R3Lq5O5k4r2J53PJ77l4j80j19K39p1r1O4j53L47l39L50
$$ -41 209 -56 43 -143 -132 -39 -36 -121 -56 -80 -172 -19 -12 165 131 -49 -168 71 0 -91 -27 -180 167 -172 178
5854A78j47k5J86l14N7L21j27n1o7m8NR1r2j0J95k85K95k45J42j5J37j92l4l20
$$ 178 31 6 192 -122 -65 256 129 78 11 -37 -32 59 -33 -43 152 -133 162 -83 59 44 181 -11 -45 -365
5878c65N03k28K47j35M1k01R2J58k67K26j34J55K75k53R2j16K33l75P1Q3N4k54
$$ -365 138 -90 157 22 63 -138 -46 112 -155 71 -63 92 367 114 206 90 323 -52 19 102 156 -98
5900i8R3m7J22l9J5j04J45q4q3P8M2j93K68l8l3r1J48j7j37o0P6k32J82Mk47L42
$$ -98 -5 -52 70 31 46 -58 87 3 -80 -2 40 -153 115 77 44 -47 101 84 -53 -113 -37 -269 -87 -83 -330 12
5926A2n3J12k28R2J8N4j18O0K1O7J24l99L04j72q6K12R8k05J48J09J02l3j58J24
$$ 12 -41 71 -157 -65 -47 7 -111 -51 -30 37 161 -238 66 -106 -192 20 118 -87 61 170 272 239 81 205
5950B05m04L37j22K89k1m91K01r3K04j1l4LQ1j53R4j54j19L70O1k68j34J05l65
$$ 205 -199 138 16 305 284 -207 -6 -99 105 94 60 63 144 -9 85 -69 -188 182 243 -25 -159 -54 -419
5973d19L45N2j19J92k16J21j6J43J90n5l89K80j58O0k73L00m4j59J03J51j34L9
$$ -419 -74 -22 -141 51 -165 -44 -60 83 273 218 -171 109 -49 11 -262 38 -6 -165 -62 89 -45 -6
5995fR4M4m58J57k0J73J00k63J58J1N5j27L35l43J19k74K23K9M3Q3P7k88k88N30
$$ -6 88 132 -326 -169 -189 -16 84 -179 -21 -10 45 -82 253 -90 29 -245 -22 7 50 133 210 -78 -366 164
6019A64n21L35J80j59q9n1J23j6K1L1L45n22J61N8j35j78M06p0j06K20k97N61
$$ 164 -357 -22 158 -1 -90 -141 -18 -34 -13 18 363 -159 2 60 -75 -253 153 83 -23 197 -100 461
6041D61m96k34M78j5j41J91l84L2K43k39J32r9j30L66j08p1J37l54M21j09K2j67
$$ 461 -35 -269 209 194 53 244 -140 -108 135 -104 28 -71 -201 165 57 -14 123 -231 190 81 103 -64
6063f4L3k4K33j94j45J12K6j3k5j8J1J74j97J86j21K12j30%j24J81n5m3o6j83
$$ -64 -31 -55 178 -16 -161 -49 -23 -36 -61 -79 -68 106 -91 95 -26 186 56 56 -68 113 58 15 -51 -234
6087b34J43K51n3o6j51L2j22L60j76L55l08J44k16K40k70MM13l17L23k78K4j65
$$ -234 -91 160 107 41 -110 -78 -200 160 -16 339 31 175 -41 199 -71 -67 346 29 352 74 98 -67
6109f7J87q6M5l40K45N0K01l96K27j42L95m38K34m17L4K62j73L45k38k5j13K21
$$ -67 120 34 79 -261 -16 34 235 -161 66 -76 319 -119 115 -302 -268 -6 -179 166 -72 -97 -210 11
6131A1J84m8oOj60K22J38n09M45j01l36K60L80k92r43O78P24j81J49o17mp2rO43
$$ 11 195 147 141 147 -13 209 347 -162 283 182 -154 106 486 194 -749 -71 653 472 621 4 0 -72 -81 562
6155E62m17k57k15J434q00p43Q82p63P35p99L60k41M52J20M07l95m74k49Q11m85
$$ 562 145 -112 -327 1107 307 -436 446 -317 418 -381 -21 -262 190 310 717 322 -152 -401 410 -75
6175g5M20k38l4L86n64q2j73P5K70K95n72Q0j75N83n1p27P54m85M43l62%J45m78
$$ -75 345 107 73 459 -105 -187 -360 -285 -15 280 -292 -212 -387 196 145 -582 172 -313 130 -232 -232 -87 -565
6198e65Q89M05o54m97P47n74J70j66O41p26N23k08J09n16L35k0R13o25o85N53
$$ -565 324 729 75 -422 325 -249 -79 -245 396 -330 193 -15 94 -422 -87 -107 806 181 -504 49
6218D9p48M43L32M23k95R4k01j80RM72o50M08k20k60k68Q63m49m58R99j09p71
$$ 49 -699 -256 76 499 204 298 97 -83 -74 398 -252 156 -64 -324 -592 271 -178 -636 363 254 -517
6239e17J425n69l20j286R59K84r6q5n30J183k26n22k69J244r00K34M25J31o61
$$ -517 908 339 19 -1267 -308 -24 -120 -205 -735 448 222 -300 -569 675 -225 9 434 565 -96
6258i6j85L27k81O8L89n10nj26O74J36k97N40q78m3J82N4k20P35p28K85k35k12
$$ -96 -281 46 -235 -167 222 -288 -293 -419 255 391 94 634 -244 -287 -105 -51 -271 464 -264 21 -214 -426
6280d26N93l21Q05m48o23M51M14n61o1J46n95N02r2j62K21M3O02o63j13k86N62
$$ -426 167 -154 651 203 -420 31 445 -116 -177 -31 -626 -124 -216 -378 -157 -114 488 -175 -288 -574 -12
6301a2J82n22n1J10M59m9j386J549j214N87j23M83k52J19j39j6L55K27n98M41
$$ -12 170 -352 -403 -293 166 117 -1269 280 -934 -347 -470 13 -239 -120 -259 -275 80 307 -291 150
6321A50k89J36J44m41j37L30M6K67n82Q25o89p21Q98j37J17p08K33L38L45n6L8
$$ 150 -139 -3 141 -300 -437 -107 -61 206 -376 449 -240 -961 -63 -200 -83 -791 -558 -220 125 69 107
6342A07K90n82p9k96M43j05N03M83q29J95L98n99K53j08P02j049N90ok60Km51
$$ 107 397 -185 -264 -560 -117 -222 281 764 -65 130 528 -71 182 74 776 -273 317 311 51 53 -398
6363c98O3J18P99p63j7K72K02l09m60M12L04m05m94R07l57j25O17q23N15R5K2
$$ -398 -335 -217 582 -181 -198 74 276 -33 -493 -81 223 -182 -676 231 -126 -251 366 -457 58 153 175
6384A75m74K38J22K4j71Q0KJ20l51L72l18K05J33k20K48r2J17l29ML62n42J75
$$ 175 -299 -61 61 85 -86 -6 -4 116 -235 137 -181 24 157 -63 185 93 210 -119 -115 247 -295 -120
6406a20J50K16l63q7mL75j18j28K74l20J19j5J01R7l33J08K54k50j49J59K17j64
$$ -120 30 246 -117 -204 -208 167 49 -79 195 -125 -6 -21 80 177 -156 -48 206 -44 -193 -34 183 19
6428A9K34l70K53l40j2K07n8j85O8K88k95K69Qp2p4J03j6m5j49K52Qk55O8Q8J6
$$ 19 253 -117 136 -204 -216 -9 -67 -252 -184 104 -191 78 86 14 -60 43 27 -18 -167 85 93 -162 -94 -6 10
6453A0M4K18J30l91k5j67K95kl4j5r1J0P0j5j41JNK4J8QL2j31Q0J05m2J77k6k09
$$ 10 54 272 402 11 -14 -181 114 112 78 63 -28 -18 52 37 -104 -103 -98 -74 -56 -48 -16 -147 -67 38 -4 173 147 -62
6481f2J0J71J05k40J94k27k10L34j7j46K13m71K84P1j52J26k86J74J14p3J19o0
$$ -62 -52 119 224 -16 178 -49 -259 75 58 -88 125 -346 -62 9 -143 -17 -303 -129 -15 -88 31 -29
6503b9J47K2k1Pj13J29j85L05l24N4M0j64J88j8k10k7K03K18m65l30N55j9J84
$$ -29 118 140 119 126 13 142 -43 262 -62 -8 32 -132 56 38 -172 -199 4 222 -243 -573 -18 -37 147
6526A47k75J79j60j15L82l5j70j49K35O9k02L08j64m19K06K14j52K23k9k62R9
$$ 147 -128 51 -109 -224 158 123 -47 -196 39 108 -94 214 50 -369 -163 51 -101 122 93 -169 -70
6547g0N1J84k16J02j67O59o38J9j53M73n70r7K83L60J3k46j06K50j75K44k00j72
$$ -70 -19 165 -51 51 -116 543 -95 -76 -229 244 -326 -423 -140 220 233 -13 -119 131 -44 200 0 -172
6569a72K20r2r0n6Q5J44j92j62N96m03M71j55q2O0J75l05o2K4l9K81Qm96M56k68
$$ -172 48 -44 -134 -190 -105 39 -153 -315 281 -122 349 194 112 172 347 42 -20 4 -35 246 254 -242 214 -54
6593e4N0kK47m04K88n13O35m47K35l81Q00o39K61l63m02O09l56L82j36k07N92
$$ -54 -4 -6 241 -163 125 -388 247 -200 35 -346 454 -185 76 -287 -689 -80 -436 -54 -190 -397 195
6614A95j16R1L5n80J28L66l70J62r2J30l52M39m82N81r9J38L14p64L54m23N36
$$ 195 79 170 205 -375 -247 119 -251 -89 -181 -51 -403 36 -446 135 36 174 488 -276 78 -345 191
6635A91l86N46m64jK73J79l20k94P1m66J120q54O61pp30J181j084K5k45Q53j14
$$ 191 -195 351 -113 -114 159 338 18 -276 -205 -671 449 -405 256 249 -481 700 -384 -359 -604 249 135
6656A35q33R25r7m25K71l51L79J0M91r18P2O44K82o4j273J250K83q74K13l68J30
$$ 135 -698 227 130 -295 -24 -375 4 14 505 -413 -341 303 585 521 -752 498 781 -93 120 -248 -118
6677a18l00L29O53l82P6M95j543N25N62K40o46J57K03j312O90J51j46jj7N06M2
$$ -118 -418 -89 564 182 258 753 -790 -265 297 537 -109 48 251 -1061 -371 -220 -366 -367 -384 122 164
6698A64k19j61M43m37J1L80m77J92J10n96O40p4j12K18k26L41K4l52p1l38n3R29
$$ 164 -55 -216 227 -210 -199 181 -296 -104 6 -590 50 -24 -136 82 -144 197 221 -131 -202 -540 -593 336
6720C36k20n37lk63L42K00K16p8J32n22M77K41j71p08K59K4L25j52K62m40L9J01
$$ 336 116 -421 -424 -687 -345 -145 71 -7 125 -397 80 321 150 -558 -299 -275 50 -102 160 -280 -241 -140
6742a40j51N40k70R5K07k69p2j17K72K8oP0k44j76N16l19J3k34J77N1L64k05r6
$$ -140 -291 249 -21 74 281 12 -60 -177 95 123 117 187 -57 -233 283 -36 -23 -257 -80 -29 335 130 34
6765C4k54L46l8K7k20l2J45J66j59k15P3R2j95J57K57j35L0k60J82j01l8k23L96
$$ 34 -220 126 88 115 -105 -137 8 174 15 -200 -127 -35 -230 -73 184 49 79 -181 1 -100 -138 -361 35
6788C5k39L28K80k08m02J12K29k47J26K2j66J03l0N2j91J73j7n1J74j61J63J03
$$ 35 -204 124 404 196 -206 -94 135 -112 14 36 -130 -27 -57 -5 -196 -23 -40 -91 83 -78 85 188
6810A88j15K40k8n58M26l3l07K09J45k91P9J52k85L52j3l5j47J65k71kK16q4Q9
$$ 188 73 313 285 -273 153 120 -187 22 167 -124 -45 107 -178 174 161 126 -21 144 -127 -129 87 3 92
6833I2j58r4K44M2%q5k66M35j63k9j32L97l61o9J22K98j99O4J7j3M1j2n1M5k70
$$ 92 -66 -160 84 126 126 41 -225 210 47 18 -114 283 -78 -147 -25 273 74 138 155 142 183 171 120 165 -105
6858a05J09k93L73Mk13r9O3K65l35J65q1J83J88m40N13l52J03n0mJ17j50J13j70
$$ -105 4 -289 84 88 -125 -224 -161 104 -231 -66 -147 36 224 -216 297 -55 48 -2 -6 111 -39 74 -96
6881i6l5L70J0k84J07J0N8p7K32l98K04j38K10j34k09K10n5l28R6M42n41M32j23
$$ -96 -131 239 249 -35 72 82 140 63 295 -103 101 -37 173 39 -170 40 -15 -343 -247 195 -346 86 -37
6904c7pJ74l2n7m0j15J2J82r0Jm7j23K42r7k5K3L0O6j46K58p5k53J66J26k89K99
$$ -37 -44 130 98 41 1 -114 -102 80 -10 -9 -56 -179 63 -34 -59 -36 -6 60 -86 172 97 -156 10 136 -153 146
6930A46N9k36J08N5o8J6j30k01L33k3P5p6m47L00L5K06j52J14j19j82K69l3r8
$$ 146 205 -31 77 132 64 80 -50 -251 82 59 134 58 -389 -89 -54 152 0 114 -5 -187 82 49 -49
6953d9P6J50j11j41k45K49K65l02Q0K4L8jL7l5m5O3k33J65J07n5k7k52J55j38
$$ -49 27 177 66 -75 -320 -71 194 -108 -28 -4 34 33 70 35 -10 53 -180 -15 92 37 10 -242 -87 -225
6977b25K63J43k15P6j32L08j72k08L11k34J28j7M6q0Q7p2j12M8K54l21J81J22
$$ -225 38 181 -34 42 -90 218 46 -162 149 -85 43 26 72 -8 79 7 -105 -57 197 -124 57 179
6999A79j79k20J08J42j78L09j24K19l78J52p4J57R3k42j19L9K24O1k64l5J2P4
$$ 179 0 -220 -112 30 -148 161 37 256 -122 30 -44 113 206 -36 -155 -116 108 169 -95 -130 -118 -44
7021d4M34k61O8j72J74m76M36j06j32K6J05p0k10J88L3L59l37j5J37k06J92j24
$$ -44 390 129 197 25 199 -277 159 53 -79 -53 52 -18 -228 -40 -7 352 15 0 137 -69 123 -1
7043aJ2m8n8J68M2k29j50L02r4j08L0k9L01O6k41K63m49L79K4l70L08o6j45Q7
$$ -1 11 -37 -95 73 115 -114 -264 38 -56 -164 -134 -163 138 204 -37 226 -223 156 180 -190 118 52 -93 -6
7067fJ14nj59Q7R1l4j1j63M7j24J59K28k37R6j21j6j95L79j51K16k14l71M74l15
$$ -6 108 103 -56 31 122 88 77 -86 -39 -163 -4 224 -13 83 -38 -54 -249 130 -21 195 -19 -390 84 -231
7091b31L97k66k29J00N29J5k23J07l00L47k34R6m75M05j11m03K1M40j81M63K59
$$ -231 166 -100 -329 -229 300 315 92 199 -101 246 12 108 -367 38 -73 -476 -455 -15 -196 267 526
7112E26l34o28M51K06n84J372j123P3j36L92K09k34m64Mr6J76J80l13L67n61N59
$$ 526 192 -436 15 221 -363 1009 -114 -41 -177 215 424 190 -274 -270 -366 -190 -10 -323 44 -517 42
7133D2O1p5l43K93J21l12P4j5N62m04J24K8j68K68l67K62j78J17J68j97q1k79
$$ 42 103 28 -315 -22 99 -213 -139 -154 408 4 128 156 -12 256 -111 151 -27 90 258 61 -20 -299
7155b99K81n4l06L75J61j98K81m00J77P2K55n6l65P0M7r5q3J3J93k8Nk52J67k16
$$ -299 -18 -72 -378 -3 158 -40 241 -159 18 90 345 289 -76 -6 41 -54 -137 -124 69 41 46 -206 -39 -255
7179b55J1jK07K22j40j80J40Ko6LK79l13J88r8O2M3r1J15j56J26k68L43l0j84
$$ -255 -244 -245 -38 184 44 -136 4 6 -60 -57 222 -91 97 -1 61 104 13 128 -28 98 -170 173 143 -41
7203d1n6Q0j00j81K99J3r8j30O46n68k1L84l68K39k58l0n6K29L70n16N2r9Q4J13
$$ -41 -97 -17 -117 -298 1 14 -84 -214 432 -136 -157 227 -141 98 -160 -190 -246 -17 353 -163 -111 -210 -126 -13
7227a3J99j98j27J67l0R6j8R0k31j1L25k73J01j94Q1K62l36K20j82J07q0O1j69
$$ -13 186 -12 -139 28 -2 94 76 166 -65 -76 249 -24 77 -117 -36 226 -110 110 -72 35 -45 16 -153
7250a53j9L60j04J04m93L68J73j74k19j49N17n71M95k73o0m2M70j91K28l41j87
$$ -153 -172 188 84 188 -305 63 236 62 -157 -306 211 -360 135 -138 -198 -240 230 39 267 -74 -261
7271b61K76P1k8j12L01l43L0K41J81l84M6k09l8J12L1L19j65k9J76n6k98K77J2
$$ -261 15 86 58 -54 247 -96 -66 175 356 -28 18 -191 -229 -117 -86 233 68 39 215 159 -139 138 150
7294A50J65l20j07J25L14l19K56j09k77K39j19K51m75M14j92P7j78j36M47j54
$$ 150 315 -5 -112 13 327 8 264 155 -122 117 -2 249 -226 188 -4 73 -105 -241 206 52
7314E2q5p8M6l5K11j88N2j61K14k12K92n8k77L40r0mp4K38l6j10Q3j27q2J48j24
$$ 52 -33 -111 -65 -100 111 -77 -25 -186 28 -184 108 50 -227 113 23 19 -55 183 147 37 120 -7 -89 59 -65
7339f5L09k05j06j13p9L45O7k03M6K3J19r4j52L8j40N18l06r4q6N1M1J79j63P4
$$ -65 244 39 -67 -180 -259 86 153 -50 -4 19 138 44 -108 -70 -210 308 2 -92 -178 -127 -86 93 -70 4
7363Dj25J43kk22K03k4M9Jk96N29k11L5Rl14J71K89k65j52N3L83m95J79j58J01
$$ 4 -121 22 20 -202 1 -23 26 27 -269 260 49 84 93 -221 -50 239 -26 -178 -125 258 -237 -58 -216 -115
7387a15j32J03P1PJJ64o21J40L85p14O80k65oP13n73J38l96M99J06r62J471j149
$$ -115 -247 -144 -73 -66 -65 99 -522 -382 3 -711 -31 -296 -302 411 -162 -24 -420 79 185 -777 694 -455
7409d55J83m94O86L67k04o2l40L42k05k41L87r2l3K17j28M48j81j86j8J89k49
$$ -455 -272 -766 -80 287 83 21 -319 23 -182 -423 -36 -128 -161 56 -72 376 195 9 -9 180 -69
7430f9m9J26j85J88J7L4j90K8K00j62P8q9K3q5L39Jm44K60K56j20k07kR6k63k65
$$ -69 -118 8 -177 11 28 62 -128 -100 100 -62 16 -73 -50 -135 204 205 -239 21 277 157 -50 -52 44 -219 -484
7455d84N02m0J15l65K46Q29j380K39J31M20n04M95n94P56n37J024j243P31P0j31
$$ -484 18 -22 93 -272 -26 803 -577 -338 -207 213 -291 204 -390 366 -171 853 -390 341 411 280
7475B80k04o9j40l09J079p90j22n00M27N41K90n52L60j086L04M13rN7j66O81n68
$$ 280 76 7 -133 -442 637 -153 -275 -775 -348 193 483 -69 291 -795 -491 -78 -87 -30 -196 485 -83
7496h3m83P42N40o74k93O2K77N17p71l5j31k50O26n36L21q9K64m32L87J104q56
$$ -83 -566 176 716 42 -251 -189 88 605 -166 -201 -332 -582 44 -492 -171 -260 4 -428 -41 1063 207
7517B07n66N02m48N62K24l35L23p13M95J86r08k41R72L4p9K86L2L99q16P82p58
$$ 207 -359 143 -305 257 481 146 469 -244 251 437 -471 -712 260 294 215 501 533 932 116 898 140
7538A40K70r81K41J49O62m4m7q63J66l14Q26j63K95m76L21n92J05L13N1m37O63
$$ 140 410 -571 -330 -181 481 437 390 -473 -307 -621 205 42 337 -139 182 -410 -305 8 59 -378 285
7559B85j72m44K97K64j24r3P86o61K29k35l37J99M21q50J76N77M65n51q06Q97
$$ 285 113 -331 -34 230 106 13 799 138 367 132 -205 -6 415 -435 -259 318 783 232 -574 323
7579C23m47L61j96j79Q9j50N40l53M71r60N97q0j62K82j80M18k10K07j41o64L01
$$ 323 -124 237 41 -138 -49 -199 341 -12 459 -501 96 16 -146 136 -44 374 164 371 230 -434 -133
7600a33N37m4l89q56J396q37L66k0Q25j268J546j678M30N46j052P46O36q90m53
$$ -133 404 360 -29 -885 511 -326 40 20 845 -423 1123 -555 -125 421 -631 115 751 -139 -592
7619e92O27o21J16R3L97l86P23m56r9J00L10l57J7L1L77m42L11o7K64k06k13L0
$$ -592 35 -586 -470 -377 20 -366 357 -99 -198 -98 212 -145 -128 -97 280 -162 149 82 346 140 -73 -43
7641d3k11M27k30j81J54j33K71L57l79m7K8j6o1L41k48K5m81N20P0j65j67L72
$$ -43 -254 173 -57 -238 -84 -217 54 411 32 -15 13 -3 -64 277 29 54 -427 93 163 -2 -169 203
7663B03m08n9K58J31m05J34L45n00M36o73O01n2j00j73J04j06L92J32l26J95M3
$$ 203 -205 -264 -6 125 -280 -146 199 -301 135 -538 63 11 -89 -262 -158 -264 128 260 -66 129 172
7684A72k54Q3n5P8k76L82L91m32j39J36J78l52J55j15K44k08k52N8J81m7O7P1
$$ 172 -82 1 -54 24 -252 130 521 89 -50 86 264 -88 67 -48 196 -12 -264 -206 -25 -72 -5 66
7706F6k25L75r7p6j58l7K9J53m9nl45K98j21M0k00L10K98J05p78P18n10J72J00
$$ 66 -159 216 119 43 -115 -152 -123 30 -19 -24 -369 -71 -192 -152 -352 -42 256 361 -417 301 -209 -37 63
7729F3k05l62J34k2N0K05j11K92l16N36p4M90j003O06k17l47L53kr0k63J98m3
$$ 63 -142 -504 -370 -392 -342 -137 -248 44 -272 264 190 680 -323 283 66 -281 72 70 -20 -283 -85 -128
7751a28L48N6j81m66M21l22R4L85p77N21P4r5J37M8l89P15k47j39M56m81m3K16
$$ -128 220 276 95 -371 50 -272 -178 207 -570 -49 25 -70 67 115 -274 441 194 55 511 30 -13 203
7773B03J06n74N16q7m12J97L22j70k54J33j00r2J44K17l04L04p66L87N5Q7L9n10
$$ 203 309 -265 251 164 -248 -51 271 101 -153 -20 -120 -212 -68 149 -155 149 -617 -230 -175 -88 -49 -559
7795e59K85N47p46O18o7J3J55r70R38j82O50m90K61o34O4j87N49n23Q1N7q3P0
$$ -559 -274 273 -473 145 78 91 246 -724 214 32 682 192 453 -181 -117 -304 245 -278 -197 -140 -223 -153
7817a53L7J32m91O62o75N73p22M78l49L62P2K87q05O10o21N71N3K60o50P7L88
$$ -153 -116 16 -475 187 -488 85 -637 -159 -508 -146 -74 213 -592 18 -603 -32 21 281 -369 -292 96
7838I6n40K61N55k15j14p9q9M3j38j34K0k58M26j48K64J37k66J84l26N21J49q10
$$ 96 -444 -183 372 157 43 -36 -125 -82 -220 -354 -334 -592 -166 -314 -50 87 -179 5 -321 200 349 -461
7860d61O50k36k83k5M78m05M07n1k51L83j42l71j23lk25O27n0KM3K46l10m78L60
$$ -461 189 -47 -330 -355 123 -282 125 74 -177 206 64 -307 -430 -433 -658 -31 -81 -79 -36 210 -100 -578 -218
7883b18O40l38L18p15J77K93L02o58L07o09j0J032p94K8L73J08j72o70N59j41
$$ -218 422 84 402 -313 -136 157 459 -199 108 -501 -511 521 -273 -245 128 236 64 -606 -47 -188
7903a88k77K07j2m3O75q28Q27k22k09l66K05Np5K73r6q6K85m0L56J76r7K90j75
$$ -188 -465 -258 -270 -313 362 -466 361 139 -70 -436 -231 -226 -301 -28 -124 -210 75 35 391 567 470 760 585
7926E85p5j291Q68o25N06K48M80q52N96m66j46O09k46l51J26J17p3j96L03J47
$$ 585 510 -781 87 -538 -32 216 696 -156 440 -26 -172 437 191 -160 -34 83 10 -186 117 264
7946B64m71L29j71J66J42l67J02j17K45n47M32o62J36L96J95J75P96q52o46R08
$$ 264 -207 122 -49 117 259 -108 -6 -123 122 -425 7 -655 -519 -123 72 247 1043 191 -455 453
7966D53M6o29K44N10o77L7k29J60L98m92K64L11J60q29OJ33p62R67r76R30L21
$$ 453 499 -130 114 624 -53 -16 -245 -85 313 -179 85 396 556 -273 -267 -134 -896 71 -905 25 346
7987C46J67k91l74o27N19L16l01P4m0p4Q5j25N26Q8p7n03j40Q56Q29j914R01k09
$$ 346 513 222 -152 -779 -260 56 -245 -171 -211 -285 -200 -325 201 289 212 -291 -431 425 1254 -660 241 32
8009C2j32k74M98j19k04j88L8k70K24N00m82O58N66n86P1m76Q51j166P8J203k081
$$ 32 -100 -374 124 5 -199 -387 -349 -619 -395 105 -377 281 847 261 332 -144 707 -459 -381 822 -1259
8030a259J362p79R11m53P33P17j327M12J08n97O60K31r29j70J28J24P3n5j7J084
$$ -1259 103 -676 235 -218 515 1232 -95 317 425 -172 488 719 -210 -380 -252 -128 -55 -110 -127 957
8050I57l68j141Q60l65L17j13n78J118j287J51J524j121N6J60q66K81J44j24k17
$$ 957 589 -552 308 -57 260 147 -431 687 -600 -449 1075 -46 10 170 -696 -415 -271 -395 -612
8069f12N50j92N3J06L17o68N22KM2l12k28Q46o57K42r6J26O1m01K38k20M97l97
$$ -612 -62 -254 -201 -95 222 -446 76 78 120 -192 -420 426 -231 11 -85 41 102 -299 -61 -281 216 -181
8091a81R5J4L29N9r5j38j10J30K74l17n5K43l18J66l87L99l66J46k81O49m27L75
$$ -181 -86 -72 257 316 221 83 -27 103 377 60 5 248 -70 96 -291 108 -258 -112 -393 256 -171 204
8113B04j60K20l23PM62o92L23l89N57m56K06k90M38P6k26m05P01k7j85M70m37
$$ 204 44 264 -59 -52 410 -282 41 -348 209 -247 -41 -331 107 183 -43 -448 253 226 41 511 74
8134G4n9K15l61q1L41l77m12P65l39N29Q5m31J40j73m78O72L4J23o74M26K81j74
$$ 74 15 230 -131 -212 129 -248 -660 105 -234 295 380 -51 89 -84 -562 110 144 267 -407 19 300 126
8156A26p1n68M96l85L45J25O18l02m05J43k63M58k15j63k23J97L15p77K40O57
$$ 126 55 -513 -17 -402 -57 68 686 384 -21 122 -141 317 102 -61 -284 -87 228 -549 -309 348
8176C48j19o99K50j67L81jK43J42r52L61K01L38o25L36r5
$$ 348 229 -470 -220 -387 -6 -7 236 378 -574 -213 -12 326 -299 37 -58
8191e8
$$ Imaginary data points
##PAGE= N=2
##DATA TABLE= (X++(I..I)), XYDATA
0@%%%%%%%%%%Qj6J6j6J6j6K4l2L9m7N6o7P5r1J10j26J46j70J96k24K56k91L30
$$ 0 0 0 0 0 0 0 0 0 0 0 8 -8 8 -8 8 -8 16 -16 23 -24 32 -35 40 -51 59 -67 79 -91 105 -119 137 -154 176
33A76l74M21m71N27n92O63p37Q20r13J011j116J232j361J501j655J825k009K212
$$ 176 -198 223 -248 279 -313 350 -387 433 -480 531 -585 647 -714 787 -868 957 -1052 1160
51A160k439K689k968L283l640M046m512N059n712O500p474Q717j0363J2647j6033
$$ 1160 -1279 1410 -1558 1725 -1915 2131 -2381 2678 -3034 3466 -4008 4709 -5654 6993 -9040
66i040K1556l2054N8636k44000m48706P25236M15109m98662l22787L73228J91344
$$ -9040 12516 -19538 39098 -204902 -653608 71628 486737 -11925 -334712 38516 229860
77B29860k60887j59920J44288J16212M2352J0200j44666k13643J31683L39236
$$ 229860 -31027 -190947 -46659 69553 111905 122105 -22561 -236204 -104521 234715
87B34715n2754l46975M2357K81738r6149k44470J14077J96237n4767q3512q841
$$ 234715 181961 -165014 -122657 159081 62932 -181538 -67461 128776 74009 -9503 -18344
98a8344r2637p823K17282Q6194k29260j22603J88029R8779j81587o2815K08597
$$ -18344 -110981 -118804 98478 184672 -44588 -167191 20838 119617 -61970 -124785 83812
109H3812P5731j82013q1581P5895J9496L9257R1586r3305j62449J05749J42804
$$ 83812 159543 -22470 -104051 -28156 -8660 30597 122183 28878 -133571 -27822 114982
120A14982j49209r4787K19190P6536k57994q7600K36998N9192k10043J8314K37553
$$ 114982 -34227 -129014 90176 166712 -91282 -178882 58116 117308 -92735 -74421 163132
131A63132q8243l00014J09606L26631j01820k84199J23321K19532j58880j77631
$$ 163132 74889 -225125 -115519 211112 109292 -174907 -51586 167946 9066 -168565
141a68565J59939J45843r5884q4817K5172r926l605Q3829J8823j09581j9115J12224
$$ -168565 -8626 137217 41333 -43484 -18312 -28238 -31843 51986 70809 -38772 -57887 54337
153E4337j3603j45150M2789J88746m3546j91230L3848J36545n4072o8589R3889
$$ 54337 40734 -104416 -61627 127119 83573 -107657 -73809 62736 8664 -59925 33964
164C3964L3843j06996j9613Q0498o764m3797M9088M0035p1665n4471O1648M8099
$$ 33964 67807 -39189 -58802 21696 14932 -28865 20223 60258 -11407 -65878 -4230 43869
176D3869m1503j0191M9423l3527o7957M7607N8500n1367j3014P0551m3931j01750
$$ 43869 2366 -7825 41598 8071 -59886 -12279 46221 -5146 -18160 52391 8460 -93290
188i3290P2827J10282q1388r1359R9785P1851j29586p8935J42798J04729j27651
$$ -93290 -20463 89819 8431 -82928 16857 88708 -40878 -119813 22985 127714 63
199F3j06379R9600Q0327q2383m5859P2883K7166l9237j5230j3809j4392O4132
$$ 63 -106316 -6716 73611 -8772 -54631 18252 45418 6181 -9049 -22858 -37250 26882
211B6882N2163q1514p5805P1885P4658p0160o5954P6224O6305p4589p1730N4566
$$ 26882 79045 -2469 -78274 -6389 68269 -1891 -67845 8379 74684 95 -71635 -17069
223a7069N3460l2449j1896L1358l3115m0559N5885L9603n8769k1936O7319O977
$$ -17069 36391 3942 -7954 23404 -9711 -50270 5615 45218 -13551 -35487 31832 38809
235C8809p3208r308O3479K1306l2964j7373L17l388J5383K3021j9195l4175L1551
$$ 38809 -34399 -43707 19772 41078 8114 -9259 -8942 -12330 3053 26074 6879 -27296 4255
248D255L7033n6750m7421P1569N9982o7655n7962N1749L6030m2178j3142M1626
$$ 4255 41288 -15462 -62883 8686 68668 1013 -56949 -5200 30830 -11348 -24490 17136
260A7136L838l5220j998K0026n054q907K7268Q145l9305j1313L3357R076k3633
$$ 17136 20974 -14246 -16244 3782 -1272 -10179 17089 25234 -14071 -25384 7973 17049 -6584
273f584R896J6440k4608j4312K6811K914k3753J5907K6272l2122l6773L1790M1521
$$ -6584 3312 19752 -4856 -19168 7643 10557 -13196 2711 28983 -3139 -39912 -8122 33399
286C3399k5411l6661K4370K7680l1354k4419L2139K6114k1454j6858R329j528
$$ 33399 7988 -28673 -4303 23377 -7977 -32396 -257 25857 4403 -12455 -3126 -4654
298d654p8J6478j044j9095O110J7598j5924j9644K3028K7045k2316k7464J3178
$$ -4654 -4732 11746 10702 -8393 -2283 15315 -609 -20253 2775 29820 7504 -19960 -6782
311f782J8947j3002q833J8760L232k4557j131J9470n349j2528J6444J0390k2511
$$ -6782 12165 -837 -9670 9090 12322 -12235 -13366 6104 755 -11773 4671 15061 -7450
324g450j4927K1195J4563j4596l931J1133l758j0689M862R979k543j821O379n423
$$ -7450 -22377 -1182 13381 -1215 -5146 5987 2229 -8460 -3598 6381 3838 2017 8396 2973
338B973j5285Q366J9412o241j6561N974J1640j3690j1594J7236J1528j4086j0418
$$ 2973 -12312 -3946 15466 9225 -7336 -1362 10278 -3412 -15006 2230 13758 -328 -10746
351a0746Q472L117p226L486R493n293p519L261L077n560N800Q498k937j1432J155
$$ -10746 -2274 843 -6383 -2897 6596 1303 -6216 -2955 122 -5438 362 8860 5923 -5509 -4354
366d354P884m40l948M776J963n741l756L925P97l483P972K818j3324q640J4133
$$ -4354 3530 3090 -858 3918 5881 140 -3616 309 1106 -2377 5595 8413 -4911 -13551 582
381E82Q709q835q220M827P287m480r445K549J2410M529r287j2204R96J5692Q828
$$ 582 9291 456 -7764 -2937 4350 -130 -9575 -7026 5384 9913 626 -11578 -10582 5110 13938
396A3938j4895j2386J4223J5914j3227j7563J0256J9385l407j7818n468R507J0459
$$ 13938 -957 -13343 880 16794 3567 -13996 -3740 15645 12238 -5580 -11048 -1541 8918
409H918l157j0661j57N085L452r34r627k894J4588Q045j6456j2079J1643J3590
$$ 8918 5761 -4900 -5057 28 3480 2546 -7081 -9975 4613 12658 -3798 -15877 -4234 9356
423I356k663r977k654O373N820m868n892O026L557k397j159j030n946L328J1885
$$ 9356 6693 -3284 -5938 435 6255 1387 -4505 1521 5078 2681 1522 492 -5454 -2126 9759
438I759j543j2897m545Q897R194m636j2990m68J7182o02j5584j182P197O613L660
$$ 9759 8216 -4681 -9226 -329 8865 4229 -8761 -9229 7953 7351 -8233 -9415 -2218 4395 8055
453H055p803j4700K840K3292N456k4507j3702K2457K4660j6682l8472J0828M9717
$$ 8055 252 -14448 -11608 11684 17140 -7367 -21069 1388 26048 9366 -29106 -18278 31439
466C1439k735n0553p679M1937J5984k7733k1157J1410K3624M28k2160j1738J4547
$$ 31439 28704 -21849 -29528 12409 28393 660 -20497 -9087 14537 14965 -7195 -18933 -4386
479d386J7285K39j8765j9339J6691L4751j1012m2988M187M2642N207l6095j3607
$$ -4386 12899 13138 -5627 -24966 -8275 26476 15464 -27524 -23337 19305 24512 -11583 -25190
492b5190K7603K4593j9092k9121J0115K7948n196j7339J792M570p30M139K2j1107
$$ -25190 2413 27006 7914 -21207 -11092 16856 11660 -5679 -3887 683 -47 4092 4114 -6993
506f993k13J3578L247j3429r871P962J9301o827k2548P001K2933j2400j7903J9921
$$ -6993 -7206 6372 9619 -3810 -13681 -5719 13582 6755 -15793 -8792 14141 1741 -16162 3759
520C759J0639k3602m648K5694M957k8268q226L0211J7338l3036k6826L5454L3279
$$ 3759 14398 -9204 -13852 11842 16799 -11469 -19695 10516 27854 -5182 -32008 3446 36725
533C6725l4222l3533K8808K6335j9106j8291N860R327M146M83j0243j0998P192
$$ 36725 2503 -31030 -2222 24113 5007 -13284 -7424 1903 6049 6532 -3711 -14709 -7517
546g517K0635K408k8456j5267L5080K5831l7415l1363L4534L4043k2125l3924
$$ -7517 13118 15526 -12930 -28197 6883 32714 -4701 -36064 -1530 32513 10388 -23536
558b3536P300L0933P983k5588j7222J8992J9109j1222j3093J31M036J0796M034
$$ -23536 -16236 14697 22680 -2908 -20130 -1138 17971 6749 -6344 -6213 -2177 8619 12653
571A2653k1664j1253K3633J7108j8298k3093R169K5712J861k9918p974L4567Q877
$$ 12653 -9011 -20264 3369 20477 2179 -20914 -11745 13967 15828 -14090 -22064 12503 21380
584B1380l5543n828L3298k33k6484O471K1698p894j9721O806K1523l659k5919
$$ 21380 -14163 -19991 13307 13074 -13410 -6939 14759 6865 -12856 -6050 15473 11814 -14105
597a4105L018K7305k874k7775N240J9906n826r362L668k544k812J2346K652j7849
$$ -14105 -11087 16218 13344 -14431 -9191 10715 4889 -4473 -805 -3349 -6161 6185 8837 -9012
611i012n876J7746J1498j2684k0466R984K7741o183l1743M046K8390J671j7906
$$ -9012 -14888 2858 14356 1672 -18794 -8810 18931 12748 -18995 -14949 13441 15112 -2794
624b794o993N712J2349M602j5248j2242J5390J4246r632j4181j788J1328J2971
$$ -2794 -9787 -4075 8274 12876 -2372 -14614 776 15022 5390 -8791 -10579 749 13720
637A3720p693k2353M235K5155K92k2704p614J7696J6123j2475k3674Q359K8060
$$ 13720 6027 -16326 -12091 13064 13356 -9348 -16962 734 16857 4382 -19292 -10933 17127
650A7127n945k5711N508J9354l762j0321J981K997J053O59j564k646r69K874M861
$$ 17127 11182 -14529 -9021 10333 6571 -3750 -1769 1228 2281 2940 1376 -1270 -2239 635 5496
665E496k180j0412K206J2191m614j0999O859O028p220K04M848o006r80Q240j248
$$ 5496 3316 -7096 -4890 7301 2687 -8312 -1453 4575 -2645 -2441 2407 -3599 -4579 3661 2413
680B413p037K103M563K08j287m172J467P328k968o781N459L411n638K044K865
$$ 2413 -4624 -2521 2042 2250 963 -3209 -1742 5586 2618 -4163 1296 4707 -931 1113 3978
695C978n347o71N849k362m516K310Q17j617K435j648l414L518L189l893k249J275
$$ 3978 -1369 -2040 3809 1447 -3069 -759 58 -1559 876 -772 -4186 -668 2521 -1372 -3621 -2346
711b346L368K631n854l586Q299M204q943l404J0701j22q381K101L966r09n24r79
$$ -2346 1022 3653 -2201 -5787 2512 6716 -2227 -5631 5070 4948 -3433 -1332 2634 1725 1201 222
727B22j929K947J552m208j342L159J269j395j783k262L699L351o376j856P162
$$ 222 -1707 1240 2792 -1416 -2758 401 1670 275 -1508 -3770 -71 3280 -3096 -4952 2210
742B210P9o414K343L760k711l13K037j220j63Q79P94J056q76k873J979L339l612
$$ 2210 2289 -4125 -1782 1978 -733 -1046 991 -229 -392 487 1281 2337 1461 -1412 567 3906 294
759B94k816M184J183k957q68q0nJ884R40m995j79N327j255l485J255J738K84J40
$$ 294 -2522 1662 2845 -112 -980 -1060 -1065 819 1759 -3236 -3415 1912 657 -2828 -1573 165 449 589
777E89l160L96L643n14k139K400m53j112K701o78l373R58M639k221l376P63K018
$$ 589 -2571 -2175 1468 954 -1185 1215 762 -350 2351 1673 -1700 -742 3897 1676 -1700 -937 1081
794A081P3L07k651j696L312M64k814j382K297K721j194l385j65L751L198o510
$$ 1081 1154 1461 -1190 -2886 426 890 -1924 -3306 -1009 1712 518 -2867 -3032 719 3917 -2593
810b593r86N548J338k942k197K923L44Q21l031m48K916J020j738j739J94J944
$$ -2593 -3579 1969 3307 365 -1832 1091 1435 2256 -775 -1223 1693 2713 975 -764 -570 1374
826A374J228k909k647L232K293l551k493L539J587l331q4O58o03Q47J799j770
$$ 1374 2602 -307 -2954 278 2571 -980 -3473 66 1653 -1678 -1762 -1104 -1707 -860 939 -831
842h31m14P75O55Q97j884q29L697Q19l054j543L383R44k000m77J469j942J198
$$ -831 -1245 -470 185 1082 -802 -1631 2066 2885 -169 -1712 1671 2615 615 138 1607 -335 863
859H63R59k659j023J919J113k140j075J392K113k315j460J887j29k07J173J105
$$ 863 1822 -837 -1860 59 1172 -968 -2043 -651 1462 -853 -2313 -426 -555 -762 411 1516
875A516l200j466N679L37m326j652N399R28l105j868K808n47J211n37k119j91
$$ 1516 -1684 -3150 2529 2866 -1460 -3112 2287 3215 110 -1758 1050 503 1714 1177 -942 -1133
891a133J265K558k706l834K493N053k758n367J891N423j932m046R65K397K90O4
$$ -1133 132 2690 -16 -3850 -1357 3696 938 -4429 -2538 2885 953 -3093 -2128 269 559 623
907F23k16l080J311N031q61n244J000M876j011l255L73K256r41j750K137M59l800
$$ 623 407 -2673 -1362 3669 2808 -2436 -1436 3440 2429 -826 -453 1803 862 -888 1249 1708 -2092
924b092N49M906j401o689N43Q642j951p995K743N133j357l582K062J185l390K144
$$ -2092 -1543 3363 1962 -4727 -4184 4458 2507 -5488 -2745 2388 1031 -2551 -489 696 -2694 -550
940e50M222l001n085L782P120l797r244L203J0894k023r998Q17O567R11l966j215
$$ -550 3672 671 -4414 -632 6488 2691 -6553 -3350 7544 5521 -4477 -3660 2907 3818 -148 -1363
956a363j607K892L565l079m879J698N406K45m733k198K793N318k385m824q90L969
$$ -1363 -2970 -78 3487 408 -4471 -2773 2633 2878 -1855 -4053 -1260 4058 1673 -3151 -4041 -72
972g2N194j675r390J856J0994K67j2199j066J2991o66j0615J244P601k185o558
$$ -72 5122 3447 -5943 -4087 6907 7174 -5025 -6091 6900 6234 -4381 -3137 4464 2279 -4279
987d279M958L437n782l263P758J905j0082j829J1668J520j2935n10J3102l048
$$ -4279 679 4116 -1666 -4929 2829 4734 -5348 -7177 4491 6011 -6924 -7434 5668 2620
1001B620r330N586P423p260m897R088K943r831j287J0124J748r705l997J0725
$$ 2620 -6710 -1124 6299 -961 -5858 3230 6173 -3658 -4945 5179 6927 -2778 -6775 3950
1015C950L667r597l901P874K338m697j365J161n38J914J791o031j119N839J581
$$ 3950 7617 -1980 -5881 1993 4331 -366 -1731 -570 -1108 806 2597 -3434 -4553 1286 2867
1030B867m327j171N89J969K608k003n287J193P601J110q087l943R934P175j1287
$$ 2867 -1460 -2631 -2042 -73 2535 532 -4755 -3562 4039 5149 -2938 -6881 3053 10228 -1059
1045a059q189J1432P708j1064n686R760J303p773K101N614m982m677O860M424
$$ -1059 -9248 2184 9892 -1172 -6858 2902 4205 -3568 -1467 4147 -835 -5512 1348 5772
1059E772r178m334J0108N703j2545n080J3799L424j3882j270J3648k201r923M598
$$ 5772 -3406 -7740 2368 8071 -4474 -9554 4245 7669 -6213 -7483 6165 3964 -5959 -1361
1073a361P527n457m337N901J325n954J66N019L08n033n84M439r9m891K448L773
$$ -1361 6166 709 -3628 2273 3598 -2356 -2190 2829 3137 -1896 -2480 1959 1860 -3031 -583 3190
1089C190m706k286O451q47n544K178L702k692j537K597j619J43K804k64m718J679
$$ 3190 -1516 -3802 2649 1802 -3742 -1564 2138 -554 -2091 506 -1113 -970 1834 1570 -3148 -1469
1105a469N713j170o587K24Q862n90q775J32R375j701r582N279N813p275j515O255
$$ -1469 4244 3074 -3513 -3289 5573 4983 -3792 -3660 5715 4014 -5568 -289 5524 -1751 -3266 2989
1121B989r74p379M925N309o512m242N352N978n572o432O463N742p312m928R595
$$ 2989 2015 -5364 -439 4870 -1642 -5884 -532 5446 -126 -6558 -95 5647 -1665 -6593 3002
1136C002K382r413J136P496m332m241O206J088o418Q37O782k307n396J821L217
$$ 3002 5384 -4029 -2893 4603 271 -3970 2236 3324 -3094 -2257 4525 2218 -3178 -1357 1860
1151A860q24l799J356N265m065n057O368J553o449J211O758m389n098P541J41
$$ 1860 1036 -2763 -1407 3858 -207 -5264 1104 2657 -3792 -2581 4177 -212 -5310 2231 2372
1166B372n111O83N382k487l938K983L423j293m542J976M697l238l391M226K069
$$ 2372 -2739 -2056 3326 839 -3099 -116 3307 2014 -2528 -552 4145 907 -2484 1742 3811
1181C811o476L73O769m086n430N209L572o834r81O092l64m363J751L499k589j950
$$ 3811 -2665 -2292 4477 391 -5039 170 3742 -3092 -4073 2019 1655 -2708 -957 2542 -47 -1997
1197a997K014K720k990k719L999L289o337j146P411j390o725L347N255n731j455
$$ -1997 17 2737 -253 -2972 1027 4316 -2021 -3167 4244 2854 -3871 -524 4731 -1000 -2455
1212b455N221j17m980P42M357j704l414J346L257j724l567K156L703m204k229
$$ -2455 2766 2649 -2331 -1589 2768 1064 -2350 -1004 2253 529 -3038 -882 2821 -1383 -3612
1227c612N774M44n813J818N282m492k808N636J178n467O90M107j512k037Q85K200
$$ -3612 2162 2606 -3207 -1389 3893 -599 -3407 2229 3407 -2060 -1370 2737 1225 -812 73 2273
1243B273j528j834J195K254l254k260M486J31m423M23N190l072l463M745J477
$$ 2273 745 -1089 106 2360 -894 -3154 1332 1463 -2960 -2537 2653 -419 -3882 863 2340
1258B340m129L25K898p99l137K159L361k590k988K290L822l550k177L876K027
$$ 2340 -1789 -1464 1434 635 -2502 -343 3018 428 -2560 -270 3552 2 -2175 1701 3728
1273C728n254p93N288k116l534K660J839l647L12L282n93l449P97K955q98k558
$$ 3728 -1526 -2319 2969 853 -2681 -21 1818 -1829 -1517 1765 1172 -2277 -1480 1475 577 -1981
1289a981O81L238j597k640K208K052l358o20M575j585l399K490K755k944j871
$$ -1981 -1300 1938 341 -2299 -91 1961 -1397 -2017 2558 973 -2426 64 2819 -125 -1996
1304a996L593K48k292l97K115n40j752l67K925j506k093J275K482k568p57K855
$$ -1996 1597 1845 -447 -844 1271 731 -1021 -1388 1537 31 -2062 -787 1695 -873 -1630 1225
1320A225q89k670J608K774k767j555L543k47k616K91K635l12j880Q88J846j092
$$ 1225 336 -2334 -726 2048 -719 -2274 1269 1022 -1594 -1303 1332 1020 -860 28 1874 782
1336G82j507Q45J571j960j095L007n84k708J126K705k320j811K932k45k181k75
$$ 782 -725 120 1691 -269 -1364 1643 1059 -1649 -523 2182 -138 -1949 983 738 -1443 -1718
1352a718K295n31j663K83K405j33k742J126K270q29k689J980J492k261L6J787
$$ -1718 577 46 -1617 -1334 1071 938 -1804 -678 1592 763 -1926 54 1546 -715 -679 1108
1368A108M8k196R94J175p72j246J039O37j030k15K07L49m19r40M38P07r4L50j94
$$ 1108 1156 -1040 -46 1129 357 -889 150 787 -243 -458 -251 98 -321 -1261 -823 -116 -210 140 -54
1387e4p63o6J779j007r95Q62J600j701k0R76K9o92M41N22l44q15K86P53j320N1
$$ -54 -817 -883 896 -111 -1106 -244 1356 -345 -365 611 640 -52 389 911 567 -248 38 791 -529 -478
1407d78R33R39j599r03J507K8j162k68J305o43o40N27M11l16n44J534K48j050
$$ -478 455 1394 -205 -1108 399 427 -735 -1003 302 -341 -981 -454 -43 -359 -903 631 879 -171
1425a71n33J222J57l05p79P94J304j002q41N11M96N57j548K47K9N79j64j154L14
$$ -171 -704 518 675 370 -409 385 1689 687 -154 357 853 1410 -138 109 138 717 553 -601 -287
1444b87Q6J35J34Qp54j97O87O98j228p93J485Q73o77q72Q86J140l64j766L92J816
$$ -287 -201 -66 68 76 -678 -875 -188 510 -718 -1511 -26 847 170 -702 184 1324 960 -806 -414 1402
1464A402q69p97N21L98r06l59J847j044n30n00J798p59p15j23O22N70j454j51
$$ 1402 533 -264 257 655 -251 -610 1237 193 -337 -837 961 202 -513 -636 -14 556 -898 -1049
1482a049J899k26k143oK695n76j717P71K188j336j404J409J148p70k108J610J130
$$ -1049 850 624 -1519 -1525 1170 594 -1123 -352 1836 500 -904 505 1653 883 -1225 385 1515
1499A515j567n32J501P78j359j398P86N17p21l98J312p50n39K93K96N65q86r59
$$ 1515 -52 -584 917 1695 336 -1062 -276 241 -480 -878 434 -316 -855 -562 -266 299 -587 -1546
1517a546L021n96k406J108J712o40j725O5J554N81p03q14J289N98j931P96R37
$$ -1546 1475 879 -1527 -419 1293 653 -1072 -1007 547 1128 425 -389 900 1498 -433 363 1300
1534A300M69m102K206J207j247j114Q53N04p83j163K730L7j627l55P57J367j738
$$ 1300 1769 -2333 -127 1080 -167 -1281 -428 76 -707 -1870 860 897 -730 -1085 -328 1039 -699
1551f99q07J920J276k633M25J533j326j94P33P59l65j25o12J271j04k756J389
$$ -699 -1506 414 1690 -943 -518 1015 -311 -505 228 987 622 497 -115 1156 1052 -1704 -315
1568c15J764j306k240K125P15j512p2J255k44n66n35M83K81O16k150J663P04q23
$$ -315 1449 143 -2097 28 743 -769 -841 414 170 -396 -931 -448 -167 449 -1701 -38 666 -157
1586a57m27J050K39j534R84L83J06k75j26j51N47m25o32R76l6j006j53J381o76
$$ -157 -584 466 705 -829 155 538 644 369 243 92 639 214 -418 558 522 -484 -637 744 68
1605F8o89K72P81j69q59N94r6P59j704L61J765k03j720J94J810p05j170J315L94
$$ 68 -621 -349 432 263 -596 -2 -98 661 -1043 -682 1083 880 -840 -646 1164 459 -711 604 998
1624I98j120J48P62M9n39o08L58N82p76o49R69Q56k289R64R45j324n66J692N41
$$ 998 -122 26 788 837 298 -310 48 630 -146 -795 174 1030 -1259 -295 650 -674 -1240 452 993
1643I93j717L34M47n9o62M35l72J028J93j039O20N12r56N88O57q56n7P04q46n12
$$ 993 -724 -390 57 -2 -664 -229 -601 427 620 -419 201 713 -243 345 1002 146 89 793 -53 -565
1663e65O15j84p55J141K33q54K35O18j018j64R52J06l90j63l78P66J24p18k12
$$ -565 50 -134 -889 252 485 -369 -134 484 -534 -698 254 360 -30 -193 -571 195 319 -399 -611
1682f11J921r09j099J191N19j626L70J375m87o23P70N00j475M08p73L32J001j203
$$ -611 1310 401 -698 493 1012 -614 -244 1131 644 21 791 1291 -184 224 -549 -217 784 -419
1700d19O09L1m86n77Q27k54q85J319K48r93O2Q11n43k77Q07J41k49N5K52j52M31
$$ -419 190 221 -265 -842 -15 -269 -1154 165 413 -580 -518 293 -250 -527 280 421 172 227 479 327 758
1721G58q67K01O85j68p29N77Rj060N98J037j111p0Q24r23j016J594L46j304L69
$$ 758 -109 92 777 609 -120 457 466 -594 4 1041 -70 -140 684 -239 -1255 339 685 -619 -250
1740b50K7j55j62M35l15K40k05j71P83Q12j261N17P97j172l09R05L20j372J192
$$ -250 -223 -378 -540 -105 -420 -180 -385 -556 227 1039 -222 295 1092 -80 -389 516 836 -536 656
1759F56K41n91L26r40L63M08k56P2r84Q11p07N21N1l1o67J065p09R8L82m13l13
$$ 656 897 306 632 -308 55 463 207 279 -705 106 -601 -80 -29 -60 -727 338 -371 -273 109 -304 -617
1780f17P06Q67j040K33j91k94p5J499o62l97N17o63O07N65j149m32J742p17j018
$$ -617 89 956 -84 149 -42 -336 -411 1088 426 29 546 -117 490 1055 -94 -526 1216 499 -519
1799e19J89R37j085K86J23J04p16L25L71n55R38q43L87J224r92Pn26O79q53J338
$$ -519 -330 607 -478 -192 -69 35 -681 -356 15 -540 398 -445 -58 1166 174 181 -345 334 -519 819
1819H19P24j728L72k57N38J17J38o42k4R68k093J149M65n91n06N73m6O5k19p42
$$ 819 1543 -185 187 -70 468 585 723 81 57 1025 -1068 81 546 -45 -551 22 -24 41 -178 -920
1839i20K17J043K82r29l13J285r96l45J216k16p94L49M35l11k31L24o33J349l68
$$ -920 -703 340 622 -307 -620 665 -331 -676 540 324 -470 -121 314 3 -228 96 -537 812 444
1858D44j180J191K03j496J63J331n48n22o2M81Q7m41J21J59n28R5n48J638m39
$$ 444 -736 455 658 -838 -675 656 108 -414 -476 5 92 -349 -228 -69 -597 -502 -1050 588 149
1877A49o90J113K61q62L30L7r7n45J326n36m83j50J54r4O36q33m37Q63N18j013
$$ 149 -541 572 833 -29 301 338 241 -304 1022 486 3 -147 7 -87 549 -284 -721 142 660 -353
1897c53m05Q66k63m59O25j0K54o9n56N63j26j17p86J695l12l59l90J077m63q59
$$ -353 -758 108 -155 -614 11 1 255 186 -370 193 67 -50 -836 859 547 188 -202 875 412 -447
1917d47Q73Q5L93p84j63K07M63n32l63Q09q14l97P98j8j59q95J204m0j047P82
$$ -447 426 511 904 120 -43 164 627 95 -268 541 -273 -670 128 110 -49 -944 260 220 -827 -45
1937d5l41J35j59M1N68Q94j093k00Q71m33n43q4N71MJ15n45J389j171n11M66P43
$$ -45 -386 -251 -410 -369 199 1093 0 -200 671 238 -305 -389 182 186 301 -244 1145 -26 -537 -71 672
1958F72o31J22MN35o06o33L35L3J9j8O18k0M06p37r84J823p04j81o14J566J76
$$ 672 41 163 167 702 96 -537 -202 -169 -150 -168 450 430 836 99 -885 938 234 53 -561 1005 1181
1979A181n59j117Q41N95r62J219o08r80l6J105j38j108R46J43Q39j633n38J279
$$ 1181 622 -495 346 941 -21 1198 590 -390 -426 679 541 -567 379 522 1361 -272 -810 469
1997D69R8r20j00P40j053j29J022J78m20M2l44R63k89p56J421r57M40n43J267
$$ 469 567 -353 -453 287 -766 -895 127 305 -115 -73 -417 546 257 -499 922 -35 405 -138 1129
2016A129J40j244p0O52K93m72j538J131K34n35n3K20OR8j31l36Q73n57m9O10J73
$$ 1129 1269 25 -45 607 900 428 -1110 21 255 -280 -333 -113 -107 -9 -140 -476 397 -160 -209 401 574
2037E74m00m56n0K34K08K64k58l11J78l74n7R61k3j344R09R0m16j65R85q89M69
$$ 574 174 -282 -332 -98 110 374 116 -195 -17 -391 -448 513 490 -854 55 145 -271 -436 549 -340 129
2058A29L23l69k89N2P8N42j024O7R74J40n29k65J039o25r74J126o3o04l4N94k90
$$ 129 452 83 -206 -154 -76 466 -558 -491 483 623 94 -171 868 243 -731 395 332 -272 -306 288 -2
2079bK57K01l19P3r3n5N8M9j502L88R12q2L28j205J022o61P12J355j575R2k58
$$ -2 255 456 137 210 117 62 120 169 -1333 -945 -33 -115 213 -992 30 -631 81 1436 -139 -47 -305
2100c05N32n93K50O14K72n02o03N84p95J153j89N27j326N98K4o74M83n68J173
$$ -305 227 -366 -116 498 770 268 -335 249 -546 607 418 945 -381 217 241 -433 50 -518 655
2119F55l69j363O51O20o68l75J775j249j31O63m11J37q26P56J79N33m94r54J567
$$ 655 286 -1077 -426 194 -474 -849 926 -323 -454 209 -202 -65 -891 -135 44 577 83 -871 696
2138F96l69j089J523q7l91O92p46q66P81J32l90J57N9m99j98K13N0m5O15j034
$$ 696 327 -762 761 674 283 975 229 -637 144 276 -114 43 102 -397 -595 -382 -332 -377 238 -796
2158g96R26O4m07O55m9K06j969J889Q18j764k44L94P01p49mK70N87j402J688o25
$$ -796 130 194 -213 442 393 599 -1370 519 1337 -427 -671 -277 424 -325 -329 -59 528 -874 814 189
2178A89K3j094M38J197j157o49J176M28j547M13J546m01j186P08J09n47r6O02
$$ 189 212 -882 -444 753 -404 -1053 123 551 -996 -583 963 562 -624 84 193 -354 -450 152
2196A52l79m26L95N0Q19p98N3O91K2j187J440k09l94k11P35j082L53J47L90o45
$$ 152 -227 -653 -258 -208 611 -187 -134 557 579 -608 832 623 229 18 753 -329 24 171 561 -84
2216h4r8Q4l18L53L7K23m3O1p47M72J04m23k05J186j146P83l2N7n12N21M99o55
$$ -84 -182 -98 -416 -63 -26 197 154 215 -532 -60 44 -379 -584 602 -544 239 207 264 -248 273 772 117
2238A17m72N60K79q43K24M13K05o31K69J98l76n20L44L50j55m16J048r10m45Q59
$$ 117 -355 205 484 -359 -135 278 483 -148 121 319 -57 -577 -233 117 -38 -454 594 -316 -761 98
2258I8l3j42J17q5k21N38l18M58j27k60j76O40%p44J085k58m31j55P22n02p02
$$ 98 65 -77 40 -45 -266 272 -46 412 285 25 -151 489 489 -255 830 572 141 -14 708 206 -496
2279d96L57O53q68j65R50j38j073N36K37l23J08l93R95l04o11K10O10j46m33N67
$$ -496 -139 514 -354 -519 431 293 -780 -244 -7 -330 -222 -615 380 76 -535 -325 285 139 -294 273
2299B73N20j019J08O74j61q20Q93j37m47J69J17N2k79n4L38k8l78k75M54k70m06
$$ 273 793 -226 -118 556 395 -425 468 331 -116 53 170 222 -57 -111 227 199 -179 -454 0 -270 -676
2320f76O70J02n78J37O53n95k30Q39N0p78J80P87l13l32K47J61k03J9k04O30o15
$$ -676 -6 96 -482 -345 308 -287 -517 322 372 -406 -226 561 248 -84 163 324 121 140 -64 566 -49
2341d9m07J000J46q49p7P68l26r49O79O07p21l17R18r8p35K59J72K06k84J43L99
$$ -49 -456 544 690 -159 -236 532 206 -743 -64 543 -178 -495 423 325 -410 -151 21 227 -57 86 485
2362D85j92m64J66P30n33k45P30n27l07Q4L39n14l1O10l45J53j26k67m3K84n8
$$ 485 293 -171 -5 725 192 -53 677 150 -157 -73 266 -248 -279 331 -14 139 13 -254 -297 -13 -71
2383g1J77l81q3M71J94p05J77Q78q03l81P97J86n72m0O38j10m36J38L29l54l18
$$ -71 106 -275 -358 113 307 -398 -221 657 -146 -527 270 456 -116 -156 482 372 -64 74 403 49 -269
2404b69L91K38K4m98n3Q62p17n51P73j93n67J23J031q44k86M50J39k07M2L9j1
$$ -269 122 360 384 -114 -167 695 -22 -573 200 7 -560 -437 594 -250 -536 -86 53 -154 -112 -73 -84
2425h4m5QP4M92l00j80L13k07N2J66J96n64K12O8m78M4K50k05k6p0L36j45q8J79
$$ -84 -129 -121 -47 445 145 -35 278 71 123 289 485 -79 133 201 -277 -233 17 -188 -214 -284 52 -93 -181 -2
2449bJ36m69K20K78j11l31J60J95J9k38J51N64p76m9L18L8k66K42K35k20j66J29
$$ -2 134 -335 -115 163 52 -279 -119 76 95 -143 8 572 -204 -253 65 103 -163 79 314 94 -72 57
2471E7L75o03k40L44qm4l28L52R6l33q4K24J58k74P8K34j92k3L1K61j40k51L34
$$ 57 432 -171 -411 -67 -75 -119 -447 -95 1 -332 -416 -192 -34 -308 -230 4 -188 -211 -180 81 -59 -310 24
2494B4kQl2O7oj01J18K88m06R6J26j51J4m3M8j96J24j0k85J92l1l4Q8m2K90j45
$$ 24 22 30 -2 65 59 -42 76 364 -42 54 180 29 43 0 48 -148 -24 -34 -319 -127 -158 -192 -104 -146 144 -1
2520aj33J99J25k7l00N2J84J0P8J49j74J9J57k39l4l19J44n1M8M0k71M91l86P
$$ -1 -134 65 190 163 -137 -85 99 109 187 336 162 181 338 99 65 -254 -110 -161 -113 -73 -344 147 -239 -232
2544b32j76J96K09m24R69j233O75L15m49rj77K21j83J80L32m39P39K66j499N49
$$ -232 -408 -212 -3 -427 542 -691 -16 299 -150 -159 -336 -115 -298 -118 214 -225 514 780 -719 -170
2564a70k4k65J689j133l75R99l58m62l03j5K95q58R18N36m08j41m40J02m03J447
$$ -170 -194 -459 1230 97 -278 721 363 -99 -402 -417 -122 -980 -62 474 66 -75 -515 -413 -816 631
2584F31j87r49K84k46j6P67m26K7J020o00q50J170l39r83J236j79p91K78Q41m48
$$ 631 444 -505 -221 -467 -483 284 -142 -115 905 305 -545 625 286 -697 539 360 -431 -153 688 240
2604B40n49J95J23L59n35j40L55q0n36p9M75N5l00J008l83j70J93k13K61n7J75
$$ 240 -309 -114 9 368 -167 -307 48 -32 -568 -647 -172 -117 -417 591 208 38 231 18 279 222 397
2625C97l01j24J31K60m57N76k39p0k96k23J95k07j66N50k4M9k50K57n9k21K58
$$ 397 96 -28 103 363 -94 482 243 173 -123 -346 -151 -358 -524 26 2 51 -199 58 -1 -222 36
2646C6j3m83K52L71n6l37K32K11k23J41k94K64J40k36k93M71j21m77N40K11l91
$$ 36 23 -460 -208 163 107 -230 2 213 -10 131 -163 101 241 5 -288 183 62 -415 125 336 -55
2667e5k4L31j82l05L3K07N7p1j99J45J22k86N6M03k15j46J11K74l83K11qL2k19
$$ -55 -79 252 70 -235 -202 5 62 -9 -208 -63 59 -227 -171 232 17 -129 -18 256 -127 84 76 108 -111
2690a11M13m27K10J89l4j23lj7N8k9j78m8R2k0N1M7m7j95K67l07k32L61L86m09
$$ -111 302 -125 85 274 240 117 114 97 155 126 -52 -100 -8 -28 23 70 23 -172 95 -212 -444 -83 303 -106
2714a06m63N01L17l76j59M61o9L6Jj02K61m47j42N52L4m47J58M15l02m94O11k02
$$ -106 -569 -68 249 -127 -286 175 106 142 143 41 302 -145 -287 265 299 -148 10 425 123 -371 240 38
2736C8m04J78L49k25k55P1j18M26r2J17o5L95k95l28N36k89L9L30l82KK76n47
$$ 38 -366 -188 161 -64 -319 -248 -366 60 -32 85 20 415 120 -208 328 39 78 408 26 28 304 -243
2758b43j17Q94j14l43j74P8k26L40k04n27M13J59K61j23m01j92N24l22K49J30
$$ -243 -360 534 420 77 -97 -19 -245 95 -109 -636 -223 -64 197 74 -327 -519 5 -317 -68 62
2778F2J8m8n73K87R74n9o27J59j87J74M4m51N68k46o58O74Qj72J26j35N47j131
$$ 62 80 32 -541 -254 720 661 34 193 6 180 224 -227 341 95 -563 111 119 -53 73 -62 485 -646
2800f46P55k29R7L52l64j93P7m70P78n29J27n4K20L00k33j25L0N74K5p1L55n71
$$ -646 109 -120 -23 329 -35 -228 -151 -621 157 -372 -245 -299 -79 221 -12 -137 -107 467 492 421 776 205
2822B05K94n4l36p1L50p42K83K69j20K37l54N7n46J73k23j54R44p69j40j42J144
$$ 205 499 445 109 38 388 -354 -71 198 78 315 -39 18 -528 -355 -578 -732 212 -557 -697 -839 305
2843C05j70p90J132j086Q4J249j26p05J174p89J47m9q2K08m59j08m15O58j10r8
$$ 305 135 -655 477 -609 -525 724 598 -107 1067 278 425 376 294 502 43 -65 -480 178 68 -30
2863c0k3L52p32N82k58J5K8J9k97p4M56k90L60l97L85K0j64P8N3J97oM7k94L1
$$ -30 -53 299 -433 149 -109 -94 -66 -47 -344 -418 38 -252 108 -289 96 116 -48 30 83 280 274 321 27 58
2887E8l54Q8L87k62k08P43l30m95L89L59n86Q3K92j39k24L88j18p9P8k12MM38
$$ 58 -296 -208 179 -83 -291 452 122 -373 16 375 -211 -128 164 25 -199 189 71 -8 70 -142 -138 300
2909C00l72j41M31J31n46J41O32n58N1K24j13j83n8J91k03Ll1P5K23m32m0l4L63
$$ 300 -72 -213 218 349 -197 -56 576 18 69 293 180 -3 -61 130 -73 -70 -101 -26 197 -235 -275 -309 54
2932E4j20k28M23j11j90J49k28L98Pk84k7L08k19J95nJ39k53k3L40j70J26M29
$$ 54 -66 -294 129 18 -172 -23 -251 147 154 -130 -157 151 -68 127 122 261 8 -15 325 155 281 710
2954G10p36Qm34N31K86m03j043J298j86P2J2r30O95k59J039p16k51P18j231P25
$$ 710 -26 -18 -452 79 365 -38 -1081 217 31 103 115 -815 -120 -379 660 -56 -307 411 -820 -95
2974i5J31O4Ll01P94o90J25J62k42r1l11O00m67l18O25K69l29J47l3J41j36m2
$$ -95 36 100 103 -198 596 -94 31 193 -49 -140 -451 149 -318 -636 -11 258 -71 76 43 184 48 6
2996Fj74j48K06Q8j72J9P5R2R1k20K60m7J08j65r7j1L38k28M8n2J19k7L9l37K09
$$ 6 -168 -316 -110 -22 -194 -175 -100 -8 83 -137 123 76 184 19 -78 -89 249 21 69 17 136 109 148 -189 20
3021B0j26O3K5K8l3J30K8k94K05nl97J11K63k03L92J08k18K2n4k14K86P3J13j24
$$ 20 -106 -43 -18 10 -23 107 135 -159 46 41 -356 -245 18 -185 207 315 97 119 65 -149 137 210 323 199
3045A99r1ok70L25j83j68K10r4n4l3J73o2p2O7P0r9Pj74L04k38J04k5R8J8Q1p3
$$ 199 108 102 -168 157 -26 -194 16 -78 -132 -165 8 -54 -126 -59 11 -88 -81 -255 49 -189 -85 -110 -12 6 87 14
3071A4J86l59kQ6R0J02j03K05j92L34k16k34L2K02o1J7m2j8j44J36N2o8k05K66
$$ 14 200 -159 -161 -75 15 117 14 219 27 361 145 -89 -57 145 84 101 59 41 -103 33 85 17 -188 78
3095G8j55L1k75L08K20j42Q9j50j7P2J29q9j14JJ52p5O9j41j7J31k95J15r2J57
$$ 78 -77 -46 -321 -13 207 65 154 4 -13 59 188 99 -15 -14 138 63 132 -9 -26 105 -190 -75 -167 -10
3119a0J45O7k72K09l00O3k72K45k12J97j30K11L52l34M2m5O0R0j38L35j90k5J46
$$ -10 135 202 -70 139 -161 -98 -370 -125 -337 -140 -270 -59 293 -41 1 -44 16 106 -32 303 113 88 234
3142B34j40j42K9K19l91K61J98k95k27J11q6k76L46K27k32J49p3J77k63k54L71
$$ 234 94 -48 -19 200 -191 70 268 -27 -254 -143 -229 -505 -159 68 -164 -15 -88 89 -174 -428 -57
3163e7m4K09k96J56q0o4mK64J17o0k71K15J97k41p1p7L59j09l84K84r9m40L60
$$ -57 -101 108 -188 -32 -112 -176 -180 84 201 141 -130 85 282 41 -30 -107 252 143 -241 43 -56 -496 -136
3186a36M43m79j03lL38m52O1N11n21L16k33O2L58J39P9j22l06N17K64j026L09
$$ -136 307 -172 -275 -278 60 -392 -331 180 -341 -25 -258 -196 162 301 380 258 -48 469 733 -293 16
3207A6o1L05n30L22k0J34j9j91P68m00m74j72L24r8L0j97k22M58J15m24O4K82
$$ 16 -45 260 -270 52 32 166 147 -44 724 324 -150 -322 2 -96 -66 -263 -485 -27 88 -336 -272 10
3229A0J71l45L33j014J268o61j64R44o68K55J65M89j592J065J5l04k47N86p68
$$ 10 181 -164 169 -845 423 -238 -402 542 -126 129 294 783 -809 256 271 -33 -280 306 -462
3248d62P82N26j024N25m40k18R31j29l45J58j408N65K35O29k89j48m40R2M91m21
$$ -462 320 846 -178 347 -93 -311 620 491 146 304 -1104 -539 -304 325 36 -112 -552 -460 31 -390
3268c90K15L77M39o13K51n41P27l97l27L30j10K50j23K24m85q5k70P00l7k27L4
$$ -390 -175 202 641 28 279 -262 465 68 -259 71 -39 211 88 312 -173 -258 -528 172 135 -92 -58
3289e8l14M36m92M63j10l77P46K02j061J40M89R7k30j11M88j8p2l56J70N1j32
$$ -58 -372 64 -428 35 -75 -452 294 496 -565 -425 64 161 -69 -180 308 290 218 -138 32 83 -49
3310d9K06J27m28M8n0K51k54m9J43N1j33k12L08l7k89L74Jj41K18j09J06L9j7
$$ -49 157 284 -144 -96 -146 105 -149 -198 -55 -4 -137 -349 -41 -78 -367 7 8 -133 85 -24 82 121 104
3333A04j54J02J04j08m8KK25n5pl25J23M13m19k67M67m09L3K05k30L11j33m55
$$ 104 -50 52 156 48 0 2 227 172 165 -160 -37 376 -43 -310 157 -252 -219 -14 -244 67 -66 -521
3355e21L70m78N99k82P38n58M50J90m46j58q07Q85N06o18k09N96J94j73m04m11
$$ -521 -151 -629 -30 -312 426 -132 318 508 62 -96 -903 -18 488 -130 -339 257 451 278 -126 -537
3375e37K2M06pO89k46K7p5n34M5j46oR61r30Q45p91O2M62K6M1m83Q4K95j28j48
$$ -537 -515 -109 -116 573 327 354 279 -255 -210 -356 -362 599 -331 514 -277 -215 247 273 314 -169 -85 210 82 -66
3399f6O41p54J27P50p04j43j3N49j53n84K58L76k79m13O68Q09j196j64K61M31
$$ -66 575 -179 -52 698 -6 -149 -162 387 234 -350 -92 284 5 -408 260 1069 -127 -291 -30 401
3419D01o02N21n32M05k81P0J46o1Rj96L14l85j75J55K13j83O01n54n22L64J85
$$ 401 -201 320 -212 193 -88 -18 128 67 76 -120 194 -191 -366 -211 2 -181 420 -134 -656 -292 -107
3440a07o8L48m6n77O55l33L55l81j12L32L47n60j8M30J07m97L26k12M10o38M05
$$ -107 -175 173 127 -450 205 -128 227 -154 -266 66 413 -147 -165 265 372 -125 201 -11 399 -239 166
3461A66N5n93N24p7K99n81K85l1q0J78m44K67J09k74J39k67J15L23l53N23l57
$$ 166 221 -372 152 75 374 -207 78 47 -33 145 -299 -32 77 -197 -58 -325 -210 113 -240 283 -74
3482g4k92L33K24k54J7j28L6R5J53k40K26j15l20K12L23qj46p1J24k68J05Rno1
$$ -74 -366 -33 191 -63 -46 -174 -138 -43 110 -130 96 -19 -339 -127 196 188 42 -29 95 -173 -68 -59 -64 -125
3506a25K37l38K53l20K86m08K12K16j46k0M08l76k19N40k70l9m2K67l0k07K06
$$ -125 112 -226 27 -293 -7 -415 -203 13 -133 -153 255 -121 -340 200 -70 -109 -151 116 86 -121 85
3527H5%K10l67L51j89k82J62J55L8j04r2J35K08j05j40o3j6j13n9jl8J14k48J60
$$ 85 85 295 -72 279 90 -192 -30 125 163 59 -33 102 310 205 65 2 -14 -127 -186 -187 -225 -111 -359 -199
3551a99O4p5J49K32j60J33J35m05K60j56J35J06l26Q1K35l37J67o4q4K28k21j59
$$ -199 -135 -210 -61 171 11 144 279 -126 134 -22 113 219 -107 -26 209 -128 39 -25 -109 119 -102 -261
3573b61P9K10q8J16j48n1K11j41k08J97M9j7J02J15k81j0J48l2k9l4L06j26k2
$$ -261 -182 28 -60 56 -92 -143 68 -73 -281 -84 -35 -52 50 165 -116 -126 22 -10 -39 -73 233 107 85
3596H5k85M60J8j76J08j64rk19L3K50k20Q8J01K4p5j82J24J84l43jL8K66k52j46
$$ 85 -200 260 278 102 210 46 37 -182 -149 101 -119 -31 70 94 19 -163 -39 145 -198 -199 -161 105 -147 -293
3620b93K87q1R6QJ8n9K22j16J08n6o6J22k41K6j24J36p3J41j57j8K14k31J1L15
$$ -293 -6 -87 9 17 35 -24 198 82 190 134 68 190 -51 -25 -149 -13 -86 55 -102 -120 94 -137 -126 189
3644A89j63m9j45K97k65M5K8L00k22Q7l78L39R4Q8k59p3L70k11k4O4j11p0K06
$$ 189 26 -23 -168 129 -136 -91 -63 237 15 102 -276 63 157 245 -14 -87 283 72 48 112 1 -69 137
3667A37j42o6K21j10r5P7J07k67K78j43p8j95J95RO1J41l10K07n0K1q3K09p8N7
$$ 137 -5 -71 150 40 -55 22 129 -138 140 -3 -81 -276 -81 -72 -11 130 -180 27 -23 -2 -85 124 46 103
3691A03j15Q4o0J16k50M6K04K07m80p3K01j9j13K19j10r4l1m2J26J68%k46L83
$$ 103 -12 72 12 128 -122 -76 128 335 -145 -218 -17 -36 -149 70 -40 -134 -165 -207 -81 87 87 -159 224
3714B24m33K21j82M64j51m52K81M1J41k15KO7J29l2q8O0j05j51K07j33K8J75l1
$$ 224 -209 12 -170 294 143 -309 -28 13 154 -61 -59 8 137 105 17 77 -28 -179 28 -105 -77 98 67
3737F7j66Q4OP5q8j54L2P9J39k41L03o43R01J94p68O0N98k70q7j27J16j50O5n39
$$ 67 -99 -15 -9 66 -22 -176 -144 -65 74 -167 136 -507 394 588 -180 -120 478 208 121 -6 110 -40 25 -514
3761e14N50L57o11O52j6n58P07o78J21j63O12l43p2N71p33N64p22K38o7o0M7N01
$$ -514 36 393 -218 434 418 -140 567 -111 10 -153 459 116 44 615 -118 446 -276 -38 -105 -165 -118 383
3783C83j07l72mM19l70j39J40K24J09J04R1n21J13o90O20K2o4l50J09K85m39q1
$$ 383 276 -96 -100 319 -51 -190 -50 174 283 387 478 -43 70 -620 0 22 -42 -392 -283 2 -437 -518
3805e18M38K91j09K35o51J53L99o6o86j19J021p05L45j16l53O6Q47p55k5l08Q63
$$ -518 -80 211 102 337 -314 -161 238 172 -514 -633 388 -317 28 -88 -441 -375 472 -283 -308 -616 247
3826B47o11P04j12l94J03N31m85j0j80J45J29m7N6j70j74K27r6J2j90J64M17k33
$$ 247 -364 340 228 -166 -63 468 -17 -27 -207 -62 67 20 76 -94 -268 -41 -137 -125 -315 -151 266 33
3848C3J51k27l3K95r5N4J25J82k72l26O5K93J97l28J35n39J92n4K36l86N93p97
$$ 33 184 -43 -76 219 124 178 303 485 213 -113 -48 245 442 114 249 -290 -98 -152 84 -302 291 -506
3870e06J38N41l11M00m70R6K07k82M70j39l48N74m31N00m29M30k40L5m6j048J502
$$ -506 -368 173 -138 262 -208 -112 95 -187 283 144 -204 370 -61 439 10 440 200 235 189 -859 643
3891F43l37K40j61n07L74l3m15O23M02n99q6L00l08L13K57n48J6j78K09j55O8
$$ 643 306 546 385 -122 252 219 -196 427 829 230 144 444 136 449 706 158 174 -4 205 50 118
3912A18l39L48Q7K09j54J76k35K53p39K3M67j49L5l26J30J2j5L14j48j62j65K82
$$ 118 -221 127 214 423 269 445 210 463 -276 -253 214 65 100 -226 -96 -84 -99 215 67 -95 -260 22
3934B2j19O3nK08k19R0M3N0k99J35JJ17k4J03k02o3J98j50L94p7k67p4K37j26
$$ 22 -97 -34 -39 169 -50 40 83 133 -166 -31 -30 87 63 166 -36 -99 99 -51 343 266 -1 -75 162 36
3958C6j03k58P72l18l6k66L91m84M2L46K10n02L4M77m89J78j35M35j8l74JN74
$$ 36 -67 -325 447 129 93 -173 218 -266 -224 122 332 -170 -136 341 -148 30 -105 330 312 -62 -61 513
3980E13l48l15K09p5N1m1J74j47J44l82J60k81J55l9K2m8K06j93n5O70n14N1l53
$$ 513 165 -150 59 -16 35 -6 168 21 165 -217 -57 -338 -183 -222 -200 -248 -42 -235 -290 380 -134 -83 -436
4003d36N16k3n0q8n99N76k40K31J16L87m62n18N28l25m6M96K44r3l06m2K19L73
$$ -436 80 57 7 -81 -680 -104 -344 -113 3 390 -72 -590 -62 -387 -433 63 307 214 -92 -134 85 458
4025D58k50j089J222r5o90N77M01n45m22N31j009R05L36j19n50N63J84K40p44
$$ 458 208 -881 341 246 -444 133 534 -11 -433 98 -911 -6 330 211 -339 224 408 648 -96
4044i6j73l3L64N5k2l23R75j401O03K77p2m1j61J75j09l52O59n53l24M31K47N64
$$ -96 -269 -302 62 117 95 -228 747 -654 -51 226 154 113 -48 127 18 -334 325 -228 -552 -121 126 690
4066F90j68p85J86N26l52q30N56L4M61J03p91J30P27j73p11J69K93K5qN84m44
$$ 690 522 -263 -77 449 97 -733 -177 -143 318 421 -370 -240 487 314 -397 -228 65 90 82 666 222
4087B22n35K62p9N37r35O04J31L11q19Q43k81l35o28J253p50R54j094O2J222j396
$$ 222 -313 -51 -130 407 -528 76 207 518 -301 542 261 -74 -702 551 -199 755 -339 -277 945 -451
4107d51R49p08N89r81pN56j112N90J711j796R09J0q95p8M30r39R44J30Q01l26
$$ -451 498 -210 379 -602 -609 -53 -1165 -575 1136 -660 249 259 -636 -714 -284 -1223 -279 -149 652 326
4127C26j116r4J655j483N96P64j053q4Q29l05m6Q0K10k36p9J009j247Q6N90m61
$$ 326 -790 -884 771 -712 -116 648 -405 -489 340 35 -11 69 279 43 -36 973 -274 -188 402 -59
4147e9j58j27N88m12K34M09o63J37o58R08J14n11M23J45k72K41m20K23K53m75
$$ -59 -217 -344 244 -168 66 475 -188 -51 -709 199 313 -198 225 370 98 339 -81 142 395 -80
4167h0l37L77M6O69n66j24M84n54K93r21J235n31k3l52N13k36J8j62K22q4N31
$$ -80 -417 -40 6 675 109 -15 469 -85 208 -713 522 -9 -32 -384 129 -107 -89 -251 -29 -113 418
4188D18r50O54j57o41Q75l9m78N03p3m1k78o1J54P8N99p39O30K69k19q67O88q6
$$ 418 -532 122 -35 -676 199 160 -318 185 112 71 -207 -268 -114 -36 563 -176 454 723 504 -363 325 239
4210B39j84n39J235o98k17k83P78r07R90l49n84P23L28o56KO34j78p15r6M8L14
$$ 239 55 -484 751 53 -164 -447 331 -576 414 65 -519 204 532 -124 -122 512 334 -381 -477 -429 -115
4231a15N7j08L69j24L4j005J178K6j36M99k6n05J85m5K33j084j97R35o06J290
$$ -115 -58 -166 203 79 113 -892 286 312 176 675 649 144 329 284 517 -567 -764 171 -435 855
4251H55m81p57M77o86o1O9L25K71k6l30L73r56J456p35K07J033o12J03m59q0l42
$$ 855 374 -383 94 -592 -653 -584 -259 12 -14 -344 29 -927 529 -206 1 1034 422 525 66 -14 -356
4272c56J028l86l32p1k84J112j6m90p29O03m00m3K23K17p47J207l93j35k38N21
$$ -356 672 286 -46 -117 -401 711 695 205 -524 79 -321 -364 -141 76 -671 536 143 8 -230 291
4292B91n24k49J74k41K78M31K94p46n3J62j99J19O92l94L1o21N41O42o92P50j073
$$ 291 -233 -482 -308 -549 -271 160 454 -292 -345 -183 -382 -263 429 35 66 -555 -14 628 -64 686 -387
4313c87K94r0m02J488j401L87R10l95l86K65N17p78M73o22k75P36Q9j04o0p06
$$ -387 -93 -183 -585 903 -498 -111 799 404 18 283 800 22 495 -127 -402 334 423 319 259 -447
4333d47O62M76l02K61j512m55J938j354J154q45J185r02k76K35k64O42q31M52
$$ -447 215 691 389 650 -862 -1317 621 -733 421 -424 761 -141 -417 -182 -446 196 -635 -183
4351a83O45l63j079R76j93M81n35k79M19o3m3j90L33k81L42K87o63M63r10J190
$$ -183 462 99 -980 -4 -197 284 -251 -530 -111 -174 -217 -407 -74 -355 -13 274 -389 74 -836 354
4371C54o08J59L41n71R74r52J40Nl77L39J48j217J218R58o96pn27N81k48k4m42
$$ 354 -254 -95 246 -325 649 -303 -163 -158 -535 -196 -48 -1265 -47 911 215 208 -319 262 14 -10 -452
4392d52Q30n01j93J20K08M43q94j47R21l52J53J033j231K16P5k11K57p46O59r8
$$ -452 378 -123 -316 -196 12 455 -439 -586 335 -17 136 1169 -62 154 229 18 275 -471 188 90
4412I0k75N23j545J223n59N06N17n61J001m30p09N04l92K03j4k07o2L38n24P96
$$ 90 -185 338 -1207 16 -543 -37 480 -81 920 490 -219 285 -107 96 82 -125 -187 151 -373 423
4432D23J71r94L39o02N16q01J220k42O7l8K67l95O5q06L03Q85p68L36O65k04n62
$$ 423 594 -400 -61 -663 -147 -948 272 30 97 59 326 -69 -4 -810 -507 378 -390 -54 611 407 -155
4453a55J93j18L31K95m77J64k72j94K47k46M54k94N36n74M22k45r7N0J30J22m98
$$ -155 38 -80 251 546 69 233 -39 -233 14 -232 222 -72 464 -110 312 67 -30 20 150 272 -226
4474b26M37l03k22O29n5n52o6J79J58n6K07K58l34o2m50J61N44l40L48l27L44
$$ -226 211 -92 -314 315 260 -292 -358 -179 -21 -77 130 388 54 -8 -458 -297 247 -93 255 -72 272
4495B72j191M58M07k37m37J231n72l80P72l1J88l58n91J06Q04j11L22j422J001
$$ 272 -919 -461 -54 -291 -728 503 -69 -449 323 292 480 122 -469 -363 441 330 652 -770 231
4514B31j30o26P02m9R7j99P1K42l27L41m65M4J20k57j0M1N81j13L98o21j63o15
$$ 231 101 -525 177 128 225 26 97 339 12 353 -112 -68 52 -205 -215 -174 407 294 692 71 -92 -707
4536g07L47P84m82L22j28j83L69j049Q47k96N61J05O95o81p17kM37Q0L05r34K31
$$ -707 -360 424 -58 264 136 -47 322 -727 120 -176 385 490 1185 504 -213 -215 222 302 607 -327 -96
4557i6K19o25M49n6K47n50M06P44j217p98O82L49J52P5q10J271m20L62k08o75
$$ -96 123 -502 -53 -109 138 -412 -6 738 -479 -1277 -595 -246 -94 -19 -829 442 22 384 176 -499
4577d99N15q6M74j229J618o92K71k9l28k43O88m66M91l82O63N30j539K97N82j091
$$ -499 16 -70 404 -825 793 101 372 343 15 -228 460 -6 485 103 766 1296 -243 54 636 -455
4597d55L74J22J107j288j20P56n35K20o29M85l53K06j59n17K83J634j422J45R30
$$ -455 -81 41 1148 -140 -260 496 -39 181 -448 37 -316 -110 -269 -786 -503 1131 -291 -146 784
4616G84n16K79j610J075n2K64m22L73N07o31k08n4M39K28l47j06p7J214j545M13
$$ 784 268 547 -1063 12 -40 224 -198 175 682 51 -157 -211 228 456 109 3 -74 1140 -405 8
4636Hm11N64j40k87n95L52L15O03j119k33O30M39l88n92O62K16j46M5L88k19M0
$$ 8 -403 161 21 -266 -861 -509 -194 409 -710 -943 -313 126 -262 -854 -192 24 -122 -77 311 92 132
4657A32J11M07r60j14P2J200j154J000l11j2Mm71J68k95J93M34n92J19K52o06
$$ 132 243 650 -310 -424 -352 848 -306 694 383 371 375 -96 72 -223 -30 404 -188 -69 183 -423
4677d23j1M16M43m49l8k90O33l89J11K82k75J58M5K14r44J136l48K67p02m00P76
$$ -423 -434 -18 425 -24 -62 -352 281 -108 3 285 10 168 213 427 -517 619 271 538 -164 -564 212
4698B12l38p7L84M7m2j30n67M23J80k81n66M85M54J65p68L32j50K62P90j016j00
$$ 212 -126 -203 181 228 186 56 -511 -88 92 -189 -755 -270 184 349 -419 -87 -237 25 815 -201 -301
4719c01Q03k66o99J273o26l69J68%L95l45K08l44N1o7J45l26m5M45L70m72J16
$$ -301 502 236 -463 810 184 -185 -17 -17 378 33 241 -103 -52 -119 26 -300 -345 100 470 -2 114
4740A14k94J77m90N37n36J07Q61k48j65m45M78J79m84K04J86l19m2P21q94O91
$$ 114 -180 -3 -493 44 -492 -385 476 228 63 -382 96 275 -209 -5 181 -138 -180 541 -353 338
4760C38j80j32K94n30J77P09n92k88M54p95J30K58K01J04mk43n39J424o60l01
$$ 338 158 26 320 -210 -33 676 84 -204 250 -545 -415 -157 44 148 144 -99 -638 786 126 -175
4780a75N77r57J070k55l11O7j78O8N93j002J088j214O96m1J65k05n1p2L68k8K19
$$ -175 402 -555 515 260 -51 16 -162 -94 499 -503 585 -629 67 26 191 -14 -65 -137 231 203 422
4801D22K09q49j62O67o90O36J45l29p8l81O63j91O1L66k7p42R26p33J77o95O15
$$ 422 631 -218 -380 287 -403 233 378 49 -29 -410 253 62 123 489 462 -280 646 -87 90 -605 10
4822A0j33L51k91k17M01j89K31O1n52L00M50m20o6M08n63K49m81K4J026p67L79
$$ 10 -123 228 -63 -280 121 -68 163 224 -328 -28 422 2 -64 344 -219 30 -451 -427 599 -168 211
4843B11N51j345K3K82K97m58K58K04l72O29m74M94J8m63J87J41K52m26r8m86o
$$ 211 762 -583 -560 -278 19 -439 -181 23 -349 280 -194 300 318 -145 42 183 435 9 -89 -575 -581
4864e81J051n70K6Q85q03J92%o43J35Q17M0P6n25j35K28m87J010l55m56K09k81
$$ -581 470 -100 -74 811 8 200 200 -443 -308 509 549 625 100 -35 193 -294 716 361 -95 114 -167
4885a67J71K48o90Q15j78K54l92j56l77J41P38m99m40O16m49j66J91J98L50o42
$$ -167 4 252 -438 377 199 453 61 -95 -472 -331 407 -92 -532 84 -365 -531 -340 -142 208 -434
4905d34Q51n23J33k70O09lm58l35J73j85P07m47K44l35K26M87l14K17r4K06n70
$$ -434 417 -106 27 -243 366 363 -95 -430 -257 -442 265 -182 62 -273 -47 440 126 343 249 455 -115
4926a15P0L63q03J58R0MM93k88qN1j26M59m38p11L41Q56j092J192j101N02P8o3
$$ -115 -45 318 -485 -327 -237 -233 260 -28 -36 15 -111 348 -90 -801 -460 396 -696 496 -605 -103 -25 -88
4948h8j40K45K5l06O71m85J45k99N34j76j34k47K14O5R5M21L6l34o58J023o64
$$ -88 -228 17 42 -264 407 -78 67 -232 302 126 -8 -255 -41 24 119 540 576 242 -416 607 -57
4969e7L57q4M49l79m33J72K74o25n5Q08k47M9Q7k89J28M20j10q45M18j66j6j73
$$ -57 300 216 665 286 -147 25 299 -326 -381 427 180 229 316 27 155 575 465 -380 38 -128 -144 -317
4991c17K19m09l47J112j47m48K73q8o1M8L34J11l42J67j44L20q18N01J2K40K13
$$ -317 -98 -507 -854 258 111 -337 -64 -152 -213 -165 169 280 -62 105 -39 281 -537 -36 -24 216 429
5012D29q4J6m59lK35O0m10M63M5l58P26q50N0K99L60k40k80J76M11j48j024L62
$$ 429 345 361 -98 -101 134 194 -216 247 292 -66 660 -190 -140 159 519 279 -1 175 586 438 -586 -224
5034b24K07l9M49n12j2Pj78O03m89O62k62k74n00l3M29P6n38J050q71M00j65K7
$$ -224 -17 -56 393 -119 -131 -124 -302 301 -188 474 212 -62 -562 -595 -166 -90 -628 422 -449 -49 -214 -187
5056a87M20m34j45K77L10n75K25J87M9j96j11M01m00p53R67L98j01m09K76n9k71
$$ -187 233 -201 -346 -69 241 -334 -109 78 127 -69 -180 221 -179 -932 35 433 332 -77 199 140 -131
5077a31L35o55O84k62L09j85k50L47k28L80j05n13j03J001o7k15m64R8M2o47N47
$$ -131 204 -451 233 -29 280 95 -155 192 -36 344 239 -274 -377 624 557 342 -122 -24 18 -629 -82
5098h2k47J92J48j53K91j53K38L6j56j80q3L32k46m49R01j0j86l58L86m02j33
$$ -82 -329 -137 11 -142 149 -4 234 270 114 -66 -149 183 -63 -512 389 379 193 -165 221 -181 -314
5119c14J08m7M48q6n8j46n0O8J00n68R82n43L61j3m10M78m52L12m70O19n28J67
$$ -314 -206 -253 195 109 51 -95 -145 -77 23 -545 437 -106 255 242 -168 310 -142 170 -300 319 -209 -42
5141d2M52o06L39o09M02j38Q1P6M51q45J143m86m33M26o56N54j83j39j80J061
$$ -42 410 -196 143 -466 -64 -202 -121 -45 406 -439 704 218 -215 211 -445 109 -74 -213 -393 668
5161F68n99k47N09R3n79O45p35N75K56m19m54N17k78m9L22j07K14p68M35L01j9
$$ 668 69 -178 331 424 -155 490 -245 330 586 167 -287 230 -48 -97 225 118 332 -436 -1 300 281
5182B81j84l71M74p25K69k49O40q7m0j41N5j2MM06k40n69L95J51l00K32K50k79
$$ 281 97 -274 200 -525 -256 -505 135 48 8 -133 -78 -90 -86 320 80 -489 -94 57 -243 -11 239 -40
5204d0l37P92ll87r1J92k82o4O26k67j44J05k26J98j66O2L0l28N73l49M53j76
$$ -40 -377 415 412 25 -66 126 -156 -220 406 139 -5 100 -126 72 -94 -32 -2 -330 243 -106 347 171
5226A71k59k44O04k82j61O79l41nk91k4k7N8q0R3J97L11l11K14p52N94KO7m71
$$ 171 -88 -332 272 -10 -171 508 167 162 -129 -153 -180 -122 -202 -109 88 399 88 302 -450 144 146 213 -258
5249b58QO68m38J76n48N96j57k34J81R6j15l03M01P4k45K31j19j99K95L0J51m69
$$ -258 -250 418 -20 156 -392 204 47 -187 -6 90 -25 -328 73 147 -98 133 14 -185 110 140 291 -178
5271a78K49k4N0k13J73j85n2K58O9k75K5J5K85l62j87L64j12M05m33J84l1k60
$$ -178 71 47 97 -116 57 -128 -180 78 147 -128 -103 -88 197 -165 -352 12 -100 305 -128 56 25 -235
5293b35Q6J87n5j37k08O7L62P7k6j64k5J19j39j46Q3L86m56r1K62K77k56l66O01
$$ -235 -149 38 -17 -154 -362 -295 67 144 118 -46 -71 48 -91 -237 -154 232 -224 -315 -53 224 -32 -398 203
5316B03m13L45M3l01j23M8L59m25m15O06J15J42l16N7J67k97J38k8J67K56m65
$$ 203 -210 135 178 -123 -246 -198 161 -264 -679 -73 42 184 -132 -75 92 -205 -67 -95 72 328 -137
5337a37K81N1j77k79J12r7J71p9J38M8k50Q9j66N65m7o00M91r9J88j20j2j18l72
$$ -137 144 195 18 -261 -149 -246 -75 -154 -16 32 -218 -129 -295 270 223 -377 114 15 203 83 71 -47 -419
5360d19L72j69J62J92o5n4p2n8R8k87N33j73j30j13l24O57n5n5p8n4j36L24L06
$$ -419 -47 -216 -54 138 73 19 -53 -111 -13 -300 233 60 -70 -183 -507 150 95 40 -38 -92 -228 96 402
5383D02n25nr4O04j70j34M2J8l35k6M22n12J89pJ05j32j0J10n8N6J44j73j75o6
$$ 402 -123 -128 -222 382 212 78 120 138 -197 -223 199 -313 -124 -131 -26 -158 -168 -58 -116 -60 84 -89 -264 -330
5407c30L8O1M35Mk78k9J53J29j13k2n7J62m80L35K23k71r1K25J30j31J40k17k78
$$ -330 -292 -231 204 208 -70 -99 54 183 70 48 -9 153 -327 8 231 -40 -131 94 224 93 233 16 -262
5430b62j3j27K95j3J40j06j39J64k3j69K43k67J12m34L77L03J40k66L41j23m48
$$ -262 -275 -402 -107 -120 20 -86 -225 -61 -84 -253 -10 -277 -165 -599 -222 81 221 -45 296 173 -275
5451b75J87j14J74k35O0m06Q10P6n68J20J17K5J81k2l88O28m22q4R7O3Pk41M96
$$ -275 -88 -202 -28 -263 -203 -609 201 277 -291 -171 -54 -29 152 130 -258 370 -52 -136 -39 24 31 -210 286
5474B86j20j34k54L5K82m25L61l8j95J38k56K01Q3p3J64J18j11J31j93lr8J07
$$ 286 166 32 -222 -187 95 -330 31 -7 -202 -64 -320 -119 -36 -109 55 173 62 193 0 -3 -101 6
$$ [...]
8191C17
##END NTUPLES=NMR FID
##END=
