##TITLE=1H_Pr CS2 40
 CDCl3
 8 sc, 
 5.05.2022
##JCAMPDX= 6.0         $$ Bruker NMR JCAMP-DX V2.0
##DATA TYPE= NMR FID
##DATA CLASS= NTUPLES
##ORIGIN= UXNMR, Bruker Analytische Messtechnik GmbH
##OWNER= root
$$ XWIN-NMR		Version 3.5
$$ Thu May  5 11:32:36 2022 Russian Standard Time (UT+4h)  she@DPX200
##.OBSERVE FREQUENCY= 200.13135
##.OBSERVE NUCLEUS= ^1H
##.DELAY= (6, 6)
##.ACQUISITION MODE= SIMULTANEOUS
##.ACQUISITION SCHEME= undefined
##.AVERAGES= 8
##.DIGITISER RES= 18
##SPECTROMETER/DATA SYSTEM= spect
##.PULSE SEQUENCE= zg30
##.SOLVENT NAME= CDCl3
##.SHIFT REFERENCE= (INTERNAL, CDCl3, 0, 15.7039)
##AUDIT TRAIL= $$ (NUMBER, WHEN, WHO, WHERE, WHAT)
$$ ##TITLE= Audit trail, XWIN-NMR		Version 3.5
$$ ##JCAMPDX= 5.01
$$ ##ORIGIN= Bruker BioSpin GmbH
$$ ##OWNER= she
$$ F:/spectra/data/she/nmr/H-F/1/audita.txt
$$ ##AUDIT TRAIL=  $$ (NUMBER, WHEN, WHO, WHERE, WHAT)
(   1,<2022-05-05 11:31:23.07 +0400>,<she>,<DPX200>,
      <created by zg, POWCHK disabled, PULCHK disabled
       configuration hash MD5:
       00 E9 B6 7A A2 85 ED C7 34 08 36 98 17 FE 4E 26
       data hash MD5: 16K
       4A 77 E1 F4 C1 E9 C8 92 32 E9 11 7F 88 67 EB D9>)
$$ ##END=
$$ 
$$ hash MD5
$$ 32 33 FE 39 B6 7A 79 B4 CD 2A 2C CA 7F 16 4B 22
##$RELAX= 
##$RELAX= 
##$RELAX= 
##$RELAX= 
##$RELAX= 
##$RELAX= 
$$ Bruker specific parameters
$$ --------------------------
##$DU= <F:/spectra>
##$EXPNO= 1
##$NAME= <H-F>
##$PROCNO= 1
##$TYPE= <nmr>
##$USER= <she>
##$AMP= (0..31)
100 100 100 100 100 100 100 100 100 100 100 100 100 100 100 100 100 100 
100 100 100 100 100 100 100 100 100 100 100 100 100 100 
##$AQSEQ= 0
##$AQ_mod= 1
##$AUNM= <au_zg>
##$AUTOPOS= <>
##$BF1= 200.13
##$BF2= 200.13
##$BF3= 200.13
##$BF4= 200.13
##$BF5= 200.13
##$BF6= 200.13
##$BF7= 200.13
##$BF8= 200.13
##$BYTORDA= 1
##$CFDGTYP= 0
##$CFRGTYP= 5
##$CHEMSTR= <none>
##$CNST= (0..31)
1 1 145 1 1 1 1 1 1 1 1 1 1 1 1 1 1 1 1 1 1 1 1 1 1 1 1 1 1 1 1 1 
##$CPDPRG= <>
##$CPDPRG1= <>
##$CPDPRG2= <>
##$CPDPRG3= <>
##$CPDPRG4= <mlev>
##$CPDPRG5= <mlev>
##$CPDPRG6= <mlev>
##$CPDPRG7= <mlev>
##$CPDPRG8= <mlev>
##$CPDPRGB= <>
##$CPDPRGT= <>
##$D= (0..31)
0 1.2 0 0 0 0 0 0 0 0.06 0 0.03 0 0 0 0 0.0002 0 0 0 0 0 0 0 0 0 0 0 0 
0 0 0 
##$DATE= 1651735882
##$DBL= (0..7)
120 120 120 120 120 120 120 120 
##$DBP= (0..7)
150 150 150 150 150 150 150 150 
##$DBP07= 0
##$DBPNAM0= <>
##$DBPNAM1= <>
##$DBPNAM2= <>
##$DBPNAM3= <>
##$DBPNAM4= <>
##$DBPNAM5= <>
##$DBPNAM6= <>
##$DBPNAM7= <>
##$DBPOAL= (0..7)
0.5 0.5 0.5 0.5 0.5 0.5 0.5 0.5 
##$DBPOFFS= (0..7)
0 0 0 0 0 0 0 0 
##$DE= 6
##$DECBNUC= <off>
##$DECIM= 32
##$DECNUC= <off>
##$DECSTAT= 4
##$DIGMOD= 1
##$DIGTYP= 9
##$DL= (0..7)
0 120 120 120 120 120 120 120 
##$DP= (0..7)
150 150 150 150 150 150 150 150 
##$DP07= 0
##$DPNAME0= <>
##$DPNAME1= <>
##$DPNAME2= <>
##$DPNAME3= <>
##$DPNAME4= <>
##$DPNAME5= <>
##$DPNAME6= <>
##$DPNAME7= <>
##$DPOAL= (0..7)
0.5 0.5 0.5 0.5 0.5 0.5 0.5 0.5 
##$DPOFFS= (0..7)
0 0 0 0 0 0 0 0 
##$DQDMODE= 0
##$DR= 18
##$DS= 0
##$DSLIST= <SSSSSSSSSSSSSSS>
$$ [...]
##$SUBNAM2= <"">
##$SUBNAM3= <"">
##$SUBNAM4= <"">
##$SUBNAM5= <"">
##$SUBNAM6= <"">
##$SUBNAM7= <"">
##$SUBNAM8= <"">
##$SUBNAM9= <"">
##$SW= 18.05172834244
##$SWIBOX= (0..15)
0 0 2 0 0 0 0 0 0 0 0 0 0 0 0 0 
##$SW_h= 3612.71676300578
##$TD= 16384
##$TD0= 1
##$TE= 0
##$TE2= 300
##$TE3= 300
##$TEG= 300
##$TL= (0..7)
0 120 120 120 120 120 120 120 
##$TP= (0..7)
150 150 150 150 150 150 150 150 
##$TP07= 0
##$TPNAME0= <>
##$TPNAME1= <>
##$TPNAME2= <>
##$TPNAME3= <>
##$TPNAME4= <>
##$TPNAME5= <>
##$TPNAME6= <>
##$TPNAME7= <>
##$TPOAL= (0..7)
0.5 0.5 0.5 0.5 0.5 0.5 0.5 0.5 
##$TPOFFS= (0..7)
0 0 0 0 0 0 0 0 
##$TUNHIN= 0
##$TUNHOUT= 0
##$TUNXOUT= 0
##$USERA1= <user>
##$USERA2= <user>
##$USERA3= <user>
##$USERA4= <user>
##$USERA5= <user>
##$V9= 5
##$VALIST= <valist>
##$VCLIST= <CCCCCCCCCCCCCCC>
##$VD= 0
##$VDLIST= <DDDDDDDDDDDDDDD>
##$VPLIST= <PPPPPPPPPPPPPPP>
##$VTLIST= <TTTTTTTTTTTTTTT>
##$WBST= 1024
##$WBSW= 4
##$XGAIN= (0..3)
0 0 0 0 
##$XL= 0
##$YL= 0
##$YMAX_a= 504140
##$YMIN_a= -642467
##$ZGOPTNS= <>
##$ZL1= 120
##$ZL2= 120
##$ZL3= 120
##$ZL4= 120
##$ABSF1= 10
##$ABSF2= 0
##$ABSG= 5
##$ABSL= 3
##$ALPHA= 0
##$AQORDER= 0
##$ASSFAC= 0
##$ASSFACI= 0
##$ASSFACX= 0
##$ASSWID= 0
##$AUNMP= <proc_1d>
##$AZFE= 0.1
##$AZFW= 0.1
##$BCFW= 1
##$BC_mod= 2
##$BYTORDP= 1
##$COROFFS= 0
##$CY= 11.3945322036743
##$DATMOD= 1
##$DC= 2
##$DFILT= <>
##$DTYPP= 0
##$F1P= 2.36226072786647
##$F2P= -0.459571619588291
##$FCOR= 0.5
##$FTSIZE= 0
##$FT_mod= 4
##$GAMMA= 1
##$GB= 0.15
##$INTBC= 1
##$INTSCL= 1
##$ISEN= 128
##$LB= 0.24
##$LEV0= 0
##$LPBIN= 0
##$MAXI= 10000
##$MC2= 0
##$MEAN= 0
##$ME_mod= 0
##$MI= 1.114404
##$NCOEF= 0
##$NC_proc= 0
##$NLEV= 6
##$NOISF1= 3.799351
##$NOISF2= 2.8
##$NSP= 1
##$NTH_PI= 0
##$NZP= 0
##$OFFSET= 15.70392
##$PC= 1
##$PHC0= -18396.11
##$PHC1= 16.40075
##$PH_mod= 1
##$PKNL= yes
##$PPARMOD= 0
##$PSCAL= 0
##$PSIGN= 0
##$REVERSE= no
##$SF= 200.130013532006
##$SI= 16384
##$SIGF1= 3
##$SIGF2= 2
##$SINO= 400
##$SIOLD= 16384
##$SREGLST= <1H.CDCl3>
##$SSB= 0
##$STSI= 0
##$STSR= 0
##$SW_p= 3612.71676300578
##$SYMM= 0
##$S_DEV= 0
##$TDeff= 0
##$TDoff= 0
##$TI= <>
##$TILT= no
##$TM1= 0
##$TM2= 0
##$TOPLEV= 0
##$USERP1= <user>
##$USERP2= <user>
##$USERP3= <user>
##$USERP4= <user>
##$USERP5= <user>
##$WDW= 1
##$XDIM= 8192
##$YMAX_p= 0
##$YMIN_p= 0
$$ End of Bruker specific parameters
$$ ---------------------------------
##NTUPLES= NMR FID
##VAR_NAME=  TIME,          FID/REAL,        FID/IMAG
##SYMBOL=    X,             R,               I
##VAR_TYPE=  INDEPENDENT,   DEPENDENT,       DEPENDENT
##VAR_FORM=  AFFN,          ASDF,            ASDF
##VAR_DIM=   8192,          8192,            8192
##UNITS=     SECONDS,       ARBITRARY UNITS, ARBITRARY UNITS
##FACTOR=    0.0002768,     1,               1
##FIRST=     0,             0,               0
##LAST=      2.2672688,     0,               0
##MIN=       0,             -642467,         0
##MAX=       2.2672688,     504140,          0
$$ Real data points
##PAGE= N=1
##DATA TABLE= (X++(R..R)), XYDATA
0@%%%%%%%Pp%qJ6k1K9l5M3n6P2q8J04j25J49j76K08k48K93l38L90m51N21n98O81
32C62p75Q81r96J124j265J418j587J772j972K196k442K704k992L308l653M031
48B114m443M895n394N942o547P220p969Q814r771J0859j2117J3590j5339J7457
62I311k0083K3443k7919L4206m3749O0130r5740L10079l13572n56892O60614L64640
74D04468l76280l10719L33874J46031k18203j35837J20590M1161P5172Q3147j63158
85B46k87642J57078L79516o2559l58407L5072K47873n6297j79945R5225J29935
96A00095n6410n3489Q553r4886l985K29232Q2679k77824j50319K29190J49295
107A62131j74221q4193J54438L0064j46589k0396P9815R899L4775M9254j32857
$$ plain form
0 0 0 0 0 0 0 0 0 7 0 0 -8 8 -13 16 -19 24 -32 40 -48 56 -69 80 -96 112 -136 157 -181 209 -242 279 -319 362
32 362 -413 468 -528 596 -669 749 -838 934 -1038 1158 -1284 1420 -1572 1736 -1917 2114
48 2114 -2329 2566 -2828 3114 -3433 3787 -4182 4632 -5139 5720 -6397 7193 -8146 9311
62 9311 -10772 12671 -15248 18958 -24791 35339 -60401 249678 -63894 -620786 39828 404468
74 404468 28188 -282531 51343 197374 -20829 -156666 -36076 5085 80257 163404 246
85 246 -287396 -130318 249198 186639 -171768 -136696 111177 54880 -125065 -29840 100095
96 100095 43685 -9804 -1251 -96137 -100122 129110 211789 -66035 -216354 12836 162131
107 162131 -12090 -96283 58155 88219 -58370 -78766 1049 10948 45723 94977 -37880
118c7880j41209J61326J86887j50116j52182J64982Q4938k23502m5938K83907
128A31213M0780k93723j4334K72943n5953k69394J36901L01341j63552l23348
138b37126J34389K78816r3945j88289Q5817J02981r7385n7509P8972K0851l0212
149b640M4556j4207j34731J6790J94700Q541j97923q403J68080k9044j45746P3641
161b6386J42807q0823j23206O1700P0425n3532k563P5400l6949r9027L7825Q8615
173E4286l4723m9377N3890J2007q6849k455R1885p52o0954K3743J7902o7397L792
186d5002J02401j1304j04482L2573R2058p6165r2898J22609J17904j37241j37447
197a36994J26161J29193j10365r8179J06020P4355j00206o7377O9287N3699j6896
$$ plain form
118 -37880 -179089 -17763 169124 19008 -133174 31808 116746 -106756 -152694 131213
128 131213 171993 -121730 -136064 136879 80926 -188468 -51567 249774 86222 -237126
138 -237126 -102737 176079 82134 -106155 -20338 82643 -14742 -72251 6721 27572 -2640
149 -2640 41916 27709 -107022 -90232 104468 113009 -84914 -93317 74763 45719 -100027 -26386
161 -26386 116421 35598 -87608 -25908 44517 -9015 -11578 63822 26873 -72154 -34329 54286
173 54286 19563 -29814 24076 36083 -50766 -53221 38664 37912 -23042 701 18603 -48794 -45002
186 -45002 57399 46095 -58387 -25814 66244 -9921 -102819 19790 137694 453 -136994
197 -136994 -10833 118360 7995 -90184 15836 90191 -10015 -77392 -8105 45594 28698
208B8698j9435l1686l1384M9720O9253n1009q2623N5216Q2830p1566q9132Q3241
220g877R7881o9700q9018M6596N3086l2918l773M0920l0106m9487M2477M6166
232D4247m8638l1401O2054K3686p4585l0667O6618L4723l7599k3781N170o657
244a6830J0335L3297j6511m5172K7227M6686m7876n2719O3659O6923o0291p0722
256f1994M6267N5908l4236k8419L6240J0398m0940l176L7421m195k2572J9270
268I972J0148l7549j0196M1758J2485l1419o742J5574j1628r149K7257O759l1137
281a3867k554L0774j2153l4247K6829M7386l0595n2754K5049M7015j7542l3716
293b0375K0285K2801k3766j6748J9372J1499o013m46n020j7173N133K8363k413
$$ plain form
208 28698 9263 -22423 -53807 -4087 65166 14157 -68466 -13250 69580 -1986 -91118 -7877
220 -7877 90004 20304 -68714 -22118 30968 -1950 -5723 35197 5091 -44396 -1919 44247
232 44247 -4391 -35792 26262 49948 -24637 -55304 11314 46037 8438 -15343 -10173 -16830
244 -16830 -6495 26802 10291 -34881 -7654 39032 -8844 -61563 2096 69019 8728 -61994
256 -61994 -15727 40181 5945 -22474 13766 24164 -16776 -19952 17469 13274 -9298 9972
268 9972 20120 -17429 -27625 14133 26618 -4801 -11543 4031 -7597 -16746 10511 17270 -13867
281 -13867 -16421 14353 2200 -32047 -5218 42168 11573 -41181 -16132 30883 13341 -20375
293 -20375 -90 22711 -1055 -17803 1569 13068 7055 6609 1589 -15584 -10451 17912 15499
306A5499k9883K980K4585j2321k4599J9679K7132j8765k6429J4845J5156j3844
318e965J069J9350q167k3973Q402K3751p209j5706J3386R908j9335r419J8514
331D606J0562j1411n751L207n941k509J4160L200j5755k806J2424m415j3534J0341
345c622J8826j1962k0396Q911J5423o354o757J0607L101j3658k765J3082L144
358G580n903J416J438p830j905J0936M281j0160l412O783k903o525N174P584m038
373B516p814N47O31p79O939N045r917r474Q561J2043p064j0461Q836J1707q144
388C172j3558M023J5338N319j0872j2735J631J5538O695j5309j1788J3390J4157
401A5001j2861j9573Q796K3552k322k3952p224J7920J1084p285j0595J97O095
$$ plain form
306 15499 -14384 -11404 13181 860 -23739 -4060 23072 4307 -22122 -7277 7879 -5965
318 -5965 -4896 14454 6287 -17686 -9284 14467 7258 -8448 4938 14846 -4489 -13908 4606
331 4606 15168 3757 -1994 1213 -4728 -7237 6923 10123 -5632 -8438 3986 -429 -13963 -3622
345 -3622 15204 3242 -17154 -8243 7180 826 -5931 4676 7777 -5881 -8646 4436 7580
358 7580 1677 3093 4531 -3299 -5204 5732 10013 -147 -3559 3224 321 -6204 -1030 6554 2516
373 2516 -5298 -4751 -4120 -4899 2040 7085 -2832 -12306 -3745 8298 1234 -9227 -391 11316 3172
388 3172 -10386 -6363 8975 14294 3422 -9313 -7682 7856 14551 -758 -12546 844 15001
401 15001 2140 -17433 -8637 14915 12593 -11359 -18583 -663 10421 3136 -7459 -7262 -1167
414a167N760k201q820K42J3134M286j3118j0825J0300J7044k936j7419l494J2790
428C576O001q088m871L687J818j535r86j640k207K757O264j017j2061n521J4316
443D93J3271j0680j8402N354J8674R57j4134m817R430R381k288j0714n797P671
457a601J7101J348k5596j5733K7483L0105k3019m2805J4020M8317m107n0636r057
470c4180M7662K1589m0357l1517K6908L4639j0264k8448m964J6732J6258j489
482A2569k0079j3108K1105K7289j6153l7461N534M4618R229m6013k1979L9776
494E327K9273k9764l1694J8536K7734r557k2308J061J3831L941n394m088m084
507g186j439J1361J0287j4297j7077J4338K1090j1153k1831J0665K1104r442j8215
$$ plain form
414 -1167 4593 2392 -6428 -6186 6948 11234 -1884 -12709 -2409 14635 11699 -5720 -9214 3576
428 3576 9577 1489 -3382 305 2123 588 -398 -2038 -4245 -1488 4776 3759 -8302 -13823 493
443 493 13764 3084 -15318 -9964 8710 9667 -4467 -9284 146 9527 7239 -3475 -9272 -1601
457 -1601 15500 16848 -8748 -24481 3002 33107 10088 -32717 -18697 29620 25513 -25123 -34180
470 -34180 13482 35071 -5286 -36803 -9895 24744 14480 -13968 -18932 -2200 14058 12569
482 12569 -7510 -20618 487 27776 11623 -25838 -20304 24314 33543 -12470 -34449 5327
494 5327 34600 4836 -26858 -8322 19412 9855 -12453 -11392 2439 6380 986 -3102 -7186
507 -7186 -8625 2736 13023 -1274 -18351 -4013 17077 5924 -15907 -5242 15862 6420 -11795
520a1795R341J5818j1402j3753J7650J3044k7602j5115L6059J9232m1448k6790
532c6761M1084L2547l7323l7442K9615L9297k0170l7211R305L0813o90j6931l804
545g671r6N400J7223p36l0002o756L8919J7133m1405k7884L8471L7952l0122m5683
559c5257J8167M5882o785l9714m278K8066J0819j6141j3575L631J2048O768o917
572B714j4297j365J6591J3272j4486k2978J0314L0305m204l1944q10L1999N463
585B0574l0071q784K8595J0140k6916r519K5736N454k6890j396K8519l334k9543
598a7435L134K8809k179k7092j13K3685J698j8375k050J2114J290l665L407m895
612a667r202J2724J7316j7042k2773J7035K7531j3077l0147P086K9212P04k6505
$$ plain form
520 -11795 -2454 13364 1962 -11791 5859 18903 -8699 -23814 12245 31477 -9971 -36761
532 -36761 4323 36870 -453 -37895 -8280 31017 10847 -26364 -17059 13754 13064 -3867 -7671
545 -7671 -7767 -2367 14856 14120 -15882 -22638 16281 33414 -7991 -35875 2596 40548 10426 -35257
559 -35257 -17090 28792 22007 -17707 -21985 6081 16900 759 -12816 -9185 2863 9631 2714
572 2714 -11583 -12948 3643 16915 2429 -20549 -10235 20070 15866 -16078 -16888 15111 20574
585 20574 -9497 -18281 10314 20454 -6462 -15981 9755 15209 -11681 -13077 15442 12108 -17435
598 -17435 -14301 14508 12329 -14763 -14876 8809 10507 -7868 -9918 2196 3486 -179 3228 -1667
612 -1667 -10869 1855 19171 2129 -20644 -3609 23922 10845 -19302 -12216 16996 17700 -8805
625h805q616J9503J3325j1121j4584r3J1270J0262p401j6731O26J9950N835j7817
639d397j2055J2702J8194m172k0819n362K1802J4063j8221j9570J2867K3076o534
652A1574k4007Q25K2965L241k0917n251J5440M107j0180j782M426k949k8N365
666B829k215p099K426Q462j850q760J483Q556m56o171J275L280j833l48N368l515
682A432o524O280O422o384p149O188O655n243o072L026M594j722m218Q60N73o70
698a952J097J989l185k548M951J929m318j116L766R74j153M0j123j65M015N22
714C723m791j548N728K582n874m446O298N341p199o495O612N318n608n306M288
729a377L413k545j981K25J635J375j088k539P20L366J424l221k543M420K983l549
$$ plain form
625 -8805 -17421 2082 15407 4286 -10298 -10391 879 11141 3740 -12991 -12365 7585 13420 -4397
639 -4397 -16452 -3750 14444 10272 -10547 -15909 5893 19956 1735 -17835 -4968 18108 11574
652 11574 -12433 -11608 11357 14598 -6319 -11570 3870 7977 -2203 -3985 441 -2508 -2536 2829
666 2829 614 -6485 -4059 4403 2553 -6207 -4724 3832 3376 -2795 -1520 1760 -73 -421 4947 1432
682 1432 -5092 1188 7610 1226 -5923 265 6920 1677 -4395 -1369 3225 1503 -2715 -1855 -1282 -1952
698 -1952 -855 1134 -2051 -4599 352 2281 -2037 -3153 613 1587 434 474 -649 -814 3201 3723
714 3723 -1068 -2616 3112 5694 -180 -4626 1672 7013 -186 -6681 -69 5249 -359 -5665 -1377
729 -1377 2036 -509 -2490 -2265 -630 745 -343 -2882 -2162 1204 2628 -593 -3136 1284 4267 718
745G18l064L739L242m175k117L934L87l481R98J876k137k312J793K582k207l405
761c629J405L533j494k940O56K744J98j182j200k06L372K052m015k538M339L391
777D486l275l049K584K925j752k286j08J491N86j045o86q66m30K253P76m361j089
794c846M435J203m040j743L323K125j726j766K35K017J627r29k151J52L127J718
810C761l354l354M520L343l663m764L778M140k900m668J834L303p84k791j277
825b876K053J324p82j837r16K435K653k532l400K567M521j866m069J496M511j482
841A800k780J061J423k14k94O62j595r97K074J446l157k116L116J852k953k620
857c292K427J484j789m08O65o75K21K171r32k127J044L681j016l089R65L096n20
$$ plain form
745 718 -2346 1393 4635 460 -1657 2277 2664 -817 181 2057 -80 -2392 -599 1983 -224 -3629
761 -3629 -2224 1309 -185 -3125 -2469 275 473 -709 -1909 -2115 1257 3309 -706 -3244 1095 4486
777 4486 1211 -1838 746 3671 1919 -367 -475 1016 1602 557 -129 -995 -1425 828 1604 -2757 -3846
794 -3846 589 1792 -2248 -3991 -668 1457 -269 -2035 -1800 217 1844 915 -1236 -1084 2043 3761
810 3761 407 -2947 1573 4916 1253 -3511 267 4407 1507 -3161 -1327 1976 1192 -1599 -2876
825 -2876 -823 501 -281 -2118 -3034 -599 2054 -478 -3878 -1311 3210 1344 -2725 -1229 3282 1800
841 1800 -980 81 1504 1290 996 1658 63 -934 1140 2586 -571 -2687 429 2281 -672 -3292
857 -3292 -865 619 -1170 -1578 -913 -1588 -1367 804 -128 -2255 -1211 2470 1454 -1635 -670 2426 1906
874A906j957L87K72l17Q56J738k825k973L880L748m867m622M315M618m043m773
890d657K732L277j191j931R6l26O60L133n37n228J165O838k38o890n11O948J820
907E160o016j169L682R21j081j029q96l42K289J325m044k378L916K355m076j834
923c217L473O3k842J943K308m267j867O901K267q206k018R177K633q734k172Q007
939C449J189o028O61L543k786j754N872n59r037O16J2225k105j3932J388J3844
954F586m5j3205j432J0374K331n335l095K720J639Q33Q44l830k554N531N407o335
970D34n766M175P284k009p340O5N147L065l109n304n74P801K475r880m209R339
986A594N363j0094l556Q320K216o889r86P331k561p382O647P980r286p734J1539
$$ plain form
874 1906 -51 336 608 291 1147 2885 60 -2913 967 4715 -152 -4774 -459 4159 116 -4657
890 -4657 -1925 1352 161 -1770 -1674 -2000 -1340 1793 1256 -3972 -2807 4031 3793 -3097 -3608 3340 5160
907 5160 -856 -2025 1657 2578 1497 468 -428 -770 1519 2844 -1200 -3578 338 2693 -1383 -3217
923 -3217 256 319 -2523 -580 1728 -2539 -4406 2495 4762 -3444 -5462 3715 6348 -2386 -4558 3449
939 3449 4638 -1390 -729 2814 28 -1726 4146 3587 -5450 -4834 7391 5286 -8646 -7258 6586
954 6586 6541 -6664 -8096 2278 4609 -726 -3821 -1101 538 1371 2215 -1615 -4169 1362 6769 434
970 434 -5332 -1157 6127 4118 -3222 -3157 1990 5055 1946 -3358 -3932 3869 6344 -3536 -7745 1594
986 1594 6957 -3137 -6693 1627 3843 -3046 -4032 3299 738 -6644 3 7983 -1303 -9037 2502
1001B502Q302j2566p323J3203N615j3160k502J2299j561j1344N139R810q413j0277
1015a0276J1183J0238j3877j0185J3770R679j2763q371J0745P083q372l781N076
1028A49O49j603K952q91m875J427O878M02q905j014Q848J584o427l063K350N320
1044C781m05n153m358N566Q629o599j1463O092J1939n367j1769N187R986m862
1058A204p221O134L407o276P8Q422l077r733O216J1598q941j1898J0774J1586
1072A2273j2550r951J2512P334j2846m273J2448N64j1888J732J0932m334j0399
1085h446O319R032p605p363Q644M908q350j817Q162l86o970L153O003n021m439
1100d176N965L622o105k156N020J295m478q3K356j915O6K969k800m655M893N290
$$ plain form
1001 2502 10804 -1762 -9085 4118 9733 -3427 -5929 6370 4809 -6535 -1396 8414 1 -10276
1015 -10276 907 11145 -2732 -12917 853 10532 -2231 -10602 143 7226 -1146 -4927 149
1028 149 798 -805 2147 1256 -3619 -2192 4686 5088 -3817 -4831 4017 5601 -826 -3889 -1539 3781
1044 3781 3376 -1777 -6135 -569 8060 1461 -10002 -3910 8029 2662 -9107 -3920 6066 1204
1058 1204 -6017 117 3524 -2752 -2674 5748 2671 -7062 -846 10752 1811 -10087 687 12273
1072 12273 -277 -10228 2284 9618 -3228 -7501 4947 5511 -6377 -4645 6287 1953 -8446
1085 -8446 -2127 6905 -700 -8063 581 5489 -2861 -4678 3484 3098 -3872 -719 5284 263 -4176
1100 -4176 1789 5411 -694 -2850 2170 3465 -1013 -1096 1260 -655 -589 2380 -420 -5075 -182 5108
1116E108p094n119Q380M163q433l223Q493J672p338M29O681k129n407N134L988
1131E305p232k121R016N90j0393J291J0624l333j0447N375Q123o559o683P254
1145H10M092q035j588P731n78p554K439P226m249o685O554N370p873l333R278
1160C605J234q695P18Q235k600o154L784M665n036k586M993P33n598J134N613
1175D045l458n789N415M267o635l173O809K118p275o0O986k087n389L782L906
1190C462m065k651N383J218n475K16O030j621n502L067M570m339l662N816J205
1205C652o839N73O579k731o169M032M996n074m438N972K998o177j225O012j3n765
1221c617J699N981l514m731N431L569n994j839O433J16o118J678N225l130m267
$$ plain form
1116 5108 -1986 -7105 1275 5438 -2995 -6218 2275 3947 -3391 -2962 3719 1590 -3817 1317 5305
1131 5305 -1927 -4048 4968 5558 -4835 -3544 7080 3747 -6700 -1325 6798 239 -6444 810
1145 810 4902 -3133 -4721 3010 2432 -5122 -2683 4543 294 -6391 163 5533 -2340 -5673 3605
1160 3605 4839 -3856 -3138 5097 2497 -3657 127 4792 -244 -2830 2163 2896 -2702 -1568 4045
1175 4045 587 -5202 213 4480 -2155 -5328 1481 3599 -3676 -3736 3250 1163 -4226 -444 3462
1190 3462 -603 -3254 2129 3347 -2128 -1912 4118 2497 -3005 62 4632 293 -3369 2447 3652
1205 3652 -3187 -2614 3965 1234 -4935 -903 4093 -981 -5419 553 3551 -2626 -3851 2161 2148 -3617
1221 -3617 -1918 4063 549 -4182 1249 4818 -1176 -3015 3418 3534 -2584 -906 4319 1189 -3078
1236c078L862K500m339k000M705P01n538M77N652k015n513L330M316m133k847
1251c920M899J368n036R62M770k269l695L208L407l585k602M263J533m284k37
1266a218L947j105m141K679L108m096k266M645N59n075J18M951j208m395J613
1281a884M325k533l111L001K337l215o80L427k30l308J638L770k978k872M034
1296A721J774m365j079M203j98m073R81L620k218l081K345K244k968k248L917
1311E75R65m187M85M123j308l726K467L077k583k284L657J548l433m42L182n59
1327A557k513J180J984j468k010K216J053k856n11K886q58l025J383K247j983
1342g18j428K019N52j906J15K130n42j922J388J974j554j480K492P48k563K8K825
$$ plain form
1236 -3078 784 3284 -1055 -3055 1650 2351 -3187 -2710 2942 927 -4586 -1256 3060 -1073 -3920
1251 -3920 979 2347 -2689 -1727 3043 774 -2921 287 3694 109 -2493 1770 3303 -981 -1218
1266 -1218 2729 1624 -2517 162 3270 -826 -3092 1553 2112 -2963 -2845 2106 898 -3497 -1884
1281 -1884 2441 -92 -3203 -202 2135 -1080 -1760 1667 1437 -1871 -233 3537 559 -2313 1721
1296 1721 3495 -870 -1949 2254 2056 -2017 -1036 2584 366 -2715 -370 1874 -1094 -3342 575
1311 575 1540 -2647 -2162 1961 653 -3073 -606 2471 -112 -2396 1261 2809 -624 -1066 2116 1557
1327 1557 -956 224 2208 740 -1270 946 1999 -857 -1368 1518 660 -2365 -982 1265 -718
1342 -718 -2146 -127 425 -1481 -1366 764 222 -1700 -312 1662 108 -1372 1120 1868 -695 -667 2158
1359B158p14k654J499K242k469k082K706J407k855j273K891P64l052l51K503m91
1375B29k077P17J715j063j363J940J006k423k0K635o2j885K21K097m41j431O17
1392D12P95o96k57M58l17r00O80M03r99n27J154L44j389k21Q60j15q08N86Q64
1411C27j466N0J584j6j513M48K072m42j919Q49J759r75j177R09R41q71q74J289
1429I75Q9j599m5J679q06j593O7J884k54j911q1J864J14j779Q4J368M88j053n0
1448e59O90K05k6JK66j2k83K78N84n20j167Q17R01q06j213M94J507o02j793N19
1468g19J332m53j636L25J542m13j338M50J157l20j145J074J229j140j067J703
1484E81J193j676j057J976Q60j943j067K339N68k154n30J507O40k345l4J890l92
$$ plain form
1359 2158 1444 -1210 289 2531 62 -2020 686 2093 -762 -2035 856 1620 -1432 -1783 720 229
1375 229 -1848 -1131 584 -479 -1842 98 1104 -1319 -1339 1296 1234 -651 -430 1667 1226 -205 412
1392 412 1207 511 254 712 395 -505 175 578 -421 -948 206 550 -839 -1060 -200 -315 -1123 -537 327
1411 327 -1139 -1089 495 479 -1034 -586 1486 1044 -875 -26 1733 758 -419 490 1431 560 -314 975
1429 975 1064 -535 -580 1099 293 -1300 -1233 651 397 -1514 -1595 269 383 -1396 -1312 56 544 -509 -559
1448 -559 131 336 310 311 577 565 282 560 1144 624 -543 274 1175 369 -844 -350 1157 555 -1238 -719
1468 -719 613 160 -1476 -1151 391 -22 -1360 -910 247 -73 -1218 -144 1085 -55 -1122 581
1484 581 1774 98 -959 1017 1877 -66 -1133 1206 1774 -380 -910 597 1237 -1108 -1142 748 356
1501C56k352Q98K031p53k225P50K412o76k390R15K066l63k106J279J719j136j189
1518g64J305R93j353m02J220M35j870l84J721K75k059l49J799N65k344n34J957
1535B11N06j954l05J652J15j141R3J155M8j101O33J099l11j354N87J575q39j488
1553h19R73J491r82j551J013J322j249j344Q85J208j253j181J368Q13j596n84
1569a486J484M46j493k16J340O10j491k3J539j04j001L7J565k34j125K48J135
1586A231j028p33J042P23p76r61N17R08j253o32O56O71p24p88Q74L57q54j94P70
1605a94J99n47L32L27K23k70k82P55J47o50j6R48k68p85L71N23k82p05K81M12
1625E19j30q00k80P94j19p77J05O46k86n58M16N82l89o34J013J45k92n45R45M53
$$ plain form
1501 356 -1996 -1098 933 180 -2045 -1295 1117 441 -1949 -1034 1032 669 -1437 -158 1561 425 -764
1518 -764 541 1534 181 -221 999 1434 -436 -820 901 1176 -883 -1232 567 1132 -1212 -1746 211
1535 211 717 -1237 -1542 110 225 -916 -823 332 380 -721 -88 1011 700 -654 -67 1508 669 -819
1553 -819 154 1645 663 -888 125 1447 198 -1146 -261 947 -306 -1487 -119 694 -902 -1486
1569 -1486 -2 444 -1049 -1265 75 685 -806 -829 710 606 -395 -358 1207 973 -152 96 1231
1586 1231 203 -530 512 1235 459 -502 15 923 -330 -962 -306 365 -359 -1147 -273 84 -770 -964 -194
1605 -194 5 -542 -210 117 340 70 -212 543 690 40 24 972 704 -81 290 813 531 -174 107 519
1625 519 389 -411 -691 103 -16 -793 -688 -42 -328 -886 -470 112 -277 -911 102 247 -45 -590 355 808
1645H08p57j97O57L82q15k5P45Q9j076J44L47k28l10r3M02P5q04j5L99r5m37M12
1667c92J51n8l70Q16k21j52N49j77r8J27m3J92M34j90j74l8K71j36k14l9n4J55
1689C39l08l42K70K18n20j88L25l29m71N25N26m55l45N85N56k66n41O57L49o36
1709e1j5O71J76o90J86O82l56n79M4O25l3j034O21L61r00j97O2O17l80n50J93
1730e47K24j91K6N70n85J16J23J24K63n5J12O5J10J89j95P6K56j73j67j44K49
1751D46k44j01j5N8q5n72J46P86p73m26K27O20m82n29P47j08j81p8P50J68m23
1772f9k63P31L64p45nN46k8m54K78K19k82l27J41Q2p3j18k69N18n34j3O9j62k4
1795d18o7J61J83r4p0j7J13K59O5K6NN28k27l63J37N08l31l56K31J34j41l98M71
$$ plain form
1645 808 51 -146 511 893 78 53 798 887 -189 -45 302 74 -236 -329 73 148 -656 -671 -272 -367 -804 -392
1667 -392 -241 -299 -669 147 -74 -226 323 146 48 175 132 324 758 568 394 356 627 491 277 238 184 339
1689 339 31 -311 -41 177 -343 -531 -206 -535 -1006 -481 45 -410 -755 -170 386 120 -421 236 585 -51
1709 -51 -66 605 781 91 277 959 603 24 68 693 660 -374 247 608 -292 -489 -427 190 -190 -740 -547
1730 -547 -323 -514 -488 82 -503 -387 -264 -140 123 68 180 245 355 544 349 425 681 508 341 197 446
1751 446 202 101 86 144 59 -513 -367 419 -354 -780 -553 67 -415 -944 -197 -305 -486 -564 186 354 -69
1772 -69 -332 399 763 18 13 559 531 77 355 574 292 -35 106 188 115 -3 -272 246 -288 -301 -232 -394 -418
1795 -418 -485 -324 -141 -235 -305 -322 -209 50 115 141 146 674 447 84 221 729 398 42 273 407 266 -132 339
1818C39r4n35j38P06n04l59K01M27j62o43L27N45o78L49l00Q46q1q31P80M12o76
1839f9k34J427j55n91k71M23M80r91k34N05J99m56k18m3K94n06j12M30r4m56M2
1860f30M15k26J28m8J78L15j8j71m3N63k84l01L53J58k34j8M39J66l61k01L24
1881E04j27m36n22R36J1r75n34J262k86n47K2L35J80q19O96N10k22o77N55P55
1901F21m66k14L65Q31j176l19J244pp87n00Q26K24l41k09L28n66k41K07K21p2
1921c1j051N55K18q3j54Q8P61j25q30J23M61L60j90Q2K47N20o13n7N6Q78p26j41
1943C48j70L44j119M22J144l66j340O79L57n61p99M23O08K38q72N31P15l56o85
1962d59L84N61o68n72P78N71m66jK48M03J88r57N03L52q41m56J360o69L7R9m49
$$ plain form
1818 339 245 -290 -428 278 -226 -585 -384 43 -119 -762 -435 110 -568 -219 -519 327 246 -585 195 607 -69
1839 -69 -303 1124 969 378 107 530 1010 19 -215 290 489 33 -185 -228 66 -440 -552 -122 -216 -672 -630
1860 -630 -215 -441 -313 -361 -183 132 114 -57 -100 463 179 -122 231 389 155 137 576 742 381 180 504
1881 504 377 -59 -581 355 366 -609 -1143 119 -167 -714 -692 -357 -177 -996 -300 210 -12 -689 -134 621
1901 621 155 -59 306 1137 -39 -358 886 879 92 -408 418 642 301 92 420 -146 -387 -180 41 -31
1921 -31 -1082 -527 -309 -392 -546 -458 303 178 -652 -529 -68 292 102 184 431 951 338 281 337 1215 489 348
1943 348 178 522 -597 -175 969 603 -737 -58 299 -262 -1061 -638 -30 208 -664 -133 582 226 -459
1962 -459 -75 486 -182 -754 24 595 129 128 376 779 967 10 513 865 24 -432 928 259 296 395 -54
1983e4K68j77l43L81m16j24j64K04N10o18M87j87K31j69k72J031m86RR5L01P5
2004E82p94P23L03o89P7l16L38n41n84O55O33p42q46J075N16q40P8O08N66k205
2024a403P65N00P17q02Q3R10o88M2j012K608q26m22L15M64j151m07J005p19P3
2043E2N0M68N4j300J063m19j51K50n30J75LO40m14k61k45J337o62k29L1M8K27
2064A87n47Q35K62J9k60M23l76q11L94P01r36R8k64R72j504O28j4k73m56J33J336
2085E47j00j590J480q0q32J89o08J720j972J575N56p78m90N34L08o40M20L12K10
2104G61j122R84Q62j78j401k8j8k76P8L37N6o89L67M59K63r16K70N67k90j113
2124a027R02J434j116n72P15J25k03j009J514j00l60J30P64n08q38N03O36j615
$$ plain form
1983 -54 214 37 -306 75 -341 -465 -629 -425 85 -533 -46 -233 -2 -171 -443 588 102 111 206 507 582
2004 582 -212 511 814 125 202 -114 224 -317 -901 -246 387 -355 -1201 -126 390 -450 -372 236 802 -1403
2024 -1403 -638 -138 579 -223 -140 770 82 124 -888 1720 894 472 787 1251 100 -307 698 -21 52
2043 52 102 570 624 -676 387 -32 -183 67 -463 -288 -285 355 -59 -320 -565 772 110 -119 -88 -40 187
2064 187 -360 475 737 756 496 919 543 -268 126 827 -109 -11 -275 697 -807 -179 -193 -466 -922 -789 547
2085 547 447 -1143 337 257 -575 -386 -994 726 -1246 329 885 107 -383 151 459 -181 239 551 761
2104 761 -361 623 1485 1307 -94 -122 -140 -416 -338 -1 55 -634 -267 192 455 -461 -191 376 86 -1027
2124 -1027 -125 1309 193 -379 336 461 258 -751 763 663 303 433 1197 689 -149 354 990 -625
2142f25O48L13n02j059J537R6n5m00r8M30p43l84R76Q4K56n25J80O24j098R06
2162E61J42l37o54M42M70q50P47J5m83K70J2m2J8k34j24k21p46M15O82k69q16
2183a002J014P0n11MO59k03o87J156Q19j308J93Q0P85p50l06J180p88q41K68J113
2203I45o12j355J160j32o36k85R58o4j139L99R58P0j088j14P72M98m18Q6P59m76
2223B86o50M48K13r08O54J164n21r61J003O16p79j27J71k74l50J22R13j246j8
2242b44K79K66j199p08J350P36j189Q83N19j76r20M76J088j993K32J436l44j97
2260B95k71K05l4N51l46P93n40r75R49N6j099P72M91j138p12Q59o4J58k2k40R31
2281F19r55nO56K54o86J77M93k84r47N62J189j314P01k24P8q58J705M8j633P47
$$ plain form
2142 -625 23 336 -166 -1225 312 408 353 -47 -145 285 -458 -842 134 218 474 -51 129 753 -345 561
2162 561 703 366 -288 154 624 -226 521 536 53 323 335 293 311 77 -47 -268 -1014 -599 83 -186 -1002
2183 -1002 12 82 -429 -425 234 31 -656 500 1319 11 204 284 1069 319 13 1193 405 -436 -168 945
2203 945 333 -1022 138 6 -630 -915 43 -21 -1160 -761 197 267 -821 -935 -163 335 -83 3 762 286
2223 286 -364 84 297 -611 43 1207 686 -275 728 1344 565 438 609 335 -15 107 1020 -226 -244
2242 -244 35 301 -898 -1606 -256 480 -709 174 693 517 -403 73 1161 -832 -600 836 492 295
2260 295 24 229 195 746 400 1193 653 -322 627 683 -416 356 847 -291 -1003 -144 -208 -50 -72 -312 619
2281 619 -336 -341 315 569 -117 60 553 269 -678 -116 1073 -241 460 236 314 -544 1161 1209 -424 323
2301C23k09J20k59l71J49r2R4n36Q20m49m85P63M79n74k60Q48l09l84N91M05k98
2322C66r25J147L93q44l50K86P00l98j77k5m29N44K32P0p03l95M38K62m87J39
2342a56J1k77M61q3P6L8J53L39q72j49M43J046n34m08L92L46o10J30L27k67o57
2363b51K17P80n88n07M23O05j211L3L47L45n81L87L71p2l95n86J700j295k35L24
2383a89K33k6l64J152m39l81l49J158m43l65K13q0K75j130Q97N06j258O43L66
2402D19n13lK35J5j18p70R26m89m01M90l09K78M8L41M09r97N85N81q51n35R53
2423B94L54k07o27L90jj56j69N48J09q77K1N76J15j179K39M50k20p1K58J74k11
2444a90k82R5M36K42l31P5K67k83L65L01r90N56j77P84j262N61l35K75Nj36o10
$$ plain form
2301 323 114 234 -25 -396 -247 -339 -245 -781 39 -410 -895 -132 347 -227 -487 361 52 -332 259 664 366
2322 366 -559 588 981 137 -213 73 773 375 198 173 -256 288 520 590 -113 -508 -70 192 -295 -156
2342 -156 -145 -422 39 -44 32 70 223 562 -310 -459 -16 1030 496 88 480 826 216 346 673 406 -251
2363 -251 -34 746 158 -349 74 679 -532 -499 -152 193 -388 -1 370 298 -97 -683 1017 -278 -513 -189
2383 -189 44 18 -346 806 367 -14 -363 795 352 -13 200 120 395 -735 162 668 -590 53 419
2402 419 -94 -97 138 153 35 -735 191 -298 -699 -209 -518 -240 -192 149 558 -439 146 727 -124 -659 294
2423 294 648 441 -186 204 203 47 -122 426 535 -342 -321 255 370 -809 -570 -120 -340 -411 -153 21 -190
2444 -190 -472 -377 59 301 -30 45 312 29 394 695 -295 261 84 868 -394 167 -168 107 112 -24 -634
2465f34L42J68P0j60k35N63J30k54l79J42k00L76j15Q7k08q5P71O2o37M61l21
2486e6L58j01K06j59l13N77j82J60l42j83K31p5j63m57M74m04k08P35j59L24p46
2507d83K65M56j7n60P14l33j14L89K54l53l06M63M64m45k11j39N09q6k48j57J89
2528B51j46j33J91m48K05J50r54R20j47m70K99K87o0k78L90M58o78K4N49k73J03
2549B40l54J97L11j70k5J1k4M12m72J87j82J6k44K22l03J38k01K57m98R4O29m34
2571a93k91L35J62L08k88K2j80P99n47j59N1m05K21K79L69J7k54M4q75O05R9m34
2593c15L39p84O20l9k36l15P90j90J40r0m39P42o00k87P46M21m91L43m32P2j05
2614a10N75m15O56r7p78L50j14K39j98m2o6r8Q93r28L9K49p86Q60o27R70r35L27
$$ plain form
2465 -634 -292 -124 -54 -214 -449 114 244 -10 -389 -247 -447 -71 -186 -99 -307 -392 379 441 -196 265 -56
2486 -56 302 201 407 248 -65 512 330 490 148 -35 196 121 -42 -499 -25 -429 -637 98 -61 263 -483
2507 -483 -218 238 221 -339 375 42 -72 317 571 218 -88 375 839 394 183 44 553 467 219 62 251
2528 251 105 -28 163 -285 -80 70 -884 36 -111 -581 -282 5 -55 -333 57 515 -163 -139 410 137 240
2549 240 -114 83 394 224 199 210 186 598 126 313 131 147 -97 125 -178 -40 -241 16 -482 -388 241 -193
2571 -193 -484 -149 13 321 33 55 -125 674 127 -32 19 -386 -165 114 483 500 246 290 -585 20 119 -315
2593 -315 24 -760 -140 -179 -415 -730 60 -130 10 -80 -519 223 -377 -664 82 503 12 355 -77 -5 -110
2614 -110 465 50 706 609 -169 181 67 306 108 66 0 -98 795 -133 -94 155 -631 229 -398 572 -363 -36
2636c6m17J96n4Q0j40O01l63N05l44L18n60N14p22N25M77n11O7k85K86m8J7k73
2658a67J06l41J54J20k29K86L0j89J31l0j28Q5k5J41j25K25J30l01N18Kl01J5
2680A07j75L81j01k18K87k2p4j96J40l34K91K52m85j60m3J43l32L67P5m34M64
2701f7o6J92k05J38K6J39N1j25K20p6o8m0N9P1L5j64J16O2k77K3j3J07k1o54K56
2726b81M2K28l24L4K81m8r8L37k90j60L50K28J04l29j31L35l8j34J54m9K65m89
2748a3J59L20k25j43m0l3l28K7K40Q7m13m9L42k84rO5J52L18l02N7R8l9K1j16
2772a08M12J4k18J78J91n38O7L79M9j94r8R5j07j65J08l31j1K57k99K65j21K68
2794I3J43m22K8L45m96K04j01k8K68N0K7J38Q1j42Q1m3k35k9J77l10K15qP5n29
$$ plain form
2636 -36 -453 -257 -311 -231 -371 230 -133 372 28 346 -214 300 -422 103 580 69 136 -149 137 89 106 -167
2658 -167 -61 -402 -248 -128 -357 -71 -41 -230 -99 -129 -257 -172 -197 -56 -181 44 174 -127 391 393 92 107
2680 107 -68 313 212 -6 281 259 185 -11 129 -205 86 338 -147 -307 -350 -207 -539 -172 -97 -531 -67
2701 -67 -133 59 -146 -8 18 157 208 83 303 227 159 119 178 249 284 120 236 298 21 44 31 138 117 -537 -281
2726 -281 -239 -11 -335 -301 -20 -68 -166 171 -119 -279 71 299 403 74 -57 278 240 106 260 211 476 -13
2748 -13 146 466 241 98 58 25 -303 -276 -36 51 -362 -411 -69 -353 -362 -297 -145 173 -129 -72 26 -13 8 -108
2772 -108 304 318 100 278 469 -69 -2 377 426 232 134 229 122 -43 65 -266 -277 -20 -319 -54 -175 93
2794 93 236 -186 -158 187 -309 -105 -206 -234 34 84 111 249 330 188 269 226 -9 -38 139 -171 44 36 111 -418
2818d18J12Q2K66j40j37k73N94l31P1K59o9q8k76N07k94l4M33j78J27k33P4L53
2840D07l02k56L27M1P1k80J29L10l83j32k33L61l25J70k65K92j32l0J34Ok00J72
2862a18j29K92l9k6P1N9n4J9N7K59m90J59L33k36J15j89J02kk20k45N56k09l01
2885b36N2J69j70O9Q2J0r4q7K83j89k5J24Q1J32o2n3K23n4j96M6J61J11k21R2
2909B48j66N2j57o6q8L09n0m85J48O9N1k11L87j66M8l28M1M22l07K54r7K94j77
2932B5j50M03P8k8m67L37P0j81J12J50M3l60P1J27o23K55L7K81k76Oj55K49l25
2955c21NJ16K7j81J90J29J46l78L24L4J93l56L04j9l8j54q7N26o11K95j18O7l7
2978E6k6K21n86N10j71j27l9O3k13K67R9l72o6M96p9o3l3J82j77L20N3j10l13
$$ plain form
2818 -418 -306 -224 42 -98 -235 -508 86 -245 -174 85 16 -72 -348 159 -135 -169 264 86 213 -20 54 407
2840 407 105 -151 176 217 288 8 137 447 64 -68 -301 60 -265 -95 -360 -68 -200 -230 -96 -90 -290 -118
2862 -118 -247 45 6 -20 51 110 56 75 132 391 -99 60 393 157 272 83 185 183 -37 -282 274 65 -236
2885 -236 -184 -15 -185 -116 -34 -24 -118 -205 78 -111 -136 -12 69 201 139 86 309 255 59 105 266 377 156 248
2909 248 82 134 -23 -89 -177 132 82 -403 -255 -186 -135 -346 41 -125 -77 -405 -364 58 -249 5 -92 202 25
2932 25 -125 278 356 328 -139 198 268 87 199 349 392 32 103 230 -393 -138 -101 180 -96 -90 -245 4 -321
2955 -321 -316 -200 -173 -354 -164 -35 111 -267 57 91 284 -72 232 213 175 21 -66 460 -151 144 26 93 56
2978 56 30 251 -335 175 4 -123 -162 -99 -312 -45 54 -318 -384 112 33 -30 -63 119 -58 262 315 205 -108
3001a08J93J12j90L0M87m96L33k64k16K54l25K76l69Q1K09j24q8N0j26j2J20k22
3023c95M46J4j28o8J15J92j52J58k7j7j28J52M7L0j89K11n5k24j31L39n71J33
3045b48J5K95k97L52j77o7P9m8J38k14l3j9K43j91J94k4R6j48J71J66j54J08l20
3068h3K05J43l74L15j07j6p8j67N2M9j12M9p4p8N8L22k85k0J5J15o2J61k9R4j87
3093i4K74K2j47m4Q6N4o0j67R1k0J82j16J10k37n4L51j69Nk82L7j60J62j92J07
3117b61j1K05l8oJ90l77J84K41j08K1K80k13L4p4J18jK0k98K98j12J9j59J85P0
3141B07k21j37J7j93L39k46mn3K79mj07p5Q7K72l79J39L33j13O8j37K81q18Q16
3164C51j40R1k6r6k1j17O7K62k53k33J43L7j83j22J34O5k82K23k3qK39j69K32
$$ plain form
3001 -108 85 197 7 37 524 28 361 97 -119 135 -190 86 -283 -202 7 -117 -205 -155 -281 -293 -173 -395
3023 -395 51 65 -63 -131 -16 176 24 182 155 138 10 162 209 239 50 261 206 -18 -149 190 -381 -248
3045 -248 -233 62 -235 117 -60 -127 -48 -96 42 -172 -205 -224 19 -172 22 -2 94 -54 117 283 129 237 -83
3068 -83 122 265 -109 206 99 83 5 -162 -110 -61 -173 -124 -198 -276 -218 104 -181 -201 -186 -71 -133 28 -1 93 -94
3093 -94 180 202 55 11 97 151 91 -76 15 -5 177 61 171 -66 -120 231 62 67 -215 -178 -338 -176 -368 -261
3117 -261 -272 -67 -105 -111 79 -298 -114 127 19 40 320 107 141 67 185 184 204 -94 204 92 111 -48 137 207
3141 207 -14 -151 -134 -327 12 -234 -238 -291 -12 -16 -123 -198 -111 161 -218 -79 254 141 209 72 353 -465 351
3164 351 211 302 276 180 159 42 109 371 118 -115 28 65 -118 -240 -106 -41 -323 -100 -123 -131 108 -61 171
3187A71j47o9j00L86q0l8l9N3j75J63o3M13k89j6L8K6k32J17o8k92J84j65L25
3210A03k92j8J14l06L18k0K5RJ53J35k2l3j37j51Q8J56K88k90rn7j10K91o9P6
3234B42J80k89n0K50l62j77R8M4l3j09J52N6l81P8J3K16L84K0l17q4R2O1J78k3
3258B39r2j52P4j06M01l52K06k73l4J31q7P1L7j44k82o7K56J91k85o4L45l75J37
3281b25o1L49r1L33l42R9j30k17K85K48j22J04o1p0l35K98J09k33J19J57k32n37
3303e55R15o01K25l24J42K58k64j96O55k21k29k58O26Ll84k81L51L87O5n86K43
3324b9J79K69m3k44M77o00L55l68k65L10n5Q0k64L12j51j28J08lm22j37M05K82
3346F8jJ6J5k68j81L81k3N19n33K40j08k64M47k46L71j41k64O3j93kO5K7j45k36
$$ plain form
3187 171 24 -45 -145 241 161 123 84 137 -38 125 62 475 186 170 208 234 2 119 51 -241 -57 -222 103
3210 103 -189 -207 -93 -399 -81 -101 -76 -67 86 221 199 166 29 -122 -34 122 410 120 111 54 -56 235 166 242
3234 242 422 133 83 333 -29 -206 -108 -64 -97 -206 -54 2 -379 -301 -288 -72 312 332 15 -69 23 84 262 239
3258 239 147 -5 69 -37 364 12 218 -55 -89 42 -45 26 63 -81 -363 -430 -174 17 -268 -332 13 -362 -225
3281 -225 -286 63 -28 305 -37 62 -68 -285 0 248 126 230 169 99 -236 62 171 -62 57 214 -18 -555
3303 -555 360 -241 -16 -340 -198 60 -204 -400 255 34 -195 -453 173 176 -208 -489 -138 249 314 -272 -29
3324 -29 150 419 376 132 609 9 364 -4 -269 41 -14 66 -198 114 -37 -165 -57 -60 -482 -619 -214 68
3346 68 67 83 98 -170 -351 30 7 526 -7 233 125 -139 308 62 433 292 28 91 -102 -104 -39 -12 -157 -393
3370c93K29L56o16R3J39R2M4J9J8j54J06k4K60n21O23j00J70r21O53K8j08N7J72
3393B22m08K1J00K81m35l90N16j59M25l80R6M93p55K35K81r0j29P13n12m0M34
3414E19o66N39o15j8N07k05l92K50M39l42k59N05l94k65L82J133j178M60p66J10
3434b56M11k02j27K22n52j38P56j18l95Q38R2k38r23K01M66m66P79K1l61j06k05
3455c01K89M80o33O12k77M29j76m56J28M98n46K17o52M35k46P6j02k65M93l78
3475c75L70K63m03L3L53m91j61j88R89R4n07n0Q23j366O75k58M39L13k28j031
3495g06j98R06m5m83P70o77j61R3Q51p37R82o87n61P33J84n03J85L44l65J97R0
3516B12k31J48o41M66L65m94K56J20l47L57L40o69m70L43k06L87K66J27o35j66
$$ plain form
3370 -393 -164 192 -424 -331 -192 -100 -56 -37 -19 -173 -67 -91 169 -352 271 171 341 -580 73 101 -7 50 222
3393 222 -186 -165 -65 216 -219 -609 -93 -252 173 -207 -111 382 -373 -138 143 53 -76 637 125 85 519
3414 519 -147 392 -223 -241 266 61 -331 -81 358 16 -243 262 -132 -397 -15 1118 -60 400 -366 -256
3434 -256 155 -47 -174 48 -504 -642 114 -4 -399 439 531 293 -630 -429 37 -429 350 371 10 -96 -301
3455 -301 -12 468 -165 447 170 599 423 -33 95 593 47 264 -388 47 -199 -123 -225 -490 3 -375
3475 -375 -5 258 -145 -112 241 -250 -411 -599 390 484 -23 -73 750 -616 59 -199 240 553 325 -706
3495 -706 -904 2 -43 -526 244 -433 -594 -501 350 -387 595 -92 -653 80 264 -239 -54 290 -75 122 212
3516 212 -19 129 -512 -46 319 -175 81 201 -146 211 551 -118 -588 -245 -451 -64 202 329 -306 -472
3536d72l86K43M94N85o68N86Q9p4q71J133m76m94Q57R1n93l46O58j36N3K78o39
3557h8N15k36l70n46J575j457j44J158l29l06o5L88M01n49N3m92N60q12O75N44
3577D75k50Mn09L2L72J09q44K48L59r2N83m34K87r66L61L63n72J54o9J47K84n68
3599e26K35K97l92q4O20L50n84J41J55K09l57o50k3J295n66m45J66k22K63O09
3619D91n77J21K11l27n88J52K29N74N86j068M00p75J30R10L19j208j53P36q5P99
3639H77k29k68o24j1l44J450J82j216K87q07L19N82k09J82m41K52k12K03L06k19
3659F0q3L84k35O25l09q90L61k80O81k97l61N56J47j037M97n32Q34j16J48J30
3679B83j57m03M70l11M34j083P45M85q40J75k57J311n87o37J62Jk94K09p8P47
$$ plain form
3536 -472 -858 -615 -121 464 -204 382 471 397 -474 659 183 -311 546 637 44 -302 356 220 273 551 -88
3557 -88 427 191 -179 -725 850 -607 -751 407 78 -228 -293 95 496 -53 0 -492 68 -744 -69 475
3577 475 225 229 -280 -248 124 233 -611 -363 -4 -96 487 53 340 -626 -265 98 -474 -320 -389 -242 42 -526
3599 -526 -291 6 -386 -470 150 500 -84 57 212 421 64 -586 -609 686 120 -325 -159 -381 -118 491
3619 491 -86 35 246 -81 -669 -517 -288 286 872 -196 204 -571 -441 469 788 -420 -573 163 78 877
3639 877 648 380 -244 -255 -599 851 1033 -183 104 -703 -384 198 -11 171 -270 -18 -230 -27 279 60
3659 60 -23 361 126 751 442 -448 -87 -367 314 17 -344 212 359 -678 -181 -713 121 5 153 283
3679 283 126 -277 193 -118 316 -767 -22 463 -377 -202 -459 852 265 -372 -210 -209 -503 -294 -372 375
3699C75p5K71o09J27r42N11l91J319j97o36M00J75l44m33J031l44l43j31K03l12
3719c45k6K85L80m78K75k90n92r3J103q37N56L43o91L32l11P07o03q49R7P16L64
3740D3r35J180n68l82J032O80j967Q29L81j444J831o08l54M06k52m87m20M24q29
3759a440R63J63m19L43J319r32J55q50J073K57p19J74O21p87l81M06j56Q16q23
3778b17N10k53J18m12N0M96r35J177o93j203J584o38P29r6M5p44k67J85Q8Q51
3798C75j73o6j86O92Q98j777j17m86O55L92r02O67K14L94o76M69k92J14M03q83
3818b85K88n38l75M70J52j50J59m26LJ103r77L25O33q31K91N00j41l42N70n65
3838a36J112m97j06O8Q7k71q8j45p90Q30ll60k06Q97r94J65M33M19q29L65J62
$$ plain form
3699 375 300 571 -38 89 -853 -342 -733 586 389 -247 153 328 -16 -449 582 238 -105 -236 -33 -345
3719 -345 -371 -86 294 -184 91 -199 -791 -884 219 -618 -62 281 -410 -78 -389 318 -285 -1134 -1037 -321 43
3740 43 -892 288 -280 -662 370 1050 -917 -88 293 -1151 680 72 -282 124 -128 -615 -1035 -611 -1440
3759 -1440 -477 -314 -733 -390 929 -3 152 -698 375 632 -87 87 708 -79 -460 -54 -210 606 -217
3778 -217 293 40 158 -254 -204 292 -643 534 -159 -1362 222 -416 313 217 262 -482 -749 -564 -476 375
3798 375 202 136 -50 642 1540 -237 -354 -840 -185 207 -695 -28 186 580 -96 373 81 195 598 -285
3818 -285 3 -535 -910 -440 -288 -438 -279 -705 -702 401 -576 -251 382 -449 -158 342 201 -141 429 -136
3838 -136 976 479 373 441 528 257 169 24 -766 64 61 -299 -505 392 -602 -437 -4 415 -414 -49 113
3859A13p61qK22Q92M47j481K48Q4K45M39p25R18k57l63N45n29J26m63n35R41o26
3880e28O56N27j99k83r63J330o00L61n59P79o75P36p88M60k98L8n09J052o36j16
3900b15m98J294j190Q46n20M47O20m87k3l78k56N1M51l24L26q37J486j147j01
3919d55L77p7l48L45J90J89o9j267P01M92n05M29k68j80R69J85j216k4k77j80
3939i89K96P81O36p82j22Q1p6p04J169p69L00N2r3l70m9L55P25l83l93K7O35n82
3961b55N59o51M20m26J22J317j442J53K39K09k42N65o47j86j07L81J08M51n71
3980cp16O11M34q59M81j22q0N53j62o94N63R3n88M85m58M80j55m45K78P01m61
4001f4k39L65m82K40P27q84L67O35p73N13r37J50L75m11K83M78m04k65J90Q90
$$ plain form
3859 113 -648 -656 -434 458 905 -576 -328 -244 1 440 -285 633 376 13 558 29 155 -308 -843 98 -528
3880 -528 128 655 456 173 -790 540 -60 301 -258 521 -154 582 -206 254 -44 -6 -515 537 -99 -215
3900 -215 -713 581 -609 237 -283 164 784 297 274 -104 -360 -309 142 -182 144 -693 793 -354 -455
3919 -455 -78 -155 -503 -158 32 221 152 -1115 -414 78 -427 2 -266 -446 523 708 -508 -532 -809 -989
3939 -989 -693 88 724 -58 -180 -99 -175 -879 290 -479 -179 -127 -220 -590 -639 -284 441 58 -335 -308 327 -255
3961 -255 304 -347 73 -353 -231 1086 -356 -203 36 245 3 568 -79 -265 -372 9 117 568 -3
3980 -3 -719 -108 326 -533 -52 -174 -254 299 137 -557 6 99 -489 -4 -462 18 -137 -582 -304 397 -64
4001 -64 -303 62 -420 -180 547 -337 30 665 -108 405 -532 -382 -7 -418 -135 343 -61 -326 -136 754
4021G54j018k53N68P6J20k33K92m50m2l15M32k32P04l20J15q34Q44J29m14K76
4041A99J59l31P97q79J57l80m83J106p03Q33m40M66p82M33j25J40ll45N39J7p34
4062c59J96K89j63M21k87K01k12k28O37n64O84K65j114j78J89Q3P11l58l42L03
4082A74j40M98m75n71J99o98J796j508O65N25k51n88N54n45k90k30J235Q2n92
4101a60L36j97L44j53P62j396J003q58q13J027J90o17Q27r53k35L0J343l49m77
4120c46L97k22J00p2M64n23J077q54K21J97q32K10p98M57J98J42o47R38n62L30
4140a25k53j98M03J2j69L56n13K06N12J32o5J32l3n8l26J42R6r13R64K03o81N38
4162C62k08K0l11j74o28P21L7L43n28M82J67j034P51q17K048k200J075j67j5K94
$$ plain form
4021 754 -264 -517 51 127 247 14 306 -144 -186 -501 -69 -301 403 83 198 -636 208 337 -77 199
4041 199 358 27 824 -55 102 -278 -761 345 -358 475 35 501 -281 152 27 167 164 -181 358 375 -359
4062 -359 -163 126 -37 384 97 298 86 -142 495 -69 615 880 -234 -412 -223 -140 571 213 -129 174
4082 174 34 532 57 -514 -315 -1013 783 -725 -60 465 214 -374 180 -365 -655 -885 350 432 -160
4101 -160 176 -21 323 170 932 -464 539 -319 -1132 -105 85 -532 295 -658 -893 -863 480 131 -346
4120 -346 51 -171 -71 -143 321 -202 875 21 242 439 -393 -183 -981 -524 -326 -184 -831 107 -455 -125
4140 -125 -378 -576 -173 -161 -330 26 -487 -281 231 363 298 430 397 339 13 155 251 -662 302 505 -176 362
4162 362 154 174 -137 -311 -939 -218 -181 162 -366 116 283 -751 0 -817 1231 -969 106 -61 -76 218
4182B18l65J39k36K79o0N87o22M30n25N82o04N99O9p00P1O32o72k07Q76k52Q51
4203A090j149n14R83n90L98p21N07k72P12n2l15k88j22J95l14M50P0l5M99L1j150
4224e87R67m5k27L6r25R75l93p4k73M02l83M28l15K11p69P71K11n3q71J027m57
4245c44J474n95j025R39n84p01R42M49K9o74J74r5p82L42J435j566J8K22K39L61
4265B58l41J32k25P27o02N06r38O05m78P20J43m04l14k4O99j448J330k70l53L50
4285G3j81Q80j564J566r08L3J08j87J66m02N99j82O84p5m35k20l2l67O76o75Q9
4306c54O01p72N46l00P66o25L89j62L73m25j75J7J15M9l41J74m2P01m77M03o83
4327b22J181j483O97m82Qj8M6M50Q69r95K3M7q51N20j42l9L49m44P0M69L46j412
$$ plain form
4182 218 -147 -8 -244 35 -25 562 -60 370 -155 427 -177 422 491 -209 -138 494 -178 -385 491 239 1090
4203 1090 -59 -573 410 -180 218 -503 4 -268 444 392 77 -211 -333 -138 -452 -2 68 33 532 563 -587
4224 -587 380 335 108 144 -781 194 -199 -273 -546 -144 -527 -99 -414 -203 -972 -201 10 -43 -914 113 -344
4245 -344 1130 535 -490 449 -135 -836 106 555 584 -90 84 -11 -793 -451 984 -582 -564 -342 -103 258
4265 258 -83 49 -176 551 -51 455 -483 122 -356 364 507 103 -211 -235 464 -984 346 76 -277 73
4285 73 -108 772 -792 774 -134 -101 7 -180 -14 -416 183 1 685 610 175 -45 -77 -444 232 -443 -354
4306 -354 247 -525 21 -279 487 -138 251 89 462 37 -138 -121 -6 43 -298 -124 -166 535 58 461 -222
4327 -222 959 -524 173 -309 -301 -319 -273 177 1046 51 74 121 -730 -210 -352 -391 -42 -486 -416 53 399 -1013
4349a013P74L56j29j84l21N14j12Q5K5Q6k27k12k11J486j593L92K09O56J67j805
4369a057P24L67J65J49m26K69m16l93Q65n35L99k35M93o36O90p2o79n7N42K94
4389D51L77j016n65P33o32K47R84n97K36l21M9M80r9o51K56m40M84j0n4N23j282
4410h47P33k68O43l66L94J45m89M04L21q03p2J41j33N93m39j64k03L23L3J45j73
4431h2p60J762j083J50N19n49M66q11K43O60p08L38q1k72J86n56M55N97m66k32
4451b24J81M69K11K7o29J95o9K79p31k13L86M42k56k78M94m97M98l92L73J89o51
4472a96o0m88R55k04l85N76n7Q6N8J34k42P46n76m51l34K80J09J79n80L03M86
4493C39p22N70l68j19J69R8k07r2J86l3K90m37j9L92l3m48L37k24J08K4J15P02
$$ plain form
4349 -1013 -239 117 -12 -196 -517 -3 -115 -30 -5 81 -146 -358 -569 917 -676 -284 -75 581 748 -1057
4369 -1057 -333 34 199 348 -78 191 -225 -618 247 -288 111 -124 369 -267 423 351 -328 -385 157 451
4389 451 828 -188 -753 -20 -652 -405 579 -18 218 -103 -54 426 327 -324 -68 -508 -24 -34 -88 435 -847
4410 -847 -114 -382 261 -105 289 434 -55 349 670 -133 -205 -64 -197 396 -43 -207 -410 -87 -54 91 -82
4431 -82 -842 920 -163 -13 506 -43 423 -388 -145 515 -193 145 64 -208 -22 -578 -123 474 8 -224
4451 -224 -43 426 637 664 35 230 161 440 -291 -504 -118 324 68 -210 284 -213 285 -107 266 455 -196
4472 -196 -256 -744 211 7 -378 198 141 227 285 419 177 923 347 -104 -438 -158 -49 130 -450 -147 339
4493 339 -383 187 -181 -300 -131 -33 -240 -332 -146 -179 111 -326 -345 47 14 -434 -97 -321 -213 -189 -74 628
4515F28j37l01J62o64m12J125r4n11K32L30j87l08l7Kk53K78L56m10L7K52l59
4536b71L93l61l15L37Q56j042P53l31Q5L65j93j71Q9j21M09q66M32L68n20R3K58
4557B47K33p34J52L2J32L8J38j1P7k76j69M57J64q45N23j24j29l56Q72o24J0O08
4579D15p34q7P93n13K28J24j20q6r8L76j34j62j14j50j28K23L5O4j29J75K85n43
4601b80O00j58K26k87m57j08R51o93o69J008P6k57k91Q10k25o34M84K20m74P8
4621h0N50n78j78M66j49N1n03M76K8j67P6L50m09l12J3J65j9rM11l23L62L21n21
4644B1J10m2Q3J92j033P73n8j26l76K4M60m30Q06m97R2j94j68L38k88M56p7J82
4666B48j49m50M64J6k9j04M49n33K92n76Q82N42j373j51O34R8r98J361r2r03Q1
$$ plain form
4515 628 491 190 352 -312 -724 401 307 -204 28 358 171 -137 -174 -172 -425 -147 209 -201 -164 88 -271
4536 -271 122 -239 -554 -217 639 -403 350 19 104 469 276 105 194 73 482 -384 48 416 -104 -11 247
4557 247 480 -254 -102 -70 62 100 238 227 304 28 -141 316 480 -365 158 34 -95 -451 421 -203 -193 415
4579 415 -319 -406 387 -126 102 226 106 20 -78 298 164 2 -112 -262 -390 -167 -132 -68 -197 -22 263 -280
4601 -280 320 162 388 101 -356 -464 487 -206 -875 133 209 -48 -339 471 246 -388 96 316 -158 -80
4621 -80 470 -108 -286 180 31 82 -421 55 83 -84 -8 342 -67 -379 -366 -201 -220 -229 182 -141 221 542 21
4644 21 131 89 172 364 -669 104 46 -80 -456 -432 28 -402 404 -93 -1 -195 -363 -25 -313 143 66 248
4666 248 99 -351 113 129 100 -4 445 -88 204 -372 510 1052 -321 -472 162 260 -738 623 531 -372 -291
4687b91J84N81q63L02J47j10J23k1M1l64O70n37M5n4O28o76K61n38K74Q19j98
4708D23p10k14O72l83j59N20j15J01l98N10j41m45N89l59k70R07j103M65k23O
4728c27L24K11j23J12l94K50q5M48k24n30N12N53m81l0l26l02N23j5j22r0K19
4749A03n12M59M2k80J13k03L80j19k53J86r2P2P92j015J86l0J94J74L75q00n21
4770g49P48J3qK63l11r1j25M07j98j9NL08m73j4L57J58m57Q6Qn37O02J3j058J402
4794C30n01M57j38n79N03l49j11J67J95k22L34n9j25l81K07O54l07j79p2N98l59
4815F3O8J86m93J35l6J62l40M64r8m80N34M20N3p00K77n52L18q5N1K88L43J37
4837G15r30K91k5O73o77m4N66l23m63P35n27Q3l59L92K73p04M85J74j30p5p92
$$ plain form
4687 -291 -107 474 -389 -87 60 -50 73 52 93 -271 399 -138 -93 -147 481 -195 66 -472 -198 621 423
4708 423 -287 -501 171 -212 -371 149 34 135 -263 247 106 -339 250 -109 -379 528 -575 -110 -333 -327
4728 -327 -3 208 85 197 -197 53 -32 416 192 -338 174 727 246 216 -110 -412 111 96 -26 -116 103
4749 103 -409 50 92 -188 -75 -278 102 -17 -270 -84 -176 -104 688 -327 -141 -171 23 197 572 -228 -749
4770 -749 -1 12 4 267 -44 -135 -260 147 -51 -70 -65 243 -230 -244 113 271 -186 -100 -92 -629 -27 -14 -1072 330
4794 330 -171 286 148 -431 72 -277 -388 -221 -26 -248 86 27 -98 -479 -272 382 75 -104 -176 422 63
4815 63 131 317 -176 -41 -77 85 -255 209 111 -369 165 585 638 -62 215 -337 -19 -104 -53 235 578 715
4837 715 -215 76 51 724 47 3 569 246 -217 518 -9 74 -285 107 380 -324 161 335 205 130 -662
4858f62P71j68k62N57o15O10r3o8m49J08J1J33P3k24L43J94l03N45m67J55M2m8
4880A83l87L59k59L67p14m23P81l02L70k34j23M67k6J4p3Mj89r7L66j32M96l03
4902A45j66N8r3P03q84J32J68l7k86J28k55J56L6L26n5n59J86j35N25N9o44N89
4924I7n38R1N84m16j4l7M90l29j17L42k44J71j33L2k34K28J00K03k19K01k50k28
4946b20J32j02j76m3Q04m17r3k46L44N16o40J39j34MJ73j5m8K71L0m5j36L81k95
4969A84K23k62O3l38k5p6M96n88M96L27n03m7m66N59K80q71L95k8l50J49K68k83
4991c97K72J68m4n1M94j66l66J91J57l16m11M39K79l25N17n49N5M1M51o39L16
5012A16o4J13n9l72M43l26K38k5j84k90M46j91L5L09n84K35L92m39P2q5J31r7
$$ plain form
4858 -662 109 -59 -321 236 -379 231 138 70 -379 -271 -260 -127 -54 -278 65 259 -44 501 34 189 231 183
4880 183 -204 155 -104 263 -451 -874 -93 -395 -25 -259 -382 85 59 73 0 4 -185 -282 84 -48 448 145
4902 145 -21 37 -56 647 -237 -105 63 26 -260 -132 -387 -231 -195 131 76 -483 -297 -432 93 152 -492 97
4924 97 -441 -350 234 -182 -196 -233 257 -72 -189 153 -91 80 -53 -21 -255 -27 73 276 57 258 8 -220
4946 -220 -88 -190 -366 -409 395 -22 -115 -361 -17 499 -141 -2 -136 -132 41 26 -22 249 279 234 98 479 184
4969 184 407 145 208 -130 -155 -231 265 -323 173 500 -3 -50 -516 43 323 -548 -153 -181 -531 -382 -114 -397
4991 -397 -125 43 -1 -52 442 276 -90 101 258 -58 -469 -30 249 -76 441 -108 -53 -12 439 -200 116
5012 116 52 165 106 -266 177 -149 89 64 -120 -410 36 -155 -120 189 -395 -160 232 -207 -135 -220 -89 -186
5034a86L14l70J24L72m13j18K75j50M98m19K96k20j77J53J01J68k56K62l51j28
5054b25P47m28m18K18L39j12l08K51k4P4k47L03J39k30R8j94j85N69l64j43J15
5075b5L05j51k02L5J38j27o10P56n1N2m67J24L9O38k07k42L4l4q4j29M46m35Q19
5098F22j0l07j60J57l39K31m6j88K14j44p9M05l74J99l57N11m36l34K10K45O9
5119H9j71L77k74k38k49N00k93L2J09J01j4K50o76L96K65k27J29m1j30j74J43
5140i6r5OM42l92l31L98m21L88K07M22k39l91J23n20N16j0K1k66J3K18K98k29
5162F2r8k32J85K08K11p33N82j5Nq0l17M5L36j6m68J73L38k10N1j53K76J27l26
5185d9P1j05j93K47J9O6o28L94K74j9j05J32L53n39J31On4k62L16r0J40l98L41
$$ plain form
5034 -186 128 -242 -118 254 -159 -277 -2 -152 346 -73 223 3 -174 -21 80 248 -8 254 -97 -225
5054 -225 522 94 -324 -106 233 121 -187 64 40 114 -133 170 309 79 177 -17 -202 367 3 -140 -25
5075 -25 280 129 -73 -38 100 -27 -637 119 68 120 -347 -223 -184 454 247 5 39 5 -79 -208 238 -197 622
5098 622 612 305 145 302 -37 194 148 -40 174 30 -49 356 -18 181 -176 335 -101 -435 -225 20 89
5119 89 -82 295 21 -217 -466 34 -259 -227 -118 -17 -31 219 -457 -61 204 -23 106 65 -65 -239 -96
5140 -96 -191 -185 257 -135 -466 -68 -489 -101 106 528 289 -102 21 -499 17 7 28 -238 -225 -7 291 62
5162 62 -36 -268 -83 125 336 -397 185 170 175 95 -222 -177 159 143 -325 -152 186 -24 27 -126 150 277 -49
5185 -49 22 -83 -276 -29 -10 56 -572 -178 96 77 -28 104 457 -82 49 55 1 -261 55 -35 105 -293 48
5208D8k60j91K70P6m3j84L88k13P8r4j83K28o6J86j93Q6J48p3K4J36k08J15k3
5231E2K3n2J02l23K95j3l7J7m0J39l36o7L62l9n5J4P6k59J77K73j47m4l64M60
5255B14n3k65J66k7N7M9j22n1K39j91o3M1l3Q3Q0q0j06J54l42J04J14k81N56k91
5279d8J18N0q8J21l6j62J24j24j13L63o0l18J37R8j84L3J76K7o6r5L72l04J94
5302B15k83j33J83R7l69J61K41k93j06M17j05J3R2j08K35l91K7L33k56K38j58
5323E0J98j52J37l41n1K99j97K57k20j30J57j78J67J94k36j68K02k28K65k94M05
5344A36l4j71k7R7Nj92J59k6K61k53r6r4J97j9J15j66K17j45K44k01j52K29m4
5367D0M0j27Q6j11J63l16N3j33K92m7r4J52L00l44K49J08l03R3j20j72L9K44J22
$$ plain form
5208 48 -212 -403 -133 -57 -100 -284 104 -109 -31 -125 -308 -80 -146 40 -153 -67 81 8 32 168 -40 75 52
5231 52 75 23 125 -198 97 84 47 64 24 163 -173 -240 122 83 28 42 118 -141 36 309 162 118 -246 214
5255 214 161 -104 62 35 92 141 19 -32 207 16 -47 -6 -39 44 124 44 -62 92 -250 -146 -32 -313 243 -48
5279 -48 70 120 32 153 117 -45 79 -45 -158 205 145 -173 -36 62 -122 -89 87 114 48 -47 325 21 215
5302 215 -68 -201 -18 79 -290 -129 112 -181 -287 130 25 38 130 22 257 -134 -107 226 -30 208 50
5323 50 248 96 233 -108 -159 140 -57 200 -20 -150 7 -171 -4 190 -46 -214 -12 -240 25 -269 136
5344 136 102 -69 -96 1 6 -186 -27 -53 208 -45 -141 -235 -38 -57 58 -108 109 -36 208 7 -145 84 40
5367 40 80 -47 39 -72 91 -225 -172 -305 -13 -60 -154 -2 298 -46 203 311 8 101 -19 -191 -152 92 214
5390B14J60k13j54N8Q5j51k60J02K08n2j57J66j53J29p3K72j02j51R9J81k49J50
5412A09j76j28K44N6kM3P1j55N1r1M9K5j07J10j39N2Np9K3N8k8o0J21k59O5k2
5438a64L53k73J56kj77J20l9P3j22J13l26M92k88L35l25J18K57l68J66j8j23J25
5460H3o6k56L28j12L43k77J60k65M5K26k41k3M9P4l17K93o1k8p2P4l26N03J0k09
5484f5L13l72k41M53P5j01l41K32J67k19r7K37j6l53L42K7n7J01j48j10l5N3K84
5507A29l9J96l22K92j49Mj12J49j8k14J50k29K02o3K76k18rJ83k29R3l59K73J94
5530A80J5k93K34k55J0N00l57l83J30K30N0j10m1j41RL06j91R3R9J61j44j40R1
5553E3K06j11n4Q9k45n1l2M4J09k5J1K10q8k0k22N0L8j06P7j16pK20j15K81Q6
$$ plain form
5390 214 374 161 7 65 150 -1 -261 -159 49 -3 -160 6 -147 -18 -91 181 79 -72 27 208 -41 109
5412 109 -67 -195 49 105 103 146 217 62 113 22 71 96 -11 99 -40 12 17 -62 -39 19 -9 -69 52 -207 -142 -164
5438 -164 189 -84 72 70 -107 13 -26 47 -75 38 -288 204 -84 251 -74 44 301 -67 99 81 -42 83
5460 83 17 -239 89 -23 320 43 203 -62 -17 209 -32 -55 -6 68 -249 44 -17 -45 -117 -43 -369 134 144 -65
5484 -65 248 -124 -365 88 163 62 -279 -47 120 -99 -196 41 25 -328 14 41 -16 85 -63 -173 -208 -155 129
5507 129 90 286 -36 256 107 111 -1 148 130 -84 66 -163 39 -24 252 34 25 208 -21 72 -287 -14 180
5530 180 195 -98 136 -119 -109 391 34 -349 -219 11 61 -49 -90 -231 -222 84 -107 -14 85 246 102 -38 53
5553 53 259 148 94 183 -62 -113 -145 -101 8 -17 -6 204 116 96 -126 -76 -38 -144 -67 -183 -190 30 -85 196 282
5578B82r6k22j50J76k18M05l43M65k84J29j54Q2j83J18J8q5N7N4j84L7R4j1l27
5601c40O51m78J44J27L3k47j39K00J75k52J96K2j17P7j94K42J87k23n32N25J24
5622A81k00J09k4J6J46j63M17o22R3L75n70M2L50k17J13O9j12K5J8r3J7J82k38
5645h6L08n5m74M15l67L03J93l26K9J92K12l95r7k9J81L1p1k08K94J91m54N0n4
5668b17M43l14J30l7J22J79l18j4m5K16l52K70K51j29k59J48j20j21L8L76m08
5689a61J54j5l1oj81J70N9Q9j41k7M05n01n8L27J12k19J7o1K1j4j66L27J30k29
5713AJ02p9L20r5k23j44L1J67j26N3P2l88L11K02k27k84O2L83j1n3j52J58J40
5736B20k58R6k13L00k43nQ0K91l58O7J18O4j73M6j05J4R9N9L3k97K46L6Lq2jk15
$$ plain form
5578 282 186 -36 -186 -10 -228 177 -166 299 15 144 -10 72 -111 7 25 -60 -3 51 -133 -96 -2 -13 -340
5601 -340 311 -167 -23 104 137 -110 -249 -49 126 -126 70 92 -25 52 -142 100 287 64 -468 57 181
5622 181 -19 90 66 82 228 65 482 -140 -47 328 -242 -200 150 -67 46 115 3 28 46 -47 -30 152 -86
5645 -86 222 167 -307 108 -259 44 237 -89 -60 132 344 -51 -148 -177 4 35 -36 -244 50 241 -213 -163 -217
5668 -217 226 -88 42 5 127 306 -12 -26 -71 145 -207 63 314 185 -74 74 -46 -167 -129 247 -161
5689 -161 -7 -22 -53 -59 -240 -70 -11 78 -63 -90 315 -186 -244 83 195 -24 -7 -68 -47 -61 -227 100 230 1
5713 1 103 24 344 249 26 -118 -87 80 -46 7 79 -309 2 204 -23 -307 -245 138 127 74 -78 80 220
5736 220 -38 58 -155 145 -98 -103 -23 268 -90 -23 95 159 -14 32 -73 -59 40 99 132 -165 81 117 120 38 37 -178
5762a78q3M91k31J49k37k45M79p3p4M7KJ1j18J47J39k29m8J07q3N4j67O3K90m34
5786b21L45r4p2Q1k83J28K47j34j71K9K23j47j79lQ1M26k42p7J81k17J76j13O3
5809B7l9L6O4j65j24O1J37j8L55l27J08o4j85N6N2J03l54L57R3l30j20J38K3p1
5833a87p9K72k58J92R7Q3j81j57J46L2J33j05J2j12Q5J14P6j96J55r2J77j28J22
5856B01r8j40K52j05J6l07L96k80K3L37k35J38J10j08%l62J3K42N2j58J53r6r2
5879d8K20j70P4j70K48l03Q4J11q5M5j96K74l27j16L59N2r2j5K62k02L98l91K44
5902B56l2j43k45m7J75l6p8j12K59R6k15J25P5m1j51N09l47j11L06j74k78J10
5924i9K20k96J74m2j98M90k29m2M9Nj81K98j75j06K00p6NO7K7J48j47K6m51J68
$$ plain form
5762 -178 -261 230 -1 148 -89 -334 145 72 -2 45 47 58 -60 87 226 -3 -51 56 -27 27 -140 -77 213 -221
5786 -221 124 30 -42 39 -244 -116 131 -3 -174 -145 78 -69 -248 -251 -170 256 14 -63 118 -99 77 -36 27
5809 27 -12 24 88 -77 -201 -140 -3 -21 334 7 115 51 -134 -78 -26 77 -277 80 173 -157 -277 -139 -116 -187
5833 -187 -266 6 -252 -60 37 120 -61 -218 -72 -40 93 -12 0 -112 -27 87 163 -33 122 30 207 79 201
5856 201 103 -37 215 110 126 -181 215 -65 -42 295 60 198 308 200 200 -162 -149 93 145 -13 140 44 -48
5879 -48 172 2 76 -94 154 -149 -65 46 -39 6 -190 84 -243 -359 0 52 -40 -55 207 5 403 12 256
5902 256 224 81 -164 -211 -36 -72 -150 -262 -3 93 -122 3 78 37 -114 395 48 -63 243 69 -209 -99
5924 -99 121 -175 -1 -43 -241 249 20 -22 27 32 -149 149 -26 -132 68 -8 -3 64 91 239 92 118 -333 -165
5948a65m4J95K26k69R0r0KL76m22J88M1j74r2R0j09K44L9l92K23J69j04j36J38
5971B4N1j36r7K22m1K08l09J93l38K23p4P4P5k41P8qj82L11M6k77o2J92j35r3
5995b96M14j50L28k90j28j15L22k09L29j10k14J86J37j01j01m0p4J59m2J61p7
6016H9j55j71K88m8j05K0q2J90J93l18K53p9j03N6J12l1j91K37k78J91L0m20L78
6039E6K46k35Q6qk19L90m14P6K03k78J90k26j27K92M5k76L20j03Q4j70J9J40j38
6062d7j24L38K65k87j13j83N39l01Q4l11J63J07j10M9J70l1l53P1L93m99j43L93
6084G0P7k17K28k01j19P1N1J31J07k15q3K70L5k08j69K03m3J88k66n0J98k47J32
6107e7n1n0J36k51J31j1J09k5q7O0J37R2Ql1j1l55J44J57k95L48j66l8O0l2q3
$$ plain form
5948 -165 -209 -14 212 -57 33 -57 -55 321 -101 87 128 -46 -138 -48 -157 87 126 -266 -43 126 22 -114 24
5971 24 75 -61 -158 64 23 231 -78 115 -223 0 -74 0 75 -166 -88 -96 -278 33 79 -198 -260 -68 -203 -296
5995 -296 118 -32 296 6 -122 -237 85 -124 205 95 -119 67 204 103 2 -38 -112 47 5 166 89
6016 89 -66 -237 51 3 -102 -82 -164 26 219 -99 154 75 -28 28 140 109 -82 155 -123 68 98 -322 56
6039 56 302 67 153 145 -74 316 -98 -22 181 -97 93 -133 -260 32 77 -199 121 18 102 -68 -49 91 -47
6062 -47 -171 167 432 145 32 -151 388 87 171 -140 23 130 20 69 239 208 -145 -74 319 -180 -323 70
6084 70 147 -70 158 -43 -162 -91 -40 91 198 -17 -100 170 205 -3 -172 31 -12 176 -90 -140 58 -189 -57
6107 -57 -108 -158 -22 -273 -142 -153 -44 -69 -156 -96 41 133 141 110 99 -256 -112 45 -250 98 -68 -106 -46 -78 -161
6132a61L09p5j23K32m91mO86j45r0l48jJ92N3k05J37L8N0j59q5J07O6l1o2P2j21
6157a59L60k31J65j32J74k36m1J47j78J77K72k09p0r6K43l0j46K7R2n4r4j7L54
6180C18q9k75J0K1p6L35j92j0J4LQ5j61p7KJ98j86J01k25K86J50j69j38j30L07
6204A02k07M4K07Om1J31m7j52l3r0J1J8L2Q0J22l8k82K75n0J10l12K52k32j77
6228b71J59K15j11j67K20K4j64m4J66r3R0j98Q1Q5j51J35Q7O1j26P8j83k6K60
6251A27k26K61l71K57M5k99K38J6j39j01J69P9K1l16J08J13No9R4p0M0J67k80
6274a31J96j6j39J74p8l00N10k89Q0j22K09l94J56J38K01j82Q9j61K44m6k83l6
6296a80K76j22M2K15mk48l5n9K39l0jL3k71J97l94M23j1q8j14O1J89j63N7M2j66
$$ plain form
6132 -161 148 73 -50 182 -309 -313 373 228 138 -210 -211 -19 34 -171 -34 4 54 -105 -190 -83 -17 -48 -110 -38 -159
6157 -159 201 -30 135 3 177 -59 -100 47 -131 46 318 109 39 -57 186 156 10 37 129 75 -19 -36 318
6180 318 229 -46 -36 -15 -91 244 52 42 56 59 144 -17 -94 -92 106 -80 21 -204 82 232 63 -75 -205 102
6204 102 -105 -61 146 152 111 242 195 43 10 -80 -69 -51 -19 61 183 145 -137 138 88 198 -114 138 -94 -271
6228 -271 -112 103 -8 -175 45 69 -95 -139 27 -66 24 -174 -93 -8 -159 -24 63 124 -2 76 -107 -133 127
6251 127 -99 162 -209 48 93 -206 32 48 -91 -192 -23 56 77 -239 -131 -18 -13 -82 12 -58 -18 149 -131
6274 -131 65 49 -90 84 6 -294 216 -73 7 -115 94 -300 -144 -6 195 13 102 -59 185 139 -144 -180
6296 -180 96 -26 16 231 227 -21 -56 -115 124 94 93 126 -145 52 -342 81 70 -18 -132 -71 118 -45 12 54 -112
6321a12J04K5k88N71j86Q7k35J33l9k8l7j14P7L6K62Q2j91m5j80r2P2m5N6j1Q5
6346a3l8J11k17J91j1j15J54op7m9L35q2o9q3L7J24l4k68K68j48q8MK25l21J66
6371dK80k86J20O2j92j23K18k08K17O8j92j88J85P9J65l4k24N0k48N56l01l7J55
6394A18r4K93j67m1j0j58j57K30m5k2l8o8R8O1p1J9R4j3r6J01K19m67M71l14K85
6419B28k15M85n43l7n1Q4J86k62K76j98L6Q5J12k60K00j93K99j11m9M5j39P9j40
6442h3m2l5L58m22K31J3k35K12O6j31N4j63K43k97J25K85k07qM9K9j10J05J38
6465A75l07K79j85q1J62J07l01J00k7k70P7M01P1m8k86K41J3j73RJ97k93R7J21
6488G9l97K58J2K02J20k3l29J51Q3j87K26J6m19R4M9K54j02r3j41J34kj49j08
$$ plain form
6321 -112 -8 17 -271 300 114 201 -34 99 60 32 -5 -119 -42 -6 256 338 147 102 -78 -170 -98 -143 -87 -98 -13
6346 -13 -51 60 -157 34 23 -92 62 56 -21 -70 265 183 114 31 68 192 158 -110 158 10 -78 -74 151 -170 -4
6371 -4 276 -10 110 172 -20 -143 75 -133 84 152 -40 -228 -43 36 201 167 -57 -7 -255 301 0 -37 118
6394 118 24 317 150 109 99 -59 -216 14 -31 -53 -91 -159 -61 0 -71 -52 42 29 -67 34 253 -214 257 -57 228
6419 228 13 498 -45 -82 -133 -49 137 -125 151 -47 -11 74 186 -74 126 -67 232 121 72 117 -22 57 -83
6442 -83 -125 -160 198 -224 7 20 -215 -3 63 -68 -14 -177 66 -231 -106 179 -28 -36 13 42 -68 37 175
6465 175 -132 147 -38 -119 43 150 -151 -51 -78 -348 -271 130 201 153 -133 108 121 -52 -43 154 -139 -42 79
6488 79 -318 -60 -48 154 274 251 -78 73 156 -31 195 211 -208 -114 -65 189 87 -6 -147 -13 -15 -164 -272
6511b72N71m06J17n4Ok34K43qJ8J02q5r1j66M33m26K88k5K45m93L00p4m7P8J1
6535C1Ok15M6M7o7k08K17L62j85j34J34J65r4n1J9k13J86j59K06l03M25r8j36
6558a9l6L38l12M6or4j03L27j90lR0k06K7L2J11k32l2M86n87L27J68j80J48K26
6582C26k17n6J38j99m3m9J54L8p6r0J28o5J24n0j05J71k29M2j76k2K53K41k80
6605d2k3N7jP9q2j10K17j50P7M6r3K63J30l02l2K58k25J35k50L96k93J21p1j91
6629h6N3K09j34j74P0R7O3m90J14J89l6r7L05k97J10j10M44j64l1L5J36k11j05
6652a10oL37m35J22K73l92K22J34j55j6J44k06J37J11m69K63j43J41K1q2o7R1
6674h5J58j22r6J47r3R0P0k10J33K8n3l5K35j82q1J8L8q1K57k28j59K4J28J09
$$ plain form
6511 -272 299 -107 10 -44 -38 -272 -29 -37 -19 83 -2 -93 -259 174 -252 36 11 256 -237 63 -11 -58 20 31
6535 31 37 -178 -132 -85 -152 -360 -143 219 34 -100 34 199 105 54 73 -140 46 -113 93 -210 215 117 -19
6558 -19 -55 283 -29 17 11 -83 -186 141 -49 -52 38 -168 -141 -109 2 -230 -262 224 -363 -36 132 -48 100 326
6582 326 109 53 191 -8 -51 -100 54 92 16 -74 54 -11 113 63 -42 129 -100 -58 -234 -256 -3 238 -42
6605 -42 -65 -8 -9 70 -12 -122 95 -55 22 68 -25 238 368 66 34 292 67 202 -48 348 55 176 105 -86
6629 -86 -33 176 42 -132 -62 35 98 -392 -278 -89 -125 -222 83 -214 -104 -214 230 66 35 70 206 -5 -110
6652 -110 -116 221 -214 -92 181 -211 11 145 -10 -26 118 -88 49 160 -309 -46 -189 -48 -27 -109 -176 -85
6674 -85 73 -49 -145 2 -91 -1 69 -141 -8 20 -33 -68 167 -15 -96 -78 -40 -121 136 -92 -251 -227 -99 10
6698A0k07K81j01j14J9m4l1L51k87j69J78J02K03p7k82L20Rk17j77L29P7k51L2
6721d6J48l10J41J37m3j66Q4J31J29k46j44N59j7j81l69L00M1j27k67K1L0M16
6743B21p0j70j3Q6M4l08K61Q9r6j78J13J49p0j02J46j26K33k77l26M36P3l8J6
6766I3k4j34J07l5m1J7N1j04J67j1r4j24J27J8j04K0J67o5P9n9N5q0m8M22l32
6791F8j1j53K19l49K15p3J23j90J9o8L20N2k59l2R4no2K36j57K08k88K33k39J6
6815h3J8K69l55K39j23M1M2j48K6J60L0k92M02l31K41k8p4m9M4j74J11j48K10
6838B8j10R6K79j93j19M12l47P3j46K65j19L4k75K69O0j8j11j77O5qQ8n4J46P4
6862B12l46R3J51K4M1r0k87L09j47K06j02J47j71P9o7m3J27J08j75j47P0l9J01
$$ plain form
6698 10 -197 84 -17 -131 -112 -156 -187 164 -123 -292 -114 -12 191 114 -168 152 161 -56 -233 96 173 -78 -46
6721 -46 102 -208 -67 70 27 -139 -55 76 205 -41 -185 374 357 176 -193 107 148 21 -246 -225 -195 221
6743 221 151 -19 -32 54 98 -210 51 140 44 -134 -21 128 58 -44 102 -24 209 -68 -394 42 115 77 93
6766 93 69 -65 42 7 -34 -17 34 -70 97 86 -8 -132 -5 13 -91 -71 96 31 110 51 106 26 -22 400 68
6791 68 57 -96 123 -226 -11 -84 39 -151 -132 -200 120 172 -87 -119 -25 -30 -92 144 -13 195 -93 140 -99 -83
6815 -83 -65 204 -151 88 -35 6 48 -100 -74 86 116 -176 226 -105 136 108 34 -15 29 -145 -34 -182 28
6838 28 -82 14 293 100 -19 393 46 119 -27 238 119 153 -122 147 207 189 78 -99 -34 -42 46 -8 138 212
6862 212 -134 -41 110 134 175 85 -202 107 -40 166 64 211 40 119 52 9 136 244 69 -78 -8 -47 54
6885E4l45K00J08j24J89j94K9L7j0j12L09m5m17L50OJ5k44J66J06m6j69j7J04
6908e0J01mJ70j90j1m6o6K67k8n2K51j42j50l27L91p5k6k51N3J25k9K71l15K61
6932A28j35j10J71Mp6P1K76j97j36K23k90P9K22k21j89j02L46j27J25j06J09k60
6954a95K03m30J09K87j05L66k1k86m4J48J61O1l03J46J00p7l00K17J11l07K44
6975H5K4k39LK76k93J95k12j90L46R3k30J79pj12m4K28J80l29j00J78J23k57J66
6998F3m4J37j70K57j90m6R5k96L49O5j31Lk53N4L37k19j03M3K85m05p4M07n04
7021c40M56p9k02K03p8p8L7L06k80l9J49k34J11K29l47K44Q3l07L73k68j91L84
7043A32L7n4l34o5K87l11N16l59J40l81J30J10J46K4mJ08j76r0J69o6K8o6Q0k34
$$ plain form
6885 54 -291 -91 17 -107 82 -112 -83 -46 -56 -168 141 96 -321 29 35 50 -194 -28 78 32 -137 -154 -50
6908 -50 51 47 217 27 16 -30 -96 171 143 91 342 200 50 -277 114 39 13 -238 -185 -60 -89 182 -133 128
6932 128 -7 -117 54 58 -18 53 329 132 -4 219 -71 8 230 9 -180 -282 64 -63 62 -44 65 -195
6954 -195 8 -422 -313 -26 -131 235 214 -72 -116 32 193 254 -49 97 197 120 -180 37 148 -159 85
6975 85 109 -130 -127 149 -144 51 -161 -351 -5 88 -142 37 30 -82 -126 102 282 -47 -147 31 154 -103 63
6998 63 19 156 -14 243 53 7 102 -194 155 220 89 92 -161 -107 230 11 -92 -49 236 -169 -243 164 -340
7021 -340 116 37 -165 38 -40 -118 -81 225 -55 -94 55 -179 -68 161 -186 58 141 -166 207 -61 -252 132
7043 132 169 115 -219 -284 3 -308 208 -151 -11 -392 -262 -152 -6 18 14 122 -54 -144 25 -41 -13 -79 1 -233
7067b33j88M62p6K10J08n6j34Q5m0l81J66L72l81J99k08J23K00m09J60k04O0j20
7089b85L24J08j94n8J74k66M46j86j21k04L94k42Q6J58j33K13j8j93K6P6k31J69
7111D3M8Q4P3j61K07n06J13R7m2K23R1n09L10O9j69r6J40K21l0l44J86J16l52
7134a88J93m1P8J51j55j76J47L04k26n4j61J90j39O8l3R6o1J25k1j64J53j75J06
7157A7J52k85R7j38K78l2j82o4P4l0J92L3l33M8J32o7J13J7K43j71j44m4QJ46
7181F0l1o4N9L8q6K62m94K42M0q6K01j65L38n55L10m9j47L58j60j69K29R2k96
7204g3M5J95k67r4K64K9k90K06J17j55jJ47m4o0p2J04P1j33N0q1p0K94l27J39
7228fK96l1j51R2o7k01J41J44j93J63m32J92l7n8O4J96jj62J97m36L86o7P1j2
$$ plain form
7067 -233 -421 41 -35 175 283 227 93 178 138 -243 -77 295 -86 113 -95 28 228 -181 -21 -225 -165 -285
7089 -285 39 147 -47 -105 69 -197 249 63 -58 -262 132 -110 -24 134 1 214 196 3 29 105 -126 43
7111 43 91 175 248 87 294 -212 -99 -2 -44 179 270 -239 71 140 -29 -125 15 236 206 -138 48 164 -188
7134 -188 5 -36 42 193 38 -138 9 313 87 33 -128 62 -77 -9 -42 54 -7 118 97 -67 86 -89 17
7157 17 169 -116 -19 -157 121 89 -93 -157 -83 -113 79 112 -221 -173 -41 -108 5 22 265 94 -50 -94 -86 60
7181 60 29 -35 24 62 -24 238 -256 -14 26 -60 141 -24 314 -241 69 20 -127 231 71 -98 131 223 -73
7204 -73 -28 167 -100 -194 70 99 -191 15 132 -23 -24 123 79 19 -53 51 122 -11 39 -42 -112 182 -145 -6
7228 -6 290 259 108 200 133 -68 73 217 24 187 -245 -53 -90 -148 -84 112 111 -51 146 -290 96 29 100 88
7252H8k03K14j42J13j77R6k4J28l3j26M7R7l1k41M45k71k0K31l70J40j82K69k42
7275a94K45k17j06O37p02Q74K98j228N32m36K18l74L42K54k49k57l2L78lP4J13
7296A67l63K47n4j34J63O2k37R4j81j47K90JJ72k79K63j08n7J07N4j61J09j27
7318a19J57LM5j28J51j07j06J17l6J19q7j10N9j48K53O1n0J19k59M8j83L70n6
7341A13m03J86j10j92N38j56k3J8j12J89j74L78m75L66P1l04L20k76P9J06j74
7362c5J1m3n5%J87j26J63r6j48J32J66k04K9o9K05nk48K12j48K97K9k92j86N04
7386B80k24j51nJ10J63l36M38k84j19Q3l6J99j93Q0J0j8J77j79p1J85j54krQ5
7410B9j6k11K22K18l64k8O0L7J7R1J98k70m4K01j74m1n1M81k75j5k01l1J17K42
$$ plain form
7252 88 -115 99 -43 70 -107 -11 -35 93 60 -66 -19 78 47 -194 251 -20 -40 191 -179 -39 -221 48 -194
7275 -194 51 -166 -272 365 -337 537 835 -393 139 -297 -79 -453 -111 143 -106 -363 -395 -17 -20 54 167
7296 167 -196 51 -3 -137 26 88 -149 -55 -236 -383 -93 -92 80 -199 64 -44 -101 6 60 -101 8 -119
7318 -119 38 41 86 -42 109 2 -104 13 -23 96 9 -101 -42 -190 63 124 74 193 -66 -18 -201 169 113
7341 113 -290 -104 -214 -406 132 -24 -47 -29 -141 48 -126 252 -223 143 214 -90 230 -46 33 139 -35
7362 -35 -24 -67 -122 -122 65 -61 102 6 -142 -10 156 -48 -19 -88 117 112 -136 76 -72 225 254 -38 -224 280
7386 280 56 -95 -100 10 173 -163 275 -9 -128 -45 -81 118 -75 5 15 -3 174 -5 -76 109 -45 -47 -56 29
7410 29 13 -198 24 242 -122 -150 -90 -53 -36 55 253 -17 -61 140 -34 -75 -126 355 80 65 -136 -167 -50 192
7434A92k36j66J93l4O1R9l8J13k18rJ96L4N8n2j25k2Q4J67j41k30l8Q5M9l4r2
7459a04N4J28j14J37k09J45J20m13J83J2j68K47K94k59k18K01j23M1q0J76R7L4
7481A81l55J98K48j43j18r6R3k1J17K0k05R5J09m20J77K86j52j14J83j45L8j13
7503a37J43J90k96O1J00j29L5r0K40J32q0k59J07m8k93J22Q1P2J45j44Q5R9k09
7526g3M9j70K46J42l3j0j25o8r1J95j79J09L7o9M2k13M43j95j84k2J94R4l46M23
7550A96l76o34Q49j8L7l39L15N2r3J10k50L04k62o1K22Q5j32p4J37J5N9k43j1
7573a12j60K75k26K68ro0p3K47j18j60o3N5J30J71l36L93m36J87r6J39R1o2L7
7596H2j76J03K17m2j36j07n3j48L54n9o3p9K00L44mn36n1lR4K82m29M68m55l00
$$ plain form
7434 192 -44 -210 -17 -51 10 109 71 184 -34 -43 153 187 245 193 68 46 130 297 156 -74 -112 -27 22 -12 -104
7459 -104 -50 78 -36 101 -108 37 157 -256 -73 -61 -229 18 312 53 -165 36 -87 -46 -126 50 147 181
7481 181 -174 24 272 129 11 -85 8 -13 104 124 -81 14 123 -297 -120 166 14 -100 83 -62 -24 -137
7503 -137 6 196 -100 -39 61 -68 -33 -123 117 249 169 -90 17 -31 -324 -202 -121 -49 96 -48 37 136 -73
7526 -73 -24 -194 52 194 161 151 26 -42 -133 62 -117 -8 29 -40 2 -211 232 37 -147 -169 25 119 -227 196
7550 196 -180 -814 35 17 54 -285 30 82 -11 99 -151 153 -109 -170 52 137 5 -69 68 83 142 -101 -112
7573 -112 -272 3 -223 45 36 -24 -97 150 32 -128 -191 -136 -6 165 -171 222 -214 -27 -123 16 107 45 82
7596 82 -94 9 226 184 48 -59 -112 -260 94 35 -28 -107 93 437 433 -103 -154 -157 -63 219 -210 258 -197 -497
7620d97K93N42j40j16J75k5m25L33N4j58P6L78l40j87K14l10N37j28p4n80J24
7641b54O77n21M20l68j75L53j81l37Q58l03o98R63o36L88j7J23l87K02j47M35
7661C95k07K09k94l18M7L46o67P16o11N8N4J76k86M06k67L76l83Q5J6Q36j26r35
7683c74J092o34k73J89K03l73p5j60L33l70J013n11n1J6j8M6k08k60N04M02k07
7704B84o52M90k04l19J244m08m31k78Q68p47q8L54k51O11m47N7j89O4l75N88m19
7725b48l0J006m36n99P06p1n00l27j64M23R90q75K51L84j56l69K67q10J118o09
7745d9K98Q2q54Q10J62n40j44L52L49l69J78j02m8j19l72O99n58P52j233P12J29
7766A35j52l81K72QM86n02P83k47q71N50k15P53n70k5j42J230j242l94N41k53
$$ plain form
7620 -497 -204 338 198 82 257 232 -193 140 194 36 112 490 150 -37 177 -133 404 276 202 -378 -254
7641 -254 423 -98 322 -46 -221 132 -49 -386 472 169 -529 434 -202 186 169 292 -95 107 -40 395
7661 395 188 397 103 -215 -168 178 -489 227 -384 -326 -272 -96 -382 24 -243 133 -250 -165 -149 687 561 -374
7683 -374 718 84 -189 0 203 -170 -245 -405 -72 -442 571 60 9 25 7 53 -155 -415 89 491 284
7704 284 -368 122 -82 -401 843 435 4 -274 594 -153 -241 113 -138 473 26 83 -106 -42 -417 171 -248
7725 -248 -278 728 292 -307 399 328 -172 -499 -663 -240 750 -125 126 510 354 -15 252 -558 560 -49
7745 -49 249 331 -523 287 449 -91 -235 117 466 97 275 173 125 6 -366 333 -225 527 -706 6 135
7766 135 -17 -398 -126 -118 368 -134 649 402 -469 81 -134 619 49 24 -118 1112 -130 -524 17 -236
7786b36O59l51n83J206m44j22l77J58l09J091l09l31N69r82n9j34O85n48K86j24
7806b55L45n3o9M91j065J71M73k06K02r1n5N36j75k60k32K06l11N36j85l0K69
7827B42j52j16j50J57PL95o31J15m23Q32J9j55J52n21K62O9l38l4K59j74N3J02
7849c0m86Q30o63P68r75Q85J22l96m37L34N94k99o5k14M8m14K15J00L47J03m41
7870g4K7K35L63k33m46n43P90J35j78j79Nq3J217l49q53J1J12n08M86L13k09L91
7892D30j05r70J083p70L28K88n95K77M68n48l84O33L48J02q97M84J24l73k32J5
7912b94L96O43q31M84j086J573r84K83r2N8K06k16N15r72J011o50P7J96j63j17
7932C7K89K33o13K00k54p1j18L88L35k99L68o49K54N5K3J60n33N38j73o22M80
$$ plain form
7786 -236 423 72 -511 695 251 129 -248 -90 -399 692 383 52 621 -361 -420 -554 131 -417 -131 -255
7806 -255 90 37 -32 459 -606 -435 38 -168 34 -57 -112 424 249 -11 -243 -37 -348 188 3 -27 242
7827 242 90 -26 -176 -19 -12 383 -248 -133 -556 276 295 140 292 -229 33 102 -236 -270 -11 -185 -132 -30
7849 -30 -516 314 -349 419 -556 329 451 55 -382 -48 546 247 182 -32 16 -398 -183 -83 264 367 -74
7870 -74 -47 188 551 318 -128 -671 119 254 76 -103 -98 -181 1036 687 -166 -155 -43 -551 -65 248 39 430
7892 430 325 -645 438 -332 -4 284 -311 -34 434 -114 -498 135 483 585 -312 172 296 -77 -309 -294
7912 -294 102 745 -86 398 -688 885 -99 184 92 150 356 140 655 -317 694 44 121 317 154 37
7932 37 326 559 -54 146 -108 -179 -297 91 426 127 495 -154 100 155 178 338 -195 343 170 -452 28
7953B8M65l42J81m91J33K31o21J33L82n77R44m76K07J87l36k07K75l36N40p9j44
7974I7k28L49K3l59l33OP38n86P04j37m38RK61k58j23N41j49K15l39Q5m27M77
7996A28j60j44Q3l22L91l2k12O01n68L37r9m23J86K94L81o93K87k83m60R46p27
8017d89K99o4P1N42o59P89o74L6L28L4n9l01M85n89M38m9l4K74m12l9J3p6k82
8040d18P25N11q63k05n97J205n41L96k81j50mJ40n5o5M88o54LJ88N28n39M18M14
8062F44n44j2k49L37l16m31J282p12K15Mm36O27m93k22N3O77p10K86o67J374k88
8083D19L5k36Pn77M2M46k07j57N07n38J29M78k28l73p0L87r5k83L37N6m31K22
8105a30M6q6M75M43o86n53O07l36M93r93O17j58j10J02R21q46q3K11k31M07q19
$$ plain form
7953 28 493 151 332 -159 -26 205 -416 -283 99 -478 466 -10 197 384 48 -159 116 -220 320 241 97
7974 97 -131 218 241 -118 -451 -445 293 -293 411 274 -164 -155 106 -152 -275 266 117 332 -7 78 -349 128
7996 128 -32 -176 -93 -415 -24 -56 -268 333 -235 102 3 -420 -234 60 441 -252 35 -248 -708 238 -489
8017 -489 -190 -254 -183 359 -300 489 -185 -149 179 213 154 -147 338 -251 187 138 104 378 -34 -73 -60 -136 -418
8040 -418 307 818 -45 -250 -847 358 -183 213 -68 -218 -222 -82 -137 -202 286 -368 -365 -177 351 -188 230 644
8062 644 100 88 -161 176 -140 -571 711 -1 214 218 -218 409 -84 -306 -253 424 -286 0 -667 707 419
8083 419 454 218 225 -352 -310 136 -71 -228 279 -259 -130 348 120 -253 -323 64 -31 -314 23 79 -352 -130
8105 -130 -84 -170 305 748 62 -491 116 -220 273 -720 -103 -261 -371 -269 652 -194 -277 -66 -297 110 -709
8126g09O82l41J43P09r49L66N7l83J476j423N06n98J064j99j4n93O60J8j492O51
8146c69O18l44m42P90O21j932R80j79K56j01K49Q17o44l8Pn38M95M21n67J1J01
8167B12n04M38m84lp2L78L09l6l34J94k73j1L61k84M74M63j384Q18R9o0N89j561
8189f71P36J011
8191A076
$$ plain form
8126 -709 -27 -368 -225 484 -465 -99 -42 -425 1051 -372 134 -464 600 401 387 -206 454 472 -1020 -369
8146 -369 249 -95 -537 253 874 -1058 -78 -257 -1 -102 147 964 320 282 289 -249 246 667 100 111 212
8167 212 -292 146 -338 -341 -413 -35 274 238 -96 98 -175 -186 175 -109 365 828 -556 262 361 301 890 -671
8189 -671 65 1076
8191 1076
$$ Imaginary data points
##PAGE= N=2
##DATA TABLE= (X++(I..I)), XYDATA
0@%%%%%%%%%%Qj6J6j6J6j6K4l2M0m8N6o7P5q9J07j25J47j71J95k23K55k91L30
33A75l73M21m73N31n95O62p36Q21r13J011j120J236j364J507j659J828k014K218
51A163k445K694k973L289l647M053m520N070n723O508p479Q719j0357J2626j5987
66i009K1461l1843N8085k42023m39138P12550M34057m82593l60131L60748K08809
77B30973k68351j44006J85859R0051j6950N037j31131j92263J79397L44436j09210
88A73842l86301M0486L01718m0426k09179Q3140J51791q2839r9201K9074j3890
99e1785N399J68309L9146k67995j20671K61642J63894j99853j18215J60327N1483
110I1681j55000j9690J21643J8975k6692J2976r1343r5920J55117J72295j58018
$$ plain form
0 0 0 0 0 0 0 0 0 0 0 0 8 -8 8 -8 8 -8 16 -16 24 -24 32 -35 40 -49 58 -67 80 -91 104 -119 136 -155 175
33 175 -198 223 -250 281 -314 348 -388 433 -480 531 -589 647 -717 790 -869 959 -1055 1163
51 1163 -1282 1412 -1561 1728 -1919 2134 -2386 2684 -3039 3469 -4010 4709 -5648 6978 -9009
66 -9009 12452 -19391 38694 -203329 -642467 70083 504140 21547 -338584 22164 230973
77 230973 -37378 -181384 4475 94526 77576 82613 -48518 -240781 -61384 283052 173842
88 173842 -212459 -171973 129745 89319 -119860 -36720 115071 32232 -66969 -37895 -51785
99 -51785 -46386 121923 161069 -106926 -227597 34045 197939 -1914 -120129 40198 91681
110 91681 -63319 -83009 38634 57609 30917 43893 -47450 -143370 11747 184042 26024
121B6024j77647J49548J17298j90134o0492K57620M1221k95187l3110K83679j4956
132A03864k66375J01918K83318j58335l16918J54758L10868j11445k35205Q5560
142d7992J41645r2421p6162R3388M1163n8315P083K429q9594K0396J70255n198
154A06677k04120j3739J83292o690j54502N3658J43725q1822j36904P3123J00887
165F3585n2730l5000O2411k1798q9132M1495R9203l3544p0287M0993K7946p1128
177c7986m347R4269J674q1165P836L8119m5546m068Q7219q540j07687J8528R7680
190E5986n3189q8871J01744J03917j34392j29927J34609J37223j15605j14185
200a02690J07401Q5201j04763o9179Q9489O2894m4261l9778j0240o346M4961N3222
$$ plain form
121 26024 -151623 -2075 115223 -74911 -135403 122217 163438 -131749 -164859 118820 103864
132 103864 -162511 -60593 222725 64390 -252528 -97770 213098 101653 -133552 -47992
142 -47992 93653 1232 -74930 18458 59621 1306 8389 10818 -78776 -58380 111875 106677
154 106677 -97443 -111182 72110 65420 -89082 -35424 108301 26479 -110425 -37302 63585
165 63585 10855 -24145 38266 16468 -72664 -31169 68034 34490 -35797 5196 33142 -37986
177 -37986 -42333 51936 53610 -27555 -19719 18400 -27146 -31214 56005 47465 -60222 -41694 55986
190 55986 2797 -86074 15670 119587 -14805 -144732 -10123 127100 11495 -102690
200 -102690 4711 89912 -14851 -84030 5459 68353 24092 -15686 -25926 -32272 12689 65911
212F5911n2079p9122N0684Q1986o3539q4473P8558R3257p9304r7048N8086P4316
224D7233l7421k8763L5381j4839m6791L9233M9984m4192l8207N5134K6084o9079
236b6243k5574P4061L4563n3741l2273K0272J0026L832K1056j4047m2058K0522
248i604M5195l8072m8658N6985N9446o5030p1244N4052O5668l8815m2164L4109
260A868J8041l8804m872M1101R05k9936J1130J5613k8777q297M1651J2321l8185
273f241j1432K3426k516j1176K0463P111l1247o479L0430m666l1058J9101M0696
286C6412l0377n1819K7456N3074j9657m2805J8568K8378k3094j7866K3396J5199
298A6865j2005o945P3q412O693K4708l753l0574J525K6807o938k4655J6381K4877
$$ plain form
212 65911 13832 -65290 -14606 67380 3841 -80632 -2074 91183 11879 -85169 -27083 47233
224 47233 9812 -18951 16430 1591 -45200 -5967 44017 -175 -38382 16752 42836 -26243
236 -26243 -51817 22244 56807 3066 -29207 -8935 1091 4923 25979 11932 -30126 -9604
248 -9604 35591 -2481 -51139 5846 65292 262 -70982 -16930 48738 9923 -32241 1868
260 1868 19909 -18895 -23767 17334 18239 -11697 -567 15046 -13731 -22028 19623 31944 -6241
273 -6241 -17673 5753 3237 -7939 12524 19635 -11612 -18091 12339 7673 -23385 -4284 36412
286 36412 6035 -45784 -18328 34746 15089 -27716 -9148 19230 -3864 -21730 1666 16865
298 16865 4860 -2085 -2012 -10424 -3731 20977 17224 -13350 -11825 14982 8044 -16611 -230 24647
312B4647k0159k8689J6332K1340j3741o969J5548n570k2821Q897K5176o706k0052
325a2767R865J2968j6419q795K0811J0615j4674q957P010L66j919J1272L022j6373
339c975l749J3843j073j2159P126J5153j1842k1075J0018J8301p216j1267P545
352c70M217j2200k754J4577L463r517r25L547m285o57J0967L453j0694l692P728
367B858P38n981M381P326n399q641J984M533o86K978K426r712q263R428J1077
382I047q286j1288P613J0423q722j2572P513J5216Q77j3547r236P180J5243L237
396A2698j5078r822J5037J2996j3206j6182J0621K1651o109k5113k358K0943R227
409A5305j2762j2081K899Q149K720m058p596J302J0656K010j3542p355J2917J5038
$$ plain form
312 24647 4488 -24201 -7869 13471 -270 -7239 8309 2739 -20082 -11185 13991 7285 -12767
325 -12767 -2902 10066 -6353 -15148 5663 16278 1604 -7353 -343 23 -1896 9376 12398 -3975
339 -3975 -7724 6119 5046 -7113 13 15166 3324 -17751 -7733 10568 3352 -7915 -370
352 -370 3847 -8353 -11107 3470 6933 -2584 -3509 38 -4247 -4904 6063 9516 -1178 -4870 2858
367 2858 3596 -2385 1996 9322 3923 -4718 -2734 1799 1113 4091 6517 -3195 -11458 -2030 9047
382 9047 761 -10527 -2914 7509 -1213 -13785 -6272 8944 9821 -3726 -12962 -5782 9461 12698
396 12698 -2380 -12202 2835 15831 2625 -13557 -2936 18715 12606 -12507 -14865 6078 15305
409 15305 2543 -9538 -6639 1510 4230 172 -7424 -6122 4534 6544 -6998 -14353 -1436 13602
423A3602o889j7438l39J5709O152r961n490N591L352k214j263m35k18K414L602
438F175k600r902k259J3290R144j3275j6591P859J8556k194j6712l075J1562P475
452G453n398j0413j025R983J1908l463k1526p565K7607K3239k5570l6847J9288
465a2329M6107r461n0055k475M9480J5150m5201k7830L4302L3297j8594l2965
477b0574J531K3111J0847r193j8730n790K1502K0060j8824l2591J1807M1700K830
490B7686m6471j5549M4042K6783l4640l1003K3951L0478j3919k5587N112J7978
502H861J775j0501m915K40J573P719N715j3951j4195J4252J9599j2926k1613J0926
516g441K1546r663j9575R590J7624r647j4591J4457J3332k2057j3288L2520J7016
$$ plain form
423 13602 6713 -10725 -11064 4645 10797 836 -4654 937 4289 2075 812 377 159 2573 6175
438 6175 3575 -6327 -8586 4704 13848 573 -16018 -8159 10397 8203 -8509 -11584 -22 7453
452 7453 2055 -8358 -9383 600 12508 9045 -12481 -20046 7561 30800 5230 -31617 -12329
465 -12329 33778 24317 -25738 -28213 21267 36417 -8784 -36614 -2312 30985 12391 -20574
477 -20574 -19043 4068 14915 5722 -13008 -18798 2704 22764 3940 -28651 -16844 24856 27686
490 27686 -18785 -34334 9708 36491 1851 -29152 -5201 25277 11358 -14229 -9117 8861
502 8861 10636 135 -4780 -4540 -2967 4752 10467 -3484 -17679 -3427 16172 3246 -18367 -7441
516 -7441 14105 4442 -15133 -5543 12081 2434 -12157 2300 15632 -6425 -19713 12807 29823
529B9823l9435k3064M1891K9618l9868l5576L3685L7946k4866l9385J4255L4773
541A9797n170k5070j878Q340N117Q631l183k4065k583L5443J2077m0692k1967
554c5203M0599L3782l4360m2268K4773M6700j2246m3869J241L4328P656k2103
566i70j3057R512J3379J435j0641j1105K853J5651P124j6506j8833J2873K7319
579A9034p793l1231K235L2152L724l1178o754K9671R954k7390j0063K6712P905
592A6978k5937l253K7413j095k9196L483K8991k890k8493R05K5069O73k1667k445
606a1464J5404J231p819O48o31o300R333J3719j5640k0037J8283K5757j5563k8581
620b1660J0773K9939k572k7910n009K3495J1522j5488j4589N151J3303N302r884
$$ plain form
529 29823 -9612 -32676 9215 38833 -1035 -36611 -2926 35020 10154 -29231 -14976 19797
541 19797 14627 -10443 -12321 -3981 1136 9767 6584 -17481 -20064 15379 27456 -13236 -35203
554 -35203 5396 39178 4818 -37450 -12677 34023 21777 -22092 -20851 13477 21133 -970
566 -970 -14027 -4515 8864 10299 -342 -11447 -8594 7057 14181 -2325 -21158 -8285 19034
579 19034 11241 -19990 -17755 14397 18121 -13057 -19811 9860 19814 -7576 -17639 9073 16978
592 16978 -8959 -12212 15201 14106 -15090 -11607 17384 14494 -13999 -13094 11975 12648 -9019 -11464
606 -11464 3940 5171 -2648 -2000 -2631 -8931 402 14121 -1519 -21556 -3273 22484 6921 -21660
620 -21660 -10887 19052 16480 -11430 -16439 7056 18578 3090 -11499 -6348 6955 12257 2373
633B373j4559M143J8570J793j9562r435J6111J4996q916j9958p10K2148R920k0248
647c334j7182J6325K1920r127k3784L649K3979K313k2444m323J8514N211j2762
660a045l362O720j142j602L830j278o728K342P093k311q554Q98R087j425p269
675d746N06M820r39j944M061j873n377M518O873n454n863N875O476m877o317M576
691C15M665j761l958L53J753j007n47K112j853l507L897K341n118j762M245Q40
707A008k381n21k10J73L108M66m542m41N358K473n354l509O164N160o627n641
723e316O770O184o616n201M959L798l647l313J358J725M91j777k363N28L127L78
739A085l445j827L684L185l773l085M200L390m016k476M624J206l433R28K366
$$ plain form
633 2373 -12186 -8043 10527 12320 -7242 -16677 -566 14430 5514 -14444 -15154 6994 16914 -3334
647 -3334 -20516 -4191 17729 8602 -15182 -11533 12446 14759 -7685 -12008 6506 11717 -1045
660 -1045 -4407 2313 1171 -431 3399 2121 -4607 -2265 4828 2517 -6037 -5139 3948 2523 -4746
675 -4746 -4240 580 -359 -2303 1758 -115 -5492 -974 5899 445 -5418 457 6933 2056 -4261 315
691 315 4980 3219 -739 -386 1367 360 -187 1925 72 -3435 462 2803 -2315 -4077 168 1008
707 1008 -1373 -1894 -2104 -1931 1177 1643 -2899 -3340 2018 4491 -863 -4372 1792 6952 325 -5316
723 -5316 1454 7638 1022 -4179 780 4578 931 -2382 -1024 701 1192 -585 -2948 -2420 707 1085
739 1085 -2360 -4187 -503 2682 -1091 -4176 24 3414 -602 -3078 1546 2752 -681 247 2613
754B613j473k012K402K020k378k645J501L202j989l388O58K814m06k481q68M32
770a998K222J152l465k458M155L404l932k944L121L512j742k720Q59K537N92j732
786E63j05K95k20K041L17l469j149L908R68m633j722L517K005k786k396R60J719
803a87Q60j608j937P28K762J114l278k317M557L400l998l679L962M470k726m981
819b858K525M299j499l082k32J819J168j352j969m08J881J615k439l689K571M164
835B514k585l966J391M462j489l384J640K187n97j65M20m35m94J898J355k443
851C09j887L163K062l025k603K855J849k491j373R52Nm07J254j165k546J243L299
868A494j145l668R13L562m61k559M92J872m73L32J271j478k045L687L145m814
$$ plain form
754 2613 1140 -872 1530 3550 1172 -1473 28 3230 1241 -2147 -1489 1325 919 -1562 -2430 -1998
770 -1998 224 1376 -2089 -4547 -392 3012 -920 -3864 -743 2769 1027 -1693 -834 1703 2295 563
786 563 458 753 533 2574 2891 -578 -1727 2181 3149 -1484 -3206 311 2316 -470 -2866 -1906 -187
803 -187 673 -935 -2872 -2144 618 1732 -1546 -3863 694 4094 96 -3583 379 4849 2123 -2858
819 -2858 -333 3966 2467 -615 -847 972 2140 788 -1181 -1589 292 1907 -532 -4221 -1650 2514
835 2514 -71 -4037 -2646 1816 327 -3057 -1417 770 173 8 428 -7 -501 1397 2752 309
851 309 -1578 1585 3647 622 -1981 874 2723 232 -1141 -189 -184 -591 663 -502 -3048 -1805 1494
868 1494 349 -3319 -2406 1156 695 -1864 -1372 500 27 359 1630 152 -1893 1794 4939 125
884A25m034M985M498m284n091L556L732k421k661N84Q38n9J441r24m263N66O317
901B905p27o815k12P302J243o225j386M975J591k367p07K28O11J789Q67l275j993
918b196M206K296m554k135L546J027l433L82K496l043k254N208J753p241k214
933f156Q706K319r010k094Q524K074p234P7N054j623k475M668P87p822Q62J0948
949G605j409j2943Q72J4076O8j3715j588J1030L211j0349j894N134J600j469j017
964g88j526j857M474L898n689n136M637P607k842p484J343O516J634m262m080
979c555K078N818J379q207l306Q582N018q401n925Q772L395q704j430Q103j900
994A717p211L663P400p402p733J0379Q397j2249p287J2925O314j2814l648J2683
$$ plain form
884 125 -3909 1076 5574 1290 -3801 -245 3487 1066 -1595 -1011 -173 -232 1209 285 -3978 -3412 2905
901 2905 2178 -4637 -4849 2453 3696 -2529 -3915 1060 2651 284 -423 -195 416 2205 3072 -203 -2196
918 -2196 2010 4306 -248 -2383 1163 2190 -1243 -861 1635 -1408 -3662 1546 3299 -3942 -6156
933 -6156 2550 4869 -4141 -6235 2289 4363 -2871 -2794 2260 637 -1838 2830 3617 -4205 -3343 7605
949 7605 6196 -6747 -5875 8201 8269 -5446 -7034 3996 7207 -3142 -5036 98 1698 229 -788
964 -788 -2314 -4171 303 4201 -1488 -6624 -1987 5620 2778 -4706 -3363 3153 4787 525 -3555
979 -3555 -1477 4341 5720 -2487 -5793 2789 7807 -594 -6519 2253 5648 -3056 -4486 3617 1717
994 1717 -5494 -1831 5569 -1833 -9566 813 9210 -3039 -10326 2599 8913 -3901 -7549 5134
1008E134P77j1667L809J0408o649j0318J0031J0191j2727j0638J3869R910j3678
1021a548r331J2003P666r715n997P102J913l010P55R59l793K29N867K6p868k18
1037d960R230R31p249k685N276M087o50n286l231O572O418o891j0116P021J1133
1052I600o193j1793M691J0588m767q328M863N136o285j897P793j932q616M608
1066b532J1102p483j1860J0296J2027j1718j0376J2612Q784j3294n042J2516K372
1079G404j2276N80J1423l239j0927M987J0087p363q604P995O191q764l707Q343
1093B130P18p769K103O439m041m983N656M223o025k626N949J993m868l76L386
1108A909r97r07K156j042l921L841M648o125n618P764M792q806m103Q484K345
$$ plain form
1008 5134 5911 -5756 -1947 8461 1812 -8506 1525 11716 -1011 -11649 2220 12130 -1548
1021 -1548 -10879 1124 8790 -925 -6922 180 2093 -917 -162 797 -2996 -2767 3100 3126 -4742 -4960
1037 -4960 4270 5201 -2048 -4733 543 4630 3980 -1306 -4537 2035 8453 1562 -8554 -1533 9600
1052 9600 3407 -8386 -3695 6893 2126 -6202 -1339 3797 -2488 -4385 3408 1476 -7140 -2532
1066 -2532 8570 1087 -10773 -477 11550 -168 -10544 2068 10852 -2442 -7484 5032 7404
1079 7404 -4872 -4292 7131 3892 -7035 -2048 8039 676 -7928 67 6258 -2506 -6213 2130
1093 2130 2848 -4921 -2818 3621 -420 -5403 253 4476 -1549 -4175 1774 3767 -1101 -1477 1909
1108 1909 912 5 2161 1119 -2802 1039 5687 -438 -6056 1708 6500 -2306 -6409 2075 4420
1123D420p799j031P072j475n866L856M533o107k638Q266J696j0018P02J1138k544
1138D205j0310M416R570o281p473P143N294p748l167Q045L19q030J578P329l732
1153A158p414N671N874p529m169Q563K189q710m53Q891j919p097L498N747m429
1168a29l304N211J689n190K41N510j935n715M182M733n621m337O526L018p679
1183b800r28O920j222o209K781M697m245l356N040K078n810m25O245o30n882K395
1199a351N560l980m008N649K594o338l47O917j971o596L364N616m597m896N270
1214H86L505n847k765O407K94o369J143N708k503n320M450M150n930k077O444
1229B176J003o133O52O038k026m627L467L290l939k195M639Q52n017k55N564j391
$$ plain form
1123 4420 -3379 -4410 2662 1187 -4679 -823 3710 -2397 -5035 3231 4927 -5091 -4389 6749 4205
1138 4205 -6105 -1689 7881 1600 -5873 1270 6564 -1184 -4351 3694 4013 -4017 -2439 4890 1158
1153 1158 -6256 -585 5289 -2240 -6409 2154 4343 -4367 -4820 4071 2152 -4945 -1447 4300 -129
1168 -129 -3433 1778 3467 -1723 -1482 4028 2093 -3622 560 5293 -328 -4665 1861 4879 -2800
1183 -2800 -3728 3192 1970 -4239 -1458 3239 -1006 -4362 678 2756 -3054 -3479 2766 2136 -3746 -1351
1199 -1351 4209 229 -3779 1870 4464 -1874 -2221 4696 2725 -3871 -507 5109 512 -4384 886
1214 886 4391 -1456 -4221 2186 2480 -3889 -2746 2962 459 -4861 -411 3739 -2191 -4268 2176
1229 2176 3179 -2954 -2302 3736 1710 -2917 550 3840 -99 -2294 2345 3197 -1820 -2075 3489 2098
1245B098n607K594M646l911l790M254K276n066l24M752j414l968K580L315k904
1260d69l051L922K384m266o34M608k87m089J848L724l302l010M518J732n236n49
1276b157N325j021m918J499M058k027m041K909K607l452j653L584L83l748R87
1291a665L793k005l427L894K732m583j032M416M96l891M39L619j124l594K286
1306C54K611k951k166L323J059l990l42M135j123m057J815L514k786k737L469
1321A28J771l353o48L173L8k757Q70K504j185j980K403J430k714m59K838r7k844
1338h82M50K893j885j921J612J429k677n35K388o90j979O24K134j738j428K255
1354E0R80k255m40K863k50k771J266K877j837k347K746J783k833j444L271P13
$$ plain form
1245 2098 -3509 -915 3731 -180 -3970 284 2560 -2506 -2830 1922 508 -3460 -880 2435 -469
1260 -469 -3520 402 2786 -1480 -2114 2494 2207 -1882 -34 3690 388 -2622 1896 3628 -1608 -2157
1276 -2157 3168 2147 -2771 -1272 2786 759 -3282 -373 2234 -1218 -2871 713 1096 -2652 -1665
1291 -1665 2128 123 -3304 590 3322 -1261 -2293 2123 2619 -1272 -833 2786 1662 -1932 354
1306 354 2965 14 -2152 1171 2230 -1760 -2102 2033 910 -3147 -1332 2182 -604 -3341 128
1321 128 1899 -1454 -2102 1071 1109 -1648 -778 1726 541 -1439 964 2394 -320 -779 2059 1962 -882
1338 -882 -432 2461 576 -1345 267 1696 -981 -1516 872 182 -1797 -1173 961 -777 -2205 50
1354 50 1030 -1225 -1665 1198 948 -1823 -557 2320 483 -1864 882 2665 -168 -1612 1659 2372
1370B372l216l10K941m32k433N54J778j325j615J513J341k507m86K330j29k354
1386a978K81K333k27j592Q81J164p83n02Q80Q7n91O44M68n34p66J314M71j604
1404e4j5Q31k16j068L95O44j062n96J306k51j556K91J948p11j528M44J851n25
1422A28j534J002J386r40r24J525L53r87j82J580L3j976J83K250p20j799n0J755
1440A083r5j933l3J292K3j266j75M91L28o36R1M60J00R8n4P09p30n32R38R69n10
1461F18j104P18J452o24j857N59J760l65j891J48J782m87k037O61J065n75j058
1478a235O61J161j329r39J511J127j770j084J971J226j836p58K236Q08k041m34
1494g25J929L97j815k45J826k0k358O52K060q28k097K48K265r40j912O11J910
$$ plain form
1370 2372 -844 -1154 1787 1355 -1078 -524 1254 -71 -1686 -173 1168 -1339 -1825 505 376 -1978
1386 -1978 -1697 636 409 -1183 -302 862 79 -423 457 544 -47 597 1065 531 -235 1079 1550 -54
1404 -54 -69 762 546 -522 -127 517 -545 -1141 165 -86 -1642 -1351 597 -114 -1642 -1198 653 128
1422 128 -1406 -404 982 42 -882 643 996 9 -173 1407 1440 -536 -353 1897 1177 -622 -672 1083
1440 1083 988 -945 -978 314 337 -929 -1104 -613 -285 -921 -830 -370 -270 -172 -226 483 -247 -779 159 1128 618
1461 618 -486 232 1684 1060 -797 -238 1522 1157 -734 -586 1196 709 -1328 -667 398 -177 -1235
1478 -1235 -574 587 -742 -1681 -170 957 -813 -1897 74 1300 -536 -1294 942 1750 -291 -725
1494 -725 1204 1601 -214 -459 1367 1347 -1011 -359 1701 873 -1224 -976 1289 349 -1563 -952 958
1511I58p31k342J134J760j035j453J298R70q84n93J564O54j705o1J666L98k165
1528e67l9J903O07j969j001K445J9k151m03J741Oj523l12J466j83j199O6J176
1546H2m60r96N08J669q65j329R97J542r05j271J116J545j036j306J400R02j090
1563E03j407J333J010j438q25J431O32k035m36J559K32j315o61J458R9j433L02
1580i91J028K76j360M25J506q35p08R28R97r74o32Q76N59q25p06O30R95j017o82
1599e10Q28N46j085k64M25j31k64k63K75M50o41k02Q56j24o56K30M36N95p11k3
1619b33R55k78p46N26N35J65p33j08M63J70p19R4O14l92p88K71M64n70n97N50
1639c57K77l86k36O0O79p77M5M72M94o01k80J024J25o84K25P78k58m87M5M62J94
$$ plain form
1511 958 227 -2115 -981 779 -256 -1709 -411 559 -325 -918 646 1300 -405 -466 1200 1598 -567
1528 -567 -606 1297 1904 -65 -1066 1379 1398 -753 -1156 585 591 -932 -1244 222 39 -1160 -1094 82
1546 82 -378 -1374 -866 803 -62 -1391 -394 1148 243 -1028 88 1633 597 -709 691 1593 503
1563 503 -904 429 1439 1 -824 607 1239 -796 -1232 327 559 -756 -1417 41 140 -1293 -991
1580 -991 37 313 -1047 -622 884 49 -659 269 1266 292 -340 536 1095 270 -436 194 1189 172 -510
1599 -510 318 864 -221 -485 -60 -191 -455 -718 -443 7 -634 -836 20 -104 -760 -530 -94 501 -210 -233
1619 -233 722 444 -302 224 759 924 191 83 546 716 -3 91 705 313 -475 -204 260 -310 -907 -357
1639 -357 -80 -466 -702 -642 37 -740 -695 -223 271 -330 -610 414 539 -145 80 858 600 113 158 620 814
1660H14q99J19M91l84m25K26K12k64l82K99J48m93m4O5n6Q2K62j13J15M44m36
1681b19j3M38J42j18k4K27Q5Q6j16j70K63k75m20O49j12q15L77M73p99m16M20
1702c37L23o37l12O94L35n48k98O73M53j115L84P85Qn64K66P52n69n20N13M75
1722G61l07j66L08P8r7q14K35N03n81r8J91j80l53J91l1j67j03K70k43K92M02
1743I1o03K76K31L39l80K11N4L06k07K39J42J40p27j04N68n0n02K47K73p61j21
1764c38L65j02o06J49M00O3m28k17O17J41m48r1P30J62o75J7P60q2o22P70m7l79
1786A39K32j29L36R3l19j57K28j51m70L23j93j40j69J66l13M5K49n15M80J7j93
1807d41O0J96N04n7m31M03R2k20K30R7L95j17j78k27J54l86k17N46j51p26J56
$$ plain form
1660 814 -85 34 525 141 -284 -58 154 -110 -492 -193 -45 -538 -582 -517 -573 -491 -229 -342 -227 217 -219
1681 -219 -232 206 348 230 206 433 518 604 488 318 581 306 -114 535 423 -392 -15 458 -341 -757 -337
1702 -337 -14 -651 -963 -269 66 -482 -780 -107 346 -769 -385 400 408 -156 110 862 293 -227 286 761
1722 761 454 288 596 674 577 -237 -2 501 -80 -178 13 -167 -520 -329 -360 -527 -630 -360 -603 -311 91
1743 91 -512 -236 -5 334 -46 165 219 525 318 557 699 839 112 8 576 526 24 271 544 -217 -338
1764 -338 27 -75 -681 -532 -132 -69 -497 -714 -97 44 -404 -495 235 397 -278 -261 499 417 -205 565 518 139
1786 139 371 242 578 671 352 195 423 272 -198 125 -68 -208 -377 -211 -524 -479 -230 -745 -265 -248 -441
1807 -441 -381 -185 319 262 -169 234 326 106 336 433 828 711 533 306 460 74 -143 403 252 -474 -318
1828c18L64k49j91K69J57m11k63o7R13p12k13L35Q07o32m42O75N18n81L04K80
1848E43m4j41r7L01Q0l87l29O61J48r95K78J39l8m13J6L87m37j56l62M03N75m95
1870c63l38N11M04o81J92N25J40m70k40Q78L72j189K06O87J01p50J8N89O0r43
1890b91nR83p26n84N79K55n64p05P30N43m16r03O93P88j113m3J352j75q46MJ104
1911F60j86l19J89N2k2r2n16Q19J00l39o30K74R1K29m50J26M38p70j73j49Q57
1932A89n88o17Q55L52r21J33P93o3m63L89M37J86m73l88L85O20l90m45P45m88
1952B48p54M19O21n88j302J141R33j117j0J08N57n45q77J267m9o89j83M79O20
1971B79k43J79j22M69r83J060q5q37P16m0Q96o99n46q5M30O44q14j208J387o67
$$ plain form
1828 -318 46 -203 -394 -125 32 -379 -642 -709 204 -508 -721 -386 421 -211 -653 22 540 -41 263 543
1848 543 499 358 261 562 642 255 -74 587 735 -260 18 157 119 -294 -278 109 -328 -484 -846 -443 132 -363
1870 -363 -701 -190 214 -467 -275 250 390 -80 -320 558 930 -259 -53 634 735 -15 3 592 652 -291
1890 -291 -296 687 -39 -623 -44 211 -353 -1058 -328 215 -201 -1104 -411 377 -736 -779 573 398 -448 -444 660
1911 660 474 155 344 396 374 282 -234 585 685 346 -284 -10 81 310 -140 -14 424 -346 -519 -668 189
1932 189 -399 -1016 -161 191 -730 -597 196 133 -330 59 496 682 209 -179 206 826 436 -9 736 248
1952 248 -506 -87 534 -54 -1356 -215 718 -399 -409 -301 256 -289 -1166 101 52 -637 -820 -341 279
1971 279 36 215 93 562 -421 639 554 -283 433 393 1289 590 44 -41 389 1033 219 -989 398 -269
1991b69P1k25J79k5k19K11n45L05M32l45j12J058j292Q42O60o9j457J328N26q71
2011A83L60k35Q31j580R77l08o31N30o66O95J18j260N33O76M43j322j062J519
2029a99l35j90k45Q36J81o20R29p7p54J47rM21p3j01L4K84M17m38K9QK2o64O55
2052B58l53j28L07m88k13K17O3p21L60Q70n20L56o8l56N42j163J186K31r15Q72
2072C37O65o46q51J714l45j240N40j30O18r88O08J0O24j607M64M00n49J10q40
2091a106J696r26P7K07M60j476Q47N40J87r75J097k57l72q51J246q77R25K53j204
2110e09J496J57j605J304l32r74J376p05n53k51j41N2M62l97R50j062n24P94K78
2129a84n69M52K10p7m43J355J46j671L50K91P60n05l09J382o98o98Q12l76j40
$$ plain form
1991 -269 -198 -423 -244 -269 -488 -277 -822 -517 -85 -430 -542 516 -776 66 726 657 -800 528 1054 183
2011 183 543 308 1139 -441 536 228 -403 127 -539 156 274 -986 -453 223 666 -656 -1718 -199
2029 -199 -534 -724 -969 -133 48 -572 357 280 -474 -327 -336 85 12 -89 -55 229 646 208 237 245 267 -397 258
2052 258 -95 -223 84 -404 -617 -400 -337 -1058 -698 172 -348 8 -60 -416 126 -1037 149 380 -535 337
2072 337 1002 356 -495 1219 874 -366 174 44 662 -326 282 292 916 -691 -227 173 -376 -266 -1106
2091 -1106 590 -336 -259 -52 408 -1068 -221 319 506 -469 628 371 -1 -852 394 -483 442 695 -509
2110 -509 987 1144 -461 843 511 -463 913 208 -345 -596 -737 -685 -223 -620 330 -732 -1256 -462 -184
2129 -184 -753 -301 -91 -168 -611 744 890 -781 -431 -140 620 115 -194 1188 490 -208 604 228 88
2148H8k62K91K8m04o46R13n8n9k72Q79n03p46N97O38r7j416Q96L94m15J51O83
2169F80m87n84J233J22r33q8J348l67q26pO77j239j84P72o8k17k80P09l63j149
2189a251Q37O57k88o15M47J038j491k98J338n14j57oJ507j79j514Q44K47p17J7
2208i8N34r7p85m2R27k99m46J20Q24p17r33M94N62l18l84O66j06k61J73J008J44
2229I66j679J123l3j15m69N99j23q51J219L57j77j290J341l73q75L36K31j14k51
2248a78n79R93j151Q58j201J284n21j14R92q56k99L93N83l46o91N81N34n09j1
2267b38Q39L57p39N78M01k46r20P16j22o53r1J06L75m86J08j34j48j74n77R38
2287a10m18k36K63N51o18P13J93j01k72m95Q21j38o51J677p30p41P60J43Nj056
$$ plain form
2148 88 -174 117 145 -259 -905 8 -50 -109 -381 498 -5 -751 -154 484 387 -1029 -133 261 -154 -3 680
2169 680 193 -391 842 964 31 -57 1291 924 98 91 768 -471 -655 117 49 -168 -448 261 -102 -1251
2189 -1251 -414 243 -45 -660 -213 825 -666 -964 374 -140 -297 -303 1204 1025 -489 355 602 -115 -98
2208 -98 436 339 -446 -488 439 140 -306 -186 638 -79 -1012 -518 44 -274 -658 8 -98 -359 -186 822 966
2229 966 -713 410 377 262 -207 392 269 -582 637 994 817 -473 868 495 -380 -44 187 73 -178
2248 -178 -757 236 -915 -57 -1258 26 -495 -609 383 -473 -772 -379 204 -142 -833 -252 282 -227 -238
2267 -238 601 958 219 797 1198 952 32 748 626 -27 -118 -12 363 -123 -15 -149 -297 -471 -1048 -110
2287 -110 -528 -764 -501 50 -568 145 338 237 -35 -530 291 153 -498 1179 449 -292 468 611 616 -440
2307d40R8O77J97o90M31J73o84k09O91l68n43J5R85o65l98N96K81j52n68P81l12
2328a04l0M14L56O1k73o38Q11p4m8J6Q4p34L52J52l27l84P32l96L06p44j26L83
2350b11m86N24O6k54l0L88M93k07m86K89k09J25L94L37l31n77R3J061j260m68
2370g49Q73M22q93M5O54k04k04n53N32L02j000N90J87m7m19N36N89j483L39K46
2390b37O6j00N66l6k08M02l43K69p0k67M42K18l70j87oJ40j52J85m69p3L23N39
2412F32j388M00J23j4l07J32N30j066P11k0P23n38J87k6M77r93K88O75n6q16P00
2433C54M90l99k19P1j27J68r57P87q34R05k63l31N26p18K0M39J46l20M06N4j27
2454G1L54k74n45M37l21O50j46L00m75m7J05J03l27O81m63K66o57P1L69J14k72
$$ plain form
2307 -440 -342 335 532 -158 273 446 -238 -447 244 -124 -667 -652 333 -332 -730 -134 147 -5 -573 208 -104
2328 -104 -134 280 636 697 424 -214 597 523 475 491 575 -159 193 345 18 -366 366 -30 276 -468 -594 -211
2350 -211 -697 -173 -107 -361 -391 -3 490 283 -203 86 -123 2 396 733 402 -175 -82 979 -281 -749
2370 -749 124 546 -347 -302 352 148 -56 -609 -77 225 -775 -185 2 -45 -464 72 661 -822 -483 -237
2390 -237 -171 -271 295 259 51 453 110 379 309 42 484 702 332 145 139 279 127 312 -157 -230 93 632
2412 632 -756 -356 -233 -247 -554 -422 108 -958 -247 -267 456 -82 105 79 556 -437 -149 526 470 -346 354
2433 354 844 445 226 297 170 338 -619 168 -666 239 -24 -355 171 -547 -527 -88 58 -262 144 198 71
2454 71 425 151 -394 43 -278 372 226 526 51 4 109 212 -115 566 103 369 -288 -217 152 266 -6
2475fl13K1N08l99l01M41r6q48Q64l5m40J030m45M34k29J11n82Q04%l96J39R5
2497C57l62J17J27r1m38M6L18Rj74J22J80m58K87l65M83p04K59L6m41M95l5J06
2519a26k1K40L11j87r3k10K40O7K22N9k34k45J19L82p93K19K88k71J19l62k60
2540e36N46n76L49j75O0k9O25n27L27n62P86j90o02O36K26m71L84l45O7L87j56
2561B24L4R2J71m30K92m67ql5P5k46j04O92o02J45k36k76R76o61K82M19Q7o88
2583b64L14j55J84j63N43l6l03O36m38N3l93J64o4L63m10L7L03r86R32m33l28
2604d44M84J13m63l7J79l56j52M99k97j11N24L77j004Q83J48O2k40l21O35J1j0
2625D80m73k34K79O4K42j72k88RJ28O6K45l95k89J93J0J38Q9l10p5n2K62M38q90
$$ plain form
2475 -6 -319 -298 210 -189 -490 -49 -145 -993 -129 -164 -604 426 -19 415 186 297 -285 519 519 123 262 357
2497 357 -5 112 239 148 -290 -244 74 83 -91 31 211 -247 40 -325 158 -546 -287 -251 -692 -197 -232 -126
2519 -126 -147 93 404 217 124 -86 154 221 443 502 268 23 142 524 -269 -50 238 -33 86 -276 -536
2540 -536 10 -566 -217 -392 -332 -361 264 -263 64 -498 288 98 -504 132 358 -113 271 -74 -7 380 224
2561 224 258 350 521 91 383 -84 -92 -127 -52 -298 -402 290 -312 -167 -403 -679 297 -364 -82 337 424 -264
2583 -264 50 -105 79 -84 459 423 120 756 318 371 -22 142 78 441 31 68 371 -615 317 -116 -444
2604 -444 40 153 -310 -347 -168 -524 -676 -177 -474 -585 -61 316 -688 195 343 405 165 -156 479 490 480
2625 480 7 -227 52 116 358 186 -102 -93 35 101 346 -49 -338 -145 -135 3 92 -218 -293 -345 -83 355 -535
2648e35m06Q46K73k93J97K84l30J01k01M9N84l89oj62K47j50k14R2k77M25k98
2669a63l87K88j3N4K25j37j72K26n4q7J33j37jP05m48k1N11l28%j18K08N0k87
$$ plain form
2648 -535 -941 -95 178 -115 82 366 36 137 -64 -15 569 180 174 12 259 109 -105 -13 -290 135 -163
2669 -163 -550 -262 -275 -221 4 -133 -305 -79 -133 -220 -87 -224 -225 480 32 11 522 194 194 76 284 334 47
$$ [...]
8191b15
##END NTUPLES=NMR FID
##END=
