##TITLE=1H_Pr CF3
 CDCl3
 8 sc, 
 4.04.2022
##JCAMPDX= 6.0         $$ Bruker NMR JCAMP-DX V2.0
##DATA TYPE= NMR FID
##DATA CLASS= NTUPLES
##ORIGIN= UXNMR, Bruker Analytische Messtechnik GmbH
##OWNER= root
$$ XWIN-NMR		Version 3.5
$$ Mon Apr  4 11:09:13 2022 Russian Standard Time (UT+4h)  she@DPX200
##.OBSERVE FREQUENCY= 200.131346
##.OBSERVE NUCLEUS= ^1H
##.DELAY= (6, 6)
##.ACQUISITION MODE= SIMULTANEOUS
##.ACQUISITION SCHEME= undefined
##.AVERAGES= 8
##.DIGITISER RES= 18
##SPECTROMETER/DATA SYSTEM= spect
##.PULSE SEQUENCE= zg30
##.SOLVENT NAME= CDCl3
##.SHIFT REFERENCE= (INTERNAL, CDCl3, 0, 15.7039)
##AUDIT TRAIL= $$ (NUMBER, WHEN, WHO, WHERE, WHAT)
$$ ##TITLE= Audit trail, XWIN-NMR		Version 3.5
$$ ##JCAMPDX= 5.01
$$ ##ORIGIN= Bruker BioSpin GmbH
$$ ##OWNER= she
$$ F:/spectra/data/she/nmr/H-F/1/audita.txt
$$ ##AUDIT TRAIL=  $$ (NUMBER, WHEN, WHO, WHERE, WHAT)
(   1,<2022-04-04 11:08:13.85 +0400>,<she>,<DPX200>,
      <created by zg, POWCHK disabled, PULCHK disabled
       configuration hash MD5:
       00 E9 B6 7A A2 85 ED C7 34 08 36 98 17 FE 4E 26
       data hash MD5: 16K
       30 1F 90 60 AB C4 F5 79 85 3D DF BF 49 5D B7 38>)
$$ ##END=
$$ 
$$ hash MD5
$$ 91 3D 5E 46 21 72 63 10 91 D9 A3 B0 FB 24 25 6F
##$RELAX= 
##$RELAX= 
##$RELAX= 
##$RELAX= 
##$RELAX= 
##$RELAX= 
$$ Bruker specific parameters
$$ --------------------------
##$DU= <F:/spectra>
##$EXPNO= 1
##$NAME= <H-F>
##$PROCNO= 1
##$TYPE= <nmr>
##$USER= <she>
##$AMP= (0..31)
100 100 100 100 100 100 100 100 100 100 100 100 100 100 100 100 100 100 
100 100 100 100 100 100 100 100 100 100 100 100 100 100 
##$AQSEQ= 0
##$AQ_mod= 1
##$AUNM= <au_zg>
##$AUTOPOS= <>
##$BF1= 200.13
##$BF2= 200.13
##$BF3= 200.13
##$BF4= 200.13
##$BF5= 200.13
##$BF6= 200.13
##$BF7= 200.13
##$BF8= 200.13
##$BYTORDA= 1
##$CFDGTYP= 0
##$CFRGTYP= 5
##$CHEMSTR= <none>
##$CNST= (0..31)
1 1 145 1 1 1 1 1 1 1 1 1 1 1 1 1 1 1 1 1 1 1 1 1 1 1 1 1 1 1 1 1 
##$CPDPRG= <>
##$CPDPRG1= <>
##$CPDPRG2= <>
##$CPDPRG3= <>
##$CPDPRG4= <mlev>
##$CPDPRG5= <mlev>
##$CPDPRG6= <mlev>
##$CPDPRG7= <mlev>
##$CPDPRG8= <mlev>
##$CPDPRGB= <>
##$CPDPRGT= <>
##$D= (0..31)
0 1.2 0 0 0 0 0 0 0 0.06 0 0.03 0 0 0 0 0.0002 0 0 0 0 0 0 0 0 0 0 0 0 
0 0 0 
##$DATE= 1649056093
##$DBL= (0..7)
120 120 120 120 120 120 120 120 
##$DBP= (0..7)
150 150 150 150 150 150 150 150 
##$DBP07= 0
##$DBPNAM0= <>
##$DBPNAM1= <>
##$DBPNAM2= <>
##$DBPNAM3= <>
##$DBPNAM4= <>
##$DBPNAM5= <>
##$DBPNAM6= <>
##$DBPNAM7= <>
##$DBPOAL= (0..7)
0.5 0.5 0.5 0.5 0.5 0.5 0.5 0.5 
##$DBPOFFS= (0..7)
0 0 0 0 0 0 0 0 
##$DE= 6
##$DECBNUC= <off>
##$DECIM= 32
##$DECNUC= <off>
##$DECSTAT= 4
##$DIGMOD= 1
##$DIGTYP= 9
##$DL= (0..7)
0 120 120 120 120 120 120 120 
##$DP= (0..7)
150 150 150 150 150 150 150 150 
##$DP07= 0
##$DPNAME0= <>
##$DPNAME1= <>
##$DPNAME2= <>
##$DPNAME3= <>
##$DPNAME4= <>
##$DPNAME5= <>
##$DPNAME6= <>
##$DPNAME7= <>
##$DPOAL= (0..7)
0.5 0.5 0.5 0.5 0.5 0.5 0.5 0.5 
##$DPOFFS= (0..7)
0 0 0 0 0 0 0 0 
##$DQDMODE= 0
##$DR= 18
##$DS= 0
##$DSLIST= <SSSSSSSSSSSSSSS>
$$ [...]
##$SUBNAM2= <"">
##$SUBNAM3= <"">
##$SUBNAM4= <"">
##$SUBNAM5= <"">
##$SUBNAM6= <"">
##$SUBNAM7= <"">
##$SUBNAM8= <"">
##$SUBNAM9= <"">
##$SW= 18.0517287032376
##$SWIBOX= (0..15)
0 0 2 0 0 0 0 0 0 0 0 0 0 0 0 0 
##$SW_h= 3612.71676300578
##$TD= 16384
##$TD0= 1
##$TE= 0
##$TE2= 300
##$TE3= 300
##$TEG= 300
##$TL= (0..7)
0 120 120 120 120 120 120 120 
##$TP= (0..7)
150 150 150 150 150 150 150 150 
##$TP07= 0
##$TPNAME0= <>
##$TPNAME1= <>
##$TPNAME2= <>
##$TPNAME3= <>
##$TPNAME4= <>
##$TPNAME5= <>
##$TPNAME6= <>
##$TPNAME7= <>
##$TPOAL= (0..7)
0.5 0.5 0.5 0.5 0.5 0.5 0.5 0.5 
##$TPOFFS= (0..7)
0 0 0 0 0 0 0 0 
##$TUNHIN= 0
##$TUNHOUT= 0
##$TUNXOUT= 0
##$USERA1= <user>
##$USERA2= <user>
##$USERA3= <user>
##$USERA4= <user>
##$USERA5= <user>
##$V9= 5
##$VALIST= <valist>
##$VCLIST= <CCCCCCCCCCCCCCC>
##$VD= 0
##$VDLIST= <DDDDDDDDDDDDDDD>
##$VPLIST= <PPPPPPPPPPPPPPP>
##$VTLIST= <TTTTTTTTTTTTTTT>
##$WBST= 1024
##$WBSW= 4
##$XGAIN= (0..3)
0 0 0 0 
##$XL= 0
##$YL= 0
##$YMAX_a= 394735
##$YMIN_a= -388957
##$ZGOPTNS= <>
##$ZL1= 120
##$ZL2= 120
##$ZL3= 120
##$ZL4= 120
##$ABSF1= 10
##$ABSF2= 0
##$ABSG= 5
##$ABSL= 3
##$ALPHA= 0
##$AQORDER= 0
##$ASSFAC= 0
##$ASSFACI= 0
##$ASSFACX= 0
##$ASSWID= 0
##$AUNMP= <proc_1d>
##$AZFE= 0.1
##$AZFW= 0.1
##$BCFW= 1
##$BC_mod= 2
##$BYTORDP= 1
##$COROFFS= 0
##$CY= 11.3945322036743
##$DATMOD= 1
##$DC= 2
##$DFILT= <>
##$DTYPP= 0
##$F1P= 2.36226072786647
##$F2P= -0.459571619588291
##$FCOR= 0.5
##$FTSIZE= 0
##$FT_mod= 4
##$GAMMA= 1
##$GB= 0.15
##$INTBC= 1
##$INTSCL= 1
##$ISEN= 128
##$LB= 0.24
##$LEV0= 0
##$LPBIN= 0
##$MAXI= 10000
##$MC2= 0
##$MEAN= 0
##$ME_mod= 0
##$MI= 1.114404
##$NCOEF= 0
##$NC_proc= 0
##$NLEV= 6
##$NOISF1= 3.799351
##$NOISF2= 2.8
##$NSP= 1
##$NTH_PI= 0
##$NZP= 0
##$OFFSET= 15.70392
##$PC= 1
##$PHC0= -17308.13
##$PHC1= 11.40078
##$PH_mod= 1
##$PKNL= yes
##$PPARMOD= 0
##$PSCAL= 0
##$PSIGN= 0
##$REVERSE= no
##$SF= 200.130013532006
##$SI= 16384
##$SIGF1= 3
##$SIGF2= 2
##$SINO= 400
##$SIOLD= 16384
##$SREGLST= <1H.CDCl3>
##$SSB= 0
##$STSI= 0
##$STSR= 0
##$SW_p= 3612.71676300578
##$SYMM= 0
##$S_DEV= 0
##$TDeff= 0
##$TDoff= 0
##$TI= <>
##$TILT= no
##$TM1= 0
##$TM2= 0
##$TOPLEV= 0
##$USERP1= <user>
##$USERP2= <user>
##$USERP3= <user>
##$USERP4= <user>
##$USERP5= <user>
##$WDW= 1
##$XDIM= 8192
##$YMAX_p= 0
##$YMIN_p= 0
$$ End of Bruker specific parameters
$$ ---------------------------------
##NTUPLES= NMR FID
##VAR_NAME=  TIME,          FID/REAL,        FID/IMAG
##SYMBOL=    X,             R,               I
##VAR_TYPE=  INDEPENDENT,   DEPENDENT,       DEPENDENT
##VAR_FORM=  AFFN,          ASDF,            ASDF
##VAR_DIM=   8192,          8192,            8192
##UNITS=     SECONDS,       ARBITRARY UNITS, ARBITRARY UNITS
##FACTOR=    0.0002768,     1,               1
##FIRST=     0,             0,               0
##LAST=      2.2672688,     0,               0
##MIN=       0,             -388957,         0
##MAX=       2.2672688,     394735,          0
$$ Real data points
##PAGE= N=1
##DATA TABLE= (X++(R..R)), XYDATA
$$ [...]
1801b06j54L27l12k77j27M37j3k78O05L02n55M14K98L17l99j94P83l57m34q4K12
1822C05j0r97N87L54p16J7j47M24k60k3N03P0n36N57K57m23J51J53j21O6n86L61
1844a4J70l64J83J79j09m1K50J55j96j52M54k94o68P37L3p44o5O2K60m13k16N15
1866b78J65m76M03L72m8j41o1N80m51K9M73J76n51j06L07j39k78j91O63m07l86
1887c45L3L40k10k11J46K65j01k18K18J98l49K22k06J65l82L65P5P9r3J06o7K35
1909B65j40K2K36k19j5J5k3r9j67R0l62K10K09n11M3P2L25l54K42L49k65q4J9
1932a42K23J0l34N88O6k72k1J05J87k92j45J79j99J10K81k53m06N92m69NL50q57
1954f94K87K67p8ml29R93m3n29K02l13M85k62J59N76l68n98K86P94n02L72q63
$$ plain form
1801 -206 -360 -33 -345 -622 -749 -312 -325 -603 2 304 -251 163 461 778 379 185 968 611 177 93 305
1822 305 295 -702 -115 239 -477 -460 -607 -183 -443 -466 37 107 -429 128 385 -38 113 266 145 211 -375 -14
1844 -14 156 -208 -25 154 45 4 254 409 213 61 515 221 -447 290 323 -421 -486 -424 -164 -577 -793 -278
1866 -278 -113 -589 -186 186 138 -3 -64 516 65 94 567 743 192 86 393 254 -24 -215 448 41 -345
1887 -345 -312 28 -182 -393 -247 18 -83 -301 -83 115 -234 -12 -218 -53 -435 -70 5 84 -9 97 30 265
1909 265 125 147 383 164 149 164 141 42 -125 -35 -397 -187 22 -489 -446 -374 -49 -403 -161 188 -77 -161 -142
1932 -142 81 91 -243 345 411 139 118 223 410 118 -27 152 -47 63 344 91 -315 277 -192 -187 163 -694
1954 -694 -407 -140 -218 -222 -551 442 399 -130 72 -241 244 -18 141 717 349 -249 37 831 329 701 -162
1975a62R71k74j22J99j08j35k88q7q5k43L9J54R4j28j55P7M13n79k3M36R3J81
1997B68l05J73J65j75k13M07J27m06K6N1n4K6j03k22M27l82n3K08P3k24l00L47
2019a39L0r4J13j04J75j07J51K66p6p9l27K08N29l75j09k5M32n02L5L10j12j6
2041A84j84K27k01j18N8J73k68j57K66m22J90p9P1Q2m7P6K68j22Q2m8j4K37R3
2064C47O8K4j28O2l77J22pj09o9qK2k85L02o0j40M10m53L26j53J91j17l16K51
2087i7LJ70j53M04m5j11J30J96m19j03L98n8k28J08j01l7J48k97K31k14r5J87
2109A7l68K43k68J17q5M2J45O3J48j77K23K50k93j44L72J03k63j17O13m65l5j53
2131c2O4J73j4m57P33o75J19N71p68J32%J26j72o0K8K52j53P9kj1M8K7J96l6k40
$$ plain form
1975 -162 809 535 413 612 504 369 81 -6 -91 -334 -295 -141 -47 -175 -330 -253 160 -419 -442 -6 87 268
1997 268 -37 136 301 126 -87 320 447 41 67 118 64 90 -13 -235 192 -190 -243 -35 38 -186 -486 -139
2019 -139 -109 -203 -90 -194 -19 -126 25 291 215 136 -191 17 546 171 62 37 469 -33 2 312 200 184
2041 184 0 227 26 -92 -34 139 -129 -286 -20 -442 -252 -331 -260 -178 -225 -149 119 -3 79 31 17 254 347
2064 347 415 439 311 373 -4 118 111 2 -67 -75 -53 -338 -36 -96 -236 174 -279 47 -106 85 -32 -348 -97
2087 -97 -94 76 -77 327 282 171 301 497 78 -25 373 315 87 195 94 57 205 -92 139 -75 -170 17
2109 17 -351 -108 -376 -259 -344 -302 -157 -94 54 -123 100 350 57 -87 285 388 125 8 621 156 121 -32
2131 -32 32 205 191 -266 467 -208 -89 482 -286 -154 -154 -28 -200 -260 -232 20 -133 -54 -56 -67 -19 8 204 168 -72
2156g2K17J98K20j68l19k04J26J2L42l29l63O92l52j62l12O27r62L30L71L34k96
2177g0O72n91K70q47N67L77n13m6K41N96n04l17j60J187j95j015M25N03k34m72
2197a26p22Q32k43L91M18p19j71n8N69m95J25L3L13l68J22JL71R9o73J220m87
2218D32j4m72L69j06k83J09j83K51nk26J20r0J85N0j58M5k33K51k17j04L01k29
2240b07L7L53k81QQ9L3nj34m4Q3L90j17r9K33j47k17K83k92J55m4l86Q73o97k54
2264c87O65m50PK96p7j46oL9q5K99l18J68j47K68J46Nj21m1j88J93n5J87l06j1
2288f5L6k7M16m96j16J64J80l03K64j82j64K46m34L67J1j48q3N37k20k71R76j23
2310E65p98J95qj17J01q4Q29J50q25m34L02N30N08o07R2J1o05O68q36L08l35K03
$$ plain form
2156 -72 145 343 563 395 76 -128 -2 10 352 23 -340 352 0 -162 -474 153 -809 -479 -108 226 -70
2177 -70 602 11 281 -566 1 378 -135 -181 60 656 152 -165 -325 862 667 -348 77 580 346 -126
2197 -126 -848 -16 -259 132 550 -169 -340 -398 171 -324 -199 -166 147 -221 -99 -98 273 372 -301 919 432
2218 432 418 -54 315 209 -74 35 -148 103 98 -128 -8 -98 87 137 -21 24 -209 42 -175 -279 22 -207
2240 -207 -170 183 -98 -90 -1 32 27 -107 -151 -68 322 205 106 339 192 -25 258 -34 121 77 -309 564 -133 -387
2264 -387 278 -172 -165 131 54 -92 -98 -59 -144 155 -163 5 -142 126 272 277 156 115 -73 120 65 252 -54 -65
2288 -65 -29 -56 360 -136 -252 -88 92 -211 53 -129 -293 -47 -481 -114 -103 -251 -334 203 -17 -288 688 565
2310 565 -233 -38 -46 -163 -62 -146 683 833 8 -426 -124 406 914 307 399 410 -195 473 -363 -55 -390 -187
2332a87O30j81k97j02l94K48L49j93K45j31q6L48k76J49O5P70q00r1m8k79L13
2353E2M86K6p22J21J8M3J3m38O9J3J29K2QJ16k2j05K94K2o9P3P5k57K07k30j13
2378a69M23k13L03l70K96j29k9m13M45k92mK1j9J24oj78K39k95P3J65m5KJ33j72
2402a10K60n5O9N3l88L36O3j30n1K10k97K19j72j00P4l9n9J12k29M9P6j8L43l94
2426a78P2J08k44M18j58k45L47j33o5J82r4L1j02K35k08M9J73R9k39l14J65K13
2448A12k46L20j45k28K1J25l66L12Q7j20L39n33M25j16J27l15K53q3O1R6j05P3
2470I4N0l67K06K25j99j2J78j79M1j38J29j45K07l2k04M5j42J07J03j3J26q4r7
2493a01K22j12K47j61K0K6j67R5P1Q5k25n9K91L5K5r8k24Qk3Q3j51K16j26j00
$$ plain form
2332 -187 443 262 -35 -137 -531 -283 66 -127 118 -13 -99 249 -27 122 187 957 157 66 18 -261 52
2353 52 538 564 -158 -37 -19 24 37 -401 -332 -319 -190 -168 -160 -44 -66 -171 123 145 76 149 224 -33 174 -56 -169
2378 -169 254 41 344 -26 270 141 112 -301 144 -148 -152 -131 -150 -26 -32 -210 29 -266 -193 -28 -73 -71 62 -110
2402 -110 150 95 164 217 -171 165 228 98 47 257 -40 179 7 -93 -19 -58 -117 -5 -234 -185 -109 -127 216 -178
2426 -178 -106 2 -242 176 18 -227 120 -13 -78 104 10 41 -61 174 -34 15 188 287 48 -266 -101 112
2448 112 -134 186 41 -187 -166 -41 -407 -95 -8 -128 211 -322 103 -13 114 -201 52 -31 30 126 21 94
2470 94 144 -223 -17 208 9 -3 175 -4 37 -101 28 -117 90 58 -146 -101 -243 -136 -33 -46 80 -4 -101
2493 -101 121 9 256 95 115 141 -26 69 140 225 0 -59 232 267 292 194 -30 -22 -45 38 -113 103 -23 -123
2517a23R1J73j15j34M6J23l90M96k7k04K26j87L9o2K0K46p6k38J68j39J40n4k13
2540a94O4j14L43r7J11j46O1l71L20k07J91k74L12J18m18R8MM05j91O3J40q8k99
2563a69M70M2k64j38P7MJ48j09N9j71Pj15J10q9p4J39J07j70K19k27j31L53M0
2586A18j54k1R8k78M18j75j33K32k07R5P5pr8O3J23j39k7K30J18k85j16R9r0O8
2610Gk9l6K46l20M5K41K2j40j40J54k3j66K21M3J38q3j69J66j54J72k11N0j02
2633f8L02m01L13l05n5j02N4J74k02K19L75m83J71k03N1M55l47R5k19L94Q6m9
2655B55j35J23j65K1q1j72N8L79l95M53j14k49p6mj96L44m5n6j89L15r0q4j22
2678b25K13J47k27n0K32j64J73j23nK02j35o7J08j83J73J5m3j34K35k30p3M04
$$ plain form
2517 -123 -32 141 26 -108 -62 61 -329 167 140 -64 162 -25 14 -48 -28 218 142 -96 72 -67 73 19 -194
2540 -194 -130 -244 99 2 113 -33 28 -343 -23 -230 -39 -313 -1 117 -301 -203 -199 206 15 78 218 130 -169
2563 -169 301 343 79 -59 18 22 170 61 120 -51 -44 -159 -49 -138 -212 -73 34 -136 83 -144 -275 78 118
2586 118 -36 -57 41 -237 181 6 -127 105 -102 -7 68 61 -37 26 149 10 -17 213 331 46 -70 29 -61 7
2610 7 -22 -58 188 -132 -87 154 176 36 -104 50 27 -139 82 125 263 180 11 177 23 195 -16 34 -68
2633 -68 234 -167 146 -159 -214 -316 -262 -88 -290 -71 304 -179 -8 -211 -160 295 -52 43 -176 218 304 255
2655 255 120 243 78 99 18 -154 -96 283 -112 341 227 -22 -98 -102 -298 46 1 -55 -244 71 -19 -103 -225
2678 -225 -12 135 -92 -142 90 -74 99 -24 -29 173 38 -29 79 -104 69 84 41 -93 142 -88 -161 243
2700B43j76j25j19O4k26K71J61j93r0J66J03N6m28M33k87K36l8M0R8l1p0NJ11
2723B04L7k36K26jm26J13K00q9LLJ71k2l21J11l9J17p3J00m04L57J8j69J32JJ2
2748B5j78L51m6j66JJ42j97R0p6J33j47QR3j05n9J96k09l9K11O8j54r6K22j27
2772e9J56m5K0j87Q7K05j09k65M36n22K44j9Q1K44l02o1P6J06k02J94r6%q4K49
2796A47j69J54k15o9K12m9m7K23j51j64J5Q5L17k82j44L13j50j24k3J36K8j31
2818h8n3R6PK93j98J76k98J46k48J90r0J12Q6k70Q2L05r2m40M17j69J31j83J33
2841D5MRj94L71j44p7j15J27J91n89N7J51L91j86q0Q8O8r1o0J72qj12l19M23m7
2866G5r3K2p0k77L88J41j27k92K16J60j28J07n9r0k14J61J52o1J34q3k60O2J73
$$ plain form
2700 243 67 -58 -177 -113 -339 -68 93 -100 -190 -24 79 135 -293 140 -147 89 51 91 189 158 88 93 204
2723 204 241 5 231 230 -196 -83 117 28 31 34 205 183 -138 -27 -66 51 -22 78 -326 31 49 -120 12 13 25
2748 25 -153 198 152 -14 -13 129 -68 22 -54 79 -68 -60 33 -72 -131 65 -144 -183 28 96 -58 -154 68 -59
2772 -59 97 52 72 -115 -28 177 68 -197 239 -283 -39 -58 23 267 -35 -96 -20 86 -116 78 -18 -18 -102 147
2796 147 -22 132 -83 -152 60 11 -36 187 36 -128 -113 -28 289 7 -137 176 26 -98 -121 15 43 -88
2818 -88 -141 -45 -38 255 57 233 -65 81 -167 23 -67 45 131 -139 -57 248 156 -284 133 -36 95 -88 45
2841 45 49 58 -136 235 91 14 -101 26 217 -372 -315 -164 227 41 -39 49 117 26 -34 138 130 18 -301 122 75
2866 75 -18 4 -66 -343 45 186 59 -233 -17 143 15 122 63 -27 -241 -80 72 11 145 62 -198 -136 37
2889C7n7l8n0J8j33J51K12j41J3J31j62M5J9j62J86j00Q3m8J61j6p3j3j26K36
2913A73k31K8O0l40L53j76P2J10o3k97M49j32M1p3K46j76r8ml5J72k57K42R4j97
2937c9L39k38J6k06o7J22j14K88N8j98j32rR4J67l0j65J50o4J25J48l71J9K61
2960A54j45KJ63j1K2k06L4k32L31Qj5k19J80l58K00K50j64j0J25L6k2l49K45j09
2984i0L51k62N5P4l16m1J73Q8o9j34J44L5q2J00j44J93k27M7j01Q5L7q6J40k2
3008e2J30J6O8k29q7J88K7j38p9N0L08k29N8Q7nN1l69L16mR6k19K98k54m2j87
3033b01L54k00R4N2j39m5j6O8J40l23K87j20J80Kl70L91l83J88P3j73R2j32J55
3056b6J4L4k15N5R5M9l63M57k07k10L18j44L67j78r5K6J6j53J1J28l8k38M27k50
$$ plain form
2889 37 -20 -58 -108 -90 -223 -72 140 -1 12 143 -19 26 45 -117 69 -31 52 4 165 149 76 63 -63 173
2913 173 -58 -30 30 -310 43 -133 -61 49 -14 -311 138 6 47 -26 220 44 -54 -58 -93 79 -178 64 158 -39
2937 -39 300 62 78 -128 -195 -73 -187 101 159 -39 -171 -180 -86 81 51 -114 36 -28 97 245 -126 -107 154
2960 154 9 11 174 163 185 -21 13 -219 112 120 105 -114 66 -292 -92 158 -6 -16 109 145 123 -226 19 -90
2984 -90 261 -1 54 128 -188 -229 -56 32 -37 -171 -27 8 -74 26 -118 75 -152 -105 -206 -121 -84 -170 -30 -52
3008 -52 78 94 162 -67 -154 34 61 -77 -156 -106 202 -27 31 118 113 164 -205 111 107 203 -16 282 28 -14 -201
3033 -201 153 -47 47 99 -40 -85 -101 -33 107 -216 71 -49 131 133 -237 154 -229 -41 32 -141 -49 -181 -26
3056 -26 -12 22 -193 -138 -43 6 -357 100 -107 -317 1 -143 224 46 -49 -23 -7 -160 -149 -21 -59 -297 130 -120
3080a20L1Q5p0J74j4L1j44J76k14J46l0O1m3p3l7N3J21l11R6L2J34KK5p6j9J1
3106B7j80R8K87j73j1N5k58Q4oJ29M0k5m4n3k25L82p9r2J03q4J4K5o4J64K9k31
3132h8l2L36l01o9n9K84k53Q3P5j49l4J09J7j60K95j63mN8L26k26J58k92J48O8
3156A27k79j8j03M43l36NO5L29j92k67L32j7k4j1l18K91j51j0K13k78l0J97m4
3179g6Q3J22k02o8j7L56m09P1K15O9n2K36j96j01r9M6k1R6K4L02l82k3n1J90N3
3204A66k25j2k02K54L5L77l24j80K7m2K11j97J5K01j14L1J80j18l2p3o1p8P6K75
3228A90k33l23J32K64n4p2K25j74P3J02p7k5N6j03l4K0J6J06qJ64m07K45p3P7
3252H7l05L8K20l6m4k50M30k75K26j91p7L65j02k11L11j88p4J74j93J17j87M57
$$ plain form
3080 -120 -89 -4 -74 100 86 117 -27 149 -65 81 51 112 69 -4 -41 12 133 -178 -82 -50 84 86 111 35 16 27
3106 27 -153 -55 232 59 48 103 -155 -71 -77 52 92 67 23 -30 -255 127 48 -44 59 -25 -11 14 -50 114 143 -88
3132 -88 -120 216 -85 -154 -213 71 -182 -99 -24 -173 -207 -98 -81 -241 54 -109 -113 -55 271 45 203 -89 59 127
3156 127 -152 -170 -273 170 -166 -161 -96 233 41 -226 106 89 65 54 -264 27 -124 -134 79 -199 -229 -32 -76
3179 -76 7 129 -73 -141 -158 198 -211 -140 75 144 92 328 132 31 -68 -22 -43 53 77 379 -3 -26 -77 113 166
3204 166 -59 -71 -273 -19 16 393 69 -111 -84 -126 85 -112 -97 104 -10 21 201 83 51 -22 -83 -161 -85 190
3228 190 -43 -366 -234 30 -24 -96 129 -45 28 130 53 28 84 -19 -53 -33 -17 89 81 245 -162 83 10 87
3252 87 -218 -180 40 4 -40 -290 140 -135 91 -100 -177 188 86 -125 186 -2 -76 98 -95 22 -165 292
3274B92k56N9j4j58Q0m2J17j29j76K38j97q3K1J51j8J27k17L31r0J24k90K22j80
3297h8P8j18J78l8j32J6q5P1K01p1q6J15j30L18m75K08P8m3r4J20q5K59j85J30
3321A42j29J98j21Q2l29J36q3%J88k8K33m3l10j11J66j45L63K4l15j72J70k5m1
3344a50j98L75j64J07M4j5k75K73K25k45J35l75K93nk14L55r1j59O4j79J29J75
3366A05mn5q9K8R5J24m66K19J57j07k76L73K8k0l5j07J08R1j29q3r0K1L5J18j23
3391h2n2J67r1J15l53L18k34J70l4K29k99Q1K2r3N0J11P9k29O1l0K48m8Pj06k56
3416b49M79l94K03L2K7k81K27O5j99q6K3J60j0%n7n9M9p9K32l53K62j21K7K91
3440A89k08k4K06n6j50R5P5r4j04K35j20j66J50j21L6J01RJ49J7k73%J7j6Kj64
$$ plain form
3274 292 36 95 81 -77 3 -39 78 -51 -227 11 -186 -269 -248 -97 -115 12 -205 126 36 160 -130 92 -88
3297 -88 -10 -128 50 12 -120 -104 -189 -118 83 12 -74 41 -89 229 -246 -38 40 -3 -97 23 -62 197 12 142
3321 142 13 211 90 172 -157 -21 -104 -104 84 56 289 246 -64 -175 -9 -154 209 233 -82 -254 -84 -109 -150
3344 -150 -348 27 -137 -30 14 -1 -276 -3 222 -23 112 -263 30 25 -189 166 75 -84 -20 -199 -70 105
3366 105 101 46 -43 -15 80 204 -262 -43 114 7 -269 104 132 112 77 -30 78 169 40 -43 -133 -112 -77 41 -82
3391 -82 -134 33 -58 57 -296 22 -212 -42 -76 153 -146 -65 -43 -136 -86 25 104 -125 -64 -94 154 106 113 7 -249
3416 -249 230 -164 39 71 98 -183 44 109 -90 -176 -153 7 -3 -3 -60 -119 -70 -149 83 -270 -8 -129 -102 189
3440 189 -19 -43 163 107 -43 52 127 33 -71 164 44 -122 28 -93 -57 44 53 202 219 -54 -54 -37 -53 -51 -215
3465b15K9L25j81j83K95N4m99L75k07J86J1k20L01k13P7J35j03L3j57K39j67R0
3487EJ70j78k28L36j15j31M6N9J79M6l78J49Q0M9Q1j99jL98l54r2J20j71J69j6
3511B4N4l10J37n6J70j97J47q7J22j18m5J47m8K34k63J57q3j10J32l6jO0j4q3
3535f7J30k70NK69R2m49K35k5j35J34l0R2K67j87J1J33j73l8p0J1j25M12k32P8
3559F8J58m33J84j10l2M21l81L13k51K45l6k12P2J45j86k7J64J22k50Q8o5L8K9
3582F4k45j7J63K78j93j47N2j39J12K34j33J48j32n4j5k35L40j53j39L11k5R6
3604A71k18J64J2j58j81K08J70k97L2M6J62N0Km2l48J32J47j89K73K2l00J63n0
3627b9J36j13Q4j65M2J10Rk00J71o4q6o3kJ49P8k76K75r6Q2O0j40KJ29K20j72
$$ plain form
3465 -215 -186 139 -42 -225 70 124 -375 0 -207 -21 -10 -230 71 -142 -65 70 -33 0 -157 82 -85 5
3487 5 175 -3 -231 105 -10 -141 -95 -36 143 189 -189 -40 40 89 170 -29 -30 368 14 -78 42 -129 40 24
3511 24 78 -232 -95 -151 19 -178 -31 -118 4 -114 -159 -12 -60 174 -89 68 -15 -125 7 -29 -30 30 16 -67
3535 -67 63 -207 -202 67 159 -290 -55 -80 -215 -81 -111 -19 248 61 72 205 32 -6 -76 -65 -190 222 -10 68
3559 68 226 -207 -23 -133 -165 256 -125 188 -63 182 146 -66 6 151 -35 -62 102 224 -26 62 -3 35 64
3582 64 -181 -198 -35 243 50 -97 -45 -184 -72 162 29 177 45 -9 -24 -259 81 -72 -211 100 75 171
3604 171 -47 117 129 -29 -210 -2 168 -129 -97 -51 111 161 163 121 -227 -95 52 -137 136 158 -142 21 -29
3627 -29 107 -6 78 -87 -45 65 74 -126 45 -19 -105 -168 -170 -21 57 -219 56 -40 42 102 -38 -36 93 313 141
3652A41j01J05J78k76j9N1k8r0l9k8J64j27K54j32m2j35j43L76j61J32j41J74
3674A13j1k20N7K2j67L54k8k23R1l2p7J96k22J0J33K5j78J72J07o6Q0k53J83J6
3698H2m7J38k17J48qk1j53P4k08J73J42K4j16Q6q6k96M49k95K72j39J29j69J92
3721A54k81k35L93k24K00j9J54m39K41J13o4J2K95j77k2m7l12K12j9O9j88J64
3743b0R7R1j34l1k09M8q1L84k05M5L5r8J4O9k6j07K28L7k47J35j00J2K27M6l1
3768A79k26j20L20k95J60r6p7RQ2j2K2L06m09J5J62K25k70M0r6m1L42n09k7L97
3792H1j30P1k9k29M23k69L7J12j43m4J59j71k8N29j11k26Q4j60P7R3K8j59J19
3815A14k3q8J50q5k02K29Ol18L88k32q5J91M7L1k40o3L66k7j7n3l7j47j6L44j79
$$ plain form
3652 141 40 145 323 47 28 79 51 -39 -78 -106 58 -69 185 53 11 -124 -267 109 -52 80 -61 113
3674 113 102 -118 -61 -39 -206 148 120 -103 -12 -44 -121 75 -147 -137 -4 21 -157 15 122 56 136 -117 66 82
3698 82 35 173 -44 104 96 75 -78 -4 -212 -39 103 127 11 97 11 -285 164 -131 141 2 131 -38 154
3721 154 -127 -362 31 -193 7 -12 142 -297 -56 57 -7 5 300 123 101 54 -258 -46 -65 4 -184 -20
3743 -20 77 168 34 3 -206 -158 -239 145 -60 -15 20 -78 -64 5 -21 -128 100 137 -110 25 -75 -63 164 210 179
3768 179 -47 -167 153 -142 18 -78 -155 -146 -64 -76 -54 252 -157 -142 20 245 -25 15 -81 -122 220 -289 -316 81
3792 81 -49 22 -7 -236 187 -82 -45 67 -76 -120 39 -132 -160 369 258 32 116 -44 33 126 154 -5 114
3815 114 91 3 153 68 -134 95 101 -217 171 -61 -146 45 92 123 -117 -180 186 159 142 89 52 -95 -111 233 54
3840E4l31M58j82p9J54J67k10J34k01k15L31Q6j69L6j80K44j12l3K05k76J53j9
3862A5K30m07N3J08jj35J15oJ3J9j1q9L63j94k22J93j48L41k48k27K76P0N4k73
3886a11J66L3J33q9j10o2k3j06K31l7n1J46k05J43j47J27k6K12j89oj67J62k27
3909b03L33r3j40L28k38o0j0L13o8k57J35k8k5q1K8R1P6Rk03O7m6q8L45k42K02
3934A45l72J10K59l1J70k27r3k96M37j5k07K3J45m1rN6j18M5j23J21R4K5l15J43
3958g4O4p3K64j79n6q6P8K2o3r7oK94m3K09l46N6q3m8L80p1n2M5j35L8O1L9l14
3985a76q3K89J35N2k42Pr3J23k4R3k39J33j07P6J2j95P5K20j78l0K44j30j89K72
4009D5j1k58J35j34Q6m3J04J92Lq4p9L5j37l5J54J81k38l5J3%J33n9K11k18j9
$$ plain form
3840 54 -277 181 -1 -80 74 241 31 165 -36 -251 80 166 -3 33 -147 97 -15 -48 157 -119 34 15
3862 15 245 -162 -109 -1 -2 -137 -22 -28 -15 4 -7 -96 267 73 -149 44 -104 237 -11 -238 38 108 162 -111
3886 -111 55 88 221 132 22 -40 -63 -169 62 25 -26 120 -85 58 -89 38 12 224 35 29 -138 24 -203
3909 -203 130 37 -103 225 -13 -73 -83 230 162 -95 40 12 -13 -94 -66 25 101 110 -93 -26 -72 -160 185 -57 145
3934 145 -227 -117 142 111 281 54 -39 -335 102 87 -120 -97 48 7 -2 54 -64 -19 -142 -21 73 98 -217 -74
3958 -74 -10 -83 181 2 -54 -140 -62 -40 -103 -200 -206 88 45 254 -92 -36 -119 -167 213 142 90 135 0 38 99 138 -176
3985 -176 -259 30 165 217 -25 -18 -111 12 -12 81 -158 -25 -132 -56 -44 -239 -164 56 -122 -152 92 -38 -227 45
4009 45 34 -224 -89 -223 -137 -180 -76 116 119 35 -44 -9 -146 -181 -27 154 -84 -119 -106 -106 27 -32 179 -39 -58
4034e8M9J33k43j2K60l8J80j68j38K60n1o0j50J17j20j08K48j98K14j38p5l6Q7
4057d5J36k80P6P9L8j59J67O7j88j2K05j19j65M80k78L24m28K25J91k20Pm5j71
4080a15K9K10k1n2k67J16K10L4l52L24j12Jl9j95K06R6l9K9j15P2OP1l0j53J3
4105g3K1O3K26j91k6j9m4m2K00j75K27j87P2j76L5K4j03j5K58p7J30k8qj0j39
4130e7PK9r8K87j22l5K97l07J84j45R5j37L5K9j58P1n0R4k04L18k13j73O3O8J8
4155a04K05j20j79J86L7M2K9j17k2J43n8q2J41J06k0j00l09L10j78Q2j05Q3L34
4178C04m96K98J00j30j8l79K70K04r7P7k62M10l81R8J55k84K05Q2M9j38j97K66
4200A36k49J94k23L80j31j84K07q6M8k14J62j49P7J28k67M31m08J57j41L55k44
$$ plain form
4034 -58 -9 124 -119 -131 129 91 271 103 -35 225 174 114 -36 81 -39 -147 101 -97 117 -21 -96 -132 -45
4057 -45 91 -189 -113 -34 4 -155 12 79 -109 -121 84 -35 -200 280 2 326 -102 123 314 94 101 56 -115
4080 -115 -86 124 103 51 -216 -100 110 144 -208 116 4 5 -34 -229 -23 73 34 63 -52 20 26 97 67 -86 -73
4105 -73 -52 11 237 46 20 1 -43 -85 115 -60 167 -20 52 -124 -89 -65 -168 -183 75 -2 128 100 92 82 -57
4130 -57 -50 -21 -119 168 46 11 308 1 185 40 135 -2 33 62 -96 -25 -75 19 -185 133 -80 -253 -190 -122 -104
4155 -104 101 -19 -198 -12 25 67 96 -21 -43 100 42 -40 101 207 187 87 -222 88 -90 -8 -113 -30 304
4178 304 -192 106 206 76 58 -321 -51 153 56 133 -129 281 -100 -2 153 -131 74 156 205 67 -130 136
4200 136 -113 81 -142 238 107 -77 130 44 92 -122 40 -109 -32 96 -171 260 -148 9 -132 223 -21
4221b1n9J11K8o1l3K87k89r1Q4K16j11j70J58J55L7k32R3q5J52k72K51n1j97J66
4245F6j17K46k51o3J87j60J51J21j90j81J75K1pP9j9mN5o0j3P7j32P9o6o8L0J61
4271A17j45J7Q8k07J40J02k25Q8j05L49Mj63J30n06L47O1k79k5J76J20k20r1J19
4294a08N3N9j82J77l2L02k30K07j00k10k3j38L70l75K97j77j9J39j33J97N5p1
4316E8k0j03K73k9k21Q2J4J70j94j34K21j47R6k0J37n09J49R6J65j38K74k83J37
4339G4r4K33l48J12j53J03J51l20J50n0N6L42j70l4J62j70%l6k03J03N3J83q2
4362F2l34L13r1J46j26j15P2K3k97J65m3J85J6j7j47K01Q6j63Oo5J11L0J01j03
4386A6o9K53m24M74k95K30qj39k3R2m05J20K73o29M09r0J30L53l69K77o7k38J29
$$ plain form
4221 -21 -80 31 59 -2 -35 252 -37 -128 -44 172 61 -109 49 204 241 9 102 17 169 -103 148 97 -100 66
4245 66 -51 195 -56 -119 68 -92 59 180 -10 -191 -16 5 -2 77 58 54 109 49 36 113 -19 60 -6 -74 -44 117
4271 117 -28 -11 77 -130 10 112 -113 -25 -130 219 223 60 190 -316 31 92 -187 -212 -36 84 -136 -227 -108
4294 -108 -55 4 -178 -1 -33 269 39 246 146 -64 -87 -225 145 -230 67 -110 -129 10 -123 74 129 58
4316 58 38 -65 208 179 -42 40 54 224 30 -104 117 -30 66 46 183 -326 -177 -81 84 -54 220 -63 74
4339 74 -20 213 -135 -23 -176 -73 78 -242 -92 -142 -86 256 86 52 214 44 44 8 -195 -92 -39 144 62
4362 62 -272 41 -50 96 -30 -145 -73 -50 -347 -182 -225 -40 -24 -41 -188 13 99 -64 -58 -123 -12 18 119 16
4386 16 -53 200 -224 250 -45 185 177 38 15 107 -298 -178 95 -534 -125 -215 -85 268 -101 176 109 -129 0
4409@J05q2J06j53K4J89n5M8r4j92K46j47r2J14J00J73l16K47n18K05O3j61J28
4432f2L8q9K66n4J8j36J85o2j28o0Nq7k6L16j63P5J41j99q1K16j74J80j72J93
4456A40r7k73Q5J58LL5j97J68N4j77J07j05j07Q5R1M6J07k78J67J04k07k5O6L33
4480B83l39K34j60j24K24q9k19N1J31J05r4o7K26j11L9m1n9MJ18K0j87j82J30
4503a07K58k23J85k05k9J92l07K15K36k48j77J65l5M8q7J78J91k29p1J32n5K81
4525C08m04K2Q2Q6k04M87k73P1m47L71k2q1NK3l5J13k9k79L46l83K61J21j26r6
4549h3R4j18K3j1J59k4q1R5k9j80J78l77K50J82k37j70J83L00k78K37p8J46j58
4572B3j46K60l36J10j74M68k94J40j19K14k07K78j68k17K44k91K26n9O6j01J48
$$ plain form
4409 0 105 23 129 -24 0 189 134 182 88 -104 142 -5 -97 17 117 290 -26 221 -297 -92 -29 -190 -62
4432 -62 -24 -113 153 99 117 -19 166 104 -24 -84 -79 -166 -192 124 -39 36 177 -22 -103 113 -61 119 -53 140
4456 140 43 -230 -145 13 16 51 -146 22 76 -101 6 -99 -206 -121 -30 16 123 -155 12 116 -91 -116 -50 283
4480 283 -56 178 18 -106 118 29 -190 -139 -8 97 3 -64 162 51 90 49 -10 -6 112 132 -55 -237 -107
4503 -107 151 -72 113 -92 -121 71 -236 -21 215 -33 -210 -45 -80 -32 -119 59 250 21 -50 82 27 308
4525 308 -96 -74 8 94 -110 377 104 175 -272 99 77 -4 1 24 -11 102 73 -206 140 -243 18 139 13 -83
4549 -83 11 -107 -84 -95 64 40 -41 54 25 -155 23 -354 -104 78 -159 -329 -146 154 -124 113 35 181 23
4572 23 -123 137 -199 -89 -263 205 -89 51 -68 146 -61 217 49 -168 76 -215 11 -48 18 -83 65
4593F5j83J25O5k78j14K14K54k52P0K84n9j89kj94J31O4K65K1k79J88k09o0j4
4616h7J31J23k86M8J7j20K54j6o2K3R7k94L05l18K92j07j97k0K30R6k68J48j47
4639a58m2K93j3P4k80J73oj24J62J1P1J23l99K55j58j33M02l50K10n8k78P5K65
4662A15l42J23J53o4P6j20J24L2lj74q2K05k45J86rm4L72l21o8J42k62K12q4n4
4686a32L52j61P7j73J60Kj32k13J36m7J66j43j3J56J9j68KK49j05j9P8j51N8K10
4710B08k00k9J95k92O7L86l48J5Pkn5Q7j72J74n3n6N6j44O6P2P5k7J84l17K05
4735A02j76K07P6j10j14j0N5k2rK66k47J27q2j09MJ61mr1j33J86k24J89j86P2
4759g2J21O8k77Pj52M22o0k02J62q5m1L33l73L40j35J65m25L23Ql7j4k50K80J9
$$ plain form
4593 65 -118 7 72 -206 -320 -106 148 -104 -34 250 191 2 0 -194 -63 1 266 287 8 196 -13 -73 -87
4616 -87 44 167 -119 -71 -54 -174 80 64 2 25 122 -172 133 -185 107 0 -197 -217 13 109 -159 -11 -158
4639 -158 -200 93 80 154 -126 47 41 -83 79 90 161 284 -115 140 -18 -151 251 -99 111 53 -225 -150 115
4662 115 -227 -104 49 -15 61 -59 65 97 94 -80 -162 43 -202 -16 -25 -69 303 -18 -86 56 -206 6 -78 -132
4686 -132 220 59 136 -37 123 125 -7 -220 -84 -131 35 -108 -121 35 54 -114 -112 137 32 13 91 -60 -2 208
4710 208 8 -21 174 -118 -51 335 -13 2 9 7 -48 39 -133 41 -12 -68 -12 -156 -90 -18 57 30 214 -103 102
4735 102 -74 133 209 99 -15 -25 30 8 -1 265 18 145 63 -46 -42 119 115 24 -109 77 -147 42 -144 -72
4759 -72 49 117 -160 -153 -305 117 57 -145 17 -68 -109 224 -149 191 56 221 -204 119 127 90 76 -174 106 125
4783A25P7k81P3j88M3j04l8L01r7k58J81J62rOP5l7j07L02k47K54m6pk72NJ14
4808B7k54J39m9M32j98j87j36K46j8QQ8K1l95Q59j44m99N3l12L90l11M23j47n0
4831a4M9p0J36K34n25J68M02k28o6J5j48L5j61J47L7k54K51j23O1k95QK09N6j5
4855i1N0K25jO%J57j80r7Q9p1k62Q2J89j96PJ59J38j80k0K94m33R8K54j74j28
4880h5NK92j83q3J70j58j57K84N1kj27R9J12pL4k78J22Q4n6j53j06K33%k62Q5
4905h6M5k62L19o1j20N9J3RK64N9k61J24l5j08JN9r9J67%p2J06j12j25O8P5R4
4931A21k28J08k15K34j56J3K65M9l35L09K0l89J28K3j18L9R0J58j31k33K60K35
4953B47p5j01k1j96K7L96j32k03j27K25j24l3K72k21k47K22p3J55J07K41n6j49
$$ plain form
4783 125 202 -79 -6 -194 -151 -255 -293 8 -89 -347 -166 -4 -13 -7 68 31 -76 226 -21 233 187 180 -92 -87 27
4808 27 -227 -88 -137 295 97 -90 -226 20 2 10 98 119 -276 583 439 -60 -7 -319 71 -240 183 36 -14
4831 -14 35 -35 101 335 -190 -22 380 152 86 101 -47 -12 -173 -26 11 -243 8 -115 -54 -349 -341 -132 -76 -91
4855 -91 -41 184 183 189 189 346 166 69 158 87 -175 -93 96 -100 -93 66 204 24 4 298 -135 -37 217 43 -85
4880 -85 -80 212 29 -54 116 -42 -199 85 136 134 7 106 218 211 245 -33 89 173 117 -36 -142 91 91 -171 -86
4905 -86 -41 -303 16 -45 -165 -106 -93 -84 180 239 -22 102 67 -41 -40 19 -80 87 87 15 121 9 -116 -48 27 121
4931 121 -107 1 -214 20 -136 -123 142 191 -144 165 185 -204 -76 -53 -171 -132 -42 116 -15 -248 12 247
4953 247 172 71 50 -146 -119 277 145 -58 -185 40 -84 -117 155 -66 -313 -91 -164 -9 98 339 283 134
4975A34j16J16j53J68r3k51RL61k39j11J28k9K01Kr5l0j62J59j27j56K90j47K61
4998A20k8r4p2J45k26J7K70k93J34K00j56j17M9O3Mj0K23n36L55o6n6K37Q3n22
5022b76K13J22k86J68K4m3M8K0J3l6P5j8Qp7R5J32o5P9k18J63M4J4l43M17j67
5047A06J12p8j02J68j22K0J33k34q5p8l2K82j37J78l58L41j63k20L88l36K56K03
5069B42j50J06k37N9M8l0K33l90K18O9m1j75K75l39OO8k69L89k77J22J42j71M8
5092e4nJ08j92P0K42o3j17J8J47q3Jk4M7j28K10j46J34j21Lj19m3o2J52L8j48
5117a35l8K07Ql9jj76J95Q4j47J03k54J52M5o1j30J94K52k95J47j35J18k2j60
5140h8J18k63J78J78k59N9k1P6q9L84l54K52l51J67q3lk2m0R1K45k06j62L35j79
$$ plain form
4975 134 18 134 -19 149 56 -195 -186 175 -64 -175 -47 -76 125 127 32 2 -160 -1 -128 -284 6 -141 120
4998 120 92 -2 -74 71 -155 -138 132 -161 -27 173 17 -100 -51 12 16 6 229 -307 48 -18 -74 163 246 -276
5022 -276 -63 59 -227 -59 -35 -78 -30 -10 3 -33 42 24 32 -45 50 182 117 196 -22 141 185 199 -144 273 106
5047 106 218 140 38 206 84 104 237 3 -82 -160 -192 90 -47 131 -227 114 -49 -269 119 -217 39 242
5069 242 92 198 -39 20 68 38 271 -119 99 168 127 -48 227 -112 -106 -38 -307 82 -195 -73 69 -102 -54
5092 -54 -59 49 -143 -73 169 106 -11 7 154 71 72 48 95 -33 177 31 165 44 47 -72 -115 -177 -25 13 -135
5117 -135 -173 34 42 3 2 -174 21 105 -42 61 -193 -41 4 -57 -187 7 259 -36 111 -24 94 72 -88
5140 -88 30 -233 -55 123 -136 -77 -98 -22 -111 273 -81 171 -180 -13 -96 -99 -121 -161 -70 175 -31 -193 142 -37
5164c7j01K80k05K77l42J22N3q8OM8J0Q7k44K62M6Mj8j65K45r4k35K71l20K52
5188A14l33K25j87K61k09J27J19p1K02l04J99k8k7j46L5J66n5q9k70K35n0R3J37
5211A44j95J05j06j39Q9M8K51j12j30oJ60j91K16r9Q3o2j72J53j58j14J38j53
5233b50K42Q0Q3k45K7K24m7j14o9L3R4R4q2j23k65L16k14J37l7R5L1K10j70J64
5257B14j29K2Oj60J16J37k07J03j93l5N2J59%l35K4J46J64l51J50r2J36P1K35
5280B33j39j38J41J09k05J35j29k04M22o6k06J94j06n2J3k8P6j4Ln9n1J70j3j08
5304b2J07j32k16M4J61J85k91j59J24L20k24J03nj89L52q2j92O4Kj91J13L6N5
5327c7l07l6K34j69K47k63M69j91J60j63M9Q9K07k22O4p2Q9j87j4J76L9l7J37
$$ plain form
5164 -37 -138 142 -63 214 -128 -6 47 -41 -35 13 23 110 -134 128 174 178 160 -5 240 146 -89 182 -138 114
5188 114 -219 6 -181 80 -129 -2 117 46 248 -56 143 115 88 -58 -23 143 88 -1 -271 -36 -86 7 144
5211 144 -51 54 -52 -191 -102 -54 197 85 -45 -51 109 -82 134 35 118 56 -116 37 -121 -235 -97 -250
5233 -250 -8 72 155 -90 -63 161 114 0 -69 -36 58 152 70 -53 -318 -2 -216 -79 -116 -21 10 220 50 214
5257 214 85 107 113 -47 69 206 -1 102 -91 -126 -74 85 85 -250 -226 -80 84 -267 -117 -209 -73 -2 233
5280 233 94 -44 97 206 1 136 7 -197 225 159 -47 147 41 -11 2 -26 50 36 39 -20 -71 99 86 -22
5304 -22 85 -47 -263 -219 -58 127 -164 -323 -199 121 -103 0 -5 -194 158 76 -116 -52 -50 -241 -128 -92 -37
5327 -37 -344 -380 -146 -315 -68 -331 138 -53 107 -56 -7 82 289 67 131 59 148 -39 -53 123 162 125 262
5350B62j96n1rJ75k18K21j18K46k15RM62n49O9o1k2k25K45r8r3Q0J03J47k24J83
5374A23j22N5j40J96p5K82p6l26J06pR5j88j02N7n8J37o6M6j33J35J87j24J0M9
5398F1j57K28j23L0M7ol20J01K44j01K2j66K76p2M1L4j53J36k23K71k60K23j88
5421e5p8P4p2l8M3K53k91oJ79Q2K3o6R9j73J28q4n5LO1j25o7J97r1k73J52J02
5447g8%J72j31o1R5K28m07J0J98M1R9k45J09r3J23j26J10k02K20q3J63j29j58
5470a45K78K5N9k72R0k3K4m2j84J59K34m87L19j3P8Q3ol6j90K4J6p0Q4J20j75
5495e0Q6N6j76p2L26l10K39o5O7j4k10J68k74L37jN5j13L1K4j10k7j37K61m3j25
5520g7K40j61j33K21p9q5k3J03P8l55L23p9J9L0L8j26j38J37L78l36j46L30j08
$$ plain form
5350 262 66 15 6 181 -37 184 66 312 97 106 568 19 88 27 5 -220 25 -73 -166 -86 17 164 -60 123
5374 123 1 56 -84 112 37 319 243 -83 23 16 111 -77 -179 -122 -180 -43 -109 -63 -196 -61 126 2 12 61
5398 61 -96 132 9 39 86 80 -240 -139 105 4 26 -140 136 64 105 139 -14 122 -101 170 -90 133 -55
5421 -55 -133 -59 -131 -169 -126 127 -164 -170 9 91 114 48 147 -26 102 18 -37 -34 27 -98 -165 32 -59 -332 -180 -78
5447 -78 -78 94 -37 -98 -3 225 -182 -172 26 67 166 -79 30 -63 60 -66 44 -158 62 -21 142 13 -145
5470 -145 133 158 217 -55 35 12 36 -6 -190 -31 203 -284 35 22 100 183 177 141 -49 -25 -9 -79 5 125 -50
5495 -50 36 92 -84 -156 170 -140 99 34 101 87 -123 45 -229 108 107 162 49 80 104 -6 -33 -170 91 48 -77
5520 -77 163 2 -131 90 11 -74 -97 6 84 -271 52 -27 -8 22 60 -66 -204 -67 311 -25 -171 159 51
5543E1o5P7k19J93J00k13J17J3m1N5k15O7K68Jk34P5kM9m3L1k5k21K48j1K2n1
5569B7q5j6j01O4L03m45K76J61q7Op9R4m1j35J21nQ3j72nOJ83j52N9j45J53l6
5595C2j22j22j4K67J58k83J26J99l33J61k85J78J97R0k28Q5j73K83Kn8j81j02
5617a23K06k49L02k37L02J6l26J45M7o4J4J74l20K07K7K3k67Q7J7J3n0K20k40
5640g6J18K54k48k4l06L24k8J3K3J35m74K64k07J92l4J59P1k49L53l65P9k5J23
5663G2L4M5j37m7J45j0K68k38k18k85M13j58K92k1l93M2J25K09m5M1j06j22J29
5686C5JJ09k79J13j77J46M1J46o8J62k14O2o2j10L4m6%Q4J26l67J74K46l10L50
5710A96k6k96K04l67NL45j69K08j84Q2rq4M0Qj36o5L01L0k05J87k23K40p1j85
$$ plain form
5543 51 -14 63 -156 37 137 -76 41 54 13 68 -147 -80 188 189 -45 30 28 77 34 65 40 -181 67 56 78 27
5569 27 -58 -74 -175 -111 192 -253 23 184 97 103 24 118 77 -58 63 58 141 -31 -36 -30 153 1 60 -85 68 32
5595 32 -90 -212 -226 41 199 -84 42 241 -92 69 -216 -38 159 249 21 106 -67 216 218 160 -21 -123
5617 -123 83 -166 136 -101 201 217 -109 36 83 19 33 207 -113 94 121 144 -123 -36 -19 -6 -56 164 -76
5640 -76 42 296 48 24 -282 42 14 27 50 185 -289 -25 -232 -40 -74 85 156 -93 260 -105 -26 -51 72
5663 72 106 151 14 -33 112 102 370 132 -86 -371 42 -116 176 155 -238 -196 -71 138 93 134 28 -94 35
5686 35 36 145 -134 -21 -198 -52 -11 135 67 229 15 77 15 -95 -61 -107 -107 -23 103 -264 -90 156 -154 196
5710 196 170 -126 78 -289 -284 61 -108 100 -84 -2 -11 -95 -55 -47 -183 -248 53 83 -122 65 -158 82 11 -174
5734a74n9R3m1L10j83P5R0qj02J75l14K58k11p5J10J13l8j01p7J05K34k96R9l
5758b0m1K1J04r3Q1r9J2K84k14J5P0j01r6LP7J94l78J24j89L98M9j2r2L1P1l28
5784a29L40l76L71r7r1P5m3j66l0K41m4n4J69l92QK53j7J38j4l6j38l7q8J97j58
5809a18J40k75J77K59k67N3k77M87k48J98k01L52j79j48Om9K24j79J26k74J87
5830fj90K01J02m4R4l04J33m7j87L18j59n3J92j37o8J77K1P7k20J31n6k57K33
5853d9K42k03OP2q4P4J9j84K96o3k16J84j35K89l55K37j66m0p9L32J38l75M0j58
5877a78J10MJ35L5k24M9n6L24k33O4p4R3oN7j48J46J01k6j56j69K29j70K31k47
5901a09J37R9k9j28M5j04O1k16M77l25L84k83pl8J34k12m6L47k74J65k70K44N3
$$ plain form
5734 -174 -233 -140 -181 129 -54 21 111 103 1 176 -138 120 -91 -166 -56 57 19 -82 -159 -54 180 -116 -17 -20
5758 -20 -61 -40 64 -29 52 -47 -35 249 35 50 120 19 -77 -74 3 197 -181 -57 -246 152 201 189 97 128 199 -129
5784 -129 211 -165 206 109 18 93 50 -116 -146 95 51 -3 166 -226 -218 35 18 156 142 106 -32 -69 -157 40 -118
5809 -118 22 -253 -76 183 -84 -31 -308 179 -69 129 -72 280 101 -47 -41 -90 134 -45 81 -193 -6
5830 -6 -196 5 107 63 157 -147 -14 -61 -248 70 -89 -142 50 -87 -155 22 43 120 -100 31 -25 -282 -49
5853 -49 193 -10 -4 68 -16 58 77 -107 189 126 -90 94 -41 248 -107 130 -36 -76 -155 177 315 -60 -20 -178
5877 -178 -68 -64 71 106 -118 -69 -125 199 -34 30 -44 49 43 100 -48 98 199 173 17 -152 77 -93 138 -109
5901 -109 28 127 98 -30 15 -89 -28 -244 233 -92 292 9 2 -36 98 -114 -160 187 -87 78 -192 52 105
5924A05j55o6P5K9J29L5j33J99j38j7K4k15L30j50j15Lk7K64j33J24q3M9k15K03
5948A22o7PJ0K4j35j8J85po8j93K57j45O6J57Rk41Kp9M4k03L54r8q3J77J11k39
5974e1M50l33k18J31J95ll93L01N1J35q3m3L3j78j19Q3r8R1MJ99m85N01k57J31
5998D4P4k27J44L7k14K07n9j61J12J08j72O8P2Q9j56J17j9r0n3K43k7l14K26J31
6022A80k17O0K02k32o0J12j20L9R1J36o24L14K16PJ05k21J19k02K19o9J03k17
6044e9P0N0o5J09j36J52J24l74K98l61pK54j80L82k43O7l55J69O7O2j24J21K8
6067D9j96L44k52Q7K33k93l8k10J98J72Q5j43l1j21R6J96k58J37J22l43J71m0
6089c5o4J16l9L9j31N1J12J54l83J95LK1K2j13J1pJ66m4j06O1q4L8j36K36O0k86
$$ plain form
5924 105 -50 -116 -41 -12 117 152 19 218 80 63 87 -128 202 52 -63 -60 -87 177 44 168 85 134 -81 122
5948 122 55 62 72 96 -39 -57 128 121 53 -140 117 -28 38 195 204 -37 -35 -114 -70 -273 81 -17 -100 77 188 -51
5974 -51 399 66 -152 -21 174 171 -222 79 130 265 182 139 172 -6 -125 -42 -140 -49 -45 154 -331 170 -87 44
5998 44 118 -109 35 72 -142 65 6 -155 -43 65 -107 -39 33 122 -34 83 64 -26 -79 164 137 -177 49 180
6022 180 -37 23 225 -7 -67 45 -75 -36 55 191 -433 -119 97 104 209 -12 107 -95 124 55 158 -59
6044 -59 11 61 -4 105 -31 121 245 -129 169 -192 -199 55 -125 257 14 81 -274 -105 -38 24 -100 21 49
6067 49 -147 197 -55 32 265 -28 -66 -276 -78 94 179 36 5 -116 -20 176 -82 55 177 -166 5 -35
6089 -35 -99 17 -22 17 -114 -63 49 203 -180 15 18 39 61 -52 -41 -48 118 74 -32 29 -55 -17 -153 83 143 -143
6115a43K95j97j03k20L25J3J12J7k40J83J3j30j26N09l05o1L3K97l27j3L1N8m6
6138b5L0P9m1j48r9J80j93J47K37j62Q3J8j83J94K5r7k36K06k9K0k10J60J2K47
6162B15L7k55J97K1k26j37J66m6J01r6k30N51k52j70L09k12p8J30R3j47J07k40
6184a62R0J87j90R6J7j60%J11j1N2J81j43k79J49o6O5l7K34j46j40K06O0j13m1
6208d0R8J24l90J23O0j06l9J81N8J38j54j74K19l31L2K22J98k87Q3j5q2O0Jj41
6232a62J99J89m84P5K83L1Rn5j3j0o1Ql6j30K99q9J4kn5k09L57r4J27J0l0j4m5
6259A12n0k33K23j44P1J96k80Q3r7q8J11L8L3K90m15K53k15J99k71J29J00j02
6281e7J15j76M6J70R3j31k13J35J68q5j17p8J33o2J23j21J45r6r8M10j45m35K28
$$ plain form
6115 -143 152 -45 -148 -368 -43 -30 82 99 -141 42 55 -75 -201 308 3 -58 -25 272 -55 -68 -37 21 -25
6138 -25 5 84 43 -105 -204 -24 -217 -70 167 5 88 106 -77 117 142 45 -191 15 -14 6 -204 -44 -32 215
6162 215 252 -3 194 215 -11 -148 18 -28 73 -23 -253 298 46 -124 185 -27 -105 25 118 -29 78 -162
6184 -162 -72 115 -75 21 38 -122 -122 -11 -22 30 211 68 -211 -62 -128 -63 -100 134 -12 -152 54 114 1 -40
6208 -40 58 182 -208 -85 -25 -131 -170 11 69 207 53 -121 98 -233 -201 21 219 -68 15 0 -82 -22 -21 -162
6232 -162 37 226 -258 -183 100 131 140 85 72 62 1 9 -27 -157 142 53 67 65 10 -199 158 64 191 201 171 157 112
6259 112 62 -171 52 -92 -21 175 -105 -22 -119 -207 -96 -58 -25 265 -150 103 -112 87 -184 -55 45 -57
6281 -57 58 -118 -72 98 191 60 -153 -18 150 65 -52 -130 3 -59 64 -57 88 -8 -106 304 159 -276 -48
6304d8Rk46M19k17N8j9J02J04l46N8J70J38o7j07R1o6l0K71l82L30j63qp7q9N6
6329e9J46q5M2k4j9K48J03n93N83l03M1p9Q1k5J43j46j3k86L76Rk35J40p5J93
6353A63rk84J26J12j33J22j10l5K01l28L84k14O6l04K70m8K12j27k75K09k40M54
6375B12k24K33o7q2j7j99J70N3Q8k00J98j34j17J69k40K18J01j12l30K25K28o8
6397A05q2p6r2J88r7q6p9K87j8p6J56j38J40j84L06j78j63J32r8J27P6o5k13J97
6421F9j99N2J61j51J76k7j30k9k03K07K76l35J29O2n1P4m3N3q1p6n7J85L2p7m2
6446b5K6J42k74K73p3O2l3Q8J52k54q7J37O6k78L4j16kK31o2j22L39k03j01J34
6470E4J15l05K51k16O8J71j14R6j36mj68K44J37j39N2O5J3m5k72L33J3j39k98
$$ plain form
6304 -48 -39 -285 134 -83 -25 -44 58 162 -184 -126 44 182 115 8 99 33 3 274 -108 222 59 51 -26 -115 -59
6329 -59 87 2 44 20 1 249 352 -241 342 39 80 1 82 57 200 54 41 -245 131 140 -95 45 -30 163
6353 163 154 -130 -4 108 -25 97 -13 -48 153 -175 209 -5 61 -243 27 -21 191 64 -211 -2 -242 212
6375 212 -12 221 154 72 55 -144 26 79 167 -33 165 31 -86 83 -157 61 162 50 -280 -55 173 105
6397 105 23 -53 -145 43 -54 -140 -219 68 50 -26 130 -8 132 -52 254 76 -87 45 -53 74 150 85 -128 69
6421 69 -130 -78 83 -68 108 81 -49 -78 -281 -74 202 -133 -4 58 7 81 38 91 10 -66 -123 62 94 17 -25
6446 -25 1 143 -131 142 69 131 98 186 338 84 -3 134 200 -78 -44 -160 -162 69 7 -115 224 21 -80 54
6470 54 169 -136 115 -101 -33 138 24 120 -16 -20 -188 56 193 54 106 171 184 139 -133 200 213 74 -224
6493b24J94O0N2j40lo0K73j79nM0K7lJ05j45J42L2k72O9R0K3q9Q0K5j4n7K52k87
6520a4J94m01J75K13q9l7n6J44k56l0K87k48K01k67J84J3R4j2np6j67J24P9j15
6544f5J32k87M82k61M3j0j93L37j68j53J55j31j50Q1J83o7j06K32j09R6j1J39
6566A69j63J53l03Q5J85j37K46m4o4j68J92j6q4k73K02r6N4r6K45k1K3m4o9J16
6590I2L1J02l09R9J20k46J1J1j63J25O7m2J41ok6p6qK16Nj58r3K51o7J27n26M75
6616A53Q3j12j56l9J71l09K01L07k57N3k55O8P6J06K1J34l13j71K68M4l77K65
6638c9K29r0k89J46J01j34Q8j14M1J44l3j7L7J33n10J90Q4j55K64k21MN2K99k33
6662b3J79k71P3N9j82M7K24j66K73l12R6J69k41J60L9m6l89M11l8n3p2j25k2J
$$ plain form
6493 -224 -30 30 82 -58 -61 -121 152 -27 -32 8 35 32 137 -8 134 166 -106 -37 53 76 -13 67 92 78 21 273 -14
6520 -14 180 -221 -46 167 78 41 -15 129 -127 -157 130 -118 83 -184 0 13 107 95 90 14 -153 -29 50 -65
6544 -65 67 -220 262 1 44 34 -159 178 10 -143 12 -119 -269 -188 -5 -72 -178 54 -55 41 30 169
6566 169 6 159 -144 -59 126 -11 235 191 127 -41 151 135 51 -222 -20 -116 -62 -158 87 66 89 45 -24 92
6590 92 123 225 -84 15 135 -111 -100 -89 -252 -127 -60 -102 39 33 7 -69 -77 139 144 -14 -107 144 77 204 -322 153
6616 153 236 124 -32 -71 100 -209 -8 299 42 95 -160 -92 -16 90 111 245 -68 -239 29 73 -304 -39
6638 -39 190 100 -189 -43 58 -76 12 -102 -61 83 50 33 70 203 -307 -117 -33 -188 76 -145 -141 -89 210 -23
6662 -23 156 -115 -42 17 -165 -118 106 -60 213 -99 -3 166 -75 85 124 78 -311 100 62 9 -63 -188 -210 -209
6686b09K87j24Q8l1M4j7j30N2N5J4j47K92l97K15k2o7K0M25l96pJ49j02J48j53
6710a3j5r6R3r3L94j81K8l67J67P3K87l22L2K20p5j97K65j37j77J2r8L28k65J94
6734E7J5q3o9J48j68R6l9l4J88j45K44m14m1J98J25q8j6J93j26k64J21K06k77
6757a73J54N8Pq8k22K10MM7o2J91j57J14m9J14L2j98n7K00k85N1K22M3k50O4m5
6782g5L6n8J94k55K06n1K0K92k23j72J28K9m6q3P2Q6J69j35l17K26j37L24k34
6805dl2jL0m33M43R4n2k3l8k2J36q0l11K47P1k32K84n8J88k90q9K94k46J71k02
6830a55L45r4k48O5J60k77L59J99m24J23j91J69p1lo6J98r1Q0oj32J65k25J01
6853a9J55k84M71l19o2J07l8M7j23J91j74PQ3J29l83N2J21K43j48l0l0j02L4q5
$$ plain form
6686 -209 78 -46 42 11 55 38 -92 -40 15 29 -118 174 -223 -8 -30 -97 -77 348 -48 -55 94 -8 140 -13
6710 -13 -28 -124 -31 -124 270 89 117 -250 -83 -10 277 -45 -13 207 132 -65 200 63 -114 -102 -200 128 -137 57
6734 57 72 -11 -80 68 -100 -4 -43 -77 111 -34 210 -204 -245 -47 78 -10 -26 167 41 -223 -102 104 -173
6757 -173 -19 39 46 -42 -264 -54 -50 -3 -65 126 -31 83 34 148 180 -18 -75 125 -160 -109 113 156 -94 -30 -75
6782 -75 -39 -97 97 -158 48 -3 17 309 86 -86 42 71 25 -58 14 100 269 134 -183 43 -94 230 -4
6805 -4 -36 -37 -7 -440 3 97 45 22 -16 -38 98 18 -293 -46 25 -207 77 19 207 -83 -172 122 -124 47 -155
6830 -155 190 96 -152 -87 73 -204 155 354 -70 53 -138 31 -40 -43 -109 89 -2 78 72 -60 105 -120 -19
6853 -19 136 -148 323 4 -58 49 11 58 -65 126 -48 -41 42 171 -212 -160 -39 204 56 26 -4 -106 -72 -157
6877a57J88j34k2K81j25n1o2l1J00J14k2j90j16K86N4j8L6J59l28J06L15r09K14
6900c12K03L3r7K51k15J08Rn9k1k4J51k1K33l22q7L27m28L39j06M5j00N9j58L0
6924a62L49j24N1j64J95o0j33m4N5k57K05L6l03L66k24J31J87k0k07k5J23j22
6946a47N95q32K56Q6j18Nm2L28m53l47J071q66Q16l3l45k09K16L79j02j52l31
6967b25K90l76k02M42J0L19l99l1L17j99P4K01j80N5J96j78M3m51L74mP8n8Q9
6990A85k44j6N3N9o4M0R9N7j12m7j09J41k19J18J6o7J19JJ65k56NL7J30O7j05
7015E3qK49n04J34K19l7k1P98j576Q10R3k41q5J58N08k13r18J44O54p04M95K48
7037B56j181J255o19L13k66J32K22k89kK39O9j53r4J65j9JMJ9k74J19K02l40J53
$$ plain form
6877 -157 31 -103 -125 156 31 -20 -82 -113 -13 101 79 -111 -227 59 113 95 131 290 -38 68 383 -526 -312
6900 -312 -109 -76 -173 78 -137 -29 -20 -79 -100 -124 27 6 239 -83 -170 157 -271 68 -38 7 -93 -34 -192 -162
6924 -162 187 63 114 -50 145 85 -48 -92 -37 -294 -89 -53 -356 10 -214 -83 104 84 -123 -148 -25 -147
6946 -147 448 -384 -128 -42 -160 -155 -197 131 -322 -669 402 -464 352 319 -26 -235 -19 360 258 106 -225
6967 -225 65 -311 -513 -71 -61 258 -141 -172 145 -54 20 221 41 96 292 114 157 -294 80 76 154 96 185
6990 185 -59 -75 -22 37 -27 13 112 169 57 10 -99 42 -177 -59 -43 -110 9 10 175 -81 -76 -39 91 158 53
7015 53 45 294 -210 -76 143 106 85 883 -693 117 210 -31 -116 42 550 337 -581 -437 217 -487 8 256
7037 256 -925 330 -289 24 -242 -110 112 -177 -179 60 129 -24 -118 47 28 29 33 52 -222 -103 99 -241 -88
7060h8j8J33j71J81j2J65k00M9K86m74J86q3JK60m66K44j43J88p2J4j14J50o5
7083d9P1J48j62j23K57k12J12j64J80o3N6j15p8K40n3j14J26J52m67K78K8j62
7105a14j59K25N2j79J33q9K1L08r3j42J83n4m39L64j7rk29Q8N7J93l00J87L61
7128C48j12k35j19J86j58O1J34Q5m78J53J66l1J1J7J4K07k71l3J98r2j35j5j6
7151a15l0%n1O9K68J23l03p6L08k40K8J45l57J05J39m4N4J02J2K9r5J54j62j42
7175g9kL9M0J49k66OJ38J00Q4k15N05p42M62l73j0k6L9K68j51j98M13n0r4r7N1
7200iMj8J2j14L26k98J24O9j11j72K23l9J7J04R9p1l38K60L87o69J70L7j66L31
7224A58j40l7J31J91n19L28m4l1nk00P6P6N0R2N6Rk83J02n8o0JK41q1R0k84m3
$$ plain form
7060 -88 -106 27 -144 37 25 190 -10 39 325 -149 37 -46 -45 215 -251 -7 -150 38 -34 -20 -134 16 -49
7083 -49 22 170 8 -115 142 -70 42 -122 58 -5 51 -64 -142 98 45 -69 57 209 -258 20 48 -114
7105 -114 -273 -48 4 -175 -42 -131 -110 198 105 -37 146 92 -347 17 0 -9 -238 -150 -93 100 -200 -13 348
7128 348 236 1 -118 68 -90 -29 105 190 -288 -135 31 0 11 28 42 249 -22 -55 143 51 -84 -99 -115
7151 -115 -145 -145 -196 -127 141 264 -39 -115 193 -47 -19 126 -231 -126 13 -31 23 125 137 166 71 225 63 -79
7175 -79 -81 -42 -2 147 -119 -113 25 125 209 -6 499 -243 219 -154 -164 -190 -151 117 -34 -232 181 131 37 -60 -9
7200 -9 -5 -23 -11 -125 201 -97 27 96 -15 -187 36 -3 14 118 217 146 -192 68 455 -214 -44 -7 -173 158
7224 158 18 -19 112 303 -216 112 68 37 32 -168 -92 -16 34 126 182 191 -92 10 -48 -108 -107 134 53 143 -141 -184
7250a84J46j20N0J81k76RK01L89k93J9k74K10j23q6L0R4l1J37q5J85M6l88L10
7273A47j68K27J05l02L29l77Q3q2J23j16k3P8Jn0o4JK6p2J93J08J7k76L53k84
7297b3j13R8r1J35l2K55l75J28K38l51M12j01k96P4K52l32L64j45j0o4j70K12
7319F5k42J97j02K36l02L15j48r0L0K60k28j80O0L42j81p8j96K73o4M2q6M7J64
7342A34j84n5R6J06J60j64m4k17J72K11l75K75k02J60n5K20k00j59J20l1J50j31
7364a3M9mn8K12j57L49l61j47J0M10m8l55L32k57j1l1J17j60j3P9k9L00l71J61
7388Dj5J01j58J61j18K32n1j42j05Q3J54k45Q6J06Ok27J3R0M0o4o5L17k38j22
7412a57K67k2j27k65K52K42r1O4J04r2m16p6K52qj89L57k77K15j47L1k64N82l94
$$ plain form
7250 -184 -38 -158 -108 73 -203 -194 7 396 103 122 -152 58 -65 -151 -121 -27 -58 79 -6 179 225 -163 147
7273 147 -21 206 311 9 338 -39 44 -38 85 -31 -54 24 25 -25 -89 -88 -62 -134 59 167 184 -92 261 -23
7297 -23 -136 -38 -129 6 -26 229 -146 -18 220 -131 281 180 -116 -42 210 -122 242 97 87 23 -147 65
7319 65 -177 20 -82 154 -148 167 19 -71 -41 219 -9 -189 -129 213 32 -46 -242 31 -33 9 -77 -30 134
7342 134 -50 -105 -9 97 257 93 49 -168 4 215 -160 115 -87 73 18 238 38 -121 -1 -32 118 -13
7364 -13 36 32 -26 186 29 378 17 -130 -120 290 242 -113 219 -38 -49 -80 37 -123 -136 -57 -86 214 -157 4
7388 4 -11 90 -68 93 -25 207 156 14 -91 -8 146 -99 -13 93 99 -128 -115 -25 15 -49 -114 203 -35 -157
7412 -157 110 88 -39 -304 -52 190 99 163 267 175 -241 -317 -65 -73 -262 95 -182 33 -114 -83 -347 235 -159
7435a59Q6J26n1J23j96J04P2l16L24j48P0p4J39r4J32R2j88j43K14J59p0k82O9
7458a1J08J5r4o3P2P6M3k19R1O9r4J72p7K6m9Q8n6j66J84m1j24K00M9l36L54k29
7484a2o8Q6J39l18PJ23K93p12N03m5J48k17n5K84l4j26j33L22j86J21j30O5j20
7507f5J38p0j12L69q8k73j5O8k4J91j64K18r1R4k97o8L88M8k21J09j9j44j24L35
7531A83k5j88j11O0J76k18L85k22q5k5K79m39K53m8J20k45JL3J41L2j57K12r8
7554A4J64j15J2Q7l5J4L9k00K04m09J80J13k92K14j4J26j15j14K62l17K16J8j98
7577a46q2J37M8p8l2J49m2Q9J6N1j60j9L3K71l20K52l16K05j93J82k2k1n6o7L04
7602A83k09P7L5j33J60k0o0k8J61l65J2J44Nl0j24J15j8J32j92L55j31J26k78
$$ plain form
7435 -159 -73 53 2 125 -71 33 105 -211 113 -35 35 -39 100 6 138 230 42 -101 113 272 202 -80 -11
7458 -11 97 112 18 -45 27 103 146 -73 18 87 -7 165 88 114 65 153 97 -69 115 74 -50 150 199 -137 217 -12
7484 -12 -80 6 145 -173 -166 -43 250 -462 41 -4 144 -73 -128 156 122 -4 -137 185 -1 120 -10 55 -65
7507 -65 73 3 -109 260 172 -101 -116 -48 -72 119 -45 173 82 176 -121 -189 199 247 26 135 116 -28 -152 183
7531 183 158 -30 -141 -81 95 -123 262 40 -45 -70 209 -230 23 -25 95 -150 -149 -116 25 57 -100 112 14
7554 14 178 63 75 162 127 141 180 -20 184 -225 -45 68 -224 -10 -24 102 -13 -127 135 -182 34 52 -146
7577 -146 -228 -91 -43 -121 -153 -4 -46 43 59 110 -50 -69 -36 235 -85 167 -149 56 -137 45 23 2 -54 -121 183
7602 183 -26 51 86 -47 113 93 33 5 166 -199 -187 -43 -38 -68 -192 -77 -95 37 -155 200 69 195 -83
7625h3R7R0k56J08K27k06Q6k18j9O5J17J10j29ON9k08J37K12k80K68N0l03J91
7648A21j11j10K04O8j15k65L05j67Jj6J21m41M92K0j88QK16n2j8l05M11q9k89
7671a99L82k04n2J75pj44J03Kn8O2k11P1q3K15R4j07N6l11K2L42p6j63J19r1J96
7696A33l65K07q2L7r0Q5n8J20q9k9K61k1k8L4J21j64j83K33j04l38K59N3j34L7
7720a05J90r1K4k50L64k3k23L10l57L11j97J2o8M07m68L02k34L1n3K22j79J65
7742I0q3q4J91k07Q7R4q3m4M0j44K38j66m7O6M1J46j8k46q8L5j3J48l0J07j18
7767h8j65J30K17K68m54J21p9J39rl03J63k3M0j45M37J15l51o4J75j9j01K24l5
7790A93l42k5K0L38j7n2M3k33J27J41l63J29J90k8j70M4j4j64J09p8P3J66k48
$$ plain form
7625 -83 14 104 -152 -44 183 -23 63 -155 -174 -109 8 118 -11 -5 54 -154 -17 195 -85 183 233 -70 121
7648 121 10 -100 104 172 57 -208 97 -70 -69 -85 36 -405 87 107 -81 -73 143 91 73 -232 179 90 -199
7671 -199 183 -21 -73 102 95 -49 54 56 -2 60 -151 -80 -163 52 146 39 95 -216 -194 148 72 -91 28 -63 133
7696 133 -232 -25 -107 -70 -160 -75 -133 -13 -102 -131 130 109 81 115 236 72 -111 122 18 -320 -61 -8 -142 -105
7720 -105 85 -6 18 -232 132 109 -114 196 -161 150 -47 -35 -103 304 -164 138 -96 -65 -118 104 -75 90
7742 90 7 -77 114 -93 -6 88 5 -39 1 -143 95 -71 -118 -52 -11 135 117 -129 -217 -182 -195 -47 -77 30 -88
7767 -88 -253 -123 94 362 -92 29 -50 89 80 -223 -60 -83 -43 -188 249 364 13 -51 124 105 4 228 193
7790 193 -149 -174 -154 184 167 115 158 -75 52 193 -170 -41 149 121 -49 -5 -19 -183 -74 -152 -79 87 -161
7813a61q7J89n1K37j73J52k41J74M9k33J44KK7J8K55n7O7l40J04J2k86J80J28
7836A09j6N2k95L74n40N17j26j63j4K32k56j65K76J39j21N1j6k29L99j32n0j0
7858A6J9P4j23m9K96n10L70o6q0j04K11l7K50n20L85K24l65L1j55R6j05n1J50
7881d3K70l70M37l29J01J07j69oL0K2J30j48Q3k39L14j72j30J72l2q7R0Q1j07
7904Ep6Q1J94l27j4N8J48k50L01P7k30q8j23L5nP5K38P%l64K06Q0j15K08k87K73
7930A07m5k45J36J1k6l6j79J07Q2L32p7k08J05k7k08J16J61j11j76L20n5r7n3
7953f6M3k8K28k71L36k47j8J89kk81K02j99n0K97O2m39Q7J79q5L62m83L17MJ33
7977B70r7j70j17P8N4K2Q5k3j4j44j74K92r6j5k00J32K39O6M5J31m61p8J71j41
$$ plain form
7813 -161 -248 -59 -110 127 -46 106 -135 39 88 -145 -1 1 28 46 301 244 311 -29 75 87 -199 -19 109
7836 109 93 145 -150 224 -316 201 75 -88 -102 130 -126 -291 -15 124 3 54 38 -191 208 76 26 16
7858 16 35 109 -14 -63 233 -277 93 27 -53 -157 54 17 267 -253 132 356 -9 22 -133 -37 -142 -193 -43
7881 -43 227 -143 294 -35 66 173 4 -2 28 50 180 32 115 -124 190 18 -112 60 28 -59 31 112 5
7904 5 -71 10 204 -123 -137 -79 69 -181 120 197 -33 -121 -244 -209 -214 -139 99 106 106 -258 -52 28 -87 121 -166 107
7930 107 62 -183 -47 -36 -62 -98 -277 -170 -88 244 167 -41 64 37 -171 -55 106 -5 -181 139 84 -13 -66
7953 -66 -23 -51 177 -94 242 -5 -23 166 164 -117 85 -114 -164 133 195 -244 -157 22 -63 299 -184 133 137 270
7977 270 173 3 -114 -36 18 40 125 102 88 -56 -230 62 -34 -49 -249 -117 122 188 233 364 -97 -175 -4 -145
8001a45J74k02J77o8k7K8L2k3n4K39k63J92l06J40J58j67j52K17K26p6O8j76P5
8024F7k85K54j51M6J15J75j72k39M4K38R2J9j67j87K95j93K51m01M42j81Onlj30
8048g0J2M0N1j1K70Jl52n0J35J74l06q2J08q2J71j78O1M3R4Q8J61m12K56j04M
8073B2J37o1k63J72J67oj8mk55k6L28j88J6j27R9j3J31l24J71l8n9K31Jk32J84
8098D5k1r7K60j80Q9j64%M5p5q1o0L11O9J27m71L42Ll57K88m0J02k82J80O9J7
8123A19k2k11M40k00k6p3j05M3J11k48P5K31M0j23J42k6l8M4k3j31N0J85l48O8
8147b6m9J73j95m4K98k38l5K28r5j57M2m7K97n9J46j02n7Rr7k6q9N8Q6Ko9K33
8173A87l34K92j76qJ70J00j33j37O3Q4k0ql7j73J92K41l28Q3
$$ plain form
8001 -145 29 -173 4 -64 -91 -63 -31 -54 -108 131 -132 60 -246 -106 52 -115 -267 -50 176 100 168 -8 67
8024 67 -218 36 -115 -69 46 221 49 -190 -146 92 184 203 36 -151 144 -49 202 -199 243 62 68 63 60 -70
8048 -70 -58 -18 33 22 292 293 -59 -109 26 200 -106 -188 -80 -162 9 -169 -108 -65 29 117 278 -134 122 18 22
8073 22 159 98 -165 7 174 168 150 146 -109 -135 193 5 21 -106 -7 -20 111 -213 -42 -80 -139 92 93 -139 45
8098 45 24 -73 187 7 96 -68 -68 -23 -98 -179 -239 72 141 268 -203 139 142 -215 73 33 135 -147 33 102 119
8123 119 97 -114 326 126 100 27 -78 -35 76 -172 -97 134 174 51 193 167 129 173 150 19 69 254 -94 -26
8147 -26 -75 98 -97 -141 157 -81 -116 112 17 -140 -98 -145 152 93 239 137 80 89 -8 -34 -123 -65 21 23 -46 187
8173 187 -147 145 -31 -39 131 231 98 -39 24 108 88 80 43 -130 62 303 -25 58
8191E8
$$ Imaginary data points
##PAGE= N=2
##DATA TABLE= (X++(I..I)), XYDATA
0@%%%%%%%%%%%%%qJ6j6J6k4L2l2M0m8N6p1Q4r4J09j29J47j68J92k19K50k82L17
35A68l57M02m51N03n60O24o93P68q51R40j039J146j262J390j533J691j862K049
53A073k262K503k771L078l430L842m329M916n639O554p756R406j1830J5740k3044
68a3949M1166j65422k50752M75109L08583k28144j97028K16934J52037j25202
78B13332j28831j808k8968o249K3230j01934j87652K4958J86034l852j92426M285
90a99881K07771O2591j19316k0111J08054M9135l1084j8355l9343m1804N9026
101A6683N7914j03160r7481R9541J03037r0636p6766J09808R1835n0831k1474
112C8470M7156j0557l0243L3442r461r8728j9146P5211m6807j34865K6066J13085
$$ plain form
0 0 0 0 0 0 0 0 0 0 0 0 0 0 0 -8 8 -8 8 -16 16 -16 24 -24 32 -39 45 -49 60 -69 78 -90 102 -117 133 -149 168
35 168 -189 213 -238 265 -295 329 -364 404 -447 493 -546 600 -662 728 -805 886 -976 1073
53 1073 -1189 1314 -1457 1621 -1809 2033 -2296 2620 -3019 3535 -4221 5185 -6645 9095 -13949
68 -13949 27217 -138205 -388957 86152 394735 166591 -30437 186497 338534 213332
78 213332 84501 82693 53725 47476 70706 -31228 -218880 -193922 -7888 -11740 -204166 -199881
90 -199881 7890 70481 -48835 -68946 39108 88243 57159 38804 -539 -42343 16683
101 16683 74597 -28563 -126044 -26503 76534 -14102 -90868 18940 110775 59944 38470
112 38470 85626 75069 44826 78268 68807 -29921 -49067 26144 -20663 -155528 -129462 -16377
124a6377n5758j09339R2407J35747p1975q1209J35767J14800j02708o7617J28727
135A02465P3056j18409o6124R1085K2934j07100l9523N2851p789n9116O798K9219
147a9653l2491j5974M7882N091m4998K2232O2935j9915n2734L9889N4225m5602
159H87l9008N6239K8098n1488o188N5119m203m3898K2698L8298l2001k4313L6842
172C7082P710m7549j2810K9407j2265m2588K855J9736k2810j7414K5159O829k7999
185e4657J4067N3652l708m0502L7271O9247k5846n6913M0691O2396m4211o4640
197a3153L5739L8079n4288m3860K9188R990m1349r740K8897k546j7946J8463J8047
210d479j2035M951K6808j624j9092J6898K4839k6000k8476K8716K2576l7954k6320
$$ plain form
124 -16377 -72135 -181474 -89067 46680 -25295 -106504 29263 144063 41355 -26262 102465
135 102465 175521 57112 -9012 82073 105007 -2093 -41616 11235 3446 -55670 -48872 -19653
147 -19653 -52144 -68118 -20236 -15145 -60143 -37911 25024 5109 -47625 -7736 46489 887
159 887 -38121 18118 46216 -5272 -11460 43659 39456 -4442 18256 56554 24553 240 37082
172 37082 44792 -2757 -15567 13840 1575 -41013 -38158 -18422 -41232 -58646 -33487 -26658 -54657
185 -54657 -40590 13062 9354 -31148 6123 75370 49524 -7389 33302 95698 51487 -13153
197 -13153 22586 60665 6377 -37483 -8295 1695 -39654 -49394 -20497 -23043 -40989 -22526 -4479
210 -4479 -16514 -11563 15245 13621 -5471 11427 36266 10266 -18210 10506 33082 -4872 -31192
223c1192L5495K4103l3326j8146L3060J5030k1504j476J6842o313j2796J0402
235A0179K453k6619q733K2015m889k9717J356K4495o88j4858J0855J7470m409
248a090M628K3017k268j9747J3399K6873j8122l6514J2392K8170k4321l6006J1856
261a7733K1345j4354j9307R477J2616l470K953Q508l676J352J6656M503j5557
274C313k222J7560J636k1579k899J5299m843j7336J562J0940q032j0504J1847
287e258P571j5600j325K0671K999j6937J840J9911l19j4708L917J0958m674n867
301C179J630j536m203K057K194j0506o291J2005N140j4348o186J4751Q505j2690
315f299o442J4906O320j1828j401R692p3o415K698M365o450q24J0630j051r630
$$ plain form
223 -31192 4303 28406 -4920 -23066 9994 25024 3520 2044 18886 12573 -223 10179
235 10179 12632 -13987 -22720 -705 -5594 -35311 -33955 -9460 -10148 -25006 -14151 3319 -1090
248 -1090 3538 26555 24287 4540 17939 44812 26690 -9824 2568 30738 6417 -29589 -17733
261 -17733 3612 -10742 -30049 -20572 -7956 -11426 -8473 35 -3641 -2289 14367 18870 3313
274 3313 1091 18651 20287 -1292 -4191 11108 6265 -11071 -9509 1431 -6601 -17105 -5258
287 -5258 2313 -13287 -14612 6059 9058 -7879 -6039 13872 13553 -1155 2762 13720 9046 3179
301 3179 4809 3273 -930 1127 3321 -7185 -13476 -1471 3669 -10679 -16865 -2114 6391 -6299
315 -6299 -12741 2165 8485 -3343 -4744 4948 4875 -1540 1158 5523 -927 -1751 8879 7828 -1802
330a802M204R479k257p491K703N835n924o341J746j095o874l315J003k778o714
345a9621K280P448l013l418R964J0354j053j40J0476P892k935K49N941k075n847
360A6502k157l486p213o026l545n909q136j244J017k547l41M588N377K582K421
375h117R278Q224q19Q93O956L695n113m135K450j601p532k590j554l673k93J407
391b524k870j400N430N423k758l032M376K873l477m289l682j500j961m363k816
406a6570j425q19L245N456M414K162P908J4472O592j891L333P945K672o238j1020
421B0236p918m776n392j4304j7725o393M173j594p227j041J0259J6661R313J551
435d177N490J6382J7461J629j1546j881J0650J939j7881k0917j614R179n662j8464
$$ plain form
330 -1802 2402 11881 9624 2133 4836 10671 4747 -1594 152 -943 -7817 -11132 -10129 -12907 -19621
345 -19621 -17341 -9893 -12906 -16324 -6360 3994 2941 2801 13277 21169 18234 18483 24424 22349 16502
360 16502 14345 10859 3646 -2380 -5925 -11834 -19970 -21214 -20197 -22744 -23085 -18497 -13120 -10538 -8117
375 -8117 1161 9385 8566 9459 16415 20110 14997 10862 13312 11711 4179 1589 35 -3638 -3931 -2524
391 -2524 -5394 -6794 -1364 4059 1301 -1731 2645 5518 2041 -2248 -5930 -7430 -9391 -13754 -16570
406 -16570 -17995 -18814 -15569 -10113 -5699 -3537 4371 18843 25435 23544 26877 34822 37494 31256 20236
421 20236 12318 7542 2150 -12154 -29879 -36272 -32099 -33693 -40920 -41961 -31702 -15041 -5728 -4177
435 -4177 1313 17695 35156 36785 25239 23358 34008 35947 18066 -2851 -4465 4714 -948 -19412
449a9412r167R994J3918p89j0099J063J6611J4952o734j6935J055J6138K425k1524
463h504j7734J0538J6669q064j8296M140K1150J0341m045O09J0770J1323O107
476C5004m036j0357l306L845m940j8085j5800j767J732p440j1345m259R891J2820
490a8043J526j27J1401J3820O723L269L778J507j315K340q09j0812r482p26Q98
505C948n536j1012l461Q690P028n281p278O564J1071j624o260J55N43K49K813
520F09n698j1983j69J5434K486j6224p2K3907J0242j3337n222J7691J4890r381
534B3173j2957L827Q149p492j6259o387J717n042q702k704j344j15N245M518j779
549a6152J807J4906J1753n255k699J2973J0198p091j1828J116Q748l259j5156
$$ plain form
449 -19412 -28579 -18585 -4667 -5456 -15555 -14492 2119 17071 10337 -6598 -5543 10595 13020 -8504
463 -8504 -26238 -15700 969 -7095 -25391 -21251 -101 10240 6195 6804 17574 28897 35004
476 35004 30968 20611 17305 21150 16210 -1875 -17675 -19442 -17710 -25150 -36495 -40754 -30863 -18043
490 -18043 -16517 -16644 -5243 8577 15300 18569 22347 23854 22539 24879 24070 13258 3776 3050 3948
505 3948 -1588 -12600 -16061 -7371 -343 -5624 -12902 -6338 4733 3109 -3151 -2996 -2453 -2204 609
520 609 -5089 -17072 -17241 -1807 679 -15545 -15617 8290 18532 5195 -27 17664 32554 23173
534 23173 10216 14043 22192 14700 -1559 -7946 -6229 -11271 -19973 -22677 -24021 -24136 -18891 -14373 -16152
549 -16152 -14345 561 12314 7059 4360 17333 27531 20440 8612 9728 18476 15217 61
562F1q020O530N895j1383j3048O801J2823j568p896O47Q055M693m52l478m661
577e001L354R679l395j4408j696J3873M288j4534p599J5335J3248p717r603Q768
591D592J4429l431j0511L406O580o036q081J034j319j0937n533N435k202r024
605b1598J690Q566K299j874M218P886M862L560M566J780K16R67%j769o014p406
621A949j035J650n353j1174k655P653K532p822k150Q237Q645R65l773Q87P210
636E766M933k836o965q21N690K198n994p734o02Q895L198r673n155J0702R860
651A1462o503r523N926Q899l701q160o34L139j142m304k124j724r87L116K123
666d137j268k92K978N191K367j465K76M222K710j756l932M0J461k198m274k878
$$ plain form
562 61 -7959 -1429 4466 -6917 -19965 -13164 -341 -1909 -9805 -9158 -1103 3590 3138 -340 -5001
577 -5001 -1647 8032 4637 -9771 -11467 2406 6694 -7840 -15439 -104 13144 5427 -4176 4592
591 4592 19021 15590 5079 8485 15065 9029 948 1982 663 -10274 -15807 -10372 -12574 -21598
605 -21598 -19908 -11342 -9043 -10917 -6699 1187 6049 9609 14175 15955 16171 17138 17138 15369 9355 1949
621 1949 914 2564 -2789 -13963 -16618 -8965 -6433 -14255 -16405 -8168 477 1442 -2331 -1444 5766
636 5766 10699 7863 898 77 5767 7965 1971 -5763 -6365 2530 5728 -3945 -9100 1602 11462
651 11462 4959 -4564 1362 10261 6560 -1600 -2234 905 -237 -4541 -6665 -8389 -9376 -6260 -4137
666 -4137 -5405 -5697 -2719 2472 4839 3374 3650 7872 10582 8826 4894 4934 6395 4197 -77 -2955
682b955o44O64q61k549j095J209K669o9o20K151K455L15J333M38l38O83P70m50
700C106j328L41O81j397j185K40j712M90J319m33k396N10K352K77l143N59J975
717B56k53j218m00J201J752j618j795J353K104o01k499Q77K925q38k128J021J256
734A395M34j088j221J302J258m16k522n95K243J3k291l82O58m7Q2o53J29J123
752e78N42J86k59R91J453k22m45M42j0r0j31j092q68j180k32j4r71o89m25Q89
772b703Q01l65N76K639P72l75J044J192J346o40j016l09l85n12j699j981l36q26
790b777j508Q5Q1k28M54P36J692J298M36J587J110P04n25m8P63J86k127j658K01
809D62p3r88k098K98J131n0j54O0J075J707p37m44O22M67l02j408j578L35K7j231
$$ plain form
682 -2955 -3599 -2935 -3796 -6345 -7440 -6231 -3562 -3631 -4251 -2100 355 670 2003 2441 2103 2786 3556 3106
700 3106 1778 2119 2800 1403 218 458 -1254 -764 555 122 -2274 -1764 588 865 -2278 -1719 256
717 256 3 -1215 -1615 -414 1338 -280 -2075 -722 1382 781 -1718 -841 2084 1246 -882 139 1395
734 1395 1829 741 -480 822 2080 1664 -858 -1453 790 803 -1488 -1870 -1212 -1259 -1177 -1830 -1701 -578
752 -578 -36 150 -109 882 2335 2113 1668 2110 2100 2010 1879 787 -81 -1261 -1493 -1507 -2478 -3167 -3592 -2703
772 -2703 -1902 -2267 -1691 948 1720 1345 2389 3581 4927 4287 3271 2962 2577 2065 366 -1615 -1951 -2777
790 -2777 -4285 -4200 -4119 -4347 -3893 -3157 -1465 -167 269 1856 2966 3670 3145 3097 3860 4046 1919 261 462
809 462 389 -599 -2697 -2399 -1268 -1318 -1472 -1412 -337 1370 633 189 811 1278 976 -432 -2010 -1675 -1648 -2879
829b879r04J27J619J097l88J899K172J475M48P2J091P50q41j716j878j312q39
846gk473k274j435k20K25n28l57J822K870J301N21J753K831J697n21m28k29j5
864D533P9k231k413p13J039n52k543l18K301R03q56p1J052J330n44j080m54o78
882a216k67l35j717j524K57J281P55l84J223K898J446J398J665J106L95R62K74
899H217k202k959m85j74m165m196m26O24j441k148R96K790R00J479K212J531J741
916B294K027J946m60j668J608Q17l413k828O41Q89k668k520Q17J813r41l65N80
933a431J384R07Q2p65J87N90j5k313j105N71l54j122p61j9J526J272K46J140J127
952A147J646L006O6j780J243K583j179m939j300L284j873o692j410K917r89m068
$$ plain form
829 -2879 -3783 -3656 -2037 -940 -1328 571 2743 4218 4666 4738 5829 6579 5738 4022 2144 832 -7
846 -7 -2480 -4754 -6189 -6409 -6184 -6712 -7069 -5247 -2377 -1076 -555 1198 4029 5726 5205 4777 4548 4533
864 4533 4612 2381 -32 -745 294 -258 -2801 -3119 -818 85 -771 -842 210 1540 996 -84 -538 -1216
882 -1216 -1483 -1818 -3535 -5059 -4802 -3521 -2766 -3150 -1927 971 2417 3815 5480 6586 6981 7943 8217
899 8217 6015 3056 2571 2397 -1768 -5964 -6390 -5766 -7207 -9355 -8359 -5569 -4669 -3190 -978 553 2294
916 2294 4321 6267 5807 4139 5747 6564 3151 323 964 1853 -815 -3335 -2518 -705 -1646 -2011 -1431
933 -1431 -47 860 942 177 364 954 939 -1374 -2479 -1908 -2262 -3384 -4145 -4164 -2638 -1366 -1120 20 1147
952 1147 2793 5799 5865 4085 5328 7911 6732 1793 493 3777 1904 -4788 -6198 -3281 -4270 -8338
968h338R41K853p50l93M357J910j533J305M532J636l396j25L950n6m246j381J902
985C168o79l405q25Q86j502j613J749J652k096j612K796L384k427k320J955K180
1001A291l13k210j048J775J516q05j993q18L705J767k053q54J936J700M94p49
1017C341j044j693J026K807l029o165J699M988k967o754P09O220N22m522Q3M580
1033a99J693r72K62J866n44Q86K353j098m567O15M366j465o278l68N882j029n538
1050d135P00M096m13k165P91J308j027L70K096j180k248J201J295q12j043L13
1066h53Q76j92K16J67l49O04J556j1q72l15J360J02j956o27J007p70j147R04j43
1085d43k138k84K997J86l667L82M512j05l208Q00L673o94k892J351K001j614j247
$$ plain form
968 -8338 -7397 -4544 -5294 -5687 -1330 580 -953 352 4884 6520 3124 2999 6949 6893 2647 1266 3168
985 3168 2489 -916 -1741 -855 -2357 -3970 -2221 -569 -2665 -4277 -1481 1903 -524 -2844 -889 1291
1001 1291 978 -1232 -2280 -505 1011 206 -1787 -2605 1100 2867 814 -40 1896 3596 4090 3341
1017 3341 2297 604 1630 4437 1408 -4757 -3058 1930 -1037 -7791 -7082 -862 -340 -4862 -4779 -199
1033 -199 1494 522 784 2650 2106 2992 5345 4247 -320 295 4661 3196 -3082 -3450 2432 1403 -4135
1050 -4135 -3435 661 248 -1917 -1126 182 -845 -475 1621 441 -1807 -606 689 -123 -1166 -853
1066 -853 23 -169 47 214 -135 469 2025 2014 1142 827 2187 2289 333 -294 713 -57 -1204 -300 -443
1085 -443 -2581 -2865 132 318 -3349 -2967 1545 1440 -1768 -968 2705 2011 -881 470 2471 857 -390
1102c90J828j09k859L98K987j233l580J746L382k307k602K427K380j914j850K291
1118E95J194k002m88J333m09r08M97J079j552j195J700M95j826q3J370P77j957
1135a380K29K793m30j908J490J387j703J31J021l73j728Q77J870k628j916K214
1151e4Q93k813q03K721L57k533J68K510m66o53J008K93r17j24J656J03j623M6
1169b31K093o41k073L80K253q82k429J385K175j584j217J569Q05k289M5J743q40
1186B62k305R76J228k117r21J874O91j911J78K229K81j231J356J887r54n2J136
1203B607R67j489j088J559q73k031l29O70j072j690N73J207j450n27J347P14n44
1220a449L53K093j76j003Q36J494o44j659J007O75j339o00J352j54j122L66J951
$$ plain form
1102 -390 1438 1329 -1530 -1132 1855 622 -2958 -1212 2170 -137 -2739 -312 2068 154 -1696 595
1118 595 1789 -213 -701 632 223 -685 -188 891 -661 -1856 -156 339 -1487 -1570 -200 577 -1380
1135 -1380 -1151 1642 1212 -696 794 2181 478 609 1630 1257 -471 406 2276 -352 -2268 -54
1151 -54 839 -1974 -2777 -56 301 -2232 -2064 446 -20 -673 335 628 -289 -413 1243 1346 -277 -231
1169 -231 1862 1221 -852 -472 1781 899 -1530 -145 2030 446 -771 798 1603 -686 -641 1102 262
1186 262 -2043 -1067 161 -1956 -2877 -1003 -312 -2223 -2045 184 465 -766 590 2477 1523 1471 2607
1203 2607 3574 2085 997 2556 1683 -348 -677 -7 -1079 -2769 -2196 -989 -2439 -2966 -1619 -905 -1449
1220 -1449 -1096 997 821 -182 654 2148 1504 -155 852 1527 188 -412 940 786 -336 30 1981
1237A981j249r68J726O65j782r45J396J08k352q78J099q10j620P27N76k18M6J717
1255g81J406l00N68K455Q2m54M25Q98o51k195L7M7j962j268J25o06j292o5J180
1274b351N28j062J211K009l05o9J312O29m86m69Q19o01j376K9P11j464n85P84
1292g36R78l70k27J287P65m28MR65k36j014j57k65j143j236L32p65j708N63Q75
1311b516L74m11P90J823N93K53J632P12L4Q4J70n90p20q93k77j241j484K95k39
1330a611j036m44M18R98n23M07J479N45l87N42J028K88q80R2J59p75J5p1l1o13
1350d00K09r6J39p0L79P55k06k24L30L4n8n56m10k4m31l42l53k90M2K76o2k7M96
1373h89P94M89r9O23O87k78O87r9l80k45j87j35m17j223k87K23m44k45l02M97
$$ plain form
1237 1981 732 -236 1490 2155 373 -572 824 932 -1420 -2298 -1199 -2009 -3629 -2902 -2326 -2544 -2498 -781
1255 -781 625 325 893 3348 3430 2976 3401 4299 3648 1453 1490 1537 -425 -1693 -1568 -2174 -3466 -3531 -2351
1274 -2351 -1823 -2885 -1674 335 30 -39 1273 1902 1416 947 1766 1165 -211 -182 529 -935 -1520 -736
1292 -736 242 -128 -355 932 1697 1269 1273 2238 2002 988 831 566 -577 -1813 -1481 -2246 -3954 -3391 -2516
1311 -2516 -2142 -2553 -1763 60 653 906 2538 3250 3284 3368 3538 2948 2228 1335 1058 -183 -1667 -1372 -1611
1330 -1611 -2647 -3091 -2673 -1675 -2198 -1791 -312 233 -154 388 1416 1704 824 916 1075 300 315 244 213 -400
1350 -400 -191 -287 -148 -218 161 916 710 486 816 850 792 236 -174 -198 -629 -971 -1324 -1614 -1572 -1296 -1358 -1385 -889
1373 -889 -95 394 295 918 1605 1327 2014 1915 1535 1290 1103 968 551 -672 -959 -736 -1180 -1425 -1727 -1230
1393a230J62K1O97L53M3L82K77J96m26l5L94j41p70l32M94N8p04n95O63P20n3
1414A74j00k53N90N90o03j98L35k88k4m49j64rl08MK46r58J84Q38O16j33n14Q09
1436C85O90k47k0k86M63J32r82l5J8j44o67q9O9o0l74P21P32q15j91J016Q22m42
1458F96n24M61M85n46p63L68k86N5p04Q9J17l42l85R85K23m59J94Q10M81j220
1478b65N6J295K85j141j64N67J02p61l47M78j23j16n32N39Q7k66j85N98l8l91
1498c22J60N94p4j020J87J091m82q71N68Q63m22m05k1R49q8j175L29R27R3j064
1518a83L6R01j86j276L95Q11j96j111M1J134j014l48R84J54p78k49R16O66q21
1537a24n40J175O12q25j48O80L23q34j70P51l18o58j89L49j15l07m03O06k74r37
$$ plain form
1393 -1230 -1068 -1047 -350 3 46 428 705 901 475 440 834 693 -77 -409 85 143 -561 -1156 -493 227 174
1414 174 74 -179 411 1001 398 200 535 247 223 -226 -390 -399 -707 -703 -457 -1415 -1231 -393 223 90 -424 385
1436 385 1075 828 808 522 985 1117 135 100 118 -26 -693 -782 -713 -773 -1147 -426 306 -509 -700 316 1138 696
1458 696 172 633 1118 572 -191 177 -109 -54 -758 -669 -552 -894 -1279 -294 -71 -530 -336 474 955 -265
1478 -265 -209 1086 1371 230 66 633 735 -26 -373 105 -18 -134 -666 -127 -40 -306 -491 107 69 -322
1498 -322 -162 432 358 -662 -475 616 134 -737 -169 694 272 -133 -154 795 707 -468 -139 788 881 -183
1518 -183 -147 754 568 -708 -313 498 302 -809 -768 366 -648 -996 -12 142 -636 -885 31 697 -124
1537 -124 -664 511 1123 298 150 830 1153 319 149 900 582 -76 -265 84 -31 -338 -741 -135 -409 -1346
1557a346P02O02q9j80j45N53K6o6K17N8J33M0k26K8K08l10j69m3N19m21m43O97
1579C45K61j020l30J381k83j016J30P07q1q03N18K59m28n11L97M62l89r8P96M01
1599F98n35J03N17L74l81m94O97L21j289k9K42m41n65j06N98p05l58P55M54m98
1619f42K32O88j40L53k9K45j65L28m12l08k06K25m76l3l05J19L1L0r9P36j21j0
1641D1K18Q50n92m19K57L00n24p37P43l60p24j46O57k59m92K96J386o09p4J053
1661H65L45m07k91L80M43j042k43K67n49l13m47L87Lq24P94M49j213O13N53l24
1681e54J352o35P85mm47J8j46n53j46Q2k88k84J76L37k56k27N28O09n51M01N90
1702G87K59o87J05M74k40j198N60K21q35j93K21K84n67k81Q61K53l25K05P28k03
$$ plain form
1557 -1346 -644 -42 -131 -311 -456 97 123 57 274 332 465 505 279 307 515 205 36 -7 512 91 -352 345
1579 345 606 -414 -744 637 354 -662 -532 175 94 -709 -191 68 -360 -871 -474 -12 -401 -499 297 698
1599 698 163 266 783 1157 776 282 979 1300 11 -18 224 -217 -782 -888 -290 -995 -1353 -598 -144 -642
1619 -642 -410 278 138 491 462 707 542 870 458 150 -56 169 -307 -340 -645 -526 -495 -465 -564 172 51 41
1641 41 259 1109 517 98 355 655 131 -606 137 -223 -947 -1093 -436 -695 -1187 -891 495 -114 -188 865
1661 865 1210 803 512 892 1335 293 50 317 -232 -545 -992 -605 -602 -1426 -632 -183 -1396 -783 -230 -554
1681 -554 798 163 948 944 497 515 369 -184 -330 -248 -536 -820 -644 -307 -563 -790 -262 347 -204 197 787
1702 787 1046 359 464 938 698 -500 60 281 -554 -747 -526 -242 -809 -1090 -229 24 -301 -96 632 429
1722D29l31N03K22m20o72O31p3q33q0L88K16n72J74N06lr1J99L46l84L92n0l8
1744D59m32J78K66o89k83K14k2l65j20N60J80p54N85M23P9m44P60P0j60k72N65
1765G98n04m69J23M00m14l47P5J05K1m75M99K09k02j86O92k8m67J55N02m99l09
1786c21M85k4l31l5R5L39r5l86P45l0k74J57K31j59L5J01M8o64l0K72k84m29K56
1809b98K13o90J9K27L77k18m15Q99K37m10L60K49J21n71j39P65J0q58K78J70n08
1830a82J3J91m7n44K66M88l33l51M81J98l33J39n4K06k34J1J2km20P64l67m8J7
1853a29L68L08o82O00n2r2K77j34k19l2m24M80n38k16J21K54j75l82j50P70L0
1874a7j37Q0K95m55J62N33O8j58l26N68k37n09J9N26j09n26J66M4j8j19J63R0
$$ plain form
1722 429 98 601 823 403 -269 362 289 -544 -624 -236 -20 -592 -418 88 85 -6 193 539 155 547 497 459
1744 459 27 205 471 -218 -501 -287 -309 -674 -794 -234 -54 -808 -223 200 279 -165 595 665 505 233 798
1765 798 294 -175 -52 348 -66 -413 -338 -233 -212 -687 -188 21 -181 -367 325 297 -170 -15 487 -12 -321
1786 -321 164 140 -191 -226 -131 208 113 -273 472 442 168 325 556 397 432 533 581 -83 -113 159 -125 -554 -298
1809 -298 -85 -775 -756 -529 -152 -370 -785 114 351 -59 301 550 671 100 -39 726 736 -122 156 326 -182
1830 -182 -169 22 -25 -569 -303 185 -148 -499 -18 180 -153 -14 -68 138 -96 -85 -73 -75 -495 269 -98 -146 -129
1853 -129 239 547 -135 465 413 321 598 464 245 213 -211 269 -269 -485 -364 -110 -285 -667 -817 -47 -17
1874 -17 -154 -74 221 -234 -72 461 529 371 45 613 376 -133 -114 412 303 -223 -57 -13 -31 -150 13 103
1896A03j97J19m3p4j91j12L97k09k0J42k68J54K00o4j86J01K02J2J40K48j32p1
1918B51K7K24L2l20m7N5m2n01J14K38k54j09j82L99l05n8K35K65m21J14P49n48
1940h4MJ41J32M9L19o09O44m08J25m79M10L49o25nJ87J46k78k92o9N67k22k88
1962b86P10o50ro45N22O46k28r0L98n7l74l48J006l0o36K55M21k02o76R38p20
1983e5M29L6j86K51k53l70J3K38j1n03K15J76k70O2j59J93k4K1J43P3K80k94L64
2006C69J45o21N50l49o9J76j64K87k21l10L64q5K77m48k95M88rl62J37q3J63m4
2028a04j06K09j34K63m43P5M42q3l68K77P6j80J75j38L66o9l1K12n64K03L82k51
2050B09m46K63l7k46L59m53K56k42J28l14K45K24K07k46OK96J7K4k4k4J07l28
$$ plain form
1896 103 -94 25 -18 -92 -283 -395 2 -207 -227 -85 -353 -199 1 -63 -249 -148 54 66 206 454 322 251
1918 251 278 502 534 214 167 222 180 -321 -207 31 -223 -332 -514 -115 -420 -478 -243 22 -399 -285 464 -84
1940 -84 -80 61 193 242 561 -48 596 188 313 -166 244 593 -32 -37 150 296 18 -274 -343 224 2 -286
1962 -286 424 -226 -235 -880 -358 288 60 -30 368 311 -63 -411 595 565 -71 184 605 403 -273 665 -55
1983 -55 374 410 224 475 222 -148 -135 103 92 -411 -196 -20 -290 -228 -387 -194 -218 -197 -54 19 299 5 369
2006 369 514 -107 443 94 25 201 37 324 103 -207 157 72 349 -99 -394 94 85 -277 -140 -223 -60 -104
2028 -104 -210 -1 -135 128 -315 -240 202 119 -249 28 104 -76 99 -39 327 258 227 439 -125 78 460 209
2050 209 -237 26 -11 -257 102 -351 -95 -337 -209 -523 -278 -54 153 -93 -87 209 226 250 226 202 309 -19
2072a9J52j6J66K0l68J19K94n12N4K4M5m4j7M41k82k36O4k3p5J12J2K44m55L61
2096F1j87K72p8m7QO4o8Q3N13m45K02j31q6Ql43L75l49ko2J16R1m01K78Q9k1%
2122f0q1J83n8j19J59J18k64K68n0l1%K63j02J0k92N55r4o37L92j96J52r4q9k5
2146i2L3j29p8J23j39K29j77M4rj13O57n65k6M79J04K59m11o6L51J84n86K10%
2169B82M69n19o38N95k52j22P55o26J84p41Q22M21j154K05K98m24Q31l46k74P92
2189E58j396J200j25q11R73L35j017R27k29k80L07o62K54o1j41J38k14P6o7K48
2209A3o9m33J77L27k76k25Q73P9o91J50O7L66n05J15N0J06r5J79j00J11j59R8
2231A58r4J14l92L24l53K74R0m63J01O5K6J03q2L12m49J82l4K07Rj00j05L10m6
$$ plain form
2072 -19 133 117 283 303 -65 54 348 -164 -110 -86 -41 -85 -102 339 57 -179 -115 -138 -213 -101 -89 155 -300 61
2096 61 -126 146 68 21 29 93 25 108 621 176 378 247 161 169 -174 201 -148 -150 -212 -96 -5 -406 -128 -39 -60 -60
2122 -60 -141 42 -16 -135 24 142 -122 146 96 65 65 328 226 236 -56 499 405 -232 160 -36 116 22 -67 -92
2146 -92 -59 -188 -266 -143 -282 -53 -230 -186 -195 -308 349 -216 -242 237 341 600 189 123 474 658 72 282 282
2169 282 751 232 -406 189 -63 -185 570 -56 128 -613 209 630 -524 -319 -21 -445 386 40 -234 558
2189 558 -838 362 237 -574 399 734 -283 644 415 135 442 -220 34 -27 -168 -30 -244 -168 -235 13
2209 13 -56 -489 -312 15 -261 -486 387 466 -225 -75 -8 358 -147 -32 18 124 29 208 108 219 60 158
2231 158 64 178 -214 110 -243 31 121 -342 -241 -176 -150 -47 -129 183 -266 -84 -118 89 98 -2 -107 203 157
2254A57m64O09j5m56M55j92J06k42K58J61o09m7N60O7l62r0M0Q1k02O1J13L5k64
2277b40K11m1m8pk7L23L6k21J05j35P0L4J06j53K0r6J96r1J14j06J17j16l0M0
2301F1J75m45L9R3l07M19J90l11j98L21R1j84K66qn81k55L07J06j26Q88o29O67
2323E79m72K32J32L3p06j67R98k9l55l96r3L80j081J081n85N71N7l99j31O99m05
2344e7L01n22l91J205p14p2K88N48k32N00o91o69P86j64l72L70n3%j16J06O4n96
2366d81K51j0j08K07N9J66N6m37J24M7K3J82j01P9K27l47J14J05q0N5Q2j50q3
2389b0k1r9K65l29K94K00l30J03k25L8k42L17j15K61l21J64l05M14O4j76l7K9
2411g1l6K48l2j16k4J73j78m4J76M0lj43K54l22j85K35K43l63J27J01l25L6K37
$$ plain form
2254 157 -307 302 287 -169 286 94 200 -42 216 377 -232 -279 281 348 -14 -104 -64 17 -185 -124 -11 24 -240
2277 -240 -29 -70 -118 -125 -152 171 207 -14 91 -44 26 60 166 13 33 -63 133 42 156 50 167 51 21 61
2301 61 236 -209 -170 -77 -384 35 225 -86 -284 37 128 -56 210 202 -379 -634 -327 -221 -347 541 -88 579
2323 579 107 339 471 504 -202 -369 629 600 245 -151 -244 136 -945 136 -449 122 179 -220 -351 348 -57
2344 -57 244 -278 -669 536 -178 -250 38 586 354 854 163 -506 280 116 -256 114 61 61 -55 51 115 -481
2366 -481 -230 -240 -348 -141 -82 84 140 -297 -173 -126 -103 79 -22 57 284 -63 51 156 76 131 213 63 -20
2389 -20 -41 -140 125 -204 90 290 -40 63 -162 -124 -366 -49 -164 97 -224 -60 -365 49 113 -63 -100 -71
2411 -71 -107 141 109 -7 -31 142 -36 -80 96 136 133 -10 244 -78 -263 -28 215 -148 -21 80 -245 -209 28
2434B8kJ34k54j8q4M62l48J00J60k72K06J52l8N5J14n02P8j05O6J17J43k71K28
2457A49l98K04K3j82K57j5k91r2L26p9R8J50j9P2p3j55q4J54jp6L19m33K81K4
2481A59k53L11j11p1j8p7j7J51P6Qn2j68K75l21M3k2n7K08j0l0L44k95l8L9J1
2506H5j62K53K06k22n3P5k3k10l0q0J58M2j3N5M0j39N4k12n9J65n0l4k4j18J86
2531a10j51L11j99J90k3k01L34j15J19k2r5k09K36Q2j24k71K57J50k64J2QM5J2
2554b8o1K2R0j36J24Jk97R8J85q6p4P3R1M18k79l72L81p9K14j0J5N1l77o8M8J08
2580E2P5m47J82J8R4n2J31j07J43j38L7k10K55l06Q1J68lk1l4J57m5K14m48N14
2604C10k40j46J03K5l1R7j81M5Nj48m6J50K21m3j30j12l8J60o5O3k02L5M04l97
$$ plain form
2434 28 26 160 -94 -112 -196 266 -82 18 178 -94 112 264 226 281 395 -107 -29 -134 -68 49 192 -79 149
2457 149 -249 -45 -22 -204 53 38 -253 -345 -19 -98 0 150 131 203 130 -25 -109 45 44 -32 287 -146 135 159
2481 159 -94 217 106 35 17 -60 -77 74 150 158 106 -62 213 -108 -65 -87 -144 64 54 24 368 73 35 74 85
2506 85 -77 176 382 160 107 182 159 -51 -81 -161 -3 39 26 81 121 -18 36 -176 -235 -70 -120 -154 -178 -296 -110
2531 -110 -261 50 -149 41 18 -183 151 36 155 133 38 -171 65 147 23 -248 9 159 -105 -93 -85 -40 -28
2554 -28 -89 -67 23 -113 11 12 -285 -187 -2 -88 -162 -89 2 420 141 -231 150 71 285 275 290 341 -36 -104 -56 52
2580 52 127 -320 -138 -120 -26 -78 53 -54 89 -49 -12 -222 33 -273 -192 -24 -27 -48 -82 75 30 244 -204 310
2604 310 70 -76 27 52 21 118 -63 -18 -13 -161 -207 -57 164 121 -9 -121 -159 1 -64 -1 -203 -168 236 -161
2628a61K34OM1K9n2j35j78K86l8q8J54J51l34r7l0J83o4j01L18m26Q7L8K45j89
2652a21k3L10k5j85m2j58K26o2J4K87m01N4K07k43M20k45K04j57j20J77k13Q8
2674hK0j88n7O4K54l05N6J11J18l59J56Q2j2j74J59JK20j06J70k26o7L26k43P6
2698F8j39J88N9J05l00R6j44J9K9J7j63L04j44P8p5K17N8l73K00r6j28L08j15
2721F9J4Q4Pp3L1N7l39J89m5R7J61j44j5j36J6Jo1j54K03J43j39j0j85L67n9j50
2747g1m9L03Jk62J64j33pJ46l04K10j5k17M99J52j95q7J53l64N9p5j16l6M8J64
2771c2k48K51J7J6J18j54l0r6Q6n5n0n8N31l57N8J09M0r5k74M0M05L2m50K68K35
2796C07j94j65j24P8J25J60j90j01n0j35K95M0j3r6j40J93J8j75J48r1P1QJ26
$$ plain form
2628 -161 73 79 120 149 97 -38 -216 70 32 -56 98 249 -85 -182 -212 -29 -93 -194 124 -302 -215 -177 68 -121
2652 -121 -144 166 141 -44 -86 -244 -18 -80 -66 221 -180 -126 81 -162 258 13 217 60 -60 117 -96 -8
2674 -8 12 -176 -233 -169 85 -220 -164 -53 65 -294 -138 -56 -68 -242 -83 -82 138 32 202 -24 -91 235 -8 68
2698 68 -71 117 176 281 -19 77 -67 -48 -19 -2 -165 139 -5 73 -2 215 273 -100 100 4 -124 184 69
2721 69 83 167 174 101 132 189 -150 39 -6 91 252 108 93 -43 -27 -26 -87 -241 -38 105 -34 -44 -229 138 79 -71
2747 -71 -120 183 184 -78 86 -47 -54 92 -212 -2 -17 -234 265 417 222 135 288 -76 -17 -92 -208 -244 -196 -32
2771 -32 -280 -29 -12 4 122 -32 -62 -158 -72 -127 -177 -235 296 -61 -3 106 146 51 -223 -183 222 254 -196 72 307
2796 307 113 -52 -176 -98 27 187 -3 -104 -154 -289 6 46 33 -63 -203 -10 8 -167 -19 -110 -39 -31 95
2819I5kJjQ1N3k30K9m6P5P8p2K9j57J76k14oR2J95k89o4p0K09j48K44J45k75P6
2846Dj42J61l0J01J52j34j33K36L4k55j65L77j54n9K1NL9j15j94J59k9jJ23k03
2870b02K07j34K33m8j71J85j06j71K96n1J35j88j9j39K44n6q4J20j02Q6o8J8j86
2893b01J48L2J70l08r0J11J91j29j32O0J57M2n7k45L99q0q4J4J59o6n4M1l4L8
2917H2L2j15J52r6k30L20k79K1K9N2j1l9p2K25j86l2J12K65p4m7j96J29J40k50
2941f8Q8J74k11NL9j54M1L5O4j84P0m21L61O7K5Q5l2O7N3q1K6j26J19P1j64j40
2967a91K02k53O4K69j81j11M10m17M79j00Mk25L1L3l1r6jmJ51J49l64k9Q8J78
2991E5m8p3n1K34j40j92K08P1k83L7J59J72k02K59m0o6j15J64J25j29o0q8O6r3
$$ plain form
2819 95 93 94 93 174 227 -3 26 -20 55 133 61 90 -67 109 -105 -111 -19 176 -113 -177 -247 -38 -186 58 203 -72 4
2846 4 -138 23 -7 94 246 112 -21 215 249 -6 -171 206 52 -7 14 19 58 -57 -251 -92 -121 -122 1 -202
2870 -202 5 -129 104 56 -115 70 -36 -207 89 38 173 -15 -34 -173 71 15 -69 51 -51 35 -33 -15 -201
2893 -201 -53 -21 149 -159 -249 -138 53 -76 -208 -148 9 51 -6 -251 148 68 -16 -2 157 91 37 78 44 82
2917 82 114 -1 151 55 -175 145 -134 -113 -84 -32 -43 -82 -154 71 -115 -147 -35 230 156 109 -87 42 182 -68
2941 -68 20 194 -17 -12 27 -127 -86 -51 13 -171 -101 -522 -161 -94 -69 16 -16 51 104 23 49 -77 42 113 -51 -191
2967 -191 11 -242 -178 91 -90 -201 209 -208 271 171 175 -50 -19 14 -17 -113 -114 -118 33 182 -182 -211 -123 55
2991 55 7 -66 -117 117 -23 -215 -7 64 -219 -182 -23 149 -53 206 166 100 -15 149 274 145 85 -3 63 -30
3015c0RP7m5l0K78j54j31j66J90l69K93J0J19j37KJ42p0l4R9K42l22j51K02k14
3039a90R0J22J29j09p9J08j45O7oJ74l97K65K6lj19j61K57p8j32N88j62l33K79
3062A91nm61M05J14j52l0qn0J20j81Po7J14o3j49L15k44K32P7Qk48J07J54j74
3086A2l8n3O4J8J57j13j23Q6J54m01L34l4j9j91L5R7K08o8k95j40K57J27N0o3
3110F1k44J29q9P8J15K12n63L26n7K5k26J81J20o0K2N2lj34J84P5oj20R7r8m0
3135C7K40o8J3l89J55l1K80l35J01Q4j91Q7p3n9J27J3KK57k92L0k16J59J02k3
3159A0J61j46k5k40J09qP6M3o8lO9mj74K49l20N0J70J39j70qJ36M6j32R6r4J19
3185H1j05K40k81N2j42K03Q7k34K33k1J77n20L01j05P6J05j16j52K23k77J43m56
$$ plain form
3015 -30 -21 56 11 -19 259 105 -26 -192 -2 -371 -78 -68 51 -86 -84 58 -12 -46 53 295 -27 -178 24 -190
3039 -190 -100 22 151 42 -37 71 -74 -7 -13 161 -236 29 55 52 -67 -228 29 -49 -181 407 245 -88 191
3062 191 186 -275 130 244 92 62 54 4 124 -57 -50 -117 -3 -66 -215 100 -144 88 165 173 -75 32 186 12
3086 12 -26 -79 -15 3 160 47 -76 10 164 -237 97 63 44 -147 -112 -15 193 125 -170 -310 -53 74 124 61
3110 61 -183 -54 -143 -65 50 262 -301 25 -32 -7 -233 -52 68 8 30 82 79 -55 129 204 198 78 175 77 37
3135 37 277 209 222 -167 -12 -43 237 -98 3 87 -104 -17 -90 -149 -22 -9 -7 250 -42 -12 -228 -69 33 10
3159 10 171 25 0 -240 -131 -139 -63 -20 -88 -91 -22 -26 -200 49 -271 -221 -51 88 -82 -90 46 92 -40 56 -38 81
3185 81 -24 216 -65 -13 -155 48 135 -99 134 113 290 -230 71 -34 42 147 31 -121 102 -175 -32 -488
3207d88N40j94QM8p7J25J04r3j07J15l2K7J44o6r8j1J27L22n81M28p5K8q1l3n0
3232C0k34L23Q4k46o6L6J25J41on4j74l0k73L99m6m4J43l34k9K12K97m25K06N8
3256I3j37k5L3Q1P4l73J78n4Q6o0oLP8O6R4k53K30j00M8n2J20m5q1K61j47j06
3282Fk74M85J6k19J1n6j9j1J5j75M3m8K93o0J48P9j70M9J59k79K37Nj79K69m92
3307a67L21j06k49L89j42J22l29j21K1K32L27l93J6J47Qm3K6nj87J41P6l77J65
3330a28N18m46M7RJ97q2p5K9J3j26M6J10j56n8J86n0J96m17O5N2k06L11Q8j47
3354b4K2J13j53J04q6K0J16Qk35O4J31Q5j98K11j45r7J20o0n3J97L5k17M6l1J14
3379H7ml5l44J48l7J64j83M41k35J01l62J54j0k78O29r5j5j43K44j88k6J36j03
$$ plain form
3207 -488 52 -142 -134 -86 -163 -38 66 -27 -134 -19 -51 -24 120 54 -44 -55 72 394 -187 241 166 194 113 80 30
3232 30 -204 119 203 -43 -109 -73 52 193 187 133 -41 -71 -344 55 9 -35 108 -226 -255 -43 254 -171 35 93
3256 93 -44 -69 -36 45 119 -254 -76 -130 -44 -104 -110 -107 -29 37 131 -122 108 8 56 4 124 79 -2 259 112 6
3282 6 -268 217 233 14 25 -31 -50 -61 -46 -221 -178 -226 67 7 155 234 64 113 272 -7 230 235 56 325 -167
3307 -167 154 48 -201 188 46 168 -161 -282 -261 -29 298 -95 -79 68 76 33 59 54 -133 8 84 -293 -128
3330 -128 390 -56 -9 0 197 115 40 69 82 -44 2 112 -44 -102 84 34 230 -187 -122 -70 -276 35 123 -24
3354 -24 -2 111 -42 62 -24 -4 112 120 -115 -51 80 165 -33 178 33 -64 56 -4 -57 140 175 -42 4 -27 87
3379 87 83 48 -296 -148 -185 -21 -204 237 2 103 -259 -105 -115 -393 236 141 126 -17 227 39 13 149 46
3402D6Q7j20R3K7Ll53Q9J48k37L7K46J16k73j72K57oP1k58J06mK73k50K37j39
3426B4M6q3p1L12j27p7j71J35l3J43r4L8J55r7k09L09m6l08J36J76j87j27L1k03
3450c28L45Q2n0k44J18o0j03K23j94J53k1J48m6nJ58p1j19P9J18k28J45O7j84
3473a7J29R6m2j77k21K35J04j55J9K11j50jk55J52n9M8K57k88o7J46k31L83r2
3496B5j50J04J85j60K7J52j42M6o7j57J36J6j0L2J7j11j36J77j94M52n29M67J7
3519A97m07J52K86l43K67k74j69L06J23l9k14J99l86L34%j36J00P7j79J12J68
3540A74j98J37o5l5j67Q4p5J84l72N17j74pj64k6J69j38K15j91N3j8L30j86R9
3563A46M7j7k12J30j29Q3p1K03J7k89jJ91m1J71j91M4n8j21p9J61j95M51j43k10
$$ plain form
3402 46 133 13 106 133 136 -217 -128 20 -217 -180 66 182 -91 -263 -6 -12 59 -199 -93 -97 176 -74 163 24
3426 24 70 -13 -84 228 101 24 -147 -12 -45 98 4 42 197 100 -109 200 154 -154 -18 158 -29 -156 -125 -328
3450 -328 17 99 49 -195 -77 -137 -240 -17 -211 -58 -79 69 23 18 176 105 -14 65 183 -45 100 167 -17
3473 -17 112 208 166 -11 -232 3 107 -48 -29 182 32 31 -224 -72 -131 -83 174 -114 -181 -35 -266 117 25
3496 25 -125 -21 164 4 31 183 41 87 20 -137 -1 15 5 37 54 -57 -193 -16 -210 242 -287 180 197
3519 197 -210 -58 228 -115 152 -122 -291 15 138 99 -115 84 -302 32 32 -104 -4 73 -106 6 174
3540 174 -24 113 48 13 -154 -70 -145 39 -333 184 10 3 -161 -187 -18 -156 59 -132 -79 -97 233 47 146
3563 146 193 176 -36 94 -35 48 -23 180 197 -92 -93 98 57 228 37 81 23 -98 -177 -16 -211 240 97 -113
3587a13J94p7qj75L52r6Jm4q5j19K10p9o8m5J8M2J57k63L56l54K66L4j43K63k81
3612e7K09k67J09p6O8n9q5J75oK65k61J0j89K37j33r7J06j99L61m96L59M0J04
3635A18k01R7j62OJ93j55m4K06j15R8k46K11R6k15j27K94M8o7j09K09j60r6L69
3658B48l08J30n4L1r6J24l19N42l08K93k39j66K39m1j87K56k7J07j38j97J03Q1
3680G4J58k10J12r8QK5o9R4J8q3j04M9L79l06q6L71k94r7k2J28l1n3j0j16K24
3705F1j09L55k25L6J49k10J52j12O1j50K37j95L7r5J21O4j34mj53J05n7J94k31
3728a03J80M4o5R1j21J09l13K97q3L3r3J99K8k78j01L21j14j21J83L4j65J93l2
3751A23n4k60L92m05P1K32j84kj46K62j94J8L9J55q5o7Jj9J91P6j65J79j83K72
$$ plain form
3587 -113 81 4 -4 -179 173 77 78 34 -51 -170 40 -39 -107 -152 -134 -92 65 -198 158 -196 70 104 -39 224 -57
3612 -57 152 -115 -6 -82 -14 -73 -158 17 11 276 15 25 -164 73 -60 -157 -51 -250 111 -385 -26 14 118
3635 118 -83 14 -148 -142 51 -104 -148 58 -57 41 -205 6 102 -113 -240 54 102 35 -74 135 -25 -121 248
3658 248 -60 70 16 47 -49 75 -244 298 -10 283 44 -122 117 76 -111 145 118 225 87 -110 -7 74
3680 74 232 22 134 36 44 69 0 94 112 29 -75 -26 353 47 -39 332 38 -59 -81 47 16 -37 -47 -163 61
3705 61 -48 307 82 118 267 57 209 97 158 8 245 50 87 -8 113 177 43 39 -114 -9 -66 128 -103
3728 -103 77 121 56 147 26 135 -178 119 36 69 -24 175 203 -75 -176 145 31 -90 93 127 -38 155 123
3751 123 69 -191 201 -204 -133 99 -85 -87 -233 29 -165 -147 -108 47 -38 -105 -104 -123 68 144 -21 158 -25 247
3775B47k36n8J84p6o3J67j76p1P6K34j37L5l06K79k31K28p3Jm3M1l4j51LQ2J86
3800A08n44L61K07p7j11l0LK66k09Q7Nm47M14J27k38Q5P3jN5p7o4J1J50K1L8l3
3826A80l06M1K76p0j43j63M64j89j27K79j85J6O5kk89J71n7Q0R6k7k70J78k57
3849b39L21j32Q5J39j58j01O0j12L38l82J48J33J37l04K2P4Ok02K68j47L1n3R
3872e9J25j52K41j79L59k86J31j07j7Q6k96K60k99K52k05J71k17K22O9p3k8J88
3894A86o7J17k80qo7J38k25K04q1k7J84j99r5R2j6M6K14j27J63k20J87j25J8j02
3918i0J45Q1l47K80K5l78K86J35L5n75N46j28K16j19o0k81M10o8m8j47N4J70k94
3941a52K53n7j00k28j8K93K45l75K7j70K64m7J7J81m6j37J45k19K01k73K64k74
$$ plain form
3775 247 11 -47 137 61 -2 165 -11 -82 -6 228 91 126 -180 99 -132 96 23 24 -19 22 -12 -163 -160 -78 108
3800 108 -436 -75 132 55 -56 -86 -83 183 -26 61 66 -381 33 160 -78 7 80 79 134 57 -7 4 154 175 213 180
3826 180 -126 -85 191 121 -22 -185 279 90 -37 242 57 73 138 136 -153 18 -39 41 137 110 -160 18 -239
3849 -239 82 -50 35 174 16 -85 -25 -137 201 -181 -33 100 237 -67 -45 29 35 -167 101 -46 -15 -68 -59
3872 -59 66 -86 155 -24 335 49 180 73 56 142 -154 106 -193 59 -146 25 -192 30 99 26 -2 186
3894 186 119 236 -44 -52 -119 19 -206 -2 -83 -110 74 -125 -220 -128 -144 -98 116 -11 152 -68 119 -6 12 -90
3918 -90 55 136 -211 69 94 -284 2 137 172 -403 143 15 231 112 52 -229 181 113 65 -82 -28 142 -152
3941 -152 101 44 -56 -284 -302 -9 236 -139 -112 -282 -18 -65 -48 133 87 -50 95 -124 77 -196 68 -206
3963b06K18N9L0L5k26R4Ok52L57J51l6k41%J60k99K33j39j7J45j45K5N1P4n0p
3988B0k15M43n67L35j9K3j59J50k56M80j96j97K5P3N7j11K91k59M7p7L57m77J33
4011i9J3J79j94L16k48J56p2np8K33l93K01J3n2j87J40k1K96j9k13K64k29j19
4034a18J7J09k2M2q5K9j74K50j41Q9j50J80J28j92N9Q8q7Q4j44J70j62o3K73l42
4058a62L48j24j50J08o5K9l2j18K9k5j5j25K13L4Q7J83j36M88n05J6r1J5N2j57
4082a03J61j54K42P3l09J40J12k9m2j24j07L19m3P7j84m4J63Jk32J38O3k02o2
4105a46M79k28k54Q9P4J32j96L7r0O2J51j19K86n9l30K22j2j64k4O6oj60K88j88
4129i0O2n1J67K7m30K43R3k3K4j16K06k16N03j11k28Q7j80J88k71L50k39Or8J30
$$ plain form
3963 -206 12 71 101 136 -90 4 10 -242 115 266 230 -11 -11 149 -150 83 -56 -73 72 -73 -48 3 77 27 20
3988 20 -195 248 -319 16 -3 20 -139 11 -245 235 39 -158 -133 -60 -3 -114 177 -82 -35 -112 245 -232 -99
4011 -99 -86 93 -101 215 -33 123 51 46 -32 201 -192 9 22 -30 -217 -77 -98 198 179 -34 230 1 -118
4034 -118 -101 8 -14 28 -57 -28 -202 48 -93 -4 -154 26 154 -38 21 109 22 106 -38 132 -30 -93 180 -162
4058 -162 186 62 -88 20 -45 -16 -48 -166 -137 -162 -177 -302 -89 -55 32 215 79 567 62 78 -13 2 54 -103
4082 -103 58 -96 146 219 -90 50 162 133 91 -33 -140 179 136 213 29 -15 148 149 -83 55 118 -84 -146
4105 -146 333 105 -149 -60 14 146 -50 -13 -103 -41 110 -9 277 218 -112 110 98 -66 -90 -24 -30 -190 98 -90
4129 -90 -28 -79 88 115 -315 -72 21 -2 22 -94 112 -104 399 288 60 147 -33 155 -116 234 -5 1 -97 33
4153C3j37K04k38K01k9J63J89k71kj60j46J84R9J33r7k74K73k78K04N1L9j61K9
4176IJ20n5p1J16r5M0n8J31l42R5l8Q4N9M4r7N5j78J05K70k62J76l38M4J89l0
4201b7k04M5L02j37J38M1l21M09k29K5p1J1Lj05K92m10J65KO2K13j96j66K20l5
4225B7k63L60j92J13j81R1L19k07r7J15N2j55j40J61j0l0J6k27J39L64l28L28
4247B55l27R5Q2j98K58o2p5J39L9j05k90M44j77k76K19J04Pn7k23J36j70P5q8
4270a95K68o5J77K6k60J52j04L7J9K4R0k91J4K7K33l36J29J40k70J39K6M4j97
4293a73K75l38J90n0k7Q6J84O3j24j31p1J02M0K4R2j50L7P9l6j8q8j72qJ09o3
4318a68OK0K74j09Q7j81J50m1n5j94J93oo7O6M4k62J10J66j40J3k2R0r3O8k1P9
$$ plain form
4153 33 -104 100 -138 63 34 197 386 115 113 -47 -193 -9 90 223 126 -148 125 -153 51 102 141 -20 9
4176 9 129 74 3 119 24 64 6 137 -205 -110 -148 -64 -5 39 -58 -3 -181 -76 194 -68 108 -230 -186 3 -27
4201 -27 -231 -186 116 -21 117 158 -163 246 17 42 -29 -18 -15 -120 172 -238 -73 -71 -9 204 8 -158 62 27
4225 27 -236 124 -68 45 -136 -45 274 67 -30 85 137 -18 -158 3 -7 -37 -21 -248 -109 255 -73 255
4247 255 -72 23 105 -93 165 103 28 167 206 101 -189 255 78 -198 21 125 132 75 -148 -12 -182 -107 -195
4270 -195 73 8 185 211 -49 103 -1 36 55 79 169 -122 -108 -81 152 -184 -55 85 -185 -46 -20 24 -173
4293 -173 102 -236 -46 -96 -123 -37 147 210 86 -45 -116 -14 26 50 142 -8 29 108 72 54 -34 -206 -214 -105 -168
4318 -168 -162 -142 132 23 110 -71 79 38 -17 -211 -18 -24 -91 -25 19 -243 -133 33 -107 -94 -116 -26 -119 -51 -72 7
4344Gj05p2M00l75P0P9k11K38j59M45l64O5j10Q9R0R5l59J88J36Q7m6l40L16j12
4368E2K2j6J6J3L4j39j8o2K8J27R2k42J28O2j2p6J93k36K58m90K63J35k11J29
4392E0o4k7J17m6L45j42k68J06r8k44K48O3j72P4J13j18l9Q5k19K27J21K05l50
4415c3R8J22k14L39j85pp0kjK54j30j86k24K20m7j52J35j39K86l1J86k48J24l93
4439b98K27K66r5m9N6j85J71j47J29p2r0l3L1Q9j02J17J14j52J73J5k30n2J15
4462bJ44o9nj07p3Q6l61J77Q6J55P4j38Q4J12m9m6p7K29l05J25K28k72K01j90
4486Gj11j35K16k16M00l31o2K24Mj32l2J87J05n3j52M60l19l16K91K30l63N3m8
4509i3J36o9r7P2L9J34j3l21M62k33L7Kk07K07J6k14L77k61J31j00K6r1J84k54
$$ plain form
4344 7 -98 -170 230 -145 -75 4 -207 31 -128 317 -47 18 -92 -3 87 182 -177 11 147 234 188 -152 164 52
4368 52 74 58 74 87 121 -18 -36 -98 -70 57 149 -93 35 97 85 9 202 -34 224 -266 -3 132 -79 50
4392 50 -14 -41 76 30 375 233 -35 71 -27 -271 -23 40 -132 -58 55 -63 -102 -17 -236 -9 112 317 -33
4415 -33 65 187 -27 312 127 120 50 48 47 301 171 -15 -239 -19 -66 -218 -83 -222 64 33 219 -29 95 -298
4439 -298 -71 195 100 51 107 -78 93 -54 75 3 -87 -120 -89 0 -102 15 129 -23 150 165 -65 -117 -2
4462 -2 142 73 68 -39 -112 -26 -387 -210 -124 31 105 -33 51 163 114 68 -9 220 -85 40 268 -4 197 7
4486 7 -104 -239 -23 -239 161 -170 -232 -8 -4 -136 -168 19 124 71 -81 379 60 -256 35 265 -98 -45 -93
4509 -93 43 -26 -123 -51 -12 122 109 -212 250 17 54 56 -151 56 72 -142 235 -26 105 5 31 -60 124 -130
4533a30K22j2q4J74j81k5J75J8j32M5R5j88j57k4J94j27J05J37p1J39k21j03L5
4556a16J70N1l5K20l19%j4J92r2p6J36k10J40j64m1p4L15k40L81l47K5J21k18
4579a95J18J25O9l5O4k80J9J53J14J4k55L14j50j26J36k18J79P1k86K7J54J5J
4602B8j66J47j30J66l9j33r9K09n3K05j78j19P2J03N8O7k21M00l67K33k91J53
4624D5j78J41p6P0J46j33L4l25N39m44Q2J18K71l84J33j73Q5J58Mj68j30m1J83
4647d3K60m77J76m6J01K4l1K31q5j13N0K51m38K78j18no6r9L35l00R9J2J50l12
4671a66L41k29J01n8j80M23n44M42jl9m3j89L32l16J15L4J67k87j95K86j96L0
4693a72J81K71k95k33K28J4N5JJ56l4j57J30j42K33j89j6j83P2L8jQ1K9k01R5
$$ plain form
4533 -130 92 80 -4 170 -11 -36 139 157 25 70 165 -23 -180 -204 -10 -137 -32 105 34 173 -48 -151 -116
4556 -116 54 105 70 290 -29 -29 -43 149 57 -19 117 -93 47 -117 -158 -232 83 -157 224 -123 -98 23 -195
4579 -195 -77 48 117 82 146 -134 -115 38 152 166 -89 225 75 -51 85 -133 46 117 -169 -142 12 27 28
4602 28 -138 9 -121 45 6 -127 -226 -17 -70 135 -43 -162 -90 13 71 138 -83 317 -50 183 -108 45
4624 45 -133 8 -68 2 148 15 49 -276 263 -181 -99 19 290 -94 39 -134 -49 109 113 -55 -185 -226 -43
4647 -43 217 -260 -84 -130 -29 -5 -36 195 110 -3 47 298 -140 138 20 15 -51 -150 185 -115 -16 -4 146 -166
4671 -166 175 -54 47 -11 -191 232 -312 130 129 90 47 -142 190 -126 -11 23 190 -97 -292 -6 -202 -172
4693 -172 9 280 -15 -248 -20 -6 49 50 206 172 15 145 3 236 47 31 -152 -80 -42 -43 38 67 -134 -39
4717c9K33k5k75lK13k23J89mJ08j9j84r3J73j62L89k38Oj73l31M31k6N4o0K5R5
4742F1j14J2Q8k3K05q4j84j22J14J21j9R3L4k31J3J86k27K44j24J8L03m44K80
4765B00l12J24M2M4j77J49L7l12K58k75M3K07J04j78kMJ91j09J13m0j55J77l0
4788A03j94r4q1J15J00L7N9k20K12l2n7p2K76o8k33L62k82Q0J89L8l59J66k1N1
4812G5k01P1K74j20j39K14j95J36j4k80O5K19j50r7K06k06J10J04m33M58p8M3
4834F2k17j22L44J55m9p0O6l9K27m60J19l9K68r2j44j73J15j42J16J1j20j13L54
4857E7oj40M19k91J13j97M96m98J90j22qj77K97P9l91K41j05j34K14q6j53K27
4879B5j2J87j28j70J44q7jK14k38M6J7J5q0K01j17p5j5QK46j9j16OO3k83MK58
$$ plain form
4717 -39 194 169 -106 -109 104 -119 70 66 174 155 -29 -122 51 -111 278 40 46 -127 -458 -27 -53 1 -59 -34 61
4742 61 -53 -41 47 24 229 145 -39 -161 -47 74 55 148 182 -49 -36 150 -77 167 43 61 364 -80 200
4765 200 -112 12 54 98 -79 70 107 -205 53 -222 -179 28 132 -46 -48 -44 147 38 151 111 -44 133 103
4788 103 -91 -185 -266 -151 -51 -14 45 -175 37 5 -52 -124 152 84 -149 213 -69 11 200 238 -121 45 24 75
4812 75 -126 -55 219 99 -40 174 -21 115 101 -179 -114 105 -45 -142 64 -142 -32 72 -361 97 19 62
4834 62 -155 -277 67 222 173 103 169 130 357 -103 16 -23 245 153 9 -164 -49 -191 -75 -64 -184 -297 57
4857 57 51 -89 330 39 152 -45 451 -47 143 21 13 -164 133 212 -179 62 -43 -177 37 -49 -202 25
4879 25 13 200 72 -98 46 -41 -42 172 -66 -20 -3 12 -68 133 16 -59 -74 -66 180 161 45 51 114 -169 -165 93
4905I3k67MJ79j52J97j33q5L1j16L36m04K89k41L82p7p3k18J99MJ61l9j76Q9L14
4929B97l20N7J0j34J23K01J19L6l67J2J99k65j5l3O1j08K16k07k6j58L28j52m
4952a30mJ91m4L5R8k5N6j99K15k40O9j13L35L8k60k81q5N30l48n8J76j03J57O1
4976G1j05j6M9J62j75J89j95J08k50N9J23j77J62K0o9K12q4j41o0L14P6j70j44
4999d1J57N3j00j73K33nk64j0j94K52Q1nm4J3j91M37j87J9J65P5j66j46J15J03
5023A77J46l05J28k68K32k1j00o1m6K55L0q3l3oN6K0J1k4J22r8%l54J11j20L03
5048G2j37J15p9Q8j32K1r8L59N0j49p8j02J28n1Q2L8l66K05m0QLK27j22k18J54
5073b2J9QL2j73M56j39l31K12k45Q8J03o4L1J90q0l68M58k1j31q5j42K46K54l07
$$ plain form
4905 93 -174 -170 9 -143 54 -79 -164 -133 -249 87 -317 -28 -269 113 36 -37 -255 -56 -52 109 70 -106 -17 297
4929 297 -23 34 44 -90 33 234 353 389 22 34 233 -32 -47 -80 -19 -127 89 -118 -144 -302 26 -126 -130
4952 -130 -134 57 13 48 146 121 177 -22 193 -47 22 -91 244 282 22 -259 -344 186 -162 -220 -44 -147 10 71
4976 71 -34 -50 -1 161 -14 175 -20 88 -162 -103 20 -157 5 25 -44 168 84 -57 -117 197 273 103 -41
4999 -41 116 169 69 -104 129 124 -140 -150 -344 -92 -11 -16 -60 -47 -238 199 12 31 196 271 105 -41 74 177
5023 177 323 18 146 -122 110 89 -11 -72 -118 137 167 84 51 45 101 121 132 108 230 132 132 -222 -111 -231 72
5048 72 -65 50 -29 59 -73 -52 -150 209 259 110 32 -70 58 7 89 127 -239 -34 -74 -66 -63 164 42 -176 -22
5073 -22 -3 5 37 -136 320 181 -150 62 -183 -95 8 -56 -25 165 85 -283 175 154 23 -62 -204 42 296 -11
5097a1p7K22n0j60J20J16k57kJ59m7P8j43N6J21l8j30j11K86k25J32J48Lj66N0
5121G4r0j96L08M2j5j17k6k44K05pj24K95j85J64k10K63l39K12k48J8K75J42j31
5144F6J23n6m35L21K85l20J31j03Q8Kj4N7l00J44o2k46L69m37L24J49k60O2o8
5167a80K32N8k85J05L85k39j59j91K48m7K42j49k04K70J57j04j88j8j57J79K20
5188A75k80M9o4P3j31J0l5J90k58N8O8J39qp6K3P8J20m0M9j47J3k24L99l3p3M2
5214A17k03N9l87K86J36p7j7J81j17o4J9j5J07L2j95R1J14l19L04k23J49o4M2
5237d4j5L36k38K52j32M3l82M42l37L3K24m03K56J43j80l74K77j30n7R4J79K3
5259A0kj31K10n8JL4p5J15Q5j69Q3J59k10k42J27NJ1k74K37J00K5kp3K12J21m93
$$ plain form
5097 -11 -88 134 84 -76 44 160 -97 -99 60 13 91 -52 4 125 87 -43 -154 132 -93 39 187 190 24 74
5121 74 -16 -212 96 138 123 6 -20 -264 -59 -66 -190 105 -80 84 -126 137 -202 10 -238 -220 55 197 66
5144 66 189 133 -302 19 304 -16 115 12 100 102 88 145 -155 -11 -73 -319 50 -387 -63 86 -174 -112 -180
5167 -180 52 110 -175 -70 315 76 -83 -274 -26 -73 169 20 -184 86 243 139 -49 -67 -224 -45 175
5188 175 -105 -56 -120 -47 -178 -168 -203 -13 -271 -213 -145 -6 -14 -90 -67 11 131 91 140 -7 6 -218 181 148 75 117
5214 117 -86 -27 -414 -128 8 -69 -86 95 -22 -86 -67 -82 25 57 -138 -47 67 -252 52 -171 -22 -86 -44
5237 -44 -59 277 39 291 159 202 -180 262 -75 -42 182 -221 35 178 -2 -376 -99 -229 -286 -192 -13 10
5259 10 8 -123 87 29 30 64 -11 104 189 20 103 262 52 -190 -63 -58 -47 -321 -84 16 41 39 -34 178 299 -194
5285a94N8J29J34j75j6J6n3K40o8j98M8J68j69P9l9K26Pj2l32k2L88m15K01j83
5309a82K9J18n6M3j7j56J40p4J60j5O3j09PK85k2J05j90j17QQ1l9l8J3k53J44
5334g2n6L3l2J80j87j07L3Q1M59l82K19o9p6nm8P1N4l11J19oJ7k5N3L9J0q7J41
5361D6R6L2k85L17p6k94K2nj3k58M29j88R4l1K07m36J97NL38k24L3J65j67j19
5385a15J36K46m16L69k83j26m7M66l23R6J50J3j40k60K30K1J8k05L36l38J57J00
5407H5j31R1k31J92k26L00l84K22N1N9K5j19J83p3K4RN3j76o7l9K49k54K00k94
5431b51K24J69k2j57J90j58J44k47M74m30K48m12J38m7o4L85j48Nn3N4p2o5R5
5454@j89J34L01m4k74M8M50l61K41m02j19K16j40O5O3j64L80k70j2L6J07kk22
$$ plain form
5285 -194 -136 -7 127 -48 -64 -48 -101 139 71 -127 -79 89 -80 -1 -40 186 193 181 -151 -173 215 -200 1 -182
5309 -182 -153 -35 -91 -48 -65 -221 -81 -155 5 -10 53 -56 -49 236 214 319 129 12 20 101 62 24 37 -216 -72
5334 -72 -128 -95 -127 53 -134 -241 -208 -127 332 -50 169 100 24 19 -29 42 96 -215 -96 -102 -85 -110 -57 -18 -8 -95 46
5361 46 142 174 -111 206 130 -164 -142 -147 -160 -418 11 -177 -83 -114 93 -343 -146 -141 197 -27 6 171 4 -115
5385 -115 21 267 -149 220 -63 -189 -236 230 -93 3 153 166 26 -234 -4 17 35 -170 166 -172 -15 85
5407 85 -46 45 -186 6 -220 80 -304 -82 -31 28 53 -66 117 44 68 77 130 -46 -113 -152 97 -157 43 -251
5431 -251 -27 142 120 -37 153 -5 139 -108 366 -64 184 -228 -90 -137 -201 184 36 41 -12 42 -30 -95 0
5454 0 -189 -55 246 202 -72 -24 426 65 306 -96 -215 1 -139 -74 -11 -175 205 -65 -77 -41 66 64 -158
5477a58K65j6k1n5K23k26n7o5L6NK59k15J9J59j28J47qO5j55k48j64K69L05q8
5501A48j74J29m7o7J76l70K42k01K9K99k24K11k44K18J5k66M16m85J39r8K50K14
5523C10k73k6k0K6k50J80J53L7j43P6lk4N6j00l6j28L13m0k20NJ92j46r6q0J93
5548d4L95j91q2J74j31k18m3K99j15j10j05k6J79o9J17k1j37K99j56m7J58O3j30
5571E9R5J47l74J31p1J23j13k92M17N0j69J5j51K32Q2l22P1j00L32k38Ml6J14
5594Fp4O0j2K1k17K65j28J95k5k08J56r2K42j87K13l80J45J36k64J36J01j07J16
5617I8j32K94j99r5Nk29O4L22r7o3O7K9m0r5J2P6J41M6p6j84%k3rj22J6K07k63
5644b50K23k24L46J06j79nK2o3J6r6J0k6m4J29J56M3l85K74p1p7k0J68QO8k0j40
$$ plain form
5477 -158 107 91 70 15 238 12 -45 -110 -74 -69 190 -25 -6 153 25 172 164 229 74 -174 -338 -69 236 148
5501 148 -26 103 56 -11 165 -205 37 -164 -135 164 -60 151 -93 125 140 -126 290 -195 -56 -154 96 310
5523 310 37 11 -9 17 -233 -53 100 137 -6 70 67 43 99 -1 -37 -165 148 108 -112 -107 85 -61 -157 -237 -44
5548 -44 351 160 78 252 121 -97 -140 159 44 -66 -171 -197 -18 -87 30 9 -128 171 15 -32 126 189 59
5571 59 154 301 -73 58 -13 110 -3 -295 122 172 3 18 -133 99 181 -141 -70 -170 162 -76 -72 -108 6
5594 6 -68 -8 -20 1 -216 49 -79 116 91 -117 39 -53 189 2 215 -165 -20 116 -148 -12 89 -18 98
5617 98 -34 260 61 -34 -29 -258 -194 128 31 -32 35 64 24 -71 -59 17 158 204 128 -56 -56 -79 -88 -210 -194 13 -250
5644 -250 -27 -251 95 201 22 17 39 -24 -8 -104 -94 -120 -164 -35 121 164 -221 53 -18 -95 -115 53 61 129 109 -31
5670c1M3J17j9M9l9j19l15L42j59r3K01L3r3R4j08K62m4J5k2o6M3j66N5R3L2J50
5696B55j09l72J45J01j03J97l34j59M27k8l7K27k81L6R2L2m17J85R0M9Ol36M12
5719G8k10L05j77j39K17Q8k20M6j39Q1R7K2o7N7m3J08j58o3L78k18j27K46l68
5742b06J58L43l21O4K4j81J34K29r7j35R9j94N2K0J8K16j48k6J5j44L13k61o2
5765i0J43l10J79N5M0M2j25J35K8j17O5n2PQ8k17LR0j46R5J43J55Q1j32n6J20
5790B24m33K5K40j8j61O0J12j42J94K44n32K02N9m24K71K87l06J64m7J09l3k22
5812a27M3J15j70K49j47j77K02k0q5J74J47j53M5l80L85j95L29l57K88k87o4M0
5834a45R4j3NO0J26j5kr1Q2j72K24j72j15K31l14J37O2l9L06m14J85l1p8l1J68
$$ plain form
5670 -31 12 129 110 159 120 1 -314 28 -131 -224 -23 10 -83 11 -97 165 121 136 114 48 91 -75 -20 73 105 255
5696 255 146 -226 -81 20 -83 114 -220 -379 48 20 -17 210 -71 -35 57 89 -328 -143 -53 -4 2 -334 78
5719 78 -132 173 -4 -143 74 162 -58 -12 -151 -70 27 49 -18 39 -4 104 -54 -117 261 43 -84 162 -206
5742 -206 -48 295 -26 38 62 -119 15 244 147 12 111 -83 -31 -11 7 223 75 49 64 -80 233 -28 -90
5765 -90 53 -257 -78 -23 17 59 -66 69 97 -20 45 -7 0 88 -129 -126 -36 -182 -87 56 211 292 160 104 224
5790 224 -209 -184 56 38 -123 -63 49 -93 101 345 -187 15 74 -350 -79 208 -98 66 19 128 95 -127
5812 -127 -84 31 -139 110 -37 -214 -12 -32 -117 57 204 51 96 -284 101 -94 235 -122 166 -121 -185 -145
5834 -145 -51 -64 -59 1 127 112 110 19 101 -71 153 -19 -134 97 -217 -80 -18 -57 249 -165 20 -11 -89 -120 48
5859D8j34k6K36j10j21K44o5m5j39J21k01K07j30N9j56K79P2l01L21k41j27J52
5881e7R9J82m37L38k22J07j2R7j6j57J38K9j36n9J4J94J9Rm2k12J46J9k0j29j21
5906b29K89N1m3k12J13r2J56j97J9J65lk20lJ20k11P21l38o8K55j81j52K76j26
5929I0K7l5j04r8J19n6r1J57p1K10k16J14k64J82p9M3J58j19J18k3k04L96l63
5952a09K06q2M99n32JP6j2r7P2p0M4K3q6m2J08k6P3K7k10J38J7n0J9j4m0j46J49
5979f4K66m13N9J78J62j63K00k95K58r6M6j65J49k53L1K37k51k9K76p4n2j16k6
$$ plain form
5859 48 -86 -112 124 14 -107 137 72 27 -112 9 -192 15 -115 -56 -212 67 139 -162 159 -82 -209 -57
5881 -57 42 224 -213 125 -97 10 -2 95 79 -78 60 89 -47 -106 -92 102 121 130 88 -124 22 41 21 -108 -229
5906 -229 60 111 68 -144 -31 -123 33 -164 -145 20 17 -203 -206 -86 -297 424 86 18 273 92 -60 216 90
5929 90 117 82 -22 -120 -1 -57 -148 9 -62 148 -68 46 -218 -36 -115 -72 86 -33 85 62 -142 254 -109
5952 -109 97 15 514 -18 -17 59 47 -50 22 -48 -4 19 -67 -109 -1 -27 46 73 -137 1 18 -32 -13 -27 -67 -213 -64
5979 -64 202 -211 -152 26 188 25 225 -70 188 92 138 -27 122 -131 -100 137 -114 -143 133 59 7 -109 -135
$$ [...]
8191c25
##END NTUPLES=NMR FID
##END=
