##TITLE=1H_Pr CF3-Am
 200.13MHz,CDCl3,
 8 sc
 
 24.6.2025
##JCAMPDX= 6.0         $$ Bruker NMR JCAMP-DX V2.0
##DATA TYPE= NMR FID
##DATA CLASS= NTUPLES
##ORIGIN= UXNMR, Bruker Analytische Messtechnik GmbH
##OWNER= pz
$$ XWIN-NMR		Version 3.5
$$ Tue Jun 24 16:34:35 2025 Russian Standard Time (UT+4h)  she@DPX200
##.OBSERVE FREQUENCY= 200.1313
##.OBSERVE NUCLEUS= ^1H
##.DELAY= (6, 6)
##.ACQUISITION MODE= SIMULTANEOUS
##.ACQUISITION SCHEME= undefined
##.AVERAGES= 8
##.DIGITISER RES= 18
##SPECTROMETER/DATA SYSTEM= spect
##.PULSE SEQUENCE= zg30
##.SOLVENT NAME= CDCl3
##.SHIFT REFERENCE= (INTERNAL, CDCl3, 0, 14.3821)
##AUDIT TRAIL= $$ (NUMBER, WHEN, WHO, WHERE, WHAT)
$$ ##TITLE= Audit trail, XWIN-NMR		Version 3.5
$$ ##JCAMPDX= 5.01
$$ ##ORIGIN= Bruker BioSpin GmbH
$$ ##OWNER= she
$$ F:/spectra/data/she/nmr/H-C/1/audita.txt
$$ ##AUDIT TRAIL=  $$ (NUMBER, WHEN, WHO, WHERE, WHAT)
(   1,<2025-06-24 16:33:17.26 +0400>,<she>,<DPX200>,
      <created by zg, POWCHK disabled, PULCHK disabled
       configuration hash MD5:
       00 E9 B6 7A A2 85 ED C7 34 08 36 98 17 FE 4E 26
       data hash MD5: 16K
       A5 0E 73 C9 2B BC 46 C4 EA F3 AE 59 D4 C9 40 E0>)
$$ ##END=
$$ 
$$ hash MD5
$$ 7F D6 B7 89 CC 0B 0A A9 9F F5 75 44 B8 CE B4 0F
##$RELAX= 
##$RELAX= 
##$RELAX= 
##$RELAX= 
##$RELAX= 
##$RELAX= 
$$ Bruker specific parameters
$$ --------------------------
##$DU= <F:/spectra>
##$EXPNO= 1
##$NAME= <H-C>
##$PROCNO= 1
##$TYPE= <nmr>
##$USER= <she>
##$AMP= (0..31)
100 100 100 100 100 100 100 100 100 100 100 100 100 100 100 100 100 100 
100 100 100 100 100 100 100 100 100 100 100 100 100 100 
##$AQSEQ= 0
##$AQ_mod= 1
##$AUNM= <au_zg>
##$AUTOPOS= <>
##$BF1= 200.13
##$BF2= 200.13
##$BF3= 200.13
##$BF4= 200.13
##$BF5= 200.13
##$BF6= 200.13
##$BF7= 200.13
##$BF8= 200.13
##$BYTORDA= 1
##$CFDGTYP= 0
##$CFRGTYP= 5
##$CHEMSTR= <none>
##$CNST= (0..31)
1 1 145 1 1 1 1 1 1 1 1 1 1 1 1 1 1 1 1 1 1 1 1 1 1 1 1 1 1 1 1 1 
##$CPDPRG= <>
##$CPDPRG1= <>
##$CPDPRG2= <>
##$CPDPRG3= <>
##$CPDPRG4= <mlev>
##$CPDPRG5= <mlev>
##$CPDPRG6= <mlev>
##$CPDPRG7= <mlev>
##$CPDPRG8= <mlev>
##$CPDPRGB= <>
##$CPDPRGT= <>
##$D= (0..31)
0 0.7 0 0 0 0 0 0 0 0 0 0.03 0 0 0 0 0 0 0 0 0 0 0 0 0 0 0 0 0 0 0 0 
##$DATE= 1750768396
##$DBL= (0..7)
120 120 120 120 120 120 120 120 
##$DBP= (0..7)
150 150 150 150 150 150 150 150 
##$DBP07= 0
##$DBPNAM0= <>
##$DBPNAM1= <>
##$DBPNAM2= <>
##$DBPNAM3= <>
##$DBPNAM4= <>
##$DBPNAM5= <>
##$DBPNAM6= <>
##$DBPNAM7= <>
##$DBPOAL= (0..7)
0.5 0.5 0.5 0.5 0.5 0.5 0.5 0.5 
##$DBPOFFS= (0..7)
0 0 0 0 0 0 0 0 
##$DE= 6
##$DECBNUC= <off>
##$DECIM= 32
##$DECNUC= <off>
##$DECSTAT= 4
##$DIGMOD= 1
##$DIGTYP= 9
##$DL= (0..7)
0 120 120 120 120 120 120 120 
##$DP= (0..7)
150 150 150 150 150 150 150 150 
##$DP07= 0
##$DPNAME0= <>
##$DPNAME1= <>
##$DPNAME2= <>
##$DPNAME3= <>
##$DPNAME4= <>
##$DPNAME5= <>
##$DPNAME6= <>
##$DPNAME7= <>
##$DPOAL= (0..7)
0.5 0.5 0.5 0.5 0.5 0.5 0.5 0.5 
##$DPOFFS= (0..7)
0 0 0 0 0 0 0 0 
##$DQDMODE= 0
##$DR= 18
##$DS= 0
##$DSLIST= <SSSSSSSSSSSSSSS>
$$ [...]
##$SUBNAM0= <"">
##$SUBNAM1= <"">
##$SUBNAM2= <"">
##$SUBNAM3= <"">
##$SUBNAM4= <"">
##$SUBNAM5= <"">
##$SUBNAM6= <"">
##$SUBNAM7= <"">
##$SUBNAM8= <"">
##$SUBNAM9= <"">
##$SW= 18.0517328524113
##$SWIBOX= (0..15)
0 0 2 0 0 0 0 0 0 0 0 0 0 0 0 0 
##$SW_h= 3612.71676300578
##$TD= 16384
##$TD0= 1
##$TE= 0
##$TE2= 300
##$TE3= 300
##$TEG= 300
##$TL= (0..7)
0 120 120 120 120 120 120 120 
##$TP= (0..7)
150 150 150 150 150 150 150 150 
##$TP07= 0
##$TPNAME0= <>
##$TPNAME1= <>
##$TPNAME2= <>
##$TPNAME3= <>
##$TPNAME4= <>
##$TPNAME5= <>
##$TPNAME6= <>
##$TPNAME7= <>
##$TPOAL= (0..7)
0.5 0.5 0.5 0.5 0.5 0.5 0.5 0.5 
##$TPOFFS= (0..7)
0 0 0 0 0 0 0 0 
##$TUNHIN= 0
##$TUNHOUT= 0
##$TUNXOUT= 0
##$USERA1= <user>
##$USERA2= <user>
##$USERA3= <user>
##$USERA4= <user>
##$USERA5= <user>
##$V9= 5
##$VALIST= <valist>
##$VCLIST= <CCCCCCCCCCCCCCC>
##$VD= 0
##$VDLIST= <DDDDDDDDDDDDDDD>
##$VPLIST= <PPPPPPPPPPPPPPP>
##$VTLIST= <TTTTTTTTTTTTTTT>
##$WBST= 1024
##$WBSW= 4
##$XGAIN= (0..3)
0 0 0 0 
##$XL= 0
##$YL= 0
##$YMAX_a= 263235
##$YMIN_a= -213079
##$ZGOPTNS= <>
##$ZL1= 120
##$ZL2= 120
##$ZL3= 120
##$ZL4= 120
##$ABSF1= 10
##$ABSF2= 0
##$ABSG= 5
##$ABSL= 3
##$ALPHA= 0
##$AQORDER= 0
##$ASSFAC= 0
##$ASSFACI= 0
##$ASSFACX= 0
##$ASSWID= 0
##$AUNMP= <proc_1d>
##$AZFE= 0.1
##$AZFW= 0.1
##$BCFW= 1
##$BC_mod= 2
##$BYTORDP= 1
##$COROFFS= 0
##$CY= -3
##$DATMOD= 1
##$DC= 2
##$DFILT= <>
##$DTYPP= 0
##$F1P= 0
##$F2P= 0
##$FCOR= 0.5
##$FTSIZE= 0
##$FT_mod= 4
##$GAMMA= 1
##$GB= 0.15
##$INTBC= 1
##$INTSCL= 1
##$ISEN= 128
##$LB= 0.25
##$LEV0= 0
##$LPBIN= 0
##$MAXI= 10000
##$MC2= 0
##$MEAN= 0
##$ME_mod= 0
##$MI= 1.114404
##$NCOEF= 0
##$NC_proc= 0
##$NLEV= 6
##$NOISF1= 3.799351
##$NOISF2= 2.8
##$NSP= 1
##$NTH_PI= 0
##$NZP= 0
##$OFFSET= 14.38212
##$PC= 1
##$PHC0= -1201.222
##$PHC1= 11.7922
##$PH_mod= 1
##$PKNL= yes
##$PPARMOD= 0
##$PSCAL= 0
##$PSIGN= 0
##$REVERSE= no
##$SF= 200.129724274929
##$SI= 16384
##$SIGF1= 3
##$SIGF2= 2
##$SINO= 400
##$SIOLD= 16384
##$SREGLST= <1H.CDCl3>
##$SSB= 0
##$STSI= 0
##$STSR= 0
##$SW_p= 3205.1282051282
##$SYMM= 0
##$S_DEV= 0
##$TDeff= 0
##$TDoff= 0
##$TI= <>
##$TILT= no
##$TM1= 0
##$TM2= 0
##$TOPLEV= 0
##$USERP1= <user>
##$USERP2= <user>
##$USERP3= <user>
##$USERP4= <user>
##$USERP5= <user>
##$WDW= 1
##$XDIM= 8192
##$YMAX_p= 0
##$YMIN_p= 0
$$ End of Bruker specific parameters
$$ ---------------------------------
##NTUPLES= NMR FID
##VAR_NAME=  TIME,          FID/REAL,        FID/IMAG
##SYMBOL=    X,             R,               I
##VAR_TYPE=  INDEPENDENT,   DEPENDENT,       DEPENDENT
##VAR_FORM=  AFFN,          ASDF,            ASDF
##VAR_DIM=   8192,          8192,            8192
##UNITS=     SECONDS,       ARBITRARY UNITS, ARBITRARY UNITS
##FACTOR=    0.0002768,     1,               1
##FIRST=     0,             0,               0
##LAST=      2.2672688,     0,               0
##MIN=       0,             -213079,         0
##MAX=       2.2672688,     263235,          0
$$ Real data points
##PAGE= N=1
##DATA TABLE= (X++(R..R)), XYDATA
$$ [...]
1672B87J43j45k44Qn83p6L14k5M44Rk21J89j45l01M81q2K97L79l72J70o15m71
$$ 287 430 285 41 49 -534 -610 -296 -321 123 132 -89 100 -45 -346 135 53 350 729 357 527 -88 -559
1694e59Q9n1L74M02r3j00q3l53K0K53Q5N75J22l25L7m31l98L72j68J03L92J81
$$ -559 -470 -521 -147 255 162 62 -21 -374 -354 -101 -16 559 681 356 393 -38 -436 -64 -232 -129 263 444
1716D44j22l75m16m2N6J1O86L85l93J09n21p3q6N2N34L45j97K6l86p21L91n44
$$ 444 322 -53 -469 -511 -455 -444 242 627 234 343 -178 -251 -337 -285 249 594 397 423 37 -684 -293 -837
1738h37L01O63N9o7J09m42k82J71K51N36J66l38L37k86n21j00j49K39K15l6L67
$$ -837 -536 127 186 119 228 -214 -496 -325 -74 462 628 290 627 341 -180 -280 -429 -190 25 -11 356
1759C56k20p92M6k52L2P65K60L26K36n95j12o3p8K04M29Q9k4l90o44Lr2j20N26
$$ 356 136 -656 -610 -862 -830 -65 195 521 757 162 50 -13 -91 113 542 631 607 217 -427 -424 -516 -636 -110
1782a10R5J99j70m90K71l29L9M54N89P9M19n38l28j33n28J61L18L30j95n9o26
$$ -110 -15 184 14 -476 -205 -534 -495 -41 548 627 1046 508 180 47 -481 -320 -2 328 133 74 -552
1803e52k43k14J91M13K91L75L57k99J32j10j98J99K47K7L57o77k91l78m33j65
$$ -552 -795 -1009 -818 -405 -114 261 618 319 451 341 143 342 589 616 973 296 5 -373 -806 -971
1823i71J41L43N17Nj09j7k93k88L41L65N12M57k87m38J1n56J53K76o3M17j11n37
$$ -971 -830 -487 30 35 -74 -91 -384 -672 -331 34 546 1003 716 278 289 -267 -114 162 99 516 405 -132
1845a32k44n57j3J39J13N79M20j08p3j10p2K44L82M31K27j65o45l38q33O3j26
$$ -132 -376 -933 -946 -807 -694 -115 305 197 124 14 -58 186 568 999 1226 1061 416 78 -755 -692 -818
1866h18QM98L0M7O4m17Q8J82K12N86L68k48J17n82l99J68k61N39L72k3l02k57
$$ -818 -810 -312 -282 -235 -171 -588 -500 -318 -106 480 848 600 717 135 -264 -96 -357 182 554 531 229 -28
1888b8o17K3j54l9N21J56J13k52k7m4K64L56M93L78J30k24k77o73n06l05k38L51
$$ -28 -645 -622 -776 -815 -294 -138 -25 -277 -304 -348 -84 272 765 1143 1273 1049 772 99 -407 -712 -950 -599
1910e99L10k12J06k65k53M28K89N98O82j13j22l31n70q3j75o1O37L42k42k82k85
$$ -599 -289 -501 -395 -660 -913 -485 -196 402 1084 971 849 518 -52 -135 -310 -371 266 608 366 84 -201
1931b01Lj98j25K39L50r8j0k81m21O5N5P55M81K63J86j62l51k0n87k19J24q1M8
$$ -201 -198 -396 -521 -282 68 -30 -40 -321 -742 -677 -622 133 614 877 1063 901 550 530 -57 -276 -152 -233 -185
1954a85m04j87j3j39j77Q38Q13J82K74K0n85q4m93J19K89j22J38j11k50k05k27
$$ -185 -589 -776 -789 -928 -1105 -267 546 728 1002 1022 437 353 -140 -21 268 146 284 173 -77 -282 -509
1975e09p5J85L50J04K48m61l43j84oJ11N20M06M18J54k93n2k56k75K38j97N9J38
$$ -509 -584 -399 -49 55 303 -158 -501 -685 -691 -580 -60 346 764 918 625 573 317 42 280 83 142 280
1997B80p34l50j52j42L94M83L36N62k2l44O0j43o3J49j66J36P8m65L1n67K73J18
$$ 280 -454 -804 -956 -1098 -704 -221 115 677 655 311 371 228 165 314 148 284 362 -103 -72 -639 -366 -248
2019b48J72o5O79n27m4j05o17L83Q3M9M65J62Q1j80k98J20L9K5L30q2m60p9k51
$$ -248 -76 -141 538 11 -33 -138 -755 -372 -289 -240 225 387 468 288 -10 110 149 174 504 422 -38 -117 -368
2042c68n37M48P4Q3L25M7K48k48j75R7J83m6L63m3qk43l74P5j89o4L04L47m61
$$ -368 -905 -457 -383 -300 25 72 320 72 -103 -6 177 131 494 451 443 200 -174 -99 -288 -352 -48 299 -162
2065a62L60o9n38J18r6K32K32l1J33Q9l71j17J37N3J45L23k54J14k36k82j98l8
$$ -162 198 129 -409 -291 -387 -155 77 46 179 268 -103 -220 -83 -30 115 438 184 298 62 -220 -418 -456
2087d56L01K35p7K54l44q3n7K50j10L59N4k34Q7j49J7j54j16M41p5j78K45j55
$$ -456 -155 80 3 257 -87 -170 -227 23 -87 272 326 92 179 30 47 -107 -223 218 143 -35 210 55
2109E5r9J3j29J48J18j25P3N1j95J28k78k2L19j31J76r3j0J78j25l76L69r8R4
$$ 55 -44 -31 -160 -12 106 -19 54 105 -90 38 -240 -262 57 -74 102 9 -1 177 52 -324 45 -53 41
2132D1m2r5j08M4K0J81j00KQ6l4j88K61J0nP9O6Q6q1j99mo4J3J40r6NK7k21J50
$$ 41 -1 -96 -204 -160 -140 41 -59 -57 29 -5 -193 68 78 73 152 218 304 223 24 20 -44 -31 109 13 18 45 -176 -26
2160b6l2L1m78M69p4%J80k09J26K47k95K13N4q3R8k73J83R1n16K23K2j67L03p6
$$ -26 -58 -27 -505 -36 -110 -110 70 -139 -13 234 -61 152 206 123 221 -52 131 222 -294 -71 -49 -216 87 11
2184A1k87K54l29K64J27J30o6K4j3oK61l73O8r8j03Q5N3k1QKL9K5j42J72k3k37
$$ 11 -276 -22 -351 -87 40 170 104 128 115 109 370 -3 65 -33 -136 -51 2 -19 -11 -9 30 55 -87 85 62 -175
2210a75K06m6k25K77j40J00K9j65K78l4R3r4J1k11P2k55P4L34k33J02J05j07O5
$$ -175 31 -15 -240 37 -103 -3 26 -139 139 105 198 104 115 -96 -24 -279 -205 129 -104 -2 103 -4 61
2233F1O1o4q4L71l96K62k18JJ12l62M3J15j4K09J06k25J20j4k61J77J56k06K65
$$ 61 122 58 -26 345 -51 211 -7 -6 106 -256 -213 -98 -112 97 203 -22 98 84 -177 0 156 -50 215
2256B15k30J53k97mJ29J16k54K80m6j53Q9k55qL08P7OJ06n1j13r9k58L96j96q2
$$ 215 -15 138 -159 -163 -34 82 -172 108 62 -91 -2 -257 -265 43 120 126 232 181 68 -31 -289 107 -89 -171
2280a71L91j46ln5k63O9J16N0j5J87r0n4Lj47J01Q2L5j10J23R3j84j14p9oJ30
$$ -171 220 74 71 16 -247 -178 -62 -12 -27 160 70 16 19 -128 -27 55 90 -20 103 196 12 -102 -181 -187 -57
2305e7J24q3j00j8J33k38K05J49j3Q6O2K2n7j29j32j57n0M22j23J2k06j78p5K30
$$ -57 67 -16 -116 -134 -1 -239 -34 115 102 188 250 272 215 86 -46 -203 -253 169 46 58 -148 -326 -401 -171
2329a71J61K40n3o2km6j36L4j35K21J64j68M8J56k40j34k04J71jJ58k56J13l70
$$ -171 -10 230 177 115 113 67 -69 -35 -170 51 215 47 95 251 11 -123 -327 -156 -157 1 -255 -142 -512
2352e12L53Mq5J24L49OK54j20j12k94P4r4K31m9j8n20k3J75j1l13O01m4Q8K52
$$ -512 -159 -155 -240 -116 233 239 493 373 261 -33 41 -53 178 129 111 -409 -432 -257 -268 -581 20 -24 64 316
2376C16j10L1q9j25l9K47k29K97k6l52J50k43o4K41n4J09r1j32j08k8l04J97J94
$$ 316 206 237 148 23 -16 231 2 299 273 -79 71 -172 -236 5 -49 60 -31 -163 -271 -299 -603 -406 -212
2399b12M88J63j11j66L03j50j13L6M0Q6k12k26k76J07l11m6L46m9M46j07Q7j15
$$ -212 276 439 328 162 465 315 202 238 278 364 152 -74 -350 -243 -554 -600 -254 -303 143 36 123 8
2421Hm4J93M0n0J82o1k76n9m2P8q1Q5Rj77K3M4qk39j3k5L16J5K74j7L29l56N4
$$ 8 -36 157 197 147 329 268 -8 -67 -109 -31 -112 -27 -18 -195 -172 -128 -136 -375 -388 -413 -97 -82 192 175 504 148 202
2448B02L06k99K00k93Q2k61j86k01p1l7N19k68J70J35Q0q6R0r0K60K30Rk70Pq7
$$ 202 508 209 409 116 198 -63 -249 -450 -521 -558 -39 -307 -137 -2 78 -8 82 -8 252 482 491 221 228 141
2472A41k19j2OJ61l68L19j49r8j00j34J25J4L54o2L67k39Q4M1j09J31Lk5Q2Rk78
$$ 141 -78 -90 -84 77 -291 28 -121 -219 -319 -453 -328 -314 40 -22 345 106 190 231 122 253 256 231 313 322 44
2497D4j28q9k72P8j24L44m8J51n5r2k9K08K02L15J31n9m41K4q1j13M0J28j19J9
$$ 44 -84 -173 -445 -367 -491 -147 -195 -44 -99 -191 -220 -12 190 505 636 577 136 160 79 -34 6 134 15 34
2521C4j44k51J00k24K42M9J18L40j89m4J35k21K31P0j46L70j95nk11j79k94K86
$$ 34 -110 -361 -261 -485 -243 -194 -76 264 75 31 166 -55 176 246 100 470 275 270 59 -120 -414 -128
2543a28n6j58L16K7k26j81J02J57R2M21r6l1J94k06j18j15J14K2l5j2o4k19J67
$$ -128 -184 -342 -26 1 -225 -406 -304 -147 -55 366 270 239 433 227 109 -6 108 130 95 83 19 -200 -33
2566c3k38K04ok46L54j02LJ56Q4j77o4K57J79j27k05K22n0k53j13J83m8k0j02
$$ -33 -271 -67 -73 -319 35 -67 -64 92 176 -1 -65 192 371 244 39 261 211 -42 -155 28 -20 -40 -142
2589a42p7J3j29K07k75M45J71k6J24P6l86J49j68J13j19j4J07K6j42j58J52k04
$$ -142 -219 -206 -335 -128 -403 42 213 187 311 387 1 150 -18 95 -24 -38 69 95 -47 -205 -53 -257
2611b57N1J73J46j4Jq5j02n5K14j60J33j06K45j01j25M6j25m7J26J3Q4l2p2q5
$$ -257 -206 -33 113 99 100 15 -87 -142 72 -88 45 -61 184 83 -42 4 -121 -168 -42 -29 55 23 -49 -134
2635a34j04J91j85L03j51J06J85j96o2N8L0P8Mq7J44j43l10J28RJ45j21J49MN5
$$ -134 -238 -47 -232 71 -80 26 211 15 -47 11 41 119 123 36 180 37 -273 -145 -136 9 -112 37 41 96
2659I6r5k69J74J22j07M4J03j67k8L9oJ05J00J7k20M2k5q5nJ24JO2k01J91J27
$$ 96 1 -268 -94 28 -79 -35 68 -99 -127 -88 -94 11 111 128 -92 -50 -75 -160 -165 -41 -40 22 -179 12 139
2684A39j11n4j49O9J82o1P0J07j87Q4p2j84K53m7k9J94m9o4m4K2Nn6r1L23k71
$$ 139 28 -26 -175 -106 76 15 85 192 5 89 17 -167 86 39 10 204 155 91 47 69 74 18 -73 250 -21
2709b1J16p2R8k05J1O2J33l41M36l6k47PM4mo2K84k31P8j94j02L48j18J21p6k9
$$ -21 95 23 121 -84 -73 -11 122 -219 217 181 -66 -59 -15 -19 -81 203 -28 50 -144 -246 102 -16 105 29 0
2734@k7k0k6j2J03O2M1J42j47K9O3l44K66j97K04j00l46K10M5r1R9K8J90Kn21
$$ 0 -27 -47 -73 -85 18 80 121 263 116 145 208 -136 130 -67 137 37 -309 -99 -54 -145 -46 -18 172 174 -347
2759c47L77n2l0R5J68j35j33M8O9N2p9n3Q1P0m24K17l6J6J43j00J1p1J13MK38
$$ -347 30 -22 -52 43 211 76 -57 -9 60 112 33 -20 61 131 -293 -76 -112 -96 47 -53 -42 -113 0 4 242
2784B42j51O7J2j97J57o7K6N7k42O2p2O9K2l4q5J93k9j23j34K57K1n2J67j48R3
$$ 242 91 158 170 -27 130 63 89 146 -96 -34 -106 -37 -15 -49 -134 59 30 -93 -227 30 51 -1 166 18 111
2809A11l49L09r1J88j62k21L47j9j02KK31k69M3o6JJ77j15J37m34K80O7P3P2l84
$$ 111 -238 71 -20 168 6 -215 132 113 11 13 244 -25 18 -48 -47 130 15 152 -282 -2 65 138 210 -174
2833a74L69j22l6n8j10m5k17N25j93q6R3N0l8O4kL39k98k11Q9J31j43o3L11j28
$$ -174 195 73 37 -21 -131 -176 -393 132 -61 -147 -54 -4 -42 22 20 359 61 -150 -61 70 -73 -136 175 47
2857D7q1K3K2l4K82m95K96j1KJ65k47Q0n1K42k25n7K74j31j83K69k10J83k24J13
$$ 47 -34 -11 11 -23 259 -236 60 49 51 216 -31 49 -2 240 15 -42 232 101 -82 187 -23 160 -64 49
2881D9o3m9l8k6J99l22L00j88K23j71P8RN9O0p3j9J26j16Q2J28q6j92R4k27R9
$$ 49 -14 -63 -101 -127 72 -250 50 -138 85 -86 -8 1 60 120 47 28 154 38 120 248 162 -30 64 -163 -64
2906f4K5k6M9L5j21m3pJ19R9K6k8o7J06k11J57r2J08j53oJ46k87k4J88J15Q0k43
$$ -64 -39 -65 -16 19 -102 -145 -152 -33 66 92 64 -3 103 -108 49 -43 65 -88 -94 52 -235 -259 -71 44 124 -119
2932a19J27j7P9J12j56J0j82K87k7k54n5N4%K25J1j81O6Q4q2J73k37M5O5qj94
$$ -119 8 -9 70 182 26 36 -146 141 114 -140 -195 -141 -141 84 95 -86 -20 64 -18 155 -82 -37 28 20 -174
2957a74J71K96j33j39Q4k12N3J26Rqj67J35p5K9k03L42k96O3l3O6J42k07J81r1
$$ -174 -3 293 160 21 105 -107 -54 72 81 73 -94 41 -34 -5 -208 134 -162 -99 -132 -66 76 -131 50 -41
2981d1M7j18K15k43K08Q2j33j51K18j25L33n13L13J18p1j26J96k76m3k4J41Q3
$$ -41 6 -112 103 -140 68 150 17 -134 84 -41 292 -221 92 210 139 13 209 -67 -110 -134 7 90
3003I0r9j01K79k14l1Q3J59l87K19Qk4K47j36j28j87J68j4J70k93J27L10k49J91
$$ 90 -9 -110 169 -45 -76 7 166 -221 -2 6 -18 229 93 -35 -222 -54 -68 102 -191 -64 246 -3 188
3026A88j37Lk65K56j14N0j4R4k1r7K0%J96j29J16j87J01l9R0k19P5mJ09l13K39
$$ 188 51 54 -211 45 -69 -19 -33 61 40 -57 -37 -37 159 30 146 -41 60 21 111 -108 -33 -37 72 -241 -2
3051b%O0J16k10K60l5j00j41p8K1R3M7l0m0o3K25K3k11J55J91l40J16j00J42k
$$ -2 -2 58 174 -36 224 189 89 -52 -130 -109 -16 31 1 -39 -102 123 146 -65 90 281 -59 57 -43 99 97
3076I7mr3o6J55N0j05Q6K8j73K5j57K02k28J23L0jk8kjJ11p2L2J93j53k30o9J49
$$ 97 93 0 -66 89 139 34 120 148 -25 0 -157 45 -183 -60 -30 -31 -59 -61 -62 49 -23 9 202 49 -181 -250 -101
3103a01j2K79k12j58J83J04j3p5L0J38r7N7k8r9K7l3o9j96K28J5j79K53j16M2
$$ -101 -113 166 -46 -204 -21 83 70 -5 25 163 66 123 95 -4 23 -10 -79 -275 -47 -32 -211 42 -74 -32
3127c2J53n7k35J60j42q7K85J49m26m4M38k37J49J13p9l3j04k2K5m1J10l0L0k1
$$ -32 121 64 -171 -11 -153 -240 45 194 -232 -276 162 -75 74 187 108 75 -29 -51 -26 -67 43 13 43 22
3151B2NJ02k90K29j51J58l6l5N0l25J77K36M0l05K9K07j92R9k5Kk17J85J02j82
$$ 22 27 129 -161 68 -83 75 39 4 54 -271 -94 142 182 -123 -94 113 -79 20 -5 -3 -220 -35 67 -115
3175a15K37k76K1L09l09kJ08J95j70K29j45l4n8J48j62K8j3M7o5J58k33J23%j14
$$ -115 122 -154 -133 176 -133 -135 -27 168 -2 227 82 48 -10 138 -24 4 -9 38 -27 131 -102 21 21 -93
3199i3JO2j05K62m5j93J97l9J15k23R7l3j51J12pR2P0k74R8oJ76k9j09M6J38J00
$$ -93 -92 -30 -135 127 82 -111 86 47 162 -61 36 3 -148 -36 -43 49 119 -155 -57 -63 113 84 -25 21 159 259
3225B59k02j59J19J64j81j38R6J13Q0j45j9N9j28M7j11L83j37j94J45j1K5r7Q
$$ 259 57 -102 17 181 0 -138 -42 71 151 6 -13 46 -82 -35 -146 237 100 -94 51 40 65 -32 -24
3248b4p0K92k21P5n8K16j84J2k60L47k25k3J14r7J87k44M5J85p3J13K5k00J25
$$ -24 -94 198 -23 52 -6 210 26 38 -222 125 -100 -123 -9 -106 81 -163 -118 67 -6 107 132 -68 57
3271E7m9J5N0L2J39l21J97k93J05M2j0O0j07j3K20k07J8N6KO8q7O7Lk6o8K23k52
$$ 57 8 23 73 105 244 -77 120 -173 -68 -26 -36 24 -83 -96 124 -83 -65 -9 -7 61 -26 41 44 18 -50 173 -79
3298g9L11l07P2q5j53K15OR6k71K9L39j76n1j1K66L3Km25K64j8o1N6K07j47j47
$$ -79 232 -75 -3 -88 -241 -26 -20 76 -195 -166 173 -3 -54 -65 201 234 236 -189 75 57 -4 52 259 112 -35
3323c5j03J01J9j8o1Q4n1K96k23o3p6rJ10J08K8M2Lk03k85K87j4L6N6o8O2J32
$$ -35 -138 -37 -18 -36 -97 -13 -64 232 9 -54 -130 -139 -29 79 107 149 152 -51 -336 -49 -63 -27 29 -39 23 155
3349A55m5j80Q6N6k37L26m1J35P2l69N0j04J86oO6l26K22m1r3J08j54K51q7J55
$$ 155 110 -70 16 72 -165 161 120 255 327 -42 8 -96 90 84 150 -176 46 5 -88 20 -134 117 30 185
3373A85k66J65J38l4j66J31j70j10P2R7j17M6O4m1r4o1K44j30j3K43j94K55j03
$$ 185 -81 84 222 188 22 153 -17 -127 -55 42 -75 -29 35 -6 -100 -161 83 -47 -60 183 -11 244 141
3396A41k53J0K5J99r7J6q1q1j5L11j19N5k03OJ48qJ3m19K36J55j48K37j53Q6m6
$$ 141 -112 -102 -77 122 25 41 -40 -121 -136 175 56 111 -92 -86 62 54 67 -352 -116 39 -109 128 -25 61 15
3421A5J5n4L1L4q4L52k97Q6l3R5m00M6O3P1j9M5p1k11L73K1J03m2m2o1j07k5L75
$$ 15 30 -24 7 41 -43 309 12 98 65 160 -240 -194 -131 -60 -79 -34 -105 -316 57 78 181 139 97 36 -71 -96 279
3448B79l61J41P5MR6j58noo1J43l7k04K33j34j54J09j80K72O4j08l9M8P2j14j83
$$ 279 -82 59 134 138 234 76 71 65 4 147 110 -94 139 5 -149 -40 -220 52 116 8 -31 17 89 -25 -208
3473b08K71l30J79k6R5L5J59o6l04K47k5K3j40K6J80k55J80j78J69J3M1J0j49
$$ -208 63 -267 -88 -114 -19 16 175 109 -195 52 27 50 -90 -64 116 -139 41 -137 32 45 86 96 -53
3496e3R9j06m2J44Rj12j6J21j41J78kn8j04J33n8j33K0NJ62m2q5P3j52J42j71
$$ -53 46 -60 -102 42 51 -61 -77 44 -97 81 79 21 -83 50 -8 -141 -121 -116 46 4 -81 -8 -160 -18 -189
3521a89J7J20mj11L34q2j93q0K95l12J53k75N66j13r8J34j94K24m42L27j01l6
$$ -189 -172 -52 -56 -167 167 85 -108 -188 107 -205 -52 -327 239 126 28 162 -32 192 -250 77 -24 -60
3543f0pK93j04j46m8o6P3J32k56P7J26Pk01K37p5k8j05M6Q4O4j47K18j35R0j46
$$ -60 -67 226 122 -24 -72 -138 -65 67 -189 -112 14 21 -180 57 -18 -46 -151 -105 -21 43 -104 114 -21 69 -77
3568g7l0L53k42j28J6J3R2j05Q0l69L24K13o1k15j0J76n4J37K4j7j87PQ4j01K19
$$ -77 -107 246 4 -124 -108 -95 -3 -108 -28 -397 -73 140 79 -136 -146 30 -24 113 137 120 -67 -60 24 -77 142
3593A42k70K29K2j39o3Q3J55l5q6p7m6P8k3J43n0k55K07M2J19k16k8j42K39O1
$$ 142 -128 101 123 -16 -79 4 159 124 38 -39 -85 -7 -30 113 63 -192 15 57 176 -40 -68 -210 29 90
3617I0j33J39p2Rj57L28j61K1j55j40J75r4J24r9J11R1j68K11lJ2l89M47l30J30
$$ 90 -43 96 24 33 -124 204 43 64 -91 -231 -56 -150 -26 -125 -14 77 -91 120 117 129 -260 187 -143 -13
3641a3O1Qn2K2j76K54j66K18q6M2p9r5J80J24l66J74R3j39J07m7K7j86j13K30
$$ -13 48 56 4 26 -150 104 -62 156 70 112 33 -62 118 242 -124 50 143 4 111 64 91 -95 -208 22
3665B2K9kN5k88K55q8n3j36J23J78k04j36J92L3P1l7m5o1R0k41K06L50l78K5n9
$$ 22 51 49 104 -184 71 -17 -70 -206 -83 95 -109 -245 -53 -20 51 14 -31 -92 -2 -243 -37 313 -65 -40 -99
3690i9n1L55j71L2j81K5K59l4l18M9K29j60R0r9J50p8L7K13m36L06j46j07J71
$$ -99 -150 205 34 66 -115 -90 169 135 -183 -134 95 -65 25 -74 76 -2 35 248 -188 118 -28 -135 36
3713C6j84J16j0J1M4k16K85m8O0m7K5j15j28R9R3j20J4JQ4%J86j33rq7q2J24K0
$$ 36 -148 -32 -42 -31 13 -203 82 34 94 47 72 -43 -171 -72 21 -99 -85 -84 0 0 186 53 44 -43 -125 -1 19
3740A9J01o3Q0j90J51j23J51j75nK6J41m3j11J68K9j49K0j42M9J50j04p7Q1j24
$$ 19 120 57 137 -53 98 -25 126 -49 -54 -28 113 70 -41 127 156 7 27 -115 -66 84 -20 -97 -16 -140
3764a40J64J29k64R5R4J56k33L04m24P3L5o9R6J09J0L1k25J28N9N7j9k34L5K4
$$ -140 24 153 -111 -16 78 234 1 305 -119 -46 -11 -80 16 125 135 166 -59 69 128 185 166 -68 -33 -9
3788iN5p8L1n4k6L23o6j81J92m04K28p7kQk78M19j01q0Q0P7n3j8P4k0J5p8k21
$$ -9 46 -32 -1 -55 -81 242 176 -5 187 -217 11 -66 -68 -60 -338 81 -20 -100 -20 57 4 -14 60 40 55 -23 -244
3815b44K07n1rJ39K4k27K96p3J99j12k92J64j14J03k48J69Q4j30K38k05J98j55
$$ -244 -37 -88 -97 42 66 -161 135 62 261 149 -143 21 -93 10 -238 -69 15 -115 123 -82 116 -39
3837c9j71K60p8k4J71k8k8J55j64J46k74N2p9J21J67k09M4j5N8J1p5K1j48L04
$$ -39 -210 50 -28 -52 119 91 63 218 54 200 -74 -22 -101 20 187 -22 22 7 65 76 1 22 -126 178
3861A78l75K90j95K62k37K21l73K13j91M59k80K0R6j13K66k00j23j6J04M8j19
$$ 178 -197 93 -102 160 -77 144 -229 -16 -207 252 -28 -8 88 -25 241 41 -82 -98 6 54 -65
3882f5J1J52r8J28Q3j69j53J10Q3J18k20O7j97jJ94K01j75l2J47j96m0r9O1J62
$$ -65 -54 98 0 128 211 42 -111 -1 82 200 -20 47 -150 -151 43 244 69 37 184 -12 -52 -151 -90 72
3906G2k07J02Jo3J82j56K5j02J51j76K78k9J05k52M6p2O9k4O4J04l30K01M5j39
$$ 72 -135 -33 -32 -95 87 -69 -44 -146 5 -171 107 78 183 -69 -23 -95 -26 -50 14 118 -212 -11 34 -105
3930a05J05J5qK2j83P6L5J00j50j43L39j9j20n3L1O5J22k03p7J42J47r1J05l19
$$ -105 0 15 7 29 -154 -78 -43 57 -93 -236 103 84 -36 -89 -58 7 129 -74 -151 -9 138 47 152 -167
3954a67Q3K30k96K53M9j3k99J84Q7p5Jr0P9QJ15j56L1O2k29J48J75m36K71J44
$$ -167 -84 146 -150 103 152 139 -160 24 111 36 37 -53 26 34 149 -7 24 86 -143 5 180 -256 15 159
3978A59l55J30J28r6n4j23L10k92L46m1k50j57K92l5J58j65N1m8J92Rl07K09j22
$$ 159 -196 -66 62 -34 -88 -211 99 -193 153 112 -138 -295 -3 -38 120 -45 6 -42 150 159 -148 61 -61
4001f1o7J5L33j10q1MJ7L3p9K27k59L6R6M0Pj52J94l91J47O9j18J04N3l4j16J01
$$ -61 -128 -113 220 110 29 33 50 83 4 231 -28 8 104 144 151 -1 193 -198 -51 18 -100 4 57 23 -93 8
4027Hj30J05K6R1l4j42J23n2j11K20k78J85q0O4J13j54J69p3qQ0J11q4k86J68
$$ 8 -122 -17 9 100 66 -76 47 -5 -116 104 -174 11 -69 -5 108 -46 123 50 42 122 233 149 -137 31
4051C1r9K23j64j4P7L5k8k3N9j81J44J63l47K69l09L13j74J42j16lP2p8l0J68
$$ 31 -68 155 -9 -23 54 89 61 38 97 -84 60 223 -124 145 -164 149 -25 117 1 -2 70 -8 -38 130
4075A30j3k01q7J33k8J46l5j48Q7j00R9j03R2J03Q3j99M1l6p5J09J21k57l3K23
$$ 130 117 -84 -171 -38 -66 80 45 -103 -16 -116 -17 -120 -28 75 158 -41 0 -36 -111 -2 119 -138 -171 52
4099E2K8J2j49PQ0J42p8j77P9r9K14m2N1Rn2O8r4K4l9P9m1p8k5L47l94L2J78k24
$$ 52 80 92 -57 -50 30 172 94 -83 -4 -103 111 69 120 129 77 145 51 75 36 115 74 -4 -29 318 -76 -44 134 -90
4127i0Q1m6j1j5P0J55k43M3L5j29j36J01J85j41J09K03K1j25r6J24L5j68q1K1
$$ -90 -9 -55 -66 -81 -11 144 -99 -56 -21 -150 -286 -185 0 -141 -32 171 192 67 -29 95 130 -38 -119 -98
4151i8J62L6k7J1r3k5K24q2m1p9l3m8K25p9j60Q7J2j91L46k77p9J39K23k05J40
$$ -98 64 100 73 84 -9 -34 190 108 67 -12 -45 -93 132 53 -107 -20 -8 -199 147 -130 -209 -70 153 -52 88
4176H8j23k46K92QJ43l34K71Rk01J3J28k10K8J55p0J60O8k64J16O2r1M4j60K33
$$ 88 -35 -281 11 19 162 -172 99 108 -93 -80 48 -162 -134 21 -49 111 179 -85 31 93 2 46 -114 119
4200A19j52j03J62j40J38m3J8J77K1n6j10o9L3n1R0Q8j03p0k5j26M05J5l26JR5
$$ 119 -33 -136 26 -114 24 -19 -1 176 197 141 31 -38 -5 -56 34 122 19 -51 -76 -202 203 218 -108 -107 -12
4225a2o7P7p0J06k1mkj92J58j2o6K01L6%j08M3j47N7J44j36j25J14K0O3J1q5O1
$$ -12 -79 -2 -72 34 13 9 7 -185 -27 -39 -105 96 132 132 24 67 -80 -23 121 -15 -140 -26 -6 57 68 -17 44
4252D4N0R7j74J9j1l0J25j62J30j3o9j47P9J77L9j94J05p6R6l5j19P0j56J16J12
$$ 44 94 191 17 36 25 -5 120 -42 88 75 6 -141 -62 115 154 -40 65 -11 85 50 -69 1 -155 -39 73
4277G3P9k03j48J07J99pq5K4Q1J9k90J15M7L6O1o1O6K9m53L15j81K57q9J4J13
$$ 73 152 -51 -199 -92 107 100 15 39 120 139 -151 -36 11 47 108 47 113 142 -311 4 -177 80 -9 5 118
4302A18Oj63r5J31j25r0L16P3k40J95j79J17o1o1R2q7K20l2k0j46K5k4n7J91J1
$$ 118 124 -39 -134 -3 -128 -218 98 171 -69 126 -53 64 3 -58 34 -53 167 135 115 -31 -6 -30 -87 104 115
4327A15o7J00lj79O7o8Q5J0m5k1k4k0q8L7J48p1N4J01K1j35n6l7O7K8L0j71J19
$$ 115 48 148 145 -34 33 -35 50 60 15 -6 -30 -50 -138 -101 47 -24 30 131 152 17 -39 -76 -9 19 49 -122 -3
4354cN3j57j2J13Q9k4N4j08N5j46%L5Q3N8J02J81k23mo7j00oj00K83k60P6J07
$$ -3 50 -107 -119 -6 83 59 113 5 60 -86 -86 -51 32 90 192 373 150 146 79 -21 -27 -127 156 -104 -28 79
4380G9j38Q9J08j27L9N5nj09k0K62m37K97Q5k45n4K34j37J61r9l2Q5k14L20l02
$$ 79 -59 30 138 11 50 105 100 -9 -29 233 -204 93 178 -67 -121 113 -24 137 38 6 91 -123 197 -105
4404a05J48k11K49K8J3j02l2p9j20J86k72L37j88K51k78M11m35L6K49j35K26l11
$$ -105 43 -168 81 109 122 20 -12 -91 -211 -25 -297 40 -148 103 -175 236 -199 -163 86 -49 177 -134
4426a34K18k54J40J95o2j21R8j52J76k25r3O1K13M7j59J06j19j1J45j43j40L63
$$ -134 84 -170 -30 165 103 -18 80 -72 104 -121 -214 -153 60 107 -52 54 -65 -76 69 -74 -214 149
4448A49K0k01k6Qn4R3J6K2p3K30j62j01k38J79nJ41j0J52j9q3k07N0L66k94J75
$$ 149 169 -32 -58 -50 -104 -11 5 27 -46 184 22 -79 -317 -138 -143 -2 -12 140 121 38 -169 -119 247 -47 128
4473A28k21L3n0J81r2o5J33P0j13Q5J5j32Q3j70J32J85j77m2j23O6JJ07o4L04
$$ 128 -93 -60 -110 71 -21 -86 47 117 4 89 104 -28 55 -115 17 202 25 -17 -140 -74 -73 34 -30 274
4497B74j82R3K6k25K7J2o4K15M4k30k6O9M7j07K32j28l29L15j01j8j66K98M6k36
$$ 274 92 185 211 -14 13 25 -39 176 220 -10 -36 33 80 -27 205 77 -252 63 -38 -56 -222 76 122 -114
4521a14K57j08j14K35r5q2j17L6Q9m4O7J21m4l3j24q5J90j70%K61j45k42L58k71
$$ -114 143 35 -79 156 61 -21 -138 -102 -13 -57 10 131 87 54 -70 -155 35 -135 -135 126 -19 -261 97 -174
4545a74L53l4p5j25J04J99m19J49K29m2j81k45L17N%l3R4j86j6M4l8L2k22M53
$$ -174 179 145 70 -55 49 248 -171 -22 207 165 -16 -261 56 61 61 28 122 -64 -80 -36 -74 -42 -264 189
4569A89j06l43K08n7K03j31P0K9Mj12K37j36m1J37m4k06k5m8K32P3j07n7j23R3
$$ 189 83 -260 -52 -109 94 -37 33 62 66 -46 191 55 14 151 107 -99 -124 -172 60 133 26 -31 -154 -61
4593f1mP2N4lj74K41j35rk89N18k79j5J23J06k13Q4j29K41k16p2L2J25n5O3lj64
$$ -61 -65 7 61 58 -116 125 -10 -19 -308 210 -69 -84 39 145 -68 16 -113 128 -88 -160 -128 -3 -58 5 2 -162
4619a62J84j96R9M9L30m31J19j25J09j48J39K6L6n3lk15K78J03J40j24k48L51
$$ -162 22 -174 -75 -26 304 -127 -8 -133 -24 -172 -33 -7 29 -24 -27 -242 36 139 279 155 -93 258
4641B58k61J69k2j73P5q8r5J77J01j70L5J86j91R0j73J26o3K6J79k22P2r6J59
$$ 258 -3 166 144 -29 46 -42 -137 40 141 -29 6 192 1 91 -82 44 -19 7 186 -36 36 -60 99
4664I9j87pJ3J69K6l63L46k71J87M2j69q1K04Qq9K66k64J3R8N2j46K09k65J16
$$ 99 -88 -95 -82 87 113 -250 96 -175 12 54 -115 -196 8 16 -73 193 -71 -58 40 92 -54 155 -110 6
4688FP0J17k08J07O0p5R2j21L5q1k00J96Ll4P8q0J41l95J52k4R9J59j37P3q8M3
$$ 6 76 193 -15 92 152 77 169 48 83 2 -198 -2 1 -33 45 -35 106 -289 -137 -161 -62 97 -40 33 -55 -12
4714a2R0O0j54r5J45j86J12l3J05o3o4J25J09N1j12r7m4O2O2n1N7j58O6j42K01
$$ -12 78 138 -16 -111 34 -152 -40 -73 32 -31 -95 30 139 190 78 -19 -63 -1 61 10 67 -91 -25 -167 34
4739C4J27n3j4j37K30L0k87r4K36J12k45MJ40j86J30k50K27Q6p1o6Q0kRr4q7O9
$$ 34 161 108 94 -43 187 217 -70 -164 72 184 -61 -57 83 -103 27 -223 4 90 19 -47 33 31 40 -54 -141 -72
4765g2J86j31J89k98K94j73pK21l85K46J7J9k47J33J11j98P8J72j67J4p9q6R1
$$ -72 114 -17 172 -126 168 -5 -12 209 -176 70 87 106 -141 -8 103 -95 -17 155 -12 2 -77 -163 -72
4788g2L4N8j07j3M01k85%k1o7J75k53J60O5mJ35j95k3P9j16%J49p9J0j05O8q7
$$ -72 -38 20 -87 -100 301 16 16 -5 -72 103 -150 10 75 71 206 11 -12 67 -49 -49 100 21 31 -74 -6 -93
4814i3K4nJ20J03j48k6L4J23p0M5j73L1j25M2q8K16l4K96k51j21K03k6O4k34o5
$$ -93 -69 -74 46 149 1 -25 9 132 62 107 -66 -35 -160 -118 -206 10 -24 272 21 -100 103 77 141 -93 -158
4839a58L5N8o3J09L0J12r0M4R5j8q3j21J38qK46k12k62K36m0j51J5JQ7r0o4J82
$$ -158 -123 -65 -128 -19 11 123 33 77 172 154 71 -50 88 80 326 114 -148 88 48 -103 -88 -87 0 -90 -154 28
4865B8j10p9k3J52J62p1J4J05j74r4M2l89N05J23k60J27K2Q7j49l9n5k0mN6K12
$$ 28 -82 -161 -184 -32 130 59 73 178 4 -90 -48 -437 68 191 -69 58 80 167 18 -21 -76 -96 -100 -44 168
4890A68p2j9j35K14k45K24n5pk40J52N0L1j01j8r8J00Q1R7j5k31J97k16R0k1K88
$$ 168 96 77 -58 156 -89 135 80 73 -167 -15 35 66 -35 -53 -151 -51 30 127 112 -119 78 -138 -48 -69 219
4915B19k02J90k09k5N2p4K82l45J28k8J01kr8N1q6o6K39J85l66J63J28j59Kj05
$$ 219 17 207 -2 -27 25 -49 233 -112 16 -12 89 87 -11 40 -46 -112 127 312 -54 109 237 78 80 -25
4939b5Q9r4l1L6J33J92K8n03J45K03j94J48l12K58rn9j5J09k4j9j16J35K4j52
$$ -25 64 -30 -61 -25 108 300 328 -175 -30 173 -21 127 -185 73 64 5 -10 99 75 56 -60 75 99 -53
4963e3O7M2o8q7K95k11j7P9J12k53j08K58j14J15Jj02N6m7n5J8K57j70j18K13
$$ -53 14 56 -12 -99 196 -15 -32 47 159 -94 -202 56 -58 57 58 -44 12 -35 -90 -72 185 15 -103 110
4987A10k61P4J77p5k33OK01K5j64J56j27L1J96k86J66j09K03J19j31J41k6m2k15
$$ 110 -151 -77 100 25 -208 -202 -1 24 -140 16 -111 -80 116 -170 -4 -113 90 209 78 219 193 151 -64
5010f4P6K05j38j9j0k7k42L24k27J40j27J15J04j57n5K2m5M1J65j1j50Q9K3N8
$$ -64 12 217 79 60 50 23 -219 105 -122 18 -109 6 110 -47 -102 -80 -125 -84 81 70 -80 9 32 90
5034I0J94k66k0nl3K41l14K20j86K10J63k22M7j21J58n8q0j13N3j4O0m5q5M08
$$ 90 284 18 -2 -7 -40 201 -113 107 -79 131 294 72 119 -2 156 98 18 -95 -42 -56 4 -41 -126 282
5058B82j96j08J04l22J94J41R2q6k05q6L23L0k7j91k10K44Q1k00K38k67j3L57
$$ 282 86 -22 82 -240 -46 95 187 101 -104 -190 133 163 136 -55 -265 -21 60 -140 98 -169 -182 175
5080A75l7j17j52K5J80J22j58O0j22J72j75j10n9K96j77J10j3m2mnR5n4o1j44
$$ 175 138 21 -131 -106 74 196 38 98 -24 148 -27 -137 -196 100 -77 33 20 -22 -26 -31 64 10 -51 -195
5104a95K78k07m7J81J3J41k3j54J32l37K44K4P4j87L23k51j73R4J53j99m7J48
$$ -195 83 -124 -171 10 23 164 141 -13 119 -218 26 50 124 -63 260 9 -164 -70 83 -116 -163 -15
5126a5J36j30P7j41Jk5M4J95j6Lq1j04N3q1m4J76j76R2j1J18r8j39L30k09L3L0
$$ -15 121 -9 68 -73 -72 -97 -53 142 126 129 48 -56 -3 -84 -128 48 -128 -36 -47 71 -27 -166 164 -45 -12 18
5152A8K1j3q6Ln8K23k08K56k62Q8J78j35MQ4j49J1jK34k49k06M61l66K41k9k48
$$ 18 39 26 -60 -57 -115 108 -100 156 -106 -18 160 25 29 113 -36 -25 -26 208 -41 -247 214 -152 89 60 -188
5177a88R4J77p8JOJ6l8j00P4P5J06j08k91J00J95j69K30o8j46J36n1K40m06J98
$$ -188 -94 83 5 6 12 28 -10 -110 -36 39 145 37 -254 -154 41 -128 102 34 -112 24 -27 213 -193 5
5201EJ31j87K05k53N8L0m2j08L11k29J10n3K09j88l3J90N9k32j02J98j98J06O3
$$ 5 136 -51 154 -99 -41 -11 -53 -161 150 -79 31 -22 187 -1 -34 156 215 -17 -119 79 -119 -13 50
5224E0J3j58J31J35q0k46J86o9k33J99pJ05j34J43l44M73j40r9O3J41R0l69J72
$$ 50 63 -95 36 171 91 -155 31 -38 -271 -72 -79 26 -108 35 -309 164 24 -75 -12 129 219 -150 22
5247B2J1m5j72L20j60o2j26K39k32lL75j8l48J46J14j02J75q8oL2L3m2k66J19
$$ 22 33 -12 -184 136 -24 -86 -212 27 -205 -208 167 149 -199 -53 61 -41 134 46 40 72 105 63 -203 -84
5271h4J45o4j23J37l3K9J86j53j24K05k62l8K36j40L52j21Rk19k5J79k57R9n7
$$ -84 61 -3 -126 11 -22 7 193 40 -84 121 -141 -179 57 -83 269 148 157 -62 -87 92 -165 -66 -123
5294a23L47k97n9J53N5j27P9J03q4q2R2J33j4k06Q1j32K09q9j49P6R2j88L66j99
$$ -123 224 -73 -132 21 76 -51 28 131 47 -35 57 190 176 -30 51 -81 128 39 -110 -34 58 -130 236 37
5318C7q1K14j77j27J47K4j17J82k48K50n1k7j67K87P2k28R3j11L1l14K73o5K15
$$ 37 -44 170 -7 -134 13 37 -80 102 -146 104 53 26 -141 146 218 -10 83 -28 3 -311 -38 -103 112
5341A12j20n7K63j34l47M04J23j63J3r5q0P7L8j48K52j91J21j61Q7k0P5j7j41
$$ 112 -8 -65 198 64 -283 121 244 81 94 -1 -81 -4 34 -114 138 -53 68 -93 -6 -26 49 32 -109
5364a09K3L47l91L80j79K9N4k74o2K13P7k33j19K54N9K4k86L17j3j76j08J67L6
$$ -109 -86 261 -130 250 71 100 154 -120 -182 31 108 -125 -244 10 69 93 -193 124 111 -65 -173 -6 30
5387C0R4q0l19N10k48k0K8R0J00l38L47k31P3Ln6j17J48m1k4J38j94O2R0J59j13
$$ 30 124 44 -275 235 -13 -33 -5 85 185 -153 194 -37 36 39 -17 -134 14 -27 -51 87 -107 -45 45 204 91
5412I1j82M4J28j44J28j21P9k4m5N4J2L7N9n8j43K29k38K01k63L29q4p7j86L12
$$ 91 -91 -47 81 -63 65 -56 23 -1 -46 8 20 57 116 58 -85 144 -94 107 -156 173 89 12 -174 138
5436A38j92J01m0N8P1j21j82qL73l78J83Kj4J0j00o2O8L22j10J28n3k97J4N1k4
$$ 138 -54 47 7 65 136 15 -167 -175 198 -180 3 5 -9 1 -99 -161 -93 229 119 247 194 -103 -89 -38 -62
5461f2J86j52j85L56n3K2r8p4L4Oj25J21k8K77j87j42mJ21k2J82l4l29J96Q1k13
$$ -62 124 -28 -213 143 90 112 14 -60 -26 -20 -145 -24 -52 225 38 -104 -108 13 -9 173 139 -190 6 87 -126
5486a26M2Lj63J91J60j57J32q4O9J40q3j37J43l9j25J37k59J27k4k9P6O2p1J9
$$ -126 -84 -81 -244 -53 107 -50 82 -2 67 207 124 -13 130 91 -34 103 -156 -29 -53 -82 -6 56 -15 4
5510DmK4k24L31j01j21n8J93J60l80K3L23l57K17l8q6K75j11KJ0rj23N1Q9k14
$$ 4 0 24 -200 131 30 -91 -149 44 204 -176 -153 170 -187 30 -8 -94 181 70 72 82 73 -50 1 90 -124
5535a24J73j04J85k02J26j60q0K07j35J97J9k50J39j81J85K2q1P7%Q7p7q0J15
$$ -124 49 -55 130 -72 54 -106 -186 21 -114 83 102 -148 -9 -190 -5 17 -64 13 13 100 23 -57 58
5558E8j37P5P1l3J1n4J55k93J59j32K96j52k7j00N4K82k16k32K21J9j13K06Jq6
$$ 58 -79 -4 67 34 45 -9 146 -147 12 -120 176 24 -3 -103 -49 233 17 -215 6 25 -88 118 119 33
5582C3k43K48l8J00j4k4j19L9n0N3l7P6J1r4p0K41k7m18L88j83P1J4q3O0J08q1
$$ 33 -210 38 0 100 86 62 -57 -18 -68 -15 -52 24 35 -59 -129 112 85 -333 55 -128 -57 -43 -126 -66 42 -39
5608c9R5O5j56l5n7J6L00p0k71J33j46K78q6j50j6M2J32o5J22j67J40j95O6l3
$$ -39 56 121 -35 -70 -127 -111 189 119 -152 -19 -165 113 27 -123 -139 -97 35 -30 92 -75 65 -130 -64 -97
5632i7J88M4k25R2J21J76k33k35O5O1N0m6P9O3k05J12l4J63k53L05r5p1j51J02
$$ -97 91 135 -90 2 123 299 66 -169 -104 -43 7 -39 40 103 -102 10 -24 139 -114 191 96 25 -126 -24
5656b4N9k8Q2n2Q4j07k29K53j09J53o7j10N9K41k33J62k27P8k7J09l5n7q5O2K14
$$ -24 35 7 89 37 121 14 -215 38 -71 82 15 -95 -36 205 -28 134 -93 -15 -42 67 32 -25 -110 -48 166
5681A66j63P0k2p6J48k55K05q1P3q8j7oLJ83j39o2J92k43L1Q7n4k4j11K42j02
$$ 166 3 73 51 -25 123 -132 73 -8 65 -23 -40 -46 -43 140 1 -61 131 -112 -81 6 -48 -72 -183 59 -43
5706d3m7Lk9K50M6k57j23J00L08k02O0k60O4L01k8j76J18k36K86j86J68q1k8l6
$$ -43 -90 -87 -116 134 180 -77 -200 -100 208 6 66 -194 -130 171 143 -33 85 -151 135 -51 117 36 8 -28
5730b8j04P4J43K6q3mP7Nk5l62L64j95J60j85NK32p7J29l29M39l53J89j11l6q5
$$ -28 -132 -58 85 111 28 24 101 106 81 -281 83 -112 48 -137 -132 100 23 152 -177 262 -91 98 -13 -49 -134
5755a34oL58l00o5K24J32j27j1k16K18n3Q7j29j1j8K26j66n3K46k53J65k38N3
$$ -134 -140 218 -82 -147 77 209 82 71 -145 73 20 107 -22 -33 -51 175 9 -44 202 -51 114 -124 -71
5778g1J36o4L2Q7qpN5P3j96j51J09k43L65j63K12j01j77K05j95J39m6J35j98K41
$$ -71 65 1 33 120 112 105 160 233 37 -114 -5 -248 117 -46 166 65 -112 93 -102 37 -9 126 -72 169
5802A69j47j67L83k69J80l26J33r0p4J73j71K70Lm7J02q6j26R6K24r0j39K7l7
$$ 169 22 -145 238 -31 149 -177 -44 -134 -208 -35 -206 64 67 20 122 36 -90 6 230 140 1 28 -9
5825ip5J74j49J01L2j05J29j19j2M9q0RJ27jJ46j69J70j65r0N9r5n5K00p6j16
$$ -9 -84 90 -59 42 74 -31 98 -21 -33 16 -64 -55 72 71 217 48 218 53 -37 22 -73 -128 72 -4 -120
5850a20J94k77L10q0j39L1RJ58l1r2J43k36P3J49j70O2K2L4N2k57L54k87K73j26
$$ -120 74 -203 107 27 -112 -81 -72 86 55 -37 106 -130 -57 92 -78 -16 6 40 92 -165 189 -98 175 49
5874D9j59J45j23j0J08or2J55j7j16l3l5pJ88k16K15k8j8Lj5K28k15J25lj36O1
$$ 49 -110 35 -88 -98 10 4 -88 67 50 -66 -99 -134 -141 47 -169 46 18 0 3 -12 216 1 126 123 -13 48
5900D8k3N7l7M7l1j88K40j05j29L1K05p8O5k24p3K79j58o9J69J5N4j78%j32J87
$$ 48 25 82 45 92 61 -127 113 8 -121 -90 115 37 102 -122 -195 84 -74 -143 26 41 95 -83 -83 -215 -28
5925b8J38k92L79j37j02J05k4j05m2K00J06k79J76K0j36p7J04M7m7K6K3mJ04l1
$$ -28 110 -182 197 60 -42 63 39 -66 -108 92 198 -81 95 115 -21 -98 6 53 6 32 55 51 155 124
5949A24r5q1J30j81J58Pj21K40k18l6nJ0M2K10j26J35j50J37j77m4J2L6J72j81
$$ 124 29 -52 78 -103 55 62 -59 181 -37 -73 -78 -68 -26 184 58 193 43 180 3 -41 -29 7 179 -2
5973bJ6j32J07n4L5N6j12p3N9K28M1p8m4Q2r3K4m5j5j18m9J47M9j98J56K4J7J12
$$ -2 14 -118 -11 -65 -30 26 -86 -159 -100 128 169 91 47 129 36 60 15 0 -118 -167 -20 29 -169 -13 11 28 140
6000A40mk01K0oj08K63j76Q6p2Q1j19K80l4j24P8k62J82N9Rj5k4O0l7p0j49K27
$$ 140 136 -65 -45 -51 -159 104 -72 14 -58 23 -96 184 150 26 104 -158 24 83 92 77 53 113 76 6 -143 84
6026H4o7K02k06M0l7J00k26K11j0P3o4j16l2J79k48j16K86K5k6M1j87K0K27l43
$$ 84 17 219 13 53 16 116 -110 101 91 164 100 -16 -48 131 -117 -233 53 78 52 93 -94 -74 153 -190
6050a90J33J9r0K32p7J84k28j60J55J80j94J23k28K24j64J99l76K99L0j04J68
$$ -190 -57 -38 -128 104 27 211 -17 -177 -22 158 -36 87 -141 83 -81 118 -258 41 71 -33 135
6071A35k61P7J16j54J67K7L8j03J06o7j10P3k20K59j01r0J95j54j40J60J26k9
$$ 135 -126 -49 67 -87 80 107 145 42 148 81 -29 44 -176 83 -18 -108 87 -67 -207 -47 79 50
6093E0J46k24o3QQ0J23N1l3j67l9K62r3L6k17m4K90l25J16r1J94k10PJ18m9K12
$$ 50 196 -28 -91 -83 -3 120 171 138 -29 -68 194 101 137 -80 -124 166 -159 -43 -134 60 -150 -143 -25 -74 138
6118A38l30K32j81K40j57O1J24j08L9j81J66M2o8P5j06J10J0Ml7p4M3m1J99p7
$$ 138 -192 40 -141 99 -58 3 127 19 58 -123 43 85 17 92 -14 96 106 110 73 -1 42 1 200 123
6142A23J20l16M8j56J34K55k01R7k2j03J45j81P6K4k5RK5R4l16L10k33J94l05
$$ 123 243 -73 -25 -181 -47 208 7 104 82 -21 124 -57 19 43 18 27 52 146 -170 140 -93 101 -204
6165b04K39J17r5J09n0o6P8k55J25lJ17kj49j49K23o4J86j93J07j25K51n9m28
$$ -204 35 152 57 166 116 50 128 -127 -2 -5 112 110 -39 -188 35 -29 157 -36 71 -54 197 138 -290
6188b90J53j67M48j70j30R4K68j65J17k15j24J46J43o9M9N9j09O7j93o6L72k93
$$ -290 -137 -304 144 -26 -156 -62 206 41 158 -57 -181 -35 108 39 88 147 38 105 -88 -154 218 -75
6210g5J89Q7k02K24j75j0j10Q6m9J88k21q6q0L26J25k23j24J55L7J33k03J9KJ7
$$ -75 114 201 -1 223 48 38 -72 14 -35 153 -68 -154 -234 92 217 -6 -130 25 62 195 -8 11 13 30
6234C0j04pJ86J94l48K7o9L7NK22j04n2J03j39p9O7K63k37J01l31J98J09K1l81
$$ 30 -74 -81 105 299 -49 -22 -91 -54 -49 173 69 17 120 -19 -98 -31 232 -5 96 -235 -37 72 93 -288
6258b88q8L35O5l7J58j41q3M3J30p4N2N3J2k47J48M3j80K07j58o5P9M7j35J75
$$ -288 -376 -41 24 -13 145 4 -79 -36 94 20 72 125 137 -110 38 81 -99 108 -50 -115 -36 11 -124 51
6282E1k24K26m3j06j47K91n1L6Oq3K3j18K91l07M4m3J81m1l7K87j58r5k4p6K3
$$ 51 -173 53 10 -96 -243 48 -3 33 39 -44 -21 -139 152 -155 -111 -154 27 -14 -51 236 78 -17 -41 -117 -94
6307i4J89k33P0O5lJ59o0Q0rk58K7J23J47j72R8q3N4J5k15K7J52o1j88K48L9j45
$$ -94 95 -138 -68 -3 -6 153 93 173 164 -94 -67 56 203 31 129 46 100 115 -100 -73 79 18 -170 78 117 -28
6333b8N7n4J21r0J62j95Qj74J40P8j47J39J52k40J27K9k65K10k64Q2K00j7J49
$$ -28 29 -25 96 6 168 -27 -19 -193 -53 25 -122 17 169 -71 56 85 -180 30 -234 -152 48 31 180
6356A80j31k26j27J63K44L7m6j35L2N4J24m5l14K55j8r7P2O7k51K88l7K8j0j12
$$ 180 49 -177 -304 -141 103 140 94 -41 -9 45 169 124 -190 65 47 -50 22 89 -162 126 89 117 107 -5
6380eQ4q0m7n0K70l02J60J28j86N3O1j99K32k08L5K8j00PJ57K6P3j61lj6J48j60
$$ -5 79 -1 -48 -98 172 -130 30 158 -28 25 86 -113 119 -89 -54 -26 -126 -119 38 64 137 -24 -27 -43 105 -55
6406e5J35J3j91J38N3j28J51o3k20R9J32k0k03J80q8J92j88J37k6m9r3J02r4J16
$$ -55 80 93 -98 40 93 -35 116 53 -167 -68 64 44 -159 21 -67 125 -63 74 48 -1 -94 8 -86 30
6430C0j71J82J04j61n1l5K10j71J36j47j02L31j75K53l93J34K84l41J36K34l63
$$ 30 -141 41 145 -16 -67 -102 108 -63 73 -74 -176 155 -20 233 -160 -26 258 -83 53 287 -76
6451g6J74k06K39k10J10J35l03P6P8n9k9R4R1j19J1ol50L65P5lK5j02k00J99O4
$$ -76 98 -108 131 -79 31 166 -137 -61 17 -42 -71 23 114 -5 6 0 -350 15 90 87 112 10 -190 9 73
6476G3j27J43J41m4l15J22j23J08j25L67m21L18j76j31J52K29j67j6j44R9L8o9
$$ 73 -54 89 230 186 -129 -7 -130 -22 -147 220 -201 117 -59 -190 -38 191 24 8 -136 -37 1 -68
6498f8k3J32o9o2l7Q0O1k8K42k95N6j98K66k06L85l09J85j98O4Lk6k4J10j69J82
$$ -68 -91 41 -28 -90 -127 -47 14 -14 228 -67 -11 -209 57 -149 236 -73 112 -86 -22 -19 -45 -69 41 -128 54
6523E4j29kP7M3q7J75k68k8Q4J04M6k47K04j52J68r0J81r1Lk68J82k8J2o5N0P2
$$ 54 -75 -77 0 43 -44 131 -137 -165 -81 23 69 -178 26 -126 42 -48 133 42 45 -223 -41 -69 -57 -122 -72 0
6549@j38K53k92K02q7r2K6J83j11L4M0k02J91q6J67l2j26Q6n2J11j36j8J80k73
$$ 0 -138 115 -177 25 -62 -154 -128 55 -56 -22 18 -184 7 -79 88 56 -70 16 -36 75 -61 -79 101 -172
6573a72J92k4L6r9L17l70K61p6l3Pp7M3O5N7q0r6L0j42J26j24N8K17M9j42rL18
$$ -172 20 -4 32 -67 250 -120 141 65 32 39 -38 5 70 127 47 -49 -19 -161 -35 -159 -101 116 165 23 14 332
6599C32m32K28k24J45k08K39j0j84P8n3k1K51J9k03J36l7p9O1J07k17j08JK42
$$ 332 -100 128 -96 49 -159 80 70 -114 -36 -89 -110 141 160 -43 93 56 -23 38 145 -72 -180 -179 63
6622F3m2j10j2M2Q4R1l14K42J4j25P9j19K70j89K37k57M0j3K07j23k41J18L5L71
$$ 63 21 -89 -101 -59 25 116 -198 44 58 -67 12 -107 163 -26 211 -46 -6 -19 188 65 -176 -58 -23 348
6646C48j68l41M53j05j13j40N1j44K70p4p1j33J96J05l08K13k59K18J84q1r6N9
$$ 348 180 -161 292 187 74 -66 -15 -159 111 37 -34 -167 29 134 -174 39 -220 -2 182 101 5 64
6668F4l09Q8O4m9K21O2J17l24J45q8p0J04J09k40M5P0p1NJ30j03p6k9J22P5L3
$$ 64 -245 -157 -93 -142 79 141 258 -66 79 -9 -79 25 134 -106 -61 9 -62 -57 73 -30 -106 -135 -13 62 95
6693I5pj10j58K47j57J0j4O8J5k8o3J22p5R5o5J79m2j43j3L0O8m4j9J14k3L7q2
$$ 95 88 -22 -180 67 -90 -80 -94 -26 -11 -39 -102 20 -55 40 -25 154 112 -31 -44 -14 54 10 -9 105 82 119 37
6720C7k1l0k57N96l32p3n1K28j43j26K32k5k32K61M9j64N2r6K01j42p0J68j34
$$ 37 16 -14 -271 325 -7 -80 -131 97 -46 -172 60 35 -197 64 113 -51 1 -95 106 -36 -106 62 -72
6743g2NJ16M0q0n4K9J62m6p5L8pk5j89K10J0N3k66J60P0n5j83K17r0L3o6J99k34
$$ -72 -67 49 89 9 -45 -16 146 100 25 63 56 31 -158 52 62 115 -151 9 79 24 -159 58 -32 1 -65 134 -100
6770a00M1K0J38j03k3J65j60%J3j73L97j78Lk28J17J48k16R7MK43j34o1N5N5j57
$$ -100 -59 -39 99 -4 -27 138 -22 -22 -9 -182 215 37 40 -188 -71 77 -139 -42 -38 205 71 10 65 120 -37
6795c7j13J54m7l1j12K57Kj92M06k68o2J53j20j36K24k10J48j3J1j29M2J39n1
$$ -37 -150 4 -43 -74 -186 71 73 -119 287 19 -43 110 -10 -146 78 -132 16 3 14 -115 -73 66 15
6818A5K9Pj4J08l42J31lP6j76R3PO4J01m8L6m5J2J62r8K8j81j51N5J06q8j0q8
$$ 15 44 51 37 145 -197 -66 -69 7 -169 -76 -69 -5 96 48 84 39 51 213 115 143 -38 -189 -134 -28 -116 -126 -214
6845b14K19o3L0m2L3j1P1n0J05r7J25J1l02P9J41n7k21J56J6o7O1o4J80o6M1L9
$$ -214 5 -58 -28 -70 -37 -48 23 -27 78 -19 106 117 -185 -106 35 -22 -243 -87 -71 -138 -77 -141 39 -27 14 53
6871E3j43k9P4o6K80q9Nq7o7L61l33J12j66J04O8p7j04j1K01N9l6k44J50k4r1
$$ 53 -90 -119 -45 -111 169 80 85 -2 -69 292 -41 71 -95 9 77 0 -104 -115 86 145 109 -135 15 -9 -100
6896a00L27k19R0M3j15m9q2K19k26J68j37o2O5j13J04K0rJ1nJ73Qm1N5r0j53M0
$$ -100 227 8 98 141 26 -23 -105 114 -112 56 -81 -143 -78 -191 -87 -67 -76 -65 -70 103 111 70 125 35 -118 -78
6922g8J41k20M21l78k9K17k36K64l30R1J73j03K27J49l43j23J31o4K45m24L43
$$ -78 63 -157 264 -114 -143 74 -162 102 -228 -137 36 -67 160 309 -34 -157 -26 -90 155 -269 74
6943G4j55m5J39l8k8M8N5J6j92J96j65R1j62K21N2J3j41L3Jj43o0J39P3R9k18
$$ 74 -81 -126 13 -25 -53 -5 50 66 -126 70 -95 -4 -166 55 107 120 -21 12 13 -130 -190 -51 22 121 -97
6968i7J72K4j08n6K6o4Q2Q1j92L09k87jkJ76n8J7J11k33K53k63J08l5M8j0PmJ75
$$ -97 75 99 -9 -65 -39 -103 -21 60 -132 177 -110 -111 -113 63 5 22 133 -100 153 -110 -2 -37 11 1 8 4 179
6995A79l36J55q4p6J74r0J77q5K0k00M00l89L03M5j53j59n7L08r2M0j13K34j57
$$ 179 -157 -2 -86 -162 12 -78 99 14 34 -166 234 -155 148 193 40 -119 -176 132 40 80 -33 201 44
7018D4r9R9j1j82J83k22K43j88J09q9M2L16m50Q0J16P9k36K01m9L3P2k22K38j3
$$ 44 -55 44 33 -149 34 -188 55 -133 -24 -113 -71 245 -205 -125 -9 70 -166 35 -14 19 91 -131 107 94
7042I4k80J64J80l54K38L9Lj24P6J4n8j62K26j07j36J65R9J04k95K36n7m4J38
$$ 94 -186 -22 158 -196 42 81 84 -40 36 50 -8 -170 56 -51 -187 -22 77 181 -114 122 65 21 159
7065A59p2j72j04K05k75L30j15l5K14o7j01n6L8l6nJ10J51j82N3K2L9j32q0J72
$$ 159 87 -85 -189 16 -259 71 -44 -79 135 68 -33 -89 -51 -87 -92 18 169 -13 40 62 101 -31 -111 61
7089F1o0j20K52r9k91J89j29K68j10q9K05n7m6q6J00J36j34N8l6k17J99pj5P3
$$ 61 1 -119 133 34 -257 -68 -197 71 -39 -128 77 20 -26 -112 -12 124 -10 48 12 -205 -6 -13 -28 45
7113D5K2n9j55L0J47R7j1j21k77L67j71L67j32l56J30j20K75K6j78L80k89J82
$$ 45 67 8 -147 -117 30 127 116 -5 -282 85 -86 281 149 -207 -77 -197 78 104 -74 306 17 199
7135A99l03o9J39p7J51j88L08j25K2r3o4O0J52k20n1K27k17K92k43oJ74j93J08
$$ 199 -104 -173 -34 -111 40 -148 160 35 57 -36 -100 -40 112 -108 -159 68 -149 143 -100 -106 68 -125 -17
7158a7p0L11k56J60j06Q7l3J21o6k56J05j5J22j4J07l60J07Jm2K7j14L30j13j15
$$ -17 -87 224 -32 128 22 109 76 197 131 -125 -20 -35 87 73 180 -180 -73 -72 -114 -87 -201 129 16 -99
7182i9J64j54M3L3kQ0J20j73nJ69k94K62l52Qn8J3K81j65J24L4p4K1%J6q9J83
$$ -99 65 -89 -46 -13 -15 65 185 12 7 176 -118 144 -208 -200 -258 -245 36 -129 -5 29 -45 -24 -24 -8 -97 86
7208H6J66r3k55J72k45P4R3O6j68N0k6m2Q3P8P6j35P1k49Q4Q1L9P7J52o2k86K78
$$ 86 252 159 -96 76 -169 -95 -2 64 -104 -54 -80 -122 -39 39 115 -20 51 -198 -114 -33 6 83 235 173 -113 165
7234A65j01p6lr7P2K27j25m3q4qM0k9J1j00J14J61j85k68M30n9P0j68J53q7L9
$$ 165 64 -12 -15 -112 -40 187 62 19 -65 -73 -33 -62 -51 -151 -37 124 -61 -329 101 42 112 -56 97 10 49
7259D9j11P5O2p4J46m76K96k36L31j46J14J56k54K68l71J12L65m08%K40j85m1
$$ 49 -62 13 75 1 147 -329 -33 -269 62 -84 30 186 -68 200 -171 -59 306 -102 -102 138 -47 -88
7281h8M7L7j04j1J24q0O6k02K02j16K08kL5l6L0p3j08J5N8Jk7j4o5K60k63J18
$$ -88 -41 -4 -108 -119 5 -75 -9 -211 -9 -125 83 81 116 80 110 37 -71 -56 2 3 -24 -38 -103 157 -106 12
7307A2m9K07j34j09K79j80O4nK5Kn6j44L9PJ03O3K0k18R4k16L26k83Q4q3K22j00
$$ 12 -37 170 36 -73 206 26 90 85 110 112 56 -88 -49 -42 61 124 144 -74 20 -196 130 -153 -69 -152 70 -30
7333c0R1R6k48J09k23L21pk5J4j32M4O2j27J07k6rk92L6R8J71P6j90J15J9J04
$$ -30 61 157 -91 18 -205 116 109 84 98 -34 10 72 -55 52 26 17 -275 -239 -141 30 106 -84 31 50 154
7358A54l27K23N6j9R0j25m7j39K22j94P9O8k49J93j26OP1J8q2J45K86l03k42L09
$$ 154 -173 50 106 87 177 52 5 -134 88 -106 -27 41 -208 -15 -141 -135 -64 -46 -128 17 303 0 -242 67
7382F7l6O5j42K64J99k85J21l08Q6p8K03j82k5j07J32J22Mp1j2q9J40j17K3m9
$$ 67 31 96 -46 218 417 132 253 -55 31 -47 156 -26 -51 -158 -26 96 100 29 17 -72 68 -49 -26 -75
7406g5K86l17m7R9J1J73J89l77j8J45j90n8J75J85k63M2r6K28p7J6j42J24J24
$$ -75 211 -106 -153 -54 -43 130 319 -58 -76 69 -121 -179 -4 181 -82 -40 -136 92 15 31 -111 13 137
7429A37m9L4q0r5%k53K66j7Q7J3j31L4l1J06Pp3O4Q2J1j04L2m8j29R6J41j14J06
$$ 137 88 122 42 -53 -53 -306 -40 -57 30 43 -88 -54 -85 21 28 -45 19 101 112 8 40 -8 -137 -41 100 -14 92
7456I2k3N6l78J30J99q5J27o6KqL1j52m1K55k20M4N6j38M1M4R7k05K50l1k31K37
$$ 92 69 125 -253 -123 76 -9 118 52 54 46 77 -75 -116 139 -81 -37 19 -119 -78 -34 63 -142 108 77 -154 83
7482H3qj26L3J67k25j45K4L58j34m3J72k47J59j7q7J22kL1j46J97k75m0J52J45
$$ 83 75 -51 -18 149 -76 -221 -197 161 27 -16 156 -91 68 51 -36 86 84 115 -31 166 -109 -149 3 148
7506A48k08l1K84k78J75j79J53q8J23J11l20NR6O9J54l00O7m3P3O8j17J13L7l56
$$ 148 -60 -91 193 -85 90 -89 64 -24 99 210 -110 -105 -9 60 214 -86 -19 -62 11 79 -38 75 112 -244
7530b44K48M9j23J2J43j45J15O0l4Q1j60M1k5R8j50o8J45j46J49R8k68J74j54
$$ -244 4 53 -70 -58 85 -60 55 115 81 162 2 43 18 116 -34 -102 43 -103 46 144 -124 50 -104
7553a04K73j76J89j95J6O5j09K6j28J03k4k0k1K85l00p8J36K03j72J23j5q0K69
$$ -104 169 -7 182 -13 3 68 -41 -15 -143 -40 -64 -84 -105 180 -120 -198 -62 141 -31 92 77 -3 266
7576B66n9n29L17JR0q6O0J30n5n1k86J43J02l6j18k6P0O2k7J41j67N8N3r4j06
$$ 266 207 -322 -5 -4 86 0 60 190 135 84 -202 -59 43 7 -111 -137 -67 -5 -32 109 -58 0 53 -41 -147
7601a47K55j91L14p0j89R7j98kJ71q0K4K9j36J96L5j64PK79k36o4N0J46p0rj37
$$ -147 108 -83 231 161 -28 69 -129 -131 40 -40 -16 13 -123 73 108 -56 -49 230 -6 -70 -20 126 56 47 -90
7626i0J19K4j16O5R1j60l4O7m7o3M5K0J73o3j67J12J09R1q2o1K9r1M8L3o2K16
$$ -90 29 53 -63 2 93 -67 -101 -34 -81 -144 -99 -79 94 31 -136 -24 85 176 94 33 62 -29 19 52 -10 206
7652B06k62Q9K3J06r1O7k47r2J32L0L0j5n2K40l1j63jR5k0m7p2O5O5J2k9r0K75
$$ 206 -56 33 56 162 71 138 -109 -201 -69 -39 -9 -24 -76 164 133 -30 -31 64 44 -3 -75 -10 55 67 38 -52 223
7679B23j51k2K1rn8k8jn1J76l0j31J85k91J43j27J18N4k09J58J4j84L28j7k23
$$ 223 72 50 71 62 4 -24 -25 -76 100 70 -61 124 -167 -24 -151 -33 21 -188 -30 -16 -200 128 111 -112
7703a12J35m4K1P5j27J68j79J00k1k48L66k14J43j18qP1K0r4k9O6l0P7j28K44
$$ -112 23 -21 0 75 -52 116 -63 37 16 -232 134 -80 63 -55 -63 8 28 -66 -95 -29 -59 18 -110 134
7727A34j17j54K6K32k1ql4Q8k60J47r1n6o4K40j12L2j26L09o1l2j12J49p3R8m3
$$ 134 17 -137 -111 121 100 92 58 146 -114 33 -58 -114 -178 62 -50 -18 -144 165 104 72 -40 109 36 134 91
7752I1J85l51J13n8L3J58j97r0J13O1j01P4L9o5M1k62K51m9R5j19j18K14mO2k37
$$ 91 276 -75 38 -20 13 171 -26 -116 -3 58 -43 31 70 5 46 -216 35 -14 81 -38 -156 58 54 116 -121
7777a21M6J69P5k37J12k05K03o6k40K24R7q8K2r6K2J27j36J37r6Q3r6K50l05J81
$$ -121 -75 94 169 -68 44 -161 42 -24 -264 -40 57 -31 -9 -105 -83 44 -92 45 -51 32 -64 186 -119 62
7801F2o2j80L33r3q7M3n3j42J92R1l0r1L4r1J04j4K11l69K47k14N5J02j02O3R
$$ 62 0 -180 153 60 -27 16 -37 -179 13 104 74 -17 17 -74 30 16 227 -142 105 -109 -54 48 -54 9 18
7826A8J08k13J97k22K27l24K52m8NP8j57K3n3K7k9K18N7q0q0n8J61j13K5R1n4
$$ 18 126 -87 110 -112 115 -209 43 -5 0 78 -79 -56 -109 -82 -111 107 164 84 4 -54 107 -6 19 110 56
7851E6l45K59J21J0k15M0K3Q9l0P4p6l7J35j23N2O0l49J78M1L0p5l5J75j79Q6
$$ 56 -289 -30 91 101 -114 -74 -51 38 8 82 6 -31 104 -19 33 93 -256 -78 -37 -7 -82 -117 58 -121 -35
7876c5J2l6K2pJ83N7j21r7j46J81L61o72K95n1n6J35k5J27M3k98r0K78k58K95
$$ -35 -23 -59 -37 -44 139 196 75 -22 -168 13 374 -298 -3 -54 -110 25 0 127 170 -128 -218 60 -198 97
7900I7r3q3Q2P7j08O2r1k9K54k65J20k4Q7m13M84Lo6P2l03J76N5o6N1j31JR5k01
$$ 97 4 -79 3 80 -28 34 -57 -86 168 -97 23 -1 86 -327 157 160 94 166 -137 39 94 28 79 -52 -51 44 -157
7927a57m7K98p5j00K75k43K0K35j60o7QOJ29j08NJ0k5j59K94l30K74J0j84N3j48
$$ -157 -204 94 19 -81 194 -49 -29 206 46 -21 -13 -7 122 14 19 29 4 -155 139 -191 83 93 -91 -38 -186
7952a86Q7J91l7Q8j84L9K4O9k79K33R3r2j03j68K01J30j16k41K63r9J91r0k2L4
$$ -186 -99 92 55 143 -41 -2 22 91 -188 45 138 46 -57 -225 -24 106 -10 -251 12 -87 104 14 -8 26
7976B6J27k03J32r7L8mLj6Q5N3k0k99J69j10K59j56N2Or2J57rk4r6O2j6K82k97
$$ 26 153 -50 82 -15 23 19 22 6 91 144 124 -175 -6 -116 143 -13 39 45 -47 110 101 77 -19 43 27 309 12
8003A2KL5j55J81n6m3K1mj95J81K9O7j16J76mk97J57J40r0Q9o5k5j44K55k36J70
$$ 12 14 49 -106 75 19 -24 -3 -7 -202 -21 8 75 -41 135 131 -166 -9 131 41 130 65 40 -104 151 -85 85
8029H5%j12j01K28j46R5Q2m02k0L99L5k65L3J11j45J06J26j25rJ79k09l4Q3q2
$$ 85 85 -27 -128 100 -46 49 131 -271 -291 108 143 -122 -89 22 -123 -17 109 -16 -25 154 -55 -89 -6 -88
8053h8J72J8j56j0J08M3j71p4M15l29K13k72Q1K4K39j00p1R5r4k6q6M9J13n7j3
$$ -88 84 102 -54 -64 44 87 -84 -158 257 -72 141 -131 -50 -26 213 113 42 137 43 17 -69 -20 93 36 23
8078B3mJ39l7j66K4j06O6j76K16r9m4M1J62j32m2O3k9K02rL7k22K03j74J11r2
$$ 23 19 158 121 -45 -21 -127 -61 -237 -21 -120 -164 -123 39 -93 -135 -72 -101 101 92 129 -93 110 -64 47 -45
8103d5J65j13j7j02J68J29l46R5K8J53r6O2L2L6J21l29nK7l4N9J8L2j60m6K78
$$ -45 120 7 -10 -112 56 185 -161 -66 -38 115 19 81 113 149 270 -59 -64 -37 -71 -12 6 38 -122 -168 110
8128A10o1J28k58J24j74K01J13j62o9J57p6q7O6r0K15m33J59RO4RL05k47p2m8
$$ 110 49 177 -81 43 -131 70 183 21 -48 109 33 -54 12 -78 137 -296 -137 -128 -64 -55 250 3 -69 -117
8152a17l8J56l0o1K19l4j47P4L7j39P5m6j35J89j06M7N9J9o0m1J92mk3o4N2J58
$$ -117 -155 1 -29 -90 129 95 -52 22 59 -80 -5 -51 -186 3 -103 -56 3 22 -38 -79 113 109 86 22 74 232
8178B32k71O3j21L01k75O5j8p6M6K19Q5l25J41
$$ 232 -39 24 -97 204 -71 -6 -24 -100 -54 165 250 -75 66
8191F6
$$ Imaginary data points
##PAGE= N=2
##DATA TABLE= (X++(I..I)), XYDATA
0@%%%%%%%%%%JrJ6j6J6k4L2l9M7n6O6p4Q9j06J29j53J77k07K39k73L12l57M06
$$ 0 0 0 0 0 0 0 0 0 0 0 1 -8 8 -8 8 -16 16 -23 24 -32 34 -40 49 -57 72 -81 96 -111 128 -145 167 -190 216
33B16m60N19n86O60p40Q27r24J029j143J270j408J559j723J901k097K311k544
$$ 216 -244 275 -311 349 -391 436 -488 541 -602 668 -740 819 -904 997 -1100 1211 -1333
50a333K804l092L407l757M147m587N087n656O314p085Q004r121J0510j2294J4685
$$ -1333 1471 -1621 1786 -1971 2176 -2411 2676 -2980 3334 -3751 4253 -4868 5642 -6652 8033
65H033j8073K3286l2443N3234j90791q084K44993j48163q7354J12840J84293l7786
$$ 8033 -10040 13246 -19197 34037 -156754 -164838 80155 -68008 -155362 -42522 141771 103985
77A03985r2740j5190L4239j504N6756K2198q6304j04598M1415Q3517m5850j22179
$$ 103985 11245 -3945 30294 28790 85546 107744 21440 -83158 -41743 41774 -4076 -126255
89a26255L4018J30161K7876p1965l1187J5470J0334J758L0336M587l9060J1032
$$ -126255 -92237 37924 65800 -6165 -37352 -21882 -11548 -9790 20546 25133 -13927 -2895
101b895O4791j3921p7567j3397P0688M4003k5981k1528L953l5827l7842J3564
$$ -2895 61896 47975 -29592 -42989 27699 71702 45721 24193 28146 -7681 -45523 -31959
113c1959M241l0937R314P0873L8828n6948n0150M1934L5524l1907p620M9313K0230
$$ -31959 -27718 -58655 -49341 21532 60360 3412 -46738 -4804 30720 -1187 -8807 40506 60736
126F0736m7762l1166L5418L873o1898l291P6785K9156n6243m7937J9016J8644
$$ 60736 12974 -18192 17226 21099 -40799 -44090 32695 61851 5608 -42329 -23313 -4669
138d669l2618j5868K9553J8162M289J4788K225k4451j6607L4055M9514p898l2581
$$ -4669 -37287 -53155 -23602 -5440 -1151 13637 15862 -8589 -25196 8859 58373 50475 17894
151A7894O853J1454k7603m6830k1814J5320J6730R449J7563j964k0592O775K7553
$$ 17894 24747 36201 8598 -38232 -60046 -44726 -27996 -18547 -984 -2948 -23540 -16765 10788
164A0788P331j4893M893M1310J4299m2642l4464K568N367l844q13J0999R272q783
$$ 10788 18119 3226 8119 49429 63728 21086 -13378 -10810 -5443 -9287 -10100 899 10171 1388
178A388o568j918j6825n886K1623K3126K933j3155l946O283j3453j5055J6779
$$ 1388 -5180 -7098 -23923 -29809 -8186 14940 17873 4718 772 7055 -6398 -21453 -4674
191d674K1933K187m461K615J747k3459k6987J1078K2185j876p115K145M851n106
$$ -4674 17259 19446 14985 17600 19347 -4112 -31099 -20021 2164 288 -6827 -4682 169 -4937
205d937j5848k138J2557J2280J6726Q214j1759j0410o67J029n307r335J0625K2352
$$ -4937 -20785 -22923 -10366 1914 18640 26854 15095 4685 4018 5047 -260 -9595 1030 23382
219B3382o547k3179q911K403m7m253O839K0186L192q753Q27m042j1981q06J3590
$$ 23382 16835 -6344 -15255 -12852 -12899 -17152 -10313 9873 13065 4312 5139 1097 -10884 -11690 1900
234A900J5093q77r490L527j871j6608p317O039R284N683j016l47n027j3169n68
$$ 1900 16993 16116 6626 10153 8282 -8326 -15643 -9604 -320 5363 4347 4000 -1027 -14196 -14764
249a4764Q904L32K240J1124R788m789j9198m230J1839l44m579Q345Q341k323j1148
$$ -14764 -5860 -5528 -3288 7836 17624 12835 -6363 -10593 1246 902 -3677 4668 13009 10686 -462
264d62q649Q88k085Q21J2261M857m933j289j799m300n750J84J3672Q125m659o31
$$ -462 -9111 -8223 -10308 -9487 2774 7631 2698 1409 -390 -4690 -10440 -10256 3416 11541 6882 6251
280F251J213o742p418j577P856O347m081J991L832j0069r205J609O331M177n19
$$ 6251 7464 722 -6696 -8273 -417 5930 1849 3840 7672 -2397 -11602 -9993 -3662 515 -4
295dM384O206p439q399R88N46J160M508L779K032n264n951J184k784l501O862
$$ -4 4380 10586 3147 -5252 -4264 -3718 -2558 1950 5729 7761 2497 -3454 -2270 -5054 -8555 -1693
311a693P593J862l754m927J325j790o842L891P545N54j090k191j248k439m719
$$ -1693 5900 7762 4008 -919 406 -1384 -8226 -4335 3210 3764 2674 483 -765 -3204 -7923
326g923L673Q060J9J706L025k925m157l722k96L312j198Q74L247l466m708p25
$$ -7923 -4250 3810 3829 5535 8560 5635 1478 -2244 -2540 772 -426 448 3695 229 -4479 -5204
342e204p6K486J929J813O475n19n833j547j128q16J45OL840J889l596l01j229
$$ -5204 -5280 -2794 -865 948 7423 6904 1071 -476 -1604 -2420 -2275 -2269 1571 3460 -136 -437 -1666
359a666k786K650L223M05r9k062k45j135n577k04M083K059L084M94l90K048j962
$$ -1666 -4452 -1802 1421 1826 1727 -335 -580 -1715 -7292 -7496 -3413 -1354 1730 2224 1834 3882 1920
376A920j772K246p64j13J658j913j200k986k891L218J414n14L233K84m95M87k275
$$ 1920 148 2394 1630 1517 3175 1262 62 -2924 -5815 -2597 -1183 -1697 1536 1820 1325 1812 -463
393d63p96N42k39L759J542j853O97q86q94J564j892j941K83j594J35j420m335
$$ -463 -1259 -717 -956 2803 4345 2492 3189 2303 1409 2973 1081 -860 -577 -2171 -2036 -3456 -7791
410g791Q61L677L334L370r12Q35N246p97l661l223l105L87j47l878j978p52K709
$$ -7791 -6930 -3253 81 3451 2539 3374 8620 7823 4162 939 -2166 -1779 -1926 -5804 -7782 -8534 -5825
427e825O327O59j526L938L823K684k780p291j389J852k624l449l133J275N820
$$ -5825 502 1161 -365 3573 7396 10080 7300 9 -1380 472 -2152 -5601 -8734 -7459 -1639
442a639J293J44L013R96K643J799k946k701k012j788O50k118l572R35J243L307
$$ -1639 -346 -202 2811 3807 6450 8249 5303 2602 590 -1198 -548 -2666 -6238 -5303 -4060 -753
458g53L170j952R45L885O06j626m514k875K201k12k867j12O07K708J833k286J195
$$ -753 2417 465 1410 5295 5901 4275 -239 -3114 -913 -1125 -3992 -4104 -3497 -789 1044 -1242 -47
475d7K410n10O17q45j916r53k491p39J890o70J430L271M0Q16P6k679K73j079r03
$$ -47 2363 1853 2470 1625 -291 -1244 -3735 -4474 -2584 -3254 -1824 1447 1487 2303 2379 -300 -27 -1106 -2009
494b009J644n18j720N78L99K817J762k472L457N493r60m737n713j91K676m865
$$ -2009 -365 -883 -2603 -2025 -1626 1191 2953 481 3938 9431 8471 3734 -1979 -2170 506 -4359
510d359m971L016N529L077k376k552O164M679j725RK77p07j836m552k628k854
$$ -4359 -9330 -6314 -785 2292 -84 -2636 3528 8207 6482 6491 6768 6061 4225 -327 -2955 -5809
526e809l698L332N761J2k810l5M764M318n414m847O108N551k235p302l422M757
$$ -5809 -9507 -6175 -414 -402 -3212 -3247 1517 5835 421 -4426 1682 7233 4998 -2304 -5726 -969
542i69J064m712Q43M416J467J08j513n55j918m580K822N688j966m557M04M383
$$ -969 95 -4617 -3774 642 2109 2217 704 149 -1769 -6349 -3527 2161 195 -4362 -3958 425
558D25J876o160k517Q628N771k387k949j70J259k862m104K036J609j872N00R41
$$ 425 2301 -3859 -6376 2252 8023 5636 2687 2517 3776 914 -3190 -1154 455 -1417 -917 24
574B4m36k445l246L006O174K69j519J206J095L40m154k246L879R79j001J408R1
$$ 24 -412 -2857 -6103 -3097 3077 3346 1827 3033 4128 4468 314 -1932 1947 2926 1925 3333 3424
591C424k497m230k228L634K011l538l46L350K496k090o304N37Q108L236r18j020
$$ 3424 927 -3303 -5531 -1897 114 -3424 -3770 -420 2076 -14 -6318 -5781 2327 5563 4645 3625
607C625k56J684j647m450k091p90K065L626k540m735j317J113L728J010j834L128
$$ 3625 3369 5053 3406 -1044 -3135 -3925 -1860 1766 -774 -5509 -6826 -5713 -1985 -975 -2809 319
623C19N566J205k383n292j300L750O00m41l46j745J49K06l066j709o68K735N223
$$ 319 5885 7090 4707 -585 -1885 1865 2465 2024 1678 -67 82 288 -2778 -4487 -5155 -2420 2803
640B803L2l424j817j22K290O41k459K162M575J845j437m030k085J542J81l12J91
$$ 2803 2835 -589 -2406 -2528 -238 403 -2056 106 4681 6526 5089 1059 -1026 516 697 385 576
657E76j310K31r39l758q36J422J527L340K076J039R02l056j330J841or4K84Q0
$$ 576 -734 -503 -1442 -5200 -6036 -4614 -3087 253 2329 3368 4270 1214 -116 1725 1719 1625 1909 1989
675A989J028k120n155q28J315J574K016L0J46R00j377n74o62p86L579L190k81
$$ 1989 3017 897 -4258 -5086 -3771 -2197 -181 -151 -5 895 -482 -1056 -1718 -2504 1075 4265 3984
692C984j117j241o62l35k065N85K120m4j65q31k823q21q66N23L503O27Q68J623
$$ 3984 2867 1626 964 629 -1436 -851 1269 1225 1060 229 -2594 -3415 -4281 -3758 -255 372 1240 2863
710B863p57j443n62o04J771J047j65J105j537l498l34p86o55J715J151K042j02
$$ 2863 2106 663 101 -503 1268 2315 2150 3255 1718 -1780 -2114 -2900 -3555 -1840 -689 1353 1251
727A251k076J04l4j152J596K111J209L76j890j049j72k200J22J663M34J303o19
$$ 1251 -825 -721 -755 -1907 -311 1800 3009 3385 1495 446 274 -1926 -1804 -141 293 1596 977
744I77j662j69k147J10K352M99N82J631k51r34j402q76J524N01j39J623l53k164
$$ 977 -685 -854 -3001 -2891 -539 -40 542 2173 1922 988 -414 -1290 234 735 596 2219 1866 -298
762b98p80j708J41O92M11K132J268j564j71m56o16Q84l6J161J918j283j134q08
$$ -298 -1078 -2786 -2645 -1953 -1542 590 1858 294 123 -333 -949 -65 -101 1060 2978 1695 561 -247
780b47j912L07O23J52J676J82J8J00k573j033K041P12J003M24m3J009j012k168
$$ -247 -2159 -1852 -1229 -1077 599 781 799 899 -1674 -2707 -666 46 1049 1473 1430 2439 1427 -741
798g41N10O12N22J478j187j063r6k291m05Q0K6K285J150J26M65o51k97P33m33
$$ -741 -231 381 903 2381 1194 131 35 -2256 -2661 -2581 -2555 -270 880 1006 1471 820 523 1256 823
817H23P80J186j173o65q28k141l20m94L86J657K38M14N71j037k79L14j80J334
$$ 823 1603 2789 1616 951 123 -2018 -2338 -2832 -2446 -789 -551 -137 434 -603 -882 -568 -748 586
835E86J005j75N56p67j238O2o50K61J128q26O32n27j979m03k16j4J366Q44O86
$$ 586 1591 1416 1972 1205 -33 29 -621 -360 768 -58 574 47 -1932 -2335 -2551 -2565 -1199 -355 331
854C31J384o11o9N50p91Q17P55q19O76j038j590m36j459oJ229J0R09N54j014K81
$$ 331 1715 1104 1035 1585 794 1611 2366 1547 2223 1185 -405 -841 -2300 -2306 -1077 -1067 -158 396 -618 -337
874c37j03o60J174P73J99J248o94m18pj027J86O33j022L97j82j360k95j166j068
$$ -337 -440 -1100 74 847 1046 2294 1600 1182 1175 148 334 967 -55 342 160 -1200 -1495 -2661 -3729
893c729J702L74Q12J058LJ112L46q20L99O22k56M68p06j235k44j461n2J8n69O87
$$ -3729 -2027 -1653 -841 217 220 1332 1678 858 1257 1879 1623 2091 1385 150 -94 -1555 -1607 -1589 -2158 -1471
913a471J216m63M95n42n88J841K89k65R28J32K01J86j803M7K6j60O54m50r04L12
$$ -1471 -255 -718 -223 -765 -1353 488 777 512 1440 1572 1773 1959 156 203 229 69 723 273 -631 -319
933c19r13p56N23k52M14J197k06J408n19q71Q09N73J63L31o79j40O84j624r59
$$ -319 -1232 -1988 -1465 -1717 -1303 -106 -312 1096 577 -294 515 1088 1251 1582 903 763 1447 -177 -1136
952a136J28j002Q80M87p8J86p82L93J234o95n84J361N85R51o87j225N22J89o94
$$ -1136 -1008 -2010 -1130 -643 -721 -535 -1317 -924 310 -385 -969 392 977 1928 1241 16 538 727 33
971C3O40p53l17R65n37n90m27p80J138R62l86K91J63j76O29k31n93M54k42J381
$$ 33 673 -80 -397 568 31 -559 -986 -1766 -628 334 -52 239 402 226 855 624 31 485 243 1624
991A624L22j932m76O15Ro9j368K13J635l67r30J80m70M90N78p0P28M5q41P70j59
$$ 1624 1946 14 -462 153 162 93 -1275 -1062 573 206 -724 -544 -1014 -524 54 -16 712 757 -84 686 527
1012E27r80r7k30J210L08j235M4O47q03L3j4J24Q00n34q7P01p83m95L83P0J247
$$ 527 -453 -550 -780 430 738 -497 -453 194 -609 -576 -590 -466 334 -200 -287 414 -369 -864 -481 -411 836
1033H36K41j547O59P76o28n68n25O68J491j180q94O87m07L51j13j49R41j41m79
$$ 836 1077 -470 189 965 337 -231 -756 -88 1403 223 -671 16 -391 -40 -153 -302 639 498 19
1052A9Q31l67j176k66N62J044k79j285R20Q17p19m71r4R89N33j279N55M22r47
$$ 19 850 483 -693 -959 -397 647 368 -917 3 820 101 -370 -464 525 1058 -221 334 756 -191
1071a91o02O41k13O8l67K10J278q53j055N72O29J32n7m71J088R4j022K64j08j71
$$ -191 -793 -152 -365 -297 -664 -454 824 -29 -1084 -512 117 249 192 -279 809 903 -119 145 37 -134
1091a34L65l06J22P09j008j79L5l80M66K69l26M33n4l16Q13m23k77R52m3L2L79
$$ -134 231 -75 47 756 -252 -431 -396 -776 -310 -41 -367 66 12 -304 509 86 -191 761 718 750 1129
1112A129r25j5l29m71N60n34J80P85j022j65K81J64M78P4k08J016j96p39L87o0
$$ 1129 204 189 -140 -611 -51 -585 -405 380 -642 -807 -526 -362 116 190 -18 998 802 63 450 390
1132C90n31O06k55J67K86j061J11J20p76K73K96j29L44l91J49P09p26K96J040
$$ 390 -141 465 210 377 663 -398 -287 -167 -943 -670 -374 -503 -159 -550 -401 308 -418 -122 918
1151I18k31K43r0k34K47p17n31O97l94n42O03n01o7j09l35P84L84k81O24l4k07
$$ 918 687 930 840 606 853 136 -395 302 -92 -634 -31 -532 -599 -708 -1043 -259 125 -156 468 434 227
1172B27J42n09L26K13o29O01L35r24L96j77j69J52l42%P33q67k37L48n15O58j42
$$ 227 369 -140 186 399 -230 371 706 -218 178 1 -168 -16 -358 -358 375 -492 -729 -381 -896 -238 -380
1193c80K78M97M23l22O22m51m90O30m90j5j73n35J98k87o61M50M15L9L86q9J27
$$ -380 -102 395 818 496 1118 667 177 807 317 302 129 -406 -208 -495 -1156 -706 -291 -252 134 45 172
1214A72K77l79K50L92n48J74K27m26j52k45j94K85j79O4O41q48J74Q7l60K80J8
$$ 172 449 70 320 712 164 338 565 139 -13 -258 -452 -167 -346 -282 359 -489 -315 -228 -588 -308 -290
1235b90k7P76m14j98K79j40J57R4l34L68j67k28L07l70o62O93K45L4O89q24K81
$$ -290 -317 459 45 -153 126 -14 143 237 -97 271 104 -124 183 -187 -849 -156 89 123 812 -12 269
1256B69q2n81M8L50m29N47O6l93O08m59O2N78k44L49J89m88J68m85q31O09j46
$$ 269 187 -394 -346 4 -425 122 188 -205 403 -56 6 584 340 689 878 390 558 73 -758 -149 -295
1277b95m22M42o3R9P5l23L36L30J24N25o2j94O2o02n18N98m07J84M55m21j28p7
$$ -295 -717 -275 -338 -239 -164 -487 -151 179 303 828 766 572 634 32 -486 112 -295 -111 344 -77 -205 -282
1299b82l77K5L53j93O19l36R7O1l08o3L65ML75L16l26J93n14k86M42l08O0M53
$$ -282 -659 -634 -281 -474 145 -191 -94 -33 -341 -404 -39 -35 340 656 330 523 9 -277 165 -143 -83 370
1321C70m63J84k96o96N56o8j6P26K8j1P9j51k15K90k48M68M22p76K18m32m08L34
$$ 370 -93 91 -205 -901 -345 -413 -429 297 325 314 393 242 27 317 69 537 959 183 401 -31 -439 -105
1343a05m22KN76l66j32L52n44r3M13k9L87L63k3O04n26m1J71l57L21K8m02n2k56
$$ -105 -527 -525 51 -315 -447 -95 -639 -732 -319 -348 39 402 379 983 457 416 587 230 551 579 177 125 -131
1366a31q05P6Ll80P08L01L85K73p01L63M05m33N54l0R6L6l47o64j4j61K32M04
$$ -131 -936 -860 -857 -1237 -529 -228 157 430 -271 92 497 64 618 588 684 720 373 -291 -305 -466 -234 170
1388A70l00K82l7q60K62j42n7M07K58L50j15j41N7M24l49M19M81o19L92m80p15
$$ 170 -130 152 115 -745 -483 -625 -682 -275 -17 333 218 77 134 558 209 628 1109 490 882 402 -313
1409c13k31m81k77M72k1L53L65l61N81J84k06M64L23M6J83n88l66k37j92j69L43
$$ -313 -544 -1025 -1302 -830 -851 -498 -133 -494 87 271 65 529 852 898 1081 493 127 -110 -302 -471 -128
1430a28j13N63k35m29J62m08p6N84r6J98J97m05J11J04k93P83K57k6M86m52m61
$$ -128 -241 322 87 -342 -180 -588 -664 -80 -176 22 219 -186 -75 29 -264 519 776 750 1236 784 323
1451C23q0o84j25O0k90K82j28k09N61KN0M39K56L31J98l84j41j75n68j69L26k57
$$ 323 243 -441 -566 -506 -796 -514 -642 -851 -290 -288 -238 201 457 788 986 602 461 286 -282 -451 -125 -382
1473c82O19m56j10K74q2k92M36o8R0J97o77L32j92k29O25J00J19N28k42O4j68
$$ -382 237 -219 -329 -55 -137 -429 7 -61 29 226 -451 -119 -311 -540 85 185 304 832 590 654 486
1494D86k88k28J59m37K51k48n25K48j15J00O95q4M69K76n5k8r3m31n8k61r9J35
$$ 486 198 -30 129 -308 -57 -305 -830 -582 -697 -597 98 14 483 759 704 676 583 152 94 -167 -266 -131
1516a31k88j42M49l37M17J81j34L90R9n14J38n47r4N02m46K28M59j48N9L57k76
$$ -131 -419 -561 -112 -449 -32 149 15 405 504 -10 128 -419 -513 -11 -457 -229 230 82 141 498 222
1537B22J05K15l07N8o33j31J22m65o5N05J63J99N03m70N68L0m43L4j5L8J1o11
$$ 222 327 542 235 293 -340 -471 -349 -814 -879 -374 -211 -12 491 21 589 619 176 210 195 233 244 -367
1559c67n5k1m9R4M56p5N44k4l72L60l80m66N61k68j06J23l57J37P9j04L53J84
$$ -367 -422 -443 -492 -398 58 -17 527 503 131 491 111 -355 206 -62 -168 -45 -402 -265 -186 -290 63 247
1581B47J42L15k71m34K48n38m0M28j41K22j62l16K95j34l6L67Q8l6P3m22m2j77
$$ 247 389 704 433 -1 247 -291 -331 97 -44 178 16 -300 -5 -139 -175 192 280 244 317 -105 -147 -324
1603c24j88M32K17j31L51j44j07J85m21K79O6j95L11l08n5l83J71j65M74J45Q
$$ -324 -512 -80 137 6 357 213 106 291 -130 149 215 20 331 23 -32 -415 -244 -409 65 210 218
1624B18K85m38R5q7k91R9J75j71M86j24m64pj23J41K8R5K67L20k95k30j14m74
$$ 218 503 65 160 73 -218 -119 56 -115 371 247 -217 -224 -347 -206 -178 -83 184 504 209 -21 -135 -609
1646f09J86K73r1N38j98j51o1k01N1K24J11M92k96l29K13n28l86O11K22j53M32
$$ -609 -423 -150 -241 297 99 -52 -113 -314 -263 -39 72 564 268 -61 152 -376 -762 -151 71 -82 350
1667C50l44J74q9m82K90K96o3M52j2l80k6m30j30K42l22N48K65k28j03m78k11
$$ 350 6 180 91 -391 -101 195 132 584 572 192 166 -264 -394 -152 -474 74 339 111 8 -470 -681
1688f81N16K44J46N86k37k24l0m65l14J28K29K36O9j63l8l11j26J31R5L75M06
$$ -681 -165 79 225 811 574 350 320 -145 -459 -331 -102 134 203 40 2 -309 -435 -304 -209 166 572
1709E72j66L6k12n29j4J76j54O03p5M6p4p09j11J25K68L23K60r0j01l70k00rp2
$$ 572 406 442 230 -299 -313 -137 -291 312 237 283 209 -500 -611 -486 -218 105 365 275 174 -196 -396 -405 -477
1732d77O53M27o9J66o67k98K25n07K79N57j16J1k3n01k48j6q8P09L59r8N05k81
$$ -477 176 603 534 700 33 -265 -40 -547 -268 289 173 184 161 -340 -588 -604 -692 17 376 278 783 502
1754E02m20j47k10L65K82N5J47n27l55l65j27J15K64L29J94K64l74j66K2j48L00
$$ 502 82 -65 -275 90 372 427 574 47 -308 -673 -800 -685 -421 -92 102 366 -8 -174 -152 -300 0
1775@M06K34K11j87o74o4l81J01J31lL04L8n06lk16j60M39M37K85M55l09k58j71
$$ 0 406 640 851 664 -10 -74 -455 -354 -223 -226 78 116 -390 -393 -609 -769 -330 107 392 847 538 280 109
1798A09l38L33M72P6J24r7p82l22l76k26L53L29M59L3l30J0m9J38L9K80O11K13
$$ 109 -229 104 576 652 776 679 -103 -425 -801 -1027 -674 -345 114 147 -183 -173 -222 -84 -45 235 846 1059
1820A059m27k98j27o08m89N16L26L3J02m02n5l50n0K91J43N18L56k0k91l65j24
$$ 1059 632 334 207 -401 -890 -374 -48 -15 87 -315 -370 -720 -770 -479 -336 182 538 518 227 -138 -262
1841b62L68J28L47M12j35l26m98n60N4m63J96L44K59k32j11j2p2L38L72O93K47
$$ -262 106 234 581 993 858 532 34 -526 -472 -935 -739 -395 -136 -368 -479 -491 -563 -225 147 840 1087
1862A087P7m1j71j063k84J78j74K82K37m78j0m77r5K26L17N57K96j06L7k29m87
$$ 1087 1164 1123 952 -111 -395 -217 -391 -109 128 -350 -360 -837 -932 -706 -389 168 464 358 395 166 -321
1883c21L9L97K10K61L08n0l04m67k57j08l30K94L68m76j92j09l38J18L70O06P99
$$ -321 -282 115 325 586 894 844 540 73 -184 -292 -622 -328 40 -436 -628 -737 -1075 -957 -587 19 818
1904H18L49J39k61l97l68k67p2K06M4k36p0q65J4M0j02R06L95K31J01j57l52k26
$$ 818 1167 1306 1045 648 280 13 -59 147 191 -45 -115 -980 -966 -926 -1028 -122 273 504 605 448 96 -130
1926a30N8Q6M35nL06l08j28n13J01k10J96R0j86N5m92j76j88jM25O95K77O19p9
$$ -130 -72 14 449 444 750 442 314 -199 -98 -308 -112 -22 -208 -153 -645 -821 -1009 -1010 -585 110 387 1006 927
1949I27l37k5j59j05K53j32r1l08m36n58j25K30P6O76L71L02j68k5l51m9M7J77
$$ 927 590 565 406 301 554 422 331 23 -413 -971 -1096 -866 -790 -114 257 559 391 366 15 -34 13 190
1971A90K41J27N1l39k59k43n9J53K95K62p1n57k32k25k86K85K58j28O20L99l08
$$ 190 431 558 609 270 11 -232 -291 -138 157 419 348 -209 -441 -666 -952 -667 -409 -537 83 482 174
1992A74L0Q2K23R0Q7o6J17n99l28m81l76K92R7M63K67K4q3J14o0k7P4K00J77J
$$ 174 204 286 509 599 686 620 737 138 -190 -671 -1047 -755 -658 -195 72 96 13 127 67 40 114 314 491 492
2016D92m05q8j5l01o1J54J74N35k52J45m72m86p8L73J74J40r3J98j20k41L42J41
$$ 492 87 -1 -16 -317 -378 -224 -50 485 233 378 -94 -580 -658 -285 -111 29 -64 134 14 -227 115 256
2038B56K02P3J85j46j89l89l94k29K1L29M11j66J04N3n05K07L15K1K24J80q5l28
$$ 256 458 531 716 570 381 -8 -402 -631 -610 -281 130 -36 68 121 -384 -177 138 159 383 563 478 150
2060A50l29n1K63l29L92L45l20L2k77j88J65k00J94K45n0K7n3k42Q3j16O9L70
$$ 150 -179 -230 33 -296 96 441 121 153 -124 -312 -147 -347 -153 92 42 69 16 -226 -143 -259 -190 180
2082A80J5J35N5l76K5j74j25n4M67P3j22j85j20J88J2k12K86m6J2K06k04l2R5
$$ 180 195 330 385 9 34 -140 -265 -319 148 221 99 -86 -206 -18 -6 -218 68 22 34 240 36 4 99
2105I9n07K68L97k63J96j39J7J01l72j22L78L4J31k09Ql4j52j45L67R2k67L15
$$ 99 -408 -140 257 -6 190 51 68 169 -203 -325 53 87 218 9 17 -17 -169 -314 53 145 -122 193
2127A93p3J54j69l10J47K17kM8j4k71M6j53lK32j88R1J19j05Q9k61K19J8J53l11
$$ 193 120 274 105 -205 -58 159 157 205 191 -80 -34 -187 -190 42 -146 -55 64 -41 48 -213 6 24 177 -134
2151a34K02j0j21K20l61M52N4k80MK09k95Q9pj83K67k03M8m9M9o4K1k37K50J20
$$ -134 68 58 -63 157 -204 248 302 22 26 235 -60 29 22 -161 106 -97 -49 -98 -49 -113 -92 -329 -79 41
2175D1k32M53k71K96j09l11P9J2J10n1P9k47J87k11K09m5j68J20l8J04J05m1n0
$$ 41 -191 262 -9 287 178 -133 -54 -42 68 17 96 -151 36 -175 34 -11 -179 -59 -97 7 112 71 21
2198B1p0K11j72J87l11O6K52l26P9l6JO0K25k33J33k54J11m3J09J01j77q3O1K24
$$ 21 -49 162 -10 177 -134 -68 184 -142 -63 -99 -98 -38 187 -46 87 -167 -56 -99 10 111 -66 -149 -88 136
2222A36r5k24L61k06J51L5k15R9j76J04j18L12j74j76j6L22j57l9J55qJ7j62r
$$ 136 41 -183 178 -28 123 158 -57 42 -134 -30 -148 164 -10 -186 -202 120 -37 -76 79 71 88 -74 -83
2245h3p1M88m23K08j75P2JJ48j65j37J27J2K02J51j59j86J0J8N5j57J09P2k16
$$ -83 -154 334 -89 119 -56 16 17 165 0 -137 -10 2 204 355 196 10 20 38 93 -64 45 117 -99
2268i9Q4j96J03K35L8k21O9J59q0o0l46K97n5K46l0n1K9J94m88O7L3p3J76Jr9
$$ -99 -15 -211 -108 127 165 -56 13 172 92 32 -314 -17 -72 174 144 93 122 316 -172 -105 -72 -145 31 32 -67
2293f7j1LJ4M9j86PM73p8l3l3j43M2k03L0K86q7o2P3j60m94L15j69K37K36K45
$$ -67 -78 -75 -61 -12 -198 -191 282 204 171 138 -5 37 -166 -136 150 63 1 74 -86 -580 -265 -434 -197 39 284
2318B84M9j99M3j66j75n3K39J00j15Mj00rp2j3J05K08j13K9j60j3l1O5J24J46
$$ 284 333 134 177 11 -164 -217 22 122 7 11 -89 -98 -170 -183 -78 130 17 46 -114 -127 -158 -93 31 177
2342A77J20j58l8R3O5l23l8K2m8rK1j47j08Q1l25L83O9K03P6M9L5j05k29L40L8
$$ 177 297 139 101 194 259 -64 -102 -80 -128 -137 -116 -263 -371 -290 -615 -232 -163 40 116 165 200 95 -134 206 244
2367B44j67K98K5l74l03j19J73J06j42K91J24k91m4j0R9K51QN7K11j59m1o1j74
$$ 244 77 375 400 26 -277 -396 -223 -117 -259 32 156 -135 -179 -189 -90 161 169 226 437 278 237 176 2
2390Bj25N0K31J40p0j86k9m33o0o8J17M01l5J6L37j20Q8j17K16p9L76j10l31J0
$$ 2 -123 -73 158 298 228 42 13 -420 -480 -548 -431 -30 -65 -49 288 168 256 139 355 276 652 542 211 221
2414B21n41k13P3J55J83K46l17J06J73l97J95L3J19K10Kj18n5O2l8MQ3Q7p2n1
$$ 221 -320 -533 -460 -305 -122 124 -193 -87 86 -311 -116 -83 36 246 248 130 75 137 99 103 186 273 201 150
2438A50q9l73j39qJ55k1J94L6j21K59j7p2J75j01O99p6q4m8n02j82r7N2j21K20
$$ 150 61 -312 -451 -459 -304 -325 -131 -95 -216 43 26 -46 129 28 727 651 567 519 17 -165 -262 -210 -331 -111
2462a11N6k16Q5l45L57J23J56J34K45j33j94q3j38O5J4K67n5j07k1k8l98K29k41
$$ -111 -55 -271 -186 -531 -174 -51 105 239 484 351 157 74 -64 1 15 282 227 120 99 71 -327 -98 -339
2485c39L6P3J74j02J41m6k71N26k88J93M05pK5j12k41j74l5p9p3R6J6j78j59m9
$$ -339 -303 -230 -56 -158 -17 -63 -334 192 -96 97 502 495 520 408 167 -7 -42 -121 -194 -98 -82 -260 -419 -468
2509d68R7L72J08P5j17J03l1J62k76k2L29J28Mn6l02j51k71p1J26K17M2j91J23
$$ -468 -371 1 109 184 67 170 139 301 25 3 332 460 464 408 106 -45 -316 -387 -261 -44 -2 -193 -70
2532g0k27P0J90R5j6J42J86p8K02k16l1l39K8J18n4J23k34q1j05r8o7K28M5L41
$$ -70 -297 -227 -37 58 42 184 370 292 494 278 247 -92 -64 54 0 123 -111 -192 -297 -395 -462 -234 -189 152
2556A52J4r7Q4k22Q8J66Q4k82L09n2J20n51L7p3j3Q1L3N3k41L01j79R9p3M5J94
$$ 152 166 69 153 -69 19 185 269 -13 296 244 364 -187 -150 -223 -236 -155 -122 -69 -310 -9 -188 -89 -162 -117 77
2581G7K27j24R5k15o0j87R4K06O2q8j41l62Q0K68k82J28n0K71Q9k0M3k73J89j1
$$ 77 304 180 275 60 0 -187 -93 113 175 87 -54 -416 -336 -68 -350 -222 -272 -1 88 68 111 -162 27 16
2605A6K94j66J01r6k11j28J20j26J71P7P8j01k21n8J29QP4K08o2Q2j37M8M6p1
$$ 16 310 144 245 149 -62 -190 -70 -196 -25 52 130 29 -192 -250 -121 -113 -39 169 107 189 52 100 146 75
2629G5j72j44J57p8L22j23m9l0k80L8L04j12J30k04J76j1n3J04k6P2J08J19l13
$$ 75 -97 -241 -84 -162 160 37 -12 -42 -322 -284 20 -92 38 -166 10 -1 -54 50 24 96 204 323 10
2652A0k37K71k88J37pm9L08j28j82J89q4j49K80j23J69QR2j92Pj93K19q1R7Lq1
$$ 10 -227 44 -244 -107 -114 -163 145 17 -165 24 -60 -209 71 -52 117 125 217 25 32 -161 58 -23 74 77 -4
2677dJ75k91R2l8q4K35k22L2M8L34j78k22J60j52J45qn7R5m5O9k69R8Q1N0J92
$$ -4 171 -120 -28 -66 -150 85 -137 -105 -57 277 99 -123 37 -115 30 22 -35 60 15 84 -185 -87 -6 44 236
2702B36k66K14m87K73K10r1K4j56K03K5k93k27K59r8R8J03j90K74k74J70k6J44
$$ 236 -30 184 -303 -30 180 89 113 -43 160 185 -108 -335 -76 -174 -76 27 -163 111 -163 7 -19 125
2724A25n1j20L0J03j15K1J62k34J81r9J15J4k65K84k21j04J6J04J47P0jp7q4j0
$$ 125 74 -46 -16 87 -28 -7 155 -79 102 3 118 132 -133 151 -70 -174 -158 -54 93 163 162 85 1 -9
2748iJ21K1K1k53M28L6j55k56j84K55j24J15j50o0K85j75O0j89P7K42J48l39J71
$$ -9 112 133 154 -99 329 365 210 -46 -230 25 -99 16 -134 -194 91 -84 -24 -213 -136 106 254 -85 86
2771H6j98m6K18k22Q4K42j67o9j08L11k28j31J18L14j53j19K65j50m7l6R4O1p0
$$ 86 -112 -158 60 -162 -78 164 -3 -72 -180 131 -97 -228 -110 204 51 -68 197 47 0 -36 58 119 49
2794D9O9Q9l7j33j47M5J67k15P1j71K19Kj74J11Q8j62J45K75q4j71p3J6L9k36
$$ 49 118 207 170 37 -110 -65 102 -113 -42 -213 6 8 -166 -55 33 -129 16 291 207 36 -37 -21 18 -218
2818b18L14q1J47k46J66q7K4j02J00k97K51m9J92O6j14J84K1j36j07R7j20rL1
$$ -218 96 15 162 -84 82 -5 19 -83 17 -280 -29 -78 114 180 66 250 271 135 28 125 5 -4 27
2841B7J12k45J81m8n1j31J20k0J69k91J77O5kR3k93Q5K62j50k8j33J17R9l66R5
$$ 27 139 -106 75 27 -24 -155 -35 -55 114 -177 0 65 63 156 -137 -52 210 60 32 -101 16 115 -251 -156
2865a56N6M6N5j34N0r9J45R7k30J98l3k6J13j11J49J5j44p2j9K3K37k69J11o7
$$ -156 -100 -54 1 -133 -83 -182 -37 60 -170 28 -5 -31 82 -29 120 135 -9 -81 -100 -77 160 -109 2 -65
2889f5n9L46l65J61j28R7l7l6J25j64K18L6k66l0L03k26P7K77k14O3o7j3o7M1
$$ -65 -124 222 -143 18 -110 -13 -50 -86 39 -125 93 129 -137 -167 136 -90 -13 264 50 113 46 33 -34 7
2913Gr0R8O5l56J58K26j05JN4o0J51r8N9n2j3j06Rl2R4Q5j86o7O7K4M1o8J73j36
$$ 7 -83 15 80 -276 -118 108 3 4 58 -2 149 51 110 58 45 -61 -52 -84 10 95 -91 -158 -91 -67 -26 -94 79 -57
2941e7P7m7k5K61k55K14k23qJ66k62K57k39K51J0J24q3k61J64N7o8k3m5K00k27
$$ -57 20 -27 -52 209 -46 168 -55 -63 103 -159 98 -141 110 120 244 161 -100 64 121 53 30 -15 185 -42
2965d2j9QJ31j19N0j0k56K81n9R2j20Km4j35K36k04L29k87J81q8q5K54n3k26K66
$$ -42 -61 -53 78 -41 9 -1 -257 24 -35 57 -63 -61 -105 -240 -4 -208 121 -166 15 -73 -158 96 43 -183 83
2990H3J3mNp4J21j76J6J56JJ63j64j35n9J92j14j36j9O7l3r2K20r4n0J9J43k57
$$ 83 96 92 97 23 144 -32 -16 140 141 304 140 5 -54 138 24 -112 -131 -64 -97 -189 31 -63 -113 -94 49 -208
3016b08L10k23Q6L7j40j05O2K92l0j41P4l7j01K18l52K16K1J56qj68J64j48J30
$$ -208 102 -121 -35 2 -138 -243 -181 111 81 -60 14 -23 -124 94 -258 -42 -21 135 127 -41 123 -25 105
3039A05m6n9j71J30J00j83N0J05j04K16j24P6j16J61j55k01Q7o8M34k14j8J66
$$ 105 59 0 -171 -41 59 -124 -74 31 -73 143 19 95 -21 140 -15 -216 -129 -197 237 23 5 171
3061A71j67J15k40J61j85j26K41m6R1pN8L6l8j2j01j88J04J17J69N6l78K57r3
$$ 171 4 119 -121 40 -145 -271 -30 -76 15 8 66 102 64 52 -49 -237 -133 -16 153 209 -169 88 -5
3084ek08Q8OJ17o9J2N0j86J63J35j60o0m4L72l30J23j58K65J19l06J35k16J28
$$ -5 -213 -125 -119 -2 -71 -59 -9 -195 -32 103 -57 -117 -161 211 -119 4 -154 111 230 -76 59 -157 -29
3107b9q0J12J7K0j69L21k41J33j02l0q4J53j00J2k15K60m7j24J57J90mj37rJ6
$$ -29 -109 3 20 40 -129 192 -49 84 -18 -48 -132 21 -79 -67 -282 -22 -69 -193 -36 154 150 13 4 20
3131B0q6J00J39k59K1KO7O9N5j80o9O7K04k23K77o5q6q5q8L47l95O7j13R7k1j08
$$ 20 -66 34 173 -86 -65 -63 4 73 128 -52 -121 -54 150 -73 204 139 53 -32 -120 227 -168 -101 -214 -117 -138 -246
3157b46J81l7j62J56m5J5J3L61l77P1qo2J77q1M9l5j30m7L20q3J5lk74K08Q6K7
$$ -246 -65 -102 -264 -108 -153 -138 -125 236 -141 -70 -78 -140 37 -44 5 -30 -160 -207 113 30 45 42 -232 -24 62 89
3183H9j22MK26l33K7J79J54k60J5r3J67J74m36K36M9k33k1L43m30r9L44r3K60
$$ 89 -33 -29 197 -136 -109 70 224 -36 -21 -114 53 227 -209 27 76 -157 -178 165 -265 -364 -20 -113 147
3206A47k8k16L1p0L01K9L7M1m12J43J0m3l9J24J58k79J27q3k05K77Jr1J18j6j75
$$ 147 119 -97 -66 -136 165 194 231 272 -140 3 13 -30 -69 55 213 -66 61 -22 -227 50 51 -40 78 62 -113
3231a13K08M5J03j84J8j12M7J10j39j53J05J69J7k59K52k6k44K97l12R8J90m3
$$ -113 95 140 243 59 77 -35 12 122 -17 -170 -65 104 121 -138 114 88 -156 141 -171 -73 117 74
3253G4L2j91J88j36J7O4P5m1j16J00q4K19l69N1j67J99J55n0n2J62j07J38j43
$$ 74 106 -85 103 -33 -16 48 123 82 -34 66 -18 201 -168 -117 -284 -85 70 20 -32 130 23 161 18
3276A8Q8LJ6j0r9m8P8j49J40O3j45L4j25K87r0J8j33J92K9j14k55J69R9J44k49
$$ 18 106 109 125 115 16 -32 46 -103 37 100 -45 -11 -136 151 61 79 -54 138 167 53 -202 -33 66 210 -39
3301c9J33j37j4J48m4n0j65J57j31J00J05p6M1j44M8K99k89O2N2p7m7K23k23K39
$$ -39 94 -43 -57 91 47 -3 -168 -11 -142 -42 63 -13 28 -116 -68 231 -58 4 56 -21 -68 155 -68 171
3325A71j86j34J83q7J05J4R2l42P7k19L39J05j54J54r8N1q9J75j44j0Q7k94M82
$$ 171 -15 -149 34 -53 52 66 158 -184 -107 -326 13 118 -36 118 20 71 -18 157 13 3 90 -204 278
3348B78k20m5q3o2J51k73L12Nq8J09k30j1K20M0j62K47k59mJ44Q7j21j81J71q7
$$ 278 58 13 -70 -132 19 -254 58 63 -25 84 -146 -157 63 103 -59 188 -71 -75 69 156 35 -146 25 -62
3372f2N8L4m2j18j0J61j63J97o1J18j98J09M3j40J17k3o5nj36K14j23m3K8K3N7
$$ -62 -4 30 -12 -130 -140 21 -142 55 -6 112 -86 23 66 -74 43 20 -45 -50 -186 28 -95 -138 -110 -87 -30
3397c0J0Jn8J20j06P1l5O8L6o1o0J65k14J15j14J07J00r0NoN1k12P2J1j18K09
$$ -30 -20 -19 -77 43 -63 8 -27 41 77 16 -44 121 -93 22 -92 15 115 25 30 24 75 -137 -65 -54 -172 37
3423C7l4J52p3j28J89q2n9N0q1M0N1l1M9L6j16K1j02l0j56K22k4j01J51K20l19
$$ 37 3 155 82 -46 143 61 2 52 -29 11 62 31 80 116 0 21 -81 -111 -267 -45 -69 -170 -19 201 -118
3448a18J93j71L78k09k3J55l53J10K44k79J17k04M30k11Lk2j5p5n9K17m6j55K26
$$ -118 75 -96 282 73 50 205 -148 -38 206 -73 44 -160 270 59 62 40 25 -50 -109 108 62 -93 133
3471A33j16j57P8J48j65j11R4J09J22j47j20K99j89J03k79K43n2l46M73j04r1
$$ 133 17 -140 -62 86 -79 -190 -96 13 135 -12 -132 167 -22 81 -198 45 -7 -353 120 16 -75
3492g5k8J70j83K37j3n7J34q0J03l16K23o2j0j57J83j70M9R1O6k04J04NM5O1j14
$$ -75 -103 67 -116 121 108 51 185 105 208 -108 115 53 43 -114 69 -101 -52 39 105 -99 5 10 55 116 2
3517Bj90J20j08K73j02k48NL25k57K18O2q2N9j04J25j59J23L1J07j68j53J26m7
$$ 2 -188 -68 -176 97 -5 -253 -248 77 -180 38 100 18 77 -27 98 -61 62 93 200 32 -121 5 -42
3540d2O6m7kj03J90M9j12j03J49p9K12k13P2o8K9R9J74k60J48j11n5J08j26j1
$$ -42 24 -23 -25 -128 62 111 -1 -104 45 -34 178 -35 37 -31 -2 97 271 11 159 48 -7 101 -25 -36
3564c6j52K22J54m57K78R7q7K0j57P7N1J02j12K2j69K9P5k8K14k02K22n8k63K96
$$ -36 -188 34 188 -269 9 106 19 39 -118 -41 10 112 0 22 -147 -118 -43 -71 143 -59 163 105 -158 138
3588A38o9L3ql2M3Nj31K40j03n6J32j20Oj17J16Nj71P0M9J57l09J68o5k38K91
$$ 138 69 102 94 62 105 110 -21 219 116 60 192 72 78 -39 77 82 -89 -19 30 187 -122 46 -19 -257 34
3613C4J04j96J59J6j38n8J31J31j27j2J32j27j54K90j94n5l2J72n6N7k74K85J3
$$ 34 138 -58 101 117 -21 -79 52 183 56 44 176 49 -105 185 -9 -64 -96 76 20 77 -197 88 101
3636A01j93J45Kp2j1K9j92L55k6L8j48r0J02j75J37j3Q3q6pK06j32M2o3j69J43
$$ 101 -92 53 55 -17 -28 1 -191 164 138 176 28 -62 40 -135 2 -11 72 -14 -21 185 53 95 32 -137 6
3661FJ6J2L1Lj62J53j27L4L4L0oJ69k40K36k5j08j14P8J4K7k78K36J45m3j57L5
$$ 6 22 34 65 68 -94 59 -68 -34 0 30 24 193 -47 189 164 56 -58 20 34 61 -217 19 164 121 -36 -1
3687al4N2k6J5R1k70L27j32J31k42j5Q1r5K32j52J48o3j13J50R2k05R6K38j29
$$ -1 -35 17 -9 6 97 -173 154 22 153 -89 -104 -23 -118 114 -38 110 47 -66 84 176 -29 67 305 176
3711A76k45J09j15r9K88j94J07J53k02j25J22j12J53p7K38j35j92o0J49J7p1K74
$$ 176 -69 40 -75 -174 114 -80 27 180 -22 -147 -25 -137 16 -61 177 42 -150 -210 -61 -44 -115 159
3733A59j97R3j29J36o2P0n6p1m7J24k4Q7J24l14R3J50j99q3R3J78j06P8j22j03
$$ 159 -38 55 -74 62 0 70 14 -57 -104 20 -4 83 207 -107 -14 136 -63 -146 -53 125 19 97 -25 -128
3757a28L9R7J13k17K05k14J93k24K21j59J8p1J48M0R3j77J31r4N5j3j40J62j61
$$ -128 -89 8 121 -96 109 -105 88 -136 85 -74 -56 -127 21 61 154 -23 108 14 69 56 -84 78 -83
3780h3k4L5J00J3L07k81N8l11J14J91j91J34j05k5k2J26n1j47J96L2m2K63j00
$$ -83 -107 -72 28 41 348 67 125 -186 -72 119 -72 62 -43 -68 -90 36 -15 -162 34 66 24 287 187
3803A87k76J97l19o1M49q2J0r9K7k7J33k62OO8J60rl99K77Q5J8j64n2K03j47O5
$$ 187 -89 108 -211 -272 177 95 105 6 33 6 139 -123 -117 -49 111 102 -297 -20 65 83 -81 -133 70 -77 -12
3828a2J46j20MM7K6n3l40M45j42j99K83n8K10k20j51J58m1N9J59l40N0N1jk0J11
$$ -12 134 14 18 65 91 38 -302 143 1 -198 85 27 237 17 -134 24 -17 42 201 -139 -89 -38 -39 -59 52
3853E2p5J54M1l5j97J98n6p8n2o5K45mm4l0n3m0Q2j30j20K15L3Q0j62q5L8R6q3
$$ 52 -23 131 172 137 -60 138 82 4 -48 -113 132 128 84 54 1 -39 43 -87 -207 8 41 121 -41 -126 -88 8 -75
3880g5k8O0%R1L0k70M5L75k71J72j66K48j27j1L4l6N6j37j3J07k76J55J98k20
$$ -75 -103 -43 -43 48 78 -192 -147 228 -43 129 -37 211 84 73 107 71 127 -10 -23 84 -192 -37 161 -59
3904e9J29j0R8j61o1p9J07j12J48j7J34k72N0J86M3j52K8L3J7j33J65j10O0O5
$$ -59 70 60 158 -3 -64 -143 -36 -148 0 -17 117 -155 -105 81 124 -28 0 33 50 -83 82 -28 32 97
3928I7j98J0J06nK9nl5L38m95K78j19N5J65k18k2K6J59j00k84J43J88m3j25K5
$$ 97 -101 -91 15 10 39 34 -1 337 -158 120 1 56 221 3 -19 7 166 66 -218 -75 113 70 -55 -30
3952c0K7p9J62R4j96Pj80L5O6K31k37j0J01K47j56j68J42k9nL8j71j0j3r2J78
$$ -30 -3 -82 80 174 -22 -15 -195 -160 -94 137 -100 -110 -9 238 82 -86 56 27 22 60 -111 -121 -134 -226 -48
3977d8L8N7P3J60k81l5L02k86q2O6N6j27M6Q7N0j22R3j74J92l5l8M0M0q1Q7j58
$$ -48 -10 47 120 280 -1 -36 266 -20 -102 -36 20 -107 -61 26 76 -46 47 -127 65 30 -8 32 72 -9 78 -80
4003h0K24k44L39k66l3pL6R6j36r6J83q2q8L99k93J36k24J00O3p1L8K19k34j72
$$ -80 144 -100 239 -27 -60 -67 -31 65 -71 -167 16 -66 -154 245 -48 88 -136 -36 27 -44 -6 213 -21 -193
4027a93K12Qj07K14K7j09O8k2p0o8L8k43M13o6r7m7K45o2j38j93L52k13O3q7n9
$$ -193 19 27 -80 134 161 52 120 98 28 -40 -2 -245 168 102 5 -42 203 141 3 -190 162 -51 12 -75 -134
4052a34J80K0n0k67K44l5J32j8k1m4K8M9j76K40j19j44L89k26k57K73j16q4nK99
$$ -134 46 66 16 -251 -7 -42 90 72 51 7 35 84 -92 148 29 -115 274 48 -209 64 -52 -136 -141 158
4076A58k05K27o7m8j60J10K25j37j36n6K51j30r0j20J89J19j00q2J88k48J68J0
$$ 158 -47 180 113 65 -95 15 240 103 -33 -89 162 32 -58 -178 11 130 30 -52 136 -112 56 66
4098F6j98k9P5J55q9m9p3m0J7O6K92k23J1K8M9k41M7K18J89l98Q0N5k7p1N9q3
$$ 66 -132 -161 -86 69 -20 -69 -142 -182 -165 -99 193 -30 -19 9 58 -183 -136 82 271 -127 -47 8 -19 -90 -31 -114
4124a14J81p1m7J4L3j2l0J07q7j16J82R5r6j94J51K7j52L8N2r2P2L1L3q9J38M9
$$ -114 67 -4 -51 -37 -4 -16 -46 61 -26 -142 40 135 39 -155 -4 23 -129 -91 -39 -131 -59 -28 5 -84 54 103
4150A03n1j42Q8q4q9K01L6j75L49k85j53j1J63j3K3m3N2N3j89R5%Q6n6R8j99K62
$$ 103 52 -90 -2 -86 -175 26 62 -113 236 -49 -202 -213 -50 -63 -40 -83 -31 22 -167 -72 -72 14 -42 56 -143 119
4176A19o4J12k04j6k6K55k55j66J56M4J57k15K3J25L1K5k19Q0j80L52j99J44m0
$$ 119 55 167 -37 -53 -79 176 -79 -245 -89 -45 112 -103 -80 45 76 101 -118 -38 -218 134 -65 79 39
4199C9j54KO7J35M1j53J29r3q2K27k49P0j29K38j22j71O6J62J72k96P8K12m95
$$ 39 -115 -113 -46 89 130 -23 106 13 -69 158 -91 -21 -150 88 -34 -205 -139 23 195 -101 -23 189 -306
4222c06K65J23p5R4L3O7j34k01J34R3l4j04q3J15j72J84J16k38J12L1l82M13J22
$$ -306 -41 82 7 101 134 201 67 -134 0 93 59 -45 -128 -13 -185 -1 115 -123 -11 20 -362 51 173
4245A73l10O3J38Lp0r7P3o3J10j42K13P3q6n9N6j12K7j16K22N7j10L6l04J78K09
$$ 173 -137 -74 64 67 -3 -100 -27 -90 20 -122 91 164 78 19 75 -37 -10 -126 96 153 43 79 -225 -47 162
4270A62m2J51l59K21j14J10l24K15P0l10K10j23K40k80j5J83p2J55o5J09p8N8
$$ 162 120 271 -88 133 19 129 -195 20 90 -220 -10 -133 107 -173 -188 -5 -77 78 13 122 44 102
4292A02o8o1r1J00q3K9L36k30p2k6K2M4L9j4j4j1m0j0r7l4K15r3P2Q1j39J41l4
$$ 102 34 -27 -118 -18 -101 -72 264 34 -38 -64 -42 2 41 27 13 2 -38 -48 -145 -179 36 -57 15 96 -43 98 64
4319F4j77J08n3j9J59j42J03o7m1j58K03q3K7K17l03L29j51L1j08R3J10m2p7K1
$$ 64 -113 -5 -58 -77 82 -60 43 -24 -65 -223 -20 -103 -76 141 -162 167 16 47 -61 32 142 100 23 44
4343D4j75L24l82J34l0J73o6l2J84k44J69M5k47N1K0J47Q7k59J21j44J3j21J68
$$ 44 -131 193 -189 -55 -85 88 22 -10 174 -70 99 144 -103 -52 -32 115 202 -57 64 -80 -67 -188 -20
4366b0n1J44k10N0PMJ54n3q6J38k39M42k91p2M5j57K24q7N3Q3j43rJ97L2j75j49
$$ -20 -71 73 -137 -87 -80 -76 78 25 -61 77 -162 280 -11 -83 -38 -195 29 -58 -5 78 -65 -74 123 155 -20 -169
4392a69K30p2L2Q4j11j66R7K24k52LPN1om2K72Rj17q5k30K49l8J34j58j8K20j65
$$ -169 61 -11 21 105 -6 -172 -75 149 -103 -100 -93 -42 -48 -90 182 191 74 -11 -241 8 -30 104 -54 -72 148 -17
4418a7K17k82J83J63k03j13P8kj2J02k36M7m1L7n6P8M3J38r1k67K21j29J52n9
$$ -17 200 -82 101 264 61 -52 26 24 12 114 -122 -75 -116 -79 -135 -57 -14 124 33 -234 -13 -142 10 -49
4442d9J98j02K7m6j30M4r4L08j01m4K26l37nP0j82K44m5R8M9m1q7n3m3N7J41j67
$$ -49 149 47 74 28 -102 -58 -152 156 55 11 237 -100 -105 -35 -217 27 -18 80 129 88 1 -52 -95 -38 103 -64
4468f4q2R0%m0J76j39J25j11l1r2K44l2j87K5N7J53j18K22q5p7j21J50Q1k99L43
$$ -64 -146 -56 -56 -96 80 -59 66 -45 -76 -168 76 44 -143 -118 -61 92 -26 196 111 34 -87 63 144 -155 188
4493A88j03R7k96N4lk9n8J61J80k39J04k2j45J82j20M9P5j51N2k2J53p3j06J04
$$ 188 85 182 -114 -60 -63 -92 -150 11 191 -48 56 34 -111 71 -49 0 75 -76 -24 -46 107 34 -72 32
4517C2L9N5j3l06J42p1K68k26j06J70n3Pq7J60J8j95K70j47K63j77J19k8j09j3
$$ 32 71 126 113 -193 -51 -122 146 -80 -186 -16 -69 -62 -149 11 29 -166 104 -43 220 43 162 134 25 12
4541A2J74j49l8M9j00Q9k3q1J12l03L30k67M22k86J37j32P8L1l0J1O3Oq4J05o9
$$ 12 186 37 -1 48 -52 37 14 -67 45 -258 72 -195 227 -59 78 -54 24 55 25 36 99 105 21 126 57
4566E7O9l93J97M3J19p5k10L60k67Q1O5j85P0j31OK89j00j9j4k9m4K3J40k3P5
$$ 57 126 -267 -70 -27 92 17 -193 167 -100 -19 46 -139 -69 -200 -194 95 -5 -24 -38 -67 -111 -88 52 29 104
4591A04j97J51p2J10p8j44J32N3O9l3O6o7m2Q8J50k67J42q9k03J46J7J19j42q9
$$ 104 -93 58 -14 96 18 -126 6 59 128 95 161 94 52 140 290 23 165 76 -127 19 36 155 13 -76
4615g6r5J90j42K5r7L04N9k82Q3J62o6j01j41N3J15J51l35M15k43N2k05J96L9
$$ -76 -171 19 -123 -98 -195 109 168 -114 -31 131 65 -36 -177 -124 -9 142 -193 222 -21 31 -174 22 61
4638F1n2J6j65J35R7L2j32J39k60J46k0m0r4J75k4j16L4P0p9n6L8J25r6LP3J7
$$ 61 9 25 -140 -5 92 124 -8 131 -129 17 -3 -43 -137 38 14 -102 -68 2 -77 -133 -95 30 -66 -63 10 27
4664B7j74J44R8k77K04K9l8J1r0N1J02o1m9N1J61j61q4J92j43N6r4K16m06L04
$$ 27 -147 -3 95 -182 22 51 13 24 -66 -15 87 26 -23 28 189 28 -56 136 -7 49 -45 171 -235 69
4688F9J0j35O4J18k14L24k84J52l1p3N7l11K87J09l59K69N3j12M6J5R5nl64J73
$$ 69 79 -56 8 126 -88 236 -48 104 73 0 57 -254 33 142 -217 52 105 -7 39 54 149 144 -220 -47
4712d7L2k4M7p1J44r7j73J29L05k38j21R4m7K7Q1J00k14p3R1J45j93J71K5j03
$$ -47 -15 -39 8 -63 81 -16 -189 -60 245 7 -114 -20 -67 -40 41 141 -73 -146 -55 90 -103 68 93 -10
4736a0PJ8m6J74j50K5k46K83J06k46Q0J9J62j65m9m5J74o7Q6K2j50j19K80j95
$$ -10 -3 15 -31 143 -7 18 -228 55 161 -85 -5 14 176 11 -38 -83 91 24 110 132 -18 -137 143 -52
4760e2J16o0M3J33k18J64l53L30k7N3k9o1j43L1M5K22k49J31j16Q3k2m4J04J18
$$ -52 64 4 47 180 -38 126 -227 103 76 129 100 39 -104 -73 -28 194 -55 76 -40 43 21 -23 81 199
4784A99p5k08q2J41K4j42J15l1J14k88K94m2k9J2m2J41l30J96j05M46k74J28P4
$$ 199 124 -84 -166 -25 -1 -143 -28 -59 55 -233 61 19 -10 2 -40 101 -229 -33 -138 308 34 162 236
4807B36j25l9m7J5j73J67o5O3k13J70l2J52p8l1J38q4L5m6Lj11P5O9j89j44J03
$$ 236 111 72 25 40 -133 34 -31 32 -181 -11 -43 109 31 0 138 54 89 43 46 -65 10 79 -110 -254 -151
4832a51R1K70k32o9J66N7o2j26P1p2K72j80j04q4J61P0k8J08m19M54l55J11M4
$$ -151 -60 210 -22 -91 75 132 70 -56 15 -57 215 35 -69 -153 8 78 50 158 -261 193 -162 -51 -7
4855gK04j99j81J08J73l02K08N0j90J68M6p5L1MK5j72J60M9j07J62r7N2k08Q1
$$ -7 197 -2 -183 -75 98 -204 4 54 -136 32 78 3 34 38 63 -109 51 100 -7 155 58 110 -98 -17
4879a7K31j45L4l57K67L5j09K07q8k00N0N0P6J9j23J09j1J32j60J82k37N4j93
$$ -17 214 69 103 -254 13 48 -61 146 58 -142 -92 -42 34 53 -70 39 28 160 0 182 -55 -1 -194
4902a94K17k7r8J64J31k43L7M8k34K39n7j8j23J40K7k1K71k62J73l34K08J34j69
$$ -194 23 -4 -102 62 193 -50 -13 35 -199 40 -17 -35 -158 -18 9 -12 259 -3 170 -164 44 178 9
4925Ij02J31j54j53K60n7JJ54P0l04P9K26j46j26K59j43r8K34J0j74J29j36m8
$$ 9 -93 38 -116 -269 -9 -66 -65 89 159 -145 -66 160 14 -112 147 4 -94 140 150 -24 105 -31 -79
4948g9P0O3j27L57n14J92R7k20M79k58k17j10M39k60L1P9l8Q1k35n0L70j62j11
$$ -79 -9 54 -73 284 -230 -38 59 -161 318 60 -157 -267 172 -88 -57 22 -16 65 -170 -220 150 -12 -123
4971a23j64J12J8L4J14j02J56j99K45k4On4J51j20J8J15jj04l15J77K57l80M4
$$ -123 -287 -175 -157 -123 -9 -111 45 -154 91 67 73 19 170 50 68 183 182 78 -237 -60 197 -183 -139
4994a39J67R8k20ll8j7J82PJ29j12j32Q5jP1j69J51K1L28l71o4N2q9K2k9K7j02
$$ -139 28 126 -94 -97 -135 -152 30 37 166 54 -78 7 6 77 -92 59 80 408 37 -27 25 -64 -42 -71 -44 -146
5020a46J09R3j91R7K6r8J85j10K9m9k48K62L6n0j50J22J28k0N7o7j40Q8P9l1j51
$$ -146 -37 56 -135 -38 -12 -110 75 -35 -6 -55 -303 -41 -5 -55 -205 -83 45 25 82 15 -125 -37 42 11 -140
5045a40J70n1m1K19j95J45J3j91J03J68j83k9P5j30J91l25K15J33k06l1lJ37J09
$$ -140 30 -21 -62 157 -38 107 120 -71 32 200 17 -12 63 -67 124 -201 14 147 -59 -90 -93 44 153
5068A53l29J20J2M3OkJ4Rm1n4M8mJ54L1m9k65J24l7J7P7j46K81pk11jO6o9q1J25
$$ 153 -176 -56 -44 -1 5 3 17 26 -15 -69 -21 -25 129 160 111 -154 -30 -67 -50 27 -119 162 155 -56 -57 9 -60 -141 -16
5097a6J79m20K24j3L6J81l74J48j25L28k43R1L8J6j38KK86l17L11l40R1m0K64
$$ -16 163 -257 -33 -46 -10 171 -203 -55 -180 148 -95 -4 34 50 -88 -86 200 -117 194 -146 -55 -95 169
5120A69k11P3O4o8kj1k2om9K05m3r5P4J3k60M8J39nj34R6K32j42j47J29P2j73
$$ 169 -42 31 95 27 25 14 -8 -14 -63 142 99 4 78 91 -169 -121 18 13 -121 -25 207 65 -82 47 119 -54
5146e4j17L0L52k22J48n3O0k05j8K20j7k47J29J01o4j80K19l2j92q9L08J61k45
$$ -54 -171 -141 211 -11 137 84 144 -61 -79 141 124 -123 6 107 43 -137 82 50 -142 -231 77 238 -7
5169gj0K71o6k50QN6p2J41j27J85j41l3J71k62J96p2J60j79J51j66n0j21J28J37
$$ -7 -17 254 188 -62 -54 2 -70 71 -56 129 -12 -45 126 -136 60 -12 148 -31 120 -46 -96 -217 -89 48
5193D8j00J97j37J22p8%M2l19R4J28KN2j40j61L08m7J80j35j48K7P5k57K98J34
$$ 48 -52 145 8 130 52 52 94 -225 -131 -3 -1 51 -89 -250 58 11 191 56 -92 -65 10 -247 51 185
5217A85k76L49j57j09K0N0j31R3Q4l36L96j45R7Q8q4r8k03L75l29O9k06J82J51
$$ 185 -91 258 101 -8 12 62 -69 24 108 -228 168 23 120 208 124 26 -177 198 -131 -62 -268 -86 65
5240F5o3N2J51j47k15N6P4L2r8lj8O5K06l95L24Nk4Nk59K29j73J17J71q9q5J14
$$ 65 2 54 205 58 -157 -101 -27 5 -93 -96 -114 -49 157 -238 86 91 67 72 -187 42 -131 -14 157 68 -17 97
5266I7m9j53K09n1k4j40M9J62N1n3Kq0jl8P8r6K32l09J07O5O1k11K27o1m1j07
$$ 97 48 -105 104 53 29 -111 -62 100 151 98 100 20 19 -19 59 -37 195 -114 -7 58 119 -92 135 74 33 -74
5292g4QO7j03J52k2J17k30J68j71J52j17n1J91p7R7j95J40j08L2l6j2P8j7j21
$$ -74 -66 1 -102 50 28 145 -85 83 -88 64 -53 -104 87 10 107 -88 52 -56 -24 -60 -72 6 -11 -132
5316a32K4L6K78j39J10k05k14K33j73K00r6J52Pj31J85o1j48j16K24Q2j21j56
$$ -132 -108 -72 206 67 177 -28 -242 -9 -182 18 -78 74 81 -50 135 74 -74 -190 34 116 -5 -161
5338a61jK56p8J86k42K27j09k5J66k41J38j38J26j62%O9m0j6K28k59J37k18P6
$$ -161 -162 94 16 202 -40 187 78 53 219 -22 116 -22 104 -58 -58 11 -29 -45 183 -76 61 -157 -81
5361h1Nm9J66K5p2jR9j13n8P4P9l4q3l2J23n1qJ11j47KK9J41J1j16O6M4k18J23
$$ -81 -76 -125 41 66 -6 -7 92 -21 -79 -5 74 40 -43 -75 48 -3 -11 100 -47 -45 -16 125 136 20 86 130 -88 35
5389C5L7j81K29k53J08N6N8K5q1nJ27p3k2j71K9K9K03k00k4J83j77O5j5P5j12
$$ 35 72 -109 120 -133 -25 31 89 114 33 28 155 82 60 -111 -82 -53 150 -50 -74 109 -68 -3 -18 57 -55
5414e5j0O9o0J28j35R4j11p8L0P4k8J88Pj45Q0l7j16M1K4Kj54J48j4J16q5N6J5
$$ -55 -65 4 -56 72 -63 31 -80 -158 -128 -54 -82 106 113 -32 48 11 -105 -64 -40 -38 -192 -44 -58 58 -27 29 44
5441D4k12K69j57Mm0K91l11P0m0K12j08J24j21k6p2M3J4J23q3j1j28J04J5j93
$$ 44 -168 101 -56 -52 -92 199 -112 -42 -82 130 22 146 25 -1 -73 -30 -16 107 24 13 -115 -11 4 -189
5465a89J62J3Rj9j36p2L06j52j6J65J71k10o4N2m2N3J4j54l8K90r4K0j62J42j60
$$ -189 -27 -14 -5 -24 -160 -232 74 -78 -94 71 242 32 -32 20 -22 31 45 -109 -147 143 49 69 -93 49 -111
5490a11J00L4L3J2j68K29j8j58K13k05J09j42J7p1J22M9j52J93k42J38K%J05k3
$$ -111 -11 23 56 68 -100 129 111 -47 166 -39 70 -72 -55 -126 -4 45 -107 86 -156 -18 -16 -16 89 66
5514F6ln0j51K06j17J05j87R5J65l4q4N9Q8o6j19Q9j23J24n4j6n4jq2J58R6l05
$$ 66 63 13 -138 68 -49 56 -131 -36 129 95 11 70 158 92 -27 62 -61 63 9 -7 -61 -62 -144 14 110 -195
5540a95L78N4k64R6P9j24k20O6J83N5k61K36j08j83K21K57k45j41M02k42K07l01
$$ -195 183 237 -27 69 148 24 -196 -130 53 108 -153 83 -25 -208 13 270 25 -116 286 44 251 -50
5562e0K31j52k2j05L34l63J01l8j03K48k80K10R2j9j01M9J02j42J39p5K4m5O8
$$ -50 181 29 7 -98 236 -127 -26 -64 -167 81 -199 11 103 84 -17 32 134 -8 131 56 80 35 103
5585A03k80O8K44l02J62j80K02q9N6J54j42P6n4Kj07M1K3J7J75j63j83J71r6J
$$ 103 -177 -109 135 -167 -5 -185 17 -72 -16 138 -4 72 18 20 -87 -46 -23 -6 169 6 -177 -6 -102 -101
5609a01J27j45L44m00K09k15J17K8j38K12M0n8m5j30K20k09L7K57l59k4J85o7
$$ -101 26 -119 225 -175 34 -181 -64 -36 -174 38 78 20 -25 -155 65 -144 -107 150 -209 -233 -48 -115
5631a15N6J6K70k13m6J25k4j37M6j38J29j33P2J63q4J45k36L32j00k34j65K46
$$ -115 -59 -43 227 14 -32 93 69 -68 -22 -160 -31 -164 -92 71 -13 132 -104 228 128 -106 -271 -25
5653b5o2L2q1K43Kq7N5p4L7J70r3Q9n65L93J03m2r4K4l31L44J64k33J33j02r0
$$ -25 -87 -55 -136 107 109 22 77 3 40 210 117 206 -359 34 137 95 1 25 -306 38 202 -31 102 0 -90
5678i0lM8k7L0J99j83j5K34l95J55J97k02j04K12o6mJ02r4K4Oj45J19J11j25r9
$$ -90 -93 -45 -72 -42 157 -26 -41 193 -202 -47 150 -52 -156 56 -10 -14 88 -6 18 24 -121 -2 109 -16 -115
5703a15K38l75J57N3o2J82Oj40k3j14J67J45q3Qo5R5k5K3J4Mj74k8L3M7R3k29
$$ -115 123 -252 -95 -42 -104 78 84 -56 -79 -193 -26 119 36 44 -21 74 49 72 86 90 -84 -112 -79 -32 61 -168
5729a68J95J79l66J79K12j20q5j06K22j24%j62O6J1L3J29n6j7m8j4J86k26o7K35
$$ -168 27 206 -160 19 231 111 26 -80 142 18 18 -144 -78 -67 -34 95 39 22 -26 -40 146 -80 -147 88
5753H8k0k4n1m8J2P0j7O8Jq8K9Q9p2J5Q4j95p4L8O2O2L7J5j33M9r5J93j27%P3
$$ 88 68 44 -7 -55 -43 27 10 78 79 -9 20 109 37 52 136 -59 -133 -95 -33 29 66 81 -52 -3 -98 95 -32 -32 41
5782D1j37K2J64J34j84q9p9J95K3k1m2j83J90j12J62j36QM0j41Q7L9l39M16j28
$$ 41 -96 -74 90 224 40 -49 -128 67 90 69 27 -156 34 -78 84 -52 -44 -4 -145 -58 -19 -358 58 -70
5806g0M4j9pR0M5j57K29j09j52K53j41K9l2l2J53k89jJ19O5J00o1j0L7k06K31
$$ -70 -26 -45 -52 38 83 -74 155 46 -106 147 6 35 3 -29 124 -165 -166 -47 18 118 57 47 84 -122 109
5831A09j13j43J68J8j07P0K83m30RJ93l30L70n5j28l9R7K87k99k47L14j10J69
$$ 109 -4 -147 21 39 -68 2 285 -145 -136 57 -273 97 42 -86 -125 -28 259 -40 -287 27 -83 86
5853H6j23M3JO6N0k91J98j41N9j77L09l3p7J49l0j49j65K91Q1q5r3n3q3J45j25
$$ 86 -37 6 7 73 123 -168 30 -111 -52 -229 80 47 -30 119 89 -60 -225 66 147 62 -31 -84 -167 -22 -147
5878a47J38j0j28O6K9J08j05L9j12J74N6L0k5j04J47Kpq3j47K81j1j95J37L6j50
$$ -147 -9 -19 -147 -81 -52 56 -49 -10 -122 52 108 138 113 9 156 158 151 68 -79 202 191 -4 133 169 19
5903A9r6K91j53k58K59j72K30K3j45r1J68r5N3k0j89J76j92L50l27K74J11k23
$$ 19 -77 214 61 -197 62 -110 120 143 -2 -93 75 -20 33 13 -176 0 -192 158 -169 105 216 -7
5925gQ1n9k12J42k6P0l9%J14k16P3R7l4j06M0j17K97j82Jo1K37L5q5lj40J34o1
$$ -7 74 15 -197 -55 -81 -11 -50 -50 64 -152 -79 18 -16 -122 -82 -199 98 -84 -83 -144 93 128 43 40 -100 34 -27
5952b7K2k64rJ26J95k45Q7J23p9k6K1K42j45j5j74K87p3k13J46L5J8j02J58J7
$$ -27 -5 -269 -278 -152 43 -202 -115 8 -71 -97 -76 166 21 6 -168 119 46 -167 -21 14 32 -70 88 105
5976A05k3j09j21N7P7J28j30o0o2J40J12Q2k65J28m2l7J86j27m2R5k03P9Q4j18
$$ 105 82 -27 -148 -91 -14 114 -16 -76 -138 2 114 196 -69 59 17 -20 166 39 -3 92 -111 -32 52 -66
6000f6N6o8J15R6k69Q6O2r7K35k10J36j65J68R6j40L7M5l4lr4J58l17K01j2j19
$$ -66 -10 -78 37 133 -136 -50 12 -85 150 -60 76 -89 79 175 35 72 117 83 80 -14 144 -173 28 16 -103
6025a03K8J27m5K6J10l29K26K5p1J40l6j50R9l23K70r0J13n7O6j0n2Q9K5l2J09
$$ -103 -75 52 7 33 143 -186 40 65 -6 134 98 -52 47 -276 -6 -96 17 -40 26 16 -36 53 78 46 155
6050A55j34J4K0kj10J41J64k37ll0J27j13k19L23k43J27PQ4j13L25l21P3k63J33
$$ 155 21 35 55 53 -57 84 248 11 8 -22 105 -8 -227 96 -147 -20 -13 71 -42 283 -38 35 -228 -95
6074i5Q4ql0J93j29o7j02J59j48J54L7j21p2J00J45n4J9q3lL9p0q9K18o2L4o5
$$ -95 -11 -19 -49 144 15 -52 -154 5 -143 11 48 -73 -145 -45 100 46 65 -18 -21 18 -52 -141 77 15 49 -16
6100a6JnJ0j0r7P6K2Rk05K00K48l30Q6M7n3L2j93J15r6J28N3o6r0J73q8m4N2K1
$$ -16 -15 -20 -10 -20 -117 -41 -19 -10 -215 -15 233 -97 -11 36 -17 15 -178 -63 -159 -31 22 -44 -134 39 -49 -93 -41 -20
6128b0J01r7N2O9j17j3K5K2n1l7O1R0k81K86o3j20M9J89k36J78mj66l4j35M60
$$ -20 81 -16 36 105 -12 -25 0 22 -29 -66 -5 85 -196 90 27 -93 -44 145 -91 87 83 -83 -117 -252 208
6153B08k68Q7N1j86R1j22K86k77J78j70J54J03j18K8no7K54l00J24M0p4k81L39
$$ 208 -60 27 78 -108 -17 -139 147 -130 48 -122 32 135 17 45 40 -27 227 -73 51 91 17 -264 75
6176G5l3k54K12J2j42%J13L42k39k28L98l23M5M9n3Q8N6k05N7q0J40p4J71%k03
$$ 75 42 -212 0 12 -130 -130 -17 325 86 -142 256 -67 -22 27 -26 62 118 -87 -30 -110 30 -44 127 127 -76
6201g6J09r0j57K53m0q3j3J14q2J95P0j80j94L10j62K26k02o2L4J8K90m27k9K54
$$ -76 33 -57 -214 39 -1 -84 -97 17 -65 130 200 20 -174 136 -26 200 -2 -64 -30 -12 278 -149 -178 76
6225G6j14j7K56j97R6q3j65JJ67K69j92q3J6r3L20j89k50K38J13k70O3J76j49
$$ 76 -38 -55 201 4 100 17 -148 -147 20 289 97 14 30 -63 257 68 -182 56 169 -101 -38 138 -11
6248a1k9K4k30K35J40k04J64n4J72p7j2l7k9l8n2N7jJ90j49l03J33L9L0O9K6l6
$$ -11 -40 -16 -246 -11 129 -75 89 35 207 130 118 81 52 14 -38 19 18 208 59 -244 -111 -72 -42 27 53 17
6274A7J02p1k11Q5J12j2j52J01j17J58p4J41J97m43R6J52n7j24J95j45K7j05m0
$$ 17 119 48 -163 -78 34 22 -130 -29 -146 12 -62 79 276 -167 -71 81 24 -100 95 -50 -23 -128 -168
6297a68L25pj55N1q8J42j69K77j8k88Q1PJ50j70m8K04k33J29J55k09M4k9K4k64
$$ -168 157 150 -5 46 -42 100 -69 208 190 -98 -17 -10 140 -30 -78 126 -107 22 177 -32 12 -17 7 -257
$$ [...]
8191A14
##END NTUPLES=NMR FID
##END=
