##TITLE=1H_Pr CF3-2
 CDCl3
 8 sc, 
 8.04.2022
##JCAMPDX= 6.0         $$ Bruker NMR JCAMP-DX V2.0
##DATA TYPE= NMR FID
##DATA CLASS= NTUPLES
##ORIGIN= UXNMR, Bruker Analytische Messtechnik GmbH
##OWNER= root
$$ XWIN-NMR		Version 3.5
$$ Fri Apr  8 10:29:32 2022 Russian Standard Time (UT+4h)  she@DPX200
##.OBSERVE FREQUENCY= 200.13135
##.OBSERVE NUCLEUS= ^1H
##.DELAY= (6, 6)
##.ACQUISITION MODE= SIMULTANEOUS
##.ACQUISITION SCHEME= undefined
##.AVERAGES= 8
##.DIGITISER RES= 18
##SPECTROMETER/DATA SYSTEM= spect
##.PULSE SEQUENCE= zg30
##.SOLVENT NAME= CDCl3
##.SHIFT REFERENCE= (INTERNAL, CDCl3, 0, 15.7039)
##AUDIT TRAIL= $$ (NUMBER, WHEN, WHO, WHERE, WHAT)
$$ ##TITLE= Audit trail, XWIN-NMR		Version 3.5
$$ ##JCAMPDX= 5.01
$$ ##ORIGIN= Bruker BioSpin GmbH
$$ ##OWNER= she
$$ F:/spectra/data/she/nmr/H-F/1/audita.txt
$$ ##AUDIT TRAIL=  $$ (NUMBER, WHEN, WHO, WHERE, WHAT)
(   1,<2022-04-08 10:28:34.85 +0400>,<she>,<DPX200>,
      <created by zg, POWCHK disabled, PULCHK disabled
       configuration hash MD5:
       00 E9 B6 7A A2 85 ED C7 34 08 36 98 17 FE 4E 26
       data hash MD5: 16K
       DE B3 DA D8 68 4A 98 9A C7 76 F5 E9 61 22 BF 27>)
$$ ##END=
$$ 
$$ hash MD5
$$ D7 6F 94 44 B3 A9 9C 05 E8 04 9F 42 93 67 79 F6
##$RELAX= 
##$RELAX= 
##$RELAX= 
##$RELAX= 
##$RELAX= 
##$RELAX= 
$$ Bruker specific parameters
$$ --------------------------
##$DU= <F:/spectra>
##$EXPNO= 1
##$NAME= <H-F>
##$PROCNO= 1
##$TYPE= <nmr>
##$USER= <she>
##$AMP= (0..31)
100 100 100 100 100 100 100 100 100 100 100 100 100 100 100 100 100 100 
100 100 100 100 100 100 100 100 100 100 100 100 100 100 
##$AQSEQ= 0
##$AQ_mod= 1
##$AUNM= <au_zg>
##$AUTOPOS= <>
##$BF1= 200.13
##$BF2= 200.13
##$BF3= 200.13
##$BF4= 200.13
##$BF5= 200.13
##$BF6= 200.13
##$BF7= 200.13
##$BF8= 200.13
##$BYTORDA= 1
##$CFDGTYP= 0
##$CFRGTYP= 5
##$CHEMSTR= <none>
##$CNST= (0..31)
1 1 145 1 1 1 1 1 1 1 1 1 1 1 1 1 1 1 1 1 1 1 1 1 1 1 1 1 1 1 1 1 
##$CPDPRG= <>
##$CPDPRG1= <>
##$CPDPRG2= <>
##$CPDPRG3= <>
##$CPDPRG4= <mlev>
##$CPDPRG5= <mlev>
##$CPDPRG6= <mlev>
##$CPDPRG7= <mlev>
##$CPDPRG8= <mlev>
##$CPDPRGB= <>
##$CPDPRGT= <>
##$D= (0..31)
0 1.2 0 0 0 0 0 0 0 0.06 0 0.03 0 0 0 0 0.0002 0 0 0 0 0 0 0 0 0 0 0 0 
0 0 0 
##$DATE= 1649399314
##$DBL= (0..7)
120 120 120 120 120 120 120 120 
##$DBP= (0..7)
150 150 150 150 150 150 150 150 
##$DBP07= 0
##$DBPNAM0= <>
##$DBPNAM1= <>
##$DBPNAM2= <>
##$DBPNAM3= <>
##$DBPNAM4= <>
##$DBPNAM5= <>
##$DBPNAM6= <>
##$DBPNAM7= <>
##$DBPOAL= (0..7)
0.5 0.5 0.5 0.5 0.5 0.5 0.5 0.5 
##$DBPOFFS= (0..7)
0 0 0 0 0 0 0 0 
##$DE= 6
##$DECBNUC= <off>
##$DECIM= 32
##$DECNUC= <off>
##$DECSTAT= 4
##$DIGMOD= 1
##$DIGTYP= 9
##$DL= (0..7)
0 120 120 120 120 120 120 120 
##$DP= (0..7)
150 150 150 150 150 150 150 150 
##$DP07= 0
##$DPNAME0= <>
##$DPNAME1= <>
##$DPNAME2= <>
##$DPNAME3= <>
##$DPNAME4= <>
##$DPNAME5= <>
##$DPNAME6= <>
##$DPNAME7= <>
##$DPOAL= (0..7)
0.5 0.5 0.5 0.5 0.5 0.5 0.5 0.5 
##$DPOFFS= (0..7)
0 0 0 0 0 0 0 0 
##$DQDMODE= 0
##$DR= 18
##$DS= 0
##$DSLIST= <SSSSSSSSSSSSSSS>
$$ [...]
##$SUBNAM2= <"">
##$SUBNAM3= <"">
##$SUBNAM4= <"">
##$SUBNAM5= <"">
##$SUBNAM6= <"">
##$SUBNAM7= <"">
##$SUBNAM8= <"">
##$SUBNAM9= <"">
##$SW= 18.05172834244
##$SWIBOX= (0..15)
0 0 2 0 0 0 0 0 0 0 0 0 0 0 0 0 
##$SW_h= 3612.71676300578
##$TD= 16384
##$TD0= 1
##$TE= 0
##$TE2= 300
##$TE3= 300
##$TEG= 300
##$TL= (0..7)
0 120 120 120 120 120 120 120 
##$TP= (0..7)
150 150 150 150 150 150 150 150 
##$TP07= 0
##$TPNAME0= <>
##$TPNAME1= <>
##$TPNAME2= <>
##$TPNAME3= <>
##$TPNAME4= <>
##$TPNAME5= <>
##$TPNAME6= <>
##$TPNAME7= <>
##$TPOAL= (0..7)
0.5 0.5 0.5 0.5 0.5 0.5 0.5 0.5 
##$TPOFFS= (0..7)
0 0 0 0 0 0 0 0 
##$TUNHIN= 0
##$TUNHOUT= 0
##$TUNXOUT= 0
##$USERA1= <user>
##$USERA2= <user>
##$USERA3= <user>
##$USERA4= <user>
##$USERA5= <user>
##$V9= 5
##$VALIST= <valist>
##$VCLIST= <CCCCCCCCCCCCCCC>
##$VD= 0
##$VDLIST= <DDDDDDDDDDDDDDD>
##$VPLIST= <PPPPPPPPPPPPPPP>
##$VTLIST= <TTTTTTTTTTTTTTT>
##$WBST= 1024
##$WBSW= 4
##$XGAIN= (0..3)
0 0 0 0 
##$XL= 0
##$YL= 0
##$YMAX_a= 336473
##$YMIN_a= -307561
##$ZGOPTNS= <>
##$ZL1= 120
##$ZL2= 120
##$ZL3= 120
##$ZL4= 120
##$ABSF1= 10
##$ABSF2= 0
##$ABSG= 5
##$ABSL= 3
##$ALPHA= 0
##$AQORDER= 0
##$ASSFAC= 0
##$ASSFACI= 0
##$ASSFACX= 0
##$ASSWID= 0
##$AUNMP= <proc_1d>
##$AZFE= 0.1
##$AZFW= 0.1
##$BCFW= 1
##$BC_mod= 2
##$BYTORDP= 1
##$COROFFS= 0
##$CY= 11.3945322036743
##$DATMOD= 1
##$DC= 2
##$DFILT= <>
##$DTYPP= 0
##$F1P= 2.36226072786647
##$F2P= -0.459571619588291
##$FCOR= 0.5
##$FTSIZE= 0
##$FT_mod= 4
##$GAMMA= 1
##$GB= 0.15
##$INTBC= 1
##$INTSCL= 1
##$ISEN= 128
##$LB= 0.24
##$LEV0= 0
##$LPBIN= 0
##$MAXI= 10000
##$MC2= 0
##$MEAN= 0
##$ME_mod= 0
##$MI= 1.114404
##$NCOEF= 0
##$NC_proc= 0
##$NLEV= 6
##$NOISF1= 3.799351
##$NOISF2= 2.8
##$NSP= 1
##$NTH_PI= 0
##$NZP= 0
##$OFFSET= 15.70392
##$PC= 1
##$PHC0= -18386.38
##$PHC1= 7.80078
##$PH_mod= 1
##$PKNL= yes
##$PPARMOD= 0
##$PSCAL= 0
##$PSIGN= 0
##$REVERSE= no
##$SF= 200.130013532006
##$SI= 16384
##$SIGF1= 3
##$SIGF2= 2
##$SINO= 400
##$SIOLD= 16384
##$SREGLST= <1H.CDCl3>
##$SSB= 0
##$STSI= 0
##$STSR= 0
##$SW_p= 3612.71676300578
##$SYMM= 0
##$S_DEV= 0
##$TDeff= 0
##$TDoff= 0
##$TI= <>
##$TILT= no
##$TM1= 0
##$TM2= 0
##$TOPLEV= 0
##$USERP1= <user>
##$USERP2= <user>
##$USERP3= <user>
##$USERP4= <user>
##$USERP5= <user>
##$WDW= 1
##$XDIM= 8192
##$YMAX_p= 0
##$YMIN_p= 0
$$ End of Bruker specific parameters
$$ ---------------------------------
##NTUPLES= NMR FID
##VAR_NAME=  TIME,          FID/REAL,        FID/IMAG
##SYMBOL=    X,             R,               I
##VAR_TYPE=  INDEPENDENT,   DEPENDENT,       DEPENDENT
##VAR_FORM=  AFFN,          ASDF,            ASDF
##VAR_DIM=   8192,          8192,            8192
##UNITS=     SECONDS,       ARBITRARY UNITS, ARBITRARY UNITS
##FACTOR=    0.0002768,     1,               1
##FIRST=     0,             0,               0
##LAST=      2.2672688,     0,               0
##MIN=       0,             -307561,         0
##MAX=       2.2672688,     336473,          0
$$ Real data points
##PAGE= N=1
##DATA TABLE= (X++(R..R)), XYDATA
$$ [...]
2170B100R3n68P9q9n63j97j27l36n81m87l34j75m60k55l7p5k23o5O89J18k9N93
$$ 2100 2193 1625 1704 1615 1052 855 728 392 -189 -676 -1010 -1185 -1645 -1900 -1937 -2012 -2235 -2300 -1611 -1493 -1522 -929
2192i29O10K46K96K91J54N77J35J53J31M32pm51J24j11k95o01j47l34k30n34l71
$$ -929 -319 -73 223 514 668 1245 1380 1533 1664 2096 2089 1638 1762 1651 1356 755 608 274 44 -490 -861
2213h61k01k62k97l11J54k5k60L59M77p5J84O44L90p0N15P79L4j3M63N00l18j70
$$ -861 -1062 -1324 -1621 -1932 -1778 -1803 -2063 -1704 -1227 -1302 -1118 -474 -84 -154 361 1140 1174 1161 1624 2124 1806 1636
2235A636J98J05k97l46l36l3l69m82l37k60o36l18P1q1j96m99L20J33K16J7L01
$$ 1636 1834 1939 1642 1296 960 927 558 76 -261 -521 -1157 -1475 -1404 -1485 -1681 -2180 -1860 -1727 -1511 -1494 -1193
2256a193L10M22L90M82M96K20J07LN99p0kk33J5Q5m37k87j2l60p10j21r3j12n65
$$ -1193 -883 -461 -71 411 907 1127 1234 1237 1836 1766 1764 1531 1546 1631 1194 907 895 535 -175 -296 -389 -501 -1066
2279a066l56L18n42m55N86p9Nl2M40M30K93J13M98L96r2P48J8O92j45r8K87l37
$$ -1066 -1422 -1104 -1646 -2101 -1515 -1594 -1589 -1621 -1181 -751 -458 -345 153 549 457 1205 1223 1915 1770 1672 1959 1622
2301A622k22k00p5l06k62k68m02m04k68l30k52k0k38j37K02q2J70j09L48Q02j40
$$ 1622 1400 1200 1125 819 557 289 -113 -517 -785 -1115 -1367 -1387 -1625 -1762 -1560 -1642 -1472 -1581 -1233 -431 -571
2322e71J73M62M13M47Q2J0N03J39k36N45jk38m07k10K8n01k98j54n38l26k88j56
$$ -571 -398 64 477 924 1006 1016 1519 1658 1422 1967 1966 1728 1321 1111 1139 638 340 186 -352 -678 -966 -1122
2344a122p1o39N4K43N9j49J55K62M43P8J03O29P02l96M70Q1N86L53k54L0J77m16
$$ -1122 -1193 -1832 -1778 -1535 -1476 -1625 -1470 -1208 -765 -687 -584 45 747 351 821 902 1488 1841 1587 1617 1794 1378
2366A378j95K53l53j85o06m73j36l07k45j13k62j26n58M76o7j26L16J79L03k1
$$ 1378 1183 1436 1083 898 292 -181 -317 -624 -869 -982 -1244 -1370 -1928 -1452 -1519 -1645 -1329 -1150 -847 -868
2386h68K48N82M70k68L64N26K29P6R9L24q4k58j83J34l71k01l38l41k15o76l4
$$ -868 -620 -38 432 164 528 1054 1283 1359 1458 1782 1698 1440 1257 1391 1020 819 481 140 -75 -751 -785
2407g85j66l61N4j51j59J76j41p5L95L22J49L36J04L88J65M24L74K20n6J71L67
$$ -785 -951 -1312 -1258 -1409 -1568 -1392 -1533 -1608 -1213 -891 -742 -406 -302 86 251 675 1049 1269 1213 1384 1751
2428A751J50n71j62L30l25l60l13k05j23q10j44l1l71j91o4j18k22K72N5J33K41
$$ 1751 1901 1330 1168 1498 1173 813 500 295 172 -638 -782 -813 -1184 -1375 -1439 -1557 -1779 -1507 -1452 -1319 -1078
2449a078J04K98N01K44m3O70K63k28L40L33J45k12K06L7k63l95j49r1k50k44o33
$$ -1078 -974 -676 -175 69 26 696 959 731 1071 1404 1549 1337 1543 1580 1317 922 773 682 432 188 -445
2470d45k49P6l91l58J06o5j01j34N9K09J83K48J56M01J04M58r0O61K93k87P70
$$ -445 -694 -618 -1009 -1367 -1261 -1326 -1427 -1561 -1502 -1293 -1110 -862 -706 -305 -201 257 167 828 1121 834 1604
2491A604p9k47K07k40K36n09k50Kj48m87m15j72J05m09o56R3jn2j32J03J68j01
$$ 1604 1525 1278 1485 1245 1481 972 722 724 576 89 -326 -498 -393 -802 -1458 -1365 -1366 -1418 -1550 -1447 -1279 -1380
2513a380M85J78K73K61J93M10L15jJ94L16L68l62J69l0k19k11q1j75qm25m21k02
$$ -1380 -895 -717 -444 -183 10 420 735 734 928 1244 1612 1250 1419 1389 1170 959 878 703 695 270 -151 -353
2535c53j04m70k00K49k14k96k00J47K90j10P4P80L4K06N5M14J61L30j61O12L14
$$ -353 -457 -927 -1127 -878 -1092 -1388 -1588 -1441 -1151 -1261 -1187 -407 -373 -167 -112 302 463 793 632 1244 1558
2556A558j21j7j71L15n31k17K5k09p07j2K9k41o14l36L17k40l83o1M23q4J04N5
$$ 1558 1437 1420 1249 1564 1033 816 841 632 -75 -87 -58 -299 -913 -1249 -932 -1172 -1555 -1616 -1193 -1277 -1173 -1118
2578a118M11J81p2L52N80J1M38J12L73j83K1L68J88m64N2j51j87P4o36j27l57
$$ -1118 -707 -526 -598 -246 334 345 783 895 1268 1085 1106 1474 1662 1198 1250 1099 912 986 350 223 -134
2599a34l86j6n15p5P1l79j00J41K03j68K92M32j08J73N92K09L48l81M69N89r8
$$ -134 -520 -536 -1051 -1126 -1055 -1434 -1534 -1393 -1190 -1358 -1066 -634 -742 -569 23 232 580 199 668 1257 1159
2620A159j45K23K40l21mM1j58n78k4k82m9o88N5j2j99m65j80M12k56k97K68L50
$$ 1159 1014 1237 1477 1156 1152 1193 1035 457 433 151 102 -586 -531 -543 -742 -1207 -1387 -975 -1231 -1528 -1260 -910
2642i10J02J77l6N47J25Q2N24L49K03O1K56L0o4k18j72k06Nn6n18J51k49n50m09
$$ -910 -808 -631 -667 -120 5 87 611 960 1163 1224 1480 1510 1446 1228 1056 850 855 799 281 432 183 -367 -776
2665g76R0J32n04l64j08L78k84j25N68M16k68J54N65M18k26L48O98l98J06L02
$$ -776 -686 -554 -1058 -1422 -1530 -1152 -1436 -1561 -993 -577 -845 -691 -126 292 66 414 1112 714 820 1122
2685A122M94k75k04J30j59k87k05R5k70l71l80j55K01m24m85M9j45J48j90j06
$$ 1122 1616 1341 1137 1267 1108 821 616 711 441 70 -310 -465 -264 -688 -1173 -1124 -1269 -1121 -1311 -1417
2705a417K06K32J42K49J77M90J08J49L26L32j00J55K38j54K10j52O2l32m5k34
$$ -1417 -1211 -979 -837 -588 -411 79 187 336 662 994 894 1049 1287 1133 1343 1191 1253 921 876 642
2725F42j57m38m46K19j42m43l95OL6k31J7J92L16l32N6R02l37J51N03RO36l8K88
$$ 642 485 47 -399 -180 -322 -765 -1160 -1154 -1118 -1349 -1332 -1140 -824 -1156 -1100 -198 -535 -384 119 128 764 726 1014
2748A014K19j12m7L33k22j88l6k71k7j79l47K1m38j94j99j36l57R0P1M2j70N8
$$ 1014 1233 1121 1074 1407 1185 997 961 690 663 484 137 158 -280 -474 -673 -809 -1166 -1076 -1005 -963 -1133 -1075
2770a075Q8o2L95K03J87K62L52J48J49P6J98J61J10j57L05N5l18k77j1p8p41R4
$$ -1075 -987 -1049 -654 -451 -264 -2 350 498 647 723 921 1082 1192 1035 1340 1395 1077 800 789 711 -30 64
2792F4j26k91j54j64j94j72kJ24j78j41L80K16L4nK06K86J33M42J24K19l1N35
$$ 64 -62 -353 -507 -671 -865 -1037 -1039 -915 -1093 -1234 -854 -638 -604 -609 -403 -117 16 458 582 801 770 1305
2814A305j15R3l71J55J35l71k06K60l76l49l76O8j68m65j35o6q6j49K9Q9J7q6
$$ 1305 1190 1283 912 1067 1202 831 625 885 509 160 -216 -148 -316 -781 -916 -982 -1068 -1217 -1188 -1099 -1082 -1168
2836a168O00J30rmN70R5L11Q7J80K12n0K57R2m22K14J39n79j92J20k68l27q3j09
$$ -1168 -568 -438 -447 -451 119 214 525 612 792 1004 954 1211 1303 881 1095 1234 655 463 583 315 -12 -95 -204
2859b04j91l15j29k44l07L25R3P9k98K95L44O6K44K82N2K57J53J71N79k39l6K90
$$ -204 -395 -710 -839 -1083 -1390 -1065 -972 -893 -1191 -896 -552 -486 -242 40 92 349 502 673 1252 1013 977 1267
2881A267P4n25N0K6L0n10j91J1m77j05P4k30k19k46j67J95j03j19L20n1J82K36
$$ 1267 1341 816 866 892 922 412 221 232 -245 -350 -276 -506 -725 -971 -1138 -943 -1046 -1165 -845 -896 -714 -478
2903d78K60J02L16J90O5L00O1K18j95K37J03k7k50j04k02oj36j43k73l78j45p2
$$ -478 -218 -116 200 390 455 755 816 1034 839 1076 1179 1152 902 798 596 590 454 311 38 -340 -485 -557
2925e57J04n49l40M06k09p8J60N59r2p6K81L67k3%M58K70M7J96M2K89k07k11K29
$$ -557 -453 -1002 -1342 -936 -1145 -1223 -1063 -504 -596 -672 -391 -24 -47 -47 411 681 728 924 966 1255 1048 837 1066
2948A066J14m08n02K9m2n84j06K76m06l53k02P5K39l93M4J38L55q9r2M68J64J16
$$ 1066 1180 772 270 299 257 -327 -433 -157 -563 -916 -1118 -1043 -804 -1197 -1153 -1015 -660 -749 -841 -373 -209 -93
2970i3R3M09L15n5K41L7L03l20n2R5M9k0k51k48k30m24k29L6n1o02N7J2Q4k84
$$ -93 0 409 724 669 910 947 1250 930 878 973 1022 1002 751 503 273 -151 -380 -344 -395 -997 -940 -928 -844 -1128
2994a128P8L78k8J11r5L01J62L7J04M59K69j02J18L26k53L15n8J4Kl48j11j73
$$ -1128 -1050 -672 -700 -589 -684 -383 -221 -184 -80 379 648 546 664 990 737 1052 994 1008 1010 662 551 378
3016C78j75k18j97j63o8m49P7n4O0j65P4j60J56m1K21L92L0K03J52q7N47J72P7
$$ 378 203 -15 -212 -375 -443 -892 -815 -869 -809 -974 -900 -1060 -904 -945 -724 -332 -302 -99 53 -34 513 685 762
3039G62jJ57M0LJ3J83n28J36k83l23k78P9k57n3k52k45K4o7N7k31K03q4r0M20
$$ 762 761 918 958 961 974 1157 629 765 482 159 -119 -40 -297 -350 -602 -847 -823 -890 -833 -1064 -861 -945 -1035 -615
3063f15Q8J73L2M08J43L00k68K93M44k45M0R0O9j28R3Q1m95k95J67m60k4l09k07
$$ -615 -527 -354 -322 86 229 529 261 554 998 753 793 883 952 824 917 998 503 208 375 -85 -109 -418 -625
3086f25J6J23n25J05o6L83j19j6K47K04j24N8K85L81L8j76K75L78j16k4K19k70
$$ -625 -609 -486 -1011 -906 -972 -589 -708 -724 -477 -273 -397 -339 -54 327 365 189 464 842 726 702 921 651
3108F51L19l82l8ON0m52l4j94l50op4j8j68l54R9K54k77M5J37L09K59k24N29j6
$$ 651 970 588 550 556 606 154 120 -74 -424 -430 -504 -522 -690 -1044 -945 -691 -968 -923 -786 -477 -218 -442 87 71
3132G1j74M91J65L91j73R9J46k19J55j98K04k63j81k90j92K64o68l39K25j80k1
$$ 71 -103 388 553 944 771 870 1016 797 952 754 958 695 514 224 32 296 -372 -711 -486 -666 -687
3153f87L4m8l46K15K23k24K44L04k69M11K13r0J91K85L04p2qK87P3k03k7q9k15
$$ -687 -653 -701 -1047 -832 -609 -833 -589 -285 -554 -143 70 -20 171 456 760 688 680 967 1040 837 810 721 506
3176E06ql45J46j02m41N3j80j34j66k01R3N7l85J67J26j48L46J3L67K06J98J00
$$ 506 498 153 299 197 -244 -191 -371 -505 -671 -872 -779 -722 -1107 -940 -814 -962 -616 -603 -236 -30 168 268
3198B68K89K80l21P0J74k7p6K3K59j32j65k13O4l59l64O5J17m08l23N2Nn5k95
$$ 268 557 837 516 586 760 733 657 680 939 807 642 429 493 134 -230 -165 -48 -456 -779 -727 -722 -777 -1072
3221a072P1R0K45J8J29M55k6J04M24J85q0L14O7K70k75j03K13j83k04r5N6l61
$$ -1072 -1001 -911 -666 -648 -519 -64 -90 14 438 623 543 857 924 1194 919 816 1029 846 642 547 603 242
3243B42j62l36j06J26m25j46k08J36L15l28Q4N1J24J71l7K50O9J79%O64J2r5J42
$$ 242 80 -256 -362 -236 -661 -807 -1015 -879 -564 -892 -808 -757 -633 -462 -499 -249 -180 -1 -1 663 675 580 722
3266G22N8K73k03O8j16j5k60r0o0k89k66l7k43j02j38j85K4j90K15j83L33j44
$$ 722 780 1053 850 918 802 787 527 437 377 88 -178 -215 -458 -560 -698 -883 -859 -1049 -834 -1017 -684 -828
3288h28K11L50PJ23J76L45O5K5J04J57Q3JP3k55K21n9k79k47r0j04Oj25l05n6
$$ -828 -617 -267 -260 -137 39 384 449 474 578 735 818 819 892 637 858 799 520 273 183 79 85 -40 -345 -401
3312d01k20L0j60q6J4J1K97k13N2L30L0j22N14K63r1K55l28N65j02J68q7j6L09
$$ -401 -621 -591 -751 -837 -823 -812 -515 -728 -676 -346 -316 -438 76 339 248 503 175 740 638 806 719 703 1012
3335A012m76j34M2j16k81K0j21k02j30j06Q3k55j41N2N2K8Q8K65l89M35L11j80
$$ 1012 536 402 444 328 47 67 -54 -256 -386 -492 -409 -664 -805 -753 -701 -673 -585 -320 -709 -274 37 -143
3357a43K46J99O1J45N2N9p3J61k2K37k55m82K42K9k73K6l23j76j1l09K47k06k4
$$ -143 103 302 363 508 560 619 546 707 685 922 667 185 427 456 183 209 -114 -290 -301 -610 -363 -569 -593
3380e93j54M3j3k3L0L55m1L6L30N4J5L07r2K69O7L5Q7j7j38J43j71L3k12j91o1
$$ -593 -747 -704 -717 -740 -710 -355 -396 -360 -30 24 39 346 254 523 590 625 712 695 557 700 529 562 350 159 98
3405I8k75jj19j55P1M0k60m0J48k49Q1K09N6m0P3r0M36p5J17K6L85N5K42k25J31
$$ 98 -177 -178 -297 -452 -381 -341 -601 -641 -493 -742 -661 -452 -396 -436 -363 -453 -17 -92 25 51 436 491 733 508 639
3430F39jr5K17j22Q5l61q4O6l35j51R0j61m36k06J20J47k39R8m9J46K12l5L01
$$ 639 638 543 760 638 723 362 278 344 9 -142 -52 -213 -649 -855 -735 -588 -827 -729 -778 -632 -420 -455 -154
3453a54K37k0L8K66J33L18k29J0L48j67o7j40kJ86m20m9L1k84k18L7p8l60k41
$$ -154 83 63 101 367 500 818 589 599 947 780 713 573 571 757 337 288 319 35 -183 -146 -224 -584 -825
3476h25K66K05l65m6P2J15P8LQ2M59k47N2K97L18j9j85O43j58j22K4N3J97l68
$$ -825 -559 -354 -719 -765 -693 -578 -500 -497 -415 44 -203 -151 146 464 445 260 903 745 623 647 700 897 529
3499E29j09j02N8l43j4l44p7j51j21L73l70Pj68J95l5k3Q5J13K43K93KJ04L76
$$ 529 420 318 376 33 19 -325 -402 -553 -674 -301 -671 -664 -832 -637 -672 -695 -610 -497 -254 39 41 145 521
3522E21j17O2M33l46qK47L8k24K59l10j50j76k22k98J83J74n99k2rL1k32K67j59
$$ 521 404 466 899 553 545 792 830 606 865 555 405 229 7 -291 -108 66 -533 -555 -564 -533 -765 -498 -657
3545f57N6j85M23K44l1m1J4M37kq0J86L82p6n2J15L2k39j38j52pK15m17N2l9k98
$$ -657 -601 -786 -363 -119 -150 -191 -177 260 258 178 364 746 670 618 733 765 526 388 236 229 444 27 79 40 -258
3570b58j46j10n5K9j82K7K81l58J46K89K62m2j32L31P7R3j39L49J88m5j68q5K11
$$ -258 -404 -514 -569 -540 -722 -695 -414 -772 -626 -337 -75 -117 -249 82 159 252 113 462 650 605 437 352 563
3593E63o3mJ3l6j62k15J25n14r7K9J10k38k03J26J0J09O4j61N8J73k6K16K45K0
$$ 563 500 496 509 473 311 96 221 -293 -390 -361 -251 -489 -692 -566 -556 -447 -383 -544 -486 -313 -339 -123 122 142
3617A42J90j20K87j10j25K06K25O4j35j40j29J25l57L19k99j07j78j62p7O8j22
$$ 142 332 212 499 389 264 470 695 759 624 484 355 480 123 442 143 36 -142 -304 -381 -313 -435
3638d35k09P2J59k25J5J65M0J71K30%Ml6P9J05L49l31LL19m6J11K26k28n1j84
$$ -435 -644 -572 -413 -638 -623 -458 -418 -247 -17 -17 -13 -49 30 135 484 153 156 475 429 540 766 538 487 303
3662C03j86J72j28k08j62L9m1j45k28O2l32L93k7r7k6L33l4L19p8K6K36L99j37
$$ 303 117 289 161 -47 -209 -170 -211 -356 -584 -522 -854 -461 -488 -585 -611 -278 -312 7 -71 -45 191 590 453
3685D53j00k7K52M8j54J15m9l1k86J12J15k48j07L8k71k36n1K56l65j5j38K77
$$ 453 353 326 578 626 472 587 538 507 221 333 448 200 93 131 -140 -376 -427 -171 -536 -551 -689 -412
3707d12j47o9J93k3J02J55N9K9K13O5R4L33j20L4L24j19p5k1L8j74k18j1j44j61
$$ -412 -559 -628 -435 -458 -356 -201 -142 -113 100 165 259 592 472 506 830 711 636 615 653 479 261 250 106 -55
3731e5q2j54k45l4k5J56o57M90j1J12J67j09K65M1j16M60m6P3L40j54L0P8j5P4
$$ -55 -137 -291 -536 -570 -595 -439 -1096 -606 -617 -505 -338 -447 -182 -141 -257 203 157 230 570 416 446 524 509 583
3755E83j84L66l16o6J68m07k05j9q8J4k63MJ89k02k24N9J9p4j0O2L63j22J07M30
$$ 583 399 765 449 383 551 144 -61 -80 -168 -154 -417 -413 -224 -426 -650 -591 -572 -646 -656 -594 -231 -353 -246 184
3779A84n6L50k0K07K1%j32Q4O3J33j51k26k63J33l09j16J3j64k63j6l9k44Q4K41
$$ 184 128 478 458 665 686 686 554 638 701 834 683 457 194 327 18 -98 -85 -249 -512 -528 -567 -811 -727 -486
3803d86q0K37l34M72N1O6n9K67K7K14j12J18L73k54J51L8m1k6k16j9j4l39j3j62
$$ -486 -566 -329 -663 -191 -140 -74 -133 134 161 375 263 381 754 500 651 689 648 622 406 387 373 34 21 -141
3827a41Q8j33j80J2k43o7Mo5Q9K6Q8J45j1K79K5K87K2L0N3K26J3p3J70j49j2l3
$$ -141 -53 -186 -366 -354 -597 -664 -660 -725 -636 -610 -522 -377 -388 -109 -84 203 225 255 308 534 547 474 644 495 483 450
3853D50j16kk25J3Mj68m8k10l3j01l4k92l7L46k5M8QN4m2K60K29r4J69n6Q6J41
$$ 450 334 332 107 120 124 -44 -92 -302 -335 -436 -470 -762 -799 -453 -478 -430 -422 -368 -410 -150 79 -15 154 98 184 325
3879C25j0J17P6J22j68J12j69P9l5l23q4n2L0n27J07j07k16J64J52r4j34M39j44
$$ 325 315 432 508 630 462 574 405 484 449 126 42 -10 20 -507 -400 -507 -723 -559 -407 -501 -635 -196 -340
3902c40OK72k65K79J73p6OK67P0J64k1j14L9K33k45J0K68m37j24Q5m1J20n87J33
$$ -340 -334 -62 -327 -48 125 49 55 322 392 556 535 421 460 693 448 458 726 289 165 250 209 329 -258 -125
3926a25k81m4J47j98N8J13k43MJ13J15O2L9L4K59J7K12J32k35J63L59k27K31j65
$$ -125 -406 -450 -303 -501 -443 -330 -573 -569 -456 -341 -279 -240 -206 53 70 282 414 179 342 701 474 705 540
3949E40M1j03m9k22R8j04j81j45j59j24n2r8m6p1oJ95j78K43J24j57L69j24n1
$$ 540 581 478 429 207 305 201 20 -125 -284 -408 -460 -558 -604 -675 -681 -486 -664 -421 -297 -454 -85 -209 -260
3972b60M26p0K44m4J48K29k09J76m30J19L00j23j66j68J26l58k5L2l81O2J1M9
$$ -260 166 96 340 296 444 673 464 640 210 329 629 506 340 172 298 -60 -85 -53 -434 -372 -361 -312
3994c12o2j81K45m83M88j40R0J64J11j88L11K31L4J25Q5j46M1P2Q1J01m13M5J53
$$ -312 -374 -555 -310 -793 -305 -445 -355 -191 -80 -268 43 274 308 433 518 372 413 485 566 667 254 299 452
4017D52m5m1m35m5JM6j96l04J08j41k2J07J00J39J93n50N08P3j1J60j50K05J37
$$ 452 407 366 -69 -114 -113 -67 -263 -567 -459 -600 -622 -515 -415 -276 -83 -633 -125 -52 -63 97 -53 152 289
4040B89m3J62L5o2l3L4J12j41oq8l02J15n3K9k28j12l41Qj08J00K51j96K43j55
$$ 289 246 408 443 381 348 382 494 353 347 259 -43 72 19 48 -180 -292 -633 -625 -733 -633 -382 -578 -335 -490
4064d90L57k15J31J05K78K90k22K17k01N32l35O8R2r0k62r4J44j31k4j61n2j05
$$ -490 -133 -348 -217 -112 166 456 234 451 250 782 447 515 607 517 255 161 305 174 150 -11 -63 -168
4086a68j00Q4j85k21P8L7k8k1L83l64J39L49L7l7j03K03J52r6L15j2k48K17KJ39
$$ -168 -268 -184 -369 -590 -512 -475 -503 -524 -141 -505 -366 -17 20 -17 -120 83 235 139 454 442 194 411 413 552
4110E52N1k86n3M0k90m0J47k51p7l43L5J23K4k39J66j58r7K79K8N7K52o8K05K3
$$ 552 603 317 264 304 14 -26 121 -130 -207 -550 -515 -392 -368 -607 -441 -599 -696 -417 -389 -332 -80 -148 57 80
4134H0m3K79K70l99K26k3l7J9RL8j61N2j22j52L15j82k45N6j73k70j46J94J03
$$ 80 37 316 586 187 413 390 353 372 381 419 258 310 188 36 351 169 -76 -20 -193 -463 -609 -415 -312
4157c12j50K76k80O7J72r0L3L20J33j20O1K27Pp3K55L2j84J04j43L6j0j22k9k65
$$ -312 -462 -186 -466 -399 -227 -317 -284 36 169 49 110 337 344 271 526 558 374 478 335 371 361 239 210 -55
4181e5R4l54J08Kk31J71j64jJ6m8M7M1J94k34J19R6K70J47k08Q3K41K8q4M03k20
$$ -55 39 -315 -207 -205 -436 -265 -429 -430 -414 -462 -415 -374 -180 -414 -295 -199 71 218 10 93 334 362 278 681 461
4206D61L8j80p0K5Q5n6m1j24k83j53J5rJ6j83Q7j31q1J59r5L07j70K03O8N8J6
$$ 461 499 319 249 274 359 303 262 138 -145 -298 -283 -292 -276 -459 -372 -503 -584 -425 -520 -213 -383 -180 -112 -54 -38
4231c8j30M44J9K66k81K49R3k11k0N9k4j81M9J26l74k39J07j35m2k89M22m43j04
$$ -38 -168 276 295 561 280 529 622 411 391 450 426 245 294 420 46 -193 -86 -221 -263 -552 -130 -573 -677
4254f77J79n4J59pO4K53k23K98m5R7K86j50J28J21L3j13K10J93k89j74jk60Q5
$$ -677 -498 -552 -393 -400 -336 -83 -306 -8 -53 44 330 180 308 429 462 349 559 752 463 289 288 28 113
4277A13n3k28K51j81r9Q0k42p1j28J09j16J83o7L4o6L17M6J9K21L7n6L08n7J27
$$ 113 60 -168 83 -98 -197 -117 -359 -430 -558 -449 -565 -382 -449 -415 -481 -164 -118 -99 122 159 103 411 354 481
4301D81p3k10L76k11m6J3j32J92k10j58j75J92r8m12r2J88j26j99J09K08KQJ38
$$ 481 408 198 574 363 317 330 198 390 180 22 -153 39 -59 -471 -563 -375 -501 -700 -591 -383 -381 -373 -235
4324b35J27R6k02M68M3Pn3j8j3R4lJ35P2j3j72J36l96M0Q4j71k67K8j74J18Q3
$$ -235 -108 -12 -214 254 297 304 251 233 220 314 311 446 518 505 333 469 73 113 197 26 -241 -213 -387 -269 -186
4349a86l26K16l54L77N5k44J05J34K88j87J89J3l1K94n9P2QJ77j66j5m4j30J57
$$ -186 -512 -296 -650 -273 -218 -462 -357 -223 65 -122 67 80 49 343 284 356 364 541 375 360 316 186 343
4372C43k86k96K51j07J01j80M2j16N8Ol12J37P9p2l8L58J99k70N4j7L29m51K41
$$ 343 57 -239 12 -95 6 -174 -132 -248 -190 -184 -496 -359 -280 -352 -390 -32 167 -103 -49 -66 263 -188 53
4395E3K46J1M8k04L14P8n9j64J76m40J42j62k13N0K9j62J01j34k09Q2p4J8k42
$$ 53 299 310 358 154 468 546 487 323 499 59 201 39 -174 -124 -95 -257 -156 -290 -499 -417 -491 -473 -715
4418g15L30j3J56K3K06q0kJ99o8M06m50K00l4J87l0o4l1Nj9r4j10K4j57l5M35
$$ -715 -385 -398 -242 -219 -13 -93 -95 104 36 442 -8 192 158 345 315 251 220 225 206 112 2 26 -131 -166 269
4443B69o59K22n7j25m5j19j5J88K52j29n2J49O9O8j86O4L03q5K37j4N1j48M9L28
$$ 269 -390 -168 -225 -350 -395 -514 -529 -341 -89 -218 -270 -121 -52 16 -170 -106 197 112 349 335 386 238 287 615
4467F15k70j31J91k26r6o7j09k1l8J10k20j04J13ol0J45l69K95k9L37j06N2j36
$$ 615 345 214 405 179 83 16 -93 -114 -152 -42 -262 -366 -253 -259 -289 -144 -513 -218 -247 90 -16 36 -100
4490a00J05JK57j36J60l10K91o4O9j26J8K6K16m42L4O5J6k65o7o8Q9j6r3J1m9
$$ -100 5 6 263 127 287 -23 268 204 273 147 165 191 407 -35 -1 64 80 -185 -252 -320 -231 -247 -340 -329 -378
4515c78k00J58K87j28j5J37M23k98L54j38kJ99o8J9k61J92R7l12K74j05j82J45
$$ -378 -578 -420 -133 -261 -276 -139 284 -14 340 202 200 399 331 350 89 281 378 66 340 235 53 198
4537A98j01k41J55j04L9k12q0P7n9N5P2k25P2K31j75l6L06J34K07k00K84pr4K55
$$ 198 97 -144 11 -93 -54 -266 -346 -269 -328 -273 -201 -426 -354 -123 -298 -334 -28 106 313 113 397 390 296 551
4561E51k99K59n7k96K67N7p0k78j54j35O5j60n3M5j10l1O4n9N1k88M62j14n0K51
$$ 551 252 511 454 158 425 482 412 134 -20 -155 -90 -250 -303 -258 -368 -399 -335 -394 -343 -631 -169 -283 -333 -82
4585h2J9K02j16Q6K22j25R4m6k1R3J1j84M4K33j92j7j27p0l35L18k46J30l46K51
$$ -82 -63 139 23 109 331 206 300 254 233 326 337 153 197 430 238 221 94 24 -311 7 -239 -109 -455 -204
4609b04k12JQ0J8Q8lk2J36L51k62J33j74J3L68r9Q1L09l09J02J73k46J34k76J7
$$ -204 -416 -415 -335 -317 -229 -232 -254 -118 233 -29 104 -70 -57 311 212 293 602 293 395 568 322 456 180 197
4633A97k94J72r5k06q1K6j96P0P7j10K07l1l5l4K26PL0L50q4R9l9L24j83r7K91
$$ 197 -97 75 -20 -226 -307 -281 -477 -407 -330 -440 -233 -264 -299 -333 -107 -100 -70 280 196 295 256 580 397 300 591
4658E91k14Lj5l3j1j80k00J29k58K66l50J06m7k7J0j14P1J9j23K05l6K9n9J92
$$ 591 377 380 365 332 321 141 -59 70 -188 78 -272 -166 -213 -240 -230 -344 -273 -254 -377 -172 -208 -179 -238 -46
4682d6m0L5J33k08M06o2K39m1K0j95O6K6m4j43J52k93J90j93j80J85J26m49J9
$$ -46 -86 -51 82 -126 280 218 457 416 436 241 307 333 289 146 298 5 195 2 -178 7 133 -316 -297
4705b97K7J03q4l8k24K79R4j96K66J68Q4m0O7p6J6R4q5M57l24l5j85K75n4j26
$$ -297 -270 -167 -251 -289 -513 -234 -140 -336 -70 98 182 142 209 133 149 243 158 615 291 256 71 346 292 166
4729A66J51l90J8q1J02m6q8j47J77j90k01K5K57o2j27K87qK9K5j13L59k89L22
$$ 166 317 -73 -55 -136 -34 -80 -168 -315 -138 -328 -529 -504 -247 -309 -436 -149 -157 -128 -103 -216 143 -146 176
4752A76K85j90L20k30N3j7k19J19k12j31Q7K6k26J26k96J23knl9P7P2l43K41n1
$$ 176 461 271 591 361 414 397 178 297 85 -46 41 67 -159 -33 -329 -206 -208 -213 -252 -175 -103 -446 -205 -256
4776b56j41K30j19J74J09J2N6j33L02J47k83J23K38O4Kk55N7P9j49r0l9l78J61
$$ -256 -397 -167 -286 -112 -3 9 65 -68 234 381 98 221 459 523 525 270 327 406 257 167 128 -250 -89
4799h9n4m60J13l1p6M3Q8J08K0K97j90J17m3L72P9k03N8L95k60k6K25k72J17L9
$$ -89 -143 -603 -490 -521 -597 -554 -466 -358 -338 -41 -231 -114 -157 215 294 91 149 544 284 258 483 211 328 367
4823C67j13j48J49l02O7J3j11l8r4j05K18J7l34J82m0k42R8J16Ro9j03L29P9K11
$$ 367 254 106 255 -47 20 33 -78 -116 -210 -315 -97 -80 -414 -232 -272 -514 -416 -300 -291 -360 -463 -134 -55 156
4847A56J80k50K62JJ37M3K6M3k94j3Rk39k91J44k51l1q4J45q9L5J33j0m2K64k96
$$ 156 336 86 348 349 486 529 555 598 304 291 300 61 -230 -86 -337 -368 -452 -307 -396 -361 -228 -238 -280 -16 -312
4872c12K53r9L90j02j14K18k08L04k04K68m00K13p7K10j27K14j64J53j26%q0k96
$$ -312 -59 -158 232 130 16 234 26 330 126 394 -6 207 130 340 213 427 263 416 290 290 210 -86
4894h6k9Q7p5j30k81Q2K1k5K47k85J70J29L6N8L8K59J69L85l64l5J06K20j43j40
$$ -86 -115 -28 -103 -233 -514 -432 -411 -436 -189 -474 -304 -175 -139 -81 -43 216 385 770 406 371 477 697 554 414
4918D14j79j7k25L3M7j29j48m0l7L7P1M3k65Q6N3j09J45j63L24L3k6K39k57j96
$$ 414 235 218 -7 26 73 -56 -204 -244 -281 -244 -173 -130 -395 -309 -256 -365 -220 -383 -59 -26 -52 187 -70 -266
4942b66L53JR6q1K6K76J34r4j63k2Rq2K70k74k5n04K74l47K80k25j72j7j5J94
$$ -266 87 88 184 103 129 405 539 445 282 260 269 187 457 183 158 -346 -72 -419 -139 -364 -536 -553 -568 -374
4966c74M7Q9N7J13j11M89R1k69K6P2K43k07j45M6J43j59j48L66k28k55K27j05
$$ -374 -327 -238 -181 -68 -179 310 401 132 158 230 473 266 121 167 310 151 3 369 141 -114 113 8
4988HQ0%j39l7p7j78J45j25J44j21k07K99n1j46L19o7m2K52n1J36R5O9q0J15j68
$$ 8 88 88 -51 -88 -165 -343 -198 -323 -179 -300 -507 -208 -259 -405 -86 -153 -195 57 6 142 237 306 226 341 173
5013A73O5K5j41L30l83P0j54K5o7r3o6k7N5o6J04r6o1n8K45n0O2K4L50j76k40
$$ 173 238 263 122 452 69 139 -15 10 -57 -150 -216 -243 -188 -254 -150 -246 -307 -365 -120 -170 -108 -84 266 90 -150
5038a50J32K08L6n3j58K96J6j09J78j40J21p9j31j34J09l0k6o8j68l5k17J32j72
$$ -150 -18 190 226 173 15 311 327 218 396 256 377 298 167 33 142 112 86 18 -150 -185 -402 -270 -442
5061d42J47K7p4j2N1P7jJ26J5J04J61m1l7L7K23RRN9k64j09k2L67r4k95J96l0
$$ -442 -295 -268 -342 -354 -303 -226 -227 -101 -86 18 179 138 101 138 361 370 379 438 174 65 43 410 316 21 217 187
5087A87k08l9q4r0J0R2j20q7%J1N5K30j08J74j63L8J93K2R7j06l3O7J42j7j27
$$ 187 -21 -60 -144 -234 -224 -132 -252 -339 -339 -328 -273 -43 -151 23 -140 -102 91 113 210 104 71 138 280 263 136
5112A36J01J07k96o6oj62L09m3k29J82j32k5j30Q5k01J41p7Q6j58J58J61Pj16
$$ 136 237 344 48 -18 -24 -186 123 80 -149 33 -99 -124 -254 -169 -370 -229 -306 -220 -378 -220 -59 -52 -168
5135a68K66J45k0j4k2L45j17j4j66P7P5j29j16r2J90k03k99K09j77R3j64L5r8
$$ -168 98 243 223 209 187 532 415 401 235 312 387 258 142 50 240 37 -262 -53 -230 -137 -301 -266 -364
5158c64m5J66l1J6L96j85J15k07Q9J50MN8pJ55j28QJ56J3k98j16K86j11J74l44
$$ -364 -409 -243 -274 -258 138 -47 68 -139 -50 100 104 162 155 310 182 190 346 359 61 -55 231 120 294 -50
5182e0L75k19j49k79K05O9j73k54K02k54K77j96N5L12M6n0j1K00o3L41j05pj53
$$ -50 325 106 -43 -322 -117 -48 -221 -475 -273 -527 -250 -446 -391 -79 -33 -83 -94 106 43 384 279 272 119
5205A19J60r5R7j34J6j00q0K37l71J06M1j49%K01O7j44m4k8%j32m6J45N9q5Q4
$$ 119 279 184 281 147 163 63 -17 220 -151 -45 -4 -153 -153 48 115 -29 -73 -101 -101 -233 -279 -134 -75 -160 -76
5230g6j19P0j8K2J35j6M1O1K27k7l14M32j82k30K56k51J13j83k5j31r0Q7q2K1
$$ -76 -195 -125 -143 -121 14 -2 39 100 327 300 -14 418 236 6 262 11 124 -59 -84 -215 -305 -218 -300 -279
5254b79J11J0j58K49P4M8j39K98l69qK02J45j34q8J40K38j92k97J96j92L6K03
$$ -279 -168 -158 -316 -67 7 55 -84 214 -155 -163 39 184 50 -38 102 340 148 -149 47 -145 -109 94
5276I4p7N1K25j39O1k64K54k37p0j73L22n6p2k94R3P0j43O2L5M46j55K05k26m6
$$ 94 17 68 293 154 215 -49 205 -32 -102 -275 47 -9 -81 -375 -282 -212 -355 -293 -258 188 33 238 12 -34
5300c4K05P8j88K65k77J67J78m48J74j88N9R1p2k5l31J60Q5j35Q9P3r0m2L24k20
$$ -34 171 249 61 326 49 216 394 -54 120 -68 -9 82 10 -15 -346 -186 -101 -236 -147 -74 -164 -206 118 -102
5324a02l9n0J55j0m6M9k2k4mL76M8k64k8R5K84j60k3J89k99J83N9j36n6l24m9
$$ -102 -141 -191 -36 -46 -92 -43 -65 -89 -93 283 331 67 39 134 418 258 235 424 125 308 367 231 175 -149 -198
5349a98J3J4j71M1J02P9j06r8J44n1J89K27j84J03j02R8q3J61j28K00n6r0L0O7
$$ -198 -185 -171 -342 -301 -199 -120 -226 -324 -180 -231 -42 185 1 104 2 100 17 178 50 250 194 104 134 201
5373B01R2j58m5n5kj52R6r7O3p4j83K57j95O1k14O2J81k4lj0R4L5J37R6j13K24
$$ 201 293 135 90 35 33 -119 -23 -120 -57 -131 -314 -57 -252 -191 -405 -343 -162 -186 -189 -199 -105 -70 67 163 50 274
5399B74l45M24J01j72J12j60j13J44l5k91K35l63op2k17O8J43J48j03P3n7j76
$$ 274 -71 353 454 282 394 234 121 265 230 -61 174 -189 -195 -267 -484 -416 -273 -125 -228 -155 -212 -388
5421c88K42J0J15M5J07R2q2q0MJ88K6j89J1J40j72K45O3j95p5K57m28O5O4j52
$$ -388 -146 -136 -21 24 131 223 141 61 65 253 279 90 101 241 69 314 377 182 107 364 -64 1 65 -87
5445h7N9m11L14r4j22K3K7K66j70k8MO7K27K7n0L48j18l16K77q7J3p0k39M16j84
$$ -87 -28 -439 -125 -219 -341 -318 -291 -25 -195 -223 -219 -152 75 102 52 400 282 -34 243 156 169 99 -140 276 92
5470I2o4J57j81R9m18K84j89M4jj47J04J70k02j80J63j13J31J08R9k2Q1l2P6k7
$$ 92 28 185 4 103 -315 -31 -220 -176 -177 -324 -220 -50 -252 -432 -269 -382 -251 -143 -44 -66 15 -17 59 32
5494C2J48O0p9J46q7j60K78l5M3j71P3j48p7j49J98r1j92R0o5l9K45l53K76j76
$$ 32 180 240 161 307 220 60 338 303 346 175 248 100 23 -126 72 -19 -211 -121 -186 -225 20 -333 -57 -233
5518b33j27J93Q3J13R9P3K5k46L2P7k1K2J06J35l6J96k32k13K07j12m5l91K10
$$ -233 -360 -167 -84 29 128 201 226 -20 12 89 68 90 196 331 295 491 259 46 253 141 96 -295 -85
5541h5Q3k3o8j61M6M3J09l03J42Q7k35K83m3o7K45J1OJ98j94K35j60N9j77J85
$$ -85 -2 -25 -93 -254 -208 -165 -56 -359 -217 -130 -365 -82 -125 -192 53 64 70 268 74 309 149 208 31 216
5565B16j34K6M8J02j80j73k3N9K9l53L32k72J1N6r4KJ4O8O3R6P8R9j43P6L7Q5
$$ 216 82 108 156 258 78 -95 -118 -59 -30 -383 -51 -323 -312 -256 -350 -348 -334 -266 -203 -107 -29 70 -73 3 40 125
5591A25J23L9j31J83J53k98j45r0J7N2Q9j13l3q6j27K34n0l18K24q9J58k07q3
$$ 125 248 287 156 339 492 194 49 -41 -24 28 117 4 -29 -115 -242 -8 -58 -376 -152 -241 -83 -290 -373
5614c73N10j64j84J19p0j62M92O4m20J70J45L6J0j01K62J32l19k8K28k45J15m0
$$ -373 137 -27 -211 -92 -162 -324 168 232 -188 -18 127 163 173 72 334 466 147 119 347 102 217 177
5636A77j94K03l55J4k9N4j78p4R3j67Q3N03j41j8J66NJ65J13j82q2M9R2l18O8
$$ 177 -17 186 -169 -155 -184 -130 -308 -382 -289 -456 -373 130 -11 -29 137 142 307 420 238 156 205 297 -21 47
5660D7K31j14Q6j31J77j98m4j5j98N2m6j68L80l77J50M0k03L02p8m9J60k17Q6
$$ 47 278 164 250 119 296 98 54 39 -159 -107 -153 -321 59 -318 -168 -128 -331 -29 -107 -156 4 -213 -127
5683a27J4N5J68j50L76qr8kJ71o2j04o1J1O7j43j02j56J11Nj39P8k41J19N2k57
$$ -127 -113 -58 110 -40 336 328 230 228 399 337 233 172 183 250 107 5 -151 -40 -35 -174 -96 -337 -218 -166 -423
5708d23L00j26K5L9K83k36n3M03m54L66k36Q0K13j19K04k47j00K84l0J95j18m7
$$ -423 -123 -249 -224 -185 98 -138 -191 212 -242 124 -112 -32 181 62 266 19 -81 203 173 368 250 203
5730B03l22K73k66J09k84J41l3l9m7o2j16J98J14j59LL35Q7j97J16L02o4j44J97
$$ 203 -119 154 -112 -3 -287 -146 -179 -218 -265 -327 -443 -245 -131 -290 -287 48 135 -62 54 356 292 148 345
5753C45k03J28K04k04k70K98j68k33L1J87k33J23L7k47K23k28Q2j2j78K50jk47
$$ 345 142 270 474 270 0 298 130 -103 -72 115 -118 5 42 -205 18 -210 -128 -140 -318 -68 -69 -316
5775c16K32L1q9lJ33o9j05M11j86J06P1j71J86k57K06JK52k67K4k00J15k0q2N5
$$ -316 -84 -53 -142 -145 -12 -81 -186 225 39 145 216 45 231 -26 180 181 433 166 190 -10 105 85 3 58
5799E8m2r7j33Lo3J52k31K11J56j61J06r4J77qL0M9r8J98J92j17n2j18J54k40
$$ 58 16 -81 -214 -211 -274 -122 -353 -142 14 -147 -41 -135 42 34 64 113 15 213 405 288 236 118 272 32
5823C2p7J34J58j05M7L2k63K9j88J08j11K57l34L18j41N2KNl5l15K17K95Qk25
$$ 32 -45 89 247 142 189 221 -42 -13 -201 -93 -204 53 -281 37 -104 -52 -50 -45 -80 -395 -178 117 125 -100
5847a00K28K0K42k62J09j16p4J72J5n6P3k86j65J24K07k20m3m7j4n5K30n0j49
$$ -100 128 148 390 128 237 121 47 219 234 178 251 -35 -200 -76 131 -89 -132 -179 -193 -248 -18 -68 -217
5870b17k49J00K39m6J60Nn5M8K6Q6K40q9Lj80n0J02L42k69k27J06R7j08l37L37
$$ -217 -466 -366 -127 -173 -13 -8 -63 -15 11 97 337 248 251 71 21 123 465 196 -31 75 172 64 -273 64
5894F4Jk52L57l66m5J90r5k61J37O1J80Qj67L08k46n1L10r7J66k74J50M4J83k24
$$ 64 65 -187 170 -196 -241 -51 -146 -407 -270 -209 -29 -21 -188 120 -126 -177 133 36 202 -72 78 122 305 81
5918H1k9J27k01K32j2P3k21j69J96j17P6l66K21k13K37r3k31J61K89j93J37q8
$$ 81 52 179 -22 210 198 271 50 -119 77 -40 36 -330 -109 -322 -85 -178 -409 -248 41 -152 -15 -103
5940a03j58J31K07m0J67k12K87l07n8L34m00L40j59K75j48j30K26k27k96L9K65
$$ -103 -261 -130 77 37 204 -8 279 -28 -86 248 -152 188 29 304 156 26 252 25 -271 -232 33
5961C3k46lJ90j26j92J50n2O7P9k40L33nM9j81K26J61Q4j52L3j55L11K2m0Lo7
$$ 33 -213 -216 -26 -152 -344 -194 -246 -179 -100 -340 -7 -12 37 -144 82 243 327 175 208 53 364 386 346 349 282
5986B82j50J22k12q0j41K32n8k34J87o0j80Q9j5M5j84L24PL5j05O7Q9n9J4O0L3
$$ 282 132 254 42 -38 -179 53 -5 -239 -52 -112 -292 -203 -218 -173 -357 -33 -26 9 -96 -29 60 1 15 75 108
6011A08m0J24Q4m6m0Q5j65l2M6j05J89r2m4l8l1k42J57j3k53J64J3JmJ31j66K73
$$ 108 68 192 276 230 190 275 110 78 124 19 208 116 72 34 3 -239 -82 -95 -348 -184 -171 -170 -174 -43 -209 64
6037F4r2N4m3L05K5l1j25j54J48Q1o7j3R5j9k02n6K33j18ql2J25k46Q0p5L0l9
$$ 64 -28 26 -17 288 313 282 157 3 151 232 165 152 247 228 26 -30 203 85 77 45 170 -76 4 -71 -41 -80
6063h0r4L00j10k00J65m4K4J65k38K86n5J45k57l9N1KK01j45PO1J33k01R4j6q4
$$ -80 -174 126 16 -184 -19 -63 -39 126 -112 174 119 264 7 -32 19 21 222 77 84 145 278 77 171 155 71
6088G1l33J29J19k29K36j36q0M2J40J8j04J40j78J72n2J57p1Q8k2m1O0j71M6K80
$$ 71 -262 -133 -14 -243 -7 -143 -223 -181 -41 -23 -127 13 -165 7 -45 112 41 129 107 66 126 -45 1 281
6112B81j27P3M5j83J10j92Q7j34J23j62L0J15k09J04L3Q2k39np8J06l69N80p9
$$ 281 154 227 272 89 199 7 94 -40 83 -79 -49 66 -143 -39 -6 76 -163 -168 -246 -140 -509 71 -8
6135ho4J96ql9K3L7K34M4m26K50j34j30P9m6K23j97R1j22n9R3m20L40Rk08J94
$$ -8 -72 124 116 77 100 137 371 415 -11 239 105 -25 54 8 231 34 125 3 -56 37 -383 -43 -34 -242 -48
6160d8j08n9j74K32K92l59K37Q2p0R7q6P4Q7j75K25N4p7j24K12k5k5j03J09k64
$$ -48 -156 -215 -389 -157 135 -224 13 95 25 122 36 110 197 22 247 301 224 100 312 287 262 159 268 4
6184Dj11R3r3j55J83l30M53k16J1P7j83J88j14p8J42J47M2mj09J28J81j41o6j09
$$ 4 -107 -14 -107 -262 -79 -409 44 -172 -161 -84 -267 -79 -193 -271 -129 18 60 56 -53 75 256 115 49 -60
6208f0J39mL2j2k46K63k71J67j05K88j14k81p9J56J97k86q2L6m0P5K87o1j05K69
$$ -60 79 75 107 95 -151 112 -159 8 -97 191 77 -204 -283 -127 70 -216 -298 -262 -302 -227 60 -1 -106 163
6232A63j15K53k52j09L8K62J43j77J2r1K27J3j12k47K42m67L41k94o5K9K1K52
$$ 163 48 301 49 -60 -22 240 383 206 218 127 354 367 255 8 250 -217 124 -170 -235 -206 -185 67
6254F7j5j84k8J5r9J51J14K9k4o5K94k93J0O2K59p8j4M8M2k4l03J56Pp8mj08J2
$$ 67 52 -132 -160 -145 -244 -93 21 50 26 -39 255 -38 -28 34 293 215 201 249 291 267 -36 120 127 49 45 -63 -51
6281e1J4m2l7%r8Q6K03k82J93J0j32k6K27k57J57L7qK29k76K51l38M53k03J95
$$ -51 -37 -79 -116 -116 -214 -128 75 -207 -14 -4 -136 -162 65 -192 -35 2 -6 223 -53 198 -140 313 110 305
6305C05j47l7J47k27J82l22L15j17k14j29L09l13Q7K09k90P0m3J73j90j8L29p6
$$ 305 158 121 268 41 223 -99 216 99 -115 -244 65 -248 -161 48 -242 -172 -215 -42 -232 -250 79 3
6327Ck38K92o5K22k31R9k1QJ13Q3k36K50j0k69R3K2p1j5j33J54Q8k00n0q1M3l4
$$ 3 -235 57 -8 214 -17 82 61 69 182 265 29 279 269 0 93 115 44 29 -104 50 138 -62 -112 -193 -150 -184
6353a84J31j30p5K34j28N4K31k13J8J36j07P3J64j60L09k61K26j89j8K05p2j38
$$ -184 -53 -183 -258 -24 -152 -98 133 -80 -62 74 -33 40 204 44 353 92 318 129 111 316 244 106
6375A06J01N9l86k6K7J21n6j76K31j04k91K47M8j93J22k7J04r2J75RoK13M0k19
$$ 106 207 266 -120 -146 -119 2 -54 -230 1 -103 -394 -147 -99 -292 -170 -197 -93 -185 -10 -1 -7 206 246 27
6399B7J3J57J27j47j07K08j16np8J8j8j61J99l03J8j21K68n5l12K64j09J87l30
$$ 27 40 197 324 177 70 278 162 157 79 97 79 -82 117 -186 -168 -289 -21 -76 -388 -124 -233 -46 -376
6422c76J34RJ64%N5K50j76p3K40j43J2J3k6J87l60L03q8k41O3m7N0K6q8R6r6M1
$$ -376 -242 -233 -69 -69 -14 236 60 -13 227 84 96 109 83 270 -90 213 125 -116 -53 -100 -50 -24 -112 -16 -112 -71
6448g1k07l5J56j4N7K0k12M07o7o0K9J68M4j84K25J19j41om3j0j58K88k79K94
$$ -71 -278 -313 -157 -171 -114 -94 -306 101 34 -26 3 171 215 31 256 375 234 228 185 175 17 305 26 320
6472C20K8l23l1j63R1j83qJ59Q5O4n13L02l0j7K54K1K2J8o1j3R1j00J44j96L50
$$ 320 348 25 -6 -169 -78 -261 -269 -110 -25 39 -474 -172 -202 -219 35 56 78 96 35 22 113 13 157 -39 311
6497C11k70O9o2l0n7J02m7R9j43J01j32N2N3j57J51k08k19K87J76l87R7P9j86
$$ 311 41 110 48 18 -39 63 16 115 -28 73 -59 -7 46 -111 40 -168 -387 -100 76 -311 -214 -135 -321
6520c21K22N9q9J73L1q0J17Q5j17J30M2j39J04K27l93K01l17k6K34q0k4j40k58
$$ -321 -99 -40 -129 44 75 -5 112 197 80 210 252 113 217 444 51 252 -65 -91 143 63 39 -101 -359
6543c59L01J30j12k20l8J16J16J6j42M8l8K29N7O8QP8k16J03oP3j22Qp5o7J02
$$ -359 -58 72 -40 -260 -298 -182 -66 -50 -192 -144 -182 47 104 172 180 258 42 145 139 212 90 98 23 -44 58
6568E8K22l18K04j75j66L85k93j37O9N4R5l5k60J35j51K02J2O3MJ04l7k7K02N9
$$ 58 280 -38 166 -9 -175 210 -83 -220 -151 -97 -2 -37 -297 -162 -313 -111 -99 -36 -32 72 35 8 210 269
6592B69N5l04J77j08j67J99j6j73K21p9k1l28J40O8K2j45J45k18J39p8QJ46J10
$$ 269 324 20 197 89 -78 121 105 -68 153 74 53 -275 -135 -67 -45 -190 -45 -263 -124 -202 -194 -48 62
6615F2j28j54K36L1P1m3j50J61J82l62R8R2J88j65J2J67j58p1o0r1J16L1l9j4
$$ 62 -66 -220 16 47 118 75 -75 86 268 -94 4 96 284 119 131 298 140 69 9 -82 34 65 26 12
6639A2p7Kj49O3l4n7LQ7J05j26J88q7J26K0N7o2K13j00k7O8j40M2j93J86J85m83
$$ 12 -65 -63 -212 -149 -183 -240 -237 -150 -45 -171 17 -70 56 76 133 71 284 184 157 225 85 127 -66 120 305 -178
6665a78M17l40n3J35o5J48om9M2k85K67k30J39j42r9K80K9k4K0J75r2n6J29O2
$$ -178 239 -101 -154 -19 -84 64 58 9 51 -234 33 -197 -58 -200 -299 -19 10 -14 6 181 89 33 162 224
6689B24k24o0J47r2R2n8J33p6j55K72n07J75K03k8j38M0L0j12k83L25N3l9K6k06
$$ 224 0 -60 87 -5 87 29 162 86 -69 203 -304 -129 74 46 -92 -52 -22 -134 -417 -92 -39 -78 -52 -258
6713b58K06J65n2j52R2p2Q9j03J27K47l02K35j11J11r3pj48K40p9lj58q0M3m8
$$ -258 -52 113 61 -91 1 -71 18 -85 42 289 -13 222 111 222 129 122 -26 214 135 132 -26 -106 -63 -111
6737a11j6L8p5j06K42Lj17j15L37P9j54n7K34m1k66J44J49N9M8j03K12j69j20
$$ -111 -127 -89 -164 -270 -28 -25 -142 -257 80 159 5 -52 182 141 -125 19 168 227 275 172 384 215 95
6760I5k57L60l27m7J46O9j12J75O4l22j2LJ7n7J6J86M2j54R8J94k58Q5l2J72m3
$$ 95 -162 198 -129 -176 -30 39 -73 102 166 -156 -168 -165 -148 -205 -189 -3 39 -115 -17 177 -81 4 -28 144 101
6785A01J6L1q6m9N4J34j96pK94j22j06K9o7m4j7k10K9K38l0J54k98Q6j25%n9J67
$$ 101 117 148 62 13 67 201 5 -2 292 170 64 93 26 -18 -35 -245 -216 22 -8 146 -152 -66 -191 -191 -250 -83
6811h3K16p2m3m8N3J1kK0N1K19j78J15j49L81k24k15L7j06j17J58o7M1qQ3l25
$$ -83 133 61 18 -30 23 34 32 52 103 322 144 259 110 491 267 52 89 -17 -134 24 -43 -2 -10 73 -252
6836b52o6J92Q2N7j20K7q3P3j97L96k19L54k47Q6n4J24n2K0J45k54K04j44j17
$$ -252 -318 -126 -44 13 -107 -80 -163 -90 -287 109 -110 244 -3 83 29 153 101 121 266 12 216 72 -45
6859d5K11o4k17J50j10q5J4K02j34j18J67l36K18J3L10m8j94M3k5o7J64N4pj79
$$ -45 166 102 -115 35 -75 -160 -146 56 -78 -196 -29 -365 -147 -134 176 128 -66 -23 -48 -115 49 103 96 -83
6883h3L13j68K12Q3k70M9j92k77L18O9Q6k65K3K9j21N0r1J55Nj78Q2J49J22o1
$$ -83 230 62 274 357 87 136 -56 -333 -15 54 140 -125 -102 -73 -194 -144 -235 -80 -75 -253 -171 -22 100 39
6907C9p1P3j61J63K11k90L38j18kk81Q6K77j04J86j83r7k8P9O1j13o5K0k12J85
$$ 39 -32 41 -120 43 254 -36 302 184 182 -99 -13 264 160 346 163 66 38 117 178 65 0 20 -192 -7
6931gq0m9j13J20k43K72j07J43K9K2L6O4j43J22R9q7j17J44K88j42j5m8R5l60
$$ -7 -87 -136 -249 -129 -372 -100 -207 -64 -35 -13 23 87 -56 66 165 78 -39 105 393 251 236 188 283 -77
6955g7K44L4k32j20J85j23j87K18J3j34J93j52K4o5P4n3J60o3J12q1q5J93n6n
$$ -77 167 201 -31 -151 34 -89 -276 -58 -45 -179 14 -138 -114 -179 -105 -158 2 -61 51 -30 -115 78 22 17
6979A7N8k5K8L28j57k06J53j29K5J43k48q6J99j88N6M1J3j56j23O3j19K05j49
$$ 17 75 50 78 406 249 43 196 67 92 235 -13 -99 100 -88 -32 9 22 -134 -257 -194 -313 -108 -257
7002b57K73j04P0n2l7J12j02J46J04l0j01K56j05j43J08M7K4j07Lq3N2j79k03
$$ -257 16 -88 -18 -70 -107 5 -97 49 153 123 22 278 173 30 138 185 209 102 105 22 74 -105 -308
7025c08J79K65k18J50p7l38N4N9J69j32R2N3j16K51k8R3M2j03j61K73Q2l2k58
$$ -308 -129 136 -82 68 -9 -347 -293 -234 -65 -197 -105 -52 -168 83 55 148 190 87 -74 199 281 249 -9
7048iJ77j98J38L8j7K7P7q7j16o9O7j60k09M14J28l47p9L0o3K56Q9j57k45K87
$$ -9 168 -30 108 146 129 156 233 146 30 -39 28 -132 -341 73 201 -146 -225 -195 -258 -2 87 -70 -315 -28
7072b8l9j25N5k7K93K7o4Q0O0r6r5j98J50Q5r4o5K3O2k91J30J07K8l01J28n9J3
$$ -28 -67 -192 -137 -164 129 156 92 172 232 136 41 -157 -7 78 -16 -81 -58 4 -287 -157 -50 -22 -323 -195 -254 -241
7098b41o9K10j57J76j15K13M1k4O9L2n9N9%J22j74R2j45k25M56k79j05L48k84
$$ -241 -310 -100 -257 -81 -196 17 58 34 103 135 76 135 135 257 83 175 30 -195 261 -18 -123 225 -59
7121e9n3R2n8O1j98J28K32o04K11K64k12K04j78Q5L40j36j84R5L6L17k94J00j95
$$ -59 -112 -20 -78 -17 -215 -87 145 -459 -248 16 -196 8 -170 -85 255 119 -65 30 66 383 89 189 -6
7144fK60j91Rq1K6K2O9RP8j68q5QL1M5k73K68p7N9k98L04k3p5o9K68j68O8R4N
$$ -6 254 63 72 -9 17 39 108 117 195 27 -58 -50 -19 26 -247 21 -56 3 -295 9 -14 -89 -158 110 -58 10 104 109
7172A09pO8j87K03j0O0p4J36j72j83K45j6k20m5K5o7J06ro5m3j66q4K64K34l97
$$ 109 102 170 -17 186 176 236 162 298 126 -57 188 172 -48 -93 -68 -135 -29 -38 -103 -146 -312 -396 -132 102 -295
7197b95K45J08j29J12O1j34L4n3L21j92rlP2J24j38l04K76Q2j3j2l39Q8q4K24
$$ -295 -50 58 -71 41 102 -32 2 -51 270 78 69 66 138 262 124 -180 96 178 165 153 -186 -98 -182 42
7221D2l02kr7K44O5k28K22r0r0Q9K41Q7j26j69J3L70j25Q7j09r1j40K63K1j01
$$ 42 -260 -262 -359 -115 -50 -278 -56 -146 -236 -147 94 181 55 -114 -101 269 144 231 122 31 -109 154 175 74
7245G4J38j11J04l07r2P1J97j97J81J1l36L11k22Q5L2J55j59N8rK07J20l16O4
$$ 74 212 101 205 -102 -194 -123 74 -123 58 69 -267 44 -178 -93 -61 94 -65 -7 -16 191 311 -5 59
7268E9J50j56J26k29K13jnj37J34m3J72l18L4j87K07k06o1R1R7l91L12J76k32
$$ 59 209 53 179 -50 163 162 157 20 154 111 283 -35 -1 -188 19 -187 -248 -157 -60 -451 -139 37 -195
7291a95J03J00k38J34M1P8k40L00J58q0M5O1j28k02L76n2m9n6M7j02k40J43j4
$$ -195 -92 8 -230 -96 -55 23 -217 83 241 161 206 267 139 -63 313 261 212 156 203 101 -139 4 -10
7314a0L4j96J11J25k55J47L0jm0j28K07q0k15J12J54j51K80l5k10K47J42k50L3
$$ -10 24 -172 -61 64 -191 -44 -14 -15 -55 -183 24 -56 -271 -159 -5 -156 124 89 -121 126 268 18 51
7337E1JN0j2k21J34j2K55k54J0J20k46J59k0j45J21l18K28k2J18j38Q1J9p7M3
$$ 51 52 102 90 -131 3 -9 246 -8 2 122 -124 35 15 -130 -9 -327 -99 -121 -3 -141 -60 -41 -118 -75
7361g5Q1P8j4n5k0K85n8pm35K65J50k8R7j23L8J00k48m0K6r9J72l32K93m3o1k54
$$ -75 6 84 70 15 -5 280 222 215 -220 45 195 167 264 141 179 279 31 -9 17 -82 90 -242 51 8 -53 -307
7387c07K84j40J62j42r0K41r0J16j0K31j22j07J76k46K43k28K11k58J41K19l11
$$ -307 -23 -163 -1 -143 -233 8 -82 34 24 255 133 26 202 -44 199 -29 182 -76 65 284 -27
7408b7o7n9J52J58l65J15J2j58J65J4p1j16K49j84J37l4l9J07j6O5n7Q6P2k42
$$ -27 -94 -153 -1 157 -208 -93 -81 -239 -74 -60 -131 -247 2 -182 -45 -79 -118 -11 -27 38 -19 67 139 -103
7432a03j9K85o3K7P6j01M5J34k84r3K21k09Lj20J0j9R9m5J62j29K2K44k40Q0j79
$$ -103 -122 163 100 127 203 102 147 281 -3 -96 125 -84 -81 -201 -191 -210 -111 -156 6 -123 -101 143 -97 -17 -196
7457a96J19J32k98K69R2l23K70l1l0K33j50k68K73J9K3K2p0J3o1P1j68J54l52
$$ -196 -77 55 -243 26 118 -205 65 34 4 237 87 -181 92 111 134 156 86 99 38 109 -59 95 -257
7480b57K97l27M8j28L20J0p5j03n0L32k6p6K18r4o0J79k0j07K45j50J3j28p6K87
$$ -257 40 -287 -239 -367 -47 -37 -112 -215 -265 67 41 -35 183 89 29 208 188 81 326 176 189 61 -15 272
7504B72J4k28Q2j6j87J46j47rk86J85p7l3J28j80L30J42p0k02J25l8p7M3L36j41
$$ 272 286 58 140 124 -63 83 -64 -73 -359 -174 -251 -284 -156 -336 -6 136 66 -136 -11 -49 -126 -83 253 112
7528A12p8J42j97N8J00j62J84o5l06K61O9j32K9m9j69J14N2j74L16l31lO1J27
$$ 112 34 176 -21 37 137 -25 159 94 -212 49 118 -14 15 -34 -203 -89 -37 -211 105 -226 -229 -168 -41
7551d1l7K3J98j75J50p1J0J33P6j25K7j25J51q2k7K42l34L3J72p9j64j74Q9J68
$$ -41 -78 -55 143 -32 118 47 57 190 266 141 168 43 194 112 85 327 -7 26 198 119 -45 -219 -130 38
7575C8j43J22O6n08M67K2j41j80P4%M1P3K14l37J44K06L6l46J16J4J93j33O7J62
$$ 38 -105 17 83 -425 42 64 -77 -257 -183 -183 -142 -69 145 -192 -48 158 194 -152 -36 -22 171 38 105 267
7599B67j61K67l23n0K15M8l51J61l8N6j85j21m7L35l03J91j00J06o3J12j51K19
$$ 267 106 373 50 0 215 263 -88 73 35 91 -94 -215 -262 73 -230 -39 -139 -33 -96 16 -135 84
7621H4q3j31M6O7J30J73q3r6q6K61k89K3j15J28K01l86J08j0j0q5j92P7J42m6
$$ 84 1 -130 -84 -17 113 286 203 107 21 282 -7 16 -99 29 230 -156 -48 -58 -68 -153 -345 -268 -126 -172
7645a72n8R3J42p1J92r3nj64J91k64K96j6k6J50K9l5q4L2N5N6j16k3K05l37Q4
$$ -172 -230 -137 5 -66 126 33 28 -136 55 -209 87 71 45 195 224 189 105 137 192 248 132 109 314 -23 61
7670F1O3j2j96R6j16J83k76J38j25j1R4L1k0J12J12J67k84PJ02J81j55k2j32p2
$$ 61 124 112 -84 12 -104 79 -197 -59 -184 -195 -101 -70 -90 22 134 301 17 24 126 307 152 130 -2 -74
7694g4J06o6K91j94J69l32KN6N6O8j10J72q3j90O3k68K34J4j61L48j05j12J56
$$ -74 32 -34 257 63 232 -100 -98 -42 14 82 -28 144 61 -129 -66 -334 -100 -86 -247 101 -4 -116 40
7717D0j83n6J72Q1L23j89j35J6J53K8k00J32j20M9o1n6R7j36Q7j13q4LQ0k4k19
$$ 40 -143 -199 -27 54 377 188 53 69 222 250 50 182 62 111 50 -6 91 -45 42 -71 -155 -152 -72 -96 -315
7742c15J42K07p3k04K17P6r4n2Q6K46o0l08N1J48K35k0j51k88J74p5P1N7J39k87
$$ -315 -173 34 -39 -243 -26 50 -44 -96 -10 236 176 -132 -81 67 302 282 131 -157 17 -58 13 70 209 -78
7766g8J25o4O7j40L53n18K66L6l08R1J23j83J80p8L3R4J54J25j17j22j85R4M30
$$ -78 47 -17 50 -90 263 -255 11 47 -261 -170 -47 -230 -50 -128 -95 -1 153 278 161 39 -146 -52 378
7789C78o6q3Ll03j5R3J30j38j13K43l11k3K19j36k8Q8oj28J15Q8o7j38K15P2q1
$$ 378 312 229 232 -71 -86 7 137 -1 -114 129 -182 -205 14 -122 -150 -62 -68 -196 -81 7 -60 -198 17 89 8
7814Hj00M02l79K86j02k41O3K17J55k29Q0l8o4j17J02j2j07O7m3o9k0O9n3J53
$$ 8 -92 310 -69 217 115 -126 -63 154 309 80 160 122 58 -59 43 31 -76 -9 -52 -121 -141 -72 -125 28
7838B8k14L92l66K44j19J05k52Q7K50N9k40M2J54n3j72k8K76k87M56k16j47J05
$$ 28 -186 206 -160 84 -35 70 -182 -95 155 214 -26 16 170 117 -55 -83 193 -94 362 146 -1 104
7860A04o2r7o5j05n5J94J5rj19K03m6J4j27J20j68J19K90j18RQ1q8j17J53RJ7
$$ 104 42 -55 -120 -225 -280 -86 -71 -80 -199 4 -42 -28 -155 -35 -203 -84 206 88 97 178 90 -27 126 135 152
7885A52j65K73j28R9j89p9J45oj08J1J04j77P3j40KJ67q9QJ14o3l5L9j83K73j89
$$ 152 -13 260 132 231 42 -37 108 102 -6 5 109 -68 5 -135 -133 34 -55 -47 67 4 -31 8 -175 98 -91
7910i1L8oNO1K40k46m6L35j85m5k0l4L58m38J14K59k74p4R4j26j63Q4n8J86j5
$$ -91 -53 -59 -54 7 247 1 -45 290 105 60 40 6 364 -74 40 299 25 -49 45 -81 -244 -160 -218 -32 -47
7935d7k26jj39O40m7q7j01q9J34m0J80K1j18j31L5L93l63K27k59L7Q0j78K40k69
$$ -47 -273 -274 -413 227 180 93 -8 -97 37 -3 177 198 80 -51 -16 377 14 241 -18 19 99 -79 161 -108
7959a08M8J55j37n3k6J41j20JJ00j34O1q0J8J36N3O8j38J74j81J54J22k29Q1j20
$$ -108 -60 95 -42 -95 -121 20 -100 -99 1 -133 -72 -152 -134 2 55 123 -15 159 -22 132 254 25 106 -14
7983a4L42l99j7L74j78O8k60j80K46k39L71j86K64p3j92K75k69L3j54r1M6Q0N6
$$ -14 328 -71 -88 286 108 176 -84 -264 -18 -257 114 -72 192 119 -73 202 -67 -34 -188 -279 -233 -153 -97
8006i7J99j06L6J13q6N1k86J73L70k38l2j19J52k47P9M2P2o8m9J9p8J85j27r9
$$ -97 102 -4 32 145 59 110 -176 -3 367 129 97 -22 130 -117 -38 4 76 8 -41 -22 -100 85 -42 -141
8030a41mo0L1N14k77K35k66r8J45o7N9K55l55L51j52k10J42l8j16J21J05rj45
$$ -141 -145 -205 -174 340 63 298 32 -66 79 12 71 326 -29 322 170 -40 102 64 -52 69 174 165 20
8053B0J77m32K25J82j9j72j86J70J56j7l06J52p2J7k7J78j0j12J06j14K00k0j42
$$ 20 197 -235 -10 172 153 -19 -205 -35 121 104 -202 -50 -122 -105 -132 46 36 -76 30 -84 116 96 -46
8076d6K26j72N4J56k05r8J13q8J65j19j11J66k46R6K68k38J04p0n0J11o6r4O5
$$ -46 180 8 62 218 13 -85 28 -60 105 -14 -125 41 -205 -109 159 -79 25 -45 -95 16 -50 -144 -79
8099g9N4J07q7q1N8n8K44j1q0j26J65j00Q5j27j2K27j17N3J66k10R0j53j74K2
$$ -79 -25 82 -5 -86 -28 -86 158 147 67 -59 106 6 91 -36 -48 179 62 115 281 71 161 8 -166 -144
8123a44J27k02J10J61j24M0k3k74J19J81j1p5J04J36l11M25l29M7J75j46K03l09
$$ -144 -17 -219 -109 52 -72 -32 -55 -329 -210 -29 -40 -115 -11 125 -186 239 -90 -43 132 -14 189 -120
8145a20J31L65j55l05K26j40k6J36kM3q4k60J23j38K44k62J7J36j81L77j04q4
$$ -120 11 376 221 -84 142 2 -24 112 110 153 69 -191 -68 -206 38 -224 -207 -71 -252 125 21 -63
8167f3K76q1j10j00j2J08l27J24J11J44M3k1j14J67l4q6J34rj35J73l11J38k23
$$ -63 213 132 22 -78 -90 18 -309 -185 -74 70 113 92 -22 145 111 25 159 150 15 188 -123 15 -208
8190b08Q5
$$ -208 -123
8191a23
$$ Imaginary data points
##PAGE= N=2
##DATA TABLE= (X++(I..I)), XYDATA
0@%%%%%%%%%%%%%qJ6j6J6j6K4l2L2m0M8n6O8p6Q8j04J20j37J57j81K05k30K60
$$ 0 0 0 0 0 0 0 0 0 0 0 0 0 0 -8 8 -8 8 -8 16 -16 16 -24 24 -32 36 -40 48 -56 64 -73 84 -97 108 -122 138
35A38k93L28l67M10m58N10n67O30o96P69q51R38j033J138j253J380j520J677j851
$$ 138 -155 173 -194 216 -242 268 -299 331 -365 404 -447 491 -542 596 -657 723 -797 880 -971
54i71K046k266K517k807L143l540M020m609N355o335P683r660J2835j8764L3454
$$ -971 1075 -1191 1326 -1481 1662 -1878 2142 -2467 2888 -3447 4236 -5424 7411 -11353 22101
69B2101j34410j95252L85931K39308j91342j48677J90300J26495r8395r7288k159
$$ 22101 -112309 -307561 78370 317678 126336 -22341 167959 294454 196059 98771 96612
80I6612l0518l312K2370q7774j55777K2438J40620k6529j64601J4146J69067L7678
$$ 96612 66094 62782 85152 -2622 -158399 -135961 4659 -21870 -186471 -172325 -3258 34420
92C4420j00375j1239Q5455L8760j7195j1780l4250k0494O1672L1114r9141n6887
$$ 34420 -65955 -77194 8261 47021 29826 18046 -16204 -36698 24974 56088 -43053 -99940
104i9940R8850N8969r1502l5555J04669M8993m9583R692M6983k3350j8909M4075
$$ -99940 -1090 57879 -33623 -69178 35491 84484 34901 44593 91576 68226 49317 93392
116I3392j2474q4723J06N8422o4000j07087M1200O8177q4278p4587J00399P3854
$$ 93392 80918 -3805 -3699 54723 -9277 -116364 -75164 -6987 -91265 -165852 -65453 8401
128H401r8815l5710J40167N7018j05687j1160J32462K9668j01411p498R0454o362
$$ 8401 -90414 -126124 14043 71061 -34626 -45786 86676 116344 14933 7435 97889 91527
140I1527p8955K937M0308k7486l6990K0696M964m2821k062L4971j9707l7558K6551
$$ 91527 12572 15509 55817 28331 -8659 12037 17001 -25820 -27882 7089 -12618 -50176 -23625
153b3625K9792l5929k5546M0351J1621m6141L815M9565j2613l5080L3405L8789
$$ -23625 6167 -29762 -55308 -14957 -3336 -49477 -45662 3903 -8710 -43790 -10385 28404
165B8404k9454j4873M8980J5254l6133J0003M0901j6760l5305J7610K0766l2420
$$ 28404 -1050 -15923 33057 48311 12178 22181 63082 46322 11017 28627 49393 16973
177A6973k6821J8397P30l2657m650J4988j8884k1122K5726K0868l3859j3619N4625
$$ 16973 -9848 8549 9279 -23378 -28028 -13040 -31924 -53046 -27320 -6452 -40311 -53930 695
190F95K3181m8837r381O3781J9860n3401p944N3294K592m4830K112K6376j6035
$$ 695 23876 -24961 -34342 29439 49299 -4102 -12046 41248 43840 -990 1122 27498 11463
203A1463k2031J4225P252k2695j600K1149o519j6405J3448J3423j2004l932J7473
$$ 11463 -10568 3657 10909 -11786 -13386 7763 1244 -15161 -1713 11710 -294 -4226 13247
216A3247k794k3450Q863K2937k0810l0462J9290K6919k3701k9638K2004K6951
$$ 13247 10453 -12997 -4134 18803 -2007 -32469 -13179 13740 -9961 -39599 -17595 9356
228I356j6384j4290J9882J3092p793L201J2626n430p790J4991N703k2445q031
$$ 9356 -7028 -21318 -1436 11656 3863 7064 19690 14260 6470 21461 27164 4719 -3312
241c312J7467R38k2352o803J2932j693j0974O651N036j1531K893J9408k769k1474
$$ -3312 14155 15093 -7259 -14062 -1130 -2823 -13797 -7146 -2110 -13641 -10748 8660 5891 -15583
255a5583P415K6914r174k7979R117K2072j0449j9728N873J2813n901m580O950
$$ -15583 -8168 18746 9572 -18407 -9290 12782 2333 -17395 -11522 1291 -4610 -9190 -2240
268b240k54j726J1511O218r470j186J5312N596j5457k834J4754j475j7662k141
$$ -2240 -2494 -4220 7291 13509 4039 2853 18165 23761 8304 5470 20224 18749 1087 -1054
282a054R232o325j4901K779O042j3222p563J2644K964j4037j1J6687L197j0386
$$ -1054 8178 1853 -13048 -10269 -4227 -17449 -25012 -12368 -9404 -23441 -23452 -6765 -3568 -13954
296a3954N315J5234O91k635N837M499M11K789J814n407l307P001m16j4324n330
$$ -13954 -8639 6595 7286 4651 10488 14987 15398 18187 20001 14594 11287 18288 17872 3548 -1782
311a782Q848p2j4210o213R862L81j2385o13Q505k187o285L502M538n242l53R325
$$ -1782 7066 6994 -7216 -13429 -3567 -3186 -15571 -16184 -7679 -9866 -16151 -12649 -8111 -13353 -13706 -4381
327d381k13p688O322J1014j127l382P867R575j320j889P162L881m290j924M60
$$ -4381 -4594 -12282 -5960 5054 3927 545 8412 17987 16667 14778 21940 25821 21531 19607 20067
342B0067l801q440m459k050j0042j0050k65j102p923l971M766M417j161M688J0006
$$ 20067 16266 7826 3367 1317 -8725 -18775 -19040 -20142 -28065 -32036 -27270 -22853 -24014 -19326 -9320
357i320M577M916Q505N162L015M877K638k068k463J202k439p778m129j189m645
$$ -9320 -4743 173 8678 13840 16855 21732 24370 22302 19839 21041 18602 10824 6695 5506 861
372H61o645k073J965j763n707J761P053j056m713K501P278o61o176J479M012k466
$$ 861 -5784 -7857 -5892 -7655 -13362 -11601 -4548 -5604 -10317 -7816 -538 -1199 -7375 -5896 -1884 -4350
388d350k019P4r34P30M303K148k427J575R300M586j481L72M194M914k3n426l579
$$ -4350 -6369 -6295 -7229 -6499 -2196 -48 -2475 -900 8400 12986 11505 11877 16071 20985 20962 15536 11957
405A1957m61k331o592q467n388k834k994l745n580k563N592O371J213J274N640
$$ 11957 11496 9165 2573 -5894 -11282 -14116 -17110 -20855 -26435 -28998 -23406 -17035 -15822 -14548 -8908
420h908J1734R522K492j285L976J0208L066j0119q065K280J436r076j3889n955
$$ -8908 2826 12348 14840 13555 17531 27739 30805 20686 12621 14901 16337 7261 -6628 -12583
434a2583K086R23n353o866p34J0324R687k100o168O265J7466O542j2516p545R446
$$ -12583 -10497 -9574 -14927 -21793 -22527 -12203 -2516 -4616 -10784 -4519 12947 19489 6973 -572 8874
449H874R397p351j6795m970R508M920j0639j3482M040J6712M793j0245l818J3146
$$ 8874 18271 10920 -5875 -10845 -1337 3583 -7056 -20538 -16498 214 5007 -5238 -9056 4090
463D090J6270j135j3973k864J2573M483j3716j4376J649N520m285r501o104L303
$$ 4090 20360 19225 5252 2388 14961 19444 5728 -8648 -6999 -1479 -5764 -15265 -21369 -18066
477a8066J0441L404m888Q68J2700J0857k564m514L650M535J89n523q798m643L65
$$ -18066 -7625 -4221 -9109 -8241 4459 15316 12752 8238 11888 16423 16612 11089 2291 -2352 -1987
492a987l378q580l972K464J958QL984M601J747N688P407L131m42J5L195O42n088
$$ -1987 -5365 -13945 -17917 -15453 -13495 -13487 -9503 -4902 -3155 2533 9940 13071 12629 12644 15839 16481 11393
509A1393q198n131J222j445p704m343K230K666K593N43j248K739R931N962p215
$$ 11393 3195 -1936 -714 -2159 -9863 -14206 -11976 -9310 -6717 -6174 -7422 -4683 5248 11210 3995
524C995n337R719M873j3401r550P041M483r494p427O544N879k252l2P031P106
$$ 3995 -1342 8377 13250 -151 -9701 -2660 1823 -7671 -15098 -8554 -2675 -4927 -4959 2072 9178
539I178K439M52M485M038k855m603k852l371n759o036m635p377o228K410J642
$$ 9178 11617 12069 16554 20592 17737 13134 10282 6911 1152 -4884 -9519 -16896 -23124 -20714 -19072
554a9072n825j527J1512J2737n37k724J0573J5024K576q016l383J0092P168j1652
$$ -19072 -24897 -26424 -14912 -2175 -2712 -5436 5137 20161 22737 14721 11338 21430 28598 16946
568A6946j6123O48P622m521j4169m709N364M271K37m785n036O932J2878j606j4177
$$ 16946 823 1471 9093 4572 -9597 -14306 -8942 -4671 -4434 -9219 -14255 -7323 5555 3949 -10228
583a0228m39J6936L895j6858r551J1247Q915p419j0825M459J1530J754m069K539
$$ -10228 -10667 6269 10164 -6694 -16245 -4998 3917 -3502 -14327 -9868 1662 3416 -653 1886
597A886O353K849J908M744r3n929K048N208p018j2687k221M595m610j1714m572
$$ 1886 8239 11088 12996 17740 17647 11718 13766 18974 11956 -731 -2952 1643 -2967 -14681 -19253
612a9253K515M05k371j710J341M997M699M247L616K071K594N978O975J6n814K572
$$ -19253 -16738 -16333 -18704 -20414 -19073 -14076 -9377 -5130 -1514 557 3151 9129 16104 16120 10306 12878
628A2878Q298k023j0349m185M958J378q184p694n98L521N75n971o192J772N874
$$ 12878 21176 19153 8804 4619 9577 10955 2771 -4923 -5521 -2000 -1425 -7396 -13588 -11816 -5942
643e942J605n524m183N079P758r74p331p78J0021O174o954m570Q483Q014l135
$$ -5942 -4337 -9861 -14044 -8965 -1207 -2181 -9512 -10290 -269 5905 -1049 -5619 2864 10878 7743
658G743m962L541O145J87j805q52j072m52J08k895m067l321n56j025l730m370
$$ 7743 2781 6322 12467 12654 10849 9997 8925 8473 8581 5686 1619 -1702 -2258 -3283 -7013 -11383
674a1383j884J789J388m007j388N415M552n50j95M657N227Q58R61K235J841J966
$$ -11383 -13267 -11478 -10090 -14097 -15485 -10070 -5518 -6068 -6263 -1606 3621 4479 5440 7675 9516 11482
690A1482o10j319L12M10l225k437N02o65l974k269M88j873k303jl09j286J81l83
$$ 11482 10872 9553 9865 10275 7050 4613 5115 4450 476 -1793 -1305 -3178 -5481 -5482 -5791 -7077 -6896 -7279
708g279j55O51Q76P81K05J564J383M20J888J742k51J235J806O39P40L24k52L2
$$ -7279 -7434 -6783 -5907 -5126 -4921 -3357 -1974 -1554 334 2076 1825 3060 4866 5505 6245 6569 6317 6349
726F349Q38K92k833j665K015p24l783k327Q13L55l474l900Q11J812n42k843j092
$$ 6349 7187 7479 4646 2981 4996 4272 489 -1838 -1025 -670 -4144 -8044 -7233 -5421 -5963 -8806 -9898
743i898L655J685r19L53K640L232J205k96J834K961R21l63q36J157r1j558p80
$$ -9898 -6243 -4558 -5477 -5124 -2484 748 1953 1657 3491 6452 7373 7010 6174 7331 7240 5682 4902
760D902j438j940j45k05j563j743o93J857m61k236qJ784K82k046j512J633J286
$$ 4902 3464 1524 1379 1174 -389 -2132 -2825 -968 -1429 -3665 -3673 -1889 -1607 -3653 -5165 -3532 -2246
777b246k406j416Q73J418L28j34Q20J887K092K136L13J631K714J266l56j66K91
$$ -2246 -4652 -6068 -5195 -3777 -3449 -3583 -2763 -876 1216 3352 3665 5296 8010 9276 8920 8754 9045
794I045l48j362k824j838j761j754k689k777n61r26j483K24N53P40N87P69K120
$$ 9045 8697 7335 4511 2673 912 -842 -3531 -6308 -6869 -7795 -9278 -9054 -8501 -7761 -7174 -6405 -4285
811d285J728Q70J026J745J683P16k5J208J371n67p03J208Q91n46j380J34M33j358
$$ -4285 -2557 -1687 -661 1084 2767 3483 3458 4666 6037 5470 4767 5975 6866 6320 4940 5074 5507 4149
829D149j419o75j058r69k538j703j89j103j902r49k18L57n0Q47Q82L90K309K557
$$ 4149 2730 2055 997 28 -2510 -4213 -4402 -5505 -7407 -8356 -8574 -8217 -8267 -7420 -6538 -6148 -3839 -1282
847a282J108J290K066K770J950r0P50J387O92j141k280m55K60k315l282j950j384
$$ -1282 -174 1116 3182 5952 7902 7812 8562 9949 10641 9500 7220 6765 7025 4710 1428 -522 -1906
864a906j059j428k843o77k15K84n65n86J256J605O01R81O30K224K149N90J000
$$ -1906 -2965 -4393 -7236 -7913 -8128 -7844 -8409 -8995 -7739 -6134 -5533 -4552 -3922 -1698 451 1041 2041
881B041R71J629J650N39J05J032P91N30r60q63N00j617l151o03j277l313l536
$$ 2041 3012 4641 6291 6830 6935 7967 8758 9288 8328 7465 7965 6348 3197 2594 1317 -1996 -5532
898e532j394m28l200k471J073P12n77Q33K767L030K054K233M104K369J552K521
$$ -5532 -6926 -7354 -10554 -13025 -11952 -11240 -11817 -10984 -8217 -5187 -3133 -900 3204 5573 7125 9646
914I646J827M43j507r07Q63k370l410j544j286k189k285q96r1j238o52P71M92
$$ 9646 11473 11916 10409 9502 10365 7995 4585 3041 1755 -434 -2719 -3615 -3706 -4944 -5596 -4825 -4333
931d333k01J50N04J309O1k240J72K085N62k822j487M135K696j680l64L845M221
$$ -4333 -4534 -4384 -3880 -2571 -2510 -4750 -4578 -2493 -1931 -4753 -6240 -2105 591 -1089 -1453 2392 6613
948F613M71j66K192J405j62O25j171m015k188P28j662p338n142L189J133n545
$$ 6613 7084 6918 9110 10515 10353 10978 9807 5792 3604 4332 2670 -4668 -9810 -6621 -5488 -11033
964a1033m636L371N969r93l104M177N632J756N03J730J716P86J632J120k979k246
$$ -11033 -15669 -12298 -6329 -7322 -10426 -6249 -617 1139 1642 3372 5088 5874 7506 8626 5647 3401
980C401K503J542l935l720J063K843j493l226n83J430J578j371k539J4J148j194
$$ 3401 5904 7446 3511 -209 854 3697 2204 -1022 -1605 -175 1403 32 -2507 -2493 -1345 -2539
996b539j282o07p38j119P34J944j610j871L325M301K50k150J478N785K179l287
$$ -2539 -3821 -4428 -5166 -6285 -5551 -3607 -5217 -7088 -3763 538 788 -1362 116 5901 8080 4793
1012D793j032L384K506k857k973N56r25k261K51q40m732r52M305o34o078o55O632
$$ 4793 3761 7145 9651 6794 3821 4377 3452 1191 1442 602 -4130 -5082 -777 -1411 -7489 -8144 -1512
1029a512J317n800n87M571K551j859k061J625K260L20j27n40K14J723J581k04
$$ -1512 -195 -5995 -6582 -2011 540 -1319 -3380 -1755 505 825 698 158 372 2095 3676 3472
1045C472j598J58L325K77k888n71K025N54k404k149nk0j080j378j661l64O54j079
$$ 3472 1874 2032 5357 5634 2746 2175 4200 4754 2350 201 196 176 -904 -2282 -3943 -4307 -3653 -4732
1063d732j124N65J337k00l08J908J766n90L81K809Q96n97N24K225m1j528J361
$$ -4732 -5856 -5291 -3954 -4154 -4462 -2554 -788 -1378 -997 1812 2708 2111 2635 4860 4819 3291 4652
1080D652Q44k021o77J627p98l258m37K118j029m171N7J481q67k022k07J194m24
$$ 4652 5496 3475 2798 4425 3627 369 -68 2050 1021 -3150 -3093 -1612 -2479 -4501 -4708 -3514 -3938
1097c938j057J095O20k16P75J698Q80o63R32L023l1j814J803K379r52j237J242
$$ -3938 -4995 -3900 -3280 -3496 -2721 -1023 -143 -806 126 3149 3118 1304 3107 5486 4534 3297 4539
1114D539N70k443k95J847j808k299L28K80k338j161L20p11j358N5K8j283K10J469
$$ 4539 5109 2666 2371 4218 2410 111 439 719 -1619 -2780 -2460 -3171 -4529 -4474 -4446 -5729 -5519 -4050
1132d050k96j29J008J959J189N80J116J650Q94J070N04K91j77K07L90m93k807
$$ -4050 -4346 -4475 -3467 -1508 -319 261 1377 3027 3921 4991 5495 5786 5609 5816 6206 5713 2906
1149B906n10N63k179k932k74J143j972k511J068O93j514J74J815j33r07J520J981
$$ 2906 2396 2959 780 -2152 -2426 -1283 -3255 -5766 -4698 -4005 -5519 -5345 -3530 -3663 -4570 -3050 -1069
1166a069m29o32K452J660q00K1J990J137q03K99J356K80r53n4L0r16j044j064
$$ -1069 -1498 -2130 322 1982 1182 1203 3193 4330 3527 3826 5182 5462 4509 4455 4485 3569 2525 1461
1184A461n00j640j675n39j058j251l48J57m82l21P09J473N78R63J833R72M06J769
$$ 1461 961 -679 -2354 -2893 -3951 -5202 -5550 -5393 -5875 -6196 -5487 -4014 -3436 -2473 -640 332 738 2507
1202B507J242j48L5R57P23j786K5R92j261j937O7R55j114j790K02M38j259o68
$$ 2507 3749 3601 3636 4593 5316 3530 3555 4547 3286 1349 1416 2371 1257 -533 -331 107 -1152 -1820
1220a820K60o90q48m26L47k35j044J66R10q5R3J035J623O91O70J471J547L14Q31
$$ -1820 -1560 -2250 -3098 -3524 -3177 -3412 -4456 -4290 -3380 -3465 -3372 -2337 -714 -23 647 2118 3665 3979 4810
1239D810J016k51q8J59q18j167j582l22j466k363m09p45j173m63LM58k72N51J692
$$ 4810 5826 5575 5487 5646 4828 3661 2079 1757 291 -2072 -2481 -3226 -4399 -4862 -4859 -4401 -4673 -4122 -2430
1258b430L71o3J215J508M35n35O50J035n57o17P45K90p08l72P92L95q53L62R38
$$ -2430 -2059 -2122 -907 601 1036 501 1151 2186 1629 1012 1757 2047 1339 967 1759 2154 1301 1663 2601
1277B601k36q88K62K71m92j155o43K37r22j292j022k83l76n09j29P18L03L58J070
$$ 2601 2365 1477 1739 2010 1518 363 -280 -43 -965 -2257 -3279 -3562 -3938 -4447 -4576 -3858 -3555 -3197 -2127
1296b127Q15J231J290L49J342P15M12o1K10M27q12r50p0k81j738j199k3j16r85
$$ -2127 -1312 -81 1209 1558 2900 3615 4027 3966 4176 4603 3791 2841 2771 2490 752 -447 -470 -586 -1571
1315a571p19L64q4p36L79Q10Q2n31R5J012Q9p38L92P64k12n20M46R30Q7k47J177
$$ -1571 -2290 -1926 -2010 -2746 -2367 -1557 -1475 -2006 -1911 -899 -810 -1548 -1156 -392 -604 -1124 -678 252 339 92 1269
1336A269N90J29N25M48O89k66m28L83L9j123r70o27n63j358j493m95j5j103k95
$$ 1269 1859 1988 2513 2961 3650 3384 2956 3339 3378 2255 1285 658 95 -1263 -2756 -3251 -3266 -4369 -4664
1355d664p8O57M96J75J348Q81L78Q88J170J117k7j89J333L94p53p02K80N00j202
$$ -4664 -4742 -4085 -3589 -3414 -2066 -1185 -807 81 1251 2368 2341 2152 3485 3879 3126 2424 2704 3204 2002
1374B002j296O39K04j031j84l85o0k75o07j49m98r38J5N3m90q96QR78J84l98P32
$$ 2002 706 1345 1549 518 334 -51 -111 -386 -993 -1142 -1640 -2578 -2563 -2510 -3000 -3896 -3888 -2910 -2726 -3124 -2392
1395b392J524J050O30J07J780J250R5Q5K90O01l36q79k04o10k140p49k38j094
$$ -2392 -868 182 812 919 2699 3949 4044 4129 4419 5020 4684 3805 3601 2991 851 102 -136 -1230
1413a230j264o59L60m10j101K30J096P0l40M65R61P15k15L00J377L10m3Q53Q01
$$ -1230 -2494 -3153 -2793 -3203 -4304 -4074 -2978 -2908 -3248 -2783 -1822 -1107 -1322 -1022 355 665 622 1475 2276
1432B276Q2j65J174P01n10o50O38N68j486j009j56j34j267j459o27k39p41j512
$$ 2276 2358 2193 3367 4068 3558 2908 3546 4114 2628 1619 1463 1329 62 -1397 -2024 -2263 -3004 -4516
1450d516k13P70m96j91Q47J336M7J81J630J444K5M64J120Q58nM4P25J84j053n19
$$ -4516 -4729 -3959 -4455 -4646 -3799 -2463 -2416 -2235 -605 839 864 1328 2448 3306 3301 3345 4070 4254 3201 2682
1470B682N12n80j238q73M22m52j708q69P39l92j515m76O29N17j128j1J018j7J79
$$ 2682 3194 2614 1376 503 925 473 -1235 -2104 -1365 -1757 -3272 -3748 -3119 -2602 -3730 -3741 -2723 -2740 -2561
1489b561O42J123N19j21J318J158J95K2Q08J116l10j059M14P80r79j326m70J76
$$ -2561 -1919 -796 -277 -398 920 2078 2273 2295 3103 4219 3909 2850 3264 4044 3065 1739 1269 1445
1507A445q30j435m09J02j433j029N97K47j134m59J020P90n11L26J146J202J66
$$ 1445 615 -820 -1229 -1127 -2560 -3589 -2992 -2745 -3879 -4338 -3318 -2528 -3039 -2713 -1567 -365 -199
1524a99L57R57J014J39L28P55q5N7o1K20o79r34m2K35j149j456k92K21o51j146
$$ -199 158 1115 2129 2268 2596 3351 3266 3323 3262 3482 2803 1869 1827 2062 913 -543 -835 -614 -1265 -2411
1544b411k38K85k01q71J15O02L77J12j3O41M66N26N67Q28L70o0O67J199n75j16
$$ -2411 -2649 -2364 -2565 -3436 -3321 -2719 -2342 -2230 -2243 -1602 -1136 -610 -43 785 1155 1095 1762 2961 2386 2270
1564B270M65O97n25n90J49K11j444o74J77r82q49m63j23r03p84K5K62k17m02L05
$$ 2270 2735 3432 2907 2317 2466 2677 1233 559 736 -246 -1095 -1558 -1681 -2584 -3368 -3343 -3081 -3298 -3700 -3395
1584c395P95R11l1Q82R51M48M11J177N26k86J84R16k02r44K16L06j175q64O3j65
$$ -3395 -2600 -1689 -1720 -838 113 561 972 2149 2675 2389 2573 3489 3287 2343 2559 2865 1690 826 889 724
1604G24o33p72l79j29m18K36p27l74L06l74r2K91L32m25K28P02N03M1M22J464
$$ 724 91 -681 -1060 -1189 -1607 -1371 -2098 -2472 -2166 -2540 -2632 -2341 -2009 -2434 -2206 -1504 -1001 -960 -538 926
1624I26J63M95P51Q00L59K04k53L09J7o77o72m89r05j737n36J29j170j644N60
$$ 926 1089 1584 2335 3135 3494 3698 3445 3754 3771 3094 2422 1933 1028 -709 -1245 -1116 -2286 -3930 -3370
1643c370J28n91j81R30J226p08L58J633L62L92M57P02L46j87K96P78k65l28J79
$$ -3370 -3242 -3833 -4014 -3084 -1858 -2566 -2208 -575 -213 179 636 1338 1684 1497 1793 2571 2306 1978 2157
1662B157Q0k4m64K39N9o96k46k88j36o21q02j072J71o46m76n96k25L34j85J08
$$ 2157 2237 2213 1749 1988 2047 1351 1105 817 681 60 -742 -1814 -1643 -2289 -2765 -3361 -3586 -3252 -3437 -3329
1682c329Q41Q42j13O44J027J608K8K86J426N33n02m5P04k31j097l85R0q19j530
$$ -3329 -2488 -1646 -1759 -1115 -88 1520 1548 1834 3260 3793 3291 3246 3950 3719 2622 2237 2327 1508 -22
1701b2k86k73r14q36j26J35o32o55P61K72j04j59Q46N08k1M19R84P06J61L37N73
$$ -22 -308 -581 -1495 -2331 -2457 -2322 -2954 -3609 -2848 -2576 -2680 -2839 -1993 -1485 -1506 -1087 -103 603 764 1101 1674
1722A674O06L46j08L94R6k35j76l25mm49q23p95k68n03p33r74j01j21j102K44
$$ 1674 2280 2626 2518 2912 3008 2773 2597 2272 2268 1819 996 201 -67 -570 -1303 -2277 -2378 -2499 -3601 -3357
1742c357P19m82j01P31J005l5J19J597P77m37P17R30O12j79j37O72l5p11j74K46
$$ -3357 -2638 -3120 -3221 -2490 -1485 -1520 -1401 196 973 536 1253 2183 2795 2616 2479 3151 3116 2405 2231 2477
1762B477o96q24l53qo81j161K73k25q02l24j5l21l24J05M57l9M54L72L67M27P37
$$ 2477 1781 957 604 596 -85 -1246 -973 -1198 -2000 -2324 -2339 -2660 -2984 -2879 -2422 -2461 -2007 -1635 -1268 -841 -104
1783a04O76K96L45O45P93j95N89Q64q74n18N8k22n20j240Rk55j246p23j61k22
$$ -104 572 868 1213 1858 2651 2456 3045 3909 3035 2517 2575 2353 1833 593 602 347 -899 -1622 -1783 -2005
1803b005o09n81L25J15j18L73N42L26L37P02L83M68M19N29L44J2M22K60LJ57j57
$$ -2005 -2614 -3195 -2870 -2755 -2873 -2500 -1958 -1632 -1295 -593 -210 258 677 1206 1550 1562 1984 2244 2247 2404 2247
1824B247r2j59j29j86n56l87j93m59r88m0l55m61p08j88O79o11k89N85M40m8K33
$$ 2247 2155 1996 1867 1681 1125 738 545 86 -902 -942 -1297 -1758 -2466 -2654 -1975 -2586 -2875 -2290 -1850 -1898 -1665
1845a665P71R73q0M04J052N84J33M3N75J02k22k02J21n25o98j68k14p59p60m15
$$ -1665 -894 79 -1 403 1455 2039 2172 2215 2790 2892 2670 2468 2589 2064 1366 1198 984 225 -535 -950
1865i50p7n53r25J71J72Km04pN95K70OM27M47P25J77L47R85m0k24N42N36L28k61
$$ -950 -1027 -1580 -2505 -2334 -2162 -2160 -2564 -2571 -1976 -1706 -1700 -1273 -826 -101 76 423 1408 1368 1144 1686 2222 2550 2289
1888B289k30M00k09o22k16l7o45q81n63Q1n52q86oO4n05l63N03L89n42J13J141
$$ 2289 2059 2459 2250 1628 1412 1375 730 -151 -714 -633 -1185 -2071 -2077 -2013 -2518 -2881 -2378 -1989 -2531 -2418 -1277
1909a277N79L4K45J011P58J77N2N47M42j4n4k23K85m58o30o9m25n99k20n29m44
$$ -1277 -698 -664 -419 592 1350 1527 1579 2126 2568 2554 2500 2277 2562 2104 1474 1405 980 381 161 -368 -812
1930h12k51n72K8j87p79L09j14M03j41l4P49N47r2O09O33L84M69L17N72K90k74
$$ -812 -1063 -1635 -1607 -1794 -2573 -2264 -2378 -1975 -2116 -2150 -1401 -854 -946 -337 296 680 1149 1466 2038 2328 2054
1951B054J52N45l68n76j80R8k95r58n90Pj41o84p04k18O8m44k86j2J05K45L63
$$ 2054 2206 2751 2383 1807 1627 1725 1430 472 -118 -111 -252 -936 -1640 -1858 -1790 -2234 -2520 -2532 -2427 -2182 -1819
1972a819L25QM01O60Q78J68K39O25M16N44j89O0K48m07P4k67o51j83n02j17n26
$$ -1819 -1494 -1486 -1085 -425 453 621 860 1485 1901 2445 2256 2316 2564 2157 2231 1964 1313 1130 628 511 -15
1993a5o22j76k27o05m92k21P0J25R6J18j65M20O16L88K59K94L94M56K78M09N09
$$ -15 -637 -813 -1040 -1645 -2137 -2358 -2288 -2163 -2067 -1949 -2114 -1694 -1078 -690 -431 -137 257 713 991 1400 1909
2014A909J45J31J35j90m3o0l84k69n79k47j70q61l84m22n01j20j27k68J39l80
$$ 1909 2054 2185 2320 2130 2087 2027 1643 1374 795 548 378 -483 -867 -1289 -1790 -1910 -2037 -2305 -2166 -2546
2034b546J67M05K42O28L6N14P14m6R05K48o4N99J81r6L39m4n0o25k39M48n03r55
$$ -2546 -2379 -1974 -1732 -1104 -1068 -554 160 114 1019 1267 1203 1802 1983 1887 2226 2182 2132 1507 1268 1716 1213 258
2056B58l5l31m27n25q9n27l31j44K15j16k79M48J39K43K87M16Q50L80J4K76O35
$$ 258 223 -108 -535 -1060 -1149 -1676 -2007 -2151 -1936 -2052 -2331 -1883 -1744 -1501 -1214 -798 52 432 446 722 1357
2077A357N96j71LN32j87m39M21j41o96k72n34l0p44k28k66l82n79p8k47o8M05
$$ 1357 1953 1782 1785 2317 2130 1691 2112 1971 1275 1003 469 439 -305 -533 -799 -1181 -1760 -1838 -2085 -2153 -1748
2098a748m66N52j35L44M51M70K31L12K73Q05J93P4O2L83J83n6j91m4K15m23l88
$$ -1748 -2214 -1662 -1797 -1453 -1002 -532 -301 11 284 1089 1282 1356 1418 1801 1984 1928 1737 1693 1908 1485 1097
2119A097l56Q9q14n49j99l34m90k40j6k32j41j50O36L34j96L09O13K58L15J31
$$ 1097 741 830 16 -533 -732 -1066 -1556 -1796 -1812 -2044 -2185 -2335 -1699 -1365 -1561 -1252 -639 -381 -66 65
2139F5Q67J88j40N46M82n2J0J4j31j77l98Rn00n01j14n98j52m67j09m68k48J19
$$ 65 932 1120 980 1526 2008 1956 1966 1980 1849 1672 1274 1283 783 282 168 -430 -582 -1049 -1158 -1626 -1874 -1755
2161a755M2j04n6K26J1J78N35L29M35J91M55L09M64J32N49o1m00Q5L49J49q59
$$ -1755 -1713 -1817 -1873 -1647 -1636 -1458 -923 -594 -159 32 487 796 1260 1392 1941 1880 1480 1565 1914 2063 1204
2182A204L7j83m21n35k01j95o35m31k43k11j1k17R4K10N1M93j07L66L41L78R2
$$ 1204 1241 1058 637 102 -99 -294 -929 -1360 -1603 -1814 -1825 -2042 -1948 -1738 -1687 -1194 -1301 -935 -594 -216 -124
2203a24O19L48K58L10L29k0K02j01N3Rl99n18m2l70l47n82j64j10n80l47J7n2
$$ -124 495 843 1101 1411 1740 1720 1922 1821 1874 1883 1484 966 924 554 207 -375 -539 -649 -1229 -1576 -1559 -1611
2225a611l59j84N64J05j55L76N79J15j95Q88K74J76K26M04L99J02O4J90k38m1
$$ -1611 -1970 -2154 -1590 -1485 -1640 -1264 -685 -570 -765 123 397 573 799 1203 1602 1704 1768 1958 1720 1679
2245A679m7j71l24k62n60m22Qo03k23m59k62j9l47K12j25J73K34J42M22L79r8
$$ 1679 1632 1461 1137 875 315 -107 -99 -702 -925 -1384 -1646 -1665 -2012 -1800 -1925 -1752 -1518 -1376 -954 -575 -673
2266f73N24L16N96j93K67Q32K8j83J80K53j86j82l35J52o07m62K29n16o19j95
$$ -673 -149 167 763 570 837 1669 1697 1514 1694 1947 1761 1579 1244 1396 789 327 556 40 -579 -774
2286g74k87m6n35j68J41Q7k54L32K05L71j53M67M80M35P1M48J97K13K63j07M74
$$ -774 -1061 -1107 -1642 -1810 -1669 -1582 -1836 -1504 -1299 -928 -1081 -614 -134 301 372 820 1017 1230 1493 1386 1860
2307A860k78l9j78Q8k61o8o43l02j12l10m86l50m5j07l86l09M66k47K32Q0L49
$$ 1860 1582 1543 1365 1453 1192 1124 481 179 67 -243 -729 -1079 -1124 -1231 -1617 -1926 -1460 -1707 -1475 -1395 -1046
2328a046K21J19N60M67r9K53N62K66j63J81N50q8m20K54j39j46l99m90M3l81m10
$$ -1046 -825 -706 -146 321 222 475 1037 1303 1140 1321 1871 1783 1363 1617 1478 1332 933 443 486 105 -305
2349c05n44k6k34j78n95K20q9j31K85K32K18J64K94L52M54P6M03K53M37K43j38
$$ -305 -849 -875 -1109 -1287 -1882 -1662 -1751 -1882 -1597 -1365 -1147 -983 -689 -337 117 193 596 849 1286 1529 1391
2370A391M19J30k82p1j55l22j12j86m02k04o29k88K49m40j09l19j88K8k46M4M69
$$ 1391 1810 1940 1658 1587 1432 1110 998 812 410 206 -423 -711 -462 -902 -1011 -1330 -1518 -1490 -1736 -1692 -1223
2391a223J75n2j7O71N89l9L74M29J05P6K33K08K32k07mk52rj3k46o16j07o03j44
$$ -1223 -1048 -1100 -1117 -446 143 104 478 907 1012 1088 1321 1529 1761 1554 1550 1298 1289 1276 1030 414 307 -296 -440
2414d40L9n66k85k29k79K16j52K36K03q8K38K99K97N74r0K86O67M9J06K40K47
$$ -440 -401 -967 -1252 -1481 -1760 -1544 -1696 -1460 -1257 -1345 -1107 -808 -511 63 -27 259 926 975 1081 1321 1568
2435A568Q5k90lN20l82n19l55k10j15m11l70o7m71l50J72j56j22k24l7N68l32
$$ 1568 1653 1363 1360 1880 1498 979 624 414 299 -112 -482 -549 -1020 -1370 -1198 -1354 -1476 -1700 -1737 -1169 -1501
2456a501M09L11J81J05L14K80P38R3K52N4J19J11j55L14j52k80l02J7J4m66m37
$$ -1501 -1092 -781 -600 -495 -181 99 837 930 1182 1236 1355 1466 1311 1625 1473 1193 891 908 922 456 19
2477A9l38M3n20l14J2n4j57j88k13L31m4K29L55K49J25M10K61N73j75J50M33K23
$$ 19 -319 -276 -796 -1110 -1098 -1152 -1309 -1497 -1710 -1379 -1423 -1194 -839 -590 -465 -55 206 779 604 754 1187 1410
2499A410r7K36j14K24m63r5j57j90n16j77l68k07j80l88N1K6m22k91L57J3J8P3
$$ 1410 1313 1549 1435 1659 1196 1101 944 754 238 61 -307 -514 -694 -1082 -1031 -1005 -1427 -1718 -1361 -1348 -1330 -1257
2521a257N05K09Q5K67J31M38O4L12N82k42J91q9K50p4j10l3n17L9l84l35j20k45
$$ -1257 -752 -543 -458 -191 -60 378 442 754 1336 1094 1285 1196 1446 1372 1262 1229 712 751 367 32 -88 -333
2543c33l00l23O9l2m04j40j20K77R8j67K16N80j48N78Q0M19K89J39J87L39k93
$$ -333 -633 -956 -887 -919 -1323 -1463 -1583 -1306 -1208 -1375 -1159 -579 -727 -149 -69 350 639 778 965 1304 1011
2564A011L69J79j09l82p5Kj13o20O9j40m75j77j86r0k41n48J28K89k18L8lN07
$$ 1011 1380 1559 1450 1068 993 995 882 262 331 191 -284 -461 -647 -737 -978 -1526 -1398 -1109 -1327 -1289 -1292 -785
2586g85m6R4L15P71l11K97M23L94m3J56O6J18J49l30j82Q0j29p24k77J02k51l44
$$ -785 -831 -737 -422 349 38 335 758 1152 1109 1265 1331 1449 1598 1268 1086 1166 1037 313 36 138 -113 -457
2608d57m69K62l65k38m5L4J6k67J36N95J47k35J85R44j79p4Q42J88k53j6O46K61
$$ -457 -926 -664 -1029 -1267 -1312 -1278 -1262 -1529 -1393 -798 -651 -886 -701 243 64 -10 832 1020 767 751 1397 1658
2630A658l24j79J34k36k05j54k24l17l21k9j52m57l02j66J47k75L2j48L97k7K07
$$ 1658 1334 1155 1289 1053 848 694 470 153 -168 -197 -349 -806 -1108 -1274 -1127 -1402 -1370 -1518 -1121 -1148 -941
2651i41M12O2K64J30K20L53L09L90l33L28L29k84k03K41J31m01m15jj88n81k89
$$ -941 -529 -467 -203 -73 147 500 809 1199 866 1194 1523 1239 1036 1277 1408 1007 592 591 403 -178 -467
2672d67k8m4o10L1L5k53k78L62J71J39m14O24L78J4Q3K01O51n7J96M56N9j10m2
$$ -467 -495 -539 -1149 -1118 -1083 -1336 -1614 -1252 -1081 -942 -1356 -732 -354 -340 -257 -56 595 538 734 1190 1249 1139 1097
2695A097J65j8o5l86J17k35m58N0m38j55l44j39r5j88r6l11J9L38NK6L32L65J10
$$ 1097 1262 1244 1179 793 910 675 217 267 -171 -326 -670 -809 -904 -1092 -1188 -1499 -1480 -1142 -1137 -1111 -779 -414 -304
2718c04J55K50L55K9r3O05J0J21J8M1L55n84o4q5J82p15k19Nr1o54J12j51l63
$$ -304 -149 101 456 485 392 997 1007 1128 1146 1187 1542 958 894 809 991 276 57 62 -29 -683 -571 -722 -1085
2741a085j14r0K38R5j63J80L73L8M7L58L42L6L27K66K3M2Q0M70l13L2J24l76J75
$$ -1085 -1199 -1289 -1051 -956 -1119 -939 -566 -528 -481 -123 219 255 582 848 871 913 993 1463 1150 1182 1306 930 1105
2764A105n01j15k54l14l7j72n54k32J95l33N2K31n2O4j07P9M94l0K03J74K11K95
$$ 1105 604 489 235 -79 -116 -288 -842 -1074 -879 -1212 -1160 -929 -981 -917 -1024 -945 -451 -481 -278 -104 107 402
2786D02rP91Kl59M90j83j36K02k99j11r1l66J42m53k94k57k02J22k63k03m4j73
$$ 402 393 1184 1186 827 1317 1134 998 1200 901 790 699 333 475 22 -272 -529 -731 -609 -872 -1075 -1119 -1292
2808a292K43%p5J75K63L13NK66N20J38k61J14N10K33J3QJ97l16k32Mj00k03j49
$$ -1292 -1049 -1049 -1124 -949 -686 -373 -368 -102 418 556 295 409 919 1152 1165 1173 1370 1054 822 826 726 523 374
2831C74%l45l36q3m95J79m02j55J42J73R6k98K64q4M03N0L08K57L59O2K1M39N3
$$ 374 374 29 -307 -390 -885 -706 -1108 -1263 -1121 -948 -852 -1150 -886 -970 -567 -517 -209 48 407 469 490 929 982
2854I82K03j53l8J51k16j26K83l63m26j30m4k40k79j03j72k03n02K92K08l00O9
$$ 982 1185 1032 994 1145 929 803 1086 723 297 167 123 -117 -396 -499 -671 -874 -1376 -1084 -876 -1176 -1107
2875a107J94J84m7K62K72KK70K63K82K51pp2M91k30m6K37o2m32o9n3j55n45j64
$$ -1107 -913 -729 -776 -514 -242 -240 30 293 575 826 819 747 1238 1008 962 1199 1137 705 636 583 428 -117 -281
2898b81j0k53j70l18k95M00j5l13OL94j8K78K12J31M27j25J03N01N9K38O4k6K22
$$ -281 -291 -544 -714 -1032 -1327 -927 -942 -1255 -1249 -855 -873 -595 -383 -252 175 50 153 654 713 951 1015 989 1211
2921A211k64l3J35j3l68j66j10n2n70Q1J5l40m36q3N0l7j62NK63j32J79J15L94
$$ 1211 947 914 1049 1036 668 502 392 340 -230 -149 -134 -474 -910 -993 -943 -980 -1142 -1137 -874 -1006 -827 -712 -318
2944c18J41j05N95M88o0j87M45J08L0l39L28pk20k25Lk50m16k7j87j0n28Pk41
$$ -318 -177 -282 313 801 741 554 999 1107 1137 798 1126 1119 899 674 677 427 11 -16 -203 -213 -741 -734 -975
2967i75K25l70j21M64l9P8j1K50%L67p4M05N71l38KM04L03l9j71L37l96j59N4
$$ -975 -750 -1120 -1241 -777 -816 -738 -749 -499 -499 -132 -206 199 770 432 434 838 1141 1102 931 1268 872 713 767
2990G67Q3l4m61o81L42q6m03k12Ql87j03L05k37K10n9j6M15lK57L19J68Q2J50
$$ 767 850 816 355 -326 16 -70 -473 -685 -677 -1064 -1167 -862 -1099 -889 -948 -964 -549 -552 -295 24 192 274 424
3013D24L80l9K12n7L0j12J27l6j38n1p8n25k01K8j85l94j89J36j64l45K10q1p9
$$ 424 804 765 977 920 950 838 965 929 791 740 662 137 -64 -36 -221 -615 -804 -668 -832 -1177 -967 -1048 -1127
3036a127M9J57L04J8L55ON60J01m6K59J93J12Mo7J46m8k0k07K9k80l10j20j73
$$ -1127 -1078 -921 -617 -599 -244 -238 322 423 377 636 829 941 945 878 1024 976 956 749 778 498 188 68 -105
3059a05P5l29l74J11q3j97m7n5L98k58j70O32j36R3N23P8P4k21L75L47K1P5M59
$$ -105 -30 -359 -733 -622 -705 -902 -949 -1004 -606 -864 -1034 -402 -538 -445 78 156 230 9 384 731 752 827 1286
3082A286j86l42j51M0K73k96m50j6j93rj98j78k91j85P3l1J55k70K9K7L35j53
$$ 1286 1100 758 607 647 920 624 174 158 -35 -44 -242 -420 -711 -896 -823 -854 -699 -969 -940 -913 -578 -731
3104g31J07L75J34L17K67J96j68L88o9r7J76j49K34n8j00r3k58k6l90l02N2k68
$$ -731 -624 -249 -115 202 469 665 497 885 816 719 895 746 980 922 822 729 471 445 55 -247 -195 -463
3126d63N4k21n00M22j9k77J04O6P8J55%L88J15J15O3M37M3J03k06K57K83j2k23
$$ -463 -409 -630 -1130 -708 -727 -1004 -900 -834 -756 -601 -601 -213 -98 17 80 517 560 663 457 714 997 985 762
3149G62lO5k09l04P1k99j31l23o7P7k33k84J71r7k73K96q1K48j20k18Q55L5Nj02
$$ 762 759 824 615 311 382 83 -48 -371 -438 -361 -594 -878 -707 -804 -1077 -781 -862 -614 -734 -952 -97 -62 -57 -159
3173a59O46r0J71J82K05mk13J65O6m7k30k82J27m25j35j01l21J21m87J13L7m41
$$ -159 487 397 568 750 955 951 738 903 969 922 692 410 537 112 -23 -124 -445 -324 -811 -698 -661 -1102
3195a102N2L85o5k3j2K46K82k32L94N9J78M00J1J63Q1O4j3l0l7L1k19O9j22l0
$$ -1102 -1050 -665 -730 -753 -765 -519 -237 -469 -75 -16 162 562 573 736 817 881 868 838 801 832 613 682 560 530
3219E30m84q4j34k64j44q3o8l73L5n0L96k9o2L70k00K44J55M43K91r8M2L45J11
$$ 530 46 -38 -172 -436 -580 -663 -731 -1104 -1069 -1119 -723 -752 -814 -444 -644 -400 -245 198 489 391 433 778 889
3242H89J6p2n6J34k41M2r2k83m5k39m24K68l03j38l62KJ27k53L44j24Lo8K13J37
$$ 889 905 833 777 911 670 712 620 337 292 53 -371 -103 -406 -544 -906 -904 -777 -1030 -686 -810 -807 -875 -662 -525
3266e25J97N1M68l8K74J18J23K13k34l8M04P6l51j36j78K1j48k23N2l00l39j47
$$ -525 -328 -277 191 153 427 545 668 881 647 609 1013 1089 738 602 424 445 297 74 126 -174 -513 -660
3288f60P8k74M7J51k90L7Q1J44K1K58O5J99L74j94K76L08J35l46M19l6j74L34
$$ -660 -582 -856 -809 -658 -948 -911 -830 -686 -665 -407 -342 -143 231 37 313 621 756 410 829 793 619 953
3310I53o9j90j84l04P7k00o6O7l63j60Qk3l66K39k28J81K9k41K31L48j04K05J51
$$ 953 884 694 510 206 283 83 17 84 -279 -439 -431 -454 -820 -581 -809 -628 -599 -840 -609 -261 -365 -160 -9
3333iK32J41J08O3k7J49J88j31k2l43K50M7l66j38J3j78q8j02j67k71J90l63J52
$$ -9 223 364 472 535 508 657 845 714 692 349 599 646 280 142 155 -23 -111 -213 -380 -651 -461 -824 -672
3356f72N3l2k09N04r4L6k0K10J34L52k51M06J56k68P6N7R4J96l26P7q6J67k30
$$ -672 -619 -651 -860 -356 -450 -414 -434 -224 -90 262 11 417 573 305 381 438 532 728 402 479 393 560 330
3379C30nj69m2j69j77l0o6j46n5l9k83N5J68o6J16J84p9N40j2k5K88L3J3J92k6
$$ 330 325 156 114 -55 -232 -262 -328 -474 -529 -568 -851 -796 -628 -694 -578 -394 -473 67 55 30 318 351 364 556 530
3404E30K55l56J71j38k9P2L0k40p6Q3k12l34l3M8l34j22K35j36P6o1J4J86l9p0
$$ 530 785 429 600 462 433 505 535 295 219 302 90 -244 -277 -229 -563 -685 -450 -586 -510 -571 -557 -371 -410 -480
3428d80L30J46k07L14K1N7L28J75N9j24J30k48K63k55j44J37j61M8l45Q2l30j56
$$ -480 -150 -4 -211 103 124 181 509 684 743 619 749 501 764 509 365 502 341 389 44 126 -204 -360
3450c60k35mr3r8J48nr6L07j77J29K55o2L01j7L21J71k54K63R4J73k09r3K41K07
$$ -360 -595 -599 -692 -790 -642 -647 -743 -436 -613 -484 -229 -291 10 -7 314 485 231 494 588 761 552 459 700 907
3474I07k09j15np9n40j41N1k48o2p4O2l60K97l2k75K1J49J58K77j62K47K10J51
$$ 907 698 583 578 499 -41 -182 -131 -379 -441 -515 -453 -813 -516 -548 -823 -802 -653 -495 -218 -380 -133 77 228
3497B28K55K10q9J60jj2Q2J51k23k62rj03k02j48q4o4k23j84J74r3k62j19N6K20
$$ 228 483 693 604 764 763 751 833 984 761 499 490 387 185 37 -47 -111 -334 -518 -344 -437 -699 -818 -762 -542
3521e42k12LL74K79L4q4L15R1r5J95K67N0q5MR8k9Q0k87m5j04j86j50j36N4m57
$$ -542 -754 -751 -377 -98 -64 -148 167 258 163 358 625 675 590 594 692 663 743 456 411 307 121 -29 -165 -111 -568
3546e68J31pn7k46O9R2j05J92m5K55R1J48m34N60J48o4K27P1R5k8L21k68j40J8
$$ -568 -437 -444 -501 -747 -678 -586 -691 -499 -544 -289 -198 -50 -484 76 224 160 387 458 553 525 846 578 438 456
3570D56J18q5L5j47l50m9j91k19O1k00m0j32oJ72J77r6j31J48J9J24L21N4K05
$$ 456 574 489 524 377 27 -22 -213 -432 -371 -571 -611 -743 -749 -577 -400 -496 -627 -479 -460 -336 -15 39 244
3593B44k2L12q4L0m1J71m1q1j01P3J6j15k54J34k59j40j41J71L3l05j99K41k68
$$ 244 222 534 450 480 439 610 569 488 387 460 476 361 107 241 -18 -158 -299 -128 -95 -400 -599 -358 -626
3616f26K67l44L61l45J15J79J90k2L95q9K07J03J35J76k20J42J8J3k00j64j27
$$ -626 -359 -703 -342 -687 -572 -393 -203 -225 170 81 288 391 526 702 482 624 642 655 455 291 164
3637A64J24j28k05j47M9k01J44o1j84J3O2j14j22J54J43R0k19K36k51L89j31K92
$$ 164 288 160 -45 -192 -143 -344 -200 -261 -445 -432 -370 -484 -606 -452 -309 -219 -438 -202 -453 -64 -195 97
3659I7Q5j28L53K96k58RJ02NK10k91M5j10jk63j92j70J3l34M0j90K6k47L60L7
$$ 97 182 54 407 703 445 454 556 561 771 480 525 415 414 151 -41 -211 -198 -532 -492 -682 -656 -903 -543 -506
3683e06j35K65J00j03J11L02L8J01q2K65j0J55J80n46N15k39K87J8m50J00j95
$$ -506 -641 -376 -276 -379 -268 34 72 173 91 356 346 501 681 135 650 411 698 716 266 366 171
3704A71J40m2k03N0k04l49J62l54J31k4j46k81M29q0R6J22J72KM03p4J64M1J97
$$ 171 311 269 66 116 -88 -437 -275 -629 -498 -522 -668 -949 -520 -600 -504 -382 -210 -208 195 121 285 326 523
3727E23K41Q7j36k22k6K42j44k56r2r5K6j84r4l30n0J30l39J70j07K88j15o7J01
$$ 523 764 851 715 493 467 709 565 309 217 122 148 -36 -130 -460 -510 -380 -719 -549 -656 -368 -483 -550 -449
3750d49P7J23j79N53Nj14R7K81m2L24l36K05M3K22j52j24J35k90ok77n7l26j81
$$ -449 -372 -249 -428 125 130 16 113 394 352 676 340 545 588 810 658 534 669 379 373 96 39 -287 -468
3773d68j99K36k97k5K38k02K9j00J89K09K6J56L04j65J93L06J76l7k2j6J49Q8
$$ -468 -667 -431 -728 -753 -515 -717 -688 -788 -599 -390 -364 -208 96 -69 124 430 606 569 547 531 680 768
3795G68j11j89M7k87R7j81p9j79n7l05J51k17j71J16pk4j60J09L25R9k1J86o0
$$ 768 657 468 515 228 325 144 65 -114 -171 -476 -325 -542 -713 -597 -604 -628 -788 -679 -354 -255 -276 -90 -150
3818a50J26K60J5J17K21j23J11J22J31j31q5J4j92J9m60N9j42j86O3l37J54k76
$$ -150 -24 236 251 368 589 466 577 699 830 699 614 628 436 455 -5 54 -88 -274 -211 -548 -394 -670
3840f70j32J65J50k64J08K81J3R8l3L27J08r7J74J63L8j61Q7L03m5kq7m2K4l41
$$ -670 -802 -637 -487 -751 -643 -362 -349 -251 -284 43 151 54 228 391 429 268 355 658 613 611 524 482 506 165
3864A65j89J12j38k13N2R8l12k43K36j10K0K10k57K18q8J53L09k72K52k34N78
$$ 165 -24 88 -50 -263 -211 -113 -425 -668 -432 -542 -522 -312 -569 -351 -439 -286 23 -249 3 -231 347
3885C47J35J87l79K09J32j45K14j13Q9m01R3j80k4m09N9P4k35R0j86j43J57j86
$$ 347 482 669 290 499 631 486 700 587 676 275 368 188 164 -245 -186 -112 -347 -257 -443 -586 -429 -615
3907f15r5J84J58K0K42j47K94N9j98J59L17J66j70K14j29qR4k18J76N7l82J56
$$ -615 -710 -526 -368 -348 -106 -253 41 100 -98 61 378 544 374 588 459 451 545 327 503 560 178 334
3929C34m62K62j59m6km97J60r7J56q4j09P9Kq8K65Q7J4Q0j04J70K70J39P7Q8m
$$ 334 -128 134 -25 -71 -73 -570 -410 -507 -351 -435 -544 -465 -463 -551 -286 -199 -185 -105 -209 -39 231 370 447 535 531
3954E31k13n1L53m4M9k58km3k54N5k05p6J16l94L32j8n03J35m2K00j54K82M5j27
$$ 531 318 267 620 576 625 367 365 322 68 123 -82 -158 -42 -436 -104 -122 -625 -490 -532 -332 -486 -204 -159 -286
3978b86l0L68L8R8O8N0J97R8j8Pl03O9J99k76j24K10k20JM5j54m8j77m14K22j5
$$ -286 -316 52 90 188 256 306 503 601 583 590 287 356 555 279 155 365 145 146 191 37 -11 -188 -602 -380 -395
4003c95k22K49o8Q6J35o7K03j43K03J52q5J99K23j48J15K5p2L55R6l95n1l92L36
$$ -395 -617 -368 -436 -350 -215 -282 -79 -222 -19 133 48 247 470 322 437 462 390 745 841 446 395 3 339
4026C39j19l27J52j53j97K6j84J16k22M3J03j39NK02J07K10l30K77K14j8J56Q4
$$ 339 220 -107 45 -108 -305 -279 -463 -347 -569 -526 -423 -562 -557 -355 -248 -38 -368 -91 123 105 261 345
4048C45n3r8J29Q8J97j97R9j31J74j65k92o8jl9l55jj95j0q7O8j7J66K00k74J25
$$ 345 292 194 323 411 608 411 510 379 553 388 96 28 27 -12 -367 -368 -563 -573 -660 -592 -609 -443 -243 -517 -392
4073c92k1J18N3L43R8o3J49K03O7n1N5j02N5N7Rk43jl15j1J43j24l08J57k02j52
$$ -392 -413 -295 -242 101 199 136 285 488 555 504 559 457 512 569 578 335 334 19 8 151 27 -281 -124 -326 -478
4098d78O6pK9j44L3j07M12K41j83j02J69L21J57q3o8J95j37J71j6k0r5o0J48k21
$$ -478 -412 -419 -390 -534 -501 -608 -196 45 -138 -240 -71 250 407 324 256 451 314 485 469 449 354 294 442 221
4122B21L2j29N9k85j91L7l6r3j97K82q8R4j48Q6J52n4LK37n6o8K16J96M9o7J85
$$ 221 253 124 183 -102 -293 -256 -292 -385 -582 -300 -388 -294 -442 -356 -204 -258 -255 -18 -74 -142 74 270 319 252 437
4147D37Q8j0k78RL62m14o1J94j77k5j34j51J4k39M4L4j9j05j40jK25J5R6L2Q0
$$ 437 525 515 237 246 608 194 133 327 150 125 -9 -160 -146 -385 -341 -307 -326 -431 -571 -572 -347 -332 -236 -204 -124
4172a24K3L57k84K91J66j07RK72r5k80K73k70J46J3j51r6j77j16j17K14P6k60
$$ -124 -101 256 -28 263 429 322 331 603 508 228 501 231 377 390 239 143 -34 -150 -267 -53 23 -237
4194b37p0m0nr5%K14j30J20K6J69j5p0J20K9K55j43R9R8o0K81j83j44J65j76k39
$$ -237 -307 -347 -352 -447 -447 -233 -363 -243 -217 -48 -63 -133 -13 16 271 128 227 325 265 546 363 219 384 208 -31
4219c1K81k58j34J44l4j53l8l3m4l3k82J06J34j14K5L52r5j25K33K2L07K51m88
$$ -31 250 -8 -142 2 -32 -185 -223 -256 -300 -333 -615 -509 -375 -489 -464 -112 -207 -332 -99 -77 230 481 -7
4242gK28P1K71j04L6Pn7O3l83j18R8j26J68k65r4j12J03k04L1j39K95j70k9OJ59
$$ -7 221 292 563 459 495 502 445 508 125 7 105 -21 147 -118 -212 -324 -221 -425 -394 -533 -238 -408 -437 -431 -272
4267b72J15j42k6L92m4K21k31L07K09j93J26j07K5J08k92L2k00K13j88q7k57R4
$$ -272 -157 -299 -325 67 23 244 13 320 529 336 462 355 380 488 196 228 28 241 53 -34 -291 -197
4289a97o3k77K61p3j03j34J76k16J99KL31j12l7K62J56J74m3J33P4j07J24j97
$$ -197 -260 -537 -276 -349 -452 -586 -410 -626 -427 -425 -94 -206 -243 19 175 349 306 439 513 406 530 333
4311C33q2P9J29j78K3k22k01Jq4n6j64J22j93J35j49R7Po0L85j19j46K65j03K72
$$ 333 251 330 459 281 304 82 -119 -118 -202 -258 -422 -300 -493 -358 -507 -410 -403 -463 -78 -197 -343 -78 -181 91
4335I1J31m9LP2j24J84q0L55n09K53J49j99j45J78l04j12J74m5m23K30j31j1k94
$$ 91 222 173 176 248 124 308 228 583 74 327 476 277 132 310 6 -106 68 23 -400 -170 -301 -312 -606
4358f06L29j00J12j61oK53M1n1L53j83K16j7J79l15L79j31Q2J07m15J89j06L20
$$ -606 -277 -377 -265 -426 -432 -179 -138 -189 164 -19 197 180 359 44 423 292 374 481 66 255 149 469
4380D69m54q0Q1j43L7k25R7n5Q7J19k69K61j75K0M7L4j78O0L81j03j0N1J14J57
$$ 469 15 -65 16 -127 -90 -315 -218 -273 -186 -67 -336 -75 -250 -230 -183 -149 -327 -267 114 11 1 52 166 323
4404C23j60J86P8q0J15k54K77pl07N1j46j51j68k0K10r8Q6n9k79R9L4k44M09j
$$ 323 163 349 427 347 462 208 485 478 171 222 76 -75 -243 -263 -53 -151 -65 -124 -403 -304 -270 -514 -105 -106
4428a06k38M10j35J48J3j54M14k33K9n2L30O6k37J17J10j37l07J92p1J1r3j24
$$ -106 -344 66 -69 79 92 -62 352 119 148 96 426 492 255 372 482 345 38 230 159 170 77 -47
4450d7J30k06mL15m70J43k09NJ03k37J06L00J23r1q7Q1K83J21M1NJ62r7m35K82
$$ -47 83 -123 -127 188 -282 -139 -348 -343 -240 -477 -371 -71 52 -39 -126 -45 238 359 400 405 567 470 35 317
4474C17J98j70k25J46k10J96k69k62K96k49O8m7J62j02J13j42Qn7k9J70j76pL20
$$ 317 515 345 120 266 56 252 -17 -279 17 -232 -164 -211 -49 -151 -38 -180 -172 -229 -258 -88 -264 -271 49
4497D9j52NJ39l1K22r3M1J24K1k9nJ42j76o9j7j83K79k11J54l92o1M2l87J39k86
$$ 49 -103 -98 41 10 232 139 180 304 325 296 291 433 257 188 171 -12 267 56 210 -182 -243 -201 -588 -449 -735
4522g35K41J87J15j54K56p1J20J26m2Q3m2J78n4j11J39O5J16Mk17J6j28L06j85
$$ -735 -494 -307 -192 -346 -90 -161 -41 85 43 126 84 262 208 97 236 301 417 421 204 220 92 398 213
4545B13k03R8l9j91M7m45J3L8R4p2N6J83k07K9K38p1R3J99Q5k2j31L97k47R5K87
$$ 213 10 108 69 -122 -75 -520 -507 -469 -375 -447 -391 -208 -415 -386 -148 -219 -126 73 158 136 5 402 155 250 537
4570E37k6l37J79o5R1j58k11%Mq3N6j36l10K10j78J92j24n6j1L34O4l99J89K98
$$ 537 511 174 353 288 379 221 10 10 14 -69 -13 -149 -459 -249 -427 -235 -359 -415 -426 -92 -28 -427 -238 60
4594F0j52O4J92q6K35K1J06n9k18N8K49j09k03J3Qj72j9j23j54K48k09j95P1J17
$$ 60 -92 -28 164 78 313 334 440 381 163 221 470 361 158 171 179 7 -12 -135 -289 -41 -250 -445 -374 -257
4618b57M3j69j62L84q6j52J11J43K37p5K45J35j93p8K86J47k95J2l4n9j22J81
$$ -257 -214 -383 -545 -161 -247 -399 -288 -145 92 17 262 397 204 126 412 559 264 276 242 183 61 242
4640B42q5l4k22Qj33r7L1k49M38k39p3L81n3j47K68k83O8L32k10J65m1L31K6J2
$$ 242 157 123 -99 -91 -224 -321 -290 -539 -101 -340 -413 -32 -85 -232 36 -247 -179 153 -57 108 67 398 424 436
4664D36k09J96k02%j7K20j19j68l1j54J14j67O6L0j58K9k70L26k30J6nm3K05J7
$$ 436 227 423 221 221 204 424 305 137 106 -48 66 -101 -35 -5 -163 -134 -404 -78 -308 -292 -297 -340 -135 -118
4688a18r6P7O5K0J43N1J56J79q2j41j19K28J80l33K69j29p5p5j29k33L5j4p6l8
$$ -118 -214 -137 -72 -52 91 142 298 477 395 254 135 363 543 210 479 350 275 200 71 -162 -127 -141 -217 -255
4712b55J8P9l17Q3K52M4k03M1J65R5J2L8R5p3J57n0j62K52j43K99j54j28J61j93
$$ -255 -237 -158 -475 -392 -140 -96 -299 -258 -93 2 14 52 147 74 231 181 19 271 128 427 273 145 306 113
4736A13r6J36q6o2Q5p7l10K7J4j02o6j79L40J4l28K66K79l98J55J97L6J7L25j82
$$ 113 17 153 67 5 90 13 -297 -270 -256 -358 -424 -603 -263 -249 -577 -311 -32 -430 -275 -78 -42 -25 300 118
4760A18L73p8K4j44q2P4l10K06J79l07L6n3p7L40l19j71J55r3j22J09l69K09p3
$$ 118 491 413 437 293 211 285 -25 181 360 53 89 36 -41 299 -20 -191 -36 -129 -251 -142 -511 -302 -375
4783c75mM2M6J95k06K03j27L6M51R9k26L80J33L9nj57Lj04p2k13o6j21n7l74j2
$$ -375 -379 -337 -291 -96 -302 -99 -226 -190 261 360 134 514 647 686 681 524 527 423 351 138 72 -49 -106 -480 -492
4808d92l3r1L23L3j22j84M5K39K79j27n0K86N1j14J34Jj02J41o0Q1o7J08j17J08
$$ -492 -525 -616 -293 -260 -382 -566 -521 -282 -3 -130 -180 106 157 43 177 178 76 217 157 238 171 279 162 270
4832B70M3j04J00l0J1j50j61r0R6m82N0Q5m13J96m4P5J65K33j1oM2L36kN3K52
$$ 270 313 209 309 279 290 140 -21 -111 -15 -497 -447 -362 -775 -579 -623 -548 -383 -150 -161 -167 -125 211 209 262 514
4857E14J05l86L31o9j94j80J16lj81K35l90K3j28j27o8j67M78N2k40NqJ62k60
$$ 514 619 233 564 495 301 121 237 234 53 288 -102 -79 -207 -334 -402 -569 -91 -39 -279 -274 -282 -120 -380
4880c80L97j67O0j24J09J08K2L62p0l7J37l20L42R2O4k61kj51j13J62k46J0l63
$$ -380 17 -150 -90 -214 -105 3 25 387 317 280 417 97 439 531 595 334 332 181 68 230 -16 -6 -369
4903c69J2K29l48J93j62k47J87N2J19K72J43j16Q7N6J22R8j4l1j2p7J00j34K21
$$ -369 -357 -128 -476 -283 -445 -692 -505 -453 -334 -62 81 -35 52 108 230 328 314 283 271 194 294 160 381
4926C81n8o8m83L22n5j72l0j45J23K54l3k48n6l8n9R0Q6k23M4J46L6L1J17n6J06
$$ 381 323 255 -228 94 39 -133 -163 -308 -185 69 36 -212 -268 -306 -365 -275 -189 -412 -368 -222 -186 -155 -38 -94 12
4951A2J96R0L6n9k6Q5J15nJ1j27j13j32N1l00K61l21L6j16o6J28jp5J21P3k1M00
$$ 12 208 298 334 275 249 334 449 444 455 328 215 83 134 -166 95 -226 -190 -306 -372 -244 -245 -320 -199 -126 -147 253
4977B53l79J55k6lJ59q3J56q8L3O4k13J58o5j62K05K10m44J60N5j68k2Q4j1j85
$$ 253 -126 29 3 0 159 76 232 144 177 241 28 186 121 -41 164 374 -70 90 145 -23 -45 39 28 -157
5001a57j01m9j34Q5j43L25L8j80K1j3K73r7K01N1k2Q4N1q8J70M7j78O9J5j84j7
$$ -157 -258 -307 -441 -356 -499 -174 -136 -316 -295 -308 -35 -132 69 120 98 182 233 145 315 362 184 253 268 84 67
5026F7L54j96l54O9J50j80k12k3pK36r2r7j87K00q1L43r9k7J02k14J06N15j67
$$ 67 421 225 -129 -60 90 -90 -302 -325 -332 -96 -188 -285 -472 -272 -353 -10 -109 -136 -34 -248 -142 373 206
5049B06p2K18K30n06k09M88m8j2k04j31R6L5j60p1j93K66j46j9j15j14J49o6J27
$$ 206 134 352 582 76 -133 355 307 295 91 -40 56 91 -69 -140 -333 -67 -213 -232 -347 -461 -312 -378 -251
5072b51N0K64q7rn3m7L91k41O4P6j7M9K65k26K69l50K25m9k84K90l24r4M0J18
$$ -251 -201 63 -24 -33 -86 -133 258 17 81 157 140 189 454 228 497 147 372 323 39 329 5 -89 -49 69
5096F9k10kp4J05l76L28p7K58m17K16m3j68M14p0nJ28k8K36n2j61N5J96k38J55
$$ 69 -141 -143 -217 -112 -488 -160 -237 21 -396 -180 -223 -391 23 -47 -52 76 48 284 232 71 126 322 84 239
5120B39m2p4L08l27RJ88j80k41o9R9j27M0k33M9K58k92j1m4L46P4M6q2K17K59
$$ 239 197 123 431 104 113 301 121 -120 -189 -90 -217 -177 -410 -361 -103 -395 -406 -450 -104 -30 16 -66 151 410
5144D10m52K53m3K01O9j38J17j66j33J99Nr3P6m92K56k55j95K48R9j47j36J93
$$ 410 -42 211 168 369 438 300 417 251 118 317 322 229 305 -187 69 -186 -381 -133 -34 -181 -317 -124
5166a24m6k79J86J42J3J73k70K21q2J24j54J99K42j54R0k40J51MO1j09Q6Oj31
$$ -124 -170 -449 -263 -121 -108 65 -205 16 -66 58 -96 103 345 191 281 41 192 196 257 148 234 240 109
5189A09K29k86j18j31N9k32j24J93k27K59j66K14j36L14p7j01J97J6p7L62k08
$$ 109 338 52 -66 -197 -138 -370 -494 -301 -528 -269 -435 -221 -357 -43 -120 -221 -24 -8 -85 277 69
5210F9R5L43k20l37M28l73n6J36k21J31r5J41j15l7J11J5k9j42J46J09l02r6P7
$$ 69 164 507 287 -50 378 5 -51 85 -136 -5 -100 41 -74 -111 0 15 -14 -156 -10 99 -203 -299 -222
5233b22J38K9k46o5J82J66k22K68Q6q3N9J49J33Q5m57K08K30n2l30m2K31m23k8
$$ -222 -84 -55 -301 -366 -184 -18 -240 28 114 31 90 239 372 457 0 208 438 386 56 14 245 -178 -206
5256b06J10j39N6q7K54j54J77q1K2j4j1j82K55J60j51j69J02N7o2J08j2p4j07
$$ -206 -96 -235 -179 -266 -12 -166 11 -70 -48 -62 -73 -255 0 160 9 -160 -58 -1 -63 45 33 -41 -148
5279a48K92k55K18P2Q8j45L58l35P1j99N9j90p0P0j82J41k91L2P4p0o7M40j28
$$ -148 144 -111 107 179 267 122 480 145 216 17 76 -114 -184 -114 -296 -155 -446 -414 -340 -410 -477 -37 -165
5302a65lJ17J0RJ94q5J40K40P1n59Q0k0K54l03K15j04L0q2m0Lr5N0j12K78k14
$$ -165 -168 -51 -41 -32 162 77 217 457 528 -31 49 29 283 -20 195 91 121 39 -1 2 -93 -43 -155 123 -91
5327i1NJ21k19M5q3k9K1N3k09R7J09J72j11o9M28j02L56k33J92j62O5oo4k66J74
$$ -91 -86 35 -184 -139 -222 -251 -230 -177 -386 -289 -180 -8 -119 -188 240 138 494 261 453 291 356 350 286 20 194
5352A94j73k26J81qk49J4k27J48J71J10j95N9J13j62Q2r8M94k24J88j84K98r5
$$ 194 21 -205 -24 -32 -281 -267 -494 -346 -175 -65 -260 -201 -88 -250 -168 -266 228 4 192 8 306 211
5374B11J2j11LL4J60k78K74J26j61r7k5M8j63O0j78QP9j12k70J45j59qJ10J0J17
$$ 211 223 112 115 149 309 31 305 431 270 173 148 196 33 93 -85 -77 2 -110 -380 -235 -394 -402 -292 -282 -165
5399a65n7R6P5J12RL2Jk2j32M43j08Q7k30l4l6K42j68r5l4R0j31j45rK9k11R4
$$ -165 -222 -126 -51 61 70 102 103 81 -51 392 284 371 141 107 71 313 145 50 16 106 -25 -170 -179 -150 -361 -267
5425b67j8K4R0o1j6P6M6L2q5J6K10J14p7J33j08J10l4j5J74m8k00j2Q6j88L22
$$ -267 -285 -261 -171 -232 -248 -172 -126 -94 -179 -163 47 161 84 217 109 219 185 170 344 296 96 84 170 -18 304
5450C04l04n7O1j42K26l19J08m27M29k06K65j9L6J08j19K13q3QN3k1K14L4j96
$$ 304 0 -57 4 -138 88 -231 -123 -550 -121 -327 -62 -81 -45 63 -56 157 74 82 135 114 328 362 166
5473A66K36k20J26K9M9l60J54J4j82J21P0n49J89ok75J53R1J25k6o1J89r8J09
$$ 166 402 182 308 337 386 26 180 194 12 133 203 -346 -157 -163 -438 -285 -194 -69 -95 -156 33 -65 44
5496D4k14Q9l0L15rk55L97l82J68N6K01j06j47p9q9J10L8jqj46J10k59p9J57m8
$$ 44 -170 -81 -111 204 195 -60 337 -45 123 179 380 274 127 48 -41 69 107 106 98 -48 62 -197 -276 -119 -167
5521a67j44J74q1k7J32J1j69K33P7p8R6j03R4P8K25k73K46J06j47l11L02k1j54
$$ -167 -311 -137 -218 -245 -113 -102 -271 -38 39 -39 57 -46 48 126 351 78 324 430 283 -28 274 253 99
5544I9N1j74p3K10l36m5O2m2R5Qq2P7J07q9Qp1QJ38k3J47lL4J33j75j8M1J61m0
$$ 99 150 -24 -97 113 -223 -268 -206 -248 -153 -145 -227 -150 -43 -132 -124 -195 -187 -49 -72 75 72 106 239 64 46 87 248 208
5572B08N3o9j44K63q1j29q0l4J33j93j28J74l64P2J41m0k56J45K49q6K1j6P3L20
$$ 208 261 192 48 311 230 101 21 -13 120 -73 -201 -27 -391 -319 -178 -218 -474 -329 -80 -166 -145 -161 -88 232
5596B32n7j31J37J12m4j11M7J07M4q2k38L09j38j29l15L40j57j53M7N8j3M3k33
$$ 232 175 44 181 293 249 138 185 292 336 254 16 325 187 58 -257 83 -74 -227 -180 -122 -135 -92 -325
$$ [...]
8191a14
##END NTUPLES=NMR FID
##END=
