##TITLE=1H_Pr CDCl3
 CDCl3
 8 sc, 
 22.12.2022
##JCAMPDX= 6.0         $$ Bruker NMR JCAMP-DX V2.0
##DATA TYPE= NMR FID
##DATA CLASS= NTUPLES
##ORIGIN= UXNMR, Bruker Analytische Messtechnik GmbH
##OWNER= root
$$ XWIN-NMR		Version 3.5
$$ Thu Dec 22 14:25:46 2022 Russian Standard Time (UT+4h)  she@DPX200
##.OBSERVE FREQUENCY= 200.13135
##.OBSERVE NUCLEUS= ^1H
##.DELAY= (6, 6)
##.ACQUISITION MODE= SIMULTANEOUS
##.ACQUISITION SCHEME= undefined
##.AVERAGES= 8
##.DIGITISER RES= 18
##SPECTROMETER/DATA SYSTEM= spect
##.PULSE SEQUENCE= zg30
##.SOLVENT NAME= CDCl3
##.SHIFT REFERENCE= (INTERNAL, CDCl3, 0, 15.7039)
##AUDIT TRAIL= $$ (NUMBER, WHEN, WHO, WHERE, WHAT)
$$ ##TITLE= Audit trail, XWIN-NMR		Version 3.5
$$ ##JCAMPDX= 5.01
$$ ##ORIGIN= Bruker BioSpin GmbH
$$ ##OWNER= she
$$ F:/spectra/data/she/nmr/H-F/1/audita.txt
$$ ##AUDIT TRAIL=  $$ (NUMBER, WHEN, WHO, WHERE, WHAT)
(   1,<2022-12-22 14:24:42.01 +0400>,<she>,<DPX200>,
      <created by zg, POWCHK disabled, PULCHK disabled
       configuration hash MD5:
       00 E9 B6 7A A2 85 ED C7 34 08 36 98 17 FE 4E 26
       data hash MD5: 16K
       4E 92 3A 68 5D 6F 34 BA 2A DA 36 5D D8 03 0F E1>)
$$ ##END=
$$ 
$$ hash MD5
$$ 9A C2 43 D2 86 B6 93 F3 77 6F B3 4A 30 70 9B 3E
##$RELAX= 
##$RELAX= 
##$RELAX= 
##$RELAX= 
##$RELAX= 
##$RELAX= 
$$ Bruker specific parameters
$$ --------------------------
##$DU= <F:/spectra>
##$EXPNO= 1
##$NAME= <H-F>
##$PROCNO= 1
##$TYPE= <nmr>
##$USER= <she>
##$AMP= (0..31)
100 100 100 100 100 100 100 100 100 100 100 100 100 100 100 100 100 100 
100 100 100 100 100 100 100 100 100 100 100 100 100 100 
##$AQSEQ= 0
##$AQ_mod= 1
##$AUNM= <au_zg>
##$AUTOPOS= <>
##$BF1= 200.13
##$BF2= 200.13
##$BF3= 200.13
##$BF4= 200.13
##$BF5= 200.13
##$BF6= 200.13
##$BF7= 200.13
##$BF8= 200.13
##$BYTORDA= 1
##$CFDGTYP= 0
##$CFRGTYP= 5
##$CHEMSTR= <none>
##$CNST= (0..31)
1 1 145 1 1 1 1 1 1 1 1 1 1 1 1 1 1 1 1 1 1 1 1 1 1 1 1 1 1 1 1 1 
##$CPDPRG= <>
##$CPDPRG1= <>
##$CPDPRG2= <>
##$CPDPRG3= <>
##$CPDPRG4= <mlev>
##$CPDPRG5= <mlev>
##$CPDPRG6= <mlev>
##$CPDPRG7= <mlev>
##$CPDPRG8= <mlev>
##$CPDPRGB= <>
##$CPDPRGT= <>
##$D= (0..31)
0 1.2 0 0 0 0 0 0 0 0.06 0 0.03 0 0 0 0 0.0002 0 0 0 0 0 0 0 0 0 0 0 0 
0 0 0 
##$DATE= 1671704681
##$DBL= (0..7)
120 120 120 120 120 120 120 120 
##$DBP= (0..7)
150 150 150 150 150 150 150 150 
##$DBP07= 0
##$DBPNAM0= <>
##$DBPNAM1= <>
##$DBPNAM2= <>
##$DBPNAM3= <>
##$DBPNAM4= <>
##$DBPNAM5= <>
##$DBPNAM6= <>
##$DBPNAM7= <>
##$DBPOAL= (0..7)
0.5 0.5 0.5 0.5 0.5 0.5 0.5 0.5 
##$DBPOFFS= (0..7)
0 0 0 0 0 0 0 0 
##$DE= 6
##$DECBNUC= <off>
##$DECIM= 32
##$DECNUC= <off>
##$DECSTAT= 4
##$DIGMOD= 1
##$DIGTYP= 9
##$DL= (0..7)
0 120 120 120 120 120 120 120 
##$DP= (0..7)
150 150 150 150 150 150 150 150 
##$DP07= 0
##$DPNAME0= <>
##$DPNAME1= <>
##$DPNAME2= <>
##$DPNAME3= <>
##$DPNAME4= <>
##$DPNAME5= <>
##$DPNAME6= <>
##$DPNAME7= <>
##$DPOAL= (0..7)
0.5 0.5 0.5 0.5 0.5 0.5 0.5 0.5 
##$DPOFFS= (0..7)
0 0 0 0 0 0 0 0 
##$DQDMODE= 0
##$DR= 18
##$DS= 0
##$DSLIST= <SSSSSSSSSSSSSSS>
$$ [...]
##$SUBNAM2= <"">
##$SUBNAM3= <"">
##$SUBNAM4= <"">
##$SUBNAM5= <"">
##$SUBNAM6= <"">
##$SUBNAM7= <"">
##$SUBNAM8= <"">
##$SUBNAM9= <"">
##$SW= 18.05172834244
##$SWIBOX= (0..15)
0 0 2 0 0 0 0 0 0 0 0 0 0 0 0 0 
##$SW_h= 3612.71676300578
##$TD= 16384
##$TD0= 1
##$TE= 0
##$TE2= 300
##$TE3= 300
##$TEG= 300
##$TL= (0..7)
0 120 120 120 120 120 120 120 
##$TP= (0..7)
150 150 150 150 150 150 150 150 
##$TP07= 0
##$TPNAME0= <>
##$TPNAME1= <>
##$TPNAME2= <>
##$TPNAME3= <>
##$TPNAME4= <>
##$TPNAME5= <>
##$TPNAME6= <>
##$TPNAME7= <>
##$TPOAL= (0..7)
0.5 0.5 0.5 0.5 0.5 0.5 0.5 0.5 
##$TPOFFS= (0..7)
0 0 0 0 0 0 0 0 
##$TUNHIN= 0
##$TUNHOUT= 0
##$TUNXOUT= 0
##$USERA1= <user>
##$USERA2= <user>
##$USERA3= <user>
##$USERA4= <user>
##$USERA5= <user>
##$V9= 5
##$VALIST= <valist>
##$VCLIST= <CCCCCCCCCCCCCCC>
##$VD= 0
##$VDLIST= <DDDDDDDDDDDDDDD>
##$VPLIST= <PPPPPPPPPPPPPPP>
##$VTLIST= <TTTTTTTTTTTTTTT>
##$WBST= 1024
##$WBSW= 4
##$XGAIN= (0..3)
0 0 0 0 
##$XL= 0
##$YL= 0
##$YMAX_a= 12196
##$YMIN_a= -5050
##$ZGOPTNS= <>
##$ZL1= 120
##$ZL2= 120
##$ZL3= 120
##$ZL4= 120
##$ABSF1= 10
##$ABSF2= 0
##$ABSG= 5
##$ABSL= 3
##$ALPHA= 0
##$AQORDER= 0
##$ASSFAC= 0
##$ASSFACI= 0
##$ASSFACX= 0
##$ASSWID= 0
##$AUNMP= <proc_1d>
##$AZFE= 0.1
##$AZFW= 0.1
##$BCFW= 1
##$BC_mod= 2
##$BYTORDP= 1
##$COROFFS= 0
##$CY= 11.3945322036743
##$DATMOD= 1
##$DC= 2
##$DFILT= <>
##$DTYPP= 0
##$F1P= 2.36226072786647
##$F2P= -0.459571619588291
##$FCOR= 0.5
##$FTSIZE= 0
##$FT_mod= 4
##$GAMMA= 1
##$GB= 0.15
##$INTBC= 1
##$INTSCL= 1
##$ISEN= 128
##$LB= 0.24
##$LEV0= 0
##$LPBIN= 0
##$MAXI= 10000
##$MC2= 0
##$MEAN= 0
##$ME_mod= 0
##$MI= 1.114404
##$NCOEF= 0
##$NC_proc= 0
##$NLEV= 6
##$NOISF1= 3.799351
##$NOISF2= 2.8
##$NSP= 1
##$NTH_PI= 0
##$NZP= 0
##$OFFSET= 15.70392
##$PC= 1
##$PHC0= -19114.62
##$PHC1= 27.80073
##$PH_mod= 1
##$PKNL= yes
##$PPARMOD= 0
##$PSCAL= 0
##$PSIGN= 0
##$REVERSE= no
##$SF= 200.130013532006
##$SI= 16384
##$SIGF1= 3
##$SIGF2= 2
##$SINO= 400
##$SIOLD= 16384
##$SREGLST= <1H.CDCl3>
##$SSB= 0
##$STSI= 0
##$STSR= 0
##$SW_p= 3612.71676300578
##$SYMM= 0
##$S_DEV= 0
##$TDeff= 0
##$TDoff= 0
##$TI= <>
##$TILT= no
##$TM1= 0
##$TM2= 0
##$TOPLEV= 0
##$USERP1= <user>
##$USERP2= <user>
##$USERP3= <user>
##$USERP4= <user>
##$USERP5= <user>
##$WDW= 1
##$XDIM= 8192
##$YMAX_p= 0
##$YMIN_p= 0
$$ End of Bruker specific parameters
$$ ---------------------------------
##NTUPLES= NMR FID
##VAR_NAME=  TIME,          FID/REAL,        FID/IMAG
##SYMBOL=    X,             R,               I
##VAR_TYPE=  INDEPENDENT,   DEPENDENT,       DEPENDENT
##VAR_FORM=  AFFN,          ASDF,            ASDF
##VAR_DIM=   8192,          8192,            8192
##UNITS=     SECONDS,       ARBITRARY UNITS, ARBITRARY UNITS
##FACTOR=    0.0002768,     1,               1
##FIRST=     0,             0,               0
##LAST=      2.2672688,     0,               0
##MIN=       0,             -5050,           0
##MAX=       2.2672688,     12196,           0
$$ Real data points
##PAGE= N=1
##DATA TABLE= (X++(R..R)), XYDATA
0@%%%%%%%%%%%%%%%%%%%%%%%JpJ4j6J6j6J6j6J8k4L0l2L4m0M6n0N6o3O9p7Q7r5
$$ 0 0 0 0 0 0 0 0 0 0 0 0 0 0 0 0 0 0 0 0 0 0 0 0 1 -6 8 -8 8 -8 8 -8 10 -14 16 -16 18 -22 24 -26 30 -33 36 -41 46 -49
45d9J04j15J28j41J54j71J90k09K29k53K82l12L45l86M32m87N56o40P47q90J091
$$ -49 55 -60 68 -73 81 -90 100 -109 120 -133 149 -163 182 -204 228 -259 297 -343 404 -486 605
66F05j400J945l203J4249n718p254N593j590j853J65K061m113p51K125l14l822
$$ 605 -795 1150 -2053 12196 6478 -776 4817 3227 1374 1539 3600 -513 -1264 861 547 -3275
82c275J202J048j968j139K533o33k056J281K423j720p7K551L23j737J795K143
$$ -3275 -2073 -1025 -2993 -4132 -1599 -2232 -4288 -3007 -584 -2304 -2381 170 493 -1244 551 2694
98B694j533L9K388j60j813O74J737j885j445K044m32k639L63J187k059j585J767
$$ 2694 1161 1200 3588 3428 1615 2289 4026 2141 696 2740 2308 -331 32 1219 -840 -2425 -658
115f58m69k297N42J942j721j011J996N15j770J442J914j048p21K588M98j370J088
$$ -658 -1127 -3424 -2882 -940 -2661 -3672 -1676 -1161 -2931 -1489 425 -623 -1344 1244 1742 372 1460
132A460K125j670m99J883j29k066N77J305j950j325J459k62k324L49J033j794
$$ 1460 3585 1915 1416 3299 3170 1104 1681 2986 1036 -289 1170 908 -1416 -1067 -34 -1828
148a828j189J589k98j469P24J636j230n19K142K56j314J021K232j098o65K128
$$ -1828 -3017 -1428 -1726 -3195 -2471 -835 -2065 -2584 -442 -186 -1500 -479 1753 655 -10 2118
164B118M28j318N31J482r88j165J209J31k196J34J075j220j524R85j64j817j58
$$ 2118 2546 1228 1759 3241 2253 1088 2297 2428 232 366 1441 221 -1303 -318 -482 -2299 -2457
181b457J790j149j292J676K64j274P02J720q32p58K148L03r50O02K105j125o52
$$ -2457 -667 -1816 -3108 -1432 -1168 -2442 -1740 -20 -852 -1610 538 841 -109 493 2598 1473 821
198H21J468N84j791M81J055r62j553J003M67k252NJ194j226j488R50K80j428O7
$$ 821 2289 2873 1082 1563 2618 1656 103 1106 1573 -679 -674 520 -706 -2194 -1244 -964 -2392 -2325
216b325J570r86j012J450Q37j164M10K009n37q74J817R00j266K29J724j000p98
$$ -2325 -755 -1741 -2753 -1303 -466 -1630 -1220 789 252 -622 1195 2095 829 1058 2782 1782 984
233I84J278l4j483p1J118j279j189J151j65j651m50J308j102j058J198K28j103
$$ 984 2262 2228 745 674 1792 513 -676 475 310 -1341 -1791 -483 -1585 -2643 -1445 -1217 -2320
250b320O6J703m81p77J442Q28j061O03J528m32o24R58Q36j136R5J331p83j215
$$ -2320 -2254 -551 -1032 -1809 -367 461 -600 3 1531 1099 475 1433 2269 1133 1228 2559 1776 561
268E61R55J62j413l80R06p13j601R02pj075m36J315m55j350J064J095j279J81
$$ 561 1516 1678 265 -115 791 78 -1523 -621 -628 -1703 -2139 -824 -1279 -2629 -1565 -470 -1749 -1568
286a568J863l28r99J403P76o63Q7J337l63q56J064O99j283l39R69n17j539R94
$$ -1568 295 -33 -1032 371 1147 484 571 1908 1545 689 1753 2452 1169 830 1799 1282 -257 737
304G37K40j677l56J074o65j432J000K48j478K18J392m10n77Q15Q31o25j92J742
$$ 737 977 -700 -1056 18 -647 -2079 -1079 -831 -2309 -2091 -699 -1109 -1686 -871 -40 -665 -857 885
322H85n7q76J148P78q72j44J366m91r72L76P33j338m85J022o45j165R4K94q81
$$ 885 828 -48 1100 1878 1006 862 2228 1737 765 1141 1874 536 51 1073 428 -737 -643 -349 -1230
341a230m66Q60l75q95O33O59r10j09J541%r36J107R81o12l76J525K04q86M38J270
$$ -1230 -1696 -836 -1211 -2106 -1473 -814 -1724 -1833 -292 -292 -1228 -121 860 248 -128 1397 1601 715 1153 2423
361B423j347l95J135k10j090M3N95j233m29N17n6j527N33P80j454j98Q11M08j226
$$ 2423 1076 681 1816 1606 516 559 1154 -79 -508 9 -47 -1574 -1041 -261 -1715 -1913 -1102 -694 -1920
380a920N14J060n50j09J113M42r91P26J218p56j26J141L62j503N42Q81j250q47
$$ -1920 -1406 -346 -896 -1005 108 550 -441 285 1503 747 621 1762 2124 621 1163 2044 794 -53
398e3J246l12j301P6Q31r91q58O57R0j241M18R53p65n15J108L01r44N08J193n61
$$ -53 1193 881 -420 -344 487 -504 -1362 -705 -615 -1856 -1438 -485 -1250 -1765 -657 -356 -1300 -792 401 -160
418a60k15J096O07j022M12J177o47p76J153K42j277L90O39j214p34Q96k27j212
$$ -160 -375 721 1328 306 718 1895 1248 472 1625 1867 590 980 1619 405 -329 567 340 -872
436h72p5P98j249m24J090J31j183K00J135l70p33J390K98p25L83J310m93m39R99
$$ -872 -947 -149 -1398 -1822 -732 -601 -1784 -1584 -449 -819 -1552 -162 136 -589 -206 1104 611 172 1171
455A171M40q54J50Q21n74n01N13P1j095k9P09j134r04Q82R3j459N27O52p29q26
$$ 1171 1611 757 907 1728 1154 653 1166 1237 142 113 822 -312 -1216 -334 -241 -1700 -1173 -521 -1250 -2076
475b076Q26M73p70M71J026k44j76N16P42n74M04R52n10q43J178N07j459L15P06
$$ -2076 -1250 -777 -1547 -1076 -50 -294 -470 46 788 214 618 1570 1060 217 1395 1902 443 758 1464
494A464o40q63M79L17j331q0P94o23r11M52N25j010M0R63n56m07N79L54n37M43
$$ 1464 824 -39 440 757 -574 -654 140 -483 -1394 -942 -417 -1427 -1387 -424 -980 -1387 -808 -454 -991 -548
514e48R57j67l86R22N28p61J01P40m36l37O19K40q72j36N63o72o55L21K71j288
$$ -548 409 242 -144 778 1306 545 646 1386 950 613 1232 1472 600 464 1027 355 -300 21 292 -996
534i96k22O89l54o29M53O93j117L20J163l96p54Q58O80p56N22J070l55k32P14
$$ -996 -1218 -529 -883 -1512 -1059 -366 -1483 -1163 0 -396 -1150 -292 388 -368 154 1224 869 637 1351
553A351P8n64k79R89n85o46N45J89j124m16N52n8q20J42L69p74l73O44j96o89
$$ 1351 1429 865 586 1575 990 344 889 1078 -46 -462 90 32 -788 -646 -277 -1051 -1424 -780 -976 -1665
573a665R86N8m62J07J042j09m09O89N45n15K46P87r5p61Q26K10m53o45Q54m30
$$ -1665 -679 -621 -1083 -976 66 -43 -452 237 782 267 513 1300 1205 444 1270 1480 1027 382 1236 806
593H06q94J85J60n94n56P66l21r27L15N87p15j76Q09j57m68N55Q37m25m16J186
$$ 806 -88 97 257 -337 -893 -127 -448 -1375 -1060 -473 -1188 -1364 -555 -712 -1180 -625 212 -213 -629 557
613E57P8n72O84O36o81l4O02j38q35Q43J64q80l45K49l62o94L58K35p60l08O08
$$ 557 635 63 747 1383 702 668 1270 1132 297 1140 1304 424 79 328 -34 -728 -370 -135 -895 -1203 -595
634e95j65m63J49P14n20j03P31K17o72Q19P44o03l34J039J58o24L63O02o86n59
$$ -595 -760 -1223 -1074 -360 -880 -983 -252 -35 -707 112 856 253 -81 958 1116 492 855 1457 771 212
654B12P56r2j095O59N32r33o15M68r3p54j33N30m80k74Q32j23n55M83O42m07k60
$$ 212 968 876 -219 440 972 39 -576 -108 -201 -955 -1088 -558 -1038 -1312 -480 -603 -1158 -675 -33 -440 -700
675g00R96M1m53N29N30m16n6O83R6r10M49L79p91j28P40l90r58K23J94n60o25
$$ -700 296 337 -116 413 943 527 471 1154 1250 340 789 1168 377 249 989 599 -359 -136 58 -502 -1127
696a127Q29k13o51j6R20n64l99Q08K32o45P06M48l61j44Q30J69m00LQ91n17j51
$$ -1127 -298 -511 -1162 -1178 -258 -822 -1221 -413 -181 -826 -120 328 -33 -177 653 822 422 425 1316 799 648
717F48L74K46j182L97L73m79n93J17L57j088K43L79l94n97P45j68n87R2O47k4
$$ 648 1022 1268 86 483 856 377 -216 -99 258 -830 -587 -208 -602 -1199 -454 -622 -1209 -1117 -470 -494
737d94l17O93M64q13L17Q87k52k44Q58Pn94J2P75o39m00O02r1p74m2M19n66n50
$$ -494 -811 -118 346 -467 -150 737 485 241 1099 1106 512 524 1299 660 260 862 771 -3 -45 374 -192 -742
759g42M34N5n94p2N48k02o05O44m3k53J92O07n5k19N65L60j73j40P65j87m11M61
$$ -742 -308 -253 -847 -919 -371 -573 -1178 -534 -577 -830 -638 -31 -86 -305 260 620 447 307 1072 885 474 935
781I35K55p57L2O07m12r16N78p6o21J87J99n53n52N20M8l71j43Q17m17n94Q37
$$ 935 1190 433 465 1072 660 -256 322 246 -375 -188 11 -542 -1094 -574 -526 -897 -1040 -223 -640 -1234 -397
802c97L84m41p9Q31k6j09N18J63k37j87O14j56n94L84K07q26J4N17o06o42M27
$$ -397 -13 -454 -533 298 272 163 681 844 607 420 1034 878 284 668 875 49 63 580 -26 -668 -241
823b41L30p91p5L05l02n41O22j9l89M06M15L6m88M48P45l23J1M57o5l54M61K53
$$ -241 89 -702 -777 -472 -774 -1315 -693 -712 -1101 -695 -280 -244 -732 -284 461 138 149 606 541 187 648 901
845I01n79KO58k97p32O61j3m26l64N35n61p61L96M24o77l01O62j68o42O89K44
$$ 901 322 324 982 685 -47 614 601 175 -189 346 -215 -976 -580 -156 -833 -1134 -472 -640 -1282 -593 -349
866c49n43K84Q00l09j66M26L67n4M7N65j75m92J70L27l29m72N82k88o73K70K01
$$ -349 -892 -608 192 -117 -283 143 510 456 503 1068 893 401 571 898 569 97 679 391 -282 -12 189
887A89o65l72R42m11m15j93N20k73q0L82M3m68O37J73l87K30O64O9m26oQ21m77
$$ 189 -476 -848 94 -317 -732 -925 -405 -678 -758 -376 -333 -801 -164 9 -378 -148 516 585 159 153 974 497
909D97L6L09k50l02K91qk49l76L49j75p33M96P1n54l46M88N0m88J33N42k23m28
$$ 497 533 842 592 290 581 573 324 -52 297 122 -611 -115 -44 -598 -944 -456 -406 -894 -761 -219 -442 -870
931h70N83K53j58K88L07O8o72J068q7m39J89L49k61m95O83l22l33K31L02p71j46
$$ -870 -287 -34 -192 96 403 471 -201 867 780 341 530 879 618 123 806 484 151 382 684 -87 -233
952b33K22k48n24O8N74p73J56K22K34n66J15Q00o12jN79M10l89J46P61l36k78
$$ -233 -11 -259 -783 -715 -141 -914 -758 -536 -302 -868 -753 47 -565 -566 13 423 34 180 941 605 327
973C27N76Rn71Q2O55o74l23J47n5m42J45K29l49m59M72J0p03M8N33m6m59O12K06
$$ 327 903 912 341 423 1078 404 81 228 173 -269 -124 105 -244 -703 -231 -221 -924 -876 -343 -389 -848 -236 -30
996c0m86J83O11k83q5M26L82p33N31N96n86n5L58j79l59r6L62n32l49K36J05m71
$$ -30 -516 -333 278 -5 -90 336 718 -15 516 1112 526 471 829 650 291 195 557 25 -324 -88 17 -454
1018d54j12L91k76n49N65J50o39K94K66o6l07P13L04o68N44M37k42k81M91K82
$$ -454 -566 -175 -451 -1000 -435 -285 -924 -630 -364 -430 -737 -24 280 -388 156 593 351 70 561 843
1038H43m24j4M27j05l83K36m0n34n5L20m50m05K89r5n01M12J54q2l99K87L4k63
$$ 843 419 405 832 727 344 580 540 6 -49 271 -179 -584 -295 -390 -891 -479 -325 -407 -806 -519 -485 -748
1060g48L04N03K9m02N66K92k41j3N84k92m10N58m4k47k6L02l57k02J29j34k95
$$ -748 -444 59 88 -314 252 544 303 290 874 582 172 730 686 439 413 715 358 156 285 151 -144
1081a44j06L53m19m84K34O19p46q3L07K8k24M68M1j71J40N56r0l01M82K19l50
$$ -144 -250 103 -316 -800 -566 53 -693 -776 -469 -441 -665 -197 -156 -327 -187 369 279 -22 460 679 329
1102C29j14N47r4m38M10R1q04R7M13m15o18M33K73m83j83J53l07m0N04k4m55J43
$$ 329 215 762 668 230 640 731 -73 24 437 22 -596 -163 110 -373 -556 -403 -710 -750 -246 -270 -725 -582
1124e82J56L57k26Q0K94K06l91O44j53J29J35R2j70m06L81q0k29j75O53q63j91
$$ -582 -426 -69 -295 -215 79 285 -106 538 385 514 649 741 571 165 546 466 237 62 715 -148 -339
1145c39J96k5j91m3O2m87o9O34l04j86L84L11l73p7N01J57l17J84O70j39m27L99
$$ -339 -143 -168 -359 -402 -340 -827 -896 -262 -566 -752 -368 -57 -430 -507 -6 151 -166 18 688 549 122 521
1167E21J34l98M31j82k99n6M16p7q47L02N26q78k65O97k71l29K08l8l44J59K61
$$ 521 655 257 688 506 207 151 567 490 -357 -55 471 -407 -672 25 -246 -575 -367 -405 -749 -590 -329
1188c29J09l07K07K79l25K82O97k23l33M67K30l72M1L39l55j62J35m2k71k16L80
$$ -329 -220 -527 -320 -41 -366 -84 613 390 57 524 754 382 423 762 407 245 380 338 67 -149 231
1209B31j13n47J90J04k40m72O09l62k13L90J50k59K5O59j84k38L14K91j33k50
$$ 231 118 -429 -239 -135 -375 -847 -238 -600 -813 -423 -273 -532 -507 152 -32 -270 44 335 202 -48
1229d8M91k1j95J74K26J09n92N00n6q90M40J21m44k22M77k52l73K53J28n52P8
$$ -48 443 422 227 401 627 736 144 644 588 -302 138 259 -185 -407 70 -182 -555 -302 -174 -726 -648
1250f48L76Ql1l1K36n31J87O43K9l64Q9Q55n12k01K90K28M5k41P0P1o11M04j16
$$ -648 -272 -264 -295 -326 -90 -621 -434 209 238 -126 -37 818 306 105 395 623 668 427 497 568 -43 361 245
1273B45l94k18K70m93m8L24J15n32K09K24k81j0L48L34l50K17J55K24m50M99N6
$$ 245 -149 -367 -97 -590 -638 -314 -199 -731 -522 -298 -579 -589 -241 93 -257 -40 115 339 -111 388 444
1294D44k72R0N78m94L0K26k83k26R3K83l68k91M26m9o89j56M32m1n63M96n3l16
$$ 444 172 262 840 346 376 602 319 93 186 469 101 -190 236 187 -502 -658 -226 -267 -830 -334 -387 -703
1316g03J22L52r1m3K86K73k87J87J22Lr3J72K42j63k05N68k54n75P14m37r1j78
$$ -703 -581 -229 -320 -363 -77 196 -91 96 218 221 128 300 542 379 174 742 488 -87 627 190 99 -79
1338g9J6K6k93J36K62o20L1L3K97m19L27R8j58PN61l04lJ37L27j51r4L38p4k21
$$ -79 -63 -37 -330 -194 68 -552 -521 -488 -191 -610 -283 -185 -343 -336 225 -79 -82 55 382 231 137 475 401 180
1362A80K87m3j06k53L91k55j99J68j97k04j21K89j63j89m9L85k61j17K48j30k88
$$ 180 467 424 318 65 456 201 2 170 -27 -231 -352 -63 -226 -415 -464 -79 -340 -457 -209 -339 -627
1383f27M71J05N6j25N34l69k05N55O2l37L43J08k34k68J80N6l15r5K11k1k10K77
$$ -627 -156 -51 5 -120 414 45 -160 395 457 120 463 571 337 69 249 305 -10 -105 106 85 -125 152
1405A52k57k06j84J40j6Q5MJ85n36M08K05K06l54J75L43l70J56J62K12m07L43
$$ 152 -105 -311 -495 -355 -371 -286 -282 -97 -633 -225 -20 186 -168 7 350 -20 136 298 510 103 446
1426D46j1j36k18L27j51o8j58L22m49l07M33k16j97j08J60k60O0K12P6m34L43
$$ 446 435 299 81 408 257 189 31 353 -96 -403 30 -186 -383 -491 -331 -591 -531 -319 -243 -677 -334
1447c34K49j47k5M38j75q7J82K17m12K57L35m4k09l9Q8Ok19L05l74l35K01Q6k98
$$ -334 -85 -232 -257 181 6 -81 101 318 -94 163 498 454 245 206 294 300 81 386 12 -323 -122 -36 -334
1470c34q6L60k83l5J3L98l82k80N92j28j30J15N56m63kL12J09n5O5K54l25l06
$$ -334 -420 -60 -343 -378 -365 33 -349 -629 -37 -165 -295 -180 376 -87 -89 223 332 277 342 596 271 -35
1492c5N76k20k88M38j95j75k34L74m50n9o0K80j31l15Q3N4J82k65L98l37J62J40
$$ -35 541 321 33 471 276 101 -133 241 -209 -268 -328 -48 -179 -494 -411 -357 -175 -440 -42 -379 -217 -77
1514g7J12l52L80L02m17J35J97J41p8J12L7j86j33K45r8m54M9K1n7j89K32l6k60
$$ -77 35 -317 63 365 -52 83 280 421 343 455 492 306 173 418 320 -134 -85 -64 -121 -310 -78 -114 -374
1537c74k5L82n07J2K55K01n18M47L49l66j98M77Q9l11L28j21J96q9J27o8j99J57
$$ -374 -399 -17 -524 -512 -257 -56 -574 -127 222 -144 -342 135 224 -87 241 120 316 227 354 286 87 244
1559B44J37k40N1P3k95k12J24M19l98k31j65M55k30j25O3j47R8K78L40l54r1N32
$$ 244 381 141 192 265 -30 -242 -118 301 -97 -328 -493 -38 -268 -393 -330 -477 -379 -101 239 -115 -206 326
1581C26l90PL18m7j28j50O17m08M30l28K19m6k75J05k94k59L89k62j84m1K01n4
$$ 326 -64 -57 261 214 86 -64 553 145 575 247 466 420 145 250 -44 -303 86 -176 -360 -401 -200 -254
1603b54l44N45q9j64k01L52j55O4K27p3J67J33J54l70L29j82L62m79J28M05o3
$$ -254 -598 -53 -142 -306 -507 -155 -310 -246 -19 -92 75 208 362 -8 321 139 501 22 150 555 492
1624D92l91O0K00q36N34k21L6m12O32j90k45k07M60k31j32K68J68m11L47J96r0
$$ 492 101 161 361 -475 59 -162 -126 -538 94 -96 -341 -548 -88 -319 -451 -183 -15 -426 -79 117 27
1645B7J79M4J67k63k75N98k53n0J01J00l81o8O44k03n29L47q4m11q9M71k97j30
$$ 27 206 250 417 154 -121 477 224 174 275 375 -6 -74 570 367 -162 185 101 -310 -399 72 -225 -355
1667c55J93k47j19J88K80r1j59j8M68k36J40K37p0m4k8M17m79q5N24j96j89J87
$$ -355 -162 -409 -528 -340 -60 -151 -310 -328 140 -96 44 281 211 167 139 556 77 -8 516 320 131 318
1689C18j85Q5j94K28o6l44Q6k5j83k90L51j48j19N84k76j96L49K18l06m6K03K20
$$ 318 133 218 24 252 186 -158 -72 -97 -280 -570 -219 -367 -486 98 -178 -374 -25 193 -113 -159 44 264
1711B64j44J26j7J59l54R1J87q9J43o8j58k58O0jk9p9K32j49j78J36J4k59k6K56
$$ 264 120 246 229 388 34 125 312 223 366 298 140 -118 -58 -59 -88 -167 65 -84 -262 -126 -112 -371 -397 -141
1735a41j12l38N30PRj99M28o6k66O93l38j56j9L64Q5l10K7L44m79J6j51J23jl14
$$ -141 -253 -591 -61 -54 -45 -244 184 118 -148 545 207 51 32 396 481 171 198 542 63 79 -72 51 50 -264
1759b64L14l94L58l03K66k72j17L87k65o6K00Q1k17K4N61j87j07J28l0O4p6M03
$$ -264 50 -344 14 -289 -23 -295 -412 -25 -290 -356 -156 -75 -292 -268 293 106 -1 127 97 161 85 488
1781D88k3k19K34k30j03k2K04l14j29K20j15k94J4L26m88O4J80K03j54j57L57
$$ 488 465 246 480 250 147 125 329 15 -114 106 -9 -303 -289 37 -451 -387 -207 -4 -158 -315 42
1802D2j25k77L44N8j08Q8K23l86J97M18j90r3J11Q5o3l01J2K64l46rM06l17k44
$$ 42 -83 -360 -16 42 -66 22 245 -141 56 474 284 191 302 387 324 23 35 299 -47 -56 350 33 -211
1825b11K54j05l23j54L80k03o7K39r5O7J68P6k12k4L78oj10K41Mj04k40M60k13
$$ -211 43 -62 -385 -539 -159 -362 -429 -190 -285 -218 -50 26 -186 -210 168 162 52 293 297 193 -47 413 200
1848B00R6r3N5j85l24n5L44r5J17jk09j28J45p8o8J23mR3k85M66l5l00O0R3L01
$$ 200 296 203 258 73 -251 -306 38 -57 60 59 -150 -278 -133 -211 -279 -156 -160 -67 -352 114 79 -221 -161 -68 233
1873B33m08L18L20k93P8K59j39l33K88m9n2j19r7m6k31M89m15P7m32L93k77L8
$$ 233 -175 143 463 170 248 507 368 35 323 274 222 103 6 -40 -271 218 -197 -120 -552 -159 -436 -398
1895c98O7J34j01N0K30j74J30J10k6r9j9L37p0l08M18J22l07N8n9l7O4J63k05
$$ -398 -331 -197 -298 -248 -18 -192 -62 48 22 -77 -96 241 171 -137 281 403 96 154 95 58 122 285 80
1918H0k85J10K52j27j2j78J54o1l71M55k93j85K27L33k70r7J04L91j52J62j6l01
$$ 80 -205 -95 157 30 18 -160 -6 -67 -438 17 -276 -461 -234 99 -171 -268 -164 227 75 237 221 -80
1940h0J67J44k34RJ81J86k75J25k9k68q4r0L26l40L3P9R3j85N0J09k8j36P0J36
$$ -80 87 231 -3 6 187 373 98 223 194 -74 -158 -248 78 -262 -229 -150 -57 -242 -192 -83 -111 -247 -177 -41
1964d1m42M08M4O1m0l0q1M63k55N4MK4J32m5k19K69k74J20k14K93j66%j33L73
$$ -41 -483 -75 -31 30 -10 -40 -121 342 87 141 145 169 301 256 37 306 32 152 -62 231 65 65 -68 305
1988C05m37N1k93J78p7l1J04m9n1L17j71j32K06L3N1j67M03k9l08M88k28jk08
$$ 305 -132 -81 -374 -196 -273 -304 -200 -249 -300 17 -154 -286 -80 -47 4 -163 240 211 -97 391 163 162 -46
2011d6J72K01n83L88k18lk16M01q0j00j94J38N3k74L93j87o3M36j22p7m42M31
$$ -46 126 327 -256 132 -86 -89 -305 96 16 -84 -278 -140 -87 -361 32 -155 -218 218 96 19 -423 8
2033HJ55j92L08J12j80k45L39k33J91M2n2j52k60J56M8j51r9J48k13L03j63J8
$$ 8 163 -29 279 391 211 -34 305 72 263 305 253 101 -159 -3 45 -106 -205 -57 -270 33 -130 -112
2055a12j46J15K48k50J6K31r1j67J43m48J79r2N91j67O9m7M24n32J53J01p4l41
$$ -112 -258 -143 105 -145 -129 102 11 -156 -13 -461 -282 -374 217 50 119 72 496 -36 117 218 144 -197
2077a97M2L47r6j26%J6k28J62Q9q3p7J32J5j18p2J62m5k83L40k5mJ26J5Mn9O0
$$ -197 -155 192 96 -30 -30 -14 -242 -80 9 -74 -151 -19 -4 -122 -194 -32 -77 -360 -20 -45 -49 77 92 96 37 97
2103I7q6L7J46O1l19K82K0k67Q6j42K47j64k34K59m5k93j83K75Q8Q4kQ7n69L68
$$ 97 11 48 194 255 -64 218 238 -29 57 -85 162 -2 -236 23 -22 -315 -498 -223 -135 -51 -53 34 -535 -167
2127a67K42k53J72J70o2j7K45j67J45m35M19k32o5K25j78K39m07J22J04j80N6
$$ -167 75 -178 -6 164 102 85 330 163 308 -127 292 60 -5 220 42 281 -126 -4 100 -80 -24
2148b4l27L36k45L00J05n10q3K55P8j6o1K69j47M1M81n19M4J89L10n17M20j58
$$ -24 -351 -15 -260 40 145 -365 -448 -193 -115 -131 -192 77 -70 -29 452 -67 -23 166 476 -41 379 221
2170B21j72J03N5O6l63k1K43j49JK2m3J68m14J81j98k31L25L19m50J97n3K68j18
$$ 221 49 152 207 273 -90 -111 132 -17 -16 6 -37 131 -283 -102 -300 -531 -206 113 -337 -140 -193 75 -43
2193d3P4N5k69N5L32r5k17K64K51l5l0k7k03m14M96K55p12M25j26o2l21K12K08
$$ -43 31 86 -183 -128 204 109 -108 156 407 372 342 315 112 -302 194 449 -263 162 36 -26 -347 -135 73
2216G3k89l61L27R2Q2k13K80l0l7J39j49pJ48j82K32J66l9l9j68J66J05j15k27
$$ 73 -216 -577 -250 -158 -76 -289 -9 -39 -76 63 -86 -93 55 -127 105 271 232 193 25 191 296 181 -46
2239d6J69M0j11J1J0j36k29N09l68k91J30o8L5J05K20k69q3L23O5l31L15J47q3
$$ -46 123 163 52 63 73 -63 -292 217 -151 -442 -312 -380 -345 -240 -20 -289 -372 -49 16 -315 0 147 64
2262F4M6p2J84j40P6L60j78k11k4L0j54L9j3L6k48P2L3p2K7j00L6J30k60K66M6
$$ 64 110 38 222 82 158 518 340 129 105 135 -19 20 7 43 -205 -133 -100 -172 -145 -245 -209 -79 -339 -73 -27
2287b7j6oKQpL52k52R9j2j70J16J72M3r6Kq5K0K2l79K88j04OK21k31L4n8R2j32
$$ -27 -43 -49 -47 -39 -46 306 54 153 141 -29 87 259 302 206 208 123 143 165 -214 74 -30 -24 197 -34 0 -58 34 -98
2315i8r1Q0J07k99K04J98o5j95J80K32k03q0K98o0j33j76L37k32J92l1j17j41
$$ -98 -189 -109 -2 -301 -97 101 36 -159 21 253 50 -30 268 208 75 -101 236 4 196 165 48 -93
2337i3J14K94l81J33l04J43l53K36L51k90oO5j06o5K16q0K46k74L03j83rJ41l1
$$ -93 21 315 -66 67 -237 -94 -447 -211 140 -150 -156 -91 -197 -262 -46 -126 120 -154 149 -34 -43 98 67
2360F7J34m8J46q0k48J45r1J08j3J52Om34J34K2k85K80J37k97j26J85j58L0K15
$$ 67 201 153 299 219 -29 116 25 133 120 272 278 -156 -22 0 -285 -5 132 -165 -291 -106 -264 -234 -19
2383a9J8j33L6N2J47j99L09p0k01m3K41P3j50j2K06k53N4j30J68k49J95o8q5k49
$$ -19 -1 -134 -98 -46 101 -98 211 141 -60 -103 138 211 61 49 255 2 56 -74 94 -155 40 -28 -113 -362
2407c62k3M04M7n20L58N3k37L28k30R5L3K93k46o4L00j75M0M4J87l68K70k53K11
$$ -362 -385 19 66 -454 -96 -43 -280 48 -182 -87 -54 239 -7 -71 229 54 94 138 325 -43 227 -26 185
2430A85l5J45%k57j6j3l0L4J45J21n84j13M22j14Q5j17j30L77J28k31k43kK77
$$ 185 150 295 295 38 22 9 -21 13 158 279 -305 -418 4 -110 -25 -142 -272 105 233 2 -241 -243 34
2453C4P1J69l34K21J11q5k03J98P5k41J44j61Q0k79J26P6j64J99m3k43L08m0k01
$$ 34 105 274 -60 161 272 187 -16 182 257 16 160 -1 79 -200 -74 2 -162 37 -6 -249 59 19 -182
2476a82oK34R8l48K7L03k53K87N0%j42j31K40k47l4K97k11J56M4o0J94m03K80
$$ -182 -188 46 144 -204 -177 126 -127 160 210 210 68 -63 177 -70 -104 193 -18 138 182 122 316 -87 193
2499A93k8J37n9k55K05m03O2J5p5J88%q1j46L82m20R6L4%R5L2L5M36o13L55J35
$$ 193 165 302 243 -12 193 -210 -148 -133 -208 -20 -20 -101 -247 135 -285 -189 -155 -155 -60 -28 7 443 -170 185 320
2524C20k63q3K1K86n0k8j63q5J44l73J97K7j77j5L88l17j34k19M04J0O8J05k96
$$ 320 57 -26 -5 281 231 203 40 -45 99 -274 -77 -50 -227 -242 146 -171 -305 -524 -120 -110 -42 63 -233
2547b33J61j46o9M13o7r6J00J33m9j95K18J7l16L35k23J15j18pk6Q8O0L2j75l8
$$ -233 -72 -218 -287 126 59 -37 63 196 147 -48 170 187 -129 206 -17 98 -20 -27 -53 35 95 127 -48 -86
2571h6J40j17l16L08O4l0j53K9K01j04J03P3j13k7R7Q9L8M4j18j4PM2K18j50k39
$$ -86 54 -63 -379 -71 -7 -37 -190 -161 40 -64 39 112 -1 -28 69 158 196 240 122 108 115 157 375 225 -14
2596a4j2L00m51J25j67K39r9p7J19o6K41k44n6J55j1k66J54K98J2k43J66R9j72
$$ -14 -26 274 -177 -52 -219 20 -79 -156 -37 -103 138 -106 -162 -7 -18 -284 -130 168 180 -63 103 202 30
2619C0j3j22M01j09Rm4R3j00l05L78l1k08J35j00m0l13N49l37j7J3ok55M17j89
$$ 30 17 -105 296 187 196 152 245 145 -160 218 187 -21 114 14 -26 -339 210 -127 -144 -131 -137 -392 25 -164
2643a64L80m18r6K69k4K48J59j69M1N9q5l07K48R2j06m6K50k99k4L0j5M6j49P1
$$ -164 216 -202 -298 -29 -53 195 354 185 226 285 200 -107 141 233 127 81 331 32 8 38 23 69 -80 -9
2667ik1L2k10Q2mN1q5J93k53kL12j3j34J21N9j12r4K41j83RJ09J8n0q4J65j37
$$ -9 -30 2 -208 -126 -130 -79 -164 29 -224 -226 86 73 -61 60 119 7 -87 154 -29 -20 89 107 57 -27 138 1
2693AR1p1J20o2k62j23K42p9J37O0l33N89l50R8j52Q3Or7J8K12J35pk79K20J01
$$ 1 92 21 141 79 -183 -306 -64 -143 -6 54 -279 310 -40 58 -94 -11 -5 -102 -84 128 263 256 -23 197 298
2718B98l53K14k5k30K65K73m89K64j59p4m9q5N8NJ69j06o6Q0j1J46O2oo22M11
$$ 298 -55 159 134 -96 169 442 -47 217 58 -16 -65 -150 -92 -87 82 -24 -90 -10 -21 125 187 181 -441 -30
2742c0j57M4K06n5O2L07l22k21P6J78j8l10K37J57k14J1l7j70N50k11Jj41k55
$$ -30 -187 -143 63 8 70 377 55 -166 -90 88 70 -240 -3 154 -60 -49 -86 -256 294 83 84 -57 -312
2765c12K98L83p45J41M55k99K03j99j06J4M65j13k95Q8J60j29P1K01l32o1K87
$$ -312 -14 369 -376 -235 220 -79 124 -75 -181 -167 298 185 -110 -22 138 9 80 281 -51 -112 175
2786A75R3k52J0N5l92Q2K56O4k97K49r2Pl01J98L2L6k61L85r4N5j31M6K07j84
$$ 175 268 16 26 81 -311 -229 27 91 -206 43 -49 -42 -343 -145 -113 -77 -338 47 -47 8 -123 -77 130 -54
2810e4n7K69j72J82j92K6L8K08M2m21L73j71l2j97J56K16m12R8J13j27k78J55
$$ -54 -111 158 -14 168 -24 2 40 248 290 -131 242 71 39 -158 -2 214 -198 -100 13 -114 -392 -237
2832b37R7O0J28p4j8p9N0k8qJ59J07k35J29J95j31R3j26q3J4on4j6Q3P5Pk04Q
$$ -237 -140 -80 48 -26 -44 -123 -73 -101 -109 50 157 -78 51 246 115 208 82 -1 13 7 -47 -63 20 95 102 -102 -94
2859i4oj19L75k36r7K76q9q6n7m5M11k68K59k53K51j45j99K13q3J55K0N1k35J07
$$ -94 -100 -219 156 -80 -177 99 10 -76 -133 -178 233 -35 224 -29 222 77 -122 91 8 163 183 234 -1 106
2883A06k06K12K16n86R7K22M7k44R9R0j62J55L%k11J60l21J13J20P1j78K22j12
$$ 106 -100 112 328 -258 -161 61 108 -136 -37 53 -109 46 49 49 -162 -2 -323 -210 -90 -19 -197 25 -87
2906h7J5k6J36J48q2m7J00M4l88J30J63j88n6J26l9j4o4K95k43J1qP5K6%k8q5
$$ -87 -72 -98 38 186 104 57 157 201 -187 -57 106 -82 -138 -12 -51 -65 -129 166 -77 -66 -74 1 27 27 -1 -86
2932h6R3k93K78j55K28q2j92K4L43r7O0J22p7Ml8m5j90K48j00R6n9oR8j38MM1
$$ -86 7 -286 -8 -163 65 -17 -209 -185 158 61 121 243 166 170 132 87 -103 145 45 141 82 76 174 36 40 81
2958H1J05l45J37m7P8j82J69N3j33J1K77j81m6O3j03K98j98l2K70j42R8j2L0n4
$$ 81 186 -159 -22 -69 9 -173 -4 49 -84 -73 204 23 -23 40 -63 235 37 5 275 133 231 219 249 195
2982A95j15K80m25O5L40n07J66j29K3l9J60j35q5P1j21K11l60J49M49k22j20J72
$$ 195 80 360 -65 0 340 -167 -1 -130 -107 -146 14 -121 -206 -135 -256 -45 -405 -256 193 -29 -149 23
3004B3O5j88J32J98k23r0J14L19k69k9K2J05n3J17J51l20j98pJ12O9j21N9j80
$$ 23 88 -100 32 230 7 -83 31 350 81 52 74 179 126 243 394 74 -124 -131 -19 50 -71 -12 -192
3027a92P5k2J30j17K24k06J01k47M10k07M8M7L42k78M7J0l39K87J66q9k43R1J0
$$ -192 -117 -139 -9 -126 98 -108 -7 -254 156 -51 -3 44 386 108 155 165 -174 113 279 190 -53 38 48
3050D8pk79K02J22k73k1j2j7R0n6K66q0j31J89mJ54j98kj60J64j9l2K48J69l40
$$ 48 41 -238 -36 86 -187 -208 -220 -237 -147 -203 63 -17 -148 41 37 191 -7 -9 -169 -5 -24 -56 192 361 21
3075B1K26k48J62J97l03m8j4Q9P4j00J6j53p5K79k91J03n1J36j94R1K45n6p1k2
$$ 21 247 -1 161 358 55 7 -7 82 156 56 72 -81 -156 123 -168 -65 -116 20 -174 -83 162 106 35 13
3099A3N4k06J68m6m9L08m86J56J42L2J21j17k05J75o7j33K75k78l2L71k09R6k38
$$ 13 67 -139 29 -17 -66 242 -244 -88 54 86 207 90 -115 60 -7 -140 135 -143 -175 196 -13 83 -155
3122a55J28NK62k96q3L66j98MO6q7J36K15l12K16k6l14O8J49o2j17K30k53K85
$$ -155 -27 -22 240 -56 -139 227 29 33 99 12 148 363 51 267 241 -73 -5 144 82 -35 195 -58 227
3145B27j13k7J20l85L14k16M0L7j74oj6J5LP7j10J73K21j68J16M1K4l32l7L29
$$ 227 114 87 207 -178 136 -80 -40 -3 -177 -183 -199 -184 -181 -104 -214 -41 180 12 128 169 193 -139 -176 153
3169A53k0l1qn1P7k2j36N8j14l3k4J94j80J02R2q6J43k9m19J99K24l42M71k67
$$ 153 133 102 94 43 120 98 -38 20 -94 -127 -151 43 -137 -35 57 -29 114 85 -334 -135 89 -253 218 -49
3193d9K44j05j95J76k64M03l54m6L9K38P6k41O4J09p2l7J36k06o6R8J22j3p2K0
$$ -49 195 90 -105 71 -193 210 -144 -190 -151 87 163 -78 -14 95 23 -14 122 -84 -150 -52 70 57 -15 5
3217El6n4K7J34k98J5L6J37J27j28J22J59l78L5R1K32p1k28K6L15l98K41k14J18
$$ 5 -31 -85 -58 76 -222 -207 -171 -34 93 -35 87 246 -132 -97 -6 226 155 -73 -47 268 -130 111 -103 15
3241A5l8J88l41J63j78K13K6j67J92q3j81J89k7m3K67l57n2K81j39Q7j93J62K20
$$ 15 -23 165 -176 -13 -191 22 48 -119 73 -10 -191 -2 -29 -72 195 -162 -214 67 -72 15 -178 -16 204
3264B04n08M01p3m9q2J01K07l35N4J37J98k65K35k50j28J85k68m2K02Mk4K72K6
$$ 204 -304 97 24 -25 -107 -6 201 -134 -80 57 255 -10 225 -25 -153 32 -236 -278 -76 -72 -96 176 202
3287B02k51k9K36j97J18r2n5j34K83O4p2J42j61l41K20K17ok70M37l94J2J92J05
$$ 202 -49 -78 158 -39 79 -13 -68 -202 81 145 73 215 54 -287 -67 150 144 -126 311 -83 -71 121 226
3310B26l44J88o8L9k93M16l9j66P2j70J16j64L44Kl24L58r3OM8k16Pk8O9M4o8
$$ 226 -118 70 2 41 -252 164 125 -41 31 -139 -23 -187 157 159 -165 193 100 106 154 -62 -55 -83 -14 30 -38
3335c8J87n0n8j9J14J75k21J4l45K4O8R5p8j8J49k40L52j37j81M55q1l0N2j79
$$ -38 149 99 41 22 136 311 90 104 -241 -217 -149 -54 -132 -150 -1 -241 111 -26 -207 248 167 137 189 10
3359A0m9j7o4j79M29o9J65k85J25j7o2K01l1o6j27j57L28j91r9R3j26K23q8L45
$$ 10 -39 -56 -120 -299 130 61 226 -59 66 49 -13 188 157 91 -36 -193 135 -56 -155 -62 -188 35 -53 292
3383B92j69k89Q5n8L8J76P3r0j58K54j66J91m2k69K86k1l13J82k64L34K9nj5L7
$$ 292 123 -166 -81 -139 -101 75 148 58 -100 154 -12 179 137 -132 154 133 -180 2 -262 72 101 96 81 118
3407A18N5l01o3K60j95n7J97j51M1J35J5J51k6m38K05j17L85k17j29K2K27K5k67
$$ 118 173 -128 -191 69 -126 -183 14 -137 -96 39 54 205 179 -259 -54 -171 214 -3 -132 -110 117 142 -125
3430a25Q1J64l35L70O8l5j12j87R4M2j46K96l40j28K36R4k85NK74j19j21K72Q0
$$ -125 -44 120 -215 155 223 188 76 -111 -17 25 -121 175 -165 -293 -57 37 -248 -243 31 -88 -209 63 143
3453A43j47j27K23j17k35M48r5oJ39J86l83j36J92j08Oj32L17M8k82j88M40k11
$$ 143 -4 -131 92 -25 -260 188 93 87 226 412 29 -107 85 -23 -17 -149 168 216 -66 -254 186 -25
3475b5q2J36q8J43j81L2r3P8J85r9j18j2K9J50k92MK53j02K08N4l01R6J69J2m50
$$ -25 -107 29 -59 84 -97 -65 -158 -80 105 6 -112 -124 -95 55 -237 -233 20 -82 126 180 -121 -25 144 156 -294
3500b94K32j02J35j2j04J74j7j58R1J04Rk31L02j30N9j54k6K9K6n1J4n8L71o1
$$ -294 -62 -164 -29 -41 -145 29 12 -146 -55 49 58 -173 129 -1 58 -96 -122 -93 -67 -118 -104 -162 209 148
3524A48J39o2k79n6J95j33j64K28J40p2k92n0J26J24q9Q6Q0l93K59K02l90Q9J42
$$ 148 287 225 -54 -110 85 -48 -212 16 156 84 -208 -258 -132 -8 -97 -11 69 -324 -65 137 -253 -164 -22
3547b2J44o5j1Q6l7n6J89l17K70k40K55N2j57Oj67J53J77k67J90n02M06r0k17
$$ -22 122 57 46 132 95 39 228 -89 181 -59 196 248 91 97 -70 83 260 -7 183 -319 87 -3 -220
3570b20K11N1m4l1m1R2K09j97j73J98l21J74K53j46q5J54j12J09J05k56L94m61
$$ -220 -9 42 -2 -33 -74 18 227 30 -143 55 -266 -92 161 15 -70 84 -28 81 186 -70 324 -137
3592a37r5lL67k55K18k79M76k86P4j80k30K83J7j40O6J47j03R2o6j1o8n3L68k4
$$ -137 -232 -235 132 -123 95 -184 292 6 80 -100 -330 -47 -30 -170 -104 43 -60 32 -34 -45 -113 -166 202 178
3616A78j84m47Q29m01J30k1k04J79k22K59j84j1J11J02MJ58l63m1J2j46K36j0
$$ 178 -6 -453 376 -25 105 84 -120 59 -163 96 -88 -99 12 114 118 276 -87 -128 -116 -262 -26 -36
3638c6K36k09j61J86j56P6n0K84j3r1R9o8m7j57J48K3m9l8K49l11K11o1j54J73
$$ -36 200 -9 -170 16 -140 -64 -114 170 157 66 165 97 50 -107 41 64 15 -23 226 -85 126 65 -89 84
3662H4R0j6l86O75n54K35l07J37p6j56L51j43Q9K4j6r6r0L32r4l84J09M67k05
$$ 84 174 158 -228 447 -107 128 -179 -42 -118 -274 77 -66 23 47 31 -65 -155 177 83 -301 -192 275 70
3685G0J31j51m8k0P0m6Q3l66J67J6K13k55j7K2J97J21j90Kj91K47j76J82k24R7
$$ 70 201 50 2 -18 52 6 89 -277 -110 -94 119 -136 -153 -131 66 187 -3 -1 -192 55 -121 61 -163 -66
3709f6q6K3J44k86L38j6N7k6r2M9l3J54m17L14J05rj07PL2j0J69k47m4R1J86j81
$$ -66 -152 -129 15 -271 67 51 108 82 -10 39 6 160 -257 57 162 153 46 53 85 75 244 -3 -47 44 230 49
3735D9p5j49p7k91K71N84m72NJ9n5J07J38N8j84K3M6K15l93Q9J78k2Q0q1K2j41
$$ 49 -26 -175 -252 -543 -272 312 -160 -155 -136 -191 -84 54 112 -72 -49 -3 212 -181 -92 86 64 144 63 85 -56
3760e6Q7j8k65K74r8J24jM7k2l4j80K7l5L21ml72J8K96p3m78N93J92k38p1K89
$$ -56 31 13 -252 22 -76 48 47 94 72 38 -142 -115 -150 171 167 -205 -187 109 36 -442 151 343 105 34 323
3785C23m49r5K09K41M8j53j68K60J2l52J62k13Q0p6J79j93L76j93KJ33l47K67
$$ 323 -126 -221 -12 229 277 124 -44 216 228 -124 38 -175 -95 -171 8 -185 191 -2 0 133 -214 53
3807E3j77r9O2J97o5R3R2j5j72J39M3q6Qj52Q3j75N3J48m8J01k30N0l4j59K09
$$ 53 -124 -223 -161 36 -29 64 156 141 -31 108 151 65 73 -79 4 -171 -118 30 -18 83 -147 -97 -131 -290 -81
3832h1O4k55J55j90K10M8LM3j74L25j63q0k18J64M61j45l13L29k57J94L4j99n5
$$ -81 -17 -272 -117 -307 -97 -49 -46 -3 -177 148 -15 -95 -313 -149 312 167 -146 183 -74 120 154 -45 -100
3855a00K22L6k57L59p3K8j93k6l28R8K20J35j46k04K49k28K52j7j79J54m5L02
$$ -100 122 158 -99 260 187 215 22 -4 -332 -234 -14 121 -25 -229 20 -208 44 27 -152 2 -43 259
3877B59l64K53j51P2J84O9k06k32J36J31k10J36O6j17K25k27r3m2L0J37k15J39
$$ 259 -105 148 -3 69 253 322 116 -116 20 151 -59 77 143 26 251 24 -69 -111 -81 56 -159 -20
3899b0k16L96m3p9p6N0J07k70P8J75j48j12K62k08K55J6l5L0j04j20J13P9k66
$$ -20 -236 160 117 38 -38 12 119 -151 -73 102 -46 -158 104 -104 151 167 132 162 58 -62 51 130 -136
3922a36M6J00n0q3K72r1j03l05K61j56K59K2J17j29M8J85q8M6k69K48j60k3J13
$$ -136 -90 10 -40 -123 149 58 -45 -350 -89 -245 14 36 153 24 72 257 169 215 -54 194 34 11 124
3945A24j01J38k49J52m9J11qk55k0L0K17n3j24j06J22j04r2K75r5n3L2j35J32
$$ 124 23 161 -88 64 15 126 118 -137 -157 -127 90 37 -87 -193 -71 -175 -267 8 -87 -140 -108 -243 -111
3968a11J85J0j11k6r4L18J16j95O2j35p1l7j33J83O9j28R1j4K32j37N6j01J58
$$ -111 74 84 -27 -53 -147 171 287 92 154 19 -52 -89 -222 -39 30 -98 -7 -21 211 74 130 29 187
3991A87k57j9J36j0K62j58j70j4k25J26P1L1j1j72J35J08J6j04J20J08j52L46
$$ 187 -70 -89 47 37 299 141 -29 -43 -268 -142 -71 -40 -51 -223 -88 20 36 -68 52 160 8 354
4013C54l30j80J43r8J70L3j70J22J59l03K47k52L15L2j57k44J06J19o9J4J0r8
$$ 354 24 -156 -13 -111 59 92 -78 44 203 -100 147 -105 210 242 85 -159 -53 66 -3 11 21 -77
4035g7j70K44j0j41K24j88J57j38NJ19j71J4K12L3j49J70m3K61j92j98j73K73
$$ -77 -247 -3 -13 -154 70 -118 39 -99 -94 25 -146 -132 80 113 -36 134 91 352 160 -38 -211 62
4057F2j76K61r6r7l9K47j85k10lK96j0l59L77j66J15j12K23l4j24J69l19K33K80
$$ 62 -114 147 51 -46 -85 162 -23 -233 -236 60 50 -309 68 -98 17 -95 128 94 -30 139 -180 53 333
4080C33m07n2J75P5Q9jk49mK08j91K49l63L45l33N8J38r7N2J34J8k14l8j8q2K72
$$ 333 -74 -126 49 124 213 212 -37 -41 167 -24 225 -138 207 -126 -68 70 -27 25 159 177 -37 -75 -93 -175 97
4105I7j35O0R4J8k69J23J3PrJ1m9J89p7kk28K97k16k84L69J31k79N7m5j7J7q8
$$ 97 -38 22 116 134 -135 -12 1 8 -1 10 -39 150 73 71 -157 140 -76 -360 9 140 -139 -82 -127 -144 -127 -215
4131b15K85P6k64M38l11j85J70q4K82j74L8R5j54K48j14n5O2j9n6K7k00J75k4
$$ -215 70 146 -118 320 9 -176 -6 -90 192 18 56 151 -3 245 131 76 138 119 63 90 -110 65 41
4154D1kk44J31L43m67K17k17K21r8RO3l4ko10O65J01j18R6k56J85K5J66n3j10
$$ 41 39 -205 -74 269 -198 19 -198 23 -75 -66 -3 -37 -39 -649 16 117 -1 95 -161 24 49 215 162 52
4178E2M2k37K53o6K43l16m04Q03l03j18K05k81J99j53N1L23l36J83Ok52k7K31
$$ 52 94 -143 110 44 287 -29 -433 370 67 -51 154 -127 72 -81 -30 293 -43 140 146 -106 -133 98
4200I8j0J19j10m2R1k13Q2oK86l53k3N6M0o5J09O7j52L7l26K51m1R0k41J31K17
$$ 98 88 207 97 55 146 -67 15 9 295 -58 -81 -25 15 -50 59 126 -26 11 -315 -64 -105 -15 -256 -125 92
4225I2R2l5k1p7J43j48J2j65n3K0o3K57n8M5m5k9K84j91L4j88J61k3o6J89j00
$$ 92 184 149 128 51 194 46 58 -107 -160 -140 -203 54 -4 41 -4 -33 251 60 94 -94 67 44 -22 167 67
4250F7p2J60l16R1QJ90j46n5k7j89J77M8l4J25q0o3J25O8j19j50K35L6q9p0j8
$$ 67 -5 155 -161 -70 -62 128 -18 -73 -100 -289 -112 -64 -98 27 -53 -116 9 77 -42 -192 43 79 -10 -80 -98
4275i8M27l98K83l91J50k78J24J15Q6r1q8J68Mj08J74j75p7L21l9QM8m90J36K32
$$ -98 329 -69 214 -177 -27 -305 -181 -66 20 -71 -159 9 13 -95 79 -96 -173 148 109 117 165 -325 -189 43
4299D3p6K23o8L2l64N11j59l2j82L2L3j5J05R1j91o1N2j34N4L28j14j62oj50J19
$$ 43 -33 190 122 154 -210 301 142 110 -72 -40 -7 -22 83 174 -17 -78 -26 -160 -106 222 108 -54 -60 -210 -91
4324i1L5l8J16o1q0K75j72Q8Q7J27l90J73K44l08J5pj67Q7J5N3K26n6k41k5Om
$$ -91 -56 -94 22 -39 -119 156 -16 72 159 286 -104 69 313 5 20 13 -154 -67 -52 1 227 171 -70 -95 -89 -93
4350i3K41n80L06L91l12M3j60K28j84j25L69K4j63j26O4K17Q6K68o36L79l3k49
$$ -93 148 -432 -126 265 -47 -4 -164 64 -120 -245 124 148 -15 -141 -77 140 226 494 -142 237 204 -45
4372d5j13L31j45r4K4o4k30K37J04K64k55Kr4Q6q3j05P6R4J8j03J04NK26l48L46
$$ -45 -158 173 28 -66 -42 -106 -336 -99 5 269 14 16 -78 8 -75 -180 -104 -10 8 -95 9 14 240 -108 238
4397B38k99J48l8o9k17K27p7j04L69j80j11N7P0O7m7k0j18J06j57j1K83k25O4
$$ 238 -61 87 49 -20 -237 -10 -87 -191 178 -2 -113 -56 14 81 34 14 -104 2 -155 -166 117 -108 -44
4420d4r6j6L9j31K58j67R6J6M6K41l07J5J89j2J67l14Q0QMJ7K52j14k85Q8Q8j95
$$ -44 -140 -156 -117 -248 10 -157 -61 -45 1 242 -65 -50 139 127 294 -20 60 68 72 89 341 227 -58 30 118 -77
4446g7j09K18J35l21J99J80k54J30j44N2k87K07J6M47k72M7l07R1r0j28J44K19
$$ -77 -186 32 167 -154 45 225 -29 101 -43 9 -278 -71 -55 392 120 167 -140 -49 -139 -267 -123 96
4468I6n4%p7j01lJ35%J62j03N7k70J07N6k07K68J05q0m2K00j24r2M8k6m04M74
$$ 96 42 42 -35 -136 -139 -4 -4 158 55 112 -158 -51 5 -202 66 171 91 49 249 125 33 81 55 -349 125
4493A25j12o3L31k40J2M43k08k50J2K7l7J4j73M0K34k54J45r2k13M13j32j61J66
$$ 125 13 -50 281 41 53 496 288 38 50 77 40 54 -119 -79 155 -99 46 -46 -259 154 22 -139 27
4516B7p9j67J46Q4j08K49j76j44J89J97k00O6J22j2j41j13j5M1J22l49J00L92
$$ 27 -52 -219 -73 11 -97 152 -24 -168 21 218 18 84 206 194 53 -60 -75 -34 88 -261 -161 231
4538B31j74K36l50Rj59K49m6O0m7j89K03j07L29n60J46L58j89J63r1j06j46K23
$$ 231 57 293 -57 -48 -207 42 -4 56 9 -180 23 -84 245 -315 -169 189 0 163 72 -34 -180 43
4560D3j08O4q9l9J50J64m62M37r1j48M4kR2n7j97J07Q1j66K71k49K14O1m4j53
$$ 43 -65 -1 -90 -129 21 185 -277 160 69 -79 -35 -37 55 -2 -199 -92 -11 -177 94 -155 59 120 76 -77
4584g7m5Q4j38L8R7j39L22O7r5j47r6J63P0k57R3P3n8J91j79J31j88R8O0j28J91
$$ -77 -122 -38 -176 -138 -41 -180 142 209 114 -33 -129 34 104 -153 -60 13 -45 146 -33 98 -90 8 68 -60 131
4609A31j02k48K83lj30J17j06K8k5K7Q1R4l55N26m28J9R7p5Q7J85k48O3j5J7O0
$$ 131 29 -219 64 61 -69 48 -58 -30 -55 -28 53 147 -208 318 -110 -91 6 -69 18 203 -45 18 3 20 80
4634H0R6K07l71O0k11M5j19J2M7N6J1Mj39J8K07k81M49l3p4M0j68L14n73J24K2
$$ 80 176 383 12 72 -139 -94 -213 -201 -154 -98 -87 -83 -222 -204 3 -278 171 138 64 104 -64 250 -323 -199 -177
4659a77K53m03L34J19k95J74K01k73j5K57j51m2o0J80j1j13J13p6Q5o8J8j58N
$$ -177 76 -327 7 126 -169 5 206 -67 -82 175 24 -18 -78 102 91 -22 91 15 100 32 50 -108 -103
4682a03M03j78m4k48L41j51k40P4j30J42nJ77K32k50P4L1n1L2M7M7j50j28k82
$$ -103 300 122 78 -170 171 20 -220 -146 -276 -134 -139 38 270 20 94 125 74 106 153 200 50 -78 -360
4705c60ML60j3J11k06j4O1J12j11k6M5K8k29J66K23p1J39j71J7J06j53j44K98
$$ -360 -356 4 -9 102 -104 -118 -57 55 -56 -82 -37 -9 -238 -72 151 80 219 48 65 171 18 -126 172
4728A72l0k7k25K15j3j01n1L50k81p9L71k49M6n07K13L04r6j05m0r2lK42j56M5
$$ 172 142 115 -110 105 92 -9 -60 290 9 -70 301 52 98 -409 -196 108 12 -93 -133 -225 -228 14 -142 -97
4752i7nO9R8j58K13j80J31j37j4P6K92k96p2L6m8j3M0K22R8k44l90N76j30j51
$$ -97 -102 -33 65 -93 120 -60 71 -66 -80 -4 288 -8 -80 -44 -92 -105 -65 157 255 11 -379 197 67 -84
4776h4j47O0K10k24L09j51J94l37M64m20L03k06k31M03r8qj91k1J46L7l1j13J28
$$ -84 -231 -171 39 -185 124 -27 167 -170 294 -126 177 -29 -260 143 45 37 -154 -175 -29 8 -23 -136 -8
4799hN1n7o7J12k44K18m8j4KOp0K30j65K9j83Q2J74r3J67j19LL42j11n3j47P2
$$ -8 43 -14 -81 31 -213 5 -43 -57 -55 -49 -119 111 -54 -25 -208 -126 48 -45 122 3 6 348 237 184 37 109
4825A09n8j85K47J64k67M2k19K44P2K3j17Q8K1p2l34J56L9p9K60q3j91lr7l4N15
$$ 109 51 -134 113 277 10 52 -167 77 149 172 55 143 164 92 -242 -86 -47 -126 134 51 -140 -143 -240 -274 241
4850B41k97J67k88J21J47j61O3qR3N1q4q4J76j75LJ58j12m7k91N33m40J57M2O6
$$ 241 -56 111 -177 -56 91 -70 -7 -15 78 129 45 -39 137 -38 -35 123 11 -36 -327 206 -234 -77 -35 31
4874C1k26R2J52q4J50j60mL7r0J63k49L80n9k80J86j25Q2j74L01j31J98r6j65
$$ 31 -195 -103 49 -35 115 -45 -49 -12 -102 61 -188 192 133 -147 39 -86 -4 -178 123 -8 190 94 -71
4897g1J78k89J26q5M4M6J81l08m2K36j4O8k4K04j09L3jJ0k96J10K29q0l6k26L55
$$ -71 107 -182 -56 -141 -97 -51 130 -178 -220 16 2 70 46 250 141 174 173 183 -113 -3 226 146 110 -116 239
4922B39j17j87J80k57J65j32P7L45m87J39K7J4M6J22k21M4o8j20K30p3J71j53
$$ 239 122 -65 115 -142 23 -109 -32 313 -174 -35 -8 6 52 174 -47 -3 -71 -191 39 -34 137 -16
4944a6l7m3J28J81m06K19K73j45q0k3J36J2j38n5o9J91r0Jl27L08k87K17k1o7
$$ -16 -53 -96 32 213 -193 26 299 154 74 51 187 199 61 6 -63 128 38 39 -288 20 -267 -50 -71 -138
4968a38L26l40q8J48j81K39J82k37J39k50O3Q6j33N7J08J35k05J75j60J22RN9
$$ -138 188 -152 -240 -92 -273 -34 148 -89 50 -200 -137 -51 -184 -127 -19 116 -89 86 -74 48 57 116
4990A16k97J84L50k56j64J13k01R6R7k08L0K3J01M4j01J16k36P2j15K95l4L64
$$ 116 -181 3 353 97 -67 46 -155 -59 38 -170 -140 -117 -16 28 -73 43 -193 -121 -236 59 25 389
5012C89m06J0J07M2j74J67k6p7j16m3J75J1J15P0n47J44R2LK3L5j24o0K45r3Q2
$$ 389 -17 -7 100 142 -32 135 109 32 -84 -127 48 59 174 244 -303 -159 -67 -64 -41 -6 -130 -190 55 -38 44
5037D4k06J33P6k66J88M2p3J31M3m7J5j0j03J28r7M7j36K17k51M45l70O1J19K
$$ 44 -162 -29 47 -219 -31 11 -62 69 112 65 80 70 -33 95 -2 45 -91 126 -125 320 -50 11 130 132
5061A32k58j9J10k24K32j0J54o8r9o7k08N86k75KR8r3K26l70J04K3J24N8l09J13
$$ 132 -126 -145 -35 -259 -27 -37 117 49 -50 -117 -325 261 -14 -12 86 -7 219 -151 -47 -24 100 158 -151 -38
5085c8L11l46O0L2j6j76K45j6l18M5N1K0K90k07j17J96l31L02J49j37p3J87n0
$$ -38 273 -73 -13 19 3 -173 72 56 -262 -217 -166 -146 144 -63 -180 16 -315 -13 136 -1 -74 113 63
5108F3j68L03m6k3p6j37J3j4n1M3K46j95K9o5J84mN0n1q0Jj00M9j9L03j36k03
$$ 63 -105 198 152 129 53 -84 -71 -85 -136 -93 153 -42 -13 -78 106 102 152 101 21 22 -78 -29 -48 255 119 -84
5134h4k72N51p7j60R5rL2l89K43l9J22j30k1J30k98M8K42N7R3j50K55j01k49k84
$$ -84 -356 195 118 -42 53 44 76 -313 -70 -109 13 -117 -138 -8 -306 -258 -16 41 134 -16 239 138 -111 -395
5158c95K93r3M58l35J20l72J34J22M3P7j74J61j39J31J48k0r2o7K05j86J31r8
$$ -395 -102 -195 263 -72 48 -324 -190 -68 -25 52 -122 39 -100 31 179 159 67 0 205 19 150 52
5180E2j08L33l20J01J85l6j11J02j70j75m9L28n5j46J4L04k87Ln3j03Q4%J2R5
$$ 52 -56 277 -43 58 243 207 96 198 28 -147 -196 132 77 -69 -55 249 -38 -35 -88 -191 -107 -107 -95 0
5204@K48k9k77K08l12K69j53P2j14J15k71J41L7j10M74m55L24j77R3J20j93J5
$$ 0 248 219 -58 150 -162 107 -46 26 -88 27 -244 -103 -66 -176 298 -157 167 -10 83 203 10 25
5226B5R2r3p4J55j61l9J17k00J31K77l92K01k5K89j53j22J56j16j21J85k05q1
$$ 25 117 24 -50 105 -56 -95 22 -178 -47 230 -162 39 14 303 150 28 184 68 -53 132 -73 -154
5248a54L02k73L12l8k95K39r2K85m88J29r1L40k13Q6J26k71J52j40QK66j6r3k38
$$ -154 148 -125 187 149 -146 93 1 286 -202 -73 -164 176 -37 49 175 -96 56 -84 -76 190 174 81 -157
5271a57L52m27N03k82J52j63L8R4n6j02P0J46k17n8o6J89j85J11j25N1J13j63
$$ -157 195 -232 271 -11 141 -22 16 110 54 -48 22 168 -49 -107 -173 16 -169 -58 -183 -132 -19 -182
5293a82L29k56J42j30M80m88J57l8l6Q3Ql39M07L4p1j73l46M88m6J53j85J05k91
$$ -182 147 -109 33 -97 383 -105 52 14 -22 61 69 -270 137 171 100 -73 -419 69 23 176 -9 96 -195
5316a95Q6k7K51K0k44J02M7k33R3Q3r6j14K03Pp6K4k7N8r1mJ73J80l3p1k4r2K5
$$ -195 -109 -136 115 135 -109 -7 40 -193 -100 -17 -113 -227 -24 -17 -93 -69 -96 -38 -129 -133 40 220 187 116 92 0 25
5343B5j94j1J13J74j60K5q3J68R5J71l35K6k6J4j65L32l96K34O1N3Rk04j29P9
$$ 25 -169 -180 -67 107 -53 -28 -111 57 152 323 -12 14 -12 2 -163 169 -227 7 68 121 130 -74 -203 -124
5367a24J59M4L7j75K94j58j25j51K18K25p6j50q6P4k92M88n4rk09M96m24j9j21
$$ -124 35 79 116 -59 235 77 -48 -199 19 244 168 18 -68 6 -286 202 148 139 -70 426 2 -17 -138
5390a38l0J93k21K3K73l2J2l61J27O3j42L40j92K69j52j70J64r9K1o0J05L23j52
$$ -138 -168 25 -196 -173 100 68 80 -281 -154 -91 -233 107 -85 184 32 -138 26 -73 -52 -112 -7 316 164
5413A64k56K63j05qn9l3J73j75p8M0j88K00Q9Oj53K05k35J28J17j90K51rk30L25
$$ 164 -92 171 66 58 -1 -34 139 -36 -114 -74 -262 -62 27 33 -120 85 -150 -22 95 -95 156 147 -83 242
5437B42l15K56j67k04L56o02O01l3k63N2p2P1K94l20J55l4K2mlk03m8J29N9K30
$$ 242 -73 183 16 -188 168 -434 167 134 -129 -77 -149 -78 216 -104 51 17 39 35 32 -171 -219 -90 -31 199
5461A99o3r2j05l6L61m30K46J1l27M36l2l25L45Q3l54j12K48o6k0J19j72K81n9
$$ 199 136 44 -61 -97 264 -166 80 91 -236 200 168 -157 188 271 -83 -195 53 -13 -33 86 -86 195 136
5484A36N0k56%K4PL8q7K26n6pk95J31R4J44N5j19L1l0J01J28l62K21k50J26q4
$$ 136 186 -70 -70 -46 -39 -1 -88 138 82 75 -220 -89 5 149 204 85 116 86 187 315 -47 174 -76 50 -34
5509c4n1J09j4p3J07j13J06J55l28J57j0j28R4n1J55l17J38M34m40L61l25K5r1
$$ -34 -85 24 10 -63 44 -69 37 192 -136 21 11 -117 -23 -74 81 -236 -98 336 -104 257 -68 -43 -134
5532a34J31j72J36J32J4j40j8m3J18L7o9q7j54qK49J12j10k30J62j13K80l56R5
$$ -134 -3 -175 -39 93 107 -33 -51 -94 24 61 -8 -95 -249 -257 -8 104 -6 -236 -74 -187 93 -263 -168
5555a68L05m42M11j28L00j90N9j32o6K04j20L9o9J69o9PM6j78O0j12j5m8J16k01
$$ -168 137 -305 106 -22 278 88 147 15 -51 153 33 72 3 172 103 110 156 -22 38 -74 -89 -137 -21 -222
5579b22K06L7l52L98m5Jj49J54j25J65k88L98k68J80K42m27J73Q1Rk98O4q9oJ15
$$ -222 -16 21 -331 67 22 23 -126 28 -97 68 -220 178 -90 90 332 -95 78 159 168 -130 -66 -155 -161 -46
5603d6j02L94L8m33L00r9n0r8J74j22K3M15l98M6j43K46p0j8k68R3K83k76J1L33
$$ -46 -148 246 284 -149 151 52 2 -96 78 -44 -21 394 -4 42 -101 145 75 57 -211 -118 165 -111 -100 233
5627B33m42K23j7o9J2j06K96m7j87M2J77j68p7j56K53K05j57J70m33K50J06j97
$$ 233 -209 14 -3 -72 -60 -166 130 83 -104 -62 115 -53 -130 -286 -33 172 15 185 -248 2 108 -89
5649h9j40J36M9J81k06K41l4j67K04Jj32l15K48J0lj54J76J42k2l26K01J89P1
$$ -89 -229 -93 -44 137 -69 172 138 -29 175 176 44 -271 -23 -13 -16 -170 6 148 126 -200 1 190 261
5672B61k77P9p1k6P6P4k82J14J46l2P5J22l87N48m88J51k84J91k14M28j92M6l24
$$ 261 -16 63 -8 -34 42 116 -166 -52 94 62 137 259 -128 420 -68 83 -201 -10 -224 204 12 58 -266
5695b66J38J99j42K53k06J59k04J61l49L20j82M87l68j27J88J1l00O1K09r2j9
$$ -266 -128 71 -71 182 -24 135 -69 92 -257 63 -119 368 0 -127 61 72 -228 -167 42 -50 -69
5716f9N5p9j0%P3N7K80j62o0k5k7K7j37M7j22M37m16l9J16K12l4j38n9J71l4J25
$$ -69 -14 -93 -103 -103 -30 27 307 145 85 60 33 60 -77 -30 -152 285 -131 -170 -54 158 124 -14 -73 98 64 189
5742A89k97N2q1L10j70J17Q7l61m5j6O8L99j34O2J57k29j19p0J67k41K3O3J76
$$ 189 -108 -56 -137 173 3 120 207 -154 -199 -215 -147 252 118 180 337 108 -11 -81 86 -155 -132 -69 107
5765A07k01O7k3O7r8k3K05j64j41r7J10K9M6K6J43r3m3J5k0P3n9R2J01k16M7J08
$$ 107 -94 -27 -50 17 -81 -104 101 -63 -204 -301 -191 -162 -116 -90 53 -40 -83 -68 -88 -15 -74 18 119 -97 -50 58
5791E8m7n5J58o4k53J18J1J71q8m1P6j11P1j95p0M20l00J28oL05j35j10J0q9J68
$$ 58 11 -44 114 50 -203 -85 -74 97 9 -32 44 -67 4 -191 -261 159 -141 -13 -19 286 151 41 51 -38 130
5816A30k79K37q8K19R4m46J71m8l68M72k51K24j53LM9K5Q0P8l58K74l36K23j16
$$ 130 -149 88 0 219 313 -133 38 -10 -378 94 -157 67 -86 -83 -34 -9 71 149 -209 65 -271 -48 -164
5839a64P1K26o2k03Q5L0j69J42P8L35k46N6j14oj09M7J47j62j47L3j81K37K6K16
$$ -164 -93 133 71 -132 -47 -17 -186 -44 34 369 123 179 65 59 -50 -3 144 -18 -165 -132 -313 -76 -50 166
5863A66l58L55m45K06j9K26k27j10K85J20l76j09M48j20J3j03k2K61p4j87J36
$$ 166 -192 163 -282 -76 -95 131 -96 -206 79 199 -177 -286 162 42 55 -48 -70 191 117 -70 66
5884F6j61P5R9L4Nj02k0p5L47n2j50n2j27K34k25K3J05P8j11ok1J3j00L8j7L2
$$ 66 -95 -20 79 113 118 16 -4 -79 268 216 66 14 -113 121 -104 -81 24 102 -9 -15 -36 -23 -123 -85 -102 -70
5910g0K02jl30J68n2Qr4K46J96k43q0j0R0mj63J37j40K43k30K44l26K70Jj23j08
$$ -70 132 131 -199 -31 -83 -75 -169 77 273 30 -50 -60 30 26 -137 0 -140 103 -127 117 -209 61 62 -61 -169
5935a69K2K63j40q4k3R3L46j11k84L22k55j02N1J97k17J36Q0PJ49j15k2K6k20
$$ -169 -147 116 -24 -108 -131 -38 308 197 -87 235 -20 -122 -71 126 -91 45 125 132 281 166 144 170 -50
5958e0q2J02O6j0O5k29K48P9q2j13Qj14j8m9PL41qq6J49k77m0j0K19J8j69o5K76
$$ -50 -132 -30 36 26 91 -138 110 189 107 -6 2 -112 -130 -179 -172 169 161 75 224 -53 -93 -103 116 134 -35 -100 176
5985A76p3j83J34k58m5K37j58j65J68J93k57K41J98Q8m29J74M2l21L41r6q9j36
$$ 176 103 -80 54 -204 -249 -12 -170 -335 -167 26 -231 10 208 296 -133 41 83 -238 103 7 -82 -218
6007b18P3k6N03n09J46K18q0N9%j10k73J47Q7J48J69k99k32J65k6N8J69k97j22
$$ -218 -145 -171 332 -177 -31 187 107 166 166 56 -217 -70 17 165 334 35 -197 -32 -58 0 169 -128 -250
6030b50K25N9nj88j6J31k55L45k17n5K82k21K78j22n7K41o1j51Q6j8j19L12k25
$$ -250 -25 34 29 -159 -175 -44 -299 46 -171 -226 56 -165 113 -9 -66 175 114 -37 49 31 -88 224 -1
6053ak64L55P7j51J03p0J59l50k14L43n5n1K59r0o0n3J7j28k4j03N59m18J8J26
$$ -1 -265 90 167 16 119 49 208 -142 -356 -13 -68 -119 140 50 -10 -63 -46 -174 -198 -301 258 -160 -142 -16
6077a6J0P1j40O4J50r7qr4K23n2Q0k50J81l79J21L29k57P4M1M3l09L56j64Q3J51
$$ -16 -6 65 -75 -11 139 42 34 -60 163 111 191 -59 122 -257 -136 193 -64 10 51 94 -215 141 -23 60 211
6102B11k07Lj50J77jK60k31j29j44J61q5K22j37n6K13o3J16j16N1l18K01O6j85
$$ 211 4 7 -143 34 33 293 62 -67 -211 -50 -135 87 -50 -106 107 44 160 44 95 -223 -22 44 -141
6125a41L24k65l0M2QJ07J9pJ52l36j39M21j29J61k98n1K48L7q9j00n0K26p6j40
$$ -141 183 -82 -112 -70 -62 45 64 57 209 -127 -266 155 26 187 -111 -162 86 123 34 -66 -116 110 34 -106
6149a06K66j74J39k28L2K45j69o0K5M2l32O24j87k73jqJ48p7r0M12k14M3Q3j10
$$ -106 160 -14 125 -103 -71 174 5 -55 -30 12 -320 304 117 -156 -157 -165 -17 -94 -184 228 14 57 140 30
6173C0j92K11q1M5k3J50j51n9J80j32j5J23J06l46J71m6LjJ30j01kK42j52j09
$$ 30 -162 49 -32 13 -10 140 -11 -70 110 -22 -37 86 192 -154 17 -29 -26 -27 103 2 0 242 90 -19
6197a9K4j26j06K83mp0J46mq7l73L32J84m25K96m0j5J26r7Q1J19j11k02K7m5k59
$$ -19 5 -121 -227 56 52 -18 128 124 37 -336 -4 180 -245 51 11 -4 122 25 106 225 114 -88 -61 -106 -365
6222c65K57K28l70M52rk14J12J9j09N5K7j20J74j67J10J88l7k85oj0K44J9j54
$$ -365 -108 120 -250 202 193 -21 91 110 1 56 83 -37 137 -30 80 268 231 -54 -60 -70 174 193 39
6245C9J50k24j81L2J20kP8M2J4kr0m1L52p6j18M0j53L4k63J21M0r1K15p1n3j30
$$ 39 189 -35 -216 -184 -64 -66 12 54 68 66 -24 -65 287 211 93 133 -20 14 -249 -128 -88 -179 36 -35 -88 -218
6271b18M12j29j88l3J50o9J07j6p0Q2K5m0J12j77o2K14k61K96l81L16M2R6r4J07
$$ -218 194 65 -123 -156 -6 -75 32 16 -54 28 53 13 125 -52 -114 100 -161 135 -246 70 112 208 114 221
6295B21o7p7k47Q4r2q5L24l21L30k59K94J23k52j22J07K91k05q0K45l84K19j40
$$ 221 154 77 -170 -86 -178 -263 61 -260 70 -189 105 228 -24 -146 -39 252 47 -33 212 -172 47 -93
6317i3k39L42k32K47l79M12rk9Lp7M5j52K84J27m39N0j05J93j3O7J05K4l13L67
$$ -93 -332 10 -222 25 -354 58 49 20 23 -54 -9 -161 123 250 -189 -139 -244 -51 -64 3 108 132 -181 186
6341A86j75J36j20R7n4QLk70J43J12p9m6J92k2j45k4q8K13j10QJ55j50j70R3K00
$$ 186 11 147 27 124 70 78 81 -189 -46 66 -13 -59 133 111 -34 -58 -146 67 -43 -35 120 -30 -200 -107 93
6366I3k41L16j55L0J0m1j75M85l73J49q1K27k90P5k27L04j63o3J32k36J92J99
$$ 93 -148 168 13 43 53 12 -163 322 -51 98 17 244 -46 29 -198 106 -57 -120 12 -224 -32 167
6388A67l53J78o0J18N0j14lj85R8M2n5j03K85n2O7k52M1k7R9n9Q5K7j54J02j87
$$ 167 -186 -8 -68 50 100 -14 -17 -202 -104 -62 -117 -220 65 13 80 -172 -131 -158 -59 -118 -33 -6 -160 -58 -245
6413b45J41K87J20l22P7j41K0J00J40j31l7k24L97j74k81R4J59k04M48j33m6J14
$$ -245 -104 183 303 -19 58 -83 -63 37 177 46 9 -215 182 8 -273 -179 -20 -224 224 91 45 159
6435A59k1j51J06j16L47j89Jj29L47l39q2J52j47J08r9L1O7L06j77j34J2k4l3
$$ 159 138 -13 93 -23 324 135 136 7 354 15 -67 85 -62 46 -53 -22 45 351 174 40 52 28 -5
6458eJ8pJ31l40K42K19r1m73L25J77l45K3J93L8Rj04J04k8M9j53K12j50r1N9n7
$$ -5 13 6 137 -203 39 258 167 -306 19 196 -149 -126 67 105 114 10 114 86 135 -18 194 44 -47 12 -45
6483d5k3N4J56j02j77o9J30P1o1J07k78K47m5m7K42l4j37K39k06K14j16n5%n3
$$ -45 -68 -14 142 40 -137 -206 -76 -5 -66 41 -237 10 -35 -82 160 126 -11 228 22 236 120 65 65 12
6507A2N1j6K12k33P3j64R1O4k26J95m3p3R4r8k3K5R3j59q0M48k29M7L4j10J61
$$ 12 63 47 259 26 99 -65 26 90 -136 59 16 -57 37 -61 -84 -59 34 -125 -205 243 14 61 95 -15 146
6532A46j52l7j74L74j29J94j18N3p0p4K61k67J52k50j51K44k51M31l46j71M78
$$ 146 -6 -43 -217 157 28 222 104 157 87 13 274 7 159 -91 -242 2 -249 182 -164 -335 143
6553A43j17R6J8k55M4m5K94j74l32K80k13L91J65o65L38k19M97l43K3p2J03J11
$$ 143 26 122 140 -115 -71 -116 178 4 -328 -48 -261 130 295 -370 -32 -251 246 -97 -74 -146 -43 68
6575F8l77N24n97L83N6M8k02j9j19o2K98J68l60L60j9k05J34m3P7N0l97N9J91
$$ 68 -309 215 -382 1 57 105 -97 -116 -235 -297 1 169 -191 169 150 -55 79 36 113 163 -234 -175 16
6598A6r0L04j78N6Lj43J15L8L8J28l32J77l86J87J46O4k67J13K79j25kk00P8k23
$$ 16 -74 230 52 108 111 -32 83 121 159 287 -45 132 -254 -67 79 143 -124 -11 268 143 141 -59 19 -204
6622b04K15J14N5k17q2J76R2k72J94j29OO1K2k8O2k43L19k32j13Q8l6L0j8Q9L7
$$ -204 11 125 180 -37 -119 57 149 -123 71 -58 -52 9 31 3 65 -178 141 -91 -204 -116 -152 -122 -140 -51 -14
6647a4P4o3j72l3K31k4k4k5k9J18q5k2k17K00m3P3N5P0o3j36J73m3l9j24K16k08
$$ -14 60 -3 -175 -208 23 -1 -25 -50 -79 39 -46 -68 -285 -85 -128 -55 0 70 7 -129 44 1 -38 -162 54 -154
6673a54n8J00KJ18j95J15J43j82J17j34J0k27K33K14n7K5o0j26L44j35n5m75P74
$$ -154 -212 -112 -110 8 -187 -72 71 -111 6 -128 -118 -345 -112 102 45 70 10 -116 228 93 38 -437 337
6696C37n75K43j51J66M6Q9m1l1Q0j75j1m6J87k1j38J4n5p4p0L37l0j18Q4r8q1
$$ 337 -238 5 -146 20 66 155 114 83 163 -12 -23 -69 118 97 -41 -27 -82 -156 -226 111 81 -37 47 -51 -132
6721a32j93N47k93n9J27NK30l69r6L96l41K22k8K26j96J22k5l29L88n0J2l10K24
$$ -132 -325 222 -71 -130 -3 2 232 -137 -233 163 -178 44 16 242 46 168 143 -186 202 152 164 -146 78
6744G8k43RK23j03J07l3l0Q7n05N93k96M9J09j85K04J31q0j09o5Q5K4J27j74q1
$$ 78 -165 -156 67 -36 71 38 8 95 -410 183 -113 -64 45 -140 64 195 115 6 -59 26 50 177 3 -78
6768g8J55k08N6K08j76n2K42l53L03Q2n13M39m2k9j43o4J12J24j02m8M17l00l96
$$ -78 77 -131 -75 133 -43 -95 147 -206 97 179 -334 105 63 34 -109 -173 -61 63 -39 -87 330 30 -366
6791c66M53k40K4R1k04J64K32l27L54k56q9J54J48p5J00k92M1J2%l9J43k3p9q3
$$ -366 87 -153 -129 -38 -242 -78 154 -173 181 -75 -164 -10 138 63 163 -129 -88 -76 -76 -115 28 5 -74 -157
6815a57J38o3L14k96jP3J02q5K65j86q9j07m9K37rK11k71j07k5M0l0L09k47P7
$$ -157 -19 -82 232 -64 -65 8 110 25 290 104 15 -92 -141 96 87 298 27 -80 -105 -65 -95 214 -33 44
6839D4m4m8o4OJ32J13Q4l65J64k4q2KJ70K6r9oj32J14j12R5n1P8K48m92L30n7
$$ 44 0 -48 -112 -106 26 139 223 -142 22 -2 -84 -82 88 114 15 9 -123 -9 -121 -26 -77 1 249 -243 87 30
6865C0j19j41L23N3J30k51j08J11j1p0k4j4J39j22N8JK04j72mM2j69L09k61K07
$$ 30 -89 -230 93 146 276 25 -83 28 17 -53 -77 -91 48 -74 -16 -15 189 17 13 55 -114 195 -66 141
6889A41k90K42L2m2N3j21q2J79k88L58l04P4K20q0n0P3M5k09m43M38M3k29K76
$$ 141 -149 93 125 83 136 15 -67 112 -176 182 -122 -48 172 92 42 115 160 -49 -492 -54 -11 -240 36
6912C6k09J12p9K30j85K01k9L5k14J50nJ65k14kq7k27L42K22o8j7L1nl20J75J28
$$ 36 -173 -61 -140 90 -95 106 77 112 -102 48 43 208 -6 -8 -95 -322 20 242 174 157 188 183 -137 38 166
6937A66q0j36J94j16p0l0J05o6o7j29J10J93l10M00l22J6K25j64J64k6jo2J11
$$ 166 86 -50 144 28 -42 -72 33 -33 -100 -229 -119 74 -236 164 -158 -142 83 -81 83 57 56 -6 105
6960A05J13k71K78l08Q0m18M19R0l0L5Oo7j99K09l53M41l16J5M28k64j15L72j54
$$ 105 218 -53 225 -83 -3 -421 -2 88 58 93 99 32 -167 42 -311 130 -186 -171 257 -7 -122 250 96
6983I6j59J10J7j1R9k13N2j7o1R0o2rJ77J5N6k72l2J68j55K05j9j83L73m65L60
$$ 96 -63 47 64 53 152 -61 -9 -26 -87 3 -59 -68 109 124 180 -92 -124 44 -111 94 75 -108 265 -200 160
7008A60j35k68K03K1J6J34j33j4mj03J25k20K32J48q8P7r6j83J32j32K43j95q0
$$ 160 25 -243 -40 -19 -3 131 -2 -16 -20 -123 2 -218 14 162 74 151 55 -128 4 -128 115 -80 -160
7031a60K70l94L36J00k51J39Lj77J7J37p0K22l21n3L07m1r4m6J30k83K60j94J14
$$ -160 110 -284 52 152 -99 40 43 -134 -117 20 -50 172 -149 -202 105 64 -30 -76 54 -229 31 -163 -49
7054d9O1K27l01J14j69M4K62j55j66j7K71k42J89j5k9j72k6K78k04P9p0OJ24j48
$$ -49 12 239 -62 52 -117 -73 189 34 -132 -149 122 -120 69 54 25 -147 -173 105 -99 -20 -90 -84 40 -108
7078a08J49L2K7r1j66K62l0o4n8K36k35nj22J17J32j02K37l07K61pl83J50J52
$$ -108 41 73 100 9 -157 105 75 11 -47 189 -46 -51 -173 -56 76 -26 211 -96 165 158 -225 -75 77
7101G7R8j86q5K97j03k26j73K95J54j10J4J1j18j02J76J38r6R5l90K49L25l68
$$ 77 175 -11 -96 201 98 -128 -301 -6 148 38 52 63 -55 -157 19 157 61 156 -234 15 340 -28
7123b8L36m44J57J55k43J15j60J68L8l32M87l80J05J53k32Q9J69k79J23J04N7
$$ -28 308 -136 21 176 -67 48 -112 56 94 -238 249 -131 -26 127 -105 -16 153 -126 -3 101 158
7144A58j24j64J53j16K12j06j14k26N40l03K21j09M6j79P3K58k70K24j30J9k87
$$ 158 34 -130 23 -93 119 13 -101 -327 213 -90 131 22 68 -111 -38 220 -50 174 44 63 -224
7165b24J69J80O7j4m3L0j02k17K00R3m5J2J22k53J44r5j13J39l9r1K44j28j2J32
$$ -224 -55 125 192 178 135 165 63 -154 46 139 94 106 228 -25 119 24 -89 50 11 -80 164 36 24 156
7189A56j99qNj31J06M05k84K2j65k50K81m9J49j52Nj17J14L43m51L69K9k15J76
$$ 156 -43 -51 -46 -177 -71 334 50 72 -93 -343 -62 -111 38 -114 -109 -226 -112 231 -220 149 178 -37 139
7212A39j6r8R9P1k69J31o6J51j97k9n8J58Pj29j61N0L41l17%K58p9l1M8J63J76
$$ 139 123 25 124 195 -74 57 -9 142 -55 -84 -142 16 23 -106 -267 -217 124 -193 -193 65 -14 -45 3 166 342
7237C42k69L4k37L1J09J96j24m8J40j68j2j79K62J9m9k57L31j2J30k93k54L10
$$ 342 73 107 -130 -99 10 206 82 34 174 6 -6 -185 77 96 47 -210 121 109 239 -54 -308 2
7259BJ12k82L41m2l03M5p8j94M02R9o6r3Q4j38J09P6l8j9J2k6N6K05k27j3Q4J6
$$ 2 114 -168 173 131 -172 -127 -205 -399 3 102 36 -57 27 -111 -2 74 36 17 29 3 59 264 37 24 108 124
7285A24k87K03j66J67j57j26M79k28j84L25k61J17l3P7L27l89j95J41J80k13M5
$$ 124 -163 40 -126 41 -116 -242 237 9 -175 150 -111 6 -27 50 377 -12 -207 -66 114 -99 -54
7306e4J4P7j17o8NK15q0j28J45m0N3R9J88k71mj27M3P5j4N5N9l42J36j22L46k51
$$ -54 -40 37 -80 -148 -143 72 -8 -136 9 -31 22 121 309 38 34 -93 -50 25 11 66 125 -217 -81 -203 143 -108
7332a08p1K65k46K48l16L04qJ50k79J90q2k0J47l50N9K63k34j0J07j48J62P6k39
$$ -108 -179 86 -160 88 -228 76 68 218 -61 129 47 27 174 -176 -117 146 -88 -98 9 -139 23 99 -140
7355a40K05o8j5J39j20o1J29R5K8j59l13K38J15J73m05J96J0j64J58l8k48L64
$$ -140 65 -3 -18 121 1 -60 69 164 192 33 -280 -42 73 246 -159 37 47 -117 41 3 -245 119
7377A19k56J43J22l24J87p1J39j45m8J54m5l4K13k3k51J71l18L23q3J81k30q6
$$ 119 -137 6 128 -196 -9 -80 59 -86 -134 20 -25 -59 154 131 -120 51 -267 56 -27 154 -76 -162
7399a62J31j7K23o0j44L1m6Np5K2K67k11k36R1j25M05j97J7J65l3R8j66k24R8
$$ -162 -31 -48 175 115 -29 2 -44 -39 -114 -92 175 -36 -272 -181 -306 99 -98 -81 84 51 149 -17 -241 -143
7423a43k06L61N5k93P2j9J94k97M24k81M6j11Q9J4J00%K04j26Mj24q2l1L6P2j08
$$ -143 -349 12 67 -226 -154 -173 21 -276 148 -133 -87 -198 -109 -95 5 5 209 83 87 -37 -119 -150 -114 -42 -150
7448a50K70q8r8K03l18K25j9j60L38j70J00j32K3k3j62J29M2J87k65q1O3N0k5
$$ -150 120 32 -66 137 -181 44 25 -135 203 33 133 1 24 1 -161 -32 10 197 -68 -149 -86 -36 -61
7471f1J20L4k19k9J68n4K35j40mk66M09K1k66p3L5J44J44n0l10L48j82J16K0l64
$$ -61 59 93 -126 -155 13 -41 194 54 50 -216 193 214 -52 -125 -90 54 198 148 -162 186 4 120 140 -224
7495b24L26j95J76nj46mJ2j79M71o00M19k34J17K53m87K91j29M2J92k07j34L86
$$ -224 102 -93 83 78 -68 -72 -60 -239 232 -368 51 -183 -66 187 -300 -9 -138 -96 96 -111 -245 141
7517A41k05n0K67j66L60l89K51j32j16J36m30K53LM9j32J03J7K93j10j44J3j65
$$ 141 -64 -114 153 -13 347 -42 209 77 -39 97 -333 -80 -77 -28 -160 -57 -40 253 143 -1 12 -153
7539a53O9O3J47M9k84J15P0Mj69J10p7q0L43k82K2K5J05P6j60J82N1l37J84l3
$$ -153 -84 -21 126 175 -109 6 76 80 -89 21 -56 -136 207 -75 -53 -28 77 153 -7 175 226 -111 73 40
7563D0J1r1j49J32n3P0p5J24P3k0N8m3j53R1j13J57q3n3J10j67L54l22K24j55
$$ 40 51 -40 -189 -57 -110 -40 -115 9 82 62 120 77 -76 15 -98 59 -24 -77 33 -134 220 -102 122 -33
7587c3r3J03J40K3J07l42o7j3K33k9J76j80q6J31J25j79J64j72J74q7k25N1j62
$$ -33 -126 -23 117 140 247 -95 -162 -175 58 29 205 25 -61 70 195 16 180 8 182 95 -130 -79 -241
7610b41K88l20K12N9j14O1R1m5k20R9L15n52K36J80k44l6K80l7K39k17K5j93k7
$$ -241 47 -273 -61 -2 -116 -55 36 -9 -229 -130 185 -367 -131 49 -195 -231 49 12 251 34 59 -134 -161
7633a61K15j35qK75n9r5j6n3o4O6k83L70j62N5m7N39p20K4L51l06M16q0q8p5r5
$$ -161 54 -81 -89 186 127 32 16 -37 -101 -35 -318 52 -110 -55 -102 437 -283 -259 92 -214 202 122 34 -41 -136
7658a36r9K83k75N2J41J71j84K78k58O1j98J67P6K9l62K28m0r8K61r4J22p2N6
$$ -136 -235 48 -227 -175 -34 137 -47 231 -27 34 -164 3 79 108 -254 -26 -66 -164 97 3 125 53 109
7681A09m4m2j12l07N02J6J5j1k74l6m6o1J80J21K5l2j03O6Q6O9j95q9K25j31L80
$$ 109 65 23 -89 -396 106 122 137 126 -148 -184 -230 -291 -111 10 35 3 -100 -34 52 121 -74 -163 62 -69 311
7706C11m22J09K02k31j02l1K2J41o4Q6l13K13q3M24l12O5Q7k8j87K1L20j57K9
$$ 311 -111 -2 200 -31 -133 -164 -142 -1 -65 21 -292 -79 -162 262 -50 15 102 74 -113 -92 228 71 100
7729A00q2j25L37p7k24j91K72o0J04N6j25L8k7K10l22J75j83L71l04Rj48J69k33
$$ 100 18 -107 230 153 -71 -262 10 -50 54 110 -15 23 -4 206 -116 59 -124 247 -57 -48 -196 -27 -260
7752b60L09L3jj9J4q4j49L79l3j02o3J16k22j7K60R6m59J05L72l38J15k1K2M9
$$ -260 49 82 81 62 76 -8 -157 222 189 87 24 140 -82 -99 161 257 -202 -97 275 -63 52 31 53 102
7776A02l64M70j74j36k73N68n80N21j14K28j10k38R8j55N3K3J77o6Q5P4j60j87
$$ 102 -262 208 34 -102 -375 193 -387 134 20 248 138 -100 -2 -157 -104 -81 96 30 115 189 29 -158
7798a58J51m7M0M9k1o1q1K30p5o7l78M08n2n3J75o9R3n3m8L7J07j88J77l25O9
$$ -158 -7 -54 -14 35 14 -47 -128 102 27 -40 -418 -10 -62 -115 60 -9 84 31 -17 20 127 -61 116 -209 -140
7823a40J81Mm0J93k52jk38Q1J06J28j28M44k78L1k49J64j18K75r3k97N32j96j97
$$ -140 41 45 5 198 -54 -55 -293 -212 -106 22 -106 338 60 91 -158 6 -112 163 70 -227 305 109 -88
7846h8L1O2K64m66J43j80J66K56m33J10j1L1O1J16j04J05P8j73L35m48qK93o1
$$ -88 -57 5 269 -197 -54 -234 -68 188 -245 -135 -146 -115 -54 62 -42 63 141 -32 303 -145 -153 140 79
7869G9j06K17k59J11L0m5J37J11k91j6K1J58k11J15J66l25j0n1K31j23l4l2J21
$$ 79 -27 190 -69 42 72 27 164 275 -16 -32 -11 147 -64 51 217 -108 -118 -169 62 -61 -95 -127 -6
7892fr4l2O8J1M1L8j9j58K49j74j63J08J87j32M4OK69k49n1R2o3K7L3l5j7j14
$$ -6 -100 -132 -64 -53 -12 26 7 -151 98 -76 -239 -131 56 -76 -32 -26 243 -6 -57 35 -28 -1 32 -3 -20 -134
7918a34q8L64j73L53l01n0Lk18K10J36l23J68L7o0k41K47L4j49J43k51J43N1o1
$$ -134 -222 142 -31 322 21 -29 -26 -244 -34 102 -221 -53 -16 -76 -317 -70 -36 -185 -42 -293 -150 -99 -160
7941a60J85j48K09J35l24J13K83k58j22J14M0r4j65L43l54J51m8mJ54Nj70J61
$$ -160 25 -123 86 221 -103 10 293 35 -87 27 67 -27 -192 151 -203 -52 -100 -104 50 55 -115 46
7963D6r8j46O6n8K99j65n3NM00j85O2k22K95k95K11p0p5k3J8J51j08m3n8J80J35
$$ 46 -52 -198 -132 -190 109 -56 -109 -104 296 111 173 -49 246 -49 162 92 17 -6 12 163 55 12 -46 134 269
7988B69l35J02J2j1j1p7K38l50L75j71Qj68j03M50j59k24M24j80j63R0k3p3K58
$$ 269 -66 36 48 37 26 -51 187 -163 212 41 49 -119 -222 228 69 -155 269 89 -74 16 -7 -80 178
8011A78k58L72o02L01K2j14l9J1K7K1kk8N1J36j78j29K31q4Q0N2k77M72n26j12
$$ 178 -80 292 -310 -9 13 -101 -140 -129 -102 -81 -83 -111 -60 76 -102 -231 0 -84 -4 48 -229 243 -283 -395
8035c95L40j31M30k09p1n7j38K71L8P4k75N2K51l64L03l53l5M99l66K29r5K94
$$ -395 -55 -186 244 35 -36 -93 -231 40 78 152 -123 -71 180 -184 119 -234 -269 230 -136 93 -2 292
8057B92K4j97J11k08r0j16L01p1j71M00k16k7J43k32K44%k23J67m49L93M8Q3n4
$$ 292 316 119 230 22 -68 -184 117 46 -125 275 59 32 175 -57 187 187 -36 131 -318 75 123 206 152
8080A52n7k04O8J7p9L06k18j1j67L07P9k38K25k16j0j42J93O4m18L10J41j58K34
$$ 152 95 -109 -41 -24 -103 203 -15 -26 -193 114 193 -45 180 -36 -46 -188 5 69 -349 -39 102 -56 178
8103A78k18J90J12l22n9n3M0J00l2L0K10j67K1J20k03k40M08m0O8N9j73J07M5
$$ 178 -40 150 262 -60 -119 -172 -132 -32 -64 -34 176 9 30 150 -53 -293 115 75 143 202 29 136 181
8126A81q5m0P8j63L9j36J6L1J42J55m04K85j35j33j0K59j85j5J80m2J22Oj86j37
$$ 181 96 56 134 -29 10 -126 -110 -79 63 218 -186 99 -36 -169 -179 80 -105 -120 60 18 140 146 -40 -177
8150a77K59j57J39J02k93J13j34J93j22j1J27N4J33j88Q2J35m33R9K38m3j21L8
$$ -177 82 -75 64 166 -127 -14 -148 45 -77 -88 39 93 226 38 120 255 -178 -79 159 116 -5 33
8172C3q5j47N1J76J24k96J34j13J24J59j36j77m5K97k02n4L43q3k73
$$ 33 -52 -199 -148 28 152 -144 -10 -123 1 160 24 -153 -198 99 -103 -157 186 103 -170
8191a70
$$ Imaginary data points
##PAGE= N=2
##DATA TABLE= (X++(I..I)), XYDATA
0@%%%%%%%%%%%%%%%%%%%%%%%%%%%%%%JkLmNoQj1J2j4J6j7J8j9K2k4K7l1L3l8M2
$$ 0 0 0 0 0 0 0 0 0 0 0 0 0 0 0 0 0 0 0 0 0 0 0 0 0 0 0 0 0 0 0 1 -1 2 -2 3 -3 5 -6 6 -8 8 -9 9 -10 12 -12 15 -16 17 -21 21
51B1m5N0n4O0o7P3q1R1j02J16j31J49j75K08k54L27m54P41k89n234O030J565k282
$$ 21 -24 26 -28 32 -35 38 -43 48 -54 62 -69 80 -95 113 -141 186 -268 473 184 -5050 980 2545 263
74B63J485K558k214p91K920K96l037O46J668j967j811K033o76l019K53J630k291
$$ 263 1748 4306 2092 1301 4221 4517 1480 2126 3794 1827 16 2049 1373 -1646 -1393 237 -2054
91b054j596K076r0k672Q95K098j346j076K568N80j443Q49K972q69j169K543R98
$$ -2054 -3650 -1574 -1664 -4336 -3441 -1343 -2689 -3765 -1197 -617 -2060 -1211 1761 892 -277 2266 3264
108C264k050N52K463j245j802J731L64k411M2J207j877j578J431N1k572J08J275
$$ 3264 1214 1766 4229 2984 1182 2913 3277 866 908 2115 238 -1340 91 142 -2430 -2322 -1047
125a047j715r30J746O46j979P22K145r64j245K844R26j517P72K233r92r31J944
$$ -1047 -2762 -3692 -1946 -1300 -3279 -2557 -412 -1376 -2621 223 1149 -368 404 2637 1645 714 2658
142B658R10k430M17J850j347j753J602q3k249j13J113j359j631J081N44j996j02
$$ 2658 3568 1138 1555 3405 2058 305 1907 1824 -425 -538 575 -784 -2415 -1334 -790 -2786 -2888
159b888J768r49j052J589R89j550O49K205o80j193K172J013j470M36J843n87j482
$$ -2888 -1120 -2069 -3121 -1532 -543 -2093 -1444 761 81 -1112 1060 2073 603 1039 2882 2295 813
176H13J488N50j802j18J066j066j711J474L08k331m84J302q67j534J400O99j732
$$ 813 2301 2851 1049 931 1997 931 -780 694 1002 -1329 -1813 -511 -1378 -2912 -1512 -813 -2545
193b545K4J595m24j014J926R00j259M14J908l93q32J398Q42j335K10J293p90j415
$$ -2545 -2521 -926 -1350 -2364 -438 462 -797 -383 1525 1132 300 1698 2540 1205 1415 2708 1918 503
211E03R83P28j766m77R01o19j764P79O90j778m55J285l88j275R69J090j429K30
$$ 503 1486 2214 448 -29 872 253 -1511 -732 -42 -1820 -2275 -990 -1378 -2653 -1684 -594 -2023 -1793
229a793J843m65m03J071J266j317j48K175l00j321J381O17j520k88J246o94j284
$$ -1793 50 -415 -818 253 1519 202 54 2229 1929 608 1989 2606 1086 798 2044 1350 66
246F6N77N13j518p45J007l52j832Q73O04j262l91J343j93q02J037R57j003K69
$$ 66 643 1156 -362 -1107 -100 -452 -2284 -1411 -807 -2069 -2460 -1117 -1310 -2112 -1075 -118 -1121 -852
264h52J467M2p98J082J151j101%J494m13j200P57O48j400r43J392o56j649N36
$$ -852 615 657 -141 941 2092 991 991 2485 2072 872 1629 2277 877 -66 1326 670 -979 -443
282d43O53j407n89P46l54j225R49J256j197k18J286j60o79P89J422q95l3J597
$$ -443 210 -1197 -1786 -1040 -1394 -2619 -1670 -414 -1611 -1829 -543 -703 -1382 -593 829 -66 -99 1498
300A498Q2r48N99J061j212rJ002l53j218K31P05j208p52Q35p01j178M92Q93j573
$$ 1498 1580 632 1231 2292 1080 1071 2073 1720 502 733 1438 230 -522 313 -388 -1566 -1074 -181 -1754
319a754l19J096l47j116Q13J260r08n56K061O2p29Q66Q18n54k24J311K53j292
$$ -1754 -2073 -977 -1324 -2440 -1627 -367 -1275 -1831 230 292 -437 429 1247 693 469 1780 2033 741
337G41P01Q41j350l38Q26k48j352J27N87r26r51R74k27j302L59Q05q68m76J187
$$ 741 1442 2283 933 595 1421 1173 -179 -52 535 -391 -1342 -368 -595 -1897 -1538 -733 -1601 -2077 -890
356h90K26p20J60J644l72o33J222P44j115P30Q79o42o02J120M4j237K28P61p24
$$ -890 -664 -1384 -1224 420 48 -585 637 1381 266 996 1875 1233 631 1751 1795 558 786 1547 823
375H23j223J253k70j651L57O49r13j129J205k0j124N45Q43n68n39J448M15j112
$$ 823 -400 853 583 -1068 -711 -62 -975 -2104 -899 -919 -2043 -1498 -655 -1223 -1762 -314 101 -1011
393a011Q02J222n68k37J036N31j251O14J011n64j087O89N38j448k21P15q08j006
$$ -1011 -209 1013 445 208 1244 1775 524 1138 2149 1585 498 1187 1725 277 56 771 -37 -1043
411a043J007k23j262J18Q95o53p69R63L22j046K95J457l64p97J169M67n41M33
$$ -1043 -36 -259 -1521 -1403 -508 -1161 -1930 -967 -645 -1691 -1396 61 -303 -1100 69 536 -5 428
429D28R23J11r92Q66N93r16k11R68p45j156R41J14j210l84J084j012j024P02L52
$$ 428 1351 1462 470 1336 1929 1013 802 1770 1025 -131 810 924 -286 -670 414 -598 -1622 -920 -568
448e68p91l23R58n11n38R24N14o29J00J413k16o75R41M03l52K41N23l29n10Q64
$$ -568 -1359 -1682 -724 -1235 -1773 -849 -335 -964 -864 549 333 -342 599 1002 650 891 1414 1085 575 1439
468A439K15j129j18P00m77j024N17Q1j184k28J029n67j012O01N25o65m46J247
$$ 1439 1654 525 407 1107 630 -394 123 204 -980 -1208 -179 -746 -1758 -1157 -632 -1297 -1743 -496
486d96l2n69J055M98o18K10Q28o9n25O69N38o87J55O50l00r70M29L82q05n64N49
$$ -496 -528 -1097 -42 456 -162 48 876 807 282 951 1489 802 957 1607 1307 337 766 1148 343 -221 328
507C28k70j045L41O20j268j39R53l53q32O54O27r44K15R28K23o35Q82O64o68K6
$$ 328 58 -987 -646 -26 -1294 -1433 -480 -833 -1665 -1011 -384 -1328 -1113 -185 38 -597 285 949 281 307
527C07J126k64o38P91K45q25l86J009l11j322L39M18q67m42R78m67j296O29N58
$$ 307 1433 1169 531 1322 1567 742 356 1365 1054 -268 71 489 -378 -820 158 -309 -1605 -976 -418
546d18p99m65J185m4m49Q9J086o45n5J080m3n80R34N60o33m44J223m26n34J30
$$ -418 -1217 -1682 -497 -541 -990 -901 185 -460 -515 565 522 -58 876 1436 803 359 1582 1156 622 752
566G52M67o22p20P50k75j124N37K71q42m91O68k12o59L36Q39q41j38J173j79k48
$$ 752 1219 597 -123 627 352 -772 -235 36 -806 -1297 -629 -841 -1500 -1164 -325 -1166 -1304 -131 -310 -558
586e58L94P48m67m4J094j2m45L18M55m67l99O78p5r91L02K40o19q68O16O4q76
$$ -558 -164 584 117 73 1167 1155 710 1028 1483 1016 617 1295 1220 229 531 771 152 -716 -100 -36 -912
607i12J20M70q01n69J142N7r24N78N87j70l81Q33O88j222P09R41l07o39J179j46
$$ -912 -792 -322 -1123 -1692 -550 -493 -1417 -839 -252 -422 -803 30 718 -504 205 1146 839 200 1379 1233
627A233p04L70M93n48n58N57n4j082N2N34o66o02N99j04j036N19L98m17k40P36
$$ 1233 529 899 1392 844 286 843 789 -293 -241 293 -373 -975 -376 -480 -1516 -997 -599 -1016 -1256 -520
647e20J76q67O05J149n80l21Q86K48m28J95O96j13o05O04K08j121M37N14p97p59
$$ -520 -344 -1211 -606 543 -37 -358 528 776 348 543 1239 1126 521 1125 1333 212 649 1163 366 -393
667c93O50r1p33j11M74m90p34N07K95n23pQ32n10l19P40N10n72M70Q49j99l70
$$ -393 257 166 -567 -678 -204 -694 -1428 -921 -626 -1149 -1156 -324 -834 -1153 -413 97 -475 -5 844 645 275
688B75N45L51n19j4Q60n93n69M98K11r48J39K31l37q74M57K11j115K88N65o17
$$ 275 820 1171 652 638 1498 905 336 834 1045 97 236 467 130 -744 -287 -76 -1191 -903 -338 -955
708i55k50N06J38n38J77P46j43j82M07Q67o42J06P52P1o39Q47m9p76J62M01m59
$$ -955 -1205 -699 -561 -1099 -922 -176 -319 -501 -94 773 131 237 989 1060 421 1268 1219 443 605 1006 547
729E47l56K45J9p84l31Q49p56l58K71L61r87K1R91n16l67O52N88n29n6P42j1n73
$$ 547 191 436 455 -329 -660 189 -567 -925 -654 -293 -1280 -1259 -268 -784 -1151 -499 89 -440 -496 246 235 -338
751c38Q81K91m71K50R28n32m86M52K79p38m41N99n69n75M92K17r73j52M79k95
$$ -338 543 834 363 613 1541 1009 523 975 1254 516 75 674 105 -470 22 239 -734 -886 -407 -702
771g02m71M36N65p73j0M87K21l91M44O23k65j60Q86k99l36M00R74j198m0N58j24
$$ -702 -1173 -737 -172 -945 -955 -468 -247 -638 -194 429 164 4 890 591 255 655 1629 431 391 949 825
792H25n48L34J86p63l85P59l88q74K46L35l21n16P08M9p84L74M32k31j86P27P5
$$ 825 277 611 797 34 -351 408 20 -854 -608 -273 -594 -1110 -402 -353 -1137 -763 -331 -562 -748 -21 54
813E4m51O55P28p08ON69j2o42O69L95q73j38L03p6n77K4N33q14j44K70M4r02M34
$$ 54 -397 258 986 278 284 853 841 199 868 1263 390 252 555 479 -98 -74 459 -355 -499 -229 -185 -1087 -653
836f53K99n81q2Q14n9l68L79L92m48R6M50Q2l07O03K50n78J40M00P6n49J30N16
$$ -653 -354 -935 -1017 -203 -262 -630 -251 141 -307 -211 239 321 14 617 867 289 429 829 905 356 486 1002
858A002o66l45N47l71p75K86K54n90l26N74m21l37N83L49m72q4N36J76k14K20
$$ 1002 336 -9 538 167 -608 -322 -68 -658 -984 -410 -831 -1168 -585 -236 -708 -792 -256 -80 -294 -74
878g4O39l64n5N54L4l70R5P90p33j32O05n43k04Q1P6p20J13K26J37r10K35K95
$$ -74 565 201 146 700 734 364 459 1249 516 384 989 446 242 323 399 -321 -208 18 155 -755 -520 -225
900b25m81l09M11L26r39O17L98j64j83O94M03n58M01M31k83n63O17L57o02J77
$$ -225 -706 -1015 -604 -278 -1217 -600 -202 -366 -549 145 548 -10 391 822 539 -24 593 950 348 525
920E25L99l04m62L82j07k94k75N97q93l76N23J03o68p3O53n06M0K88N17q01L39
$$ 525 924 620 158 540 433 139 -136 461 -432 -808 -285 -182 -850 -923 -270 -776 -736 -448 69 -732 -393
941c93M62O8n71Q12Ql62N27M82l03m54L09M26m74o9J06n82r8L22n3n83j80M64
$$ -393 69 137 -434 378 386 24 551 1033 730 276 585 1011 537 468 574 -8 -106 216 163 -420 -600 -136
963a36l67j55K73R3o45k0M86j48r2N96J91k60J48N11j85%M45K0k59K0J89r8m90
$$ -136 -503 -658 -385 -292 -937 -957 -471 -619 -711 -115 76 -184 -36 475 290 290 735 755 496 516 705 607 117
986A17L56J42o36j7M14m39n38M91M3q34J92M15o17n5M11J71k90J60O94k61k73
$$ 117 473 615 -21 -38 376 -63 -601 -110 -67 -901 -709 -294 -911 -966 -555 -384 -674 -514 180 -81 -354
1007c54O42O8j88K79M00n30Q4K74K71n43R7K74n74m15P36l4o47q6J05k02m84M69
$$ -354 288 356 168 447 847 317 401 675 946 403 500 774 200 -215 521 487 -160 -246 -141 -343 -827 -358
1029c58J6m09K32M31k51m20M49K89n00J17Q01j40k90M42L6J10j22L09L2o49M94
$$ -358 -342 -751 -519 -88 -339 -759 -310 -21 -521 -404 397 257 -33 409 445 555 433 742 774 125 619
1050F19K9p02K31L27k95m04K36J78n26m74N53k16j91P7K41m20K0L38M8j82M76
$$ 619 648 -54 177 504 209 -195 41 219 -307 -781 -228 -444 -635 -558 -317 -737 -717 -379 -331 -513 -37
1071c7L63l04J98K67J72n22L19J91m57j2N51p6q17L88J69n29j84M46l48j75J60
$$ -37 326 22 220 487 659 137 456 647 190 178 729 653 -164 224 393 -136 -320 126 -222 -397 -237
1092b37m6o24l7O74o1m43M28J76m92K83O22j60l72N21L83m68K05M17J1o70K91
$$ -237 -283 -907 -944 -270 -331 -774 -346 -170 -662 -379 243 83 -289 232 615 147 352 769 780 110 401
1113D01J52k40p5L34p8n34M2J93n94k15N20j61l72K48K20m91o3K64J17k25N00
$$ 401 553 313 238 572 494 -40 2 195 -399 -614 -94 -255 -627 -379 -159 -650 -713 -449 -332 -557 -57
1134e7J01k41k98R60K8m67N75j67j77N7K54k96n3J97k6L5l59J49j22p36J80N07
$$ -57 44 -197 -495 465 493 26 601 434 257 314 568 272 219 416 390 425 66 215 93 -643 -463 44
1156D4o94j00P38n61l23L89M15m25j2L70J20l81M80M46q18L54N17J11m51J68M54
$$ 44 -650 -750 -12 -573 -896 -507 -92 -517 -529 -159 -39 -420 60 506 -312 42 559 670 219 387 841
1177H41l87m06O37j36n45p5L80l52j08K03k90l05nM02m74k29M85pk24L73qK39
$$ 841 454 48 685 549 4 -71 309 -43 -151 52 -238 -543 -548 -146 -620 -849 -364 -371 -595 -222 -230 9
1199Ij75J58L35N7j57J82j64l69O96J31l96J85L48k59p42M96r7j24j89M49n51
$$ 9 -166 -8 327 384 227 409 245 -124 572 703 307 492 840 581 -161 335 238 114 -75 374 -177
1220a77j07J26j15n43J76O33n58k7K19K84l91K37M29rm30N95K77m00K17L32k27
$$ -177 -284 -158 -273 -816 -640 -7 -565 -592 -373 -89 -480 -243 186 177 -253 342 619 219 436 768 541
1241E41l68M51K13p79J2L53l08j42j3L9j56m76P69o30k02L01J36l06k91Q46l85
$$ 541 173 624 837 58 70 423 115 -27 -40 -1 -157 -633 136 -494 -696 -395 -259 -565 -856 -10 -395
1262c95M2N01J98m81J60M77j63n5K13M5j75K61J56k03l70J05J40n41K30J45m02
$$ -395 -353 148 346 -135 25 502 339 284 497 542 367 628 784 581 211 316 456 -85 145 290 -112
1283a12k28J99o0n07K62L83k01m01N21l4r2l3K94J64j56j5M84l81J60L53k87j78
$$ -112 -340 -141 -201 -708 -446 -63 -264 -665 -144 -178 -270 -303 -9 155 -1 -16 468 87 247 600 313 135
1305A35K32M11m87j13K52j99n92N24j74k81r5M62m46j62L28m6k35Q3K00j64q2
$$ 135 367 778 291 178 430 231 -361 163 -11 -292 -387 75 -371 -533 -205 -251 -486 -403 -203 -367 -449
1326d49K13J02J00k52M76O0m79M81L49k36L02j28n5j89J03J92n80K73Q5n59q5
$$ -449 -236 -134 -34 -286 190 250 -229 252 601 365 667 539 484 295 398 590 10 283 368 -191 -276
1347b76M79k64n74J57J48kj74N5M04m01J4K54P1j69n9N21k26L3L03J60l90M58
$$ -276 203 -61 -635 -478 -330 -332 -506 -451 -47 -448 -434 -180 -109 -278 -337 184 -42 -9 294 454 64 522
1369E22J15m85j89L75J01o77L28M13o46L5M39l70m57J29L33m31N9K41r5k72J97
$$ 522 637 152 -37 338 439 -238 90 503 -143 -108 331 -39 -496 -367 -34 -465 -406 -165 -260 -532 -335
1390c35J28N4j0K18o2r5L86L09n40J51N29l66N1J61R8l88j52N2K5l04q7K40m41
$$ -335 -207 -153 -163 55 -7 -102 284 593 53 204 733 367 418 579 677 289 137 189 214 -90 -177 63 -378
1413c78j28N53l01j60r0L73k25m72P48j33k43K50K37k59J92Q9J21M6P9L00k67
$$ -378 -506 47 -254 -414 -504 -131 -356 -828 -80 -213 -456 -206 31 -228 -36 53 174 220 299 599 332
1434C32R5Q7q4k33lK46l56j23J49M0m46O4J73l60j28N00l00k38M65k3j1k62K05
$$ 332 427 514 430 197 194 440 84 -39 110 150 -296 -232 -59 -419 -547 -47 -347 -585 -120 -143 -154 -416 -211
1457b11L02l10K48J43Q1j72K75K42m30L45p0j22r9J24J41n85J42J24j02k41o3
$$ -211 91 -219 29 172 253 81 356 598 168 513 443 321 222 346 487 -98 44 168 66 -175 -238
1478b38O5l04J61K74n68K27J49j36n1L91j69j6K11K06j37J9o3M77q4k88M21m4
$$ -238 -173 -477 -316 -42 -610 -383 -234 -370 -421 -30 -199 -215 -4 202 65 84 21 498 414 126 547 503
1500E03l37p1M30m64mL2J4k88M5O5p1m09L15N6m49M11p6P2m19M41J88k29O4M67
$$ 503 166 95 525 61 57 89 103 -185 -140 -75 -146 -555 -240 -184 -633 -222 -298 -226 -645 -204 -16 -245 -181 286
1524B86k51l1J38M01k79k13L99j12k67O45l81j88J68n9l32k6Q2J10l44k40N96
$$ 286 35 4 142 543 264 51 450 338 71 716 335 147 315 256 -76 -102 -20 90 -254 -494 102
1545A02l16l24N17j01k02RM6J72k89M17j5l5J84J13j22j90P86j89k98R3LL6o00
$$ 102 -214 -538 -21 -122 -324 -315 -269 -97 -386 31 16 -19 165 278 156 -34 752 563 265 358 361 397 -203
1568b03L37J68k54J29K8o5o24K82L09j48k09J75k73N5O0L05l49Q8P4J29m59N55
$$ -203 134 302 48 177 205 140 -484 -202 107 -41 -250 -75 -348 -293 -233 72 -277 -189 -115 14 -445 110
1590A10M42l18k21L98j24L0k0L38n46J66K37j83n61K24JJ93k19j39J61k73R1J79
$$ 110 552 234 13 411 287 317 297 635 89 255 492 309 -252 -28 -27 166 -53 -192 -31 -304 -213 -34
1612c4l63Q1L94j34k66L03K53l72K46K42j11j64j5P5K67j20J16j42L4k0K44m25
$$ -34 -397 -316 78 -56 -322 -19 234 -138 108 350 239 75 60 135 402 282 398 256 290 270 514 89
1634H9l8k61J91j54M0k9J19l13P2O8m14J81K30k15J87K51k44P5jL03j47O8L41
$$ 89 51 -210 -19 -173 -133 -162 -43 -356 -284 -216 -630 -449 -219 -434 -247 4 -240 -165 -166 137 -10 58 399
1657C99k85Q1M1J52j73k00L19k4k65M16o7m00n4o6Q0m33N86k76j86K2J02j07n13
$$ 399 114 195 236 388 215 15 334 310 45 461 394 -6 -60 -126 -46 -479 107 -169 -355 -333 -231 -338 -851
1680h51P57p4q4o1L92J90j86M9J09J33j18K59P5l47K0J76l3l95M53k54k48j58
$$ -851 -94 -168 -252 -313 79 269 83 132 241 374 256 515 590 243 263 439 406 11 464 210 -38 -196
1702a96L55l43k93L91O7n75M21J02l37K8L35j44k50J85J78L9L8K02j2j72L02q3
$$ -196 159 -184 -477 -86 -19 -594 -173 -71 -408 -380 -45 -189 -439 -254 -76 -37 1 203 191 19 321 238
1724B38J03k6NJ72m49R5K18m05K25O3k83M7k72K13j13l39M53oj67p7J96q9P1o7
$$ 238 341 315 320 492 43 138 356 -49 176 239 -44 3 -269 -56 -169 -508 -55 -61 -228 -305 -109 -198 -127 -194
1748a94J48j2J50k1K56m25N28J32j78k84J78p7m5N3Jk76J22k9l97K04J5R7j91
$$ -194 -46 -58 92 71 327 -98 430 562 384 100 278 201 156 209 210 -66 56 27 -370 -166 -151 -54 -245
1771b45J11l0K2l74M25j87J55k39M68k6l14K99L9K5J53J8k10J85P3j48j6m9K65
$$ -245 -134 -164 -142 -516 -91 -278 -123 -362 106 80 -234 65 104 129 282 300 90 275 348 200 184 135 400
1794D00j16k54K8M0k94J4K89k74j41L86j65m68J48M02j15o1q4J56J22l87N86q1
$$ 400 284 30 58 98 -196 -182 107 -167 -308 78 -87 -555 -407 -5 -120 -181 -265 -109 13 -374 212 131
1816A31l41O31k28k06K38J05M4l22J64n2j69K70j08j05k72K3K13q5N8l80L27j99
$$ 131 -210 421 193 -13 225 330 374 52 216 164 -5 265 157 52 -220 -197 16 -69 -11 -391 -64 -263
1838b63K61q9j21J0K37j42j6J96ok6j62J89J79k35l4K87j63J2J54l3j9O6j19j33
$$ -263 -2 -91 -212 -202 35 -107 -123 73 67 41 -121 68 247 12 -22 265 102 114 268 235 216 282 163 30
1862C0j52O7p6N9k46L41k63L3o1J85l62J92J35k02pM42l74L81j86L11r4M7K03
$$ 30 -122 -55 -131 -72 -318 23 -240 -207 -268 -83 -445 -253 -118 -320 -327 115 -259 122 -64 247 153 200 403
1885D03k96mK85n6m00K91j75j53P0N3k7k12o6M73m77O7L50J2m74R7J49L1k62M65
$$ 403 107 103 388 332 -68 223 48 -105 -35 18 -9 -221 -287 186 -291 -224 126 138 -336 -239 -90 -59 -321 144
1909A44j9j82P0K43l08J10O5J54l61K35K66l06j01J49J44n1l42K33k8k44P1j62
$$ 144 125 -57 13 256 -52 58 123 277 -84 151 417 111 10 159 303 252 -90 143 115 -129 -58 -220
1931b20Q9l23L60l1k39K1L36k16J47j43N5o7K54J89o5R1p0n9K7J33rj38r9J81
$$ -220 -131 -454 -94 -125 -364 -343 -7 -223 -76 -219 -164 -231 23 212 147 238 168 109 136 269 260 122 23 204
1955B04R6l8k63J70j02l4qK5m87L27J6M4l12O5L29m46L17K7j74Q8M10j66j48J81
$$ 204 300 262 -1 169 67 33 25 50 -437 -110 -94 -50 -362 -297 32 -414 -97 -70 -244 -156 254 88 -60 121
1979A21J72j71N8J68k09K26k29m4%J0J01j49r1R9J5k87l0L48j00l89J55L0j17
$$ 121 293 122 180 348 139 365 136 92 92 102 203 54 -37 62 77 -210 -240 108 8 -381 -226 -196 -313
2002c13J1K55N5q2L3j36L79m01L63k02j48O03Q7m58J15n2J26q4N9j04j8j17L03
$$ -313 -302 -47 8 -74 -41 -177 202 -199 164 -38 -186 417 504 46 161 109 235 151 210 106 88 -29 274
2025B74m06p1K36n5r0k01L94n4n8r0M7l15RM72J22k94J78l0k86K09J94K26n81
$$ 274 -132 -203 33 -22 -112 -313 81 27 -31 -121 -74 -389 -380 92 214 -80 98 68 -218 -9 185 411 -170
2048a70L5K99J17j58J90M8o56M64j7k38p2RJ37k95K92j12j00m5K11n2q4j70L14
$$ -170 -135 164 281 123 313 361 -295 169 152 -86 -158 -149 -12 -307 -15 -127 -227 -272 -61 -113 -197 -367 -53
2071e3l4j20J58K71j55j6J01L25m81L00l49J94K69k84J00m25J21J31k19K08K24
$$ -53 -87 -207 -49 222 67 51 152 477 -4 296 -53 141 410 126 226 -199 -78 53 -166 42 266
2092B66n93J47K6l8j93J33J59j58j14K40J51o3J71L3l78J76J98j9k00J16K87P3
$$ 266 -327 -180 -154 -192 -385 -252 -93 -251 -365 -125 26 -37 134 167 -211 -35 163 144 -56 60 347 420
2114D20m56J43M92m54k53Q4K25l01J1J30l22Q8L4K8L3p6K20k11Q1m4M7Q6j36L08
$$ 420 -36 107 599 145 -108 -24 201 -100 -89 41 -281 -193 -159 -131 -98 -174 46 -165 -84 -128 -81 5 -131 177
2138A77k05K8J82j08k17K52M72n29q4J94p6K2R7m58M31l45L37n35J02L39j97p4
$$ 177 -28 0 182 74 -143 109 581 52 -32 162 86 108 205 -253 178 -167 170 -365 -263 76 -121 -195
2160a95p7K18k1j94J70M7k1O9K5Nk24O30j22k73n6M11m07J86o0L29l06P2l2k14
$$ -195 -272 -54 -75 -269 -99 -52 -73 -4 21 26 -198 432 310 37 -19 392 -15 171 111 440 134 206 174 -40
2184d0J0O2p4k98K19N5O6r3Q9l22M08m20J27j5J22L67k91Jl34O63J48m57K54J73
$$ -40 -30 32 -42 -340 -121 -66 0 -93 -4 -326 82 -338 -211 -226 -104 263 -28 -27 -361 302 450 -7 247 420
2208D20k56j33J81k8j56p3Q7K5k22M31k75j19J08j57M1O2N3k41l5J94j09k6J35
$$ 420 164 31 212 184 28 -45 42 67 -155 276 1 -118 -10 -167 -126 -64 -11 -252 -287 -93 -202 -228 -93
2231i3J55j9o5J16p3n4j82M66j14J50K1R6q8k71K8K03l56L5J69l52J56n3J38j10
$$ -93 62 43 -22 94 21 -33 -215 251 137 287 308 404 316 45 73 276 -80 -45 124 -228 -72 -125 13 -97
2255i7N7q6j25k5J16J37n28L49J60Q5k04QQ2J12j73K04J42kk31R5K40k08K65l84
$$ -97 -40 -126 -251 -276 -160 -23 -551 -202 -42 43 -161 -153 -71 41 -132 72 214 212 -19 76 316 108 373 -11
2279a1l6p7r6n4J20j4k43R7J91j06OJ33J62m43N8L67j67j84P5J73M5j84R9P8R
$$ -11 -47 -124 -220 -274 -154 -168 -411 -314 -123 -229 -223 -90 72 -371 -313 54 -113 -297 -222 -49 -4 -188 -89 -11 -2
2304bO9K94l95O3J45J39l96pL40o5j94j2m7j11k3L10k42m9k81J66K94m42L91N9
$$ -2 67 361 -34 29 174 313 -83 -90 250 185 -9 -21 -68 -179 -202 108 -134 -183 -464 -298 -4 -446 -55 4
2328Dl19K77j32R5J81M9R2l73J44l5J06Q2Q8k61R0K2k35R8N2K6j88M5j37L43k82
$$ 4 -315 -38 -170 -75 106 155 247 -126 18 -17 89 171 259 -2 88 110 -125 -27 25 51 -137 -92 -229 114 -168
2353a68j29M45m85j56O87k83j51M8P5J10L2J42l4k55k66O49N2m69K39l6Qj81M82
$$ -168 -297 148 -337 -493 194 -89 -240 -192 -117 -7 25 167 133 -122 -388 261 313 -156 83 47 55 -126 356
2376C56k2m41L23j8k03q8L14k31j52P7l4j80K27l2K5j36L46l40J4J96Q0k6j03
$$ 356 334 -107 216 198 -5 -93 221 -10 -162 -85 -119 -299 -72 -104 -79 -215 131 -209 -195 1 81 55 -48
2399d8J06J08q0J87j90J09j97J49j0q4L07k01j28j81J51K0k46K39k5n2pr2J60
$$ -48 58 166 86 273 83 192 -5 144 134 50 357 156 28 -153 -2 18 -228 11 -14 -66 -73 -165 -5
2422ej35r4J26L44j6j81nQ0j05O1r4L06j08r3J4R7J08O8m74L1L23P5l20Pj43L43
$$ -5 -140 -234 -108 236 220 39 34 114 9 70 -24 282 174 81 95 192 300 368 -106 -75 248 323 3 10 -133 210
2448B10l15M1j37K37J46n29J48k7L14r9J0Q5k24K52n5K98k46j69K52l28L74p8
$$ 210 -105 -64 -201 36 182 -347 -199 -226 88 -11 -1 84 -140 112 57 355 109 -60 192 -136 238 160
2470A60Q8Qk24J37n6k33L76l42K71p1k30N1k61L55Lj28j3M0j65O9J92J38r5j3
$$ 160 248 256 32 169 113 -120 256 -86 185 114 -116 -65 -326 29 32 -96 -109 -69 -234 -165 27 165 70 57
2494E7J54jl14K26K26k87j48J53J77m69K88J11l35L36j26N7j48M1L0n2R7n2k10
$$ 57 211 210 -104 122 348 61 -87 66 243 -226 62 173 -162 174 48 105 -43 -2 28 -24 73 21 -189
2517a89j8J80k26M6J52L5k8m02L58o8J64P3J25n8L7o4R4j16J5o8n1J99j56Q3J21
$$ -189 -207 -27 -253 -207 -55 -20 -48 -450 -92 -160 4 77 202 144 181 117 211 95 110 42 -9 190 34 117 238
2542B38k4J60k36l04Q2q6Q3j72J49J53l24J47K74k04J40q7O6J56k46J31O6n9O1
$$ 238 214 374 138 -166 -84 -170 -87 -259 -110 43 -281 -134 140 -64 76 -11 55 211 -35 96 162 103 164
2565A64r3M8n0QK20k72J66k17l0l9M01n39J20J12j51P9j42K59n3p0op0K78j9Q6
$$ 164 71 119 69 77 297 25 191 -26 -56 -95 306 -233 -113 -1 -152 -73 -215 44 -9 -79 -85 -155 123 104 190
2590A90J71n32M82j26j33pJ68j45M3k0jj50O2L7j82K49Q6l59j08R7L43o50O9K39
$$ 190 361 -171 311 185 52 45 213 68 111 91 90 -60 2 39 -143 106 192 -167 -275 -178 165 -485 -416 -177
2614a77J29j85M14k27k69L06P8p3Q4j27M69n10O9J34J71k26M9M57l74k48K62R3
$$ -177 -48 -233 181 -46 -315 -9 69 -4 80 -47 422 -88 -19 115 286 60 109 566 192 -56 206 299
2636B99k55k69L59j76K3K94k40q5J54k3k02j50K34Qj71P3K50j09n8K96j60k35
$$ 299 44 -225 134 -42 -19 275 35 -50 104 81 -121 -271 -37 -29 -200 -127 123 14 -44 252 92 -143
2658a43L34On5j56j9K99l87M33p3n0j67K12j00k23J15j43R3j35P3M7j51J80k73
$$ -143 191 197 142 -14 -33 266 -121 312 239 189 22 234 134 -89 26 -117 -24 -159 -86 -39 -190 -10 -283
2681b83K23k45M63k39k9j06K73J85j48k3N8P8j04k57O1J33n8K6j16Q7q6k06L89
$$ -283 -60 -305 158 -81 -110 -216 57 242 94 71 129 207 103 -154 -93 40 -18 8 -108 -21 -107 -313 76
2704G6m1j51J90l10J77P3m34L79l7J13r5J18j03o8K37p5R2j77J26k1j49K45j51
$$ 76 35 -116 74 -236 -59 14 -420 -41 -78 35 -60 58 -45 -113 124 49 141 -36 90 69 -80 165 14
2727A4P2J5K28j32p0j16R5J01j96k53J31j68K98k4l5O7p0O0n0n0p8J2N0K54r3
$$ 14 86 101 329 197 127 11 106 207 11 -242 -111 -279 19 -5 -40 27 -43 17 -33 -83 -161 -149 -99 155 62
2752F2j47QK07j32r3K94j69j14N1o5J11K04j29k73N9J94l21J29O8J12q5o3m5L03
$$ 62 -85 -77 130 -2 -95 199 30 -84 -33 -98 13 217 88 -185 -126 68 -253 -124 -56 56 -29 -92 -137 166
2776A66k34K59l70N1J99K29k28j52Q7K94l01j67M02n0l32L64k12p2Q5N4k12K62
$$ 166 -68 191 -179 -128 71 300 72 -80 7 301 0 -167 235 185 -147 217 5 -67 18 72 -140 122
2798A22m02K97p6l40K93K57j26j14o2J51p9L6J22k66M87m06QK20j27J44l11J73
$$ 122 -280 17 -59 -399 -106 151 25 -89 -151 0 -79 -43 79 -187 300 -106 -98 122 -5 139 -172 1
2820Am1K34j78j2R3k0o1k57J63M25l63J69l26q2J69n4J62l6R8M8j69L1j60m8J58
$$ 1 -40 194 16 4 97 77 16 -241 -78 347 -16 153 -173 -255 -86 -140 22 -14 84 132 -37 -6 -166 -214 -56
2845e6N5K28J17k88j48K88j5j10M1K28l64N7q9J82r7K56k36j27K90j70o8R5j96
$$ -56 -1 227 344 56 -92 196 181 71 112 340 -24 33 -56 126 29 285 49 -78 212 42 -26 69 -127
2868a27j96O5L41q6m20M03j09K18J34j46j93o5L87l27l0K18m1O3q5K41m3q2J14
$$ -127 -323 -258 83 -3 -423 -20 -129 89 223 77 -116 -181 206 -121 -151 67 26 89 4 245 202 120 234
2891B34K0k51O2j45Q9P6p4k3k61K06M1P7k06L75k78On8J62R7k07M8m5j18j07M89
$$ 234 254 3 65 -80 9 85 11 -12 -273 -67 -26 51 -155 220 -58 -52 -110 52 149 -58 -10 -55 -173 -280 209
2916B09j74j83M73k99j86J99J80j55J82k59k0J83k49J17k79K96J73j66p5K56k46
$$ 209 35 -148 325 26 -160 39 219 64 246 -13 -33 150 -99 18 -261 35 208 42 -33 223 -23
2937b3j09K45l95M39k42l1J07Q0R5K2J07m07J0K66r7K54n69P31m55K17M7k44J
$$ -23 -132 113 -282 157 -85 -116 -9 71 166 188 295 -112 -102 164 67 321 -248 483 28 245 292 48 49
2960D9q4K26m10OJ04m6O0K79m92J76J11J5k2j46K43m9K4r6K6J43P9O6l39l1K04
$$ 49 -35 191 -219 -213 -109 -155 -95 184 -308 -132 -21 -6 -28 -174 69 20 44 -52 -26 117 196 262 -77 -108 96
2985I6k10L17j96K1J2j13K5j61K50q0j44K7J08q0J87m1J2j06J77j68o6J96l23
$$ 96 -114 203 7 28 40 -73 -48 -209 41 -39 -183 -156 -48 -128 59 18 30 -76 101 -67 -133 63 -260
3008b60Prp1L00L3J37J41n5L2P2k38Jmq9N1pP8n9j19J27o1n7J54o3j19Q5L19o34
$$ -260 -253 -262 -333 -33 0 137 278 223 255 327 89 90 86 -3 48 41 119 60 -59 68 7 -50 104 41 -78 7 326 -308
3036c08K95j55jn9M7K13k47L32L1k51O9j96L92P7k92K60k48J77k26J84r9J13k3
$$ -308 -13 -168 -169 -228 -181 32 -215 117 148 -103 -34 -230 162 239 -53 207 -41 136 -90 94 -5 108 85
3059H5J07kj19j74k6J06j36J95j94J05J08k7K1J97l54K17l07J55J35l69L37o4
$$ 85 192 190 71 -103 -129 -23 -159 36 -158 -53 55 28 49 246 -108 109 -198 -43 92 -277 60 -4
3081dn2q9O9J28j5J66Rm8k60J33j91J56l82M57p3k04L17k68R2M1O8j96J63l5j45
$$ -4 -56 -145 -76 52 37 203 212 164 -96 37 -154 2 -380 77 4 -200 117 -151 -59 -18 50 -146 17 -18 -163
3106a63L8M6K44j89J05j16Q7J13k04M06m19P9L4q0p7J78k3J0k70M55k42k87K98
$$ -163 -125 -79 165 -24 81 -35 52 165 -39 367 -52 27 61 -19 -96 82 59 69 -201 254 12 -275 23
3129B3j67K52l15J68p3j17J14n2J70j04L8J02l34K28K86j00l5n7J93l09J4N19
$$ 23 -144 108 -207 -39 -112 -229 -115 -167 3 -101 -63 39 -295 -67 219 119 84 27 220 -89 -75 444
3151D44l24m5J5k12O7m1J6R4j13J31n4O4K06k75N2j89N2K56j23o2k2K76j84K3
$$ 444 120 75 90 -122 -55 -96 -80 14 -99 32 -22 42 248 -27 25 -164 -112 144 21 -41 -63 213 29 52
3175E2LLq8K05k26R7p9L8j9j49K29J13k01L75m72M4j24K42p3j66K59j2m5q7J50
$$ 52 55 58 -30 175 -51 46 -33 5 -14 -163 66 179 -22 353 -119 -75 -199 43 -30 -196 63 51 6 -81 69
3200F9o9r9j91J44M01j88j68K44L5%l03oK52KM2m3M4o1j12N2k0l8k32L74k03r
$$ 69 0 -99 -290 -146 255 67 -101 143 178 178 -125 -131 121 123 165 122 166 105 -7 45 25 -13 -245 129 -74 -83
3226h3P9P3j36N5p2J63j45P2j6pj02J75j56J27q2J02K39m40J58L56r1j02j37P2
$$ -83 -4 69 -67 -12 -84 79 -66 6 -10 -17 -119 56 -100 27 -55 47 286 -154 4 360 269 167 30 102
3250A02k64K87K12l84r8K26p6q1M0N4k05K86jr1j14o1Q1O1J41j83N3j26L39r6
$$ 102 -162 125 337 -47 -145 81 5 -76 -36 18 -187 99 98 7 -107 -168 -87 -26 115 -68 -15 -141 198 102
3274A02j06M7j11K97k56J82P4l04j20J87K2r5J98k38J31k3K49l04L31k28k4J55
$$ 102 -4 43 -68 229 -27 155 229 -75 -195 -8 14 -81 117 -121 10 -13 236 -68 263 35 11 166
3296A66j83L13m78K5q4K11k72J49o6L09r5M41l14k44J09K3k0O9J81l13n5K09k50
$$ 166 -17 296 -182 -157 -241 -30 -302 -153 -219 90 -5 436 122 -122 -13 10 -10 59 240 -73 -128 81 -169
3319a69k8K00L7j00K55l73Q9J37j00J24j20n2L35l17O3j26P1K29l16J16J71j59
$$ -169 -197 3 40 -60 195 -178 -89 48 -52 72 -48 -100 235 -82 -19 -145 -74 155 -161 -45 126 -33
3341c3r6O6J71J83j86q5K20j63J6j88N1l0n8J12k40K1M0J21k0N4m2o1J07kQ8l63
$$ -33 -129 -63 108 291 105 20 240 77 93 -95 -44 -74 -132 -20 -260 -239 -199 -78 -98 -44 -86 -147 -40 -42 46 -317
3367c17L66N9p9J12K57k94j91K50p7L0P4Mk20n6QJ25L4K35n37M3j75K45l5o9K8
$$ -317 49 108 29 141 398 104 -87 163 86 116 190 194 -26 -82 -74 51 85 320 -217 -174 -349 -104 -139 -208 -180
3392a80j50L64j88R9k31R0L78j02kr7K3o3J46k0j31J69k93JL18k24J78N3J8o7
$$ -180 -330 34 -154 -55 -286 -196 182 80 78 -19 4 -59 87 67 -64 105 -188 -187 131 -93 85 138 156 89
3416H9j00j48k15M82j65j33J45j3J66j05R5Q5j08k4j6l19R5L71l82q7L04K5j61
$$ 89 -11 -159 -374 108 -57 -190 -45 -58 108 3 98 183 75 51 35 -284 -189 182 -200 -287 17 42 -119
3439a19N6J19R7j19J16M4J4m80K09O8J75k14L70k0n66J54L00j71N7j33j37J24
$$ -119 -63 56 153 34 150 194 208 -272 -63 5 180 -34 336 316 -250 -96 204 33 90 -43 -180 -56
3461e6m0J38j31j43L73j01q3J68j25J26q1R3k31Qk07L00j2K7k60K77N2o6j23L1
$$ -56 -96 42 -89 -232 141 40 -43 125 0 126 45 138 -93 -85 -292 8 -4 23 -237 40 92 26 -97 -66
3485f6J79p5r7JM2o3J39L1l63N44m03lK99k92Q9J50o2j44K77JJ0k19J66K30k50
$$ -66 113 38 -59 -58 -16 -79 60 91 -272 272 -131 -134 165 -127 -38 112 50 -94 183 184 194 -25 141 371 121
3510A21k40J30K1j79K38j66rq8L2q5K93J79l24k32L70K7Lp1J87l61k7J85J01J28
$$ 121 -119 11 32 -147 91 -75 -84 -172 -140 -225 68 247 -77 -309 61 88 91 20 207 -154 -181 4 105 233
3534B33j36j95J79q2l2J47K4q2K85n95J03K0J38J20K26m10N7J67j10k48P5J60
$$ 233 97 -98 81 -1 -33 114 138 56 341 -254 -151 -131 7 127 353 -57 0 167 57 -191 -116 44
3556D4j70J8K98m73L04j8P6J9j95R7q6P5N3j03L2o4J70K0J35j23k51L70k91n0
$$ 44 -126 -108 190 -283 21 3 79 98 -97 0 -86 -11 42 -61 -29 -93 77 97 232 109 -142 228 -63 -113
3580a13O3J7QJ9j00K31m10K15N3K2n6l2j72L01k0K4j05j37K83mJ4K7j34n1J06
$$ -113 -50 -33 -25 -6 -106 125 -285 -70 -17 5 -51 -83 -255 46 26 50 -55 -192 91 87 101 128 -6 -57 49
3605D9J93k58K80l45J46J21j8j01j8l6N5p2j76K94k20N4O9k72J51L39l56J13K2
$$ 49 242 -16 264 -81 65 186 168 67 49 13 68 -4 -180 114 -106 -52 17 -255 -104 235 -121 -8 14
3628A4N7R2J5Om45K51K80j76J20j83j17J8O2J08k73K14j71K6J36n6o3j06m4L34
$$ 14 71 163 178 184 -261 -10 270 94 214 31 -86 -68 -6 102 -171 43 -128 -102 34 -22 -85 -191 -235 99
3652I9j12j31J97r7K80j52k86N6P5M4p5Q5k73M57q4q6K09j82l02K95q9L10m05
$$ 99 -13 -144 53 -44 236 84 -202 -146 -71 -27 -102 -17 -290 167 83 -3 206 24 -278 17 -72 238 -167
3675a67K40j14J62j30Q7L7j91K6q9K77m69K58J8j95M04j73k56M00j76J44j69K3
$$ -167 73 -41 121 -9 78 115 -76 -50 -139 138 -331 -73 -55 -250 154 -19 -275 125 -51 93 -76 -53
3697e3k32J63J19j69K43l62K91K30j91j33J7K46j71J29O0m55J46M05m65K9K00
$$ -53 -285 -122 -3 -172 71 -291 0 230 39 -94 -77 169 -2 127 187 -268 -122 283 -182 -153 47
3718D7j29q7N02l18N8k29K27j21J98j66m1j1N2L95k29l05L19r4l1n6l0J43j50
$$ 47 -82 -169 333 15 73 -156 71 -50 148 -18 -59 -70 -18 377 148 -157 162 68 37 -19 -49 94 -56
3741e6J09j01O8J03j92k5K59j77J00O3j70Q2j05J37j32J15n4l6J01k47J43j01
$$ -56 53 -48 20 123 -69 -94 165 -12 88 151 -19 63 -42 95 -37 78 24 -12 89 -158 -15 -116
3763a16J43P1l97L44J30j65m1N3J10j95o2J04R0l1j48m4r2K65l02K19j03p3L83
$$ -116 27 98 -299 45 175 10 -31 22 132 -63 -125 -21 69 38 -110 -154 -246 19 -283 -64 -167 -240 143
3786A43l54J39J51k46J59o2j2J55j39K2q8J58o2O2K29l66Q1j68J54o1N8p4j2j
$$ 143 -211 -72 79 -167 -8 -70 -82 73 -66 -44 -132 26 -36 26 255 -111 -30 -198 -44 -105 -47 -121 -133 -134
3810a34J83p2J22m00L53j17O1J20l86M78O1k49j69K25r9K39l25J98k42rK78j96
$$ -134 49 -23 99 -301 52 -65 -4 116 -270 208 269 20 -149 76 -23 216 -109 89 -153 -162 116 -80
3832h0L73l86J14pJ30j93J7J26l26L3L02j05J41M3j01n3k10j3J28K17j13L3k09
$$ -80 293 -93 21 14 144 -49 -32 94 -232 -199 103 -2 139 182 81 28 -182 -195 -67 150 37 70 -139
3855a39K47j69J05L06n12K58j62P0J04o2K64j18k85%L04m67n3K76K03l64J75N1
$$ -139 108 -61 44 350 -162 96 -66 4 108 46 310 192 -93 -93 211 -256 -309 -33 170 -194 -19 32
3877C2k73J67j07J38l20L88j0M6J67k44j22j52L39P6M0l80K98K6n7j17L56k04
$$ 32 -241 -74 -181 -43 -363 25 15 61 228 -16 -138 -290 49 125 165 -215 83 109 52 -65 291 87
3899H7j99L44n05J83q4Q8P5j29L1J9k18M72j48L1K95m86K7K33r8K6j00k0K35j53
$$ 87 -112 232 -273 -90 -174 -86 -11 -140 -109 -90 -308 164 16 47 342 -144 -117 116 18 44 -56 -76 159 6
3923Fl7j93L65J9j31J36o8j61J61j43K31k42k75M10j93K14l02l2K15l7R2k32K55
$$ 6 -31 -224 141 160 29 165 97 -64 97 -46 185 -57 -332 78 -115 99 -203 -235 -20 -57 35 -197 58
3946E8j46nK66m3q5Q9k27J04J61k36J8J73j91J3po8m3J50J61l00K04J18k45j41
$$ 58 -88 -93 173 130 45 134 -93 11 172 -64 -46 127 -64 -51 -58 -126 -169 -19 142 -158 46 164 -81 -222
3970b22K22q6n1K43m2J17j82k6J24j9J0k86L18n2m0O2j32k7J72j33J5j94L47k00
$$ -222 0 -86 -137 106 64 181 -1 -27 97 78 88 -198 120 68 28 90 -42 -69 103 -30 -15 -209 138 -62
3994f2L25j87P9j20j02J22O2k79k3J44j88K93j41q7Q0L42l32K44l81Q3r7K54j13
$$ -62 263 76 155 35 -67 55 117 -162 -185 -41 -229 64 -77 -164 -84 258 -74 170 -211 -128 -225 29 -84
4017h4J89Q0j23m9p6J16j10K97j93n4n4Q4j77J29k54N9J75Q0l09M6l1J92l3N3
$$ -84 105 185 62 13 -63 53 -57 240 47 -7 -61 23 -154 -25 -279 -220 -45 35 -274 -228 -259 -67 -100 -47
4041d7j26J41M5j74J61j36K94j25J00k8l32L16q5r1J78K74m14P7R1J60j25n9q7
$$ -47 -173 -32 13 -161 0 -136 158 33 133 105 -227 89 4 -87 91 365 -49 28 119 279 154 95 8
4064Hj80N7q4K05J05O3Pm8k89o5K39L3j95L27l28K57k28k4J14K98n04J43J30o7
$$ 8 -172 -115 -199 6 111 174 181 133 -156 -221 18 51 -144 183 -145 112 -116 -140 -26 272 -232 -89 41 -26
4088b6m3J70k29j1N4K46j74J14P9k87Q3m6K14j89P4j63L1J11l0J3nj0J22k19R2
$$ -26 -69 101 -128 -139 -85 161 -13 101 180 -107 -24 -70 144 -45 29 -134 -103 8 -22 -9 -14 -24 98 -121 -29
4113b9r7R7pL3J29l28K67l2j03j88K2L32r2j78J17Q8k39J33k4J84j45k6L5q0k0
$$ -29 -126 -29 -36 -3 126 -202 65 33 -70 -258 -236 96 4 -174 -57 31 -208 -75 -99 85 -60 -86 -51 -131 -151
4138a51J6N0o8R4L3J38k69N02m09J64J35l00k4J48N6j92N90m89J9j88K69K7k67
$$ -151 -135 -85 -153 -59 -26 112 -157 345 -64 100 235 -65 -89 59 115 -77 513 24 43 -145 124 151 -116
4161a16L11k48j94M44l74L62l1j53j04Rj3k8l3J35j05Q6J3J87k7k51J12p6p1L63
$$ -116 195 -53 -247 197 -177 185 154 1 -103 -94 -107 -135 -168 -33 -138 -52 -39 148 121 -130 -18 -94 -165 198
4185A98j28k14K82k42m4K38o2jJ15J34k22j00J55M0k36r1J74k33J72J85j50j82
$$ 198 70 -144 138 -104 -148 90 28 27 142 276 54 -46 109 149 -87 -178 -4 -237 -65 120 -30 -212
4207b12M8J54k42L33k88J66J3J86l94L69k31J83p4j85K87j67n7l4K55j86J44j49
$$ -212 -164 -10 -252 81 -207 -41 -28 158 -236 133 -98 85 11 -174 113 -54 -111 -145 110 -76 68 -81
4229h1j02J2Q5J4J78k94j2L70j63k08L66q6j75L1J22O7j87J14K4m14M04j01J85
$$ -81 -183 -171 -86 -72 106 -188 -200 170 7 -201 165 79 -96 -65 57 124 -63 51 75 -339 65 -36 149
4252A49j26j71J21L7k79L27J96m06K21o6l10M26o7K03k35k4J30Q8l87J7M50m16
$$ 149 23 -148 -27 10 -269 58 254 -152 69 3 -307 119 52 255 20 -4 126 214 -173 -156 294 -122
4274a22N02k96N5l70J26L34r8k29L23k01rP5j14l0O1j51J42k21K07m6q0J53O5
$$ -122 380 84 139 -231 -105 229 131 -98 225 24 15 90 -24 -54 7 -144 -2 -223 -16 -62 -142 11 76
4297G6l4l46M25j16K9K6j81K19k70J31J74k46R7O1j21q3J42NO6J91k76J55k50
$$ 76 42 -304 121 5 34 60 -121 98 -172 -41 133 -113 -16 45 -76 -159 -17 -12 54 245 -31 124 -126
4320a26K38r9j21J08K58l34K2k41N28k3r7k33lK00Q8j45M7m6nk39L19k1p4O3r5
$$ -126 112 13 -108 0 258 -76 -54 -295 233 210 113 -120 -123 77 165 20 67 21 16 -223 96 75 1 64 -31
$$ [...]
8191A0
##END NTUPLES=NMR FID
##END=
