##TITLE=1H_Pr CDCl3-TMS
 CDCl3, 96 sc, 
 17.10.2019
##JCAMPDX= 6.0         $$ Bruker NMR JCAMP-DX V2.0
##DATA TYPE= NMR FID
##DATA CLASS= NTUPLES
##ORIGIN= UXNMR, Bruker Analytische Messtechnik GmbH
##OWNER= root
$$ XWIN-NMR		Version 3.5
$$ Thu Oct 17 15:21:56 2019 Russian Standard Time (UT+4h)  she@DPX200
##.OBSERVE FREQUENCY= 200.1315
##.OBSERVE NUCLEUS= ^1H
##.DELAY= (6, 6)
##.ACQUISITION MODE= SIMULTANEOUS
##.ACQUISITION SCHEME= undefined
##.AVERAGES= 96
##.DIGITISER RES= 18
##SPECTROMETER/DATA SYSTEM= spect
##.PULSE SEQUENCE= zg30
##.SOLVENT NAME= CDCl3
##.SHIFT REFERENCE= (INTERNAL, CDCl3, 0, 15.7039)
##AUDIT TRAIL= $$ (NUMBER, WHEN, WHO, WHERE, WHAT)
$$ ##TITLE= Audit trail, XWIN-NMR		Version 3.5
$$ ##JCAMPDX= 5.01
$$ ##ORIGIN= Bruker BioSpin GmbH
$$ ##OWNER= she
$$ F:/spectra/data/she/nmr/H-F/1/audita.txt
$$ ##AUDIT TRAIL=  $$ (NUMBER, WHEN, WHO, WHERE, WHAT)
(   1,<2019-10-17 15:20:22.60 +0400>,<she>,<DPX200>,
      <continue with go, POWCHK disabled, PULCHK disabled
       configuration hash MD5:
       00 E9 B6 7A A2 85 ED C7 34 08 36 98 17 FE 4E 26
       data hash MD5: 16K
       19 73 F3 D4 CC 6A D6 28 6D 24 BD 04 B7 F7 47 8E>)
$$ ##END=
$$ 
$$ hash MD5
$$ 2F 0D 7D 20 2D 60 DD EC BA 6A 9B A8 07 5A 76 36
##$RELAX= 
##$RELAX= 
##$RELAX= 
##$RELAX= 
##$RELAX= 
##$RELAX= 
$$ Bruker specific parameters
$$ --------------------------
##$DU= <F:/spectra>
##$EXPNO= 1
##$NAME= <H-F>
##$PROCNO= 1
##$TYPE= <nmr>
##$USER= <she>
##$AMP= (0..31)
100 100 100 100 100 100 100 100 100 100 100 100 100 100 100 100 100 100 
100 100 100 100 100 100 100 100 100 100 100 100 100 100 
##$AQSEQ= 0
##$AQ_mod= 1
##$AUNM= <au_zg>
##$AUTOPOS= <>
##$BF1= 200.13
##$BF2= 200.13
##$BF3= 200.13
##$BF4= 200.13
##$BF5= 200.13
##$BF6= 200.13
##$BF7= 200.13
##$BF8= 200.13
##$BYTORDA= 1
##$CFDGTYP= 0
##$CFRGTYP= 5
##$CHEMSTR= <none>
##$CNST= (0..31)
1 1 145 1 1 1 1 1 1 1 1 1 1 1 1 1 1 1 1 1 1 1 1 1 1 1 1 1 1 1 1 1 
##$CPDPRG= <>
##$CPDPRG1= <>
##$CPDPRG2= <>
##$CPDPRG3= <>
##$CPDPRG4= <mlev>
##$CPDPRG5= <mlev>
##$CPDPRG6= <mlev>
##$CPDPRG7= <mlev>
##$CPDPRG8= <mlev>
##$CPDPRGB= <>
##$CPDPRGT= <>
##$D= (0..31)
0 1.2 0 0 0 0 0 0 0 0.06 0 0.03 0 0 0 0 0.0002 0 0 0 0 0 0 0 0 0 0 0 0 
0 0 0 
##$DATE= 1571310901
##$DBL= (0..7)
120 120 120 120 120 120 120 120 
##$DBP= (0..7)
150 150 150 150 150 150 150 150 
##$DBP07= 0
##$DBPNAM0= <>
##$DBPNAM1= <>
##$DBPNAM2= <>
##$DBPNAM3= <>
##$DBPNAM4= <>
##$DBPNAM5= <>
##$DBPNAM6= <>
##$DBPNAM7= <>
##$DBPOAL= (0..7)
0.5 0.5 0.5 0.5 0.5 0.5 0.5 0.5 
##$DBPOFFS= (0..7)
0 0 0 0 0 0 0 0 
##$DE= 6
##$DECBNUC= <off>
##$DECIM= 24
##$DECNUC= <off>
##$DECSTAT= 4
##$DIGMOD= 1
##$DIGTYP= 9
##$DL= (0..7)
0 120 120 120 120 120 120 120 
##$DP= (0..7)
150 150 150 150 150 150 150 150 
##$DP07= 0
##$DPNAME0= <>
##$DPNAME1= <>
##$DPNAME2= <>
##$DPNAME3= <>
##$DPNAME4= <>
##$DPNAME5= <>
##$DPNAME6= <>
##$DPNAME7= <>
##$DPOAL= (0..7)
0.5 0.5 0.5 0.5 0.5 0.5 0.5 0.5 
##$DPOFFS= (0..7)
0 0 0 0 0 0 0 0 
##$DQDMODE= 0
##$DR= 18
##$DS= 0
##$DSLIST= <SSSSSSSSSSSSSSS>
$$ [...]
##$SUBNAM2= <"">
##$SUBNAM3= <"">
##$SUBNAM4= <"">
##$SUBNAM5= <"">
##$SUBNAM6= <"">
##$SUBNAM7= <"">
##$SUBNAM8= <"">
##$SUBNAM9= <"">
##$SW= 24.0689530833862
##$SWIBOX= (0..15)
0 0 2 0 0 0 0 0 0 0 0 0 0 0 0 0 
##$SW_h= 4816.95568400771
##$TD= 16384
##$TD0= 1
##$TE= 0
##$TE2= 300
##$TE3= 300
##$TEG= 300
##$TL= (0..7)
0 120 120 120 120 120 120 120 
##$TP= (0..7)
150 150 150 150 150 150 150 150 
##$TP07= 0
##$TPNAME0= <>
##$TPNAME1= <>
##$TPNAME2= <>
##$TPNAME3= <>
##$TPNAME4= <>
##$TPNAME5= <>
##$TPNAME6= <>
##$TPNAME7= <>
##$TPOAL= (0..7)
0.5 0.5 0.5 0.5 0.5 0.5 0.5 0.5 
##$TPOFFS= (0..7)
0 0 0 0 0 0 0 0 
##$TUNHIN= 0
##$TUNHOUT= 0
##$TUNXOUT= 0
##$USERA1= <user>
##$USERA2= <user>
##$USERA3= <user>
##$USERA4= <user>
##$USERA5= <user>
##$V9= 5
##$VALIST= <valist>
##$VCLIST= <CCCCCCCCCCCCCCC>
##$VD= 0
##$VDLIST= <DDDDDDDDDDDDDDD>
##$VPLIST= <PPPPPPPPPPPPPPP>
##$VTLIST= <TTTTTTTTTTTTTTT>
##$WBST= 1024
##$WBSW= 4
##$XGAIN= (0..3)
0 0 0 0 
##$XL= 0
##$YL= 0
##$YMAX_a= 170307
##$YMIN_a= -117751
##$ZGOPTNS= <>
##$ZL1= 120
##$ZL2= 120
##$ZL3= 120
##$ZL4= 120
##$ABSF1= 10
##$ABSF2= 0
##$ABSG= 5
##$ABSL= 3
##$ALPHA= 0
##$AQORDER= 0
##$ASSFAC= 0
##$ASSFACI= 0
##$ASSFACX= 0
##$ASSWID= 0
##$AUNMP= <proc_1d>
##$AZFE= 0.1
##$AZFW= 0.1
##$BCFW= 1
##$BC_mod= 2
##$BYTORDP= 1
##$COROFFS= 0
##$CY= 11.3945322036743
##$DATMOD= 1
##$DC= 2
##$DFILT= <>
##$DTYPP= 0
##$F1P= 20.1720416913024
##$F2P= 0.152960286110954
##$FCOR= 0.5
##$FTSIZE= 0
##$FT_mod= 4
##$GAMMA= 1
##$GB= 0.15
##$INTBC= 1
##$INTSCL= 1
##$ISEN= 128
##$LB= 0.24
##$LEV0= 0
##$LPBIN= 0
##$MAXI= 10000
##$MC2= 0
##$MEAN= 0
##$ME_mod= 0
##$MI= 1.114404
##$NCOEF= 0
##$NC_proc= 0
##$NLEV= 6
##$NOISF1= 3.799351
##$NOISF2= 2.8
##$NSP= 1
##$NTH_PI= 0
##$NZP= 0
##$OFFSET= 15.70392
##$PC= 1
##$PHC0= -9567.308
##$PHC1= 12.20089
##$PH_mod= 1
##$PKNL= yes
##$PPARMOD= 0
##$PSCAL= 0
##$PSIGN= 0
##$REVERSE= no
##$SF= 200.130013532006
##$SI= 16384
##$SIGF1= 3
##$SIGF2= 2
##$SINO= 400
##$SIOLD= 16384
##$SREGLST= <1H.CDCl3>
##$SSB= 0
##$STSI= 0
##$STSR= 0
##$SW_p= 3612.71676300578
##$SYMM= 0
##$S_DEV= 0
##$TDeff= 0
##$TDoff= 0
##$TI= <>
##$TILT= no
##$TM1= 0
##$TM2= 0
##$TOPLEV= 0
##$USERP1= <user>
##$USERP2= <user>
##$USERP3= <user>
##$USERP4= <user>
##$USERP5= <user>
##$WDW= 1
##$XDIM= 8192
##$YMAX_p= 0
##$YMIN_p= 0
$$ End of Bruker specific parameters
$$ ---------------------------------
##NTUPLES= NMR FID
##VAR_NAME=  TIME,          FID/REAL,        FID/IMAG
##SYMBOL=    X,             R,               I
##VAR_TYPE=  INDEPENDENT,   DEPENDENT,       DEPENDENT
##VAR_FORM=  AFFN,          ASDF,            ASDF
##VAR_DIM=   8192,          8192,            8192
##UNITS=     SECONDS,       ARBITRARY UNITS, ARBITRARY UNITS
##FACTOR=    0.0002076,     1,               1
##FIRST=     0,             0,               0
##LAST=      1.7004516,     0,               0
##MIN=       0,             -117751,         0
##MAX=       1.7004516,     170307,          0
$$ Real data points
##PAGE= N=1
##DATA TABLE= (X++(R..R)), XYDATA
0@%%%%%%%%%%%%%%Kk9J14j83J92j92J92j98K42l24L78m04M63n39O08o91P83q77
32d63R80j098J228j367J522j693J885k096K318k562K839l140L479l861M283m771
48b517N327n958O691p572Q647r968J1655j3909J7088k1955L0483m9899K02194
61A70307p7939j26123J17787l4667k5713K2302J0740m2343L7660j7530l2972M8574
73E0083K2416r1738J9755P0659n1229m4631O7240r488n0831K8228J1305l5606
85a3837L0099o48n4566L4397M2794p4131p092P2761l2354o1633N4875J5487m9587
98d3435J6235J2543l3269K5214J5046n8183K0231N7043o0809l5512P6441l865
110a2320o6533L1913K9242l8930J0375J7732l5317K0998L1500n7802j807P1675
$$ plain form
0 0 0 0 0 0 0 0 0 0 0 0 0 0 0 0 2 -27 87 -96 96 -96 96 -102 140 -184 194 -210 253 -286 322 -369 414 -463
32 -463 517 -581 647 -720 802 -891 994 -1102 1216 -1346 1493 -1647 1832 -2029 2254 -2517
48 -2517 2810 -3148 3543 -4029 4618 -5350 6305 -7604 9484 -12471 18012 -31887 170307
61 170307 92368 -33755 84032 49365 23652 45954 56694 14351 52011 34481 1509 50083
73 50083 72499 -19239 516 71175 19946 -24685 42555 33067 -17764 10464 21769 -13837
85 -13837 16262 15614 -38952 -4555 38239 -35892 -42984 29777 -2577 -64210 -9335 6152 -43435
98 -43435 -27200 -14657 -47926 -22712 -7666 -65849 -45618 11425 -49384 -84896 -8455 -12320
110 -12320 -78853 -46940 -17698 -56628 -46253 -28521 -63838 -42840 -11340 -69142 -70949 726
122G26l4274n4466O0396K1294o0229J7045L5212l2446O688K3727l5692J2793M5840
135F614m6441k2922P1342r552o5556M6633L8521n2708K183M0580k4636q75K9024
148A2207l2296o36N6316l3342m2402O6554J6755o8260K1024N2019l8540j3050
160c651L5452j5622m146L2927k9500j7316N9201j3328n6625M7430L7042n8927
172A2937l224N1424k3810j7862K9861j3689j1375L5068k0910l2741N1385Q111
184F5175o2797K4042M9572m7486k1173M7710j1519k6313K5995j0103j7922L5599
196E0780j1232m5189M0090K7116o3370M05N7674l1594l4751L6843l60k6398K1396
209B1410q340k6518L6411J289n4971K4906M5697n5513k0602N6925j2822m2009
$$ plain form
122 726 -33548 -88014 -27618 -6324 -66553 -49508 -14296 -46742 -40054 -16327 -52019 -39226 6614
135 6614 -39827 -62749 8593 -959 -66515 -19882 18639 -34069 -31886 8694 -15942 -16817 12207
148 12207 -20089 -20725 35591 2249 -40153 26401 43156 -25104 -4080 47939 9399 -3651
160 -3651 31801 16179 12033 44960 15460 -1856 57345 44017 -12608 34822 71864 12937
172 12937 9713 61137 37327 19465 49326 35637 24262 59330 38420 5679 57064 65175
184 65175 2378 26420 75992 28506 7333 55043 43524 17211 43206 33103 15181 50780
196 50780 39548 -5641 34449 61565 -1805 -1400 56274 24680 -10071 26772 26412 14 21410
209 21410 13070 -13448 22963 24252 -30719 -5813 39884 -15629 -36231 20694 7872 -34137
221c4137K7763N716k7580K0387M01l4409K9659K0438n6204N642N4533l7387l5797
234f0975M7021M922m1134J9059J3865k6895J7415O870l5916K0724L3615m7761
246d9190j2988N7770j5625m5030L4418K0859l5812Q157J7703k2388J4746J6202
258a1178l6434R157M4449l3779k9732N3528N029m7425K0993K8966k7605L299J8682
271b050k1008J0850K6535l5573o877N2584j7804m2693M2914K2689m4467Q351L1337
284B4788k2025k68K0968k2416M425L4351k8609k2196N1853l33n0109K7624L3537
297E1590l6484o616L2443j7041l309K1047k1574n912L8378k0403l4414M3492J6225
310E7422n2040R939M0453k8234j4675K6315j0294q987K1143j7166j7405L9517
$$ plain form
221 -34137 -6374 -658 -28238 -7851 -7450 -41859 -12200 8238 -47966 -42324 12209 -25178 -60975
234 -60975 -13954 -9032 -50166 -31107 -17242 -44137 -26722 -19852 -55768 -35044 -1429 -49190
246 -49190 -62178 -4408 -20033 -65063 -30645 -9786 -45598 -37441 -19738 -42126 -27380 -11178
258 -11178 -47612 -38455 5994 -27785 -57517 -3989 1040 -46385 -25392 3574 -24031 -20732 -2050
271 -2050 -23058 -12208 14327 -21246 -28123 24461 6657 -36036 6878 29567 -14900 -6549 24788
284 24788 2763 2495 23463 1047 5472 39823 11214 -10982 40871 40538 -9571 18053 51590
297 51590 15106 8490 40933 23892 20583 41630 20056 14144 52522 32119 -2295 41197 57422
310 57422 5382 15321 55774 27540 12865 39180 28886 19899 41042 23876 6471 45988
322D5988o851m5660K9850K9423m5982p616L8939j5276k1801K2148p264j2770K2139
335B5267j2977k6807L3853R583m9270J3443L9053l5332k1373L6042o388k2990
347a7896J6420l269j7177K4687o571l3859K7325K2730m6358k648M4403k1977k9323
360d3513K9043L245k2296J3516R20k0397K4274M287l8997J7698L5198l7334j8103
373e2459M3785m872l4132K2179J0252k1410J4250L551k2956K1945J6451l8036
385d1452K087M4762k3788k8559L7766P392l2786J4735J5306j9159J3118Q766k5837
398b7649J5010K7854l3788j0298M6148r059l5963K8304J7981k7379M927J8758
410A4846j6764P933J4387k5565N302L5681k4969k2995M1003N429l9297J5106K6033
$$ plain form
322 45988 39137 -6523 23327 52750 6768 -848 38091 22815 1014 23162 15898 3128 25267
335 25267 12290 -14517 19336 28919 -20351 -6908 32145 -3187 -24560 11482 5094 -17896
347 -17896 -1476 -4745 -21922 2765 -3806 -37665 -10340 12390 -33968 -36616 7787 -14190 -43513
360 -43513 -14470 -11225 -33521 -20005 -19085 -39482 -15208 -10921 -49918 -32220 2978 -34356 -52459
373 -52459 -8674 -13546 -47678 -25499 -15247 -36657 -22407 -18856 -41812 -19867 -3416 -41452
385 -41452 -39365 5397 -18391 -46950 -9184 -1792 -34578 -19843 -4537 -23696 -10578 -1812 -27649
398 -27649 -12639 15215 -18573 -28871 17277 8218 -27745 559 18540 -8839 -3912 14846
410 14846 -1918 6015 20402 -5163 139 35820 10851 -12144 28859 34288 -5009 10097 36130
423C6130k1329k232J6124j3602M124J9844k5755n901L9029j4806l4133L2187J7432
436D7112l5947L108K5472j5736n798J5628j5410j207K3622k1699j8552L6908J09
449C7610m0595J8661K7165l1815p468K5128j1379r056J5512j4826p217K5677j3327
462A4070k7570K9636J2452m2945O585L1207k2619j4402K0809n680j0750J4207
474E000j2081j4661K8015l916l4107J9973K5723l6863p322L1196j0441j8870J6318
487a2036k796j1092J6263p912k0266K6594Q203l7316R383L1787k5237j8089K9898
500a2616j907j9428J4340P09j3136J7933r42k4214K0420J9575l4679j515L6500
513A040j4158k4890K3894Q179j9261J1854K540j2596J6465P187k8692J3585K9564
$$ plain form
423 36130 14801 12569 28693 15091 19215 39059 13304 7403 46432 31626 -2507 29680 47112
436 47112 11165 14273 39745 24009 18211 33839 18429 17222 40844 19145 593 37501 37610
449 37610 -2985 15676 42841 11026 3558 28686 17307 8251 23763 8937 1720 27397 14070
462 14070 -13500 16136 28588 -14357 -7772 23435 816 -13586 7223 1543 -9207 5000
474 5000 -7081 -21742 6273 2357 -31750 -11777 13946 -22917 -30239 957 -9484 -28354 -12036
487 -12036 -14832 -25924 -9661 -17573 -37839 -11245 -3042 -40358 -30975 812 -24425 -42514 -12616
500 -12616 -14523 -33951 -19611 -18902 -32038 -14105 -15047 -39261 -18841 734 -33945 -35460 1040
513 1040 -13118 -38008 -14114 -5935 -25196 -13342 -10802 -23398 -6933 254 -28438 -14853 14711
526A4711k7875j5225L6589j027k7540J6723J3234j5713Q147P071j8382J4720J6189
539B1622k9075J504L5389j7510k4146K9682R631k6859Q778J4676j4087O001R304
552B4910k0249J0224K2232k5585r384L4842o627l0832K0811J6998k4482J940J5101
565B9899j1681K314R768j8604P73K6606j9223k1675L1336N645l3806J0835K0162
578C2349j9558m500J2770j0906J156J3734j9968o406K8559j1339k9491K4011J4845
591B5256l0229j103K2037j3454q756J2308j0279k293J6833j5029j7080K8162M61
604F834l3689J4111K2245k4886o654J9733q484r589J1887r130n629J9685j0529
617a4095k1298K4637J0142l3163L901K8134j6463j3526J8981l073r459J2079p760
$$ plain form
526 14711 -13164 -28389 8200 7173 -20367 -3644 9590 -6123 2024 9095 -9287 5433 21622
539 21622 -7453 -5949 29440 11930 -12216 17466 27097 238 9016 23692 9605 15606 24910
552 24910 4661 14885 37117 11532 2148 36990 30363 -469 20342 37340 12858 14798 29899
565 29899 18218 20532 30300 11696 12469 39075 19852 -1823 29513 35158 1352 12187 32349
578 32349 12791 8291 21061 10155 11311 25045 5077 -1329 27230 15891 -13600 10411 25256
591 25256 -4973 -6076 15961 2507 -6249 6059 -4220 -6513 10320 -4709 -21789 6373 6834
604 6834 -26855 -12744 9501 -15385 -22039 -2306 -10790 -20379 -8492 -17622 -23251 -3566 -14095
617 -14095 -35393 -10756 -614 -33777 -29876 -1742 -18205 -31731 -12750 -15823 -25282 -13203 -20963
630b0963q809K2068l066k8096J9678K1389k9356o130K9433p658j6130J5058J463
643a1119r302J3568m517j4308K0585Q204k8047P602K8362j9628j4332K5942M65
656C475j8134J3993L031r656J2905Q84j8769J6979J5767k6085j794L0124r634
669A3086k1839K0752P521j6135P949M106r834J1056O214k2210R819K4663k3611
682A1537j2769L0264j523k2644J1241J0816j2975L728M157j0361R352J0248k3011
695H060M8K6326j3495k2563K4602P158k5025O721J2232j2118J390O784j5422N449
709A0147J6482k0851r543K6600n091k6023J6732J1665k2163k99J3592j0312j350
722d14R515j5357j27K0778j7428j7672K5136M336k8164O742J8880j5602o510J1256
$$ plain form
630 -20963 -29772 -7704 -10770 -38866 -19188 2201 -27155 -33285 -3852 -11510 -27640 -12582 -11119
643 -11119 -20421 -6853 -11370 -25678 -5093 3111 -24936 -17334 11028 -8600 -22932 3010 3475
656 3475 -14659 -666 2365 -7291 5614 6498 -12271 4708 20475 -5610 -7404 22720 13086
669 13086 -8753 11999 19520 3385 11334 15440 5606 16662 22876 666 10485 35148 11537
682 11537 -1232 29032 27509 4865 16106 26922 13947 17675 21832 11471 20823 31071 8060
695 8060 8108 34434 20939 -1624 22978 30136 5111 11832 24064 11946 13336 20120 4698 10147
709 10147 26629 5778 -3765 22835 17744 -8279 8453 20118 -2045 -2344 11248 936 -414
722 -414 9101 -6256 -6383 14395 -3033 -20705 4431 8767 -19397 -12655 6225 -9377 -15887 -4631
736d631o698j211R774j4500n566K3660q313k4883J9489J4448k6951K05J9530j0463
750a6110o343J0265p234k779J4944j0609j2512K2821J699k7136J2096K1368k0425
763a9955p277K0100l577j0340J0829l691n685J7044o973j7259K0673J0696k5699
776b1114J981K6189j3741j2661J8210Q83q974R821k427r030J8495J78k2834J4126
790h98K1517k3555p247K5992m461j4342J2444K550q911J1166k218j1415J4921
803A5543P490k3998O713K2988j6244j3648K2320K583j7939R753L789q237P319
816A8432J769j4441J1546J2521k2901k131K4491q886j8841J6003N904j5014L268
829A1720N701r709Q476L057j8094O249J9796j9949j2901K5079r55k2103R484Q890
$$ plain form
736 -4631 -11329 -12540 -2766 -17266 -22832 828 -7485 -32368 -12879 1569 -25382 -25177 -5647 -16110
750 -16110 -22453 -12188 -19422 -22201 -7257 -17866 -30378 -7557 -5858 -32994 -20898 470 -19955
763 -19955 -27232 -7132 -10709 -21049 -10220 -13911 -19596 -2552 -9525 -26784 -6111 4585 -21114
776 -21114 -19133 7056 -6685 -19346 -1136 -253 -9227 594 -1833 -10863 7632 7810 -15024 -898
790 -898 20619 -2936 -10183 15809 11348 -2994 9450 12000 3089 14255 12037 622 15543
803 15543 23033 -965 5748 28736 12492 -1156 21164 23747 5808 15561 19350 11113 18432
816 18432 20201 5760 17306 29827 6926 4795 29286 20400 1559 17562 23466 8452 11720
829 11720 17421 7712 16188 19245 1151 7400 27196 7247 -5654 19425 18470 -3633 5851 14741
843A4741j1979K94N230j0339N478Q512j9084m85K1108j1759j9306J8758Q028k2743
857a3546M872J0964j0870r21P327j1659K869J1520j4557q485K2899l728k4196
870b7511J5028J3222j8798j918J3036o878l071P870j0235m88J7851j2703j4412
883b9007K2276L030k2913O735J7946j3613n505J2012n585j120J0257r513n508
896b0508J9799n978j9625J7666J3281k1629O52J9138q369p478J2014l709l960
909h706J3069q267q618J8595K673k1562J0700J7718j6724p916J9085k395r274
922a622R527j307m802J3065m488j3853J6672R553k3366L702K2009j0623j2856
935A611J4575J426j0051Q506j474p277J2116J453j9136J0875J5502j8907p909
$$ plain form
843 14741 2762 3056 8286 -2053 3425 11937 -7147 -7632 13476 1717 -17589 1169 9197 -13546
857 -13546 -8674 2290 -8580 -9501 -2174 -13833 -10964 556 -14001 -22486 413 -3315 -27511
870 -27511 -12483 739 -18059 -19977 -6941 -13819 -16890 -9020 -19255 -19743 -1892 -14595 -29007
883 -29007 -6731 -3701 -26614 -19879 -1933 -15546 -21051 -9039 -14624 -15744 -5487 -15000 -20508
896 -20508 -709 -6687 -26312 -8646 4635 -16994 -16342 2796 -5573 -13051 -1037 -4746 -8706
909 -8706 4363 -3904 -12522 6073 8746 -12816 -2116 15602 -1122 -9038 10047 7652 -1622
922 -1622 7905 6598 1796 14861 10373 -3480 13192 22745 -621 3081 25090 14467 1611
935 1611 16186 17612 7561 16067 14593 7316 19432 20885 1749 12624 28126 9219 1310
948A310K2594l352j6866J1073K234q163O018L97j1376J1791M864k0619M071K0072
962B4048j3861j4369J8909J663j7188O295N710r017M270K155j4347R320J0443
975A4031j9131l840K0782p051j8115J4224N319j4317J079P183r789M941M568j5366
989a5482M832J5144j5706j0809K0580l97j9889Q367J2065j3698R82N588p765L259
1003a2929R039j4196j675J9016r918j5001J5842Q572j9772L502J2812r573m38
1016a4719P006r236L120J1846j2930p261K1108k179j9245J3186J2819j6620m39
1029a3544J2390m638l700R507p227j918J5472q872j2569J8145O710k1179O740
1042d683J6710j1542n572J1719k801m255J0989q160l727J6156l887j6683J4275
$$ plain form
948 1310 23904 20552 3686 14759 16993 8830 14848 15245 3869 15660 20524 -95 3976 24048
962 24048 10187 -4182 14727 16390 -798 5497 11207 2190 6460 8615 -5732 3588 14031
975 14031 -5100 -8940 11842 4791 -13324 900 6219 -8098 -7019 164 -9625 -4684 -116 -15482
989 -15482 -10650 4494 -11212 -22021 -1441 -1838 -21727 -13360 -1295 -14993 -14011 -8423 -16188 -12929
1003 -12929 -3890 -18086 -19761 -745 -10663 -25664 -9822 -1250 -21022 -17520 -4708 -14281 -14719
1016 -14719 -7713 -16949 -13829 -1983 -14913 -22174 -1066 -3245 -22490 -9304 3515 -13105 -13544
1029 -13544 -1154 -5792 -9492 15 -7212 -9130 6342 -2530 -15099 3046 9756 -11423 -4683
1042 -4683 12027 485 -5087 6632 3831 -424 10565 2405 -1322 14834 10947 -5736 8539
1055H539J1784j9652m46J8066o981o654Q903k266k935Q964n918q664J4669K712
1069B0121j9384Q273J6137j4683p616J5518l210q081P177j104o962J1000l270
1082A3916j2590J2448O383j8724J014J7878j0264j1646J3267N11j0077N971p73
1095G314p724R870N71j6450P739J3336j7496o411J9016m462j4054P991N036j1354
1109g078O632j126r128R026M779j7301K228J6544j1651j2216J7466P89j4457N314
1123a0179N863r340N876J463j1448O996R861j5996k962K0068p365j5750J3317
1136i596O889j4318L301O968p850M062N002j1880L300J4981j3096q944J9135L20
1150a726j6062P141J1602r870j818Q904p379L256O562r684j193J7308p673j4112
$$ plain form
1055 8539 20323 671 225 18291 11310 4656 13559 11293 8358 17322 11404 2740 17409 20121
1069 20121 737 9010 25147 10464 2848 18366 15156 7075 14252 13148 6186 17186 13916
1082 13916 1326 13774 20157 1433 2447 20325 10061 -1585 11682 12193 2116 8087 7314
1095 7314 -410 9460 10031 -6419 1320 14656 -2840 -9251 9765 5303 -8751 -760 4276 -7078
1109 -7078 -446 -1572 -10700 -1674 3105 -14196 -11968 4576 -7075 -19291 -1825 -1036 -15493 -10179
1123 -10179 -4316 -13656 -7780 -6317 -17765 -10769 -908 -16904 -19866 202 -7163 -22913 -9596
1136 -9596 -2707 -17025 -13724 -6756 -14606 -10544 -5542 -17422 -14122 859 -12237 -21181 -2046 -1726
1150 -1726 -17788 -10647 955 -8915 -10733 -1829 -9208 -5952 610 -9074 -10267 7041 -632 -14744
1164a4744J5480O999j5207L196J0791o180j549P377o713J541J0671j0010n150
1177c498J6363j885j6310J1280J1595j4414j513J2812n799l064P907o863j127
1190E484J1399o278j0355J5174M613j8587N617J2876j0341m875J0057k561n083
1203G140Q782o672m401J2259l164j5453J2040R936j7772j066J3696o379q921R527
1217I552p79o399Q427n342q695J1903K205j7121O728J3298j4733o112J4746l805
1231C873q502O304j405n898P452j660j1451J0320N772j6330N54J6035j0869r912
1245a5717J2100J053r091M340O12o505P330J349j2560O151J1442j4294m708J5808
1259b690k418j3101Q875M298q154M064J572p336O080N548j2830K073J5583j0227
$$ plain form
1164 -14744 736 7735 -7472 -4276 6515 335 -1214 6163 -550 991 11662 1652 -3498
1177 -3498 12865 10980 -5330 5950 17545 3131 1618 14430 8631 5567 13474 6611 5484
1190 5484 16883 10605 250 15424 20037 1450 7067 19943 9602 4727 14784 12223 7140
1203 7140 15922 9250 4849 17108 13944 -1509 10531 20467 2695 1629 15325 8946 25 9552
1217 9552 8773 2374 10801 5459 -3236 8667 10872 -6249 479 13777 -956 -7068 7678 3873
1231 3873 -4629 1675 270 -5628 1824 164 -11287 -967 4805 -11525 -10971 5064 -5805 -15717
1245 -15717 -3617 -2564 -11655 -7315 -6703 -13208 -5878 -4529 -17089 -10938 504 -13790 -18498 -2690
1259 -2690 -5108 -18209 -9334 -5036 -13190 -9126 -7554 -14890 -8810 -3262 -16092 -14019 1564 -8663
1273h663r639J4726J064j2061O276O314p671L299L770p613N165Q440j1644l441
1287a1678J7330m059j4759J1906P112j2613L231P837o268K079N507q601L756J1187
1301A1967j0488p151J7208k70j4393O170R246p369j314O754n263K149N863q853
1315D256qJ2724n659j2766J2755O133j3524J951J0240o854l011O041m212j019
1329G047Q261p765n801J3991j472j5367R507J0113j4096k149J1926o347m075N654
1343I427m922k115R740p301r115J2922K389j7004M586J2123r553o223R810l617
1357A147m736O118n782m064J1365k990j3684J1455P512j5621j397J2669n945o678
1371a0631Q105k965m012N863k298p353R451J411j4871Q099R941j2182o219J3484
$$ plain form
1273 -8663 -18302 -3576 -2512 -14573 -8297 -1983 -9654 -6355 -2585 -10198 -5033 3407 -8237 -11678
1287 -11678 5652 1593 -13166 -1260 5852 -6761 -3530 4307 -1961 118 5625 -2976 780 11967
1301 11967 1479 -5672 11536 11266 -3127 3043 12289 4920 3606 10360 5097 7246 13109 4256
1315 4256 4248 16972 11313 -1453 11302 17435 3911 5862 16102 9248 6237 12278 8066 7047
1329 7047 15308 7543 1742 15733 14261 -1106 8401 18514 4418 2269 14195 7848 3773 9427
1343 9427 4505 2390 12130 4829 -4286 8636 11025 -5979 -1393 10730 1177 -5046 4764 1147
1357 1147 -3589 2529 -3253 -7317 4048 1058 -12626 -1171 6341 -9280 -10677 1992 -3953 -10631
1371 -10631 -2526 -5491 -9503 -3640 -5938 -13291 -3840 -2429 -17300 -9201 740 -11442 -17661 -4177
1385d177j743q445P064M75n733N519n61q386Q453O993j4968J904J4333p669r211
1400a6152J1527J410q151O098O03n049O743K047j0944O689J1095j2996m610J5840
1414D150l224j0331Q200L975p333L859K635o817P271M551j1430K884J3728j0647
1428A471p288J3846J721j1920O745N423p852L446L533n766K373P788j0689r99
1442A832J2774m498j2352J2542N750j2057P58P720n207J6L803o092J428J0074
1456A6491r258p078J4805j229j4264O450R193j1333k50O423n480J43N869r316
1470A166K28J0933o626r984J1330L919j3992J662R269q142k453N764n405q7O697
1485D279p709m722J1765k199j2667Q184O605j1265q45R450m323o462O864l012
$$ plain form
1385 -4177 -5920 -14365 -7301 -6826 -12559 -7040 -7601 -15987 -7534 -541 -15509 -13605 728 -6941 -16152
1400 -16152 -4625 -3215 -11366 -5268 -4665 -9714 -2971 -924 -11868 -5179 5916 -7080 -11690 4150
1414 4150 926 -9405 -1205 2770 -4563 -704 1931 -4886 2385 6936 -4494 -1610 12118 1471
1428 1471 -5817 8029 9750 -2170 4575 9998 2146 5592 9125 3359 5732 13520 2831 1832
1442 1832 14606 10108 -2244 10298 16048 3991 4749 12469 7262 7278 11081 4989 6417 16491
1456 16491 7233 155 14960 13731 -533 5917 15110 3777 3527 9950 4470 4613 10482 1166
1470 1166 1394 12327 5701 -4283 7047 10966 -3026 -1364 7905 -237 -2690 3074 -2331 -2418 4279
1485 4279 -3430 -8152 3613 1414 -11253 -3069 3536 -7729 -8574 876 -3447 -9909 -3045 -6057
1499f057l687Q852n799q205J2118J868j3667M686R730q880m644R295k577m284
1513a1251N174k384m313R379k221j1946J0724P206j3104r2J2599n027p222Q697
1527c781o02n439P291k818n386Q604J476j0856O017R867j0500k504J1829l333
1541a35o391O180J105m369N291m6p074P797N219j1369J765J2720p322p527J1419
1556G263J243p927K872K603l200M664J365q696N734Q643j1714k928J3967m347
1570I542q350O867L920p509K609K435m135L541L948j0020J751J1893r713p721
1584i42J3583p91j0981M938O191p161Q28L335p157M119N335j1049K38J1811o777
1599E520j0295J1453K782j2405K182O963o519R6M460p996J592P912r092n066J2652
$$ plain form
1499 -6057 -9744 -892 -6691 -14896 -2778 -910 -14577 -9891 -161 -9041 -13685 -4390 -6967 -11251
1513 -11251 -6077 -8461 -12774 -3395 -5616 -17562 -6838 368 -12736 -12828 -229 -5256 -12478 -3781
1527 -3781 -4383 -9822 -2531 -5349 -10735 -2131 -655 -11511 -5494 4373 -6127 -8631 3198 -135
1541 -135 -6526 -346 759 -3610 1681 1635 -5439 2358 7577 -3792 -2027 10693 3371 -4156 7263
1556 7263 8506 579 3451 6054 2854 7518 8883 187 5921 14564 2850 -78 13889 9542
1570 9542 1192 8059 11979 4470 7079 9514 5379 8920 12868 2848 4599 16492 6779 -942
1584 -942 12641 11850 869 5807 11998 4837 5665 9000 1843 5962 11297 248 486 12297 5520
1599 5520 -4775 6678 9460 -2945 -763 6200 -319 -223 4237 -3759 -2167 5745 -3347 -8413 4239
1614D239j845j2406O202P245q781k072O550m122j521N115o699j872J1008o012
1628d971r329J1183L943j3458K440R591p424k851O227l051j251N039m856l928
1642a2696J1074l193j0493P688P355j0504j660J0478l320m151O239k930k834P327
1656a620m006n858J0879K215j2218M129J0681p898m235Q897j298n083O614j568
1670c69k563P049j617q848R189M452j0762K87J2252o355o101R418N84n293N379
1685F702j786l457P949p31r545O141R171j0385m214J0878k023o206N376L96l414
1700D852M686n17o842O347M580j1981J761J1912p898o329R032J063q704L922K157
1715H041m593L377k69o682M415N987r983j844J2322n064r203O810L771q074K419
$$ plain form
1614 4239 2394 -10012 -3810 3435 -5346 -7418 -868 -4990 -6511 -1396 -8095 -9967 1041 -4971
1628 -4971 -14300 -3117 826 -12632 -10192 -601 -8025 -10876 -4649 -7700 -8951 -3912 -8768 -12696
1642 -12696 -1622 -4815 -15308 -7620 -265 -10769 -12429 -1951 -5271 -9422 -3183 -6113 -8947 -1620
1656 -1620 -5626 -11484 -605 1610 -10608 -6479 4202 -3696 -7931 966 -332 -5415 1199 -369
1670 -369 -2932 4117 2500 -6348 2841 7293 -3469 -3182 9070 2715 -3386 6032 6616 1323 6702
1685 6702 4916 1459 9408 8677 -868 5273 14444 4059 -155 10723 8700 2494 7870 8266 4852
1700 4852 9538 9021 2179 8526 13106 1125 2886 14798 6900 571 9603 10666 1962 5884 8041
1715 8041 3448 6825 6556 -126 4289 10276 293 -1551 10771 5707 -3496 3314 7085 -989 1430
1730A430L240o252L437L596r778J544Q480p258o775J0665k14r841M197N386o358
1745d501K11K406n052K785M378r505J43J1436n975q857Q811L233j0921L641M508
1760c259l938j520M127n399K391N996p620m053J2046j957j0973O756O401q728
1774i730K12O870m745q4M017m037p31Q961n411p344J0643K965j1291K993R499
1789B787p110k048O496j823j784O010n376k397R732k249q981Q909O884j1467J96
1804b221R257l500m275O043n24l498N066j378m996Q278J473j0958N144R353q498
1819D766l895Q539j066m434K839O45k874N471j317p474P384N260j1164O14J0273
1834A3567o106o518P229l77l781K973m90l605N411J24r024N076P193j0110j985
$$ plain form
1730 1430 4670 -1582 1855 5451 -4327 -2783 5697 -1561 -8336 2329 2115 -7726 -3529 1857 -4501
1745 -4501 -4290 -1884 -6936 -4151 227 -9278 -9135 2301 -3674 -12531 -3720 -487 -11408 -7767 -3259
1760 -3259 -7197 -8717 -4590 -9989 -7598 -1602 -9222 -13275 -1229 -3186 -14159 -7403 -1002 -9730
1774 -9730 -9518 -2648 -7393 -7477 -3460 -7497 -8228 733 -4678 -12022 -1379 1586 -9705 -6712 2787
1789 2787 -4323 -6371 125 -1698 -3482 2528 -2848 -5245 4487 2238 -6743 2166 9050 -2417 -2221
1804 -2221 7036 3536 -739 5304 4780 1282 6348 4970 -26 8252 9725 -1233 3911 13264 4766
1819 4766 871 9410 8344 3910 6749 7394 4520 9991 8674 1200 8584 13844 2680 3294 13567
1834 13567 7461 943 8172 7795 4014 6987 6497 2892 8303 8427 -597 4479 11672 1562 -423
1849d23Q380j542p901M486J528m131K810q20m949N134K598j0794K517Q923o927
1864a111o688R415O53r758M430K340m442L362J218p568M330N561q784k802J1222
1879A378l297r737Q044K364o990J006L600l193J273J619o145K577Q090q042n645
1894a3098J0068R24r683M406N917o381J079K421m090K060N159o425j277J0409
1908A489n518o739Q427L439r503L474N579l745m46L599l784M01P086o799k633
1923e673J0010j440q401O155N593p301l88O944k436j720L628l982O03P668n022
1938D238n793R022K738j0369L154P880o089j988N659j627k559M728m415j715Q756
1953A1620l335o795N461M764r026l0Q804m379m504M974j137j973L425k270m706
$$ plain form
1849 -423 7957 6415 -1486 3000 4528 397 3207 2387 -2562 2572 5170 -5624 -3107 5816 -1111
1864 -1111 -7799 1616 2269 -7489 -3059 -719 -5161 -1799 -581 -8149 -3819 1742 -7042 -9844 1378
1879 1378 -1919 -11656 -3612 -1248 -8238 -7232 -3632 -6825 -5552 -3933 -10078 -7501 589 -7453 -13098
1894 -13098 -3030 -2106 -11789 -7383 -1466 -7847 -6768 -4347 -8437 -6377 -1218 -7643 -8920 1489
1908 1489 -4029 -10768 -2341 1098 -8405 -4931 648 -3097 -3543 56 -3728 -3327 3759 -3040 -5673
1923 -5673 4337 2897 -5504 651 6244 -1057 -1445 5499 3063 1343 4971 989 1592 9260 4238
1938 4238 -1555 7467 10205 -164 2990 10870 4781 2793 8452 6825 4266 8994 4579 2864 11620
1953 11620 8285 1490 6951 11715 2689 2659 11463 7084 2580 7554 6417 4444 7869 5599 893
1968H93O766J017j0253M820P437p706l314O709j344n602M148k032j665M285k131
1983B028o779P013L947r948R0R899o886n455O972l66n387M046j452l412M281J54
1999a255p058M046O505r206l376R810j724o866M232K414n410K282J372n272M740
2014d766J730o788J957Q201p247m856R048j82o397L138K028k702K513Q18n045
2029h550L972N316r916N79J0591m457p562P715L846q124K017L732l518J822L223
2044F86n813K808N889n822m294J0090L28r269M903N658m697J07K754k913K345
2059B760L671o280k13R194m757p086Q257L860r742K426O491m223r87L581k687
2074D265p26N448n197k346R737j499r287N779N076o073k440N556k165j024K461
$$ plain form
1968 893 7659 8676 -1577 3243 10680 2974 -340 6369 5025 -577 3571 1539 -126 4159 2028
1983 2028 -4751 2262 6209 -3739 -3649 6250 -636 -6091 881 515 -4872 -826 -2278 -5690 -1409 -1255
1999 -1255 -8313 -4267 2238 -6968 -10344 -534 -2258 -9124 -4892 -2478 -7888 -5606 -4234 -9506 -4766
2014 -4766 -3036 -9824 -7867 334 -6913 -11769 -2721 -2903 -9300 -6162 -4134 -6836 -4323 -3505 -8550
2029 -8550 -4578 738 -9178 -8599 1992 -2465 -10027 -2312 1534 -6590 -4573 -841 -4359 -2537 686
2044 686 -5127 -2319 3570 -2252 -6546 3544 3872 -5397 -494 5164 467 574 3328 415 2760
2059 2760 6431 151 -62 9132 4375 -2711 5546 9406 -336 2090 8581 4358 3371 6952 4265
2074 4265 3539 8987 3790 1444 11181 9682 395 6174 11250 5177 2737 8293 6128 5104 7565
2089G565k172j884M878k175p588R557P84j0051L384P184n598l935O264k427k281
2104A505L557l729j018M275j603p364O129L964q521o65Q059m672m203M524k16
2119B2l082L672l964k630N363L48q387L021P964p967k627O924q07n417L608n26
2135d485k221M044k928m648P154K661r752Q88R048o429l862N615J468n123L479
2150e091J136l116K608Q21o590O038M833p896q18Q368k891o821O544K815n508
2165e568J800J989k407K720L460q815M149P989o509m820R321j42p011M208L511
2180C875l084K47L432n085L921L668o725j10Q502k963p735P618K401o768K006
2195C200K881j807J42K805m983K578M773n351l210Q332l27p501K635O616o954
$$ plain form
2089 7565 5393 3509 8387 6212 -1376 8181 8965 -1086 2298 9482 3884 -51 6213 3786 1505
2104 1505 5062 1333 315 4590 2987 -4377 1752 5716 -2805 -3470 4589 -83 -4286 238 22
2119 22 -3060 612 -3352 -5982 -619 -271 -8658 -5637 2327 -5640 -8267 -1343 -2150 -7567 -3959 -4485
2135 -4485 -6706 -2662 -5590 -10238 -3084 -423 -10175 -9287 -239 -6668 -10530 -4915 -3447 -8570 -5091
2150 -5091 -3955 -7071 -4463 -3642 -10232 -4194 639 -7257 -8075 293 -2598 -9419 -2875 -60 -5568
2165 -5568 -3768 -1779 -4186 -1466 1994 -6821 -2672 5317 -1192 -6012 3309 3167 -3844 364 3875
2180 3875 791 1038 4470 -615 3306 6974 249 139 8641 5678 -2057 5561 7962 1194 3200
2195 3200 6081 4274 4416 7221 2238 4816 9589 4238 1028 9360 9033 1532 4167 10783 3829
2210C829K91K870j692R15K344n240j097P533m591o350O737L258q830K125O694
2225H796n436k482M503k859j423N565o183k501P904j745q788N204N330p397j477
2240b989N491k557l067L449j839j025L964k778n789P132J038r229L574O126n279
2255c778l331M750j256k502K490j225j462M275j391n947O112L358r346K80P527
2270a446l204m888M816K41j704K806j978l423O486J216q593L882O659q419j739
2285i288P899j986l544L345P21k185L980J16n387N459K884p885K111Q284o395
2300a871l365O544J189m452P02L374k756K996R29n240L661N219o503j945Q962
2315G444l143n527N462K305m121J541J523k850L502J872o905K466O942n635m912
$$ plain form
2210 3829 4120 6990 5298 6213 8557 3317 2220 9753 5162 -1188 5549 8807 -23 2102 8796
2225 8796 3360 878 5381 2522 1099 6664 481 -2020 5884 4139 -4649 555 5885 -1512 -2989
2240 -2989 2502 -55 -3122 327 -1512 -2537 1427 -1351 -7140 -8 1030 -8199 -4625 1501 -3778
2255 -3778 -7109 -2359 -3615 -6117 -3627 -4852 -6314 -2039 -3430 -9377 -3265 93 -9253 -8973 -1446
2270 -1446 -4650 -9538 -4722 -4481 -6185 -3379 -5357 -8780 -2294 -1078 -9671 -5789 870 -7549 -9288
2285 -9288 -1389 -3375 -6919 -3574 -2853 -5038 -1058 -942 -6329 -870 2014 -5871 -3760 4524 -1871
2300 -1871 -5236 1308 2497 -1955 -1253 2121 -635 2361 3290 -1950 1711 6930 427 -1518 7444
2315 7444 4301 -1226 4236 6541 2420 3961 5484 2634 6136 8008 1103 3569 10511 4876 -36
2330c6P090Q69n283L028K553l720J509O90m387K979K656o697o10Q658k692p099
2346d92N880K674o288q45N493m035J38J944l448J336L535m523l400P783j383p905
2362c536L125N284n690k1K527k785l34L330n459m94O190m024o122P693J478p552
2378f390O72N731l659k270M339k595j065L877l140k954O645k045q096O316M416
2393b18o490o24N542k537k901L599j263j894N352m554l683P129J512q754K813
2408f971P307m214m123O001o43k062K780j640j413M468q18n439N836L521p299
2423d709L52P315k818n101O660K01l876L824j727j871N133J364q252M010O455
2438F960n650l280Q097j399m793L821P93k028K000k5l779N268L660q820J625P619
$$ plain form
2330 -36 7054 7923 2640 5668 8221 4501 6010 6700 2313 5292 7948 1251 641 9299 6607 -492
2346 -492 5388 8062 1774 929 6422 2387 2525 4469 1021 2357 5892 1369 -2031 5752 4369 -3536
2362 -3536 -411 4873 -817 -838 1689 -1096 -1430 1900 -3559 -4053 2137 -1887 -8009 -316 1162 -6390
2378 -6390 -5718 13 -3646 -5916 -1577 -4172 -5237 -1360 -4500 -7454 -809 -2854 -10950 -4634 -218
2393 -218 -6708 -7332 -1790 -4327 -7228 -3629 -4892 -6786 -1434 -5988 -9671 -2542 -1030 -9784 -6971
2408 -6971 336 -3878 -8001 -2000 -2643 -4705 -1925 -3565 -4978 -510 -1328 -6767 -931 2590 -4709
2423 -4709 -4357 2958 140 -4961 1699 1900 -1976 1848 121 -1750 3383 4747 -3505 505 6960
2438 6960 1310 -1970 6127 4728 -65 3756 4549 2521 4521 4496 717 5985 9645 825 2450 10069
2454A0069n857n080O782K090n367K460j2k677M042Q50n816L333N072p003k885
2469AQ834k430o352M800J865m021M81K067l740K037K127o614J885P126o638l559
2485b131P172J81p295K088L950n461J076K793l846J569K651o145m44O341k711
2500b12p591P143K072o640L80M833m228k13L137l788j03M222k988m941P780j317
2516b454o478L142N454o603J95N033l019j267K388l403J48N115l212n206O783
2531c384K540q041K814N367m369j319M139j897k29L162k494k776O355j290n942
2546g364N107N696p380l98N988j652k621K702o56j076M304k356l618O401J347
2561D424p146K697P412o005l065N934k23l420L205Q4l330N115m13n547N660L040
$$ plain form
2454 10069 4212 -868 5914 8004 2637 5097 5085 2408 6450 7300 1484 4817 9889 2886 1
2469 1 8835 6405 53 4853 6718 2697 3178 5245 1505 3542 5669 -945 940 8066 1428 -2131
2485 -2131 5041 5222 -2073 15 3965 -1496 -420 2373 -1473 96 2747 -3398 -3842 2499 -212
2500 -212 -7803 -660 1412 -5228 -4848 -15 -4243 -4456 -1319 -5107 -5210 -988 -3976 -8917 -1137 -2454
2516 -2454 -8932 -5790 -336 -6939 -6744 -1711 -4730 -5997 -3609 -7012 -6864 -1749 -4961 -10167 -3384
2531 -3384 -844 -8885 -6071 -704 -5073 -6392 -2253 -4150 -4379 -1217 -3711 -6487 -132 -1422 -7364
2546 -7364 -2257 3439 -3941 -4339 1649 -3 -2624 78 -578 -1654 2650 294 -3324 3077 4424
2561 4424 -2722 -25 7387 1382 -1683 4251 4028 608 3813 3897 567 5682 5269 -278 5382 8422
2577H422p261J611O134l113m144M355K5k737K148r40l154N951o65o255L914M666
2593H957n959k240P140k350m200K735J365k909K294J62n217M756K141p483K58
2608e50O881l386n094O163O03m575J194J503l228K082O5n330K841M414o600j923
2624d940P983k789o117M512L057n849J26J930k075J33K857m250J233N299o010
2639d900l455N932J370p168K353M746l913n56K449l579R52L456n242j172Q175
2654e52k017p499O807K044o243J643L062j662o2K683l410j73M771l702k160O286
2670a84N87o868K965N530n497o00N330k349q05K802l073L0O018k803n760P728
2686C051J446p244K274N191l302j227L222j592j037N101m712o25P004k010p162
$$ plain form
2577 8422 1161 2772 8906 5793 1649 6004 6029 3292 5440 4500 1346 7297 6632 377 4291 8957
2593 8957 2998 758 7898 5548 1348 4083 5448 2539 4833 4995 -222 4534 6675 -808 -550
2608 -550 6331 2945 -2149 4014 4617 42 1236 2739 -489 1593 1658 -3672 -831 3583 -3017 -4940
2624 -4940 3043 254 -5863 -1351 1706 -4143 -4017 -2087 -4162 -4029 -1172 -5422 -4189 1110 -4900
2639 -4900 -8355 -2423 -1053 -8221 -5868 -1122 -5035 -5591 -3142 -6721 -5769 -2313 -7555 -8727 -552
2654 -552 -2569 -10068 -3261 -1217 -7460 -5817 -2755 -4417 -4479 -1796 -5206 -5379 -608 -4310 -6470 -184
2670 -184 403 -6465 -3500 2030 -3467 -4067 1263 -1086 -1891 911 -2162 -2132 3886 1083 -4677 3051
2686 3051 4497 -2747 -473 4718 1416 189 3411 1819 782 5883 1171 546 7550 5540 -1622
2701a622N997M933p114o98N883k161k852L894j455j851L609k574k201M772O80
2716G240o715K505N939n104l302O212j635k998K549j64k272L742p03o755N598
2731D137K755p619k29P775m350m393N185l15m178K812j3k936L095O40n620K606
2747f48M160n944k850P957j234o080M062J427m741K542p86l710M211K440p412
2762f606J236P119n711m456P527j064n133K578O30j661J574J802n053K632L557
2777a029n149j852P183j736o111N040K960n788O64M238l103q4L292m542J79O484
2793F46l399n260Q236M94o230L544K424l282O39J504k740J554L940m204q59O410
2809C417k354n495N668L588o507J005N396l806J07L156l573N11M335k951k608
$$ plain form
2701 -1622 4375 9308 2194 1496 7379 5218 2366 6260 4805 2954 6563 3989 1788 6560 7240
2716 7240 525 3030 8969 3865 563 6775 5140 2142 4691 4527 2255 5997 5294 -1461 4137
2731 4137 6892 -727 -956 6819 2469 -1924 3261 2946 -1232 1580 1567 -1369 1726 2366 -3254 -648
2747 -648 3512 -2432 -5282 2675 1441 -4639 -577 850 -3891 -1349 -2135 -5845 -1634 806 -6606
2762 -6606 -5370 1749 -3962 -8418 -891 -1955 -7088 -4510 -3880 -5541 -3967 -2165 -7218 -4586 -1029
2777 -1029 -6178 -8030 -847 -2583 -8694 -3654 -694 -6482 -5818 -1580 -4683 -4767 -1475 -6017 -5838 646
2793 646 -2753 -8013 223 717 -5513 -1969 455 -2827 -2188 -684 -3424 -1870 2070 -2134 -2993 3417
2809 3417 1063 -4432 1236 4824 -1683 -678 4718 912 1019 4175 602 1113 5448 2497 -111
2824a11O241M5p354L627N876n823q65N206j897j900K610k386j599N831l121m455
2840g5O206K239p879J954N031k845l298M422k203p85K505k507j403N147j637o374
2856a502N718L015p005Q9M948k619l686L862r70j021K846j827m260M433O59o164
2872c484K028O029m259l892M345p71l476L189n92l446L431j13m698L774K461o426
2888e900J330N130l907l435L967J071m866L274L44k713K953M01n007K096M598
2903f64m897k814O225M45n474L954J530l474K594K16l065K616J366n340J587O908
2919A713n064l814P096J14n050K096K490k025J541L24l342L431K976n611q00P177
2935C252k132n784N851L101n342M97L858m102K578J783m088M63O708m538l810
$$ plain form
2824 -111 6130 6175 -1179 2448 8324 2501 1636 6842 4945 3045 5655 3269 1670 7501 4380 -75
2840 -75 6131 8370 491 2445 7476 4631 1333 5755 3552 2767 5272 2765 1362 6509 4872 -1502
2856 -1502 4216 7231 226 315 5263 2644 -1042 2820 1850 829 3675 1848 -2412 2021 2680 -3484
2872 -3484 -1456 4573 314 -3578 767 -4 -3480 -291 -883 -4329 -898 -1011 -5709 -1935 526 -5900
2888 -5900 -4570 560 -3347 -6782 -2815 -1744 -6610 -3336 -2992 -5705 -2752 -2351 -7358 -5262 -664
2903 -664 -5561 -8375 -2150 -1705 -7179 -3225 -1695 -5169 -2575 -2359 -5424 -2808 -1442 -6782 -5195 1713
2919 1713 -3351 -7165 -69 45 -5005 -2909 -419 -2444 -903 -579 -3921 -490 2486 -3125 -3925 3252
2935 3252 1120 -4664 1187 4288 -1054 -557 3301 -801 1777 3560 -528 -65 6643 2105 -1705
2950a705N872O67n680M270L293m157P44J563j998m14L520m103J03M399j161n570
2966c57N984J514n956P27M922k576j416K381k653M67M399n035k016O185k205n482
2982a117L821M903p694N02L089j244j847K509j549j387L344k582l317N362J015
2997C808p212K042N164m453k975M374o16l070K004j070j465L667q91n501L478
3012b716M723n971j154N144j587m725M213n08k778L102q30k609L138O70n987K983
3028d892N404m698l506N555q72m542M294o82j553L366q75l496L272K851n083M18
3044e039O367l835l232L940J730l143J048J515j951K508J327m354J153O038n887
3059a815k444P099j361n063L582K630m188J807J898k735L173J734n987J800N907
$$ plain form
2950 -1705 4167 4834 -846 3424 6717 2560 3304 4867 2869 2455 5975 1872 1975 6374 5213 -357
2966 -357 5627 7141 1185 1912 6834 4258 2842 5223 2570 3037 7436 2401 385 6570 4365 -1117
2982 -1117 2704 7607 -87 415 3504 2260 413 2922 1373 -14 3330 748 -2569 2793 3808
2997 3808 -3404 -1362 3802 -651 -3626 748 132 -2938 -934 -2004 -3469 198 -693 -6194 -2716
3012 -2716 2007 -3964 -5118 26 -1561 -6286 -2073 -2581 -5359 -2257 -3087 -5696 -2558 -1888 -7875 -4892
3028 -4892 512 -4186 -7692 -2137 -3009 -7551 -3257 -3939 -5492 -2126 -3001 -6497 -3225 -374 -5457 -5039
3044 -5039 1328 -2507 -5739 -1799 -69 -3212 -2164 -649 -2600 -92 1235 -3119 -1966 4072 -1815
3059 -1815 -4259 2840 1479 -3584 -2 2628 -1560 247 2145 -590 2583 4317 -1670 130 6037
3074F037l657l786N742J452m960J711L094m035J735J075l610J859L842l933k251
3089C15O900k528m395M406J674l908L45K179j533K49Q46k611J80M708l707l223
3105a03N961q36o608L038M021l624j106K889k115K75K148l552j265N103k672m054
3121b500N235J439o293O87L845k164k027J697j267o89L065k344l651N476N07o266
3137e250L347K934l643k752M338r21j541J644j934p13L645k206l408M048J996
3152d16o030J574M916l879k891L722l28k433K938j055q82L990r85n468M917L293
3168I83o701q27O719q22m182K756L42j362J493j82k906L862K544o142K037N358
3184B970l707k254L889n04k089K185O45j889J651J83l089L276M060n684k87N649
$$ plain form
3074 6037 2380 -1406 4336 5788 828 2539 5633 1598 3333 4408 798 2657 6499 2566 315
3089 315 7215 4687 292 4698 6372 2464 2809 4988 3455 3704 4550 1939 2119 6827 3120 -103
3105 -103 5858 5022 -1586 1452 5473 1849 743 3632 1517 1792 3940 388 -877 4226 1554 -2500
3121 -2500 2735 4174 -2119 -1432 2413 249 -1778 -81 -1348 -2037 1028 -1316 -4967 509 1016 -5250
3137 -5250 -1903 1031 -2612 -5364 -1026 -1947 -3488 -1844 -3778 -4491 -846 -3052 -6460 -2412 -416
3152 -416 -6446 -4872 44 -3835 -6726 -3004 -3332 -5765 -2827 -3882 -4764 -774 -1759 -7227 -2310 983
3168 983 -5718 -6545 174 -648 -4830 -2074 -1732 -3094 -1601 -1783 -4689 -827 1717 -4425 -2388 2970
3184 2970 -737 -2991 898 394 -1695 490 1135 -754 897 1080 -2009 1267 5327 -357 -644 5005
3200E005l422l090N155n2l556J956K742l484K427Q48l850J686L818n459j72O077
3216F629k174l904M281O30l189J529J47k187J942K061m702K70N158l190l388M530
3232D443J70m195J315K794l448K178J77l373J618K807m444l33M585k294m421L756
3248A335R91l760J097K213k821N50L335n013O21L163l416k880N497k06o519L081
3264b732M129m274j666L633k382R63J080k826O9M857l683m142M804J866n354J0
3280e648M828k986n18J685p62j401K813j220k067L932R0n600L844M113n530l24
3296d751M195j137k033L178j452j695M135j049m289N326O38n183K300M627m675
3311a865j484L736M43k460K294j83j779L706K58n003L879J993m107q48N830k379
$$ plain form
3200 5005 1583 -1507 3648 3596 40 1996 4738 1254 3681 4529 679 2365 6183 724 552 6629
3216 6629 4455 551 4832 5462 2273 3802 3949 1762 3704 5765 1063 1333 6491 3301 -87 4443
3232 4443 4613 418 1733 4527 1079 3257 3434 61 1679 4486 42 -291 4294 2000 -2421 1335
3248 1335 2326 -1434 -337 1876 -945 -395 2940 -2073 -1452 1711 -1705 -4585 912 706 -5813 -2732
3264 -2732 1397 -2877 -4543 -910 -3292 -2329 -1249 -4075 -4006 851 -2832 -6974 -2170 -304 -5658 -5648
3280 -5648 -820 -3806 -4324 -2639 -3401 -4802 -1989 -3209 -5276 -1344 -1254 -6854 -3010 1103 -4427 -4751
3296 -4751 -556 -1693 -3726 -548 -2000 -3695 440 -609 -4898 428 1066 -4117 -1817 2810 -1865
3311 -1865 -3349 387 830 -1630 664 481 -1298 2408 2666 -2337 1542 3535 -572 -1420 4410 2031
3327B031k424K924Mj127J135L55k542L652L76l507J436M934n490j526M862o72
3343D421k596J723R82k370J627k7k087J641K123m471n58O416m216k174L481K83
3359D198l372J327R13j738J617N37m398K304L738m718j646N611j597m593J104
3374g13K739k443K56M84j267J761J941n654J053M299l057l416M429J223o132K488
3390b009K614k188o73J813l107K201K642m679k076N471k359l479M029Q91l339
3405d248Q4K602k170P3J442q44p28K264k827o02L771L22m845K878L436m285j80
3422c857K055m79j048J847r93j255M533j144m454M491J886m981J479L174k474
3437a220j747L580o06j395K230j390j220M276r74l653L521K968m411j567N031
$$ plain form
3327 2031 -393 2531 2535 1408 2543 2898 356 4008 4384 877 2313 7247 1757 231 5093 4421
3343 4421 1825 3548 4530 2160 3787 3760 1673 3314 5437 966 408 6824 2608 434 3915 4198
3359 4198 826 2153 3066 1328 2945 3482 -916 1388 5126 408 -1238 4373 2776 -1817 -713
3374 -713 2026 -417 -161 323 -944 817 2758 -2896 -1843 2456 -601 -4017 412 1635 -4497 -2009
3390 -2009 605 -1583 -2256 -443 -3550 -1349 1293 -3386 -5462 9 -2350 -5829 -1800 -909 -4248
3405 -4248 -4164 -1562 -3732 -3659 -2217 -3061 -3789 -1525 -4352 -4954 -1183 -861 -5706 -2828 608 -3677 -3857
3422 -3857 -1802 -2281 -3329 -1482 -2475 -3730 803 -341 -4795 -304 1582 -3399 -1920 1254 -1220
3437 -1220 -2967 613 7 -1388 842 -548 -1768 2508 1534 -2119 1402 4370 -41 -1608 3423
3452C423k394r90K540r94o79K831j124j736K750J392n544J422N208l698j526L545
3468D426q7k453J011R76j115J073M31m178K676K777m698J70M012j502k743K604
3484C380K54j541R36L7j760K434J34m113Q34L822l056j879L622k90m316K414R27
3501A839j887J645j651j316R70J722k587j548M239j662l647L879O03l536J846
3516a091O27j842J599M83l425J793J723l831n98N392j837m517J930J919k555O64
3532c566J671j833J255J187k902J040K421j658l349M593K46m749K649K811l156
3547c340N55K249k251J118J115j796m43M317k192l761L978L012n548Q83L719k319
3563g04j407K500n79n23L118k571j140L386K60m547J814M117l357j144M056k449
$$ plain form
3452 3423 1029 39 2579 1585 906 3737 2613 877 3627 5019 -525 897 6105 2407 881 4426
3468 4426 4339 1886 2897 3873 2758 3831 4262 84 2760 5537 839 1009 5021 3519 776 3380
3484 3380 3634 2093 3029 3066 1306 3740 3874 -239 595 4417 1361 -518 3104 2814 -1502 912 1839
3501 1839 -48 1597 -54 -1370 -400 1322 -1265 -2813 1426 -236 -3883 -4 599 -2937 -1091
3516 -1091 -464 -2306 -707 -224 -3649 -1856 -133 -3964 -4562 830 -1007 -5524 -3594 -1675 -4230 -3566
3532 -3566 -1895 -3728 -2473 -1286 -4188 -3148 -727 -2385 -5734 -1141 -895 -5644 -2995 -184 -3340
3547 -3340 -2785 -536 -2787 -1669 -554 -2350 -2793 1524 -668 -4429 -451 2561 -2987 -2104 1615 -704
3563 -704 -2111 389 -190 -713 2405 -166 -1306 2080 2340 -2207 -393 3724 367 -777 3279 830
3579H30m35K782k647n02L985j383l750L511J638l753k47N131k911j784L286j724
3595B027N16P73j036k407M464%n142L351L309m448p94K881n66j917J651l83r41
3612A338K200j087k241K787R76m792J873L287k438l391L918o56k533J550k95q20
3628c24J059J94l056K816J695l319j470L456j192k695J993J208k223J097k96j705
3644b762J799J034m248K123K927l645j346L086K44m227K684O89j532J064J60j157
3660c107M61J595m162J739M272k654k082K712O96l229J337P01j751R24R64k414
3676c998J635K584k596q69M798k530k957J939K613l308R08J247m05J422R75k676
3692a218K0L510k110k503L771L58l214J219K925k267o43K348j025j30J335j449
$$ plain form
3579 830 395 3177 530 28 4013 2630 -1120 2391 4029 276 29 5160 2249 465 3751 2027
3595 2027 2543 3316 2280 -127 4337 4337 -805 2546 5855 1407 613 3494 2928 1011 2662 2279 1338
3612 1338 3538 2451 210 2997 3973 -819 1054 4341 1903 -1488 2430 1774 -759 791 496 -324
3628 -324 735 929 -2127 689 2384 -935 -2405 1051 -141 -2836 -843 365 -1858 -761 -1057 -2762
3644 -2762 -963 71 -4177 -2054 873 -2772 -4118 -1032 -788 -5015 -2331 -1642 -3174 -2110 -1950 -3107
3660 -3107 -2646 -1051 -5213 -3474 798 -1856 -3938 -1226 -530 -3759 -2422 -1721 -3472 -2548 -1584 -3998
3676 -3998 -2363 221 -2375 -3244 1554 -976 -3933 -1994 619 -2689 -1781 -534 -939 483 1458 -1218
3692 -1218 -1198 2312 202 -2301 1470 1828 -1386 -167 2758 491 -152 2196 1171 1041 2376 927
3708I27L24K805j245m150L498K440l721q08L658k526R71K044j969O10J205j638
3724B425k835M212j76m477K816L181m111j402L471o10p36J423j169n34J706r40
3740B244k840K851J379m478J483K639k202j717K841j187j386K287j459j501L006
3755A960j225k263K276K176l071k112L725j681j708J988l44j539Q35Q69l684L202
3771e96L70l528R77K807j951k181L499K8k660J679k24j614K223o48k259J694J577
3788h07k909N58L724k248k102J265J029n10N74j582p79K777R52m497K256L046
3804G47k999j587L931j22l547L059L46j061N73P07k161K324K28k660Q08L695j977
3821C04k037K337M87j391L01J516j059M0J860k432O94K881k674j023M887j671
$$ plain form
3708 927 1251 4056 2811 -1339 2159 4599 878 70 3728 1202 2173 4217 2248 2858 4063 2425
3724 2425 -410 3802 3626 -851 1965 5146 1035 -367 3104 2494 1758 3181 2012 1478 3184 2244
3740 2244 -596 2255 3634 -844 639 3278 1076 -641 2200 1013 -373 1914 455 -1046 1960
3755 1960 735 -1528 748 2924 -147 -2259 1466 -215 -1923 65 -279 -1818 -983 -114 -3798 -596
3771 -596 -226 -3754 -2777 30 -1921 -4102 -603 -575 -3235 -1556 -1780 -3394 -1171 -1819 -4078 -2384 -807
3788 -807 -3716 -3158 566 -1682 -3784 -2519 -1490 -2000 -1426 -3008 -3787 -1010 -58 -4555 -2299 747
3804 747 -2252 -3839 92 -30 -3577 -518 -172 -1233 -660 47 -2114 210 438 -2222 -1414 2281 304
3821 304 -1733 604 1091 -300 1 1517 458 498 2358 -74 620 3501 827 -196 4691 3020
3837C020l789K718J373j909l80K159k301K14L046l120L47K009j010k008L549P16
3853D634n164J617K376j788J77J347j085K93J272k050L39J847j931l640M090J475
3869C809m638R03K898k086j257K497j703J19Q43j054k433L918j091k910K806J820
3885B441l089j142K126j439k47J487j504p8J512n98k482K087J540m591J653K201
3901a23k104n30K226n54k86l68K44q88J671n02k566J610K546m251l29M244k640
3918b600j606K060M12m09J293q40k074L175P82k801K52K917j636k770L534N35
3934B24j948J196Q59k223J815j77k308K704J564m036J073L518j675k195L367n57
3950A201j705J441m76r59J861J013j709l39L253k987j361L528K00l453K369O12
$$ plain form
3837 3020 -769 1949 3322 1413 1033 3192 891 1105 4151 1031 1378 3387 2377 369 3918 4634
3853 4634 -530 1087 3463 1675 1852 3199 2114 2407 3679 1629 1968 3815 1884 -1756 2334 3809
3869 3809 -829 74 2972 886 -371 2126 423 542 1385 331 -2102 1816 725 -2185 621 2441
3885 2441 -648 -1790 336 -1103 -1350 137 -1367 -1445 67 -531 -3013 -926 614 -3977 -2324 -123
3901 -123 -2227 -2757 -531 -1085 -1371 -1739 -1495 -2383 -712 -1214 -3780 -2170 376 -3875 -4204 40 -2600
3918 -2600 -4206 -2146 -1734 -2143 -850 -1690 -3764 -589 193 -2608 -2356 561 -1075 -3845 -311 224
3934 224 -1724 -528 331 -1892 -77 -254 -2562 142 1706 -2330 -1257 2261 586 -1609 1758 1201
3950 1201 -504 937 461 -498 1363 2376 667 328 3581 594 -767 2761 2961 -492 1877 2489
3966B489j188m06M01O5N8K418k872k07K986r76l321L675J40l658K466J081r32
3983B219q6J39j571M18K497l904M75M133k294k094J168K205k514q55J837j0n92
4000A171N25j683n56K659j817j789K699M32l105R37K032k581N45Q31j774P59J305
4017E90j449j149L012j075l070K272J771l328O61K033j947j142K760j744r35J571
4033a169o16j677L402m86m198K934J811l066M24K186l86o30J12l83p37L147j703
4050a035j710K727K83l435O64L410j897j672K233Jk152K543r99j762L244L37k910
4067b130K056J226l260J178J655m52k176J870J171j848J354N21q63J457K65k587
4083e63J515K194j949j432L454j660j342J582J079k505K395o71j519K437M27k303
$$ plain form
3966 2489 1301 895 1296 1361 1419 3837 965 758 3744 2768 -553 3122 3262 -396 2070 3151 2219
3983 2219 2133 2272 701 1119 3616 -288 187 4320 2026 -68 1100 3305 791 -64 1773 1763 1171
4000 1171 1696 13 -543 2116 299 -1490 1209 1641 -1464 -527 1505 -1076 -531 300 -1474 -715 590
4017 590 -859 -2008 1004 -71 -3141 -869 902 -2426 -1765 268 -1679 -2821 -61 -1805 -2740 -1169
4033 -1169 -1785 -3462 -60 -546 -4744 -1810 1 -3065 -2641 -455 -841 -1471 -1359 -1742 -2479 668 -1035
4050 -1035 -2745 -18 265 -3170 -2506 904 -993 -2665 -432 -431 -2583 -40 -1039 -2801 443 780 -2130
4067 -2130 -74 1152 -2108 -930 725 273 -1903 -33 1138 -710 644 1165 302 1759 2024 -563
4083 -563 952 3146 1197 -235 3219 1559 217 1799 2878 373 2768 2097 578 3015 3442 1139
4099A139l52K111r26j644K544K41k430J494j62O79o00K26k394K800K79j087j904
4116A4K429J22k146J62J422k599O03J898j630R13J65k031N48L806m736p70K810
4133I80N42k649J232M73j191j94R01j434R00P14j012j347K979k009k038J904R46
4150c03j775N65K392k477N54J017j199q44J963j245j635K207K46l390J159K555
4166b10k665j59K672k370M29J295j671p87L186j512k304L129Q91l068J570J792
4182B18k017OJ390j653J220M48l46j305K158k82k579K612O47j164L8J260o25j674
4200a648K535P61k323K510j666p72K868q2l087K110K041l103Q62R66k4j260K85
4217I73j84p69K979m48k922K247J024j690o78K332j03j700J491Q19k163O32o6
$$ plain form
4099 1139 787 2898 1972 328 2872 3113 683 2177 2015 2694 2094 2320 -74 2726 3005 1918 14
4116 14 2443 2565 419 581 2003 -596 7 1905 275 1188 1353 -678 -130 3676 -1060 -1830 980
4133 980 1522 -1127 105 578 -613 -807 94 -1340 -440 274 -738 -2085 894 -1115 -3153 -1249 -303
4150 -303 -2078 -1513 879 -1598 -1044 -27 -1226 -2070 -107 -1352 -2987 -780 -534 -3924 -2765 -210
4166 -210 -2875 -3034 -362 -2732 -2303 -1008 -2679 -3466 -280 -1792 -4096 -967 -76 -3144 -1574 218
4182 218 -1799 -1793 -403 -2056 -836 -388 -734 -2039 119 -163 -2742 -130 517 -647 -609 651 26 -1648
4200 -1648 887 1648 -675 1835 169 -603 2265 2183 -904 1206 3247 144 1006 1972 1948 688 973
4217 973 789 20 2999 2551 -371 1876 2900 1210 532 2864 2761 1061 2552 3371 1208 1840 1774
4234A774j828K501m13j946Q60K292j818k093L164M23k429M82K81l82q57J792k218
4251d15J830R56l515J078K205j840j467K095j0j629P98J364l024P22L3j016R05
4268i30J627k176j561L809r74l173K209J603l440J550J461j690l96J065j617L69
4284b264J771j283j724K716N50k648R81J518j482J87J009j908J017K047k801l28
4300b642L510r92l569L419L45j712L59R12n46j099P96O67L04L33j613j427K685
4317b70L34k593J479K999l004n1K331k026N33K259k292k63K259l28k544K895J045
4334B763l172J180J769j702l57R26O45m09K39m80j851L039l23k593J650K417k630
4351A111o04K837j909n58J722k73j282Q15J31k561K663R49k391O02K238l899K48
$$ plain form
4234 1774 -54 2447 2034 88 948 3240 1422 -671 2493 2916 487 969 1250 868 11 1803 -415
4251 -415 1415 2371 -1144 -66 2139 299 -1168 927 917 -712 86 1450 -1574 -852 -819 -1835 -930
4268 -930 697 -1479 -3040 769 -205 -3378 -1169 434 -3006 -1456 5 -1685 -2081 -1016 -2633 -2264
4284 -2264 -493 -1776 -3500 -784 -234 -2882 -1901 -383 -1865 -1678 -669 -2577 -1560 487 -2314 -2642
4300 -2642 868 -124 -3693 -274 71 -1641 -1282 -370 -916 -2015 -1219 -552 -248 85 -1528 -2955 -270
4317 -270 64 -2529 -1050 1949 -1055 -1106 1225 -801 -268 1991 -301 -564 1695 1367 -1177 1718 2763
4334 2763 -409 771 2540 838 481 1407 2052 1643 1882 1402 -449 2590 2267 -326 1324 3741 1111
4351 1111 507 3344 1435 877 2599 2326 1044 1859 1990 -571 2092 3041 650 1252 3490 -409 -161
4368a61K525j707j82J164L32k320J753o21k654K731j01n31n35J138r99q92K794
4385A734l22j911R74k26j586J432j08k751K117R42k133j116M368j241k098L37
4401a588Q34q66L82P10l207J958J711k217o30L629k179j867K273Oj228J069p78
4418a988N58pJ019j744N30J360k685Q01J392M99k881K408R39j662m44J488j081
4435a498N78P97j226L65K453k209j498K673l27j798J846R58j896R86k85m44o5
4452e90K018r46j50J453r99j166J488J295k252P43J822j906n22J356K52j537J245
4469A604n5j372J856k80j655J385O53p21j184K709m16j723P61N93j146K465k149
4486A325j183K692p17j833j63J286O2k068K779l59j211J174j111k98J001o80k081
$$ plain form
4368 -161 2364 657 475 1639 1971 -349 1404 783 -1871 860 759 228 -307 831 -168 -1060 1734
4385 1734 1412 -499 475 249 -1337 95 -13 -2764 -647 295 -1838 -2954 1414 173 -1925 -1588
4401 -1588 -754 -1620 -1238 -528 -3735 -1777 -66 -2283 -2913 716 -1463 -3330 -1057 -1051 -2279 -1210 -1988
4418 -1988 -1430 -1437 -418 -2162 -1632 -272 -2957 -2156 -764 -265 -3146 -738 201 -1461 -1905 -417 -1498
4435 -1498 -920 -123 -1349 -984 1469 -740 -2238 435 108 -1690 156 1114 -782 204 -81 -525 -590
4452 -590 1428 482 332 1785 786 -380 1108 2403 151 894 2716 810 288 1644 1896 359 1604
4469 1604 1549 177 2033 1753 98 1483 2136 1415 231 2940 2524 801 1562 2155 1009 3474 1325
4486 1325 142 2834 2117 284 121 1407 1469 -599 2180 1821 610 1784 673 375 1376 696 -1385
4503a385K666J104l089Q0K058j705j437J960l13r77K572j840j815K610M50k801
4519a862Q88K156j206k008K119j231n10N38M19r68K020m34k064K219p42j097j530
4536c293K857j461r76J161Q34j431J089m1j243K177j156k001J707J432j465j225
4552c035K854n69j744P34J188j154K91Q92j858J329R81j954J405J707j731j271
4568a935K184or61J059L53p35j23O04j867J296J756j520q80K167j17k441K230
4585A064Q55j357P45M06j396J244Q92j858K63J161k77j844K874q12k048J645P63
4602B320j536L1J832k447P71K296k190M4J513q42k227K478j56j477j27J576m55
4619A404j311J667j205k2Q35q43j018K924j483k023J112K134l382p9K814j152
$$ plain form
4503 -1385 1281 2385 -704 -624 1434 -271 -1708 252 -61 -1038 1534 -306 -2121 489 939 -1862
4519 -1862 -974 1182 -24 -2032 87 -1144 -1654 -1116 -697 -1665 355 -79 -2143 76 -666 -1763 -3293
4536 -3293 -436 -1897 -2873 -1712 -878 -2309 -1220 -1261 -2504 -327 -1483 -3484 -1777 -345 -1810 -3035
4552 -3035 -181 -750 -2494 -1760 -572 -1726 -1435 -543 -2401 -1072 -91 -2045 -640 1067 -664 -1935
4568 -1935 249 243 -718 341 694 -41 -164 440 -1427 -131 1625 105 -775 1392 1275 -1166 1064
4585 1064 1919 562 1307 1713 317 1561 2453 595 858 2019 1742 -102 2772 1960 -88 1557 2320
4602 2320 784 815 2647 200 971 3267 1077 1121 2634 1792 -435 2043 1887 410 283 1859 1404
4619 1404 93 1760 555 533 1368 525 -493 2431 948 -1075 37 2171 -1211 -1290 1524 372
4635C72o64J377j361j449K789j691r96K800M66l907P25J674j384N17R82N2j093
4652g91J241r26o97J081j246j235J519J024k706K06K172j874p43K731p91N89O9
4669c77j476J8J509M62m046K752J748k001q67K588r19j321J156p94J105j48M28
4686a83j482J529L48j782Q62J188q69j956K995q5j708J199O42j736K527k20j769
4703e00Q89L30j657P81J840j02k140J285Q73j289J164o76j830J858J329k444J139
4720H50Q96r95o76J439n0m89k9R18L69k528J908q45N98q9n33P63J633k109r37
4739I4K092p75r83J122K03r49K37O63j489m53K802k664o90K391p37k056J530J770
4757B108j773r42J365k002M85J316j535O16J374j085j404J229J709l619N61J928
$$ plain form
4635 372 -292 1085 -276 -1725 1064 -627 -1623 1177 1643 -2264 -1539 135 -1249 -732 250 302 -791
4652 -791 450 -476 -1173 -92 -1338 -2573 -1054 -30 -2736 -2530 -358 -2232 -2975 -244 -1035 -446 -377
4669 -377 -1853 -1835 -326 136 -3910 -1158 590 -1411 -2278 310 -609 -1930 -774 -1568 -463 -611 -183
4686 -183 -1665 -136 212 -1570 -708 480 -389 -2345 650 565 -1143 56 698 -1038 1489 1269 -500
4703 -500 389 719 -938 -157 1683 1581 -559 726 1599 310 1474 798 -1032 826 2155 -289 850
4720 850 1746 751 75 1514 1464 975 946 1864 2233 -295 1613 768 1366 1277 744 1507 3140 1031 94
4739 94 2186 1411 428 1550 1753 804 1041 1704 215 -238 2564 -100 -790 1601 864 -1192 338 2108
4757 2108 335 -607 758 -1244 -759 557 -978 -362 1012 -73 -1477 -248 1461 -2158 -1597 331
4773C31j120j174J032p8Q51L40j458q64J785o93j483K441J07j919j74K297j253
4790a032j033R80j046M10J780j011j866K005Q60k531J902M23q98l27J019j160
4806a525m24J440r57K79Q53q95j086K334L0o21j54J553j271j63J388q24j575K211
4824E93l48r60J280M8k281K379Q97j846j68J057L07j175R47N45n14J337j511m05
4842A82O77R61k026R13J366j807k69J164J469k224P40O41k047K456J06l068J796
4859A030J445k015q66K442j698j380L387j014J97r7K98k522K578p9k494J607J896
4876B715k322r32K769r45j134m44J060j054P80Q03k892K162m8k70K29R50j412
4893A5j029K494p43k295M58J237r96M51l1o80L48J218k210r1J266n46r56J688
$$ plain form
4773 331 -789 -1963 -931 -1009 -158 182 -1276 -2140 -355 -1048 -2531 -90 17 -1902 -2076 221 -1032
4790 -1032 -2065 -1085 -2131 -1721 59 -952 -2818 -813 47 -2484 -582 -159 -1057 -1384 -365 -1525
4806 -1525 -1949 -509 -1466 -1187 -334 -1229 -2315 19 49 -572 -726 827 -444 -607 781 -43 -1618 593
4824 593 245 -715 565 613 -1668 711 1608 -238 -406 651 958 -217 730 1275 761 2098 587 182
4842 182 859 1820 -206 707 2073 266 -3 1161 2630 406 1146 1787 -260 2196 2302 -766 1030
4859 1030 2475 460 -406 2036 338 -1042 2345 1331 1528 1431 1729 -793 1785 1706 -788 819 2715
4876 2715 393 -539 2230 1285 151 -293 767 -287 493 1296 -1596 566 518 248 477 1427 15
4893 15 -1014 1480 737 -1558 -1100 137 -859 -408 -439 -1119 -771 447 -1763 -1854 -588 -1134 -2090 -402
4911d02N76j557m02J312r86k61J076j010J68J173o70k111J946L84r09l13K041
4928E5j484l65J891j630J143L44p30j226J646o29l92N83J108j174R81N83m96j548
4946a340P95l28j94K282k057j246K521R36k616R16J607j656o05K567o34m44M30
4963I34m85L70Q61j20j842K190m25j532J92K316n74k735K614N7j195J282j178
4980G30j04K84J767k920J520J786k511L06J970q45k01j195K84nL42k35L35R6N72
4999A976j788J54L009l474m62J407K08p10L65Q84j887M86K87j199P55J243j996
5016g42O23J157j975l13Q27J631k360M92J69n83O31Q76j200k73Q96j596j135K620
5034b55O75k268N33R40l99l30K51j444R5J828j083m14J652l21o92J54J734j523
$$ plain form
4911 -402 174 -1383 -1785 -473 -1459 -1720 -644 -1654 -1486 -313 -983 -3094 -1148 -764 -1673 -1986 55
4928 55 -1429 -1794 97 -1533 -390 -46 -776 -2002 -356 -985 -1377 -794 314 -860 121 704 208 -1340
4946 -1340 -545 -873 -1067 1215 -842 -2088 433 1369 -1247 -331 1276 -380 -985 1582 948 504 934
4963 934 449 819 1680 1560 -282 1908 1483 -49 143 2459 1885 -850 1764 1821 626 1908 730
4980 730 626 910 2677 -243 1277 3063 552 858 2828 1983 1782 587 871 866 1208 973 1308 1404 1976
4999 1976 188 342 3351 -123 -585 822 1030 320 685 1569 -318 168 455 -744 11 1254 -742
5016 -742 -119 1038 -937 -1250 -423 1208 -1152 -660 -491 -1074 -443 433 -767 -1040 -144 -1740 -2875 -255
5034 -255 420 -1848 -1315 -375 -774 -1104 -853 -2297 -2202 -374 -1457 -1871 -219 -540 -1232 -1078 656 -867
5052h67l68J00j044J143o6P02K76O41j813M1J910j821r15J011K123j885k43J294
5070B19r20N79Q99j513O18J191j002j702J953N83k146J791R77j008o13O08N06
5087A020k98P09j420J99J663l24k139J572J500l114M71K258j109j14J455j679
5103F50o80K149q37j027K762n14k860J670J306k154q14J663N74j253K28M97J90
5120A550M96q48j381M16J524k454R00K111k190m38O55P32j286J26L0J327k31q73
5138A66j137K76J889j440q55J996o52j556P08N65j184R47k73m53M41M72j865J493
5156d62O75j697n67P98L97p58N64Q24k18l0j074j251J446J084k316R80J047l15
5174h73j156l19K070j555J39N16K65N97k62j136M40J445n11j666J836O48k031
$$ plain form
5052 -867 -1235 -1135 -2179 -1036 -1102 -400 -124 517 -1296 -1255 655 -1166 -2081 -1070 1053 -832 -1075 219
5070 219 -701 -122 777 -736 -118 1073 71 -1631 322 905 -1241 550 1527 519 -94 514 1020
5087 1020 722 1431 11 210 1873 1549 -590 982 2482 -632 -161 2097 988 874 2329 650
5103 650 -30 2119 1282 255 3017 2503 -357 1313 2619 465 -349 1314 1888 635 863 1360 1550
5120 1550 2046 1198 -183 233 1757 -697 203 2314 124 -314 341 1073 -213 -87 -57 1270 1039 166
5138 166 -971 -695 1194 -246 -1101 895 243 -1313 -605 -40 -1224 -277 -550 -1003 -562 -90 -1955 -462
5156 -462 213 -1484 -2051 -1253 -856 -1614 -1050 -226 -444 -474 -1548 -2799 -1353 -269 -2585 -1605 -558 -873
5174 -873 -2029 -2348 -278 -1833 -1694 -1178 -913 -316 -578 -1714 -1274 171 -340 -2006 -170 478 -1553
5191a553P50J043j328M17P64j167L64J353r19o50J994j156o01K254p26j588K94
5208d55R33k82M01j8p09M45J584j943L04J240j00j690O30Q34p50j186J638N3L33
5227A262N68j236L76J022j140j663K255L37k040J260O69r46J70R70j428J519o14
5244A341r04k71J385J41j723K119N14k993M79J672o79j855P50J95K12K78l71N5
5262C45M16k79n53k24J342j443N14J89o93k4O4J636r53K02j771k38Q70J031j437
5281a006%J352j006o87J282o32j143p4J043j354J965p60j37O5P36o14j843K382
5299d31j58j904J653M08k067J057J403j144M8L92j593J185J542j660l28J303l97
5316f91j097Q50K092j565N56K60l33j279J990k736J94L211j582k21J077J442j991
$$ plain form
5191 -1553 -803 240 -1088 -671 93 -1074 -710 643 -276 -926 1068 -88 -689 1565 839 -749 -455
5208 -455 478 196 597 579 -130 315 1899 -44 260 1500 1400 -290 340 1174 424 -762 876 929 1262
5227 1262 1830 594 970 1992 852 -811 1444 1781 -259 1001 1670 724 894 1864 436 1955 1341
5244 1341 437 166 1551 1692 -31 2088 2602 -391 88 1760 1081 -774 -24 171 383 661 290 345
5262 345 761 482 -71 -295 1047 -396 118 307 -386 -410 -346 1290 337 539 -1232 -1470 -600 431 -1006
5281 -1006 -1006 346 -660 -1347 -65 -697 -1840 -1914 -871 -2225 -260 -1020 -1157 -1092 -356 -970 -2813 -431
5299 -431 -589 -2493 -840 -432 -2499 -1442 -39 -1183 -1135 -743 -2336 -1151 391 -1269 -1597 -294 -691
5316 -691 -1788 -938 1154 -411 145 405 72 -1207 783 -1953 -1759 1452 -130 -351 726 2168 177
5333A77N0l57k73J654q42j394K034J366k334r9J899l28k893K369J643k109j48
5350D15n7m52R32J90q5k44J544j228o51J385J103k618l50J384q65Q93L69j542
5368A23K79L49j99o91J838m91o56K76J039k852K030J015k635O18P25Mj59Q27j141
5387B99j532J680J090k975M09J848j344k49J135j050n17n27J364l10J851j985
5403h13o06L88J465k001p36K415j411O18K01n13L8P22r23p13M33M83r23Q43J010
5422b3j301M98J77K94r20R28j549N89P37m80j69k51J819j688j5J587j418j28J353
5441D0J66q85O98j148J39M71M38j225R21J808k823J32K637j318m30J125j70o88
5459a12O83J076j854P95Q38k536J392J473k435M69K717q86o55n89N93l76M48J002
$$ plain form
5333 177 227 -130 -403 1251 409 -985 1049 2415 81 -18 1881 1553 -1340 1029 2672 563 415
5350 415 358 -94 838 1028 943 699 2243 1015 364 1749 2852 234 -116 1268 403 1296 1665 123
5368 123 402 751 552 -139 1699 1208 552 828 1867 -985 1045 2060 -575 43 768 772 613 1440 299
5387 299 -1233 447 1537 -1438 -1029 819 -525 -774 361 -689 -1206 -1733 -369 -679 1172 -813
5403 -813 -1419 -1031 434 -1567 -2303 112 -1299 -681 -480 -993 -955 -233 -1156 -1869 -1436 -953 -1876 -1033 -23
5422 -23 -1324 -826 -649 -355 -1275 -347 -1896 -1307 -570 -1050 -1219 -1470 349 -1339 -1354 233 -1185 -1313 40
5441 40 206 -679 19 -1129 -990 -519 -81 -1306 -385 1423 -1400 -1268 1369 51 -379 746 576 -112
5459 -112 571 1647 -207 588 1426 -1110 282 1755 -680 -211 2506 1620 965 376 969 593 1041 2043
5477B043k058J189J201j949K75J393q09k89l08J738j226l7R74j597P34K21j436
5494E9q80L259k545O05J191j152r52J239K59j679M06R18m58N64L38j642M64J512
5512A506j504j037J157M12n23o42R54j830J152P10o23L29q17p7K64Q46L11j804
5530a216Q75P29k287K64K156j270l05l18K08N58P48j480k51R29n10j105J336J944
5548A005k575k65R65o24Q84J23p79N86J578k477l93N75K12K60r32K490j750O7
5566a050O95k10m61J734n50q15J309j389j083J629J573j245j141K107o84q91N37
5583F5M16j27j99N24p93K87O13j194N09J225p88j020J775j117o87O78J303m78
5601I92J191J48k201J789l75j18k031K563m43j772P71J227j836P31Ll29o1K119
$$ plain form
5477 2043 -15 1174 2375 426 701 2094 1285 996 688 2426 1200 1163 2137 540 1274 1495 59
5494 59 -821 2438 -107 498 1689 537 -415 824 1083 -596 -190 728 270 834 1172 -470 -6 1506
5512 1506 2 -1035 122 534 11 -631 323 -1507 -355 355 -268 61 -756 -833 -569 277 588 -1216
5530 -1216 -341 388 -1899 -1635 521 -749 -1054 -1372 -1164 -606 142 -1338 -1589 -660 -1170 -2275 -939 1005
5548 1005 -1570 -1835 -870 -1494 -610 -487 -1266 -680 898 -1579 -1972 -1397 -1185 -925 -1857 633 -1117 -1050
5566 -1050 -355 -565 -1026 708 158 -657 652 -737 -1820 -191 1382 137 -1004 1103 419 -472 65
5583 65 481 354 155 679 -114 173 786 -408 101 1326 538 -482 1293 176 -511 167 1470 992
5601 992 2183 2331 130 1919 1544 1426 -605 1958 1515 -257 514 1741 -95 636 639 310 249 2368
5619B368k205O20J342n14k26p34J063j650Q12j5J15q3j33q84N95M7n04m85J551
5638A080j97k002J347m6r42j04J373q72j37Q61j619J030Q49j671m33K437p04k827
5656b577J365K128j204l12M79n36P12k5j134P2R85p68l97N44P00j467K73J895
5674G33j441o37R70r02l13L64K89l17K801l026r33K587k0j960O67J012j045K07
5692i64M71m84J017k08p16r73K159L34k504K047K10l86m34R66j569N75N17J56
5710B14n1R40j046J78k08J375k153M5J818J13k044M92K086j524J385o61q97O81
5728G43J88j846J545J759k022N15J493l82k057K406j287p67J316o77j403J754
5744A278j39p48O15Q35j525n42J060o49k99J419n98k22R09j029j277J510K576
$$ plain form
5619 2368 163 783 2125 1611 1385 651 1714 64 876 861 976 893 760 -124 471 518 14 -471 1080
5638 1080 883 -1119 228 182 -760 -864 509 -363 -500 361 -1258 -228 621 -1050 -1483 954 250 -2577
5656 -2577 -1212 916 -288 -600 -121 -657 55 30 -1104 -1032 -47 -815 -1212 -668 32 -1435 -1162 733
5674 733 -708 -1345 -375 -1277 -1590 -1226 -937 -1254 1547 -1479 -2412 175 155 -1805 -1138 -126 -1171 -964
5692 -964 -493 -977 40 -168 -884 -1857 302 636 -1868 179 389 3 -431 535 -1034 -459 58 214
5710 214 163 1103 57 235 27 1402 -751 -706 1112 1225 -819 -327 1759 235 1620 959 62 743
5728 743 931 -915 630 2389 367 882 2375 1993 -64 2342 1055 288 1604 927 -476 1278
5744 1278 1139 391 1006 1841 316 -226 834 185 -114 1305 707 485 1394 365 -912 598 3174
5761C174l806k24K713j055o53J19m61J48P88J91j437p43J884j767M15J264O3j508
5779h95J68M32r41R70L42j815J427q7L40J58Q12j883J85L81l47m23L36L58j373
5798a855p9J331l57k34L67r60O48Q05j361R15J086p68j449J197J059j622k04L99
5816a082L72m94J952j582P80L28p8j422J252L46k213R10J555j218j01M87k37J45
5834c00M86k00J14P97M29k397J953P85k515R56J547k227J002J55O54j055J51Q1
5852D16J14J544l18j927M62J482j481l60N69P09j746P87J40n4J169j149J00k2
5870D35N07q58Q19j35k9k90O11j28j98O50o94J33k99K46j263J846m33j362J83
5889b59P01J93j144J723q24o41J91o29O82j75M52q44k08K540k948k17J067Q22
$$ plain form
5761 3174 -632 -856 1857 802 149 268 -193 -45 743 934 -503 -1246 638 -1129 -714 550 613 -895
5779 -895 -727 -295 -1236 -266 76 -1739 -312 -399 -59 99 911 -972 -787 -406 -753 -1176 -840 -482 -1855
5798 -1855 -1934 -603 -960 -1194 -827 -1787 -1139 -334 -1695 -780 306 -462 -1911 -714 345 -1277 -1481 -1082
5816 -1082 -710 -1204 748 -834 -54 274 196 -1226 26 372 -1841 -931 624 -594 -695 -208 -445 -300
5834 -300 186 -14 100 897 1326 -1071 882 1667 -848 108 1655 -572 430 585 1239 184 335 416
5852 416 530 2074 1756 -171 291 1773 292 -68 501 1210 -536 251 391 337 1506 357 457 435
5870 435 942 84 903 768 739 449 1060 932 734 1384 690 823 524 770 -493 1353 920 -442 -259
5889 -259 442 635 -509 1214 390 -251 -60 -689 -7 -182 270 -574 -782 1758 -1190 -1407 -340 482
5907D82j725J133m28o2K27l83L26lO88j258N52Q2j38j392N90J276p64Q40o83o66
5927a306j88L81O33q25J483j604q7J673o74r56O77N36p85M95J43n99R16l98m24
5946i09K61Q48o73j568K609J38j729J92O86r11J42K32N29q34J819o33m25Q93j342
5965f75R7K31J332j115J013n33n15R25k87p88J670r9j85k9Q81k1k376Q64J091
5984A481j690N22J500o94m06P61p11n24Q54O71j651J163L90j146j73J294j042
6001E99k04Q37k208J790J03o86n91J253o2k033K145R3m57o31J471j217j30R83
6019A055j331j29N82K00n57P08R15k174Q9J731j484N44O5k57q84M17j79m76J173
6038Ho28K4Q79K17k181p89K909r45j722J123o13L71L96j87L82M22L09j795R65
$$ plain form
5907 482 -1243 -110 -538 -600 -373 -756 -430 -433 255 -1003 -451 -369 -507 -1899 -1309 -33 -797 43 -640 -1306
5927 -1306 -1494 -1113 -480 -1305 178 -1426 -1513 160 -514 -1470 -793 -257 -1042 -547 -404 -1003 -87 -485 -909
5946 -909 -648 200 -473 -2041 568 706 -1023 -831 -145 -1056 -914 -682 -153 -987 832 199 -226 667 -675
5965 -675 -578 -347 985 -130 883 350 -165 760 473 -315 1355 1256 1071 1042 1923 1902 -474 390 1481
5984 1481 -209 313 1813 1119 713 1474 763 239 1093 1764 113 1276 1666 520 347 1641 599
6001 599 395 1232 -976 814 917 231 -360 893 831 -1202 943 1036 579 -52 1419 202 72 1055
6019 1055 -276 -405 177 377 -180 528 1443 -731 -642 1089 -395 149 214 -43 -927 -510 -689 -1165 8
6038 8 -620 -596 283 500 -1681 -2470 439 -506 -2228 -1105 -1718 -1347 -951 -1138 -756 -334 -25 -1820 -855
6057h55L53o21L2R48O1k27K87k85k39M07J06p99j7j43J12M06J505j644n49J162
6077@L40j305R35N0k80J26j5o81j13J566l65j110J806n88n87L12L39l89J81K00
6097D22P60q44K41n54L69Q21m12q38Q13L54p21l76K50L9o74O45n53O54J407m69
6117A334j443J110o82l75J311k43o13j293J999k69j85L02n39n87J132p9j738P09
6135a49J273j651J022K63j556J232Q15k080J377o80O0p57N2P77o34J357n59j308
6153a146j20K278o91r18J32L63J64J55j843K040J41j821J158n62L31o85p35J213
6171e46m03K02K94j55j314J856j119k31O79Q9j199J767Oj212K04J262k18j85j250
6190a473J565q30L93j070k23N27Q78r47O99P78l38o86o0J906j667k37Q56j33K01
$$ plain form
6057 -855 -502 -1123 -1091 -143 -82 -309 -22 -307 -546 -139 -33 -832 -849 -992 -880 -474 1031 -613 -1162 0
6077 0 340 -965 -30 20 -260 -134 -149 -830 -943 623 258 -852 954 366 -221 91 430 41 222 422
6097 422 1182 338 579 25 394 1215 803 -35 778 1132 411 35 285 324 -350 295 -258 396 1803 1334
6117 1334 -109 1001 319 -56 1255 1012 399 -894 1105 836 651 953 414 -173 959 880 -858 -149
6135 -149 1124 -527 495 758 -798 434 1249 -831 546 -134 -74 -831 -779 -2 -636 721 162 -1146
6153 -1146 -1266 1012 321 -597 -465 -102 62 217 -1626 414 555 -1266 -108 -670 -339 -1024 -1759 -546
6171 -546 -949 -747 -453 -608 -1922 -66 -1185 -1416 -737 -648 -1847 -80 -74 -1286 -1082 180 -38 -223 -1473
6190 -1473 92 -738 -345 -1415 -1638 -1111 -233 -1180 -481 297 -41 -727 -787 1119 -548 -785 71 -62 139
6209A39M01j401J28J125n81j85J440r14o09J148p1o44J025J64j413P9P19M25k462
6228a487L220l69j540M91l05K38O12o70M73J90o07m39N72J335k165Q64J025K84
6246A722j398Q6L21J2ML15o23k48L92m27o0Q42m44m90J099m05k387J094J356l3
6266G28j90o09J22K09j9K2Q1J45n66j354Q57P61p11M35N12q56l33J252j294L68
6286d40j21k49l43J476j0j910J267JlP9m6l78k65L18k85L73Q90q69k7o33R50j025
6308a250k35J190j74j007O48k3j96J313k65r55O27p48M3M74j07K09L01P48n87
6327Fp14N7M84L35n48J048r25K77lj21o40J44Q17o69J457j338n10J809n3j772
6347h59N84R69l09R08l16j348J474n42Q77j569L50J54J042j014R86n88p6r58R29
$$ plain form
6209 139 540 -861 -733 392 -189 -374 1066 152 -457 691 620 -24 1001 1165 -248 -169 550 975 -1487
6228 -1487 1733 1364 -176 315 10 248 860 190 663 853 246 -193 379 1714 -451 413 1438 1722
6246 1722 324 410 731 743 747 1062 439 191 583 156 96 938 494 4 1103 698 -1689 -595 761 728
6266 728 538 -71 51 260 241 263 344 489 -77 -1431 -574 187 -524 -89 423 -433 -766 486 -808 -440
6286 -440 -561 -810 -1153 323 313 -1597 -330 -329 -332 -253 -299 -677 -942 -624 -909 -536 354 -515 -542 -1175 -225 -1250
6308 -1250 -1485 -295 -469 -1476 -828 -851 -1047 266 1 -954 -327 -1075 -1032 -558 -665 -456 -155 593 6
6327 6 -708 -651 -167 168 -380 668 -257 20 17 -104 -744 -600 217 -452 1005 -333 -843 966 913 -859
6347 -859 -275 694 385 1293 977 -371 1103 561 1438 -131 219 373 1415 401 1387 799 723 -235 694
6366F94M54L70j441J96Q99j094N30L62k25j61K35n59j035R43J006r78L17L77q56
6385C4O30q4l93k32O5M57m37N63O94k185P17J048p95p16M44Q38j200O50l97m84
6405g83j57N72n62K27J027j357R88J42k1l8m4j073j1J033j65m36l5l2n56L37M26
6426e18p79Q51J36q59J86L57M07l97q65J440K34o1m79j38j397J756n7r2J515k049
6446h09j28P23P92j284m4Q13K44j145O99n45K55m23O80p56J105J026r43j985J974
6465B49l0J3K19L68l28p38R85l40N67k38j69j79J281j523j52J553q33k46k88L32
6485E03o52Q02j90j178K180q73q09R37J08p59K38O37M76J02j709L64OQ84j12q03
6505A52J543j115k07J78N35L03j368J10J302j609P95K87p28l47Q6k89J64N85k92
$$ plain form
6366 694 1148 1518 77 273 1172 78 608 970 745 584 819 260 -775 168 1174 196 513 890 34
6385 34 664 580 187 -45 20 477 40 603 1297 -888 -171 877 82 -634 -190 648 -552 98 -299 -783
6405 -783 -940 -368 -930 -703 324 -1033 -45 97 76 38 -6 -1079 -1090 -57 -222 -658 -693 -725 -1281 -944 -518
6426 -518 -1297 -446 -310 -1169 -983 -626 -219 -616 -1481 -41 193 132 -347 -485 -1882 -126 -183 -275 1240 -809
6446 -809 -937 -214 578 -706 -750 63 307 -838 -139 -684 -429 -852 -172 -928 177 1203 260 -1725 249
6465 249 219 232 451 819 491 -247 738 398 965 727 558 379 1660 137 -15 1538 705 459 171 503
6485 503 -149 653 463 -715 1465 592 -217 720 828 69 307 944 1420 1522 -187 177 183 1067 955 152
6505 152 1695 580 373 551 1086 1389 21 131 1433 -176 619 906 178 -169 -83 -372 -208 377 85
6524H5o49J362m62l96J82J48m67M54o77j33P97L12j094O16J98k00j91k54N73k87
6544h3l49O33P96j054o92J46N09P2k22k82Q53k40o50M54m87k99O02P2l99p2M02
6565b90J3k68J003j395k91J382n90N90p97N67m68j72Q29j158R44R90j235O74j23
6584B05M82j213P83L7l09M54q14J51R34j170n29J286r15P93m36J325j201m20P92
6603B35N65r22O72P57l35j708J506qN56l20p98j45J46J257r19j265Q34j00k44
6622b36r04K293p17L55o59R17p71N63n01m40J615j594m05J110O57r45O50j527
6640e39J526j076Q13J04p56K3l05k96J290p90n12j28J310j662J002p3K10n42J93
6659b08k28m75Q70K09p98K187j781p07J082k69K11j012R34N00o22l09K3j76P64
$$ plain form
6524 85 -564 798 336 -60 122 270 -197 257 -420 -553 244 556 -538 78 276 76 -115 -369 204 -83
6544 -83 -432 201 997 -57 -749 -603 -94 -22 -244 -526 327 87 -563 -109 -596 -895 -293 -221 -620 -692 -290
6565 -290 -277 -545 458 -937 -1228 154 -436 154 -643 -76 -544 -716 113 -1045 -101 889 -346 328 205
6584 205 687 -526 257 294 -15 439 -375 -224 710 -460 -989 297 -618 175 -261 1064 -137 -557 235
6603 235 800 -122 550 1307 972 -736 770 762 1318 998 200 55 201 1458 539 -726 108 8 -236
6622 -236 -1140 1153 436 791 132 1049 278 841 340 -100 1515 -79 -484 626 1283 338 988 -539
6640 -539 987 -89 724 828 72 95 -210 -506 784 -6 -518 -646 664 -998 4 -69 141 -401 -208
6659 -208 -436 -911 -41 168 -630 1557 -224 -931 151 -118 93 -919 15 515 -107 -416 -393 -569 195
6678A95j939N95J177o1j096R46J8m18j13K32J03m60J580j287q68J633o75q33J545
6697B74m97m68R92K89j017k98J594j375J015K9j483N54L84Q54k489J873j48k87
6715b04R3J217j507K36K28n51J522k05l92m86j29J207j183n31Q75L29ll19J27
6734C24L58nl7j31p98K58l80R25J93p15n93J612q48K86M52L6j531Q27R63j437
6754b41O92K12j670J074Q42r69P5M66N67o60J6l97j320K763j345q34J368o76l11
6773c48k75J352o95O23j232J076r42M39o33R27o30N48j626J552l84NJ11N52k04
6792B16n67m84N48L35k13n4m4Q0n60m71J77J031m00o22N95R72j550P20O89j231
6812h33J106j005j022J391P72j916R22R85K46j724P65q6q01Q03j27r7k75K02N19
$$ plain form
6678 195 -1744 -1149 28 -33 -1129 -183 -165 -583 -696 -464 -361 -821 759 -528 -1396 237 -438 -1271 274
6697 274 -223 -691 301 590 -427 -725 869 -506 509 538 -945 -391 -7 847 -1642 231 83 -204
6715 -204 -111 1106 -401 -165 63 -488 1034 829 437 -49 -178 1029 -154 -685 190 519 516 197 324
6734 324 682 677 640 509 -289 -31 -411 514 707 -8 -601 1011 163 449 901 937 -594 233 1196 -241
6754 -241 451 663 -1007 67 909 -60 15 481 1048 388 404 7 -1313 1450 105 -729 639 -37 -348
6773 -348 -623 729 34 657 -575 501 -441 -2 -635 292 -338 210 -1416 136 -248 -243 -132 420 216
6792 216 -351 -835 -287 48 -165 -219 -263 -183 -743 -1214 -1037 -6 -406 -1028 -433 539 -1011 -291 398 -833
6812 -833 273 -732 -1754 -363 409 -1507 -585 400 646 -1078 -313 -399 -1200 -397 -524 -621 -896 -694 -175
6831a75N63K36l37l09N1p05J089n79M2j449O75J622k62j74O79l4j046P10p14j70
6851b87k61J117o31J13P22K72k10k29N40q57L15r54P11m86P50L36p99J302k248
6870g84J481n30N38k94J046r45r20J706j310N05O12m78l75o32M88R73j126J23
6888G8l76l5j50L32J249k40k88j314J294m22q25pJ014M5k31K09j251J666j623
6907h75Q54m6m21J178j560K43M35o28J207n02J83K91k21q08L35P47j026j094J751
6926D3J075k792J307m13j7j9P91L08j142J062j507M62J483j033k14O12N76j474
6944h92J23J442j199n74J182k43q15J572p21MP52k88j106N50Q46p89l93R81k91
6963A41J82j258R49m88J167j344K95O18N32O03j135N71q72K22M82k76K72L78p90
$$ plain form
6831 -175 388 624 287 -22 29 -676 413 -166 -124 -1573 -898 724 462 288 967 933 -113 597 -117 -287
6851 -287 -548 569 -62 51 773 1045 835 606 1146 289 604 -350 361 -125 625 961 162 1464 -784
6870 -784 697 167 705 411 1457 512 -408 1298 -12 493 1105 627 252 -380 108 1081 -45 78
6888 78 -298 -333 -483 -151 1098 858 570 -744 550 128 -697 -704 310 355 124 333 -918 748 -875
6907 -875 -21 -67 -488 690 -870 -627 -192 -820 387 -115 68 359 138 -670 -335 412 -614 -1708 43
6926 43 1118 -1674 -367 -780 -797 -816 -25 283 -859 203 -1304 -842 641 -392 -606 6 582 -892
6944 -892 -769 673 -526 -1100 82 -161 -976 596 -125 -121 631 343 -763 -213 633 -156 -549 432 141
6963 141 323 -935 14 -474 693 -651 -356 262 794 1397 262 833 -39 183 665 389 661 1039 249
6982B49k17P90N90m86m98O49j447N11J398p42j584J139l40o93J277j277J063P76
7000A158L7j517O61L39o84O42k99j03j32L06R94j891J183k79j15r10R59O6k36
7019A79p60J082n08q4Q49q23j531L092k727J461O41q39R4n41N36k65p6n76O22
7038a74n64J454j65q56N77q74J003O34k307l1J409o20R18l7J00j190N01P38r74
7057d58q5R68j142R72J01k54M42q69L16q06N39l86j93j00P35K61j30Q5j118Q41
7077b81l43R65j66j56J25j057o3P19M37j047O49R0l59P40m58n40J497j12K48j33
7097G55o9o27P0K41M20p89K62L90o57P51K47j763L45Q19m9R1j53m44n32K203o55
7118H56l26K29l28k09L55l39q57Q39P27j791P19R19j391j02J655j141P00N9k63
$$ plain form
6982 249 32 822 1412 926 428 1077 -370 141 1539 797 -787 352 12 -681 596 -681 382 1158
7000 1158 1195 -322 339 678 -6 636 337 234 102 408 1402 -489 694 415 300 -610 349 415 179
7019 179 -581 501 -7 -91 758 -65 -1596 1496 -1231 230 871 32 126 -415 121 -144 -220 -796 -174
7038 -174 -738 716 551 -305 272 -602 401 1035 -1272 -1303 106 -514 404 367 467 -723 -222 516 -458
7057 -458 -543 425 -717 255 356 102 544 -325 -9 -815 -276 -662 -855 -955 -220 41 -89 -4 -1122 -281
7077 -281 -624 341 175 19 144 -913 -976 -257 180 -867 -218 -128 -487 253 -205 -745 752 640 888 755
7097 755 686 59 129 370 790 1 263 653 -4 747 994 -769 -424 395 346 437 284 -160 -692 1511 856
7118 856 530 759 431 222 577 238 -619 220 947 -844 -125 794 -597 -699 956 -185 515 574 311
7137C11J28l59j125J118K47J72j013m44K132p47j419J082N83n30j067J128K81
7154D78J71q10k82L05O27n47n81R63k02q9l02P94j626J542n14r05%J254j053M76
7174c01m64r3J053K6l96q79J087n44L15j392J516Pl80O68j71j224P01J009j217
7193f79J29L16l78J47L69n45K28N21k02N14l96j553J800J73N74j268q1Q42j225
7212g14L81p1N34j11R14j910R45J084o04p92l34J799j592N29R62j278O41J61J14
7231F58q21J114j003O62o99K19j353K177m07m46M61o13J406j346j25O08J74l23
7249C43J82j278J202r0J43n03J072l39l79L39k63L59L59j827J815j113k11N36
7267C47n34J158q02J97r5p96N07j55R62o07l53p5p03R20k36J29r62J740j129P47
$$ plain form
7137 311 439 80 -1045 73 320 492 -521 -965 1167 420 -999 83 666 136 -931 197 478
7154 478 649 -161 -443 -138 489 -58 -639 324 122 33 -269 525 -1101 441 -73 -978 -978 276 -777 -301
7174 -301 -765 -858 195 221 -175 -1054 33 -511 -196 -1588 -72 -65 -445 223 52 -1172 -471 538 -679
7193 -679 -550 -234 -612 -465 -96 -641 -413 108 -94 420 24 -1529 271 444 1018 -250 -331 511 -714
7212 -714 -333 -404 130 19 933 -977 -32 1052 448 -344 -678 1121 -471 58 1020 -258 383 544 658
7231 658 -163 951 -52 610 -89 130 -1223 954 547 101 562 -51 1355 9 -116 492 666 343
7249 343 525 -753 449 359 502 -1 1071 732 353 692 429 788 1147 -680 1135 22 -189 347
7267 347 -187 971 169 366 271 -525 -18 -173 789 182 -171 -246 -949 -29 -265 -136 -1098 642 -487 260
7287B60K87m60o61J022m76j79J171j141r8K92k87L98q28Q87k20k74R72p70j864
7306a969K778j037q81L26N14q22M78K46L15q69N99N88j476R41M54N34l11n05m51
7325e48M14L47m38J27N15k67n45N22l35n27O74m75L16r70J433l78r8J478j228
7344A7K23J24Q44m17k33k79p79J331n6o84l15J41R53l47k73j36q39J222O83j571
7364c91M28J017j664J562J49j21q1k44k51j34j01J97r41O88K005j369p77J6L04
7383B92n87N78N4m19m17J025K25M07o99j224m1J359n49p32R24j46R87j103O73
7402F07l65l08J52q48J200K49j454j6J280q13k26O6N49J59n14R3n54M27O38j120
7422g98L97M06m07j74J18K69m28K33R08o66o74K89O29L9J88r07R23q85p92N03
$$ plain form
7287 260 547 87 -574 448 -28 -207 964 -177 -275 17 -270 128 -700 187 -33 -307 665 -105 -1969
7306 -1969 809 -228 -1109 -783 -269 -1091 -613 -367 -52 -921 -322 266 -1210 -269 185 719 408 -97 -548
7325 -548 -134 213 -225 -98 417 150 -395 127 -208 -735 -61 -536 -220 -1190 243 -135 -233 1245 17
7344 17 240 364 1208 791 558 279 -500 831 775 91 -224 -83 870 523 250 114 -725 497 1180 -391
7364 -391 37 1054 -610 952 1101 980 899 655 404 270 169 366 -575 113 2118 749 -28 -12 292
7383 292 -295 283 337 -82 -499 526 751 1158 459 -765 -806 553 4 -728 196 50 1037 -66 607
7402 607 242 -66 86 -762 438 687 -767 -783 497 -316 -542 -476 73 232 -282 -189 -743 -316 322 -798
7422 -798 -401 5 -402 -576 -458 -189 -617 -384 524 -142 -816 -527 102 141 329 -578 345 -540 -1332 -829
7442h29J133n09rr80K74J444r06P10m29o95J171r16l31R72l81r3J153o72p61J152
7462D98q98O60K68L13j132L98L75j18p36O82j026J229k65K15M16r37M11j72K62
7481D43L5J50m46K93n92o08J165o87J37K04R86p31K45m76K97l68L92m34l16J409
7501A098l46p41k12J279o03k33M82n32P48j063L06Q08q55r6p05J107m25j17O49
7520E49m94l2L26k66R24j513k41O29m38O94o40L68M94K3q45J31J114m17J34k9
7540D71r07jO47q79Q74m50l19P79M15m60K46k033J096k56J062m52q01P76O63k71
7560B00p29L2K77k30M98N39p93L98q15J046r87P54R4j221J196q05n16M00N16m95
7580f41K18J467o70m75K5n2L06j070J238o61k8m33J86K61o82J64J386j232Q64
$$ plain form
7442 -829 304 -205 -214 -1194 -920 524 -382 328 -101 -796 375 -541 -872 100 -281 -374 779 107 -654 498
7462 498 -400 260 528 841 -291 107 482 364 -372 310 -716 513 248 463 879 -58 353 181 443
7481 443 478 628 182 475 -117 -725 440 -247 -110 94 1080 349 594 118 415 47 439 5 -311 1098
7501 1098 752 11 -201 1078 475 242 724 192 940 -123 183 991 136 40 -665 442 17 -100 549
7520 549 55 23 349 83 1007 -506 -747 -118 -556 138 -502 -134 360 383 -462 -331 783 366 500 471
7540 471 -436 -437 210 -669 205 -245 -564 215 630 170 416 -1617 -521 -777 285 -167 -968 -192 471 200
7560 200 -529 -497 -220 -450 48 587 -206 192 -623 423 -564 190 284 -937 259 -546 -1062 -662 -146 -641
7580 -641 -423 1044 374 -101 -76 -128 178 -892 346 -315 -343 -776 -590 -329 -1011 -847 539 -693 171
7599A71Q03k079J238J21J621j233j186P06P36q54L63N41j213J196j739J142l80
7616d6j14J67K9J91N93r95O36P59j569P74p05k40p7N64n8Q20r04j46L86p48M04
7637b79p63K74Q12j88m2L65P65j041pJ008n60j19r87L34J105N26j445K28O34P4
7657F94q38L76o23J760j319j006J083l40L53j08j59R9Q98j694M96M83o04P13O54
7676I18j796O02J408j383k45J92m46O76J089j280J02M30k74q29P69Q71o24q15
7694f35Q26q77P13m44o95J215K02P6q23R27m57j568J656k75q27P45q13j9J932
7713H59r53L42n78J769j76o81j32Pp7K42m51n5n63K96K89M2J59r15M66R83N3p75
7735A51m46J474q77k75N80L24n50m85K21m28K37p32P41P55N47j897R79k6L92j67
$$ plain form
7599 171 974 -1105 133 254 1875 642 -544 162 898 44 407 948 -265 931 -808 334 -46
7616 -46 -160 7 36 227 820 -175 461 1220 -349 425 -280 -520 -597 -33 -91 729 -175 -321 65 -683 -279
7637 -279 -1042 -768 44 -144 -186 179 944 -97 -104 904 344 225 -762 -428 677 1203 -242 -14 620 694
7657 694 -144 232 -391 1369 50 -956 127 -213 140 32 -127 -28 870 -824 -328 155 -449 264 918
7676 918 -878 -276 1132 -251 -496 -304 -750 -74 1015 -265 -163 267 -7 -836 -67 804 180 -635
7694 -635 191 -686 27 -417 -1112 103 305 381 -442 485 28 -1540 116 -159 -986 -241 -1054 -1073 859
7713 859 -94 248 -330 1439 1263 582 450 457 380 622 171 116 -447 -151 138 180 339 -576 -110 873 926 151
7735 151 -295 1179 302 27 607 931 381 -104 117 -311 -74 -806 -65 690 1237 -660 319 293 685 518
7755E18N4j20n73O12O45j755R60K16m15P82j15l65Q17n50M8r25n89N21N54m11
7775i1n88J306o63R81q99K87L1l11m00j93M40J070q11Nj072J24K91J37K63j89
7795b82P04p07L37m63m04L52j16l04R02j452K029q56l0r71Q56l6O29j96j21k90
7815d19N69o42Q99p07P94k71q93J406p03q50J090k97p02R87j502K009j493l01
7833a026J466k8j111J268m80j239J115m76K31L45L64p85P81j107J012J160j415
7850G5o02o4LJ818j77j091r1N19M02J86j029R7Q47p63J94j508K383j172L33k39
7870A21r47J147m49m13K398j577N73j488J693j431j03M82n92J415j067J24Q76
7887G62p81M60J10j156J037k20j61M88o1R5m10M05M32j167j26q08J662l06j283
$$ plain form
7755 518 572 452 -121 491 1136 -619 341 557 142 924 809 444 1261 711 759 -166 -755 -234 320 -91
7775 -91 -679 627 -36 945 46 333 364 53 -347 -540 -100 970 159 164 -908 -784 -493 -356 -93 -282
7795 -282 422 -285 52 -411 -815 -463 -579 -883 19 -1433 596 -260 -290 -1261 -405 -441 188 -8 -129 -419
7815 -419 150 -492 407 -300 494 223 -670 736 33 -817 273 -24 -726 261 -1241 768 -725 -1026
7833 -1026 440 412 -699 569 89 -1150 -35 -511 -280 65 429 -356 425 -682 330 1490 75
7850 75 -527 -591 -588 1230 1053 -38 -129 390 792 978 -51 46 893 130 324 -1184 1199 27 360 121
7870 121 -826 321 -128 -541 1857 280 853 -635 1058 -373 -476 6 -586 829 -238 -114 762
7887 762 -19 441 551 -605 432 212 51 539 478 573 163 568 1000 -167 -293 -1101 561 255 -1028
7906a028J550j45l44K11m60P99PN6j653M69K06J047m11q12P90k72j193J427j257
7925a013q03J986o90J29j76O4J93k61J44M19o89N56R7q57K05M33m03M63Q53q39
7945a89M79r19K19M78N07q59k59P53j10j35l63J048k81j323J639j082N05k37l21
7964d50O23j54L05m06n26L89L76q83Q98n99R96J62j123P53J062j073L38o39l87
7983c38L75K93l12r70O60P12K29q21O27j180J760q9j116m13N95P61m17M55k79
8002E32n42L07L22o57K2k22J005l8p18m19j39m5M96l63R66L67q81j33R51o45O03
8023G69r16J06J176q25n73P7m80K04O17K07l31k16j97k90K68j013J367K42j773
8042a581K536m9j967N61k60O95l99J294p73k19j97pP05k42k98r92R89M55j104
$$ plain form
7906 -1028 522 377 33 244 -216 583 590 646 -1007 -538 -332 715 304 -508 282 10 -1183 244 -1013
7925 -1013 -1816 170 -520 -391 -567 -503 -310 -571 -427 -8 -697 -141 -44 -901 -696 -263 -666 -203 650 -189
7945 -189 290 -629 -410 68 575 -284 -543 210 100 -35 -398 650 369 -954 685 -397 108 -129 -450
7964 -450 173 19 324 -82 -608 -219 157 -726 172 -427 569 731 -392 361 1423 350 688 49 -338
7983 -338 37 330 18 -952 -292 420 649 -172 455 -725 1035 946 -170 -583 12 773 356 811 532
8002 532 -10 297 619 -38 -16 -238 767 729 11 -408 -547 -592 -96 -459 507 874 -7 -140 811 166 769
8023 769 -147 -41 1135 310 -263 -186 -666 -462 155 362 31 -185 -382 -672 -404 -1417 -50 192 -1581
8042 -1581 955 906 -1061 -500 -760 -65 -464 830 57 -162 -359 -366 339 97 -201 -1193 -204 251 -853
8061h53M27J039j090l00J585j152J03o1K03l59j51R94o64L77Q47j427K26j43J325
8080I26j088l53L40NQ5n26K24J171o58N4q5J1o89J226K81o31Q9p7Q55m42p04m53
8102d39R19K65j83l87R3J5J422k117J38M41m75m8q8J512j06o57N49l81J37o70
8122f0J455j081J157j529N08N63N0l83q74O57N6J98j579Q90j94R23O4M48j556
8141b87N22l57Q65j335K34P53o97l19Q4N87M69n86j15M81j185J768j216p9J47
8160b66N81q64M09P7j75L97j144J51Q6K93J63k64J047q36L96P30j106K92r73J258
8180B52m22o94O10j17L77M82q65n29K248r12q58
$$ plain form
8061 -853 -426 613 -477 -777 808 -344 -241 -302 -99 -458 -609 385 -279 98 945 -482 -256 -399 926
8080 926 -162 -515 -175 -170 -85 -611 -387 784 126 180 95 106 -583 643 924 293 382 305 1160 718 14 -439
8102 -439 480 745 562 175 268 283 1705 -412 -274 167 -308 -356 -444 1068 962 305 854 473 610 -60
8122 -60 1395 314 1471 -58 450 1013 1063 680 -194 463 519 717 -862 28 -166 757 821 1269 -287
8141 -287 235 -122 743 -592 -358 395 -302 -621 -537 50 519 -67 -182 299 -886 882 -334 -413 -266
8160 -266 315 -549 -140 -63 -238 159 -985 -834 -748 -455 -292 -556 491 -345 51 781 -325 -33 -1006 252
8180 252 -170 -864 -254 -371 6 488 -377 -906 1342 430 -428
8191d28
$$ Imaginary data points
##PAGE= N=2
##DATA TABLE= (X++(I..I)), XYDATA
0@%%%%%%%%%%%%%%%%%%%%kMj3L6o9R5j10J33j59J75j83J98k26K54k78L04l38L84
38B05m35M79n26N83o44P15p92Q72r74J095j218J360j533J746k002K322k738L309
56A824m132N430p791J3283j5335j11030J20469P395o1359K4586K1292m3835J7946
69c1257J1908l9559L1031L1906p6339j603Q1010l5942o2217O3096J5721o2991
81g5236K0046L3221l6692J0867J9760m5485J6854N4303n6167k7348P7033j2584
93b1428o9343M7429M0253n4595K507L3997k4602P459K7968m3590L798O2384l9156
106b6919m7557P3632J7707p2602K1481N1517l7765o278L3747k3385L688L8993
118B6259m0127j5990P0021j4462o4289N1139M1452o1551m05N3668k7350j2809
$$ plain form
0 0 0 0 0 0 0 0 0 0 0 0 0 0 0 0 0 0 0 0 0 0 -2 2 -11 25 -44 51 -59 74 -85 90 -93 105 -121 133 -145 159 -179 205
38 205 -230 249 -277 306 -338 377 -415 457 -517 578 -640 720 -813 933 -1069 1253 -1485 1824
56 1824 -2308 3122 -4669 8614 -6721 -117751 2718 10113 -51246 -26660 -5368 -49203 -31257
69 -31257 -19349 -58908 -27877 4029 -72310 -73913 7097 -28845 -91062 -27966 -12245 -75236
81 -75236 -55190 -21969 -58661 -47794 -28034 -73519 -56665 -2362 -58529 -85877 -8844 -21428
93 -21428 -90771 -43342 -3089 -57684 -55177 -21180 -45782 -38323 -10355 -53945 -50147 12237 -26919
106 -26919 -74476 -844 16863 -55739 -34258 17259 -20506 -26784 6963 -16422 -12734 26259
118 26259 -13868 -29858 40163 25701 -38588 12551 54003 -7548 -7953 45715 18365 5556
130E556L4093k2236o082M5317k8230l6675O3817Q696p0047K9019N5929n1395j8046
143I716M9619j3171k1454L0239j7707j5929M6119j4970n3635N1996L0696p0581
155A0938L261O1097l1642l5143L9068l387k2841K6598j4589k7378M3797K366o3465
168a1320K9812M9150n8252k1408N6955j4269l9887K9605R15k4824K5029o094l9595
181b4183L6147K1490o2317O118N7942l9640l9551M9368R91m0391K0098O543k5621
194c3006K3040M295m5644K4724L7790n5644j5095O2464j7883n0830L8605J6297
206a0887l5914J2282J0108k6186K1551J6218m7949J0895N1928m0391l3520N6314
218a5551M672n0124K1911K5671k9846Q685J5898k7877J5080L1293m4516o359N8031
$$ plain form
130 5556 39649 17413 11331 56648 28418 -8257 55560 64256 -5791 23228 79157 27762 9716
143 9716 59335 46164 24710 54949 37242 21313 67432 52462 -1173 50823 81519 10938
155 10938 14199 75296 43654 8511 47579 44192 21351 47949 33360 5982 49779 52145 -11320
168 -11320 18492 67642 9390 -12018 44937 30668 -9219 20386 21301 -3523 21506 15412 -24183
181 -24183 11964 33454 -28863 -22745 35197 -4443 -43994 5374 6365 -34026 -13928 -7385 -33006
194 -33006 -9966 -5671 -51315 -26591 11199 -44445 -59540 2924 -14959 -65789 -27184 -10887
206 -10887 -46801 -34519 -24411 -50597 -29046 -12828 -60777 -49882 2046 -38345 -71865 -15551
218 -15551 -10879 -61003 -39092 -13421 -43267 -34582 -18684 -46561 -31481 -188 -44704 -51063 6968
231F968k1300m5181M5547K2552m5275R108K9838k3527M115K1051k7983O696M0603
244B3212l4208k4365N8950j218n2984K9281L6376l7935l095K9600j6165n88K3374
257C0235k5342l540M2818k0667l8462M7900K0074n2860J0060M1271k6308j2355
269A2824K7700j4280n230K6573k2002j8601M6250n410m9435L1844L3144m5319
281A8058p699M0608j6642j7139K2380j1096j1226K9765j7129l0901M0676J1541
293E1196n4914J3569M2131l4672k0824L5443q562k1011K0715j0968j6890L0664
305B5877p768m0301L1796K5488n1320m198M7166k2766l0527K9146L01k1875J6867
318b114m026k3698K8556N728m7519J8985L7848m1236k0023M4821p336l2566K0527
$$ plain form
231 6968 -14332 -59513 -13966 8586 -36689 -27581 2257 -21270 -17155 3896 -24087 -17391 23212
244 23212 -10996 -35361 23589 22371 -30613 -1332 35044 -2891 -5986 23614 7449 6861 30235
257 30235 4893 1353 44171 23504 -14958 32942 53016 156 10216 51487 25179 12824
269 12824 40524 26244 21014 47587 25585 6984 53234 47824 -1611 30233 63377 18058
281 18058 10359 50967 34325 17186 39566 28470 17244 47009 29880 -1021 39655 51196
293 51196 -3718 9851 51982 17310 -3514 31929 23367 2356 23071 12103 -4787 25877
305 25877 18109 -22192 9604 35092 -16228 -20426 26740 3974 -26553 2593 2894 -18981 -2114
318 -2114 -6140 -29838 -1282 4446 -43073 -24088 13760 -27476 -47499 -2678 -10014 -42580 -22053
331b2053O149j9356J5811n24k7743K5380J8617m4553K116M5947k3956l1144L6630
344a8679O734l1299J4160J0428j9744J6084Q460l1430J7584L0489l6425j3781
356d7419M8676r743l7194K8679J6746k6453P126J4840j8786J2755J6488l2247
368b6532O414M0919k7821k5850M5392N747l9668J7704K3328k2108K904J4850j7876
381b597R012K2955k9314o117M4541j4302l6893L3996K0200l7436M888K5346j6129
394A8150k664J7683j9603J359L1092k4731k0983M1874R87m2521K0406K8106l0532
407A8623o742K4784j1670n151J5122j7803m802L1430j6353l1223L3151J5319m3167
420A518M624L3044k1805j4098K0485q873p663J8384j7257j5231L2859m453l9332
$$ plain form
331 -22053 -15904 -35260 -19449 -19973 -47716 -22336 -3719 -48272 -46156 -209 -24165 -55309 -18679
344 -18679 -11945 -43244 -29084 -18656 -38400 -22316 -13856 -45286 -27702 2787 -33638 -47419
356 -47419 1257 -8486 -45680 -17001 -255 -26708 -19582 -4742 -23528 -10773 5715 -26532
368 -26532 -20118 20801 -7020 -32870 12522 18269 -21399 -3695 19633 -2475 429 15279 -2597
381 -2597 6415 29370 56 -6061 38480 24178 -12715 21281 41481 4045 8933 34279 18150
394 18150 15486 33169 13566 14925 46017 21286 303 42177 43164 643 21049 49155 18623
407 18623 11881 36665 24995 19844 34966 17163 12361 43791 27438 -3785 29366 44685 1518
420 1518 6142 39186 17381 3283 23768 14895 7232 25616 8359 -6872 25987 21534 -17798
433a7798K1607K6846l6905r405L1291j1788j7031J6658o853j0293J9777j1266
445e160k3058K8175R067m2039R902L3831k7372j8747K8549l351j8630J4933l452
458a7352j2703K0630l538k9336K2242K0788l7585l634L7987j5503k4665K3589
470a9080M734j8648J2553n14j5833K1603O550l3677J4430L1764k9805j5405L5783
483e545j474k6301J6792R045j5685J1202M686j9408J8174J6312l1450q01L9638
496A5185j7145k6281L1894P918k5730J0581J2230j4063J0084Q191k1938J2241
508C167K5002k7576j1063L7992o011k9915K2458J5522k1575K671J4271j3620O995
521A8318J1766k2009J985L0664k0475k2285L3524P140l3013J0054K1640j8425
$$ plain form
433 -17798 3809 30655 -6250 -15655 15636 3848 -13183 3475 -3378 -13671 6106 -5160
445 -5160 -28218 -43 9024 -33015 -23113 10718 -16654 -35401 -6852 -10203 -28833 -13900 -17352
458 -17352 -30055 -9425 -12963 -42299 -20057 731 -36854 -40488 -2501 -18004 -42669 -19080
470 -19080 -14346 -32994 -20441 -20955 -36788 -15185 -8635 -42312 -27882 3882 -25923 -41328 -5545
483 -5545 -7019 -33320 -16528 -7483 -23168 -11966 -7280 -26688 -8514 7798 -23652 -24453 15185
496 15185 -1960 -28241 3653 11571 -14159 -3578 8652 -5411 4673 12864 -9074 3167
508 3167 28169 593 -10470 27522 21511 -8404 14054 29576 8001 10672 24943 11323 18318
521 18318 30084 8075 10060 40724 20249 -2036 31488 38628 5615 15669 37309 18884
533A8884j987J3201j5196M465J6479k2452q456L4024j1559l1202K5531J6447l1178
546G001Q81K1651j5467m530J2360j3565j389K1695j8982j8419L0035J638l6307
559a3398J5419K2709k4744p932J9139j0084o889J2504j2674o337K2953j1997k6126
572b7457K6135J3408l5866K237K8278j7709j4368J8015n181p252J3876j2120j1915
585b9919K4600j573l1708J8698K1640k9395q128K8067p241j5591J4738k511p752
598b6075J4586p643j6369K3780P223l1350O884L0491j9994j5327K5004l41j5747
611b4878J1731K20r517J7788n21k1970J7881J9300k9756k610L2487j1754j9833
624b1432K1161O289j4395Q082K359j1429J7354O354k6852J1032K7168k3316j3544
$$ plain form
533 18884 16897 30098 14902 19367 35846 13394 4938 38962 27403 -3799 21732 38179 7001
546 7001 7882 29533 14066 9536 21896 8331 6942 28637 9655 -8764 21271 22909 -13398
559 -13398 2021 24730 -14 -7946 11193 1109 -5780 6724 -5950 -12287 10666 -1331 -27457
572 -27457 -1322 12086 -23780 -21543 6735 -10974 -25342 -7327 -12508 -19760 -5884 -18004 -29919
585 -29919 -5319 -6892 -38600 -19902 1738 -27657 -35785 -7718 -14959 -30550 -15812 -18323 -26075
598 -26075 -11489 -19132 -35501 -11721 -4498 -35848 -28964 1527 -18467 -33794 -8790 -9131 -24878
611 -24878 -13147 -12927 -22444 -4656 -5177 -27147 -9266 10034 -19722 -22332 10155 -1599 -21432
624 -21432 -271 6018 -8377 -295 2064 -9365 7989 14343 -12509 -1477 25691 2375 -11169
637a1169L1640n91k3326J2898J0218j2581O927M658j4821J2573J3598k5365M1
650D700L0441j4296k1859K4899P025k1380O675R777j1479N667O203j6883P147
663A6637J7359k1215j0957L0468m925k7471J7725J1766j9031j56J1161j0694J957
676A2624J0176j9052N16K3555j7272j9765K7040M477k9037P030J7661j6065m072
689b184R933j0029J873J1403j8175q245K6845p423k6783J8126J3886k5368j064
702a7205J8607j2286m456J0622r889k763J6270j4407j4060K5742L46k8535J2352
715a9662K0222k0688p858J8537n082p762J0202p446n464J8949p638k0534K2330
728a1894J1095k8594K418K5326j2070j2533J6828k303p009J1563o391j0549K0824
$$ plain form
637 -11169 20471 19880 -3446 9452 19670 7089 14016 18674 3853 16426 30024 4659 4700
650 4700 35141 20845 -1014 23885 30910 9530 16205 25982 14503 20170 26373 9490 16637
663 16637 33996 12781 1824 32292 27367 -104 17621 29387 10356 10200 21361 10667 12624
676 12624 22800 3748 4264 27819 10547 -9218 17822 22299 -6738 292 17953 1888 -2184
689 -2184 7749 -2280 -407 10996 -7179 -15424 11421 3998 -22785 -4659 9227 -16141 -17205
702 -17205 1402 -10884 -15340 -4718 -14607 -17370 -1100 -15507 -29567 -3825 -3479 -32014 -19662
715 -19662 560 -20128 -27986 -9449 -14531 -22293 -12091 -19537 -25001 -6052 -13690 -34224 -11894
728 -11894 -799 -29393 -26975 -1649 -13719 -26252 -9424 -11727 -18736 -7173 -13564 -24113 -3289
741c289L09k4081J3913K1946k2967p668K4768m670j1861J1225J862p730J2703
754D460l960j3368J8938Q813k5576N564K5122j5130j4400K3140R72j4792J0426
767A0209K097q261J0943O91j6982J4509J3985k3591k334K6503p381k0230J6651
780A6809P637j4137O001L180j0807J1166N381k0445O338K2259k0662j3093K5392
793B5019J458k2293J0013P819j2981N004M028j2797O678J1986k0835k738K5461
806B5822j2853j9728J9084P509k0454K870J1640j1450M96O007j3814M546J4071
819A3746j9730q113K4473m094k5099J3695J3326j8238k173J0658r318J285P824
832a758j5266P45K0077j4401j7722K2525N464k4681O226J5709j3932l360R810
$$ plain form
741 -3289 -2980 -27061 -13148 8798 -14169 -21837 2931 -1739 -13600 -2375 -513 -8243 4460
754 4460 500 -12868 6070 14883 -10693 -5129 19993 4863 -9537 13603 14575 -217 10209
767 10209 12306 4045 14988 15679 -1303 13206 27191 3600 1266 27769 20388 158 16809
780 16809 24446 10309 16310 19490 8683 19849 25230 4785 11123 33382 12720 -373 25019
793 25019 26477 4184 14197 22016 9035 14039 18067 5270 11948 23934 3099 361 25822
806 25822 12969 -6759 12325 19834 -620 2250 13890 2440 2936 8943 -4871 -325 13746
819 13746 -5984 -14097 10376 6282 -18817 -5122 8204 -10034 -12207 -1549 -10867 -9582 -1758
832 -1758 -17024 -16279 3798 -10603 -28325 -5800 -336 -25017 -18791 -3082 -17014 -20374 -10564
845a0564o863n91J1850j3130o712K1225m411k1117J5797J3295k0945j75J6847
858e494p819n905R448n312k909J3997r672j0147K0578K557k3496J1055J8861j7155
872a1413p194J8066k685p312R279l857m070J6889n688j7926J9863J0384k4009
885i673K179K3413j0741j0489J4163o40n604Q727k832r625J7643N02j9943J1613
899H693J7169j9256o886K1476k706j4363J0223L790q799Q433j778j1845J3158
912A7309P718k2300M980J9846j3737j2277J8119Q71j3162O634L280r307Q071J51
926A6196j3739Q742J3091k0795m605K2491o579j9022J3865M763j3802L650N156
939I412r990O881M869j8517N708J6546j7199j1502K1089l64j9414Q220Q911j2817
$$ plain form
845 -10564 -17427 -18018 -6168 -19298 -26010 -4785 -9196 -30313 -14516 -1221 -22166 -22341 -5494
858 -5494 -13313 -19218 -9770 -15082 -17991 -3994 -13666 -23813 -3235 -678 -24174 -13119 5742 -11413
872 -11413 -18607 -541 -3226 -10538 -1259 -5116 -9186 7703 2015 -15911 3952 14336 -9673
885 -9673 -7494 15919 5178 -5311 8852 8212 2608 11335 8503 -1122 16521 17023 -2920 8693
899 8693 25862 6606 -280 21196 18490 4127 14350 18140 9341 17774 15996 4151 17309
912 17309 25027 2727 7707 27553 13816 1539 19658 20529 7367 14001 17281 7974 16045 16196
926 16196 2457 11199 24290 3495 -1110 21381 14802 -4220 9645 14408 606 4256 9412
939 9412 -578 6303 11172 -7345 -1637 14909 -2290 -13792 7297 6933 -12481 -4261 4650 -8167
953h167K244M916j1277N831Q745j7034j239J9914r668j8404J7269O915j9037K858
967a6134J0443q505N62N212j0153K921J3098j4789q067K1992k777k0729J2427
980a4499J3146j5845k100J1508o775l72Q903j0377q45J6563j0709j2577J9306
993d673N521j9903N460J5950j0460m527J1013n430n41R149q392m265J8326m506
1007B722j8033J5834J1462j7151k201J8143o176o841R393k863k679J1698p195
1020F113r904J7961K869k0722Q632J6586j4186p647J7249m398n893Q126l287m850
1034F649J2639l260j5879J4859R150j9407q37K0512j0558j1241J3466k6p967P561
1048A5661k435q659J0838J256j7901R594J4584j8027o019J9045m494j3374Q859
$$ plain form
953 -8167 -5923 -1007 -12284 -6453 2292 -14742 -15981 3933 -5735 -24139 -6870 45 -18992 -16134
967 -16134 -5691 -14196 -13634 -8422 -18575 -15654 -2556 -17345 -25412 -3420 -6197 -26926 -14499
980 -14499 -1353 -17198 -19298 -7790 -14565 -14937 -6034 -16411 -17256 -693 -11402 -23979 -4673
993 -4673 848 -19055 -13595 2355 -8105 -12632 -1619 -7049 -7590 1559 -6833 -11098 7228 2722
1007 2722 -15311 523 11985 -5166 -7367 10776 4600 -2241 7152 4289 1610 13308 6113
1020 6113 -3791 14170 17039 -3683 4949 21535 7349 -298 16951 12553 6660 14786 11499 6649
1034 6649 19288 16028 149 15008 24158 4751 3914 24426 13868 2627 16093 16067 8100 15661
1048 15661 13226 4567 15405 16661 -1240 8354 22938 4911 -1108 17937 13443 69 8928
1061H928Q93p886O078n54j1137J0545O216j9996L053J8588j3914j2721J5691J620
$$ plain form
1061 8928 9821 1935 8013 7459 -3678 6867 13083 -6913 -3860 14728 814 -11907 3784 5404
$$ [...]
8191D72
##END NTUPLES=NMR FID
##END=
