##TITLE=1H_Pr CDCl3-A
 CDCl3, 96 sc, 
 21.10.2019
##JCAMPDX= 6.0         $$ Bruker NMR JCAMP-DX V2.0
##DATA TYPE= NMR FID
##DATA CLASS= NTUPLES
##ORIGIN= UXNMR, Bruker Analytische Messtechnik GmbH
##OWNER= root
$$ XWIN-NMR		Version 3.5
$$ Mon Oct 21 14:21:47 2019 Russian Standard Time (UT+4h)  she@DPX200
##.OBSERVE FREQUENCY= 200.1315
##.OBSERVE NUCLEUS= ^1H
##.DELAY= (6, 6)
##.ACQUISITION MODE= SIMULTANEOUS
##.ACQUISITION SCHEME= undefined
##.AVERAGES= 96
##.DIGITISER RES= 18
##SPECTROMETER/DATA SYSTEM= spect
##.PULSE SEQUENCE= zg30
##.SOLVENT NAME= CDCl3
##.SHIFT REFERENCE= (INTERNAL, CDCl3, 0, 15.7039)
##AUDIT TRAIL= $$ (NUMBER, WHEN, WHO, WHERE, WHAT)
$$ ##TITLE= Audit trail, XWIN-NMR		Version 3.5
$$ ##JCAMPDX= 5.01
$$ ##ORIGIN= Bruker BioSpin GmbH
$$ ##OWNER= she
$$ F:/spectra/data/she/nmr/H-F/1/audita.txt
$$ ##AUDIT TRAIL=  $$ (NUMBER, WHEN, WHO, WHERE, WHAT)
(   1,<2019-10-21 14:17:04.56 +0400>,<she>,<DPX200>,
      <continue with go, POWCHK disabled, PULCHK disabled
       configuration hash MD5:
       00 E9 B6 7A A2 85 ED C7 34 08 36 98 17 FE 4E 26
       data hash MD5: 16K
       0A 77 40 E4 5F 25 C7 CB BE 2A EB 55 63 18 50 E7>)
$$ ##END=
$$ 
$$ hash MD5
$$ 5F 61 A6 26 4B 6F 25 5E EF BC 6A 40 55 06 E4 5D
##$RELAX= 
##$RELAX= 
##$RELAX= 
##$RELAX= 
##$RELAX= 
##$RELAX= 
$$ Bruker specific parameters
$$ --------------------------
##$DU= <F:/spectra>
##$EXPNO= 1
##$NAME= <H-F>
##$PROCNO= 1
##$TYPE= <nmr>
##$USER= <she>
##$AMP= (0..31)
100 100 100 100 100 100 100 100 100 100 100 100 100 100 100 100 100 100 
100 100 100 100 100 100 100 100 100 100 100 100 100 100 
##$AQSEQ= 0
##$AQ_mod= 1
##$AUNM= <au_zg>
##$AUTOPOS= <>
##$BF1= 200.13
##$BF2= 200.13
##$BF3= 200.13
##$BF4= 200.13
##$BF5= 200.13
##$BF6= 200.13
##$BF7= 200.13
##$BF8= 200.13
##$BYTORDA= 1
##$CFDGTYP= 0
##$CFRGTYP= 5
##$CHEMSTR= <none>
##$CNST= (0..31)
1 1 145 1 1 1 1 1 1 1 1 1 1 1 1 1 1 1 1 1 1 1 1 1 1 1 1 1 1 1 1 1 
##$CPDPRG= <>
##$CPDPRG1= <>
##$CPDPRG2= <>
##$CPDPRG3= <>
##$CPDPRG4= <mlev>
##$CPDPRG5= <mlev>
##$CPDPRG6= <mlev>
##$CPDPRG7= <mlev>
##$CPDPRG8= <mlev>
##$CPDPRGB= <>
##$CPDPRGT= <>
##$D= (0..31)
0 1.2 0 0 0 0 0 0 0 0.06 0 0.03 0 0 0 0 0.0002 0 0 0 0 0 0 0 0 0 0 0 0 
0 0 0 
##$DATE= 1571652718
##$DBL= (0..7)
120 120 120 120 120 120 120 120 
##$DBP= (0..7)
150 150 150 150 150 150 150 150 
##$DBP07= 0
##$DBPNAM0= <>
##$DBPNAM1= <>
##$DBPNAM2= <>
##$DBPNAM3= <>
##$DBPNAM4= <>
##$DBPNAM5= <>
##$DBPNAM6= <>
##$DBPNAM7= <>
##$DBPOAL= (0..7)
0.5 0.5 0.5 0.5 0.5 0.5 0.5 0.5 
##$DBPOFFS= (0..7)
0 0 0 0 0 0 0 0 
##$DE= 6
##$DECBNUC= <off>
##$DECIM= 24
##$DECNUC= <off>
##$DECSTAT= 4
##$DIGMOD= 1
##$DIGTYP= 9
##$DL= (0..7)
0 120 120 120 120 120 120 120 
##$DP= (0..7)
150 150 150 150 150 150 150 150 
##$DP07= 0
##$DPNAME0= <>
##$DPNAME1= <>
##$DPNAME2= <>
##$DPNAME3= <>
##$DPNAME4= <>
##$DPNAME5= <>
##$DPNAME6= <>
##$DPNAME7= <>
##$DPOAL= (0..7)
0.5 0.5 0.5 0.5 0.5 0.5 0.5 0.5 
##$DPOFFS= (0..7)
0 0 0 0 0 0 0 0 
##$DQDMODE= 0
##$DR= 18
##$DS= 0
##$DSLIST= <SSSSSSSSSSSSSSS>
$$ [...]
##$SUBNAM2= <"">
##$SUBNAM3= <"">
##$SUBNAM4= <"">
##$SUBNAM5= <"">
##$SUBNAM6= <"">
##$SUBNAM7= <"">
##$SUBNAM8= <"">
##$SUBNAM9= <"">
##$SW= 24.0689530833862
##$SWIBOX= (0..15)
0 0 2 0 0 0 0 0 0 0 0 0 0 0 0 0 
##$SW_h= 4816.95568400771
##$TD= 16384
##$TD0= 1
##$TE= 0
##$TE2= 300
##$TE3= 300
##$TEG= 300
##$TL= (0..7)
0 120 120 120 120 120 120 120 
##$TP= (0..7)
150 150 150 150 150 150 150 150 
##$TP07= 0
##$TPNAME0= <>
##$TPNAME1= <>
##$TPNAME2= <>
##$TPNAME3= <>
##$TPNAME4= <>
##$TPNAME5= <>
##$TPNAME6= <>
##$TPNAME7= <>
##$TPOAL= (0..7)
0.5 0.5 0.5 0.5 0.5 0.5 0.5 0.5 
##$TPOFFS= (0..7)
0 0 0 0 0 0 0 0 
##$TUNHIN= 0
##$TUNHOUT= 0
##$TUNXOUT= 0
##$USERA1= <user>
##$USERA2= <user>
##$USERA3= <user>
##$USERA4= <user>
##$USERA5= <user>
##$V9= 5
##$VALIST= <valist>
##$VCLIST= <CCCCCCCCCCCCCCC>
##$VD= 0
##$VDLIST= <DDDDDDDDDDDDDDD>
##$VPLIST= <PPPPPPPPPPPPPPP>
##$VTLIST= <TTTTTTTTTTTTTTT>
##$WBST= 1024
##$WBSW= 4
##$XGAIN= (0..3)
0 0 0 0 
##$XL= 0
##$YL= 0
##$YMAX_a= 162887
##$YMIN_a= -108125
##$ZGOPTNS= <>
##$ZL1= 120
##$ZL2= 120
##$ZL3= 120
##$ZL4= 120
##$ABSF1= 10
##$ABSF2= 0
##$ABSG= 5
##$ABSL= 3
##$ALPHA= 0
##$AQORDER= 0
##$ASSFAC= 0
##$ASSFACI= 0
##$ASSFACX= 0
##$ASSWID= 0
##$AUNMP= <proc_1d>
##$AZFE= 0.1
##$AZFW= 0.1
##$BCFW= 1
##$BC_mod= 2
##$BYTORDP= 1
##$COROFFS= 0
##$CY= 11.3945322036743
##$DATMOD= 1
##$DC= 2
##$DFILT= <>
##$DTYPP= 0
##$F1P= 20.1720416913024
##$F2P= 0.152960286110954
##$FCOR= 0.5
##$FTSIZE= 0
##$FT_mod= 4
##$GAMMA= 1
##$GB= 0.15
##$INTBC= 1
##$INTSCL= 1
##$ISEN= 128
##$LB= 0.24
##$LEV0= 0
##$LPBIN= 0
##$MAXI= 10000
##$MC2= 0
##$MEAN= 0
##$ME_mod= 0
##$MI= 1.114404
##$NCOEF= 0
##$NC_proc= 0
##$NLEV= 6
##$NOISF1= 3.799351
##$NOISF2= 2.8
##$NSP= 1
##$NTH_PI= 0
##$NZP= 0
##$OFFSET= 15.70392
##$PC= 1
##$PHC0= -9565.688
##$PHC1= 7.00089
##$PH_mod= 1
##$PKNL= yes
##$PPARMOD= 0
##$PSCAL= 0
##$PSIGN= 0
##$REVERSE= no
##$SF= 200.130013532006
##$SI= 16384
##$SIGF1= 3
##$SIGF2= 2
##$SINO= 400
##$SIOLD= 16384
##$SREGLST= <1H.CDCl3>
##$SSB= 0
##$STSI= 0
##$STSR= 0
##$SW_p= 3612.71676300578
##$SYMM= 0
##$S_DEV= 0
##$TDeff= 0
##$TDoff= 0
##$TI= <>
##$TILT= no
##$TM1= 0
##$TM2= 0
##$TOPLEV= 0
##$USERP1= <user>
##$USERP2= <user>
##$USERP3= <user>
##$USERP4= <user>
##$USERP5= <user>
##$WDW= 1
##$XDIM= 8192
##$YMAX_p= 0
##$YMIN_p= 0
$$ End of Bruker specific parameters
$$ ---------------------------------
##NTUPLES= NMR FID
##VAR_NAME=  TIME,          FID/REAL,        FID/IMAG
##SYMBOL=    X,             R,               I
##VAR_TYPE=  INDEPENDENT,   DEPENDENT,       DEPENDENT
##VAR_FORM=  AFFN,          ASDF,            ASDF
##VAR_DIM=   8192,          8192,            8192
##UNITS=     SECONDS,       ARBITRARY UNITS, ARBITRARY UNITS
##FACTOR=    0.0002076,     1,               1
##FIRST=     0,             0,               0
##LAST=      1.7004516,     0,               0
##MIN=       0,             -108125,         0
##MAX=       1.7004516,     162887,          0
$$ Real data points
##PAGE= N=1
##DATA TABLE= (X++(R..R)), XYDATA
0@%%%%%%%%%%%%%%KmP2j62J88j92J93j95K11k81L57l82M18m95N58o28P14p99R03
33D78j013J131j261J406j566J736j921K127k352K604k883L191l541L929m366M874
49B573n455O137o946P921r140J0700j2780J5728k0253K8209m6483J92676o1789
62A01098j31772Q3776Q650j5422l4025L1856O368j1418l7418K3064L2881j4950
74D2688n3200K0805L7453k2031l8933K6846J8500k2004k4146J2448K0243l226
86A5443l4817n285L4718J446m4829K265M0787j2530m3345J2933K9729j1352k8027
99d2864j753K2821R181k6883j7858L1024J7001m2175j4446M1556R750m0109o926
112f1681K8790Q237k1875j3617J5199K2825j5008k9921K0450L5480k5580l0783
$$ y = [0, 0, 0, 0, 0, 0, 0, 0, 0, 0, 0, 0, 0, 0, 0, 2, -2, 70, -92, 96, -96, 97, -98, 113, -168, 189, -193, 225, -270, 288, -340, 374, -425, 478, -535, 596, -665, 741, -825, 911, -1010, 1117, -1235, 1369, -1514, 1677, -1864, 2065, -2301, 2573, -2882, 3255, -3691, 4230, -4910, 5790, -6990, 8738, -11515, 16694, -29789, 162887, 101098, -30674, 53102, 61752, 46330, 12305, 44161, 50529, 39111, 1693, 24757, 57638, 42688, -10512, 10293, 47746, 25715, -13218, 13628, 32128, 10124, -14022, -1574, 18669, 15443, -19374, -24659, 10059, 11505, -33324, -31059, 9728, -2802, -46147, -33214, -3485, -14837, -42864, -44617, -21796, -12615, -39498, -57356, -26332, -9331, -51506, -65952, -24396, -14646, -54755, -61681, -32891, -24654, -46529, -60146, -44947, -22122, -37130, -67051, -46601, -11121, -36701, -67484]
124f7484L0137K5303k4872j8697K1040J7980j0025j7192N002K9093k68l4013N711
137c8285M0961q450l6374J7902L2763j3578k2405J2036K3262J154k0748n166L0035
150A3107J3990l3756q533M1961O662l6046l24L6550R58k4998j811K0262J3407
163D1429j5483j8498J9223K7436k3656k5753L1625K3099l0663j4972K5872J3277
175E2936j8708j2182J1208J8729o712k4768O206L1670j2525l3105J6539K9466
187E8754j9812k5448J5962J7888j0348j8815N09J9681L190k8568p252L2050K654
200D0445l8480j486L3916o983k9884J944K0760r0j9736j1403J5165J5876k4113
213d069k1892K5605J7362l1698j6886K7799Q554k5699r607J5533R276j1801j8509
$$ y = [-67484, -37347, -12044, -36916, -55613, -34573, -16593, -26618, -43810, -38808, -9715, -9983, -43996, -38285, 2676, -5774, -42148, -24246, 8517, -5061, -27466, -15430, 7832, 8986, -11762, -16928, 13107, 27097, -6659, -15192, 26769, 33431, -2615, -2939, 33611, 34569, 9571, 7760, 28022, 41429, 25946, 7448, 26671, 54107, 30451, 4698, 36323, 59422, 28759, 13787, 39659, 52936, 34228, 22046, 33254, 51983, 45271, 20503, 26709, 58379, 45854, 12749, 29288, 58754, 38942, 13494, 29456, 47344, 36996, 18181, 18690, 38371, 41561, 12993, 5741, 37791, 40445, 1965, 479, 34395, 27412, -2472, -528, 20232, 20142, 406, -10997, 4168, 20044, -4069, -25961, -356, 17006, -14692, -31578, -3779, 4775, -20924, -30531, -14998, -5722, -17523, -36032]
226c6032P060K3853j2660k9265J3908K7524k0290k5834K0190J7327j6394j5984
238d6597R842J4316j488k1237k771K7979Q54l1320M116L1824o870k7769R147K3464
252a6510n294j6970O77J5894Q986j6360j2010K3974J6859k8003j1338L1850R673
265A428k6896k628K3785O517j3677q512J3300J6898q466k1199J5828K7259j8724
278D913k0825K3805J9997j9944j2143J6886J3262p987j1904K627K2425j35k4044
291F933L701L0453m380k9460J1825K4404q671j9495P645J5311J2j4270p848K0761
305C6921R396k3563j0375K7080O348k8631j700K4456j151j9414k282J2502Q359
318C7946j3645j5148J2340J9210j9446k0680K2370J4435k5112j2719J8374Q820
$$ y = [-36032, -28972, -5119, -17779, -47044, -33136, -5612, -25902, -51736, -31546, -14219, -30613, -46597, -36755, -22439, -23927, -45164, -47935, -19956, -19102, -50422, -46306, -14482, -21352, -49121, -39974, -16510, -21804, -38774, -38097, -22203, -13217, -29577, -41587, -17613, -754, -28757, -40095, -8245, 1428, -25468, -28096, -4311, 2206, -11471, -19983, -6683, 10215, 1749, -19450, -3622, 23637, 4913, -15912, 7893, 27890, 7946, -4197, 12689, 25951, 17964, 6060, 8687, 31112, 30977, 6933, 10634, 41087, 36707, 7247, 19072, 43476, 34805, 15310, 22955, 38266, 38278, 24008, 16160, 36921, 46317, 22754, 12379, 39459, 45807, 17176, 15476, 39932, 38781, 19367, 17085, 29587, 37946, 24301, 9153, 21493, 40703, 21257, 577, 22947, 37382, 12270, -449, 17925, 26745]
330B6745j6509j1321P120J2933o177k1999L002K3659r394k7279J0130K2875j5301
343a516k0326J0364J2779p638j3423k545J4216L243j9977p278K3468L037k8136
356c3732m9K3915l049k2564K716J4600O50j3402n724J1987J1691j6110j6511K0870
370b4712J5538k4014j1628K4144P148j8304o052J4367Q540q107j1982P521J8508
383i033o745k2583J3347K4406j4115j8022J5593J7016j1181j1230Q709J3175m64
396a127j3518j86K1275L338k3713J973K6650l322k1511Q699J9535m207j2965J980
410B901J3235O328j2495q206J8626J0892k0443q122K4980N577j9681l151J8469
423B8910M372j2241o924J0430J2615r283j7041J1659J9900j5348j8053J8002J4258
$$ y = [26745, 10236, -1085, 6035, 18968, 12791, -9208, -6206, 17453, 8059, -19220, -9090, 13785, -1516, -21842, -11478, 1301, -6337, -19760, -22305, -8089, -4846, -24823, -32101, -8633, -5596, -33732, -33781, -9866, -12915, -35479, -32763, -18163, -17513, -30915, -36639, -24652, -12961, -29071, -45582, -24712, -9174, -33188, -44816, -20672, -13524, -31828, -37880, -23513, -14973, -23080, -35062, -27541, -9033, -15778, -38361, -25014, -608, -14723, -32745, -17152, -136, -11317, -22547, -13838, -663, -1127, -14645, -14831, 6444, 9782, -13931, -11958, 14692, 11370, -10141, -1442, 18093, 13886, 921, 2901, 16136, 22464, 9969, 1763, 20389, 31281, 10838, 2716, 27696, 33273, 13592, 10441, 28910, 33282, 21041, 14117, 24547, 37162, 27879, 10838, 22497, 42397, 27049, 8996, 26998, 41256]
436D1256j6925j0927J2114Q411p587j1126R11J5651j545k1069K25K3089n766k4716
450A996Q507J8548r838j6634M781J0210j518j3020n194J5124N753k1328p904K1269
464A0752K566k3940j364J8283k199j7743k217J0182N696j1066j3091J1331J3852
477A042j6216j6054J6690J3188k0511j0817J6177P276j2861q105O908R614m548
490a8217j4147K500J9585o509k0427Q438J9564j2413j4090J0509J2342o268r896
503b9029J651J2489J957j4627l939J9432M927k0634O50K1657k543j5971M128J3922
517e930J972r744m183J0902J0471j1629j0996J8563J2718j7748p338J9782O398
530A3238j5649l270J3177O638n588r214N257J6944n808j6144J0501J8233j1604
$$ y = [41256, 24331, 13404, 25518, 33929, 26342, 15216, 16127, 31778, 30233, 9164, 9389, 32478, 26712, 1996, 10503, 29051, 19213, 2579, 7360, 17570, 16052, 3032, -2162, 12962, 18715, -2613, -10517, 10752, 13318, -10622, -11986, 6297, 4098, -13645, -15862, -5680, 16, -11050, -24141, -12810, 1042, -15174, -31228, -14538, -1350, -21861, -32678, -16501, -9225, -22086, -30191, -23283, -13669, -18217, -32364, -29864, -10279, -16788, -37215, -28777, -9213, -21626, -35716, -25207, -12865, -19133, -29029, -27378, -14889, -12932, -27559, -31498, -12066, -7139, -27773, -27123, -5466, -8009, -23980, -19852, -5930, -3958, -13702, -17885, -6983, 3488, -8141, -19137, -574, 12144, -5604, -12942, 6840, 13238, -2411, -5681, 7496, 14134, 8546, -668, 4589, 21533, 15725, -419, 10082, 28315, 16711]
543A6711j4648J3871J2422j0926p802O471R589j180r538k662J6640K454j9383
556A2019O17K1235m878j7866O411J3967n218j0997Q82Q914L674j0876r054J5346
570B4176O922j8706n894J7059M505k0356j030J2905J215j1888n093O228P856q495
584I404j3136Q249J3478j3988j4975J3766R201j4694r239R878N142o171r598J778
598a0905J1208k358j6911J094J7348m893j9778N809J4836p504j3353M846R115
611a1446j368j0506k651J0713O024j6893m745J7790K309j8537L85J5686m90j3525
625b7254J090R579L128o936p786R089J1645j1894j1942J6331R955j2832q601J4775
639a1653O409q357n966P480J0196m380j1201M984J6784n231j5916R371J6535q795
$$ y = [16711, 2063, 15934, 28356, 17430, 9628, 16099, 25688, 24508, 14970, 12308, 28948, 31402, 12019, 12636, 33871, 28993, 11127, 17538, 31505, 26287, 15290, 16172, 25086, 28760, 17884, 8830, 24176, 31098, 12392, 6498, 23557, 28062, 7706, 6676, 19581, 20796, 8908, 3815, 10043, 17899, 9404, -3732, 4517, 17995, 4007, -10968, 2798, 11999, -2695, -11934, -2056, 3086, -3085, -12683, -10905, 303, -2055, -18966, -17872, -524, -5417, -25195, -19386, -4550, -12054, -25407, -20561, -11446, -12814, -23320, -25971, -15258, -9234, -26127, -30872, -13082, -10773, -29310, -28925, -13239, -13729, -27254, -26164, -16585, -13457, -20393, -28179, -19090, -7445, -19339, -31281, -14950, -4995, -17827, -26428, -11653, -5244, -13601, -19567, -12087, -1891, -6271, -17472, -12488, 4296, -935, -16851, -7480, 9055, 260]
653B60j1037R096J1280m665o085J499J0004L194j2305j436J6747K391j6046J197
667D094J6326j231j4092M372J1172J350r680j885Q873P833j0767r554J4099R202
681C0112j4725p207J6190M236j3649l389R346M153m981p975L815J1593n403j3964
695H152O480J4647j0822j4589J1218R416j0374p980M538O889k112j0248l170J2711
709A4756N03j7727J228J4839m393j4454J846J3018o735r762J881N602K002j0183
723g579o296J0670O089j6330n834J6198N68j4978j344J0704O45r334m844O411
737a5254O998p010j1510Q559J3040j2485j1434J1900R069j0827q379Q898O538
750a1897n676o123J950R757j23j2772J717J4918k278j4226M769J3669m985r396
$$ y = [260, -10777, -1681, 9599, 4934, -1151, 348, 10352, 13546, 1241, -195, 16552, 18943, 2897, 4094, 20420, 19189, 5097, 9469, 20641, 21991, 12311, 10426, 19299, 27132, 16365, 6811, 20910, 30112, 15387, 8180, 24370, 28606, 14957, 11568, 20914, 25067, 20086, 12111, 15926, 27519, 22116, 8152, 14632, 29279, 18457, 3868, 15086, 24502, 14128, 6148, 10686, 17575, 15463, 5215, 2045, 14756, 15259, -2468, -1240, 13599, 9206, -5248, -3402, 9616, 2881, -6881, -5000, 602, 2604, -7579, -13875, -3205, 2884, -13446, -19280, -3082, -2514, -17492, -18836, -8132, -7487, -16821, -21665, -15254, -8256, -15266, -26776, -18217, -5177, -17662, -29096, -17196, -8127, -18954, -27333, -18435, -11897, -17573, -23696, -21746, -11989, -12112, -24884, -23167, -8249, -10527, -24753, -19984, -6315, -11300, -20696]
764b0696M973Q558o57o132k630R808O465j2792k363J5272L416j5073J461J4396
778D006j54j0258K111Q455K963n262n756R142Q954r367q433J2875R950j2393n889
793I44J2766N499q322l301N432P479k452q798J959J1931l489j2952O483J4040
807B7219p997r896P258P281m736n832J211O140J916j0408k140J2497J097j6436
821G174K347J2524k997j2979L145Q999j687o615m917O592N714j0318p904J0500
835I578O532j3973o693J2673K797j1772l198O079K781n373p518K462R332n097
849a390j2482N712J1411j0213j1242R521O498q096n668L751O057m054p370J013
863a6552P710m64j3162K065J2922k960j3303M729R837n276p285P90P428K204p623
$$ y = [-20696, -15723, -7165, -7822, -13954, -16584, -6776, -311, -13103, -15466, -194, 3222, -11851, -10390, 4006, 3852, -6406, -4295, 4160, 7123, 1861, -3895, 5247, 14201, 4834, -3599, 9276, 19226, 6833, 944, 13710, 19209, 10887, 7586, 13018, 20497, 18045, 9247, 11206, 23137, 19648, 6696, 13179, 27219, 19222, 9326, 16584, 23865, 19129, 13297, 14508, 20648, 22564, 12156, 10016, 22513, 23610, 7174, 9521, 22045, 19048, 6069, 9214, 18213, 16526, 9911, 4994, 11586, 17300, 6982, -922, 9578, 16110, 2137, -4556, 8117, 10914, -858, -4056, 2023, 4804, -569, -8087, -5625, 3707, -1390, -13872, -8160, 3251, -6962, -18204, -8683, -2185, -10281, -15949, -12198, -6141, -10195, -17565, -16552, -8842, -9306, -22468, -20403, -7481, -10441, -23744, -19015, -9178, -14454, -21739, -20949, -13521, -11317, -18940]
878a8940m253J1029N168j1753o584J5601L370j3038j45J0601K193p277k923O081
892a0870O154m843p138O216J1821p195j0508J1429Q934r666m361Q447N876n052
906g56l253J807R604j051r683K803J3578m172j1302O925J0990n615o998M489O719
921A4085l44o415K47Q509M459j1920k381J4122J533j3973R60J2764p31j0056J596
936A2455O362J761o268m245N084Q365q163r102J0339P075j1467o143J0144K976
950A9173p231m490L922L874k763q306J413J0451m555j2444N317J0975q111r809
964b584N641P333o521o691J403N391N74j0456j471R832M7j3212m16J2274k782
979a638j2061J895P400k226n806k422M209N797q754o200Q465O788j1997n011J2242
$$ y = [-18940, -23193, -12164, -6996, -18749, -25333, -9732, -6362, -19400, -19545, -8944, -6751, -14028, -16951, -10870, -4716, -9559, -16697, -10481, 1340, -5855, -16363, -4934, 4000, -5666, -10027, -1580, 4296, -756, -4009, -2202, 7402, 6351, -3332, -529, 13049, 8877, -2425, 4500, 15490, 9875, 2877, 7366, 14085, 13741, 7326, 7573, 16082, 20541, 8621, 6240, 20362, 21895, 7922, 8882, 21646, 20915, 10859, 12455, 18817, 20578, 14310, 10065, 15149, 23514, 15351, 6249, 16588, 23663, 12196, 6053, 16197, 19173, 11942, 7452, 11374, 15248, 12485, 4179, 5592, 16043, 11488, -956, 4361, 15336, 7225, -2584, 3057, 10390, 3869, -2822, -1419, 3972, 4546, -5910, -7381, 2451, 2498, -10714, -11130, 1144, -1638, -13699, -11804, -4404, -6630, -12436, -14858, -10649, -4852, -13606, -19806, -11341, -4553, -16550, -21561, -9319]
994i319J498j0076j055O579K132l973m869K727P399m383r071N429J0683q065q807
1009b3171R875O415o599m121M517O200j967n734p41J0281J626j0260J298J1802
1023e79k306r751M924Q931l370m861L095N452K567n951l777R357M353q738l094
1038c748J1598L643j1105J068R286Q95o028j245N442M593l605p441P573P685o669
1053A1942p758R237Q036j0098l607P634L782n153l660J583P076p63j0062J609
1067I798J1060l340j0133M249R448o939p724M776M266j663n440j307M211M344
1081A5606q941l754J0122j37j0258k011J0037k585q556M54M614J356n391l738
1095c182L445O316q948p279Q132O351j1357m361R057K229q574k888L637L855m070
$$ y = [-9319, -7821, -17897, -18952, -12373, -10241, -14214, -19083, -16356, -8957, -13340, -22411, -16982, -6299, -14364, -23171, -13296, -6881, -13480, -17601, -13084, -6884, -8851, -14585, -15326, -5045, -3419, -13679, -12381, -579, -2885, -12636, -7712, 1219, -2151, -7012, -3917, 1535, 4102, -1849, -5626, 3731, 8084, -654, -3748, 7850, 11493, 388, 1456, 10742, 11637, 5609, 4364, 9806, 14399, 10794, 3353, 10926, 18611, 11942, 4184, 13421, 21457, 11359, 7752, 15386, 19168, 14015, 10355, 11938, 19014, 18251, 8189, 9798, 20858, 17518, 7385, 11634, 21082, 14143, 6419, 11195, 15461, 13798, 8358, 7051, 11262, 15606, 6665, 2911, 13033, 12896, 2638, 627, 10664, 8079, -477, -23, 4591, 5947, 556, -3182, 263, 6579, -2369, -9648, -1516, 4835, -6522, -10883, -1826, 403, -8171, -11059, -7422, -3567, -7637]
1110g637p321L035Q104k705j1976M467J0063p699o986O822M068m484n078K206
1124a5121N640r46n626j833P806K264j1787J360J0523k731p661L308P055j908
1138i657n255Q60M177M174n727m485R438N231j0017k672J0798K916q328k61P108
1153a700K404k952l481L120O907j957p590N340R478p102o849Q114P576n988m412
1168I08M984L406o0l360j196Q176J291j0173J253J1361k231r467L422Q364l069
1183A3609o009L230K958K296n582l526P863L789r174l359J2016l56r715m67Q210
1198A5783k66o249r95L163L149m677o459N334O087o244q405P971N654r858l655
1213C33O268J622l073m921J558M889k573q679J244R648m828r635L866P337n577
$$ y = [-7637, -14958, -11923, -3819, -6524, -18500, -14033, -3970, -11669, -18655, -11833, -7765, -12249, -17327, -15121, -9481, -10427, -16053, -17886, -10080, -7816, -19603, -18243, -7720, -10451, -18112, -14804, -7749, -9657, -14912, -14052, -9875, -5701, -11428, -15913, -6475, -1244, -11261, -13933, -3135, -219, -8547, -8808, -1700, 704, -2248, -5729, -2609, 4298, 2341, -5249, 91, 9569, 2467, -4382, 3732, 11308, 5320, 908, 5892, 9298, 9238, 5878, 4682, 12858, 14149, 3976, 5229, 16590, 14359, 4892, 8314, 16678, 13609, 7600, 10830, 13788, 16084, 10502, 6976, 14839, 18628, 9454, 6095, 18111, 17755, 8040, 7573, 15783, 15517, 9268, 8273, 11436, 14585, 9908, 3449, 8783, 14870, 8626, 221, 8192, 13846, 3988, 333, 6601, 8223, 5150, 229, 1787, 6676, 4103, -4576, -3332, 6316, 1488, -8147, -4281, 3056, -2521]
1228b521o518L479L505j600m783j426M907K302r549j737R859m78j0114N57Q164
1243e953k312o872J436M352M80l987l925N117L400n282n644Q182N362r340k256
1258a7242P709J629n094j528M896J978k616l097J191Q496k425q954N561R058o923
1273g361n218O944L471k158m374L539M196J760m886n36P090J665q878J686R394
1288F334j241o847K650O514n35m466K41M912L171m411l160O839M233p743l638
1303B853J0548J369p042j321P340O97l281l168J838O530k621p981N110O989o814
1318A1046n698O905N224p431k383L278J771l56m657r15O815n94r148J597R075
1333A4529m311p749L608M243l080n554Q42K708J644n542k881N242L723r333l609
$$ y = [-2521, -9039, -5560, -2055, -3655, -8438, -9864, -4957, -2655, -12204, -13941, -4082, -4560, -14674, -14117, -5953, -8265, -15137, -13701, -9349, -8869, -12856, -16781, -11664, -8264, -13546, -19190, -11008, -5646, -14986, -17242, -9533, -7904, -12998, -14526, -9630, -7652, -10268, -13365, -12174, -3678, -6103, -15057, -9496, -438, -7361, -12579, -5635, -2164, -4322, -8696, -5157, -961, 799, -4087, -4623, 2467, 4132, -4746, -3060, 6334, 5093, -1754, 896, 7410, 6875, 2409, 2650, 7562, 10733, 6322, 3162, 10001, 14234, 6491, 2853, 13401, 14770, 7728, 6407, 13747, 14444, 11163, 7995, 9833, 16363, 13742, 5761, 10871, 17860, 11046, 5348, 12253, 17477, 10046, 7663, 10941, 12712, 12356, 7699, 6784, 13599, 13005, 3857, 5454, 14529, 10218, 2469, 6077, 10320, 7240, 1686, 2528, 5236, 6880, 1338, -1543, 3699, 7422, -1911, -5520]
1348e520Q168M54r368J002O281j790m501j988L208K773m393n111L895N876p914
1363h928n691Q042L811q088l697O500J185m725j734J135M797j130p058J715Q119
1378e747l203q109M265O937m068m634K988M252k249k820k7M321K355p292l26Q857
1394d500O41q299K178P946j390o369J838N981j153j359k061L485N022m200l673
1409e913P999K943o474j712O184L118m461r54K979L580k225l790K160P108k371
1424H171o933N064P882n125n481N549L704l634l261K535L968P88m997j240P431
1439A4421R68q997J498Q045k783o297K871M179j957l629R6K871K257n658l748
1454D137O382K574p185l294Q716n82p888R3N157r66k857k503P93N620l691p312
$$ y = [-5520, 2648, 3102, -6266, -5264, 1017, -773, -5274, -7262, -4054, -1281, -5674, -10785, -6890, -1014, -8928, -14619, -6577, -2766, -10854, -14551, -8051, -6866, -11591, -13325, -12190, -7393, -8523, -15581, -13866, -5747, -8950, -17059, -12794, -5857, -9925, -14559, -11571, -7319, -9568, -12388, -12415, -8094, -5739, -13031, -13357, -4500, -3859, -12158, -9980, -2034, -3424, -9793, -7955, -1974, -3127, -4486, -6547, -3062, 1960, -2240, -5913, 2086, 5029, -1445, -3157, 3027, 6145, 1684, 730, 3709, 7289, 5064, 1274, 3434, 10542, 8171, 1238, 6302, 14184, 9059, 3578, 9127, 12831, 9197, 5936, 8471, 12439, 13227, 8230, 6990, 14421, 15389, 6392, 7890, 15935, 13152, 6855, 9726, 13905, 11948, 8319, 8415, 11286, 13543, 7885, 4137, 10519, 13093, 5908, 2614, 11330, 10748, 2860, 2953, 8110, 7144, 4287, 1784, 2577, 8197, 4506, -2806]
1470b806L832O475n810o558N260L767o802k412K908J684k004l913l82M170k61
1485b852o660O2P606l519o543K328N937m362l844J886K393l89k519j680M242J433
1501f481n569k506P639O9p464J365N398p80l625j192M026K994l173m232L110O421
1517d000n409m175O620M211o488j653O642L3k88k479J105M745j406m108J488P741
1533B579k511o193M988O591m610l404M117L005q44k764o66N378J809m900k560
1548A5Q656J834q437R51P730j919m509J605N215m0l349j905L143M185m738l586
1564D851N837M900p849j856O610Q51n663P68J360K456k614k768q6O278k520o625
1580C930L577N352n157m353M116K344l733l258K418L367k130m150o87L664K8p029
$$ y = [-2806, 1026, 7501, 1691, -4867, 393, 4160, -2642, -5054, -2146, -462, -2466, -6379, -6761, -2591, -2852, -9512, -9450, -1844, -5363, -11906, -9578, -3641, -8003, -11847, -9961, -7568, -7957, -10476, -12156, -7914, -6481, -12050, -14556, -6917, -6848, -14312, -12947, -7549, -8329, -11954, -13146, -9120, -6126, -9299, -13531, -10421, -4000, -9409, -13584, -6964, -2753, -9241, -10894, -4252, -4219, -4507, -6986, -5881, -1136, -2542, -6650, -5162, 2579, 68, -6125, -1137, 5454, 844, -2560, 1557, 4562, 3718, 954, 288, 5666, 7475, 2575, 15, 8671, 10505, 2068, 3019, 10749, 8830, 4321, 5926, 11141, 11101, 7752, 5847, 8990, 13175, 8437, 4851, 10688, 15588, 7739, 5883, 12493, 13344, 7681, 8449, 9809, 12265, 9651, 6883, 6797, 13075, 10555, 3930, 7507, 12859, 7702, 3349, 7465, 9809, 6076, 2818, 5236, 8603, 6473, 2323, 1636, 5300, 5328, -1701]
1596a701N28O959k315p789L218M357k669m725K56K104K345n012l476N089L324
1611D93p124k927O322J54n717j687L415J718l904j176J436K815k258n492L244
1626a0688O850n961l208M007K399m744m74K144J510j056k461J086L982l89n385
1641a2388J394P272j880p024M065N119k180k719Q17M675j326k400n61L743L941
1656E48n609j261P162N10n572J309N770r82k633k35K891J724j824j815L296N028
1672H307m172m959P731L034n223j869N792J048l421n79K325K751j087l745r6O751
1688A2588j711n971L964N278m173m384L839K818j949l927Q69L668J574n271j920
1703E292P506j114p276J005N984l275l488R63K954m84l062k536J935M385m929
$$ y = [-1701, -1173, 5786, 3471, -4318, -1100, 3257, 588, -4137, -3881, -1777, 568, -4444, -7920, -2831, 493, -6631, -9558, -3236, -3082, -8799, -10486, -7071, -5353, -9257, -10433, -8997, -6182, -8440, -13932, -10688, -3838, -9799, -13007, -9000, -6601, -11345, -11819, -9675, -8165, -9221, -11682, -10596, -6614, -7003, -12388, -10994, -3722, -5602, -12626, -8561, -3442, -5622, -8341, -7524, -2849, -4175, -6575, -7136, -3393, 548, -5061, -6322, 840, 1350, -4222, -2913, 2857, 1875, -758, -993, 1898, 3622, 1798, -17, 3279, 8307, 4135, -824, 6907, 9941, 4718, 2849, 8641, 9689, 6268, 5689, 8014, 10765, 9678, 5933, 5837, 12588, 10877, 4906, 8870, 14148, 9975, 5591, 9430, 12248, 10299, 6372, 7241, 10909, 12483, 7212, 5292, 12798, 11684, 4408, 5413, 11397, 8122, 4634, 5597, 8551, 8067, 5005, 2469, 4404, 8789, 3860]
1718C860n276N821J776o178j799N376l0o696J111K222L33k059l219J136M547l035
1734b110o185L143N176m547m025L651K460m057j894J067J905L79m072j408N040
1749e477n35o534J354P383l521m321J715K875k077j124m29J813K151k811l591
1764a3129O116K341o083j037O390l80l912Q59L605J644l346l72J458L140j915
1779d621k839K737O318n901k463O297J698l949p57L749J551l22k393q52N536J372
1795E161o847K737N982j249n648L481M002j098l685K038L216N4k291K04L009J688
1811A0754m821j075N933L00n783J316M255R9m196P80J949J669j946l834K176M529
1827A2105m024l515M701K869o229j086L977J046l633k643J445L294j138m814J055
$$ y = [3860, -1416, 4405, 6181, 3, -1796, 3580, 3550, -3146, -2035, 187, 520, -1539, -4758, -3622, 925, -2110, -8295, -5152, 24, -4523, -8548, -4897, -2437, -6494, -8388, -7321, -5416, -5037, -9109, -10517, -5477, -6012, -12546, -11192, -3809, -7330, -11651, -9936, -7061, -9138, -10262, -10691, -8878, -6727, -9538, -13129, -7013, -4672, -10755, -11792, -5402, -5782, -9694, -8835, -5230, -3586, -6932, -7304, -5846, -2706, -4621, -7460, -4723, 1595, -4306, -6769, -472, 1226, -2723, -3480, 269, 1820, 1498, -895, -1747, 3789, 5161, -1686, 1051, 7033, 5784, 136, 3617, 7619, 6521, 2836, 4874, 8090, 8144, 5853, 6057, 9066, 10754, 5933, 4858, 10791, 11091, 5308, 6624, 10879, 10978, 6782, 7562, 9511, 11180, 9234, 5400, 7576, 12105, 8081, 4566, 9267, 12136, 5907, 4821, 8798, 9844, 6211, 3568, 5013, 8307, 7169, 2355, 3410]
1842C410M633k619n566L190L944m085m109K764J758j782l308l62K740j79m830
1857d401m78M471P13o211M9M572k543l063K16K407j339j110k335K673K840m860
1873h399j906M769J783n945k696O880l14l902j250K191K755k036l154J317M865
1888e042k350l691K377M875m969k234N015Q27k961n95K333K358o96j752j575N676
1904b404Q8m050J658N068k231m601M316L380j920j736J218K525L124m651k81L172
1920B675J932m924N5N347K107m944m37L956J309k283j739J632L401p32m630L969
1936F694M397l780l664M814K953m508j412M825m50r17j873l38K988L9l745kO095
1953A2116l351m421L165L418m319k156K211J276k15l748J66L187J443o685r46
$$ y = [3410, 8043, 5424, -142, 3048, 6992, 2907, -1202, 1562, 3320, 1538, -1770, -2132, 608, 429, -4401, -4879, -408, 305, -5906, -5857, -1285, -3828, -6891, -6675, -4268, -5607, -6717, -9052, -6379, -3539, -8399, -10305, -5536, -3753, -9698, -12394, -5514, -5828, -9730, -10980, -8789, -6034, -8070, -11224, -9907, -5042, -7392, -11083, -8706, -3831, -8800, -11034, -6019, -5192, -8153, -8748, -6415, -4057, -4753, -6505, -8080, -2404, -2316, -6366, -4708, 360, -1871, -6472, -2156, 1224, -696, -2432, -1214, 1311, 4435, -216, -497, 2675, 4607, -317, -262, 5085, 7192, 2248, 1811, 5767, 7076, 4793, 3054, 4686, 8087, 7355, 2725, 6694, 11091, 7311, 3647, 8461, 11414, 6906, 5494, 10319, 9869, 8952, 7079, 6741, 9729, 9768, 6023, 6021, 12116, 8765, 4344, 7509, 10927, 6608, 4452, 6663, 7939, 7724, 3976, 4142, 7329, 8772, 2087, 1141]
1968A141N767j110m878p4M501k817k168R1N66J776k993k347K539J989l979l061
1984e057M379J202n383j060L958Q59m448j651J470K297J22m592q68N027j407n940
2000a1092L934L293l575k985K183J695l36j590o12K475J555n129m58N610r84n318
2016a1334J058N881j971l495J822L501j111j666p93K215K964k177l147M342L706
2031b05n325n21M885M57l443J780Q48J175j37k889K750L885r03n795L969N242
2047E773m419k677M660K949l326L17K64L066j320j391j81M051m97l441J198M797
2063I823j153n098L148L028j576j784O81R82J602l057j175L562J687m801j866
2078D003O271j36o177J606L840j751j043n90q26L212k922k526J326L517l956k903
$$ y = [1141, 6908, 5798, 920, 846, 5347, 2530, 362, 453, 1019, 2795, -198, -2545, -6, 1983, -1996, -5057, -678, 524, -4859, -5919, -1961, -1102, -5550, -7201, -5731, -3434, -3312, -7904, -8772, -3745, -5152, -11092, -7158, -3865, -7440, -10425, -8242, -6547, -6883, -8473, -9085, -6610, -5055, -10184, -10642, -5032, -6016, -11334, -10276, -4395, -6366, -9861, -8039, -4538, -5649, -7315, -8108, -5893, -2929, -5106, -8253, -3911, -205, -5530, -6051, -1166, -709, -4152, -2372, -1524, -349, -486, -3375, -625, 3260, 2357, -3438, 531, 5773, 1354, -1323, 3337, 6286, 2960, 3277, 3541, 6607, 5287, 3896, 3715, 7766, 7269, 3828, 5026, 9823, 8670, 3572, 6720, 9748, 8172, 6388, 7069, 8051, 9653, 6596, 5421, 8983, 10670, 5869, 4003, 10274, 10138, 3961, 5567, 9407, 7656, 6613, 6023, 5197, 8409, 5487, 2961, 4287, 7804, 3848, 945]
2094I45M273J340m016j944L035J89k155j691j95L597k109l443L77M759l548l280
2110c866J057K575j924l663J443J404n92k722L5J851L44l790o57M531r5m896J087
2127g878K566k24k974l45K759R98k780k074J622M353m231k176M103K467m532r81
2143i327M170L94l129K16J267K027j18l215L21N777k185l931K587M139k716k831
2159f554L193K288j067p28R4K352J764l385k22M502O95n353J561M957p98l030
2175B69K680R06O56q46l00Q77K720k041l085N155J986m430p27N026K08m271q1
2192D702K250J812j152l289J177M722j383m909M146K822l204l793L961J118k519
2207F461j064Q32Q05O50k541j046M366j233m645J092L390j556m885J837L359k581
$$ y = [945, 5218, 6558, 2542, 598, 3633, 3822, 1667, -24, -219, 3378, 1269, -2174, -1797, 2962, -586, -3866, -2809, -234, -2158, -5821, -4378, -2974, -3566, -6288, -6253, -4402, -4058, -7848, -8505, -3974, -4069, -8965, -7878, -5312, -5536, -8510, -8855, -6096, -5098, -7878, -9952, -8330, -3977, -8208, -10384, -6281, -3814, -8346, -9327, -5157, -4763, -7892, -7676, -6409, -4382, -4500, -7715, -7394, -1617, -3802, -7733, -5146, -1007, -3723, -6554, -3361, -1073, -2140, -2868, -2774, -422, 1342, -2043, -2265, 2237, 2932, -2421, -860, 4097, 3299, 269, 2949, 3855, 4511, 3665, 3365, 4242, 6962, 4921, 1836, 6991, 8977, 4547, 3820, 8846, 9054, 4783, 4702, 6952, 8764, 7612, 4323, 5500, 10222, 8839, 3930, 8076, 10898, 7694, 3901, 7862, 8980, 6461, 5397, 6229, 7034, 7684, 5143, 4097, 8463, 7230, 2585, 3677, 7067, 5511, 626, 2463, 5822, 3241]
2223C241j697N43P73P82k343k577L241M47l253l957N131P25n150K61L401r59j987
2240c378j286J254J398k023l805K394M220m220l945N255J315l592k049K445J447
2255d570j706j349p52K119J041m717R06N803l356m515L570L884m428r71K104J640
2271e297n53j537p00L120J789l922j006M413Q95m571K686K172l55k424R39K466
2287a885J716k301j060K466K967k845k741M271K409m036M15L450O46k284j37J801
2303B852J755N87m262J323M777j570l025L286K426l378j297K064K483j363j533
2318E125j01K563Q63k734r51M537m58m764J648L243p43l724J665K172n64k129
2334E648q64K387J236l000k251L535J057m191k033N076l77l955J65J936n56j665
$$ y = [3241, 1544, 2087, 2860, 3642, 1299, -1278, 1963, 2410, -843, -4800, 331, 1056, -4094, -3833, -432, -1391, -3378, -4664, -3410, -2012, -4035, -7840, -5446, -1226, -5446, -9391, -4136, -2821, -6413, -8462, -6017, -4570, -6276, -7625, -8377, -6258, -5217, -9934, -9028, -3225, -6581, -11096, -7526, -3642, -8070, -9041, -6937, -5297, -5850, -7387, -8087, -4967, -3178, -7100, -8106, -3693, -2798, -7369, -4683, -2511, -2866, -5290, -4351, -1885, -169, -2470, -3530, -1064, 1903, -942, -3683, 588, 2997, -1039, -624, 2826, 3472, 1188, 1051, 2852, 4607, 5194, 932, 2255, 7032, 5462, 2437, 5723, 8149, 4771, 3474, 5538, 8021, 6658, 5125, 5024, 7587, 8450, 5716, 4765, 9302, 8844, 4080, 5728, 8971, 8228, 4504, 6169, 8341, 7777, 5648, 4784, 7171, 8407, 5407, 3156, 6691, 7748, 3557, 1524, 6600, 6223, 2268, 2433, 4369, 3813, 2148]
2350B148j704P19J976j410l422P09N159m022l054J696K671k647k018P19K081j062
2366a461l106r79M275o46m487J052L489j098m700J746J914o74k158p03K603m95
2382e428j788j486K780K299n388O81L423L82l502k34K575Q65k667R29M99J644
2398d416j265l486K940L828k676k344L435K216m012J15K293R45p75o01R04J938
2414i61Q85m286K920K724l32m037K610J967j70j911J997R84M39k599N43K604N25
2431C902j499j460M405n03j828P5M417j833j444Q91Q52N39m46j201Q65K913j528
2448G117l823M458J608l153j860M018J48l073R1J673j96O0m290J978L104j635
2464F225l633K552L290m571k019K590J179j447j207j119J103K039l362j676K995
$$ y = [2148, 444, 1163, 3139, 1729, -1693, -984, 4175, 153, -2901, -1205, 1466, -1181, -3199, -2480, -399, -1461, -4567, -5546, -1271, -1917, -6404, -5352, -1863, -2961, -7661, -5915, -4001, -4675, -6833, -7536, -4933, -5428, -7216, -8702, -5922, -3623, -9011, -8330, -4907, -4525, -8027, -8261, -5686, -4821, -7488, -6559, -6060, -4416, -5681, -9167, -6227, -2399, -5075, -7419, -3984, -1768, -5780, -5665, -3372, -2427, -3202, -3803, -2899, -961, -76, -4362, -1442, 1282, 950, -3087, -477, 1490, 1320, -591, 1406, 2390, 2829, 230, 773, 3377, 3902, 2403, 943, 5348, 4845, 3017, 3092, 7509, 5676, 4232, 5123, 5975, 6514, 6068, 4867, 5732, 8645, 7117, 3294, 7752, 9360, 6207, 4347, 8365, 8513, 5440, 5531, 7204, 7008, 7068, 2778, 4756, 7860, 6225, 2592, 5144, 8434, 3863, 1844, 4434, 5613, 4166, 2959, 1840, 2943, 4982, 1620, -56, 2939]
2479B939L02m525M02L839p67l779J24K349j257j170j494Q05K130k435k127K168
2495b496O58l040j344L529P67m205l4K033k8k231j568K287K255j499l896J658
2511g154L620k980k179K835J748l411k63K354R01q21k150J86K898K48l227J011
2527f384L265k235j068R95K809j562j065Q72Q85Q94j863Q23J730K676m959Q97
2543c290M135j22m727K544K514m61j74r02J869K122k092j514K958K284k337j599
2559A208L024K517l717r39L091R50o85j650P00K958q23l913K010L733k361l347
2575B756L154L144k612j150N04J488K94k904K13K068P69m082m80M741p97m022
2591C084J598K130j936k476J399J707j511n43j267J77K566k781k806L550N54m560
$$ y = [2939, 3241, -1284, -882, 2957, 2190, -1589, -1465, 884, -373, -1543, -3037, -2232, -102, -2537, -4664, -2496, -1838, -4878, -6222, -2693, -1926, -6131, -6165, -4132, -4160, -6391, -7959, -5672, -3417, -4916, -8812, -7154, -3534, -6514, -8693, -5858, -4110, -7521, -7784, -5430, -4529, -5350, -7500, -7314, -4416, -4168, -7395, -6384, -3119, -5354, -6422, -5427, -2618, -4180, -5245, -4373, -3488, -2594, -4457, -3634, -1904, 772, -4187, -3290, 845, 723, -4004, -1460, 1054, 593, 419, -483, 1386, 3508, 1416, -98, 2860, 5144, 2807, 1208, 4232, 6749, 3032, 2093, 5184, 6134, 5449, 3799, 4499, 7457, 6634, 2721, 4731, 8464, 6103, 2756, 5910, 9054, 6442, 5292, 5796, 7284, 7578, 4674, 4887, 6955, 7724, 3642, 3162, 7903, 7106, 3084, 4682, 6812, 4876, 2400, 3799, 5506, 3995, 3452, 2185, 2362, 4928, 2147, -659, 2891, 3445, -1115]
2607a115p60M077j289j639o91K29R58n67k339P53L042j683m317J510L994m259
2623d096j853K028M21o82j384K48J011k8j597q11J948L90l701O10L163j859j004
2640g196J181J371r23j195k19J422K099k956j641L759J435l675P3L450j225j512
2656e752J78K031Q60j675J43q96M391j923k581J987L931k463j852L337J203j595
2672f76j072J756J599m08q92M65J772J033l655J401M148k400k612K843K782r97
2688E087j898J10K011M51p61j298J108K222l739M3L834M77l859Q07K741n98j845
2705D893l85J520P15k25l885L566K105l273k312L068K197l760m56J217R40j171
2721D754j013n16Q55J482l975j95L639j200m239K156O48k138j805K869Q28j300
$$ y = [-1115, -1875, 2202, 913, -726, -1417, -1188, -230, -797, -3136, -2383, 659, -1024, -5341, -3831, 163, -4096, -5949, -3921, -3500, -4182, -5566, -5318, -4307, -4335, -5932, -6743, -4795, -4405, -8106, -7496, -4333, -6192, -7196, -6015, -4644, -5567, -6762, -6981, -5559, -3460, -6416, -8057, -4298, -2863, -6538, -6465, -3015, -4240, -5752, -5574, -3543, -2683, -4358, -4215, -5111, -720, -2643, -5224, -3237, 694, -1769, -3621, -284, 919, -676, -1748, 8, 1607, 1199, 307, 772, 2544, 3577, -78, 1323, 5471, 3071, 459, 3302, 6084, 5087, 3189, 3299, 5310, 5761, 5000, 3702, 4810, 7032, 3293, 3336, 7170, 7647, 3788, 4595, 7336, 6738, 4893, 4508, 6028, 6743, 6518, 2633, 6199, 8304, 5031, 2719, 5787, 7984, 4224, 3768, 4985, 5925, 4754, 3741, 3225, 4080, 5562, 1587, 1392, 5031, 3831, -408, 1748, 2396, 258, -1547, 1322, 2150, 850]
2737H50k076n40J293P09l812K26K461L86l050L03J926j569k700J976Q73p75q33
2754d352k145K143J324k339k124K998J944l569l26K688r34k018K64Q65M08m68
2770e641q67j88L847k851k039J760K968j388k125J973Q08q26o3J050l1J313k280
2787d580M12K279J813l391Q5L204j245j348J186K642q65j434J107O90K340k748
2803A47k0K963J207l779J84L110J92j752p8K695j708P26J35m84J821M39l546J830
2821D082L243k002k369L047J098l346J236J888j351P45j263M32J596L73k692k00
2837D517L250k669k194K196J337k111O7p93O71J336j487k756K114K499l906o37
2853A434K241n97m059K941N65l83j381j074J276M1j304j991O63J850k862j280
$$ y = [850, -1226, -1766, -473, 236, -3576, -3350, -889, -503, -3553, -3250, -1324, -2893, -5593, -3617, -2744, -3519, -4352, -6497, -4354, -3030, -5369, -7493, -4495, -2551, -6120, -6446, -3758, -4692, -6710, -6446, -5581, -5173, -5641, -6508, -6696, -2849, -5700, -7739, -5979, -3011, -4399, -6524, -4551, -3743, -4569, -4632, -3582, -3613, -2300, -4580, -4168, -1889, -76, -3467, -3382, -178, -1423, -2771, -1585, 1057, 192, -1242, -135, 555, 2895, 147, 127, 3090, 4297, 518, 702, 3812, 4004, 2252, 2174, 4869, 3161, 3887, 4022, 3538, 5359, 5798, 2252, 4082, 7325, 5323, 2954, 6001, 7099, 3753, 4989, 6877, 5526, 6271, 5008, 5440, 7036, 7409, 4717, 4517, 7767, 5098, 2904, 5100, 6437, 4326, 4393, 3600, 4271, 5607, 4120, 1364, 3478, 5977, 2071, 1434, 3675, 3078, -981, 1960, 2525, 2142, 761, -313, 963, 1004, -300, -2291, -1628, 222, -2640, -3920]
2869c920L094N20l447O3J348l57k20j561N7J413k83j928m34K881j510k627J848
2886e063K418l471k9J249n65J326j381n44Q90J168k670j10J604J727l879J159
2902f171L411j800p61M00L42l2r5o39J711K403k085k357L909Q28k609m79L176
2919h48N53k114J480Q74p8K54j932J280K643j8k246Q61K664j647k415L314J098
2936C723k78l72l52J417M16r28p73K540N23k542P03K479k499j401J182J633M47
2953E918j328m31K014J446l755j304L396P57k675p18K793l47k224J79J592K30
2969E543j588n70J88J538o16l190K204K777m071j087O50K999l705m19N40O82p80
2986A095j218r65J620N25k397k84K784j251k592Q40J488k403l45J14O59M6k300
$$ y = [-3920, -826, -306, -3753, -3690, -2342, -2699, -2919, -4480, -4423, -3010, -3293, -5221, -5655, -2774, -4284, -6911, -5063, -2645, -6116, -6145, -4896, -5461, -4135, -5516, -6060, -5170, -4002, -6672, -6782, -5178, -3451, -7330, -6171, -2760, -4560, -5321, -4921, -4579, -4611, -4706, -5345, -3634, -1231, -3316, -5673, -1764, -936, -3545, -4024, -848, -295, -2409, -929, -55, -133, 121, -1811, -531, 2112, 2094, -152, 709, 3373, 1726, -689, 2625, 3723, 3445, 3073, 2721, 4138, 4554, 3626, 2853, 5393, 5916, 3374, 4077, 6556, 4057, 2656, 3838, 5471, 5918, 4590, 4159, 6173, 7619, 3864, 2560, 5956, 6713, 4038, 3320, 6113, 5766, 3542, 3721, 5313, 5543, 3955, 3385, 3573, 5111, 4495, 1305, 3509, 6286, 2215, 1128, 1778, 4777, 1072, 653, 1193, 1875, 1095, -123, -1088, 532, 1057, -1340, -1624, 1160, -91, -2683, -1843, -355, -2758, -3103, -2989, -2330, -2284, -4584]
3003d584n35J861O59k561k40L064j070k187j42K195m12o02r75J154J32k86k076
3020f605J343K612k902j966L161Q39k997K99J787P77j525K71J07J047Q18k402
3036e336M47K907l10l132J668L311k248m67J742k18N95k76o85J153K263k807m28
3053a821L685l72k125P33K617j357r42K050J636j400k53j612K346J299j077j730
3069A677K904J140j869q70L141q46j927J391O92o40pp50O25K435j434k497J411
3086D576L195k897j802K538M68j174j343N92R77M62k875o00L343J77m334O22K303
3103D228j667j540R75J440p37k276K94L52J095j077k050K473l62k294j412K748
3119A90Q54m267J300J140j449K14k57m66J062j207k043K428L19k007j231J561
$$ y = [-4584, -5119, -3258, -2599, -5160, -5400, -2336, -3406, -5593, -5735, -3540, -3952, -4554, -5529, -4375, -4243, -4529, -6605, -5262, -2650, -5552, -7518, -4357, -3518, -6515, -6216, -4429, -3652, -5177, -4906, -4799, -3752, -2934, -5336, -4889, -1982, -2292, -5424, -3756, -445, -2693, -3160, -1418, -1636, -1041, -1317, -2002, -849, 1414, -1393, -1821, 1864, 1492, -633, 100, 2717, 1360, 418, 2468, 4104, 2704, 2451, 839, 3185, 4484, 3407, 1677, 4581, 5721, 3852, 2982, 6123, 5277, 3350, 4741, 5433, 4793, 4786, 4036, 4661, 7096, 5662, 3165, 4576, 7771, 4874, 3072, 5610, 6078, 4904, 3561, 4153, 5130, 5592, 2717, 2117, 5460, 5637, 1303, 1925, 4228, 2561, 1021, 1996, 3436, 2699, 423, 717, 1069, 2164, 1087, -963, 1510, 1148, -1146, -2558, 190, 1044, -3223, -1923, -783, -2232, -2018, -2275, -2741, -1679, -2886, -4929, -2501, -2182, -4189, -5420, -3859]
3135c859J352k094l98O29N22o49o89m43J697M62l110M26L626k446o20l27L243
3152b678j146k439J835P75k98j291P18J221J113k973K95K886j89j409n3K108o02
3169b127q50m14J862O00N02k004R78K877k797r82L948m29j825N75J801J041j617
3186A139P22J34P70M07j529K91L291k255j761K770M34j069J52J753r62P92m86
3203D593r42J213J134r72j347J273P26k220L93L305k113j142Q86m1J461k050l72
3220C785l5J563j670N2L66J318j911j582K167j200j014N11N03j147o21p14r62
3237e91L639j412k787K031J241k259k140K298p02n74l14o14J437Qk610o76K146
3254a879L24l846J823K049q75k031P71R90j475R5K60k007K214j336j008K753k40
$$ y = [-3859, -2507, -4601, -4999, -4370, -3848, -4497, -5186, -5629, -3932, -3470, -6580, -6154, -2528, -4974, -5594, -5921, -2678, -3824, -6263, -4428, -3653, -3951, -5242, -4524, -3303, -2190, -5163, -4868, -1982, -2171, -3580, -3633, -1525, -2127, -2977, -3391, -1529, -929, -427, -2431, -1453, 1424, -1373, -2355, 1593, 1164, -661, -86, 1715, 2756, 1139, 1861, 1995, 2765, 3172, 1643, 1934, 5225, 2970, 1209, 3979, 4413, 3344, 3496, 5249, 4287, 5079, 4593, 3651, 4864, 5998, 5026, 3679, 4952, 5678, 3458, 3851, 7156, 5043, 3901, 4787, 4746, 6207, 4157, 3785, 3750, 5313, 3643, 3695, 4061, 5379, 3468, 1886, 4053, 2853, 1839, 2350, 2853, 1706, 1085, 371, -591, 3048, 1636, -1151, 880, 2121, -138, -2278, 20, -682, -1256, -1570, -2184, -747, -739, -3349, -4025, -1879, -1555, -5401, -3578, -1529, -2404, -4435, -3664, -2674, -4149, -4054, -3794, -5801, -3587, -4923, -5931, -3178, -3418]
3271c418k399m77K846p59q63l71J075L08j75j392R19K252j647k094K133K595k426
3288c893r24K156J51j284L22K422l16n84j980J756K660n14k259m42L629l77k004
3305a481J783L12k76RO2J824q70n75r1K754p93j837J401J845L58k483n2K924r48
3324C866q06N07R54R70j558n43L03J583q76j447K080J401k371L19J656j203m72
3341D363p54j81J496L24k662N73K108j527k495J410J775p26j329J889k63j513
3357B488j258P5J56J966k539j406K054J49l126J288J445j266j324m1J133p93r1
3374a090j150P4R14r26k709L807M48k643m79J895j36k545Q25P06J06n4k810J632
3392d135R62p11k588K915K75k118o74J908j17K6l64j71O43J355k038n68K385L7
$$ y = [-3418, -5817, -6294, -3448, -4207, -5070, -5441, -4366, -4058, -4233, -5625, -4706, -2454, -4101, -6195, -4062, -1467, -3893, -4817, -2661, -2510, -3794, -3472, -1050, -1366, -1950, -3930, -2174, 486, -28, -2287, -2729, 900, 523, -1481, 302, 614, 338, 347, 409, 2233, 1363, 788, 697, 3451, 2658, 821, 2222, 4067, 4425, 1942, 1890, 4814, 3866, 3060, 3567, 4521, 5491, 3933, 3390, 3693, 5276, 4400, 2953, 5033, 6434, 4063, 4382, 6038, 4835, 4363, 3609, 3428, 4924, 5248, 2586, 3159, 5267, 3740, 1245, 2655, 4430, 3704, 2375, 4264, 4001, 2488, 1230, 1305, 1461, 3427, 888, -518, 1536, 1685, -1441, -153, 1292, 26, -1298, -1339, -206, -999, -1090, -2240, -2166, -1252, -2178, -4887, -1080, -632, -3275, -3754, -1859, -1995, -4540, -3715, -3009, -2903, -2957, -5767, -4135, -3173, -3884, -6472, -3557, -3282, -5400, -6074, -4166, -4283, -4257, -4621, -4792, -4149, -2794, -4832, -5400, -3015, -2978]
3410b978k889J390K001m91p34M16J597j468N43p60J519m8N99j971L320m4k812
3427b810O22L140l53j612Q89J688O0k311Q53O54R37M11j964J721K936k599k653
3444c91L793O86k065L94Q33KO83o72k52K083q71k254J834K412j546k172J913L87
3462D797j231Q35r7M27L62k57j462Q98J397k792L5J922k45k397Q51P95j71q18
3480B849j549O08J580l39j918M45J033j598k754L639k97j348o49J378m80j425
3496h25k80J55Q54P21l644R08K319k231j254O81K031r46l273J077P81q71j69Q67
3514c099j9j04p48j146K892j097j362L88J880j771o76N56N41r60O00l92o21K443
3532b695r33j932K958j91j365l42K110m48j027l06J517K38j056J239n60J323M32
$$ y = [-2978, -5867, -4477, -2476, -2967, -3701, -3285, -1688, -3156, -2613, -3373, -1854, -1902, -1303, -3274, 46, 2, -2810, -2188, 952, 599, -1013, -124, 1564, 1624, -687, 166, 820, 1757, 2168, 204, 1925, 4861, 2262, -391, 3402, 4088, 2023, 2417, 3250, 3252, 3935, 3263, 3011, 5094, 4223, 1969, 3803, 6215, 4669, 2497, 4410, 4797, 3566, 4401, 4304, 4731, 5093, 4836, 3374, 4272, 5669, 2877, 2912, 4834, 4589, 2192, 3043, 3838, 3667, 2849, 1300, 1908, 3488, 3149, 1231, 1676, 2709, 1111, -1643, 1996, 1699, 351, -298, 1080, 600, -825, -1105, -950, -96, 625, -3019, -2111, 208, -2023, -3277, -2596, -565, -1511, -4784, -3707, -2926, -3797, -3966, -3099, -3118, -3222, -3970, -5116, -2224, -3321, -4683, -4295, -2415, -4186, -4862, -4306, -3765, -4725, -4125, -4517, -5138, -2695, -3628, -5560, -2602, -2793, -4158, -4500, -2390, -2838, -3865, -4171, -2654, -2416, -3472, -2233, -2793, -1470, -1038]
3549a038j683J090K178k548O3J955L92j493J21P35Q18J869j733n5J783l7k133
3566B84J004K535j636j934K771J76j290J180q16J800m50M66j874J362M30j948
3582B060N57K383j85j559J304N72p33j206l18J092J657q03k385J129K544k050
3598D059j042Q63k16j188Q71j059J966j837O35j447J583q0k409J188J450j260
3614B077k721J720J139j382l63m23m85J306j467q51J057N16k405m95K178P47l228
3631c080J215O15j323L34q75N20O46j750k11j96J699j799j308K301J567l537K99
3648d883J464j89j135L13J028k92Nq36l65L541k240r61K283o53j055n76J603N46
3666b402M27j332l39P48P84j943P03L272j70k285l40J924l77P96o86J953q72m61
$$ y = [-1038, -2721, -1631, 547, -2001, -1938, 17, 409, -1084, -963, -228, 590, 2459, 726, 671, 2454, 2417, 284, 1288, 3823, 2187, 253, 3024, 3200, 1910, 3090, 2274, 4074, 3624, 4090, 2216, 3578, 4008, 2060, 2617, 5000, 4815, 3256, 4560, 5132, 4399, 3193, 2875, 3967, 5624, 4821, 2436, 3565, 6109, 4059, 3017, 3880, 3664, 2476, 3347, 2288, 4254, 2417, 3052, 1605, 3188, 3108, 699, 1887, 3337, 2077, -644, 1076, 2215, 833, 470, 47, -438, 868, -599, -1450, -393, 123, -2282, -2777, -599, 148, -3080, -1865, -1250, -2573, -2239, -3114, -2594, -1948, -3698, -3909, -4105, -2406, -4205, -5513, -3212, -1645, -5182, -4883, -3419, -3608, -4743, -4430, -3402, -3694, -3689, -4525, -4890, -1349, -3589, -4550, -2267, -2920, -3975, -4551, -2948, -2402, -1975, -3307, -3646, -2898, -2114, -4057, -3354, -82, -252, -2537, -2877, -953, -1330, -534, -1220, 733, -139, -600]
3684f00k57J487J410j619m29J407J226k023O47Q56p60L47Q7Q43m86Q91j325J254
3702B956K405j374j972Q55K896k995j21K177l20q56p52J151L28j97j79j057J840
3719D785l9k154J56K309q82j527P28R92j347P7j014R73J07j484N88P03K95k108
3737A158k26J929j513q58n38J302M68r34l51l96jP1j908L88L144k597j534K169
3755b27o97j775N33L70m42J90j470L04N95M34k402J062J590j091j642J878J188
3772a602k111p44M3Q83J80r42m14J780l08j317m59K321p61q04O89J514m46j762
3790d260J482l75Q28p90p59J996P62j377l52J175J577l183J004O95J272j500P48
3807a057k9J421J29k140R38J822L09k272K435J267j189j115J964M64k213P50O1
$$ y = [-600, -857, 630, 2040, 421, -8, 1399, 2625, 602, 1249, 2105, 1345, 1692, 1779, 2622, 2136, 3027, 1702, 2956, 5361, 3987, 2015, 2870, 5766, 2771, 2650, 4827, 4507, 3651, 2899, 4050, 4378, 4181, 4002, 2945, 4785, 4746, 2592, 2748, 5057, 4175, 2648, 3376, 4368, 3021, 3098, 2084, 3057, 3164, 1680, 2268, 2971, 3266, 1158, 932, 2861, 1348, 490, -48, 1254, 1722, 788, 437, 41, 40, 111, -1797, -1409, 1735, -862, -2396, -227, -924, -2699, -2166, -1796, -2238, -2048, -3518, -3214, -2619, -2185, -4587, -3525, -1935, -3026, -4668, -2790, -1602, -3713, -4457, -4414, -3531, -3351, -4293, -4707, -2927, -3235, -4552, -5011, -2690, -3451, -4255, -3566, -2052, -2498, -4260, -2778, -3153, -2325, -3115, -3874, -1878, -1116, -2493, -2845, -1670, -93, -3276, -2272, -1577, -305, -1805, -1057, -1086, 335, 464, -1676, -738, 1084, 1393, -879, 1556, 2823, 1634, 519, 2483, 2947, 734, 1484, 1545]
3824A545M41R21k80o96K285M37k275n6K928j250j275J463q2K69m60q31j74J721
3842D631j722j466K329J438k168j015J780j016r68J932J0q72J33r39P25N25K15
3859C552j678n68J782j362j251J872m6j103n27k32O10J17j096j041K124l92k489
3876a728J181N86l18j134M34J427j308q43j89L61M67j219j167J129J070k714L65
3893c600J131l71r60J32Q49p98K86j049N44K06R07k151K362J2r53j460J042K291
3911a580l093J841J22j253O01o87L7K462K33l389K116J734q69k157K077K345j823
3928a283o53J043K34m11R46q44O11K778k349p1J470j02j951J72K465m24n67J279
3946B343k79m1R15j659J785K47j320P85Q37M22k020N50J148p71L04j199J221J536
$$ y = [1545, 1986, 2907, 2627, 1931, 4216, 4653, 2378, 2322, 5250, 4000, 2725, 4188, 4106, 4375, 3915, 3084, 2910, 4631, 2909, 1443, 3772, 5210, 3042, 2027, 3807, 2791, 1823, 3755, 3765, 2893, 3026, 2087, 2812, 3337, 3552, 1874, 1306, 3088, 1726, 475, 2347, 2301, 1198, 671, 439, 1049, 1166, 70, -971, 1153, 761, -1728, -547, 39, -279, -1413, -979, 448, -860, -1703, -1892, -1531, -1064, -2283, -3450, -2321, -1251, -3965, -3600, -2469, -2840, -3800, -3668, -2819, -3617, -3331, -4380, -3836, -3630, -2723, -4874, -2512, -2500, -3453, -4913, -3871, -1580, -4673, -2832, -2710, -3963, -3362, -4049, -4012, -1550, -1317, -4706, -2590, -856, -1725, -3882, -1805, 540, -1283, -1936, -893, -659, -1070, -124, -968, -357, 2421, 72, 1, 1471, 1369, -582, -410, 2055, 1631, 1064, 2343, 2064, 2023, 2938, 1279, 3064, 3311, 1991, 2776, 3613, 4035, 2015, 2565, 3713, 2942, 3246, 2047, 3268, 4804]
3964D804r3j746J46R87J024k396J186O87j244n19J318o5p05o51n76J652O15j995
3982B429n94K163j208j410O66J718j386j247L94O92r84L13r53K47Q52p43n86N18
4000H81m25j945O27R17n91j467J172l32j77K29j222L56n06J142j679k30J729j989
4018c510R9O99K27%j416J109L12M12k067N10K49M06k161J693P32p81j234P93J414
4037b514j037L19J306j519J117j672L44Q54P13j404N23K718j305p65M83O02j057
4054b294M99Q3j94J734J61m30J132J48o95o18J211q07Q30k94N62L58M92N7j309
4073F26R60O81r34j63K122J24n55j3N16k32J16r3J37J72k26j144J145J357j032
4092C564p02L34J107k892J613O61r35J26N18q02O10o41q7RR95j74k184J674R55
$$ y = [4804, 4711, 2965, 3111, 4098, 5122, 2726, 3912, 4599, 3355, 2836, 4154, 4089, 3384, 2733, 2157, 3809, 4424, 2429, 1835, 3998, 2790, 1380, 2046, 3764, 2378, 1131, 1525, 2217, 1233, 1546, 593, 840, 1692, 949, 363, 881, 456, -1489, -862, 55, -536, -2003, -831, -1163, -1340, -1111, -2333, -1977, -2483, -1341, -3020, -3250, -1521, -3510, -3411, -2712, -2485, -2485, -3901, -2792, -2480, -2068, -4135, -3625, -3376, -2970, -5131, -3438, -2706, -3487, -4721, -3928, -2514, -3551, -3232, -1926, -3445, -2328, -4000, -3656, -2802, -2089, -3493, -2970, -252, -1557, -2322, -1839, -1237, -2294, -1795, -1712, -1906, -172, -11, -441, 691, 839, 144, -474, 737, -70, 760, 466, 1028, 1386, 1878, 1935, 626, 1586, 2267, 1333, 1170, 3292, 3416, 2861, 2848, 3364, 3132, 3248, 3155, 3292, 3464, 3238, 2094, 3239, 4596, 3564, 2862, 3196, 4303, 1411, 3024, 3685, 2750, 2876, 3394, 2592, 3202, 2561, 2474, 2483, 3478, 3304, 1120, 2794, 3749]
4111C749j348j204J410j132N40j048J30L12R73j848j87J626j044j689R2J164j066
4128e70o38m44O50J59J9o67L67n43k63J2J194K08k176P19R56j262j022j20J072
4147b349j501Q19l38Q17L56j213K2J021J58j537J21J280r1j931J125K86l08N82
4165b681j111M42J317j463j49Q82O34r21J79J411n70j010P73J044m87J96O53o11
4183a472J422j69m60l34J350r26p93J822J59n71P56N45o67J305p91k1M39P38j246
4202A086O01K082q99j204N48K05N89L39q98M20Q09l72j419P91J393r51p78J270
4220C612P4j104L15K20L95p27J456j302O46P62k795J041O36n52l90M91q26k17
4238A735m15J134j01p53n34m61J125l36o47j71m6J113k313N64J207j171p01j72
$$ y = [3749, 2401, 1197, 2607, 1475, 2015, 967, 1097, 1409, 2382, 534, 347, 1973, 929, -760, -668, 496, -570, -1208, -1652, -1002, -843, -824, -1491, -1124, -1667, -1930, -1918, -724, -516, -2692, -1973, -1017, -2279, -3301, -3421, -2349, -3850, -3031, -3369, -2552, -2196, -3409, -3387, -2366, -2208, -3745, -3624, -2344, -2435, -4366, -3241, -2955, -3263, -2681, -3792, -3350, -2033, -3496, -3645, -2763, -2129, -3050, -2871, -1460, -2030, -3040, -2267, -1223, -1710, -1514, -861, -1472, -50, -219, -679, -1013, 337, -589, -1382, 440, 599, 28, 784, 1329, 662, 1967, 1176, 1155, 1594, 2332, 1086, 1687, 3769, 2870, 1666, 2214, 2419, 3008, 3347, 2449, 2869, 3678, 3306, 1887, 2678, 4071, 3120, 2342, 3612, 3686, 2582, 2897, 3117, 3512, 2785, 4241, 2939, 3585, 4347, 1552, 2593, 3229, 2677, 2287, 2778, 1952, 1735, 1320, 2454, 2353, 1600, 1066, 605, 1730, 1394, 747, 576, 530, 1643, -670, -106, 1101, -70, -771, -943]
4256i43N73Q42r73j478N46N85j827o7J266o28j41n31Q26n10M06O37q64l4j129
4275c444L53K90J80l29j746J730K56m27j53R57o48K64p2j96q6j94Q84n60K68N69
4295b104k306K283K43n32q73J861j619J681k44k48J15Q12j540M16J476j35p46
4312a460q7K083r30j63J79K077j770P58k7K6J758j326j039J519J265j780k15J233
4330B101J146j466M16M23M12J52j437j62J074P55j078r84K132r52p07K098n03
4347C420m78l33N27n54O27k57j98R88j74j483l8M65k88j21j63M60j405N65j08
4366A452P97J05j04j876J352k1j167p72J599q30p93j006N38J653j634J64j324
4383a867J306K52j174j492K691o71j44k36L16j087j338J364j35L94p80j102J483
$$ y = [-943, -370, 472, -501, -1979, -1433, -848, -2675, -2742, -1476, -2104, -2245, -2776, -1950, -2460, -2054, -1417, -2281, -2315, -3444, -3091, -2801, -2621, -2950, -4696, -2966, -2710, -3137, -3290, -2333, -2981, -2717, -2789, -2985, -3071, -3265, -2381, -2941, -2673, -2104, -4410, -2127, -1884, -2416, -3289, -1428, -3047, -1366, -1610, -1858, -1743, -931, -2471, -2055, -579, -714, -1460, -1547, 536, -394, -557, -378, 1699, -71, 687, 660, 686, 2444, 1118, 79, 1598, 2863, 1083, 868, 2101, 3247, 1781, 2197, 2620, 3032, 3184, 1747, 1585, 2659, 3414, 2336, 1352, 3484, 2532, 1825, 3923, 3420, 2942, 2609, 3136, 2582, 3209, 2952, 2754, 3742, 3568, 2085, 2047, 2512, 2224, 2103, 1940, 2400, 995, 1560, 1452, 2249, 2354, 2250, 374, 1726, 1705, 538, -234, 1365, 535, -258, -1264, -726, 927, -707, -543, -1867, -561, -309, -1483, -2975, -284, -955, -1099, -1335, -1019, -2106, -3444, -2080, -2215, -1821, -2601, -3703, -2220]
4400b220k06j253J209L57Q5j971R38J617j770K3J060q96J5J398j456p80P06O2
4418c082j394J745J222j336P9P65n12l80N8Q86k10Q32N1j325J304K50j223K675
4436D05K99p11n53k78K124r36P55j456J573J420j949o36K440p13j133Q61J648
4453C160k057j57J512K14L37j407O42l98J582k53j051J590o53j214M57J122j082
4470B344M23j183J558j82K62p28J36J757j094j072P72J359k602l82J683j101o37
4487A313N76K35Q09j188n65J84Q22o13o39M62P82j896l88P11P56j151j081J534
4505F63n16L58j413o56K05J293j495o4J712j90j722L97J273j580p7n05P13l19
4523a923l73j25P28j23j232J73J101J37n89K16j903J191r67J306o31J043O8j149
$$ y = [-2220, -2426, -3679, -2470, -2113, -2028, -3999, -3061, -1444, -3214, -3191, -2131, -3027, -3012, -1614, -3070, -3850, -3144, -3082, -4476, -2731, -1509, -2845, -2766, -2001, -2513, -2893, -2835, -1949, -2159, -1327, -1276, -2601, -1297, -1047, -2270, 405, 704, -7, -560, -838, 1286, 350, 1105, -351, 1222, 2642, 693, 57, 2497, 1784, 651, 1512, 3160, 1103, 946, 2458, 2672, 3009, 1602, 2244, 1846, 3428, 3175, 2124, 3714, 3061, 1847, 2304, 3426, 2344, 2767, 1584, 3142, 2960, 3222, 2494, 2630, 4387, 3293, 2221, 2993, 4352, 1750, 1368, 3051, 1950, 1313, 1889, 2124, 2933, 1745, 1180, 1364, 2186, 1573, 934, 1396, 2178, 282, -106, 605, 1361, 210, -871, 663, 147, 505, -908, -1564, -1359, -66, -1561, -1625, 87, -103, -1825, -1428, -155, -1735, -1812, -2317, -1604, -1923, -2296, -2421, -1693, -1816, -3048, -2875, -1774, -1637, -2226, -2010, -3913, -2722, -3689, -2383, -3014, -1971, -1903, -3052]
4541c052O7R65K53j862J927L73k114O15L85o29N39J364j060J796K24j832k53J957
4559c37j202l42N43R60M18o02Q5n55Q99l67n66J389J708k130Q89R70K19j691P97
4578A085N08J161r69l31J76L75O58j698J086P41j42r43P16N70j071l68J299M04
4596C257O4k26l32J77O02j227j63J626p42j585J368J28q60k59Q97K20q18M12k003
4615E36J904L83p35r50M22J208k545Q51P01o44r19P9J065j184P59j588M39L96
4633A78r1j732R26M70l06r72J115J04q98r46J57l14J09j97P8R36K99j544N66R11
4653a151r86q10R37J84j248R9M93p93K316j258p03P8R53m72j125J856j152l25
4671c107P59R59j617K06K88J49K73M82j071J123J153p36j852J657Q97j427L23
$$ y = [-3052, -2985, -2020, -1767, -3629, -1702, -1329, -3443, -2828, -2443, -3072, -2533, -1169, -2229, -433, -209, -2041, -2294, -337, -1539, -1881, -1338, -378, 40, -562, -477, -1032, -133, -500, -1066, 323, 2031, -99, 790, 1760, 1979, 288, 1085, 1593, 2754, 1785, 1454, 1630, 2005, 2663, 965, 2051, 2792, 2650, 1707, 2423, 2993, 1922, 1554, 2853, 3257, 3321, 3095, 2763, 2940, 3542, 2315, 2152, 3778, 3036, 1451, 2819, 2947, 2087, 1828, 2725, 2945, 2127, 2539, 536, 2440, 2823, 2088, 1138, 1560, 2768, 223, 1074, 1775, 1131, 212, 291, 1356, 172, 931, -657, -218, 178, 87, -1645, -719, -249, -555, -1527, -412, -308, -1206, -2152, -1995, -2309, -2200, -2397, -2319, -1383, -1084, -2628, -2062, -1151, -2137, -2947, -2010, -1826, -3074, -2975, -2482, -3275, -959, -2217, -2920, -2842, -1889, -2361, -3486, -1630, -2782, -3107, -2348, -1389, -3006, -2800, -2512, -2363, -2090, -1608, -2679, -1556, -403, -1139, -2991, -1334, -437, -1864, -1541]
4688a541L57m01R18M16L04m41N03r32J248J447k171M95l9K647q78j445O29K23
4706A339P95l80o20K14M15q06R06Q85l55q42j23J625j526J063L46J041p67Q14
4724D024j384k05J013j224rP18k45o18J055j39k27m27Q68l61n05l60p12L16J520
4743C098q07j619J598j127R8r09M57M18r18J397j328Q1J163j880L88R42k97k186
4761a431P02J078j700r7o3Q11l66r11M61l23K83o84q05J859k54j694O12J186k51
4780a587k260J401k52N33K05j239l06J107o67L39MJ449j945J77J56N53J20j062
4798c274L88J167p17J3n52J731j46j149o48K790j073q49J111L78q90J606p38J271
4816D19l2j643J129k45K233j306J52J29p43N26J91R81k86j463J140N01Q05p65
$$ y = [-1541, -1184, -1585, -667, -251, 53, -388, 115, -817, 431, 1878, -293, 202, 163, 2810, 1932, 487, 1116, 1339, 2134, 1754, 1134, 1348, 1763, 957, 1863, 2748, 2393, 1551, 1428, 3053, 1527, 2590, 2936, 3977, 3210, 4024, 2640, 2435, 3448, 2224, 2215, 2933, 2688, 2070, 3125, 2986, 2759, 2332, 3200, 2839, 2334, 1974, 1262, 1578, 3098, 2291, 672, 2270, 1143, 1241, 332, 789, 1207, 289, 1686, 358, 439, 1602, -278, 110, 1052, 755, -1431, -729, 349, -1351, -1448, -1511, -700, -1066, -1977, -1516, -1839, -1556, -2240, -3045, -1186, -1440, -3134, -2522, -1336, -1587, -3847, -2446, -2698, -2165, -1960, -3199, -3505, -2398, -3065, -2726, -2722, -1273, -3218, -3041, -2885, -2332, -2212, -3274, -2886, -1719, -2436, -2423, -2975, -1244, -1390, -2539, -3187, -397, -1470, -2319, -1208, -830, -1720, -114, -852, 419, 387, -1256, -127, -372, 1861, 555, 707, 836, 93, 619, 810, 1791, 1505, 42, 1182, 1683, 2488, 1723]
4834A723n04O79J380j833j18J217n7n69j086J465N9m00J431j356M64R5p92J690
4852C488M46j880o62O92J434j728o2J206L08j316N72j257P39M19k65p5k26M00
4870B233n19j202J756j502j54P51o74L16M45j467M46J722j326j450O43L15j978
4887a645j32J135m88P92j656O28n15J030j438O33p1K13n34M78O04l038J286O74
4905b044L8q26J65N85p98Q32j667M50M98J230k671J298Q69j035K88Q82J70j062
4923b798J65JQ54P31q76r59J708r13J17q18J765J7p13R30j384O92K94N63L7j337
4943a924J629l50n6J132r13Q38N41l04o0m84N59O3M99j029N50J072m30%J98O40
4963B171l29k46k39J096j07M2R05k38n76K55p54O35J17k35L2M05M75l000J200
$$ y = [1723, 1219, 1898, 3278, 1445, 1327, 2544, 2487, 1918, 832, 2297, 2356, 1956, 3387, 2031, 2495, 2590, 1798, 3488, 3934, 2054, 1392, 2084, 3518, 1790, 1728, 2934, 3242, 1926, 2498, 1241, 1980, 2399, 2134, 2059, 1833, 2233, 1714, 512, 2268, 766, 612, 1363, 689, 1005, 1450, -17, 429, 2151, 825, -625, 18, 333, -1645, -1777, -642, -1130, -338, -1994, -1366, -1881, -851, -2289, -1656, -1727, -1514, -2048, -1570, -966, -4004, -2718, -2044, -2006, -2832, -2667, -2082, -2880, -2048, -3715, -3265, -2767, -1537, -4208, -2910, -2041, -3076, -2788, -1906, -1736, -2798, -2633, -2632, -1778, -1047, -1923, -2882, -1174, -2087, -1970, -2788, -1023, -1006, -1719, -789, -2173, -1481, -1187, -624, -587, -1924, -295, -645, -701, 431, -482, 356, 897, 593, 533, 49, 608, 671, 1170, 141, 691, 1763, 1333, 1333, 1531, 2171, 1842, 1596, 1357, 2453, 2346, 2388, 3293, 3055, 2479, 2734, 1980, 2615, 2732, 2497, 2529, 2934, 3409, 409, 1609]
4982A609M58J157r38J091M2r37p4j312J076m92m2K62l66O52q75O45J66n08J39
5001A753k59q6l6k17j628J595K8m65j337o4J366k32j230K1O08r19K27o40J142
5020c73jp84k79J066j733j61L91L51m4r43N72L47k78M08q67l43J705j180j90N29
5040a807Q2n42m31J514j968J298j155P57j36o97P13L00O80r66L29j48J258j225
5058b144K3M55P90l83Q09n54L51j56k92m98J462J040k180N09J597Q0j346P24O34
5077I21m98j51L01J087j055n7N65O4Q70o93q05K180q81K51n9Q0q89L08L8L17N18
5098B412M0p02R46k10J31j708J535J009j235k13O84j054R88M51J24K92q31k118
5116E41N62J275L77j986J368p88Q4k61N1J049j864m3Q6K10J65k87l73J218q68
$$ y = [1609, 2067, 3224, 2286, 3377, 3419, 2482, 2408, 1096, 2172, 1680, 1638, 1900, 1534, 2186, 1311, 1956, 2122, 1614, 1753, 1494, 1408, 1372, 1155, -473, 1122, 1150, 685, -652, -716, 650, 418, -812, -791, -183, -1102, -875, -1515, -373, -374, -1158, -1437, -371, -2104, -2265, -1874, -1523, -1567, -2510, -1938, -1591, -1869, -1461, -2328, -2671, -966, -2146, -2336, -1807, -1725, -2267, -2698, -1184, -3152, -1854, -3009, -2252, -2388, -3085, -2372, -2072, -1392, -2358, -2029, -2177, -919, -2144, -2121, -1666, -876, -1259, -450, -1004, -653, -809, -1101, -1599, -137, 903, -1277, -768, 829, 909, -437, 287, 921, 423, 272, 573, 1660, 605, 548, 1113, 1177, 2047, 1354, 549, 2729, 1848, 2099, 2040, 2120, 1231, 1539, 1577, 1894, 2412, 2452, 1750, 2696, 2486, 2617, 909, 2444, 3453, 2218, 2005, 2689, 1635, 2623, 3074, 3198, 3490, 2659, 541, 1103, 2378, 2755, 769, 2137, 1349, 1433, 1172, 1223, 2272, 408, 365, 451, 661, 826, 539, 166, 1384, 516]
5135E16j672J608l83m35J97m53q22P32L37k068J045L08n93q71J737Rj205K81J183
5154e49j280R6p23O94K84m14l87l49J482j205J40L40k19r57R2J263o37K23l33
5173b439K45k01L28r90J026J499j631k21R2J486q96l65M03K02m48Q22o12J114
5191e86M06k63r86P86J180j397k16M26R95l35j86k12P6J434j226R18J139j354
5209E99Q27o01M22Q28q15J142Q9m76J9q76M32N70O86j805J117J031j475P40J172
5228C626r09k05J148j166m59J29J20R18o69o51O94r56J102j268M21J142j292p2
5246A653q66N94N58o41J03J11N45j684p91P31O78k619J827k60J53k86P49K6j04
5265D77n34N50j373O97L66j360M90N47q37j644N74J445r93K23q57J383m84N57
$$ y = [516, -1156, 452, 69, -366, -169, -622, -1444, -712, -375, -2443, -1398, -1090, -1683, -2554, -817, -808, -2013, -1732, -549, -1829, -1733, -2456, -1762, -1478, -1892, -2279, -2628, -1146, -2351, -2211, -1871, -2090, -3047, -2955, -1692, -2329, -2106, -2439, -2194, -2395, -2067, -3057, -2031, -532, -2163, -2384, -2292, -806, -1702, -2067, -1664, -1462, -1910, -1088, -1700, -586, -180, -443, -1429, -643, 537, -860, -1076, -650, 345, 10, -176, -388, -312, 1122, -104, 814, 1953, 599, 1426, 825, 1247, 2075, 1260, 2402, 2491, 2015, 2034, 1158, 1590, 2160, 2846, 1041, 2158, 3189, 1714, 2454, 3626, 2717, 2512, 3660, 2494, 2035, 2164, 2284, 3202, 2533, 1882, 2576, 1620, 2722, 1454, 1875, 3017, 1725, 1653, 787, 1381, 1939, 1298, 1401, 1512, 2057, 373, -418, 313, 991, -1628, 199, -61, 92, -194, 555, 581, 477, -57, 493, -880, -183, 183, -1177, -687, -140, -977, -2621, -2047, -602, -1595, -1372, -2229, -846, -1330, -773]
5283g73k069J669k40j273n37K126r88l28j13O88p10M65k24k79J237j369J03q23
5301c438J732Q13j580J158k09m06L5N48r31N09J29K56N48l53q97M18J799k39j039
5320a147J781j529K22N48o72N70j397J567j12J211M1j287Q47K45P17p16k17J636
5338B308j731M15J331j772R66m61L51l88J293N98j749Q74K15p90J022r16k03L26
5356A689P59l34l64J222m78P4n60r35MR96K72p20j05P67O11j506L68p26O54j129
5376E59J123l11l07P31j116O16l54K24r24O9M11J66m24j433M42m4L40O5j66N24
5396A91j338L81M86l83k027J043J073o4j721J010k57J71K41j307J321R41j536
5413a775m34N13n12q31P15N36l88L39k29l23L70N32j861J501P00l75k51N82j420
$$ y = [-773, -2842, -1173, -1413, -2686, -3223, -1097, -2085, -2413, -2526, -1838, -2548, -2083, -2307, -2586, -1349, -2718, -2615, -3438, -1706, -893, -2473, -1315, -1524, -1930, -1895, -1347, -2278, -1769, -1640, -1384, -836, -1189, -2086, -1668, 131, -108, -1147, 634, -895, -673, -125, -797, -227, -1624, -57, -169, 1042, 1083, -204, 643, 888, 1605, 889, 672, 2308, 577, 992, 2323, 551, 1517, 1056, 1407, 1019, 2312, 2910, 1161, 2035, 2250, 1460, 2482, 1566, 1363, 1689, 2448, 2114, 1750, 2972, 2494, 2568, 2008, 1073, 1077, 2073, 2345, 1625, 1520, 2287, 2898, 1392, 1760, 1034, 1688, 559, 1682, 1371, 1064, 1795, 679, 1295, 941, 1165, 241, 310, 721, 887, 463, -970, -528, -572, -232, -167, -333, 191, -1147, -766, -280, -663, -2690, -1647, -574, -638, -2359, -1349, -1606, -1435, -1194, -2501, -1180, -239, -1775, -2209, -1696, -2208, -3039, -2324, -1788, -2176, -1837, -2066, -2389, -2019, -1487, -3348, -1847, -1147, -1522, -1773, -1191, -2611]
5432b611J161j61O33p11J78k82O71N61l59J3l56J439j343j86R77M19j191J294
5450A46n99M21P34Q63j224l62J082o66m11J027P14j580l36P65N41n87Q04l92R19
5469A859K48q86M93J563r49j589K369m42j532J82P21R9R4q45N93O82p50M04k40
5488B074l14M1n9l51J161k211J007O4j7J327j202Q1mN18M78k244P51L46j239J51
5508C58N76k60L34p17P19j051R92q74m5N36r05j301J151M63j64j071P90l32J07
5527f94q40m6l36N91J29n69N13j32l29n52Q8O36M1o95J255q07l18P49r16k93k42
5548b767k88J871j018p02Q73J80J53j232Q90J38Q06j270K36l5N84M07q44Q14Q84
5567c20j510l08K335p98M32m37L36K13P47j096l3N32M26p74Q52N63r09j426R62
$$ y = [-2611, -1450, -1611, -978, -1689, -1511, -1793, -1122, -561, -920, -907, -1263, 176, -1167, -1353, -376, 43, -1148, 146, -453, -32, 702, 1565, 341, -21, 1061, 395, -16, 1011, 1725, 145, -191, 574, 1115, 528, 1332, 940, 1859, 2107, 1221, 1714, 3277, 2328, 739, 3108, 2666, 1134, 1316, 2037, 2136, 2230, 1385, 1978, 2660, 1910, 2314, 2074, 1760, 1801, 1742, 1391, 2552, 341, 1348, 1412, 1395, 2722, 1520, 1601, 1597, 2115, 2593, 349, 1100, 1446, 207, 358, 934, 674, 1008, 291, 1010, -41, 951, 77, 32, 568, -337, -1638, -487, -24, -188, -1259, -469, -801, -694, -1534, -1580, -1916, -1325, -1196, -1765, -1252, -1384, -1713, -2265, -2177, -1541, -1500, -2195, -940, -1747, -2065, -1316, -2232, -2525, -2767, -3055, -1184, -2202, -2904, -2031, -1851, -1698, -2930, -2040, -1902, -1096, -2366, -2130, -2165, -1581, -1174, -2018, -1204, -320, -1830, -2138, 197, -601, -169, -606, -270, -57, 690, -406, -439, 93, 519, -255, 597, 1160, 251, -1175, -213]
5586b13O39Q55o5l58P34M44j05j120N75p1J408j144k92J453p4j230N52L27q75
5605A440P02p3K1j94M25m49L35M4l71Q32j867M04k30K75O47P78o51j507J423M94
5625B478j487M29R46p54j547O60L31o94R91k53k99qk34j89K69M65j214l72j16
5644e98Q74j600J049O34o48j309j53J870j161k01P39o17p58L33j354K691r37j001
5662b147j96R95R1j104J46k55K71O52p97k92J525Q2k186O30J928j758K37N42q
5681a644q97N27N30O03p65p06J02J010L04m82N58J387j927l61R78L61k77R62r93
5700g30Q23m82L11p68J132n62K66m86N27O80k54J00K64J62j192J444j255J407
5718A387m51M39M40J8Q6j013J123M42j012M79k69o15J400N36k626J433k3l67J298
$$ y = [-213, 426, 1281, 1216, 858, 1592, 2036, 1931, 811, 1386, 1315, 2723, 1579, 1287, 2740, 2666, 1436, 1988, 2315, 1440, 2142, 2069, 2090, 1896, 2321, 1872, 2207, 2251, 1880, 2712, 845, 1249, 1019, 1294, 1941, 2719, 2068, 561, 1984, 2478, 991, 1420, 2366, 1612, 65, 725, 1056, 362, 1353, 1100, 801, 793, 559, 370, 639, 1104, -110, -482, -598, 276, -1324, -275, 359, -289, -1598, -1751, 119, -1042, -1243, -504, -1121, -1879, -1546, -2900, -209, -1146, -2147, -2343, -1348, -1257, -2361, -2215, -2470, -2199, -1547, -2344, -2636, -1111, -1029, -3215, -2585, -657, -2415, -2178, -1636, -1644, -2541, -2014, -1484, -881, -1646, -2352, -2250, -1240, -936, -1418, -860, 527, -1400, -1761, -783, -422, -699, 263, -730, 93, -389, -78, -846, 286, -276, -10, -496, 31, 711, 457, 557, 821, 983, -209, 1235, -20, 1387, 936, 1375, 1815, 1833, 1919, 906, 2029, 2471, 1459, 1938, 1669, 1054, 2454, 2990, 364, 1797, 1774, 1407, 2705]
5737B705q99L86n18j94Q85j338J22L71J32J496j37q42l98O29n84j111J045m84
5755A266j72p73J093o90r40J347N5l16k98Q41j255M51p10q98N61l61M43k90O90
5774D4q33m74J105m07J68m14j578R58R16k09j155L46J152j910K30P54q56P21o58
5793b100L13o11O45r60L00M82N6p76p49J122P6n31K51J121p59r24P75J25Q97K12
5813a035p46K31P89j228R38r59Q75M19j31N71q10P84m07o03P18J149r12j72J401
5832H72j292J041R34q72K39L42l17k86k05P4j41Q01L83j199J528P61k400J443
5850A706j26L20n78M66m07m37k32J250j140J362m47m48O34M54j38j638J643n70
5868A674j17O64k65J58M04j351K47j64O43q34q72J258l27p89k03K361k654J361
$$ y = [2705, 1806, 2192, 1674, 1480, 2365, 1027, 1149, 1520, 1652, 3148, 3011, 2169, 1771, 2400, 1816, 705, 1750, 1266, 1094, 321, 1414, 724, -216, 1131, 1186, 870, 572, 1413, 158, 609, -101, -999, -438, -799, -356, -646, 44, -789, -1263, -158, -565, -397, -811, -2389, -1431, -515, -724, -1879, -1533, -381, -2291, -2061, -1307, -2163, -1442, -2100, -1787, -2398, -1753, -2713, -2413, -1931, -1875, -2651, -3400, -2278, -2202, -2733, -2482, -1361, -2120, -3044, -2269, -2144, -1247, -1035, -1781, -1550, -761, -1989, -1051, -2010, -1135, -716, -847, -276, -1086, -302, -709, -1312, -594, 555, -357, -529, 872, -420, 621, 1555, 683, 922, 1264, 947, 661, 456, 530, 389, 1190, 1573, 374, 1902, 2663, 263, 1706, 1580, 1900, 1322, 1788, 1381, 944, 712, 1962, 822, 2184, 1737, 1289, 1923, 2377, 2239, 601, 2244, 1674, 1557, 2221, 1956, 2114, 2518, 1167, 1414, 1250, 1893, 1059, 187, 1445, 1118, 329, 126, 2487, -167, 1194]
5886A194o24K48M54j005p58l59J079o39l96Q66Q1r37n6L37P29j530J832n15j371
5905a370k42J003m54J291j316j33J87R89j766p81Q23M02j089Q21k97n07J852o65
5923a252m75J082j400N31n15O36j787J261L40o62J176j206Q77k83O26P1j985K104
5941h61P14j384N47J079j044L58N24j661O87n9J162k185J188J663r67R28n97l71
5959b79J23O89J159j167M45N13r74k49K08l9R91L34q3j373J482n38l74L01J222
5978B391j578J344q42J63L31M45j220M9L15n9o30J446O25j357J67J82n2m62m38
5997H20R24O72o76o18J11q53J583j377P68j36k89L88n42j17M11J15l77L66k53
6016I20j240L63M65n48o95J234J59j316J58O03L54o11j129L32L60%j009J64K62
$$ y = [1194, 570, 818, 1272, 267, -491, -850, 229, -410, -806, 60, 141, -796, -852, -515, 214, -1316, 516, 1, -1370, -1612, -609, -1063, 228, -1088, -1221, -1034, -45, -1811, -2592, -1769, -1367, -2456, -1635, -1932, -2439, -587, -1252, -1727, -645, -2045, -1514, -2029, -1393, -3180, -1919, -1579, -2241, -1065, -2271, -1394, -1677, -1051, -980, -2965, -861, -147, -1531, -984, 95, -949, -591, -67, -1728, -1041, -1100, 62, -2123, -935, 728, -239, 689, 92, -279, -156, 533, 1692, 525, 970, 1483, 509, 260, 468, 429, 1420, 1754, 1671, 298, 1780, 1242, 868, 1169, 2391, 813, 2157, 1315, 1478, 1809, 2254, 1034, 1083, 1398, 1339, 709, 2155, 2780, 1423, 1590, 1772, 1720, 1258, 820, 1744, 2416, 1740, 1122, 1233, 380, 1963, 586, 1354, 1218, 929, 1317, 775, 658, 1069, 1184, 807, 1173, 920, -320, 43, 508, -40, -735, 499, 658, -658, -500, 103, 457, -154, -1283, -951, -591, -591, -1600, -1436, -1174]
6035a174o70N35o2J223q81n31N51K54o19j55p3R7M7j83j023J626o42Q2m56N72
6055a482j22n24J091q44l90J332l81o71K23O13N23p18M55l91k10J147n91p30R75
6074f95r25Q23J236q62r13Q41o3Q02J23j36j3L73l44j59J127m50j040P62P86J080
6094B353k031M39n74O55o51J535k2m5O93j367J476j129k72k14K367k775J243P55
6112B436L6j107M99P10p92Q39q61%q0K48L58j121Q58K76j021j17J284r78o70J410
6132B207j406l47P86o75k43P50J82j171O73L44m39j709K267k50o50R18r07j090
6150g60K81J86M06n54N61p58j297K354j210o91N18L83j652N03L05K69L90J42p92
6169a416n01Q74j560J463r78J740j600P07j84o10J44P62j697R31J097k31n99l43
$$ y = [-1174, -1844, -1309, -1371, -148, -1029, -1560, -1009, -755, -1374, -1529, -1602, -1505, -1458, -1641, -2664, -1038, -1680, -1598, -2054, -1482, -1604, -2128, -1037, -1881, -2271, -939, -1320, -1991, -1768, -1155, -632, -1350, -895, -1286, -1496, -349, -940, -1670, -695, -1620, -797, 439, -423, -1336, -495, -558, 244, 367, 231, 218, 591, 247, 88, 1215, 765, -275, 487, 1273, 2353, 322, 761, 187, 842, 191, 1726, 1704, 1659, 2352, 985, 2461, 1332, 1060, 846, 3213, 438, 1681, 2436, 2472, 1365, 1864, 2574, 1782, 2621, 1760, 1760, 1680, 1928, 2286, 1165, 2023, 2299, 1278, 1161, 2445, 1467, 797, 2207, 801, 454, 1240, 565, 322, 1072, 1254, 83, 756, 1100, 661, -1048, 1219, 969, 319, 1237, 330, -760, -479, -293, 113, -441, 120, -638, -1935, 419, -791, -1482, -964, -581, -2233, -1730, -1425, -1156, -766, -624, -1416, -1917, -1043, -2603, -1140, -2118, -378, -1978, -1271, -1455, -2065, -1921, -1159, -2856, -1925, -828, -1059, -1658, -2001]
6187b001j68N78j64R72l77q01Q75r29P35Q52p92L47J282r73j220J117L90q55L51
6206g81O99N72o06L14l02J13J57J15N76l86n65N16K80K28l96O04o6l77j93J090
6226A592k17K88o48O11k45K98Q5p26J379j144J08l6K86n35l5J61J074j95n5r62
6246A084o7J365n97m15l8R80p34l59R60o83j178O11O11n44k67l86J068K21q51
6265G81m32L65J9o87J27Q2L62k49k73m70m97O47Q12n02N32q90j018O70M81r45
6285a085J006n76q10m3N24k07p08J160K15o44J6k81o71Q2pJ041j696P56O56j014
6305b286J25R9j361K453j231N27n19K20P71l35l31J329j051q2P59o72N81o86O96
6324i94j154M64O39n01J727n03o45R76p55K21J70k77p28Q55P00m93L27Q55n85
$$ y = [-2001, -2169, -1591, -1755, -783, -1160, -1961, -1086, -2015, -1280, -428, -1220, -873, 409, -564, -1784, -667, -277, -1132, -781, -82, 490, -116, 198, -104, 9, 166, 281, 857, 471, -94, 422, 702, 930, 534, 1138, 1072, 695, 502, 1592, 1375, 1663, 1015, 1626, 1381, 1679, 1764, 1038, 2417, 1273, 1381, 1345, 1631, 1096, 1061, 1222, 2296, 2101, 2046, 1084, 1017, 2382, 1785, 1370, 1332, 2312, 1578, 1219, 2179, 1496, 318, 929, 1540, 996, 729, 343, 1411, 1632, 781, 349, 714, 733, 46, 173, 255, 617, 368, 95, -375, -872, -225, 587, 85, 617, -273, -1291, -621, -140, -1085, -79, -655, -1465, -1508, -984, -1191, -1899, -739, -524, -1168, -1152, -1433, -2104, -2022, -2029, -988, -2684, -1928, -1272, -2286, -2161, -2062, -3423, -970, -2201, -1674, -2193, -1973, -1202, -1537, -1868, -539, -1590, -1672, -913, -1585, -1004, -1690, -994, -2148, -1684, -1045, -1546, 181, -322, -967, 9, -746, -525, -355, -632, -1360, -505, 195, -298, 29, 884, 299]
6343B99n54J612j37p71P33K63q77Pn3P60l69J085k85n9O10j708o92J759P62m57
6363A928j043M02n70P5R76n9P89J0p99p1n24M29O66k67M31M83j720n79J65J185
6383A907j32j738J595q61O29k49L2j85o78m1P30J66q03K60M12j88p98j65R4L30
6403C17l23m44p91J372r88o17N54L79J88j024M15J36J237j790l05L97l30j16o74
6422b407Q84j18n23j6O60L49k96j074O72J139j687J047O64j445r70K101r4J92
6440i22j88k23o18j89J795j427M48K54L95o17N08N29p54N19J5p97j06N38J247
6459D07o13N59j037J22O87N97j885J058O35j50ln2N94M34j470Q77N93j99P21j013
6479H62K82J44j237O99J244j017J190m77n07l75K73K04k26J581n60j280N00J554
$$ y = [299, -255, 1357, 1220, 449, 1182, 1445, 568, 575, 522, 1282, 913, 1998, 1713, 1654, 2264, 556, -136, 1623, 2385, 1928, 885, 1287, 717, 792, 1768, 1709, 2498, 2508, 1709, 1638, 1114, 1543, 2209, 1942, 2373, 2856, 1136, 557, 722, 1907, 1775, 37, 1632, 771, 1400, 1151, 1183, 998, 320, 279, 1009, 1175, 372, 632, 1044, 856, 58, -107, -13, 317, -6, -450, -1241, 131, -857, -1474, -920, -541, -353, -1377, -962, -826, 411, -1379, -1684, -1287, -1617, -1733, -2407, -1523, -1641, -2164, -2180, -1520, -1171, -1467, -2541, -1869, -730, -2417, -1370, -706, -2151, -3121, -1020, -1114, -922, -1110, -1333, -1951, -2140, -345, -1772, -1324, -1070, -675, -1292, -784, -255, -1009, -490, -475, -1272, -1378, -840, 407, -206, 353, -684, -562, 125, 722, -1163, -105, 530, 380, 377, 325, 919, 1353, -117, 760, 1353, 1154, 1875, 862, 1144, 1288, 51, 750, 1994, 977, 2167, 1690, 1183, 808, 1081, 1285, 1059, 2640, 2080, 800, 1300, 2854]
6497B854j513j026O80J503k00M6m51mn35p9K29K88l16m67J021p12J38o83j72P47
6517A348J03r74L28l08o33l6l05J97J139q86m92P31Mp58K95L76L68j131j33o47
6537a414M80j96J8j065J009Q50j012M8P80p67J20K95q85L31P92n09o22j34l56
6556b237J195q98J89k30n19J524l66p64L01J920q46n64j23m10K65J581m08j417
6574a807J413j109J261p92K66j258J281K69K90n13k64q4Q13p20L69Q42m87K40
6592A0L45l59J99j24K49J05l37J038o48J15J059j173L20O80j33j553J033J253
6610B079j8q53N48r2J91Q35j216J101q18k97N61o89KJ130m41q30J340j543K66
6629A256N54k98M25o43R00kn20p82o55J304j405N23n46J339o05r31j28J330q71
$$ y = [2854, 1341, 315, 995, 2498, 2298, 2344, 1893, 1889, 1354, 1275, 1504, 1792, 1476, 1009, 2030, 1318, 1456, 773, 601, 1348, 1451, 477, 805, 497, -136, -172, -477, -280, 859, -27, -519, 212, 216, -542, -247, 129, 497, -634, -767, -1414, -934, -1130, -1112, -2177, -1168, -318, -1330, -1282, -502, -1269, -1149, -854, -1739, -1408, -616, -1125, -1747, -1881, -2237, -1042, -1940, -1751, -1981, -2500, -976, -1342, -2106, -1805, 115, -731, -1295, -1418, -1828, -1563, 18, -390, -1807, -394, -1503, -242, -1034, -768, -2026, -745, -476, -186, -699, -963, -1047, -234, -954, -585, 257, -230, 10, 355, -4, 195, 71, 320, 425, 88, 1126, 478, 593, 1652, 479, 799, 1479, 1346, -207, 826, 2079, 2061, 1208, 1756, 1664, 1855, 2690, 1474, 2575, 1757, 1460, 2021, 1332, 1334, 2464, 2023, 1193, 2533, 990, 1256, 1810, 1512, 1937, 1294, 2194, 2192, 1672, 890, 235, 1539, 134, 657, 111, 1450, 845, -86, -214, 1116, 245]
6648B45N58j085p3J016j244N97l82M38j85K59l79M85j619J66M3N83K3j24j148
6667a826j86P10L45P03J45p58J65J34j120J388j350q8M80L18Q0L78j391m01Q2
6686b192J627o17O7j338Q40p71q9P60K0l06N37j53o00J399J28L44r53L02M46P5
6706d74o10J62q82J338j3lL72P22j381K69Q55L14j062Q93q59J758j147N80K93
6725A125m40l07M64L20N44r78k41J124l45L3K27K9l93k0O98r72K14K39o96J316
6745A941r99n94k56K052q22k30O16K35j95N42o34r06J479j291P09n96O68j70j324
6764B25J424p90j115P45J20j64J9j33J09O61j319J223n79K60r27k67R22j043P76
6783A47k47L22o61J93r39J162q94J361j403j015J303n24o7k44J674k129J149l12
$$ y = [245, 803, -282, -355, 661, -583, 14, -368, 70, -115, 144, -235, 250, -1369, -1203, -1160, -577, -554, -678, -1826, -2012, -1302, -957, -254, -109, -867, -702, -568, -1688, -300, -1650, -1738, -1258, -940, -860, -482, -1873, -2274, -2192, -565, -1182, -1115, -2453, -1613, -2384, -2473, -1713, -1693, -1999, -1462, -1615, -2215, -816, -688, -344, -1297, -995, -549, -474, -1084, -922, -1804, -466, -479, -482, -110, 612, -769, -500, 355, 669, -393, 500, -359, 1399, 252, 832, 1125, 685, 378, 842, 1162, 1706, 728, 487, 1611, 1266, 1299, 1526, 1555, 1162, 1142, 1840, 868, 1082, 1321, 625, 1941, 942, 348, 92, 2144, 1322, 1092, 1708, 1943, 1748, 2290, 1656, 750, 2229, 938, 1647, 1051, 1719, 1549, 225, 1649, 859, -256, 489, 609, 445, 464, 331, 440, 1101, -218, 1005, 426, 686, -241, -508, 414, -629, 147, -100, 222, -439, -246, -1185, -23, -917, 444, -959, -1974, -671, -1195, -1262, -1506, 168, -1961, -812, -1124]
6801a124l80q1n41P97l34J027n49j519J143M11l85P22l69K30o07l20r4J11L72
6820a490k28k2R74ol42k72K51p0K26o97N13M35L64J20o12n6o71J201K75N75j064
6841e96P37l3p61N16n43J694O9p14M31o05J260j666J66R76J389k206P93J267j160
6860A014N96j163O78L43M1m82O84l58o95p24J364Q99j295j158K317j099r72Q28
6878H18L51P20o29j013J222Q60m22j080n72Q23J47p58P30o32O41m06n11K62J91
6897G42p91J080o74n58O06K70l79Q23j436oN99j120K02J100n84l10Q80k009P66
6916g99P82l00o48m83L58N02m12J05q79P72L63p33O72L24j888k08J115l37R3k10
6936a811R72K08p76N39l82K78k42m41Q02M58j701Q93J061j373m86R61J425k007
$$ y = [-1124, -1504, -1585, -2126, -1329, -1663, -636, -1185, -2704, -1561, -1150, -1535, -813, -1182, -952, -1559, -1879, -1973, -1862, -1490, -1718, -1740, -766, -772, -1114, -1386, -1135, -1205, -979, -1676, -1163, -728, -364, -244, -856, -912, -1583, -382, -107, 468, -596, 141, 108, -653, -137, -680, 1014, 1083, 369, 800, 195, 1455, -211, -45, 931, 2320, 114, 907, 2174, 1014, 1610, 447, 1125, 1468, 1509, 1027, 1711, 1353, 658, -66, 1298, 2197, 902, -256, 2061, 962, -10, 818, 1169, 1889, 1260, 247, 1469, 2329, 1907, 827, 255, 1078, 1225, 467, 1197, 565, 1206, 800, 289, 551, 742, -49, 1031, 357, -201, 405, 675, 296, 1119, -317, -323, 276, -844, -642, 458, -126, -436, 444, -1565, -799, -17, -317, -965, -1448, -1090, -588, -1000, -895, -1774, -1002, -639, -1372, -700, -376, -2264, -2472, -1357, -1694, -1601, -1811, -839, -631, -1407, -868, -1250, -972, -1214, -1655, -853, -395, -2096, -1203, -142, -1515, -2001, -1040, 385, -1622]
6954a622J029K11j57L13k26r02O55m0J105j357L31M06M59p04k84P42J65Q2J25
6973C31N04j38j090m1J017o47L90L47Q38O1n48K55l21j21Q59j66N23o65M47j754
6993H1J668J16o01m91J061j56M33j56n43N2J12k84J43L7K10o86L66J156n58o75
7013A285J1K43r99Q10o9r52K373o82j798Q66J21m01m15P25o75R09q88P1l92L55
7033D98M87j472J153r92j89P50m92q02L61K1k80M90M22j106J33j37J070j388J863
7052C90k288L01J64R12j672J32J596l95n08p47O12q87P51M67j410R85K89m2n46
7071a896L81P99n38P85o06J179j316K98p0M21O76j038K50L97R86j077K38oj320
7090a457J814k25n21j41j05p9j66K133k069N93K004q35n34P39j359R30j60k73
$$ y = [-1622, -593, -382, -539, -226, -452, -1354, -699, -739, 366, -991, -660, -254, 205, -499, -783, -41, 124, 206, 331, 835, 697, -393, -434, 583, -64, 326, 673, 1511, 1572, 1024, 1279, 958, 837, 1696, 1530, 2053, 1388, 1835, 81, 1749, 1865, 1264, 773, 1834, 1678, 2111, 1955, 1412, 1464, 1576, 1292, 1435, 1472, 1682, 996, 1362, 2518, 1960, 1285, 1296, 1539, 540, 1350, 1281, 329, 2702, 2020, 222, 1088, 1209, 808, 393, 1118, 443, 1352, 464, 535, 143, 498, 985, -487, 666, -326, -515, 235, -257, -1059, -698, -677, -957, -467, -45, -1151, -1018, -1155, -85, -1473, 390, -1898, -1597, -1433, -521, -2193, -2061, -465, -860, -1368, -2115, -1503, -2390, -1639, -1172, -2582, -1597, -1308, -1350, -1896, -1515, -716, -1254, -469, -1075, 104, -1212, -914, -984, -563, 113, -925, -675, -278, 708, -369, -131, -137, -1457, 357, 132, -389, -530, -635, -714, -880, 1253, -816, -223, 1781, 946, 412, 1151, -208, 722, 562, 289]
7108B89k45J00J434n9j410Q51L21j56P73k20p1q05P67j301L71O71l64j09M74R2
7128A403M20k89j82l06M34K95q13J76k89j98Q1o35J083k61r5k29m39J097n99p11
7148e7J269j79j648J12P36j00O7p5k47J185j028l3l86Q80J46j486Q85j13j018
7167a090L12k52O69l49n52m43Q87l2k5k73O95N63j711P22O90q78o19K295j542
7186i33j001J048k96M19n31J92q6j315K237p12k39N75o15m91P80O69j79j201O8
7205a611R56j31j60o75N61J317p62Ro4L43M7R88j084K66K34N8J90k76m2r55R84
7226A93P40m30m26O93l89P96q71J032r13j12k51J9P54J189j329R5R10p51K1n13
7246D57P59L20j44k46l16J75M68k33k91j51O91l1q16L42n06J400j326R06J79q40
$$ y = [289, 44, 144, 1578, 1519, 109, 960, 1281, 1125, 1898, 1678, 1607, 802, 1569, 268, 639, 1310, 946, 837, 1311, 1403, 1823, 1534, 1352, 1046, 1480, 1775, 962, 1138, 849, 651, 732, 97, 1180, 919, 824, 595, 156, 1253, 654, -57, 1212, 1033, -615, -503, 233, 133, 200, 125, -122, 1063, 35, 2, -384, 496, 642, -844, 41, -72, -1090, -778, -1030, -361, -710, -1262, -1705, -818, -850, -875, -1148, -453, 110, -1601, -879, -189, -1067, -1686, 609, -933, -1934, -886, -1182, -763, -1294, -1102, -1188, -2503, -266, -978, -1217, -642, -1257, -1748, -968, -299, -478, -1679, -1611, -655, -786, -946, -1621, -1060, 257, -505, -496, -560, -217, -170, 818, -266, 0, 234, 292, 482, 206, 164, -791, 193, 933, 503, 77, 770, 381, 1177, 306, 1338, 425, 313, 62, 81, 835, 2024, 695, 790, 1700, 949, 970, 457, 1216, 1536, 1392, 1146, 830, 1005, 1473, 1240, 949, 798, 1489, 1458, 642, 984, 478, 1878, 552, 1458, 1637, 797]
7266G97k6R06j471J76N98j80J007j144K74K08j253N34k92k81n0P04q40N0j23R83
7286E77j087J706j371O54k29O06j370j27j77o86J228o91K62j087K410j734k4Q14
7304c26j246l01N62K80r9o7n95R5k92J604j045o65J39K361q54p44q7M4n3J47K53
7325h89J20j57p4n35N14l24J63P91j37L8j97J189k222J989j256K69L67j5O33n92
7345c25J297j844J012K38M98n92q31Q75L11k56N73P97o66m46k98n43J286j47o47
7364B92K37J97P93o17J012m91n21m98j7R91N28j578p0M51J238k022J782M48n51
7383A604m30P5k76L83n34P06q2q64L27j30Q52l47j69p13O84l86o71J239q14l62
7403I2k11N47O39J02j305l14m22J150rj265J321r45j30l16J167o03N8Q6m16j25
$$ y = [797, 771, 1677, 206, 382, 980, 800, 1807, 663, 937, 1145, -108, 426, 134, -147, -197, 507, -333, -283, -406, 577, -510, 1196, -175, 479, 250, 856, -514, -641, -818, -1504, -276, -967, -705, -1792, 618, -1116, -1140, -326, -1572, -1873, -1311, -1031, -1130, -1197, -1792, -1697, -1989, -385, -1430, -2095, -1956, 405, -449, -1193, -1280, -1236, -1289, -1142, -889, -769, -926, -1000, -1535, -1021, -1345, -1182, -391, -528, -490, -687, 502, -1720, 269, -987, -718, -351, -366, 267, -325, 972, -872, 140, 378, 876, 284, -547, 328, 639, 383, 956, 1753, 1087, 641, 343, -200, 1086, 939, 292, 529, 726, 1519, 902, 1914, 1423, 902, 404, 387, 1378, 1906, 328, 258, 709, 1947, -75, 1707, 2155, 1604, 1174, 1249, 973, 1356, 822, 1528, 1446, 582, 909, 779, 1631, 1284, 1115, 402, 1086, 700, 29, 1268, 454, 92, -119, 428, 1067, 1169, -136, -450, -872, 278, 269, -996, 325, -620, -750, -1066, 101, -502, -444, -358, -774, -899]
7423h99J097j465M41Q56j184J540j321r20J201o09P35r51Q9K86Q4m15L31K93l08
7442a119J73q49P45l47q5n45J174o65j78L46M16j32J26P60j167J4l38N76K76L45
7462d74j7M2J48pj33j016J583J90q44j49J098j029M48j83j32Q06K19p01J158L59
7482A366j322K19P44l89L92j114N9L11N81m10N37r28P11J845j268r69O41n91J359
7501A774l29J03n98O91k22J42j27k87j207J191l0p52J358m68O48m74K34r79R82
7520A650n57k89n66J31L48j012J487n71K71M34j546M84K82m29o78O59N89r24p36
7539i73R78M08r06K37n08R82n52mO22j475N49l61k20R05j332N90K97K50m86l62
7559a361J034j128J053q58J15j19K34q08j79K679k029j48O98l53l34M85r1k85
$$ y = [-899, 198, -1267, -826, 30, -1154, 386, -935, -1855, -654, -1263, -528, -1479, -1390, -1104, -1020, -1435, -1104, -811, -1119, -946, -1795, -1050, -1397, -1482, -2027, -853, -1518, -1696, -1350, -934, -1066, -940, -180, -1347, -1333, -1671, -1095, -819, -474, -491, -449, -301, -308, -441, -1457, 126, 316, -528, -677, 421, -608, -160, -343, -475, 331, 550, -151, 1007, 1366, 44, 263, 1007, 618, 1010, -104, -45, 266, 847, 437, 974, 46, 757, 2602, 1334, 365, 1006, 415, 1774, 1445, 1548, 950, 1641, 1419, 1561, 1434, 1147, -60, 1131, 1101, 349, 1707, 1239, 1887, 1413, 1647, 668, 1650, 1093, 804, 238, 369, 717, -295, 1192, 621, 892, 1326, -220, 264, 546, 117, -561, 98, 687, -237, -973, 5, 413, -493, -256, -764, 218, -334, -338, 284, -1191, -642, -1003, -1223, -318, -1650, -1060, -763, -513, -999, -1361, -327, -1455, -402, -1260, -1145, -1264, -1030, -1838, -2017, 662, -1367, -1515, -817, -1170, -1504, -1019, -1110, -1395]
7577a395j3L81Q83K83m31j259J136j83o90P15p86K42M17K54p9o53J13R66n50q2
7597g31R31k11M00l20P74j618P39M41m25q81J715k29n13Q23j169J213L7p7op82
7617A11Q29j00q87P90n34Q16r58O58Q9J209j122n05K206j509L8Q37j147P13J77
7636A711m96N22m89l72L28q73O86P8r57P76O37j044j79P35j035O87j14o73P57
7655F85j33r5K3p36Q72k23r19J028n22K35j79M97J39l40j265J27l75J838r85r39
7675a267L23Q7p79J032n34k18Q95q35Q98o86j081J090K12N34j164k82N15N49j080
7694a791N87M49o08Q12r94M06Q50p89L45L98j417N80k18J432q71k42j45J097l36
7713d55p84l37Q61k5m3m59M70j6O27n88p54J734m00p69P38N40j060J303o9M14
$$ y = [-1395, -1408, -1027, -144, 139, -292, -1551, -415, -598, -1288, -573, -1359, -1117, -700, -446, -525, -1178, -1065, -99, -649, -731, 200, -11, 389, 69, 843, -775, -36, 405, -20, -901, 814, 585, 72, 895, -274, 939, 976, 899, 893, 111, 940, 840, -47, 743, 209, 1025, 67, 725, 814, 2023, 901, 396, 2602, 1093, 1131, 1968, 821, 1534, 1711, 1215, 1737, 1248, 876, 1204, 331, 1017, 1095, 138, 914, 1551, 507, 328, 1063, 28, 715, 601, -72, 685, 552, 457, 480, -256, 616, 393, -526, 502, -20, 215, 36, 533, 672, 332, -933, -806, -1181, 657, -328, -1267, -944, -857, -1636, -604, -1138, -1356, -461, -1296, -398, -1084, -2165, -1075, -863, -329, -1493, -1775, -1260, -711, -1791, -1204, -755, -1363, -551, -1545, -1139, -289, -1078, -733, -335, -1752, -1172, -1390, 42, -829, -1071, -1216, -119, -455, -1239, -1576, -715, -740, -783, -1242, -772, -788, -161, -749, -1503, 231, -169, -938, -200, 340, -720, 583, 514, 928]
7733I28r22O86J18l68n65l2M79L21m6J36n47n39J583p64J122mql94n93J153j209
7754E35K29l37J304j307M6L48K83r6Q0j40L91Q7n42K98l86O25j412P60m78J94
7774D82P72o00q38J884j164L81k82r33Q73k42l47Q5k50k85J464j385N3J300j242
7793b74J1o1K48j050P52J87J13n3J14m11l47K8q2L18p52J954j496J70r6m81P63
7814d45r68l09R07M86L44j498J47K22k70k81N39j327K211j253m64J271n93J2M40
7833h29Q49j429M93m81J629j91l49J051k121N6O93Q2q47J452o78J653p64j246
7851i77K99N35M34P71m28N62r19L70l93o16j0O42N93p52O14j40o4Q00j128R4O96
7872I83p94J56P02K49q88P53q61Q95J12j6o96Q36n9O3M8l53K83l8J59p46j89o53
$$ y = [928, 6, 692, 810, 442, -123, -155, 324, 645, 599, 735, 188, -351, 1232, 468, 1590, 1586, 1578, 1184, 591, 1744, 535, 764, 427, 1731, 424, 470, 818, 1101, 1005, 1085, 945, 1336, 1423, 881, 1179, 793, 1418, 6, 766, 288, 482, 1254, 654, -184, 1700, 536, 917, 635, -298, 575, 333, -14, 71, -179, -464, 1000, -385, -332, 968, -274, -263, -324, -76, -1126, -374, -187, -74, -127, -13, -424, -771, -743, -825, -507, -1259, 695, -801, -631, -727, -1208, -445, -1413, -1722, -815, -329, 15, -1483, -1336, -1114, -1384, -1665, -1126, -2453, -242, -1495, -1959, -688, -1281, -1269, -829, 20, -1409, -916, -1397, 232, 41, -308, 743, -1378, -1322, -629, -547, -1394, 58, -620, 1033, 269, -977, -678, -143, 291, 1062, 634, 1196, 277, 647, 254, -362, -372, 270, 863, 111, 725, 585, 521, 1321, 193, 287, 983, 189, 345, 1047, 1296, 408, 1161, 300, 1195, 1307, 1291, 595, 1431, 1372, 1435, 1483, 1130, 1413, 1375, 1534, 788, 599, -54]
7894e4kQ26q17O75L2j05M92k72j256J722j213J132n61m26r24L31Q33o27J111m47
7914D50k01k71K5J41L08p96L0n37N7J312m91m16l46J752k303n3J503p14j10K22
7934d38j098N01k16P47k85r7j36k70m58M76N56k85j84j061K280j147o00P26N80
7953d09M97j612R24N99q3j269J383r48J29O18q44L34Ql71O44J24K18J80j15k96
7973b89q28O66Q35j417J155j000O13Q63K82j545R05n19M11q15Q11M83n07M78j96
7992C86O30o45J180q26O4J88m75j15M77n5j31j4j25K5J046l67j20l89J23L3K60
8013A150J77k38o37n55J868o11m46J99l80L61m58K34o60J057N4k81n32K11Jk38
8033B76K02N96o75p94J88L54n52M02K85m60Q63q47m60J250j558L27Q45J17o23
$$ y = [-54, -56, 770, -47, 628, 660, 555, 1047, 775, -481, 1241, 28, 1160, 599, 173, -751, -420, 413, -214, 897, 450, 249, -22, 3, 144, 452, -344, -314, -851, -794, 518, 27, -389, -735, 1017, -1286, -1339, 164, -550, -660, -438, -1536, -1035, -1251, -504, -789, -886, -1022, -1292, -1750, -1274, -718, -1003, -1187, -2248, 32, -1115, -1715, -989, -409, 88, -1524, -600, -1, -84, -1353, 30, -918, -789, -171, -1015, -681, -673, -1044, -400, -276, -58, 122, 7, -289, -1117, -451, 384, -1033, 122, -878, -265, 598, 880, -665, 240, -279, 132, -683, 128, 611, 104, 582, 386, 1016, 371, 1551, 725, 789, 977, 502, 387, 864, 809, 678, 664, 539, 564, 1610, 1243, 1123, 734, 857, 890, 1150, 1327, 1089, 452, -103, 1765, 1154, 708, 907, 527, 888, 430, 664, 4, 1061, 1115, 834, 302, 513, 514, 276, 478, 1074, 399, -395, -207, 147, -405, -3, 282, -178, 685, -162, -622, 628, -930, -603, 242, 359, -264]
8052b64r77J358k45j146O0L29k01J265j427J786j147l40j51o5L71o74k78N98k07
8071a355N96L13l13o07J017p89K12l51J026l81q30J161j76j74o42P92j06N67r08
8090i48j347K013J96o05M63j325K68M59O0P06n06P53q86J546m32O6k68N59q83
8109a11K48P01p12m44P39o57K21k10N99J93m57J93L3l82O61R37m04p25K71m38
8129B56J67K4k7q27J193M58L7m92J35M72j60o97J107k255J484J46n08O08M18j42
8149A397o74m17N29N06k42l54L86j8o83p82J327j415J95l02R20k21N2n22p76J122
8169B8n89K42M35m78K8N78l64K99r69J44N03k21o02M93p88J080m13O36q0m09n56
8190a003Q03
$$ y = [-264, -1241, 117, -128, -1274, -1214, -885, -1086, 179, -1248, 538, -609, -949, -1100, -1165, -794, -1468, -1746, -1148, -1355, -759, -446, -759, -1366, -349, -1138, -926, -1277, -251, -632, -1462, -301, -477, -651, -1293, -501, -607, -40, -948, -2295, -282, -86, -691, -228, -1553, -1285, -826, -766, -60, -566, 187, -699, 847, 415, 481, 213, 772, -111, 137, 838, 126, -318, 421, -236, -15, -225, 374, 567, 110, 303, 336, -46, 615, 1552, 1148, 423, 694, 256, 423, 447, 420, -407, 786, 1244, 1281, 789, 924, 1396, 1236, 539, 1646, -609, 875, 1021, 513, 1121, 1539, 1397, 723, 306, 835, 1341, 1099, 745, 1131, 1113, 430, -352, 975, -440, -245, -547, 373, 152, 204, -318, -1094, 28, -561, -319, 116, -362, -334, 244, -120, 179, -790, -646, -143, -364, -966, -473, -1261, -181, -594, 42, -38, -447, -1003, -200]
8191b00
$$ Imaginary data points
##PAGE= N=2
##DATA TABLE= (X++(I..I)), XYDATA
0@%%%%%%%%%%%%%%%%%%%%%Nk1M9p9J02j17J24j32J44j63J87k17K49k76L06l46
37a85L86m26M81n32N80o45P11p85Q74r67J076j209J353j517J723j971K283k687
55a457L223l994N193p335J2236r565j06426Q9990L3664l7964k9944K7946J3058
68a1375k0866k4304J8154L2272j8352m7481J8539M3709k0442m0406K5752K6222
80a8578k5754k3343K1682J9330p051k7223k92L3608M587l9491Q2M2159o430m0280
94f6994J4240L7480j1500k6998O121K4462P755k0600j3162L0374J9099l4300j5655
107d9678M4722J4787l9817o097L7372Q278k2445q712J9728K0431j2578k4738J9323
120E76L5497k0271l3249K9125L0105k5958j9590K5801J8334j3607j5890Q143K5063
$$ y = [0, 0, 0, 0, 0, 0, 0, 0, 0, 0, 0, 0, 0, 0, 0, 0, 0, 0, 0, 0, 0, 0, 5, -16, 33, -46, 56, -61, 63, -69, 75, -88, 99, -118, 131, -145, 161, -185, 201, -225, 256, -276, 304, -341, 370, -415, 459, -508, 568, -641, 712, -805, 918, -1053, 1230, -1457, 1766, -2228, 2965, -4370, 7866, -1699, -108125, -18135, 15529, -22435, -52379, -24433, -11375, -32241, -56545, -38391, -6119, -24471, -71952, -53413, -9704, -30146, -70552, -44800, -18578, -44332, -67675, -45993, -26663, -33714, -60937, -61229, -27621, -23034, -62525, -62443, -20284, -26714, -66994, -52754, -15274, -26774, -53772, -47651, -23189, -15434, -36034, -49196, -18822, 277, -34023, -49678, -4956, 9831, -29986, -36083, 1289, 9567, -12878, -21590, -1862, 18569, 5991, -18747, 576, 36073, 15802, -17447, 11678, 41783, 15825, -3765, 22036, 40370, 26763, 10873, 19016, 44079]
133D4079p00l0482M393L8985p267l8303J4370L5774j6411k6447J4130K4552p232
146D9441k0617l808K5779R384l2606j0838L7429P615m0036n223L6416o82l1441
159B0813k380K2305O165j9651j7922J6917K1959k3825k8430K6350K3357l3173
171A2485k0545K7124J2129k5167j3380J3125J2047r772k2613M365K6148r297l5024
184b8375J0727L1030j9630k9866J7293J9621j4451j9367M130J6511J789k5327
196c5915p352K8647N480l6520m366L5935k226l4418L770K6414l389j8021o833
209d8794J7382J2988j8866j8868K4390K1939l1016j5382L0620J2895k5954q259
221d6925K0065J0570j2790j2577J1016K1176p757k5989J4515L0564j6549k5872
$$ y = [44079, 43379, 12897, 17290, 56275, 49008, 10705, 25075, 60849, 44438, 17991, 32121, 56673, 49441, 28824, 25016, 50795, 60179, 27573, 16735, 54164, 61779, 21743, 16520, 52936, 52254, 20813, 18433, 40738, 46903, 27252, 9330, 26247, 48206, 24381, -4049, 22301, 45658, 12485, -8060, 19064, 31193, 6026, -7354, 5771, 17818, 8046, -14567, -10202, 15946, 6649, -28375, -17648, 13382, -6248, -36114, -18821, 800, -13651, -33018, -28888, -12377, -10588, -35915, -43267, -14620, -9140, -45660, -50026, -14091, -16317, -50735, -46965, -20551, -23940, -41961, -48794, -31412, -18424, -37290, -56158, -31768, -9829, -40845, -56227, -25607, -12712, -38666, -46925, -26860, -16290, -29080, -41657, -30641, -9465, -17222, -43211, -28696, 1868, -14681, -40553]
233d0553K3261K1484j6873j4172J3923J7721n789j5477J623K4928M086k8197J812
246a2223L4629k086l0371R708K7318m794k0182M011J9671M621j5506j0687K2536
259B6645J5664k5135j2752L0187J2581k9877m555K5680M230j7106o517J3433J2962
272D5440j1934j8078J2499K3887j7533k4203K1198K1340k3278j6167J7468J1591
284D2230j2635j3025M222J6461j192k4807o00K7656n225l2691P515K6150j1929
297B2130k4646Q583J6714o133j6228m744J5254P691k2848j2745K6272O594l1154
310a5260n815K5868j494k2689j776J5067L738j3819j2531J0495J6424j7055k1584
323d0431K0430J6606k4309j5460K1882J0018j8893q839J1485J1191q214j6100
$$ y = [-40553, -17292, 4192, -12681, -26853, -12930, 4791, -998, -16475, -14852, 10076, 14162, -14035, -12223, 22406, 20320, -10051, -343, 26975, 22181, 1999, 6010, 25681, 30302, 14796, 4109, 26645, 42309, 17174, 4422, 34609, 47190, 17313, 12758, 38438, 42668, 25562, 19045, 32478, 45440, 33506, 15428, 27927, 51814, 34281, 10078, 31276, 52616, 29338, 13171, 30639, 42230, 29595, 16570, 20792, 37253, 36061, 11254, 10654, 38310, 33085, 394, 7909, 34059, 22130, -2516, 6067, 22781, 16648, 420, -4324, 10930, 18621, -4227, -16972, 9300, 15894, -15260, -21075, 4793, 3299, -19390, -21166, -6099, -2361, -16180, -28711, -18216, -1792, -18847, -40431, -20001, -3395, -27704, -43164, -21282, -11264, -30157, -38996, -27511, -16320, -24534, -40634]
335d0634L524K2346n793k5858J0302K5437j2937k1517J2751J7982r797j2697N038
348c1853J4508K028j5882m206K2859O614k5772q42K7735m99k3326M828K1056l63
362c115j3425j070J2472J1900j2350j3826K0368J6109k1504j1351K5174J1079
374B0461k0690n126J8917O387r197r502R645J7290o614j8853J0323K4420j3537
387B3924k0069J6115J8010j3987j2522J1698J0488l576j2981K99J7405K618k3010
400A4412j07K6028l076k5084O284J9777o416j5482K432J1269J793j2977p889J3468
414B4432J1130k0886j1539K2111O083k3597m748J9161J423j7426n114J0084Q281
427A9395j0416j6593R865J7095j4888k0875J5433J5639j8465j5128J4899Q285
$$ y = [-40634, -37110, -14764, -20557, -46415, -36113, -10676, -23613, -45130, -32379, -14397, -24194, -36891, -31853, -17345, -15317, -31199, -35405, -12546, -5932, -31704, -32546, -4811, -5310, -28636, -23808, -2752, -3115, -16540, -17610, -5138, 6762, -5588, -19414, 954, 17063, -4441, -15792, 9382, 20461, -229, -5355, 13562, 19949, 10752, 1250, 10895, 28185, 21571, 2718, 13041, 37461, 23924, 3855, 19970, 37980, 23993, 11471, 23169, 33657, 30081, 17100, 17399, 34804, 37422, 14412, 14305, 40333, 37257, 12173, 18457, 38234, 31818, 16336, 18768, 30037, 31830, 18853, 10964, 24432, 35562, 14676, 3137, 25248, 31331, 7734, 2986, 22147, 23570, 6144, 1030, 11114, 19395, 8979, -7614, 2251, 19346, 4458, -16417, -984, 14655, -3810, -18938, -4039, 4246]
439D246j1678j0146K290J2385k294j8685L53K0945n508k3083O569J9425r717j8136
453c3034P619J2617l899j0505l542J2619N499j7913q039K1878N603k3564k915
466c7576K2838M50j7920K41J4092L287j0758p130J0071J3841j1687j4851J7753
479a7349J5439j8510j0734J9131R086j2670n834J0149R381l887j1659M668J8046
492E257m270j7311Q639K0920r804j6684J4368J2800n698j0069N551J1220O94j0835
506D778k623J8227M741j9242j249K2577j141j8368L650J5441j479r380l069J2001
520B4864O723j0678j0380J4770J2608j8765r302J9284O888j7439m750J3295M364
533C1482j0272o736M583J0900n980j6066O305J8271j2382j7902J2690J2300j1908
$$ y = [4246, -7432, -17578, -15288, -2903, -5197, -23882, -23529, -2584, -8092, -31175, -24606, -5181, -14898, -33034, -25415, -12798, -16697, -27202, -30744, -18125, -12626, -30539, -38578, -16700, -11097, -34661, -37576, -14738, -14288, -32208, -31967, -17875, -14588, -25346, -32476, -22405, -8564, -20251, -35102, -17349, -1910, -20420, -31154, -12023, -2937, -15607, -21441, -11292, -1911, -5798, -17457, -12789, 5257, 987, -16324, -7685, 13235, 3431, -13253, 1115, 13915, 8217, -1852, 3699, 14919, 15613, 4778, 2155, 20382, 25123, 5881, 4632, 27209, 26068, 7700, 11350, 26791, 25312, 15932, 12863, 24864, 31587, 20909, 10529, 25299, 37907, 19142, 9840, 29124, 36012, 18573, 13823, 27118, 31482, 21210, 14474, 19057, 29957, 23977, 7911, 14216, 32487, 20105, 2203, 14893, 27193, 15285]
546A5285j1632P692Q479n334j1340j615J4153m82j9753o54J9966m715k0687M515
560f122J5541o034j5374K436Q963J167j2096o570J1246P134j7476p024J6832M974
574b403j9195l629J4348J811j2808l434Q455N669q104j1194P671J3581r910j6050
588c5192J3755J4148j6092q713J2369P722q729p862N231J0861k167j3445J376
601b6738J8429l037j7531O789J7779o868j3242P856J1141k688q570M46J1073N125
615c6j1231n288J6874O161j8125q17J9683K28j3595J911J3038J087o677n034R091
630G270J1406j0539j1309J5342J1860j4522q738J6181P651j1471n647Q921P928
643B4333l857j0072L529J5194m395j6218O562J6159p575j4903R274J1942q012
$$ y = [15285, 3653, 11345, 19824, 14490, 3150, 1535, 15688, 15206, -4547, -5201, 14765, 10050, -10637, -6122, 9419, 3385, -11989, -9553, -590, 577, -11519, -18089, -6843, 291, -17185, -24209, -7377, -2403, -21598, -25227, -10879, -9068, -21876, -25310, -16855, -11186, -19290, -30484, -22813, -9232, -19142, -35192, -21437, -7289, -23381, -32094, -19725, -12003, -20732, -28594, -23363, -12502, -14669, -28114, -26738, -8309, -11346, -28877, -22088, -4309, -11177, -24419, -16563, -5422, -8110, -16680, -16234, -5161, -36, -11267, -16555, 319, 6480, -11645, -12462, 7221, 7449, -6146, -4235, 8803, 9890, 3213, -1821, 7270, 18676, 8137, -3172, 12170, 24030, 9508, 770, 16951, 24602, 13131, 7484, 16405, 24333, 20476, 10404, 13933, 29127, 24732, 8514, 15076, 31235, 23660, 8757, 18031, 29973, 21961]
656B1961p529J466Q489J278j1529l684J3235K853j5731k417J7709l286j6104L229
670I940J1364l284r917k056O287M423r286r269J0560Q806j6596q261J4977L953
684A1641j4619m048J0972J749p988q892M747R997o508j4496N070J3883r715j4176
698b2383J0137J0404j1501q526N668P834m062r913L35J0346K219j5673o63J6283
712i495k545j5733M628J3771n713j0915K195J0109P19q940l614J0470O621j3435
726b1877n558J6856M590j6366j7J5020Q05j0303k532R273O522n554q219P695J2699
741C034p401j3488J2573J3018j2048p070J0803P521n052o803N087R186j91j0604
755a435J088J5234j111j4408O262J4735o372r543O606Q322k834p237P52P925M214
$$ y = [21961, 14432, 15898, 24387, 25665, 14136, 10452, 23687, 26540, 10809, 8392, 26101, 22815, 6711, 9940, 21304, 18020, 8103, 6047, 12334, 16757, 7471, -1798, 8762, 17568, 972, -7289, 7688, 11641, -2978, -7026, 3946, 5695, -2293, -11185, -6438, 3559, -2949, -17445, -12375, 1508, -8207, -22383, -12246, -1842, -13343, -21869, -16201, -8367, -12429, -22342, -22007, -11661, -9442, -25115, -25778, -9495, -12040, -27773, -23145, -9374, -15087, -26002, -23807, -13698, -12979, -21919, -25533, -15063, -8442, -21877, -27435, -10579, -5989, -22355, -22372, -7352, -6547, -16850, -19382, -10109, -3587, -9141, -17360, -9665, 3034, -4367, -17855, -5282, 7736, -4312, -11382, -579, 6942, 1890, -4913, 174, 9360, 9169, -1435, -347, 14887, 13776, -632, 5630, 20365, 13993, 4450, 11056, 19378, 16544, 9307, 10059, 17984, 22198]
770B2198j0426m162J5141K686j5094L6J4484r99j2707J566R410J479p868l888
784A1856N848Q444q406j0891J0613R884j4237q272J2794N336j1516m738N073N520
798A7308m043r233J304J0902l237j4540L833J3576q326j2805Q963N846p517p473
812e442K954N709q18r565m021J2705l30j5632P31J4274l569j4674L371J0569l134
827f872r674n3N525L742q247p798R711P510j2961p249J4098M124j3009k864R983
842a4034J966o298m290M806P262l091j1065N129J3752q527j0911R259J0339p999
856a3702o134O607N979k859n743J703R050J907j1422K60J4789j526j2329M783
870h637J3249m079q733M323P963L97n827k621J0117N976j0844n283J4194N073
$$ y = [22198, 11772, 7610, 22751, 25437, 10343, 10379, 24863, 23864, 11157, 12723, 22133, 23612, 15744, 11856, 17704, 26148, 17742, 6851, 17464, 27348, 13111, 4839, 17633, 22969, 11453, 6715, 11788, 17308, 13265, 4032, 5336, 16238, 13001, -1539, 2294, 15870, 7544, -5261, 3702, 9548, 2031, -5442, -2488, 3221, 2403, -7162, -11183, 1522, 1192, -14440, -13709, 565, -3004, -17678, -14307, -3738, -6872, -16546, -16599, -11074, -7332, -15579, -23377, -13666, -6156, -19117, -26366, -12268, -8144, -21153, -24017, -14034, -12068, -18366, -22656, -17850, -10588, -13679, -24744, -19615, -5863, -14390, -25301, -16042, -5703, -13702, -19836, -13229, -7250, -10109, -15852, -14149, -5099, -3192, -14614, -14354, 435, -1091, -13420, -8637, 4612, 533, -8200, -3877, 4086, 4483, -1344, -3965, 6152, 12128, 1284, -3999, 10195, 15268]
884A5268j2864j625J2906K288q603r34O303N823m881p901O185J1387r080r177
898E095J0808Q484j0730m708Q073N306p069m721L997O620j960r065J323J1813
912B3266m502j1889M225J2027p728q487N063O463m056p534P22O929Q71r232m856
927A282J1305K230j4026j902J2687j555j2012l18P747p99n973m748M266P457q682
942c041r720R230Q213j2071o689R129N046j0060l436L843M597m337p243K418P620
957f501j818j2710O017J0569p381j1029O674Q206o158n990K596O596j347o576
971a8852j365R043K103j1594j298J4959k307j1064K429J0142j248o178k40O244
985i226L890n498o086R155P255j0460m574J2733M282r062k288Q997K632n457j917
$$ y = [15268, 2404, 779, 13685, 15973, 7370, 6436, 12739, 18562, 13681, 5780, 11965, 23352, 14272, 5095, 15903, 24387, 13657, 8949, 17022, 22328, 15259, 10538, 14535, 21155, 19195, 10130, 11453, 23266, 18764, 6875, 11100, 23127, 15399, 6912, 11975, 18438, 14382, 6848, 7570, 14499, 15370, 6138, 1282, 12587, 14817, 791, -1111, 11576, 10021, -1991, -2309, 5438, 4639, -1334, -6082, -1816, 5641, -3041, -12761, -3531, 4682, -7389, -14078, -4949, 97, -9963, -13399, -9556, -4959, -9296, -16539, -14121, -6501, -8319, -21029, -15012, -4443, -11824, -22853, -16179, -7973, -14131, -20121, -17525, -10929, -12276, -18852, -20217, -11174, -9071, -20665, -21963, -7004, -9311, -20375, -17946, -7804, -9052, -15230, -15470, -9226, -5336, -10834, -16920, -7765, -510, -10970, -15544, -2811, 1471, -7591, -9879, -882, 1750, -3707, -5624]
1000e624L362Q132l330q900P266J0524p626q380J0150Q892p721o068P372N041
1014A3090k814n368J679R009n60q964L69J2964j843j1116L402J0251k759p956
1028I384K801N579q2m835l348N971N576j0268l924J2092K067j2548r08J0492m94
1043A7555q511o82L772L223m668n908M362P907p219j0056P929O835j0696n211
1057a368P502L269o122n130L334L441j099r254K91R793l693j0462J542J1914p757
1072c799q987N371N637m177n834r53M911K694q017l178Q679L538j2834m68J0887
1087f530j805r288J809N103M90m515k627L694N683o581n039P636O984j0589n640
$$ y = [-5624, -2262, 5870, 2540, -6360, 906, 11430, 3804, -4576, 5574, 14466, 6745, 677, 8049, 13090, 10276, 4908, 6587, 15596, 15036, 6072, 6441, 19405, 17562, 6446, 9848, 20099, 17340, 9384, 12185, 17764, 17682, 12847, 9499, 15470, 21046, 10778, 6854, 18946, 21013, 8465, 7557, 18049, 17555, 9044, 8362, 12134, 15357, 10689, 4781, 9143, 17050, 9831, -225, 7704, 14539, 3843, -1368, 6134, 9403, 3281, -1849, 1485, 4926, 3827, -5427, -5136, 4657, 964, -9498, -7956, 3958, -3799, -12786, -7415, -1778, -5955, -11789, -12742, -7831, -5137, -13154, -16332, -7653, -4115, -16949, -17417, -6530, -8335, -17623, -15814, -10711, -10221, -14736, -17363, -13669, -7986, -14567, -19606, -11970, -4986, -15575, -21215]
$$ [...]
8191c00
##END NTUPLES=NMR FID
##END=
