##TITLE=1H_Pr CCl4
 200.13MHz,CCl4,
 8 sc
 
 29.7.2025
##JCAMPDX= 6.0         $$ Bruker NMR JCAMP-DX V2.0
##DATA TYPE= NMR FID
##DATA CLASS= NTUPLES
##ORIGIN= UXNMR, Bruker Analytische Messtechnik GmbH
##OWNER= pz
$$ XWIN-NMR		Version 3.5
$$ Tue Jul 29 13:58:43 2025 Russian Standard Time (UT+4h)  she@DPX200
##.OBSERVE FREQUENCY= 200.13
##.OBSERVE NUCLEUS= ^1H
##.DELAY= (6, 6)
##.ACQUISITION MODE= SIMULTANEOUS
##.ACQUISITION SCHEME= undefined
##.AVERAGES= 8
##.DIGITISER RES= 18
##SPECTROMETER/DATA SYSTEM= spect
##.PULSE SEQUENCE= zg30
##.SOLVENT NAME= CDCl3
##.SHIFT REFERENCE= (INTERNAL, CDCl3, 0, 14.3821)
##AUDIT TRAIL= $$ (NUMBER, WHEN, WHO, WHERE, WHAT)
$$ ##TITLE= Audit trail, XWIN-NMR		Version 3.5
$$ ##JCAMPDX= 5.01
$$ ##ORIGIN= Bruker BioSpin GmbH
$$ ##OWNER= she
$$ F:/spectra/data/she/nmr/H-C/1/audita.txt
$$ ##AUDIT TRAIL=  $$ (NUMBER, WHEN, WHO, WHERE, WHAT)
(   1,<2025-07-29 13:57:36.26 +0400>,<she>,<DPX200>,
      <created by zg, POWCHK disabled, PULCHK disabled
       configuration hash MD5:
       00 E9 B6 7A A2 85 ED C7 34 08 36 98 17 FE 4E 26
       data hash MD5: 16K
       D6 E6 86 E7 95 BC E0 66 F5 29 45 7D 01 C1 CA 07>)
$$ ##END=
$$ 
$$ hash MD5
$$ AF 04 4C 8B AB 30 EC 69 1A 6E 10 E3 AC 32 D9 54
##$RELAX= 
##$RELAX= 
##$RELAX= 
##$RELAX= 
##$RELAX= 
##$RELAX= 
$$ Bruker specific parameters
$$ --------------------------
##$DU= <F:/spectra>
##$EXPNO= 1
##$NAME= <H-C>
##$PROCNO= 1
##$TYPE= <nmr>
##$USER= <she>
##$AMP= (0..31)
100 100 100 100 100 100 100 100 100 100 100 100 100 100 100 100 100 100 
100 100 100 100 100 100 100 100 100 100 100 100 100 100 
##$AQSEQ= 0
##$AQ_mod= 1
##$AUNM= <au_zg>
##$AUTOPOS= <>
##$BF1= 200.13
##$BF2= 200.13
##$BF3= 200.13
##$BF4= 200.13
##$BF5= 200.13
##$BF6= 200.13
##$BF7= 200.13
##$BF8= 200.13
##$BYTORDA= 1
##$CFDGTYP= 0
##$CFRGTYP= 5
##$CHEMSTR= <none>
##$CNST= (0..31)
1 1 145 1 1 1 1 1 1 1 1 1 1 1 1 1 1 1 1 1 1 1 1 1 1 1 1 1 1 1 1 1 
##$CPDPRG= <>
##$CPDPRG1= <>
##$CPDPRG2= <>
##$CPDPRG3= <>
##$CPDPRG4= <mlev>
##$CPDPRG5= <mlev>
##$CPDPRG6= <mlev>
##$CPDPRG7= <mlev>
##$CPDPRG8= <mlev>
##$CPDPRGB= <>
##$CPDPRGT= <>
##$D= (0..31)
0 0.7 0 0 0 0 0 0 0 0 0 0.03 0 0 0 0 0 0 0 0 0 0 0 0 0 0 0 0 0 0 0 0 
##$DATE= 1753783055
##$DBL= (0..7)
120 120 120 120 120 120 120 120 
##$DBP= (0..7)
150 150 150 150 150 150 150 150 
##$DBP07= 0
##$DBPNAM0= <>
##$DBPNAM1= <>
##$DBPNAM2= <>
##$DBPNAM3= <>
##$DBPNAM4= <>
##$DBPNAM5= <>
##$DBPNAM6= <>
##$DBPNAM7= <>
##$DBPOAL= (0..7)
0.5 0.5 0.5 0.5 0.5 0.5 0.5 0.5 
##$DBPOFFS= (0..7)
0 0 0 0 0 0 0 0 
##$DE= 6
##$DECBNUC= <off>
##$DECIM= 32
##$DECNUC= <off>
##$DECSTAT= 4
##$DIGMOD= 1
##$DIGTYP= 9
##$DL= (0..7)
0 120 120 120 120 120 120 120 
##$DP= (0..7)
150 150 150 150 150 150 150 150 
##$DP07= 0
##$DPNAME0= <>
##$DPNAME1= <>
##$DPNAME2= <>
##$DPNAME3= <>
##$DPNAME4= <>
##$DPNAME5= <>
##$DPNAME6= <>
##$DPNAME7= <>
##$DPOAL= (0..7)
0.5 0.5 0.5 0.5 0.5 0.5 0.5 0.5 
##$DPOFFS= (0..7)
0 0 0 0 0 0 0 0 
##$DQDMODE= 0
##$DR= 18
##$DS= 0
##$DSLIST= <SSSSSSSSSSSSSSS>
##$DSPFIRM= 0
$$ [...]
##$SUBNAM0= <"">
##$SUBNAM1= <"">
##$SUBNAM2= <"">
##$SUBNAM3= <"">
##$SUBNAM4= <"">
##$SUBNAM5= <"">
##$SUBNAM6= <"">
##$SUBNAM7= <"">
##$SUBNAM8= <"">
##$SUBNAM9= <"">
##$SW= 18.0518501124558
##$SWIBOX= (0..15)
0 0 2 0 0 0 0 0 0 0 0 0 0 0 0 0 
##$SW_h= 3612.71676300578
##$TD= 16384
##$TD0= 1
##$TE= 0
##$TE2= 300
##$TE3= 300
##$TEG= 300
##$TL= (0..7)
0 120 120 120 120 120 120 120 
##$TP= (0..7)
150 150 150 150 150 150 150 150 
##$TP07= 0
##$TPNAME0= <>
##$TPNAME1= <>
##$TPNAME2= <>
##$TPNAME3= <>
##$TPNAME4= <>
##$TPNAME5= <>
##$TPNAME6= <>
##$TPNAME7= <>
##$TPOAL= (0..7)
0.5 0.5 0.5 0.5 0.5 0.5 0.5 0.5 
##$TPOFFS= (0..7)
0 0 0 0 0 0 0 0 
##$TUNHIN= 0
##$TUNHOUT= 0
##$TUNXOUT= 0
##$USERA1= <user>
##$USERA2= <user>
##$USERA3= <user>
##$USERA4= <user>
##$USERA5= <user>
##$V9= 5
##$VALIST= <valist>
##$VCLIST= <CCCCCCCCCCCCCCC>
##$VD= 0
##$VDLIST= <DDDDDDDDDDDDDDD>
##$VPLIST= <PPPPPPPPPPPPPPP>
##$VTLIST= <TTTTTTTTTTTTTTT>
##$WBST= 1024
##$WBSW= 4
##$XGAIN= (0..3)
0 0 0 0 
##$XL= 0
##$YL= 0
##$YMAX_a= 12569
##$YMIN_a= -13862
##$ZGOPTNS= <>
##$ZL1= 120
##$ZL2= 120
##$ZL3= 120
##$ZL4= 120
##$ABSF1= 10
##$ABSF2= 0
##$ABSG= 5
##$ABSL= 3
##$ALPHA= 0
##$AQORDER= 0
##$ASSFAC= 0
##$ASSFACI= 0
##$ASSFACX= 0
##$ASSWID= 0
##$AUNMP= <proc_1d>
##$AZFE= 0.1
##$AZFW= 0.1
##$BCFW= 1
##$BC_mod= 2
##$BYTORDP= 1
##$COROFFS= 0
##$CY= -3
##$DATMOD= 1
##$DC= 2
##$DFILT= <>
##$DTYPP= 0
##$F1P= 0
##$F2P= 0
##$FCOR= 0.5
##$FTSIZE= 0
##$FT_mod= 4
##$GAMMA= 1
##$GB= 0.15
##$INTBC= 1
##$INTSCL= 1
##$ISEN= 128
##$LB= 0.25
##$LEV0= 0
##$LPBIN= 0
##$MAXI= 10000
##$MC2= 0
##$MEAN= 0
##$ME_mod= 0
##$MI= 1.114404
##$NCOEF= 0
##$NC_proc= 0
##$NLEV= 6
##$NOISF1= 3.799351
##$NOISF2= 2.8
##$NSP= 1
##$NTH_PI= 0
##$NZP= 0
##$OFFSET= 14.38212
##$PC= 1
##$PHC0= -1199.288
##$PHC1= 13.79254
##$PH_mod= 1
##$PKNL= yes
##$PPARMOD= 0
##$PSCAL= 0
##$PSIGN= 0
##$REVERSE= no
##$SF= 200.129724274929
##$SI= 16384
##$SIGF1= 3
##$SIGF2= 2
##$SINO= 400
##$SIOLD= 16384
##$SREGLST= <1H.CDCl3>
##$SSB= 0
##$STSI= 0
##$STSR= 0
##$SW_p= 3205.1282051282
##$SYMM= 0
##$S_DEV= 0
##$TDeff= 0
##$TDoff= 0
##$TI= <>
##$TILT= no
##$TM1= 0
##$TM2= 0
##$TOPLEV= 0
##$USERP1= <user>
##$USERP2= <user>
##$USERP3= <user>
##$USERP4= <user>
##$USERP5= <user>
##$WDW= 1
##$XDIM= 8192
##$YMAX_p= 0
##$YMIN_p= 0
$$ End of Bruker specific parameters
$$ ---------------------------------
##NTUPLES= NMR FID
##VAR_NAME=  TIME,          FID/REAL,        FID/IMAG
##SYMBOL=    X,             R,               I
##VAR_TYPE=  INDEPENDENT,   DEPENDENT,       DEPENDENT
##VAR_FORM=  AFFN,          ASDF,            ASDF
##VAR_DIM=   8192,          8192,            8192
##UNITS=     SECONDS,       ARBITRARY UNITS, ARBITRARY UNITS
##FACTOR=    0.0002768,     1,               1
##FIRST=     0,             0,               0
##LAST=      2.2672688,     0,               0
##MIN=       0,             -13862,          0
##MAX=       2.2672688,     12569,           0
$$ Real data points
##PAGE= N=1
##DATA TABLE= (X++(R..R)), XYDATA
$$ plain form
0 0 0 0 0 0 0 0 0 0 0 0 0 0 0 0 0 0 0 0 0 0 0 0 0 0 0 0 0 0 0 0 0 0 0 0 1 -3 4 -5 5 -5 6 -6 6 -8 9 -10 10 -11 13 -13 15
51 15 -15 18 -20 23 -25 28 -31 34 -40 45 -51 59 -71 87 -111 154 -237 482 -3931 -10724 -12210 -7705 854
74 854 8938 11732 8319 284 -7795 -11550 -9499 -1826 6515 11609 10487 4053 -4497 -10365 -10810 -5600
90 -5600 2248 8927 10477 6636 -929 -7803 -10424 -7694 -677 6605 10522 8799 2883 -4784 -9456
105 -9456 -9170 -4123 2973 8270 9250 5340 -1460 -7696 -9620 -6537 -139 6455 9327 7588 1984 -4512
121 -4512 -8742 -8196 -3306 2974 7680 8354 4383 -1610 -6893 -8263 -5555 217 5748 8413 6651 1474
137 1474 -4122 -7568 -7043 -2909 2718 6652 7152 3776 -1591 -5920 -7106 -4743 142 4752 7286 5619
153 5619 1434 -3360 -6560 -6140 -2604 2194 5707 6167 3575 -1168 -5014 -6246 -4397 -129 4139 6237
$$ packed form
0@%%%%%%%%%%%%%%%%%%%%%%%%%%%%%%%%%%JmPrJ0j0J1j2J2j4J7j9K0k1K4k6K8
51A5l0L3l8M3m8N3n9O5p4Q5r6J10j30J58j98K65l91P19m413o793j486M505Q559
74H54Q084K794l413q035q079l755K051P673Q341N094j122o434q550n868m45N210
90e600P848O679J550l841p565o874k621K730P017P282L917j723n916p667m672
105i456K86N047P096N297R80l910o800o236j924L083O398O594K872j739n604o496
121d512m230N46M890O280M706O74l971n993n283j370K708N772N531K665j762n177
137A474n596l446N25M134N627L934N00l376n367m329j186K363M885M610K534j667
153E619m185m794l200M20L536M798L513M60k592m743l846j232J849M268M268K098
$$ plain form
169 6237 5213 1708 -2853 -5670 -5279 -2430 1579 4888 5462 3318 -660 -4244 -5617 -4168 -428 3296
185 3296 5471 4699 1557 -2174 -4876 -4712 -2559 1087 4139 5007 3201 -288 -3500 -5180 -3973 -950
201 -950 2484 4711 4290 1866 -1571 -4013 -4507 -2597 634 3749 4560 3128 260 -2824 -4577 -3793
217 -3793 -1209 1846 4143 4301 2180 -1154 -3614 -4195 -2510 363 3014 4157 3245 660 -2314 -4194
233 -4194 -3811 -1627 1522 3798 3981 2233 -744 -3320 -4093 -2762 -101 2759 4141 3262 879 -2037
249 -2037 -3923 -3852 -1627 1223 3561 3884 2569 -428 -3175 -4002 -3154 -458 2429 4032 3355 1167 -1802
266 -1802 -3684 -3664 -1886 947 3284 3654 2401 -222 -2548 -3798 -2973 -474 2017 3445 3317 1348
282 1348 -1393 -3254 -3514 -1930 604 2821 3645 2424 115 -2169 -3468 -2866 -617 1806 3383 3276
$$ packed form
169F237j024l505m561k817L91K849M009L309N74k144l978l584j373J449L740L724
185C296K175p72l142l731k702J64K153L646L052Q68j806l489l212j680J207L023
201i50L434K227m21k424l437k442m94J910L231L115Q11j432k868l084j753P84
217c793K584L055K297J58k121l334k460n81J685K873K651J143r12k585k974j880
233d194L83K184L149K276J83j748k977k576p73J331K661K860J382q79k383k916
249b037j886P1K225K850K338L23j315k997k747q27Q48K696K887J603o77k188k969
266a802j882K0J778K833K337L70j253k623k326j250Q25K499K491J428j28j969
282A348k741j861k60J584K534K217Q24j221k309k284j299O02K249K423J577j07
$$ plain form
298 3276 1271 -1264 -3032 -3308 -2040 322 2559 3365 2545 110 -2093 -3375 -2845 -685 1549 3039
314 3039 3206 1537 -879 -2849 -3315 -2096 207 2316 3008 2451 420 -1612 -3025 -2575 -1097 1155
330 1155 2947 2961 1663 -622 -2438 -2948 -2062 -105 1988 2903 2379 781 -1586 -2892 -2605 -1170 888
347 888 2575 2656 1681 -178 -2003 -2841 -2172 -289 1588 2705 2573 1087 -1026 -2563 -2790 -1431 480
364 480 2218 2896 2047 83 -1841 -2771 -2496 -585 1346 2694 2691 1281 -869 -2496 -2627 -1697 99 1925
382 1925 2761 2087 464 -1680 -2729 -2497 -846 1168 2528 2661 1337 -548 -2277 -2708 -1850 109 2003
399 2003 2865 2162 436 -1503 -2723 -2313 -1116 972 2368 2613 1406 -475 -2072 -2638 -1961 -145 1795
416 1795 2796 2392 615 -1255 -2856 -2519 -1328 1008 2220 2664 1600 -252 -2264 -2792 -2036 -253
$$ packed form
298C276k005k535j768k76J268K362K237Q06q20k435k203j282N30K160K234J490
314C039J67j669k416j970m66J219K303K109O92n57k031k032j413M50J478K252
330A155J792J4j298k285j816n10Q86J957K093R15n24j598k367j306K87J435K058
347H88J687Q1r75j859j825q38O69J883J877J117j32j486k113j537k27J359J911
364D80J738O78q49j964j924r30K75J911J931J348lj410k150j627j31R30J796J826
382A925Q36o74j623k144j049K32J651K014J360J33j324j885j729m31Q58J959J894
399B003Q62p03j726j939j220M10J197K088J396K45j207j881j597n66O77J816J940
416A795J001m04j777j870j601L37J191K336J212M44j064j852k012n28P56J783
$$ plain form
432 -253 1739 2680 2365 594 -1100 -2613 -2607 -1217 795 2413 2901 1744 -300 -2125 -2795 -1928 -282
449 -282 1690 2565 2362 839 -1125 -2386 -2594 -1269 587 2357 2740 1756 -161 -1969 -2664 -1946 -306
466 -306 1525 2558 2294 890 -1150 -2291 -2334 -1353 570 2404 2656 1622 -12 -1843 -2726 -2039 -353
483 -353 1393 2588 2189 807 -1071 -2422 -2380 -1379 579 2158 2497 1677 -329 -1725 -2435 -1828 -316
500 -316 1364 2377 1867 806 -892 -2181 -2230 -1085 496 2038 2337 1481 77 -1577 -2138 -1641 -407
517 -407 1152 2127 1881 885 -817 -1823 -2094 -1319 432 1620 1991 1277 -7 -1269 -2110 -1661 -447 972
535 972 1750 1944 760 -641 -1825 -1717 -1229 172 1669 2000 1420 67 -1127 -1761 -1536 -565 833 1680
553 1680 1634 965 -473 -1701 -1764 -1128 -20 1268 1847 1656 256 -1041 -1643 -1675 -570 457 1703 1622
$$ packed form
432b53J992R41l15j771j694j513OJ390K012J618M88j157k044j825o70Q67J646
449b82J972Q75k03j523j964j261k08J325J856J770L83r84j917j808o95P18J640
466c06J831J033k64j404k040j141m3R81J923J834K52j034j634j831q83O87J686
483c53J746J195l99j382j878j351M2J001J958J579L39q20k006j396p10O07J512
500c16J680J013n10j061j698j289m9J145J581J542K99q56j404j654n61M97J234
517d07J559R75k46r96j702j006k71P75J751J188L71p14j284j262q41M49J214J419
535I72P78J94j184j401j184J08M88J401J497L31n80j353j194o34K25R71J398Q47
553A680m6o69j438j228o3O36J108J288N79j91j400j297o02l2J105J027J246q1
$$ plain form
571 1622 897 -289 -1456 -1759 -1264 5 1081 1664 1492 418 -630 -1553 -1469 -753 366 1487 1673 1084
589 1084 60 -1153 -1564 -1324 -262 956 1540 1614 512 -465 -1351 -1529 -733 223 1419 1699 1199 -49
607 -49 -1186 -1680 -1357 -534 747 1641 1479 473 -639 -1344 -1517 -966 250 1387 1506 1324 344 -1130
625 -1130 -1557 -1465 -574 637 1554 1508 942 -278 -1340 -1644 -1088 212 1044 1781 1293 481 -915 -1525 -1607
644 -1607 -596 463 1474 1690 863 -345 -1102 -1555 -1126 -168 869 1647 1251 397 -714 -1453 -1527 -787
662 -787 461 1387 1509 920 -127 -1088 -1509 -1031 -133 921 1455 1221 368 -558 -1379 -1394 -736 548 1291
681 1291 1583 1030 -177 -1157 -1424 -1293 -222 671 1500 1218 480 -535 -1220 -1216 -634 365 1064 1461 1022 -52
701 -52 -944 -1313 -1150 -256 704 1176 1237 456 -592 -1248 -1382 -678 165 950 1430 987 105 -908 -1243 -1094
$$ packed form
571A622p25j186j167l03M95J269J076N83j72j074j048r23Q4P16J119J121J86n89
589A084j024j213m11K40J062J218N84P4j102r77q86j78P96R56J196K80n00j248
607d9j137m94L23Q23J281Q94j62j006j112p05j73N51J216J137J19j82r80j474
625a130m27R2Q91J211R17m6n66j220j062l04N56J300Q32P37m88q12j396o10q2
644a607J011J059J011K16q27j208p57m53M29R58J037P78l96q54j111p39p4P40
662g87J248R26J22n89j047r61m21M78Q98J054N34k34q53r26q21j5O58J284P43
681A291K92n53j207r80k67J31J071Q93Q29k82p38j015o85MN82R99O99L97m39j074
701e2q92l69J63Q94R60M72O1p81j048o56j34P04Q43P85M80m43q82j013l35J49
$$ plain form
721 -1094 -193 600 1269 1242 531 -314 -1392 -1367 -867 86 869 1388 1112 133 -698 -1271 -1220 -410 461 1243 1205
742 1205 709 -283 -1062 -1296 -1019 32 999 1327 1256 223 -817 -1205 -1126 -655 287 1135 1286 838 -291
761 -291 -1057 -1355 -698 -208 945 1355 1321 410 -600 -1322 -1342 -593 566 1153 1395 737 -117 -797 -1145 -984
781 -984 -105 895 1328 1272 428 -573 -1233 -1203 -472 453 1085 1236 852 -23 -930 -1287 -994 -119 738 1360
801 1360 1409 404 -550 -1153 -1325 -720 348 1210 1346 887 -88 -989 -1303 -918 -234 938 1358 1146 702
820 702 -507 -1127 -1161 -635 228 1105 1402 1029 188 -899 -1301 -1095 -300 598 1206 1161 316 -460 -1041 -1177
840 -1177 -693 153 908 1288 802 64 -852 -1108 -951 -407 541 1172 1023 382 -570 -1049 -1146 -462 100 939
860 939 1196 797 100 -797 -1197 -851 -254 532 1098 1042 541 -406 -1130 -1104 -795 276 962 1099 812 51 -690
$$ packed form
721a094R01P93O69k7p11q45j078K5N00R53P83N19k76r79q31n73N1Q10Q71P82l8
742A205m96r92p79k34K77J051R67L28p1j033j040l88P9M71R42Q48J51m48j129
761b91p66k98O57M90J153M10l4r11j010p22k0P49J159N87K42o58q54o80l48J61
781i84Q79J000M33n6q44j001o60L0P31R25O32J51l84q75r07l57K93Q75Q57O22
801A360M9j005r54o03j72O05J068Q62J36m59r75r01l14L85O84J172M20k12m44
820G02j209o20l4N26Q63Q77K97l73q41j087m02K06P95Q98O08m5q45p76n81j36
840a177M84Q46P55L80m86p38r16k56J57N44R48O31j49o41r52m79r7O84N62Q39
860I39K57l99o97q97m00L46N97P86N66n6n01r47p24K6L09J071O86J37k87p61p41
$$ plain form
881 -690 -1140 -933 -428 537 1244 944 377 -283 -961 -951 -651 57 768 1019 768 284 -554 -941 -886 -245 377
902 377 933 1042 532 -214 -991 -975 -549 -83 691 847 1010 329 -584 -972 -1095 -437 258 838 963 484 -71
923 -71 -786 -1063 -807 45 590 934 808 118 -541 -842 -915 -513 352 794 971 593 -153 -613 -928 -623 -32
944 -32 450 658 641 130 -350 -650 -915 -462 116 543 857 512 241 -570 -843 -633 -198 434 877 733 245
965 245 -67 -629 -931 -584 28 479 772 750 191 -392 -959 -814 -292 240 803 877 524 84 -653 -796 -569
986 -569 26 604 777 660 373 -637 -765 -641 -362 402 701 777 527 -98 -757 -824 -628 -187 462 997 777
1007 777 315 -403 -745 -755 -363 279 694 805 607 -69 -725 -925 -711 -63 491 1024 807 263 -197 -613
1027 -613 -1065 -545 110 626 904 610 116 -471 -841 -712 -271 318 893 897 468 -244 -724 -730 -512 65 698
$$ packed form
881f90m50K07N05R65P07l00n67o60o78J0L00P08P11K51k51m84q38l87N5O41O22
902C77N56J09n10p46p77J6M26M66P74J56J63o81r13l88j23O58O95N80J25m79n55
923g1p15k77K56Q52N45L44j26o90o59l01p3M02Q65M42J77l78p46m60l15L05N91
944c2M82K08j7n11m80l00k65M53N78M27L14l45k71q11k73K10M35O32M43j44m88
965B45l12n62l02L47O12M51K93k2n59n83n67J45N22N32N63P4l53m40p37j43K27
986e69N95N78J73j17k87j010j28J24K79P64K99P6k50o25o59o7J96M41O49N35k20
1007G77m62p18l42j0L92O42M15J11j98o76o56k00K14O48N54N33k17n44m60m16
1027f13m52N20O55N16K78k94m94n87l70J29M41N89N75Mm29p12m80oK18N77O33
$$ plain form
1048 698 913 534 211 -562 -963 -856 -192 476 692 804 370 -102 -628 -815 -692 47 626 823 726 214
1068 214 -446 -730 -790 -186 396 856 727 437 -305 -768 -919 -535 -81 421 708 800 201 -317 -604 -774 -308
1089 -308 255 732 833 437 -194 -642 -783 -592 -44 496 920 670 193 -445 -756 -810 -289 413 710 864
1109 864 573 97 -618 -891 -667 -39 405 896 734 347 -256 -769 -852 -428 249 491 949 523 -20 -637
1129 -637 -788 -653 -66 505 758 693 241 -365 -740 -773 -402 113 819 874 604 11 -597 -999 -616 -205 361
1150 361 775 776 248 -370 -644 -748 -276 82 544 988 654 97 -522 -951 -701 -218 368 929 736 375 -284
1171 -284 -647 -808 -537 -174 754 713 499 271 -543 -727 -636 -201 347 867 829 141 -296 -669 -770 -540 177
1192 177 439 703 674 121 -396 -798 -638 -408 406 654 775 281 -67 -709 -886 -345 34 452 632 663 85
$$ packed form
1048F98K15l79l23p73m01J07O64O68K16J12m34m72n26j87J23P39N79J97r7n12
1068B14o60k84o0O04N82M60j29k90p42m63j51L84M54N02K87R2n99n18k87j70M66
1089c08N63M77J01l96o31m48j41J91N48N40M24k50m77o38l11n4N21P02K97J54
1109H64k91m76p15k73K24O28M44M91j62l87o03n13q3M24O77K42M58m26n43o17
1129f37j51J35N87N71K53o5m52o06l75l3L71N15P06N5k70n93o08m02L83M11N66
1150C61M14Jn28o18k74j04M72L58M62M44l34n57o19m29K50M83N86N61j93l61o59
1171b84l63j61K71L63R28m1k14k28q14j84R1M35N48N20l8o88m37l73j01K30P17
1192A77K62K64k9n53n17m02J60K30Q14K48J21m94l48o42j77N41L79M18J80L1n78
$$ plain form
1213 85 -541 -737 -801 -140 405 665 869 418 -304 -712 -852 -654 41 492 994 504 -36 -521 -802 -780 -468
1234 -468 321 795 787 391 -189 -803 -761 -327 94 432 846 616 250 -344 -798 -529 -230 276 640 694 463
1255 463 -69 -560 -605 -377 -31 317 703 700 248 -307 -753 -691 -394 107 714 721 376 -178 -495 -830 -436 21
1277 21 363 678 635 286 -221 -644 -601 -107 116 635 669 445 31 -497 -541 -476 151 377 605 562 184 -353
1299 -353 -702 -661 -376 103 588 755 407 88 -502 -693 -484 -68 372 325 629 232 -147 -651 -486 -316 141
1320 141 280 458 458 27 -180 -666 -480 -147 174 662 493 256 -109 -657 -702 -384 60 358 342 686 192
1341 192 -398 -566 -498 -60 309 465 525 235 -135 -573 -642 -414 18 613 549 593 194 -382 -716 -489 -278 284
1363 284 526 436 335 -62 -474 -523 -358 15 279 572 480 171 -237 -393 -568 -199 51 372 552 271 -4
$$ packed form
1213H5o26j96o4O61N45K60K04m51p22m08j40J98O95M51N02m90n40m85k81K2L12
1234d68P89M74ql96n80o14M2M34M21L38M14k30l66n94m54K69K99N06L64N4k31
1255D63n32m91m5K28L46L48L86lm52n55m46O2K97N01O07Pl45n54l17l35L94M57
1277B1L42L15m3l49n07m23M3M94K23N19L4k24m14n28m4O5O27K26K28m3l78n37
1299c53l49M1K85M79M85J67l48l19n90j91K09M16M40m7L04l97l79n04J65J70M57
1320A41J39J78%m31k07m86J86L33L21M88j69k37l65n48m5L18M44K98j6L44m94
1341A92n90j68O8M38L69J56O0k90l70m38o9K28M32N95o4M4l99n76l34K27K11N62
1363B84K42r0j01l97m12m9J65L73K64K93r2l09m08j56j75L69K50L21J80k81k75
$$ plain form
1384 -4 -325 -659 -434 -100 290 529 477 387 -257 -515 -490 -281 110 516 497 343 130 -165 -605 -289 52 224
1406 224 619 470 220 -195 -526 -626 -299 24 445 561 418 92 -177 -677 -339 -155 296 612 466 247
1426 247 -61 -365 -495 -183 85 353 530 506 6 -323 -495 -685 -63 245 642 570 163 11 -504 -535 -468
1447 -468 85 373 561 363 29 -266 -593 -497 -123 255 492 570 217 -152 -382 -498 -408 14 514 544 523 62
1469 62 -318 -567 -653 22 195 543 505 192 -152 -413 -616 -432 71 609 544 573 108 -155 -366 -563 -175 149
1491 149 576 377 370 -75 -336 -510 -446 99 358 687 564 229 -413 -463 -391 -298 143 394 555 385 -75 -503
1513 -503 -316 -333 -57 414 476 517 61 -227 -567 -502 -307 302 462 507 266 -314 -473 -388 -398 47 272 432
1535 432 369 172 -225 -421 -553 -229 181 306 267 374 -18 -191 -443 -426 -48 435 538 418 209 -157 -402
$$ packed form
1384dl21l34K25L34L90K39n2r0o44k58K5K09L91M06j9j54k13k95m40L16L41J72
1406B24L95j49k50m15l31j00L27L23M21J16j43l26k69n00L38J84M51L16j46k19
1426B47l08l04j30L12K68K68J77k4n00l29j72j90O22L08L97p2m07j52n15l1O7
1447d68N53K88J88j98l34k95l27R6L74L78K37P8l53l69k30j16R0M22N00L0k1m61
1469F2l80k49q6O75J73L48l8l13l44k61k03J84N03N38o5K9m65k63k11j97L88L24
1491A49M27j99pm45k61j74O4N45K59L29j23l35o42n0P2R3M41K51J61j70m60m28
1513e03J87j7K76M71O2M1m56k88l40O5J95O09J60M5k41n80j59Q5j0M45K25J60
1535D32o3j97l97j96j32L24M10J25l9J07l92j73k52J7L78M83J03j20k09l66k45
$$ plain form
1556 -402 -375 -277 134 470 444 400 -46 -237 -525 -252 -97 316 435 237 172 -290 -536 -421 -218 249 451 350
1578 350 203 -110 -248 -450 -423 -114 264 659 366 142 -92 -381 -429 -216 -54 363 456 328 23 -462 -444
1599 -444 -323 -87 211 382 432 131 -228 -458 -555 -291 123 504 444 264 -69 -122 -326 -255 -149 150 166 363
1621 363 198 -124 -601 -490 -192 56 308 427 345 74 -159 -526 -282 -134 170 372 339 220 -149 -345 -340
1642 -340 -296 0 402 409 229 4 -203 -461 -228 6 14 318 235 192 -180 -97 -267 -122 109 219 473 165 116
1665 116 -220 -408 -273 -107 124 300 484 264 -119 -318 -390 -246 -9 301 407 268 -9 -53 -402 -274 -96
1686 -96 3 223 438 217 -145 -362 -144 -120 -70 304 204 283 202 -177 -399 -224 -169 107 209 135 183 18 -360
1709 -360 -346 -238 91 219 233 85 178 -122 -386 -335 -65 -1 207 281 192 -27 -270 -301 -251 138 306 308 412 297
$$ packed form
1556d02K7R8M11L36k6m4m46j91k88K73J55M13J19j98o5m62k46J15K03M67K02j01
1578C50j47l13j38k02K7L09L78L95k93k24k34k89m8K13J62M17R3j28l05m85J8
1599d44J21K36K98J71N0l01l59k30r7K64M14L81o0j80l33n3k04P1J06K99J6J97
1621C63j65l22m77J11K98K48K52J19q2k71k33l67K44J48L04K02l3j19l69j96N
1642c40M4K96M02Pj80k25k07k58K33K34QL04q3m3l72Q3j70J45K31J10K54l08m9
1665A16l36j88J35J66K31J76J84k20l83j99p2J44K37L10J06j39k77m4l49J28J78
1686i6R9K20K15k21l62k17K18K4N0L74j00P9q1l79k22J75N5K76J02p4M8j65l78
1709c60J4J08L29J28J4j48R3l00k64N1K70O4K08P4q9k19k43l1N0L89J68KJ04j15
$$ plain form
1733 297 -178 -163 -237 -206 32 217 254 218 -65 -151 -323 -223 -143 287 249 287 176 -76 -356 -260 -250 100 203 267
1757 267 333 -95 -123 -479 -159 -176 252 120 312 131 -44 -195 -107 -172 -27 334 252 367 -97 -107 -381 -236
1779 -236 -32 134 263 325 158 -63 -262 -516 -281 -56 340 369 193 128 -155 -301 -161 -358 218 278 357 54
1801 54 -117 -247 -451 -175 231 79 160 253 51 -219 -428 -405 -76 75 252 272 222 -4 -226 -222 -162 -40 287
1824 287 420 431 93 -92 -271 -385 -193 33 324 273 226 -19 -247 -463 -182 57 143 372 356 62 -151 -85
1846 -85 -139 -123 44 345 311 254 37 -183 -416 -277 -14 255 327 198 209 -187 -468 -70 -187 52 374 305 300
1869 300 -43 -287 -300 -272 -121 210 375 214 107 -58 -216 -236 -77 89 204 215 252 -56 -322 -319 -141 -140 -91
1892 -91 273 143 -12 -118 -132 -153 -228 37 245 234 273 71 -293 -410 -127 66 79 391 329 242 -123 -210 -479
$$ packed form
1733B97m75J5p4L1K38J85L7l6k83q6j72J00Q0M30l8L8j11k52k80R6J0L50J03O4
1757B67O6m28k8l56L20j7M28j32J92j81j75j51Q8o5J45L61q2J15m64j0k74J45
1779b36K04J66J29O2j67k21j99k54K35K25L96K9j76o5k83j46J40j97N76O0P9l03
1801E4j71j30k04K76M06j52Q1R3k02k70k09K3L29J51J77K0n0k26k22MO0J22L27
1824B87J33J1l38j85j79j14J92K26K91n1m7k45k28k16K81K39Q6K29j6k94k13O6
1846h5n4J6J67L01l4n7k17k20k33J39K63K69P2j29J1l96k81L98j17K39L22o9n
1869C00l43k44j3K8J51L31J65j61j07j65j58k0J59J66J15J1L7l08k66LJ78JM9
1892i1L64j30j55j06j4k1p5K65K08j1L9k02l64j17K83J93J3L12o2q7l65q7k69
$$ plain form
1915 -479 -253 6 225 387 134 -30 -63 -172 -147 -86 107 195 298 198 -206 -167 -258 -268 23 170 460 205
1937 205 22 -137 -308 -191 -182 279 148 231 84 -286 -154 -324 -92 140 201 209 183 -103 -174 -136 -177 -91 198 279
1961 279 338 113 -23 -290 -173 14 85 77 249 233 78 -151 -445 -352 -169 128 149 316 122 43 -162 -122 -125 -59
1985 -59 125 220 227 132 -56 -120 -307 11 50 291 106 176 103 -80 -213 -160 -123 13 306 293 -13 -83 -167 -324 -284
2010 -284 77 121 96 166 -61 -108 -121 -291 -74 59 272 226 111 -135 -173 -210 -271 44 326 138 144 -21 -195 -33
2034 -33 -139 -24 216 115 101 -73 -87 -350 -106 -165 90 122 83 348 31 -98 -331 -258 -124 177 176 253 -9
2057 -9 71 -88 -152 -121 36 97 175 243 50 -196 -223 -202 52 58 306 257 65 42 -298 -273 -277 17 367 322 144 111
2083 111 -239 -224 -129 -78 23 106 140 82 -119 -317 -342 -11 -97 297 202 103 157 -109 -194 -282 -136 7 187 163 122
$$ packed form
1915d79K26K59K19J62k53j64l3j09K5O1J93Q8J03j00m04L9r1j0K91J47K90k55
1937B05j83j59j71J17RM61j31Q3j47l70J32j70K32K32O1Qk6k86p1L8m1Q6K89Q1
1961B79N9k25j36k67J17J87P1qJ72j6j55k29k94R3J83K97K1J67j94p9k05M0lO6
1985e9J84R5Pr5j88o4j87L18L9K41j85P0p3j83j33N3L7J36K93j3l06p0q4j57M0
2010b84L61M4k5P0k27m7j3j70K17J33K13m6j15k46l8l7o1L15K82j88Oj65j74J62
2034c3j06J15K40j01j4j74j4k63K44n9K55L2l9K65l17j29k33P3J34L01jP7k62
2057iQ0j59o4L1J57O1P8O8j93k46k7K1K54OK48m9j92k3l40K5mK94L50m5j78l3
2083A11l50J5R5N1J01Q3L4n8k01j98k5L31q6L94r5r9N4k66q5q8J46J43J80k4m1
$$ plain form
2108 122 146 -113 -185 -315 -165 123 164 351 132 -53 -266 -270 35 24 176 261 44 18 80 -302 -111 -69 86
2131 86 260 155 -45 -59 -54 -238 -171 109 161 284 205 77 -195 -130 -97 12 90 218 288 213 -179 2 -197 -301
2155 -301 -41 168 181 11 188 -190 -229 -325 -5 165 117 259 -82 -32 -191 -175 -259 -9 169 21 69 15 -90
2178 -90 -250 -258 -119 42 210 323 108 -91 -356 -80 -76 -8 189 347 188 -20 -49 -309 -100 -59 63 320 418
2201 418 87 31 -53 -223 -184 -4 210 258 90 162 -85 -228 -230 -19 154 158 179 158 -60 -78 -334 -92 -37 228
2225 228 354 226 -24 54 -297 -224 -204 -21 79 258 38 136 -13 -40 -226 -115 124 206 315 190 125 -177
2247 -177 -204 -178 94 190 122 176 71 -167 -265 -132 -62 100 225 94 93 -73 -242 -255 -194 3 80 151 264 85
2271 85 -77 -280 -289 -89 71 304 328 128 20 -103 -223 -215 -110 265 213 220 25 -78 -169 -263 -53 2 278 272 190
$$ packed form
2108A22K4k59p2j30J50K88M1J87k19j85k13mL05j1J52Q5k17k6O2l82J91M2J55
2131H6J74j05k00j4Nj84O7K80N2J23p9j28k72O5L3J09P8J28P0p5l92J81j99j04
2155c01K60K09J3j70J77l78l9r6L20J70m8J42l41N0j59J6q4K50J78j48M8n4j05
2178i0j60qJ39J61J68J13k15j99k65K76MO8J97J58j59k08k9k60K09M1J22K57R8
2201D18l31n6q4j70L9J80K14M8j68P2k47j43kK11J73MK1k1k18j8k56K42N5K65
2225B28J26j28k50P8l51P3K0J83J00J79k20R8j49k7j86J11K39Q2J09j25o5l02
2247a77k7K6K72R6o8N4j05k38r8J33P0J62J25j31jj66j69j3O1J97P7P1J13j79
2271H5j62k03rK00J60K33K4k00j08j23j20QJ05L75n2Pj95j03r1r4K10N5K76oq2
$$ plain form
2296 190 12 -224 -200 -307 41 226 178 89 110 -91 -288 -327 -49 109 250 302 -1 1 -183 -203 -215 41 26 176
2320 176 52 -12 44 -55 -251 -44 47 231 346 35 -74 -50 -310 -160 -4 46 311 130 94 36 -144 -214 150
2343 150 147 231 150 115 -54 -161 -320 -233 6 225 162 188 6 -74 -201 -177 -269 3 51 251 206 9 -233 -152 -248
2368 -248 -74 66 163 182 159 -77 -142 -188 -58 1 136 196 90 -1 -172 -230 -158 -105 223 32 117 63 -9 -236 -173
2393 -173 -238 -60 172 236 96 -16 -58 -125 -169 -231 -40 106 297 125 -45 -166 -235 3 -103 251 161 176 31
2416 31 -132 -141 -264 60 86 169 241 68 79 -132 -298 -165 -213 279 100 69 -38 186 -41 -227 0 -175 297
2439 297 447 162 160 -93 -180 -243 -6 219 175 151 3 75 -221 -340 -193 -124 180 139 78 57 -146 -208 -377 -18
2463 -18 79 235 137 176 120 -141 -333 -89 -1 274 243 84 -105 -64 -189 -151 -168 184 357 180 18 -78 -208 -427
$$ packed form
2296A90j78k36K4j07L48J85m8q9K1k01j97l9K78J58J41N2l03Kj84k0j2K56j5J50
2320A76j24o4N6r9j96K07R1J84J15l11j09K4k60J50J56N0K65j81l6n8j80p0L64
2343A50lQ4q1l5j69j07j59Q7K39K19o3K6j82q0j27K4r2K72M8K00m5j97k42Q1r6
2368b48J74J40R7J9k3k36o5m6J30N9J35O0j06r1j71n8P2N3L28j91Q5n4p2k27O3
2393a73o5J78K32O4j40j12m2o7m4o2J91J46J91j72j70j21o9K38j06L54r0J5j45
2416C1j63rj23L24K6Q3P2j73J1k11j66J33m8M92j79l1j07K24k27j86K27j75M72
2439B97J50k85kk53q7o3K37K25m4k4j48P2k96j19J47O9L04m1o1k1k03o2j69L59
2463a8R7J56r8L9n6k61j92K44Q8K75l1j59j89M1j25L8j7L52J73j77j62r6j30k19
$$ plain form
2487 -427 -194 21 168 203 165 109 -12 -173 -45 -8 33 143 9 165 -78 -227 -286 -118 -46 164 345 108
2509 108 38 -250 -266 -116 -183 59 172 108 -15 -46 -86 -182 -189 -151 124 215 76 59 -218 -162 -130 -195 15 187 190 192
2535 192 -101 -249 -356 -155 -54 -22 108 233 96 -61 -250 -210 -126 125 37 248 109 74 -48 -157 -208 -186
2557 -186 226 150 220 -119 42 -25 -202 -170 10 417 510 164 51 78 -9 -132 -134 129 278 71 -35 88 -287
2580 -287 -302 -10 122 123 203 180 -22 -121 -156 -95 -31 114 134 142 100 19 -173 -137 -215 36 279 21 105 95 -216 -238
2606 -238 -178 37 109 188 183 33 -106 -119 -213 -37 -104 203 199 160 9 -232 -254 -204 45 -22 280 267 154 -195 -174
2631 -174 -305 -82 -140 168 336 195 -15 -167 -240 -99 30 172 93 127 56 -56 -184 -329 -241 -11 101 258
2653 258 208 205 39 -132 -197 -101 -49 65 182 166 -107 -224 -100 -151 128 108 169 206 211 18 -198 -248 9 170 119
$$ packed form
2487d27K33K15J47L5l8n6j21j61J28L7M1J10j34J56k43j49n9J68P2K10J81k37
2509A08p0k88j6J50o7K42J13o4j23l1m0r6pL8K75R1j39j7k77N6L2o5K10J72LK
2535A92k93j48j07K01J01L2J30J25j37j57j89M0Q4K51q8K11j39l5j22j09n1K2
2557a86M12p6P0l39J61o7j77L2J80M07R3l46j13K7q7j23kK63J49k07j06J23l75
2580b87j5K92J32JQ0k3k02r9l5O1O4J45K0Qm2q1j92L6p8K51K43k58Q4j0l11k2
2606b38O0K15P2P9nj50j39j3r4J76o7L07ml9j51k41k2N0K49o7L02j3j13l49K1
2631a74j31K23n8L08J68j41k10j52p3J41J29J42p9L4p1j12j28j45Q8K30J12J57
2653B58n0lj66j71o5R6N2J14J17j6k73j17J24n1K79k0O1L7Nj93k16n0K57J61n1
$$ plain form
2678 119 132 253 71 -189 -67 -180 -24 94 345 311 4 -30 -131 -125 -149 -8 85 212 268 126 -237 -228 -35
2701 -35 -150 110 105 -35 45 18 -370 -261 -193 -125 182 240 -25 -140 -27 -233 -136 30 7 55 151 130 -59 -174
2725 -174 -161 -9 -128 163 291 82 -76 -86 -45 -213 -58 -30 120 73 81 -74 -227 -187 -89 169 22 166 87
2748 87 -38 37 -198 -205 -88 -44 60 86 175 -110 -42 -78 -103 -176 156 249 180 98 -78 -115 -266 6 231 128 159
2773 159 126 15 -159 -265 -132 27 -18 223 112 39 -45 -142 -178 -80 -69 115 157 179 68 -254 -338 -201 -77 225
2797 225 138 181 52 -16 -203 -112 -3 65 111 250 127 6 -72 -162 -106 44 96 228 240 44 -62 -170 -227 -131
2821 -131 -122 223 161 213 94 82 -191 -270 -214 36 264 166 270 -41 -119 -291 -212 77 61 77 173 -11 -132 -167 -201
2846 -201 -179 20 77 158 -130 -15 30 -163 -172 -31 38 245 97 91 35 -46 -133 -228 -27 115 105 -3 50 -112 -237
$$ packed form
2678A19J3J21j82k60J22j13J56J18K51l4l07l4j01Ok4J41R3J27N6j42l63RJ93
2701c5j15K60nj40Q0k7l88J09O8O8L07N8k65j15J13k06R7J66k3M8R6k1j89j15
2725a74J3J52j19K91J28k09j58j0M1j68J55K8J50m7Qj55j53M0R8K58j47J44p9
2748H7j25P5k35pJ17M4J04K6Q9k85O8l6k5p3L32R3o9q2j76l7j51K72K25j03L1
2773A59l3j11j74j06J33J59m5K41j11p3q4r7l6R8J1J84M2K2j11l22q4J37J24L02
2797B25q7M3j29o8j87R1J09O8M6J39j23j21p8r0N6J50N2J32J2j96j06j08n7R6
2821a31RL45o2N2j19j2k73p9N6K50K28r8J04l11p8j72P9K89j6J6R6j84j21l5l4
2846b01K2J99N7Q1k88J15M5j93rJ41O9K07j48on6q1q7r5K01J42j0j08N3j62j25
$$ plain form
2871 -237 -218 -7 134 139 237 217 -73 -261 -254 -221 -47 209 30 230 -144 -293 -98 -27 31 57 165 296 9 -172
2895 -172 -36 -503 -113 8 163 36 79 83 -283 -190 -267 -175 239 347 320 80 -111 -83 -116 -46 35 2 291 117
2919 117 20 -127 -105 -63 -116 216 -8 280 60 -46 -131 -107 28 -105 46 105 120 -176 -152 -159 -246 -108 115 242
2943 242 243 222 -133 -152 -180 -1 -5 148 158 108 -28 -167 -179 -197 -83 90 263 67 265 -17 -118 -247 -159 -37
2967 -37 -23 124 17 -12 -68 -149 -94 1 20 79 112 148 -3 -187 -80 -111 -33 277 14 177 -61 -16 -201 -196 -27
2992 -27 97 153 304 -87 -11 -172 -113 -94 -169 46 23 202 121 -106 -296 -91 -173 -133 76 149 112 -112 -56 -58 -210
3017 -210 51 -62 157 177 -114 -137 -168 -247 18 151 185 -18 208 -127 -175 -151 -80 -98 161 177 188 -68 -84 -113
3041 -113 -129 -74 -16 86 23 18 -77 -181 -250 -142 200 59 133 191 -11 -258 -290 -121 -40 128 75 340 -70 25 -43
$$ packed form
2871b37J9K11J41NR8k0k90j88PL3J74K56j79K00l74j49J95P1N8K6J08J31k87j81
2895a72J36m67L90J21J55j27M3Ml66R3p7R2M14J08k7k40j91K8l3P0Q1l3K89j74
2919A17r7j47K2M2n3L32k24K88k20j06q5K4J35j33J51N9J5k96K4pq7J38K23J27
2943B42Jk1l55j9k8J79mJ53J0n0j36j39j2j8J14J73J73j96J98k82j01j29Q8J22
2967c7J4J47j07k9n6q1N5R5J9N9L3L6j51j84J07l1P8L10k63J63k38M5j85NJ69
2992b7J24N6J51l91P6j61N9J9p5K15k3J79q1k27j90K05q2M0K09P3l7k24N6kj52
3017b10K61j13K19K0k91k3l1p9K65J33L4k03K26l35m8K4P1j8K59J6J1k56j6k9
3041a13j6N5N8J02o3nr5j04o9J08L42j41P4N8k02k47l2J69Q1J68n3K65m10R5o8
$$ plain form
3066 -43 -177 -192 8 102 225 118 31 -48 -126 -247 -149 123 61 188 143 44 36 -52 -72 33 -86 284 171 100 37
3091 37 -12 -104 -129 -21 -122 -17 137 -130 -140 -136 -212 64 71 166 157 224 -75 -254 -182 -120 107 103 156 95 81 -76 -138
3118 -138 -180 53 12 146 191 152 -162 -223 -181 -98 30 23 125 70 34 19 -153 -115 -62 -71 208 212 18 -24 -253 -116
3144 -116 -76 -50 -80 138 100 -131 -49 -36 -187 31 137 42 273 109 86 92 -165 -81 104 28 257 306 15 -95
3168 -95 -312 -59 2 -18 40 15 139 -89 -50 -6 -112 114 63 173 134 -8 39 -110 -167 -194 18 -33 210 117 152
3193 152 -172 -167 44 4 15 97 198 29 60 -243 -212 -59 -12 168 33 177 85 -107 -242 -153 25 -4 193 52
3217 52 -42 -77 -45 -109 -98 62 3 197 251 -8 -180 -125 -150 0 49 186 130 41 2 -24 -91 -200 24 -4 207 224
3243 224 101 -177 -222 -31 -49 -45 273 0 -25 -82 -64 -248 -93 66 81 126 169 8 -69 -7 -184 -105 -107 251 179
$$ packed form
3066d3j34j5K00R4J23j07q7p9p8j21R8K72o2J27m5r9qq8k0J05j19L70j13p1o3
3091C7m9r2k5J08j01J05J54k67j0Mp6K76PR5rO7k99j79P2O2K27mN3o1j4j57o2
3118a38m2K33m1J34M5l9l14o1M2Q3J28pJ02n5l6j5j72L8N3rK79Mj94m2k29J37
3144a16M0K6l0K18l8k31Q2J3j51K18J06r5K31j64k3Ok57Q4J85p6K29M9k91j10
3168i5k17K53O1k0N8k5J24k28L9M4j06K26n1J10l9j42M7j49n7k7K12n1K43r3L5
3193A52l24NK11m0J1Q2J01j69L1l03L1J53M7J80j35J44r2j92j35Q9J78k9J97j41
3217E2r4l5L2o4J1J60n9J94N4k59j72N5k5J50M9J37n6q9l9k6o7j09K24k8K11J7
3243B24j23k78m5J91j8ML18k73k5n7J8j84J55J59J5M5M3j61p7O2j77P9kL58p2
$$ plain form
3268 179 28 76 -46 -167 -16 8 135 180 10 -57 -82 103 -218 89 17 42 169 82 110 -154 -49 -202 -118
3291 -118 -27 -20 63 -75 -102 -229 11 121 20 325 284 132 -106 -83 -125 -296 49 78 125 304 170 -117 -212 -64
3315 -64 -38 -25 212 177 -10 22 -12 -115 43 59 129 290 152 6 29 -236 -113 -43 115 133 194 65 111 -132
3339 -132 -184 -55 -158 -8 117 14 -63 -42 -55 -45 -148 68 -11 -53 48 -1 -40 -102 -12 -14 178 182 11 -160 54
3364 54 -6 -220 -202 18 -3 164 57 -77 -41 -77 -74 -133 6 52 188 -106 -87 -40 -128 51 130 143 113 47 -18 -68
3390 -68 -145 -77 -63 61 100 1 60 -96 -213 -72 -112 11 118 104 101 22 -90 58 -115 2 188 64 -15 -52 75
3415 75 -102 -66 46 -84 74 -35 -55 64 -21 73 85 -148 6 3 151 -55 180 -83 -86 -63 8 117 205 107 158
3440 158 -55 -16 -214 -2 55 12 49 112 -11 141 89 -33 -151 -135 91 2 17 -158 -221 42 -34 92 -97 140
$$ packed form
3268A79j51M8j22j21J51K4J27M5j70o7k5J85l21L07p2K5J27q7K8k64J05j53Q4
3291a18R1PQ3j38k7j27K40J10j01L05m1j52k38K3m2j71L45K9M7J79j34k87r5J48
3315f4K6J3K37l5j87L2l4j03J58J6P0J61j38j46K3k65J23P0J58J8O1j29M6k43
3339a32n2J29j03J50J25j03p7K1j3J0j03K16p9m2J01m9l9o2R0kJ92Mj71j71K14
3364E4o0k14J8K20k1J67j07j34L6l6Ln9J39M6J36k94J9M7q8J79P9J3l0o6o5n0
3390f8p7O8J4J24L9r9N9j56j17J41m0J23J07j4lp9j12J48j73J17J86j24p9l7J27
3415G5j77L6J12j30J58j09k0J19q5R4J2k33J54lJ48k06K35k63lK3P1J09Q8r8N1
3440A58k13L9j98K12N7m3L7O3j23J52n2j22j18J6K26q9J5j75o3K63p6J26j89K37
$$ plain form
3464 140 39 36 -208 -223 -180 -41 8 61 193 64 85 -38 -20 -134 22 58 -128 91 67 -124 -171 -11 136 -60
3488 -60 190 121 181 35 -21 -25 116 63 -78 208 232 49 -106 88 -51 -58 150 206 75 -27 104 27 36 -50 -108
3513 -108 136 285 22 137 91 -103 -2 -214 3 65 146 63 -69 105 102 -187 -68 108 -2 -9 104 36 -123
3536 -123 -41 -162 6 -41 101 141 -28 -100 -270 -206 -216 42 171 163 6 -113 -108 -17 33 -73 183 175 93 -119 -132
3561 -132 9 -288 -180 59 51 93 74 20 -110 11 30 -38 81 94 99 -21 53 -18 -152 -90 63 113 173 30 4
3586 4 -66 114 -50 156 108 -88 77 -40 -15 -14 -38 -81 8 90 -2 109 34 27 -16 -171 -31 135 130 224 -107 -294
3612 -294 -155 -101 82 -35 -64 -4 34 -26 -85 -52 -35 28 100 -172 142 -163 -120 -50 -89 -102 -56 -85 30 -3 15 -15
3638 -15 -56 -168 31 -69 147 42 -11 -101 -117 -174 -133 -108 -30 14 196 99 -65 69 -20 -132 36 79 80 9 -61 -44
$$ packed form
3464A40j01lk44j5M3J39M9N3J32j29K1j23J8j14J56L6j86K19k4j91m7J60J47j96
3488f0K50o9O0j46n6mJ41n3j41K86K4j83j55J94j39pK08N6j31j02J31p7Rq6n8
3513a08K44J49k63J15m6j94J01k12K17O2Q1q3j32J74lk89J19J76j10pJ13o8j59
3536a23Q2j21J68m7J42M0j69p2j70O4j0K58J29qj57j19NR1N0j06K56qq2k12j3
3561a32J41k97J08K39qM2j9n4j30J21J9o8J19J3Nj20P4p1j34O2J53N0O0j43k6
3586Dp0J80j64K06m8j96J65j17K5Jk4m3Q9Q2r2J11p5pm3j55J40J66nR4l31j87
3612b94J39N4J83j17k9O0L8o0n9L3J7O3P2k72L14l05M3P0l9j3M6k9J15l3J8l0
3638a5m1j12J99j00K16j05n3r0j6n7M1K5P8M4J82r7j64J34q9j12J68M3Jp1p0J7
$$ plain form
3664 -44 -2 143 66 -31 78 51 55 -27 -192 7 -171 -173 75 321 77 -31 31 -166 -154 -11 -84 19 13 -73 -3 -269
3690 -269 -7 15 -50 -144 13 174 -70 -21 -40 -246 -116 -62 -84 123 54 29 -44 -54 -21 -43 99 -25 76 220
3714 220 -55 35 -142 -66 197 -93 182 -17 -89 -233 -35 7 -61 12 -27 57 -111 -49 -6 157 -126 147 -45
3737 -45 111 115 62 -268 -165 -78 58 11 84 74 77 -18 -15 -30 10 66 -74 77 2 84 -44 39 -51 90 49 96 -10
3764 -10 31 -130 28 -197 -57 191 131 58 -28 45 -57 -108 0 -102 85 75 -41 6 -190 -1 -116 139 58
3787 58 95 231 124 9 4 -210 -98 -18 17 24 15 -4 -26 -61 -160 -59 8 -29 76 198 0 -115 -16 81 74 153 -80
3814 -80 86 -133 -53 136 11 1 -72 72 -15 -57 20 15 -152 23 35 -51 -13 -160 102 -81 -71 20 -179 63 223
3839 223 74 149 84 76 21 2 -121 135 -65 185 103 -117 16 -72 62 56 46 127 162 71 -9 4 -142 30 -63 -109
$$ packed form
3664d4M2J45p7r7J09k7Mq2j65J99j78kK48K46k44j08O2j97J2J43p3J03oq6P0k66
3690b69K62K2o5r4J57J61k44M9j9k06J30N4k2K07o9k5p3j0L3k2J42j24J01J44
3714B20k75R0j77P6K63k90K75j99p2j44J98M2o8P3l9Q4j68O2M3J63k83K73j92
3737d5J56Mn3l30J03Q7J36m7P3j0Lr5Lj5M0N6j40J51p5Q2j28Q3r0J41m1M7j06
3764a0M1j61J58k25J40K48o0p3q6P3j02n1J08j02J87j0j16M7j96J89j15K55q1
3787E8L7J36j07j15nk14J12Q0L5Prj9k2l5r9J01O7l7J05J22j98j15R9R7pP9k33
3814h0J66k19Q0J89j25j0p3J44q7m2P7nj67J75J2q6L8j47K62j83J0R1j99K42J60
3839B23j49P5o5qn5j9j23K56k00K50q2k20J33q8J34oj0Q1L5r1q0J3j46J72r3m6
$$ plain form
3865 -109 203 75 2 2 -75 -82 -67 34 78 -141 -85 -159 -28 132 -28 -118 -2 206 50 74 -14 74 -14 -72 44
3890 44 -50 136 26 -167 -167 25 -171 66 96 -61 -157 21 -151 82 -76 -139 17 39 -20 -144 -24 -62 25 -52
3914 -52 -88 105 25 29 41 10 29 -95 58 113 117 55 63 52 229 33 -107 197 15 196 71 29 -86 -47 -20 -44
3940 -44 81 16 187 14 -1 -99 -74 -183 122 -19 136 -61 -90 12 -145 -50 -4 91 98 -63 129 133 -238 -208 -75
3965 -75 -52 -38 55 9 -17 91 96 -94 -47 166 35 -3 84 35 37 -14 -74 198 -86 166 -6 -18 81 -278 31 -30
3991 -30 -9 23 176 -59 23 -97 -18 -35 105 118 -106 -17 182 14 48 67 193 -131 49 40 162 -97 -183 -113 -116
4016 -116 132 172 -61 115 -39 -31 -256 -13 -216 94 -5 -59 -94 125 22 -186 -43 -24 42 54 193 -76 -175
4039 -175 -148 116 -83 -110 74 61 93 10 8 -180 91 29 40 110 -18 162 -98 25 35 -32 -90 6 195 10 3
$$ packed form
3865a09L12j28p3%p7pJ5J01M4k19N6p4J31J60j60r0J16K08j56K4q8Q8q8n8J16
3890D4r4J86j10j93%J92j96K37L0j57r6J78j72K33j58o3J56K2n9j24J20l8Q7p7
3914e2l6J93q0MJ2l1J9j24J53N5Mo2Qj1J77j96j40L04j82J81j25m2j15L9K7k4
3940d4J25o5J71j73j5r8K5j09L05j41J55j97k9J02j57R5M6R5Pj61J92Ml71L0J33
3965g5K3J4R3m6k6J08Nj90M7K13j31l8Q7m9Kn1o0K72k84K52j72j2R9l59L09o1
3991c0K1L2J53k35Q2j20P9j7J40J3k24Q9J99j68L4J9J26l24J80rJ22k59q6P0l
4016a16K48M0k33J76j54Qk25K43k03L10r9n4l5K19j03k08J43J9O6J2J39k69r9
4039a75K7K64j99k7J84j3L2q3kj88K71o2J1P0j28J80k60J23J0o7n8R6J89j85p
$$ plain form
4064 3 -30 -76 -11 49 17 225 -24 -132 26 -195 -99 14 40 60 134 15 -153 -22 -34 158 4 -18 94 161 113
4089 113 -136 -19 -141 -99 14 -94 77 -83 -156 -177 -67 -81 -30 -75 -7 128 86 5 -59 -238 -39 44 -11 154
4113 154 51 -195 -121 -148 -5 18 -45 -106 121 115 -297 65 -119 -36 30 63 308 7 -3 40 36 -41 -118 166 100 -16
4139 -16 25 -20 -89 29 54 246 45 76 88 56 -122 -34 -72 84 -69 -152 36 -53 -76 -218 -63 -92 119 64 -113
4164 -113 5 -198 40 11 -277 -119 10 -12 86 -31 -61 18 -183 50 -26 31 -16 190 -9 -29 -25 182 34 155
4188 155 59 118 15 99 20 -44 8 -55 -4 -19 -84 -22 86 -58 -266 14 13 14 72 111 140 -149 55 55 -10 120 140
4215 140 -33 -61 120 -36 -40 -73 130 108 -55 53 -83 -128 -168 -66 -235 109 96 -73 137 -92 51 139 -130
4238 -130 -164 18 58 47 -80 86 -37 -10 -162 13 66 67 166 -4 91 83 65 -21 98 87 59 5 40 -100 -20 -309
$$ packed form
4064Cl3m6O5O0l2K08k49j08J58k21R6J13K6K0P4j19j68J31j2J92j54k2J12O7m8
4089A13k49J17j22M2J13j08J71j60p3k1J10j4N1m5O8J35m2q1o4j79J99Q3n5J65
4113A54j03k46P4k7J43K3o3o1K27om12L62j84Q3O6L3K45l01j0M3mp7p7K84o6j16
4139a6M1m5o9J18K5J92k01L1J2l2j78Q8l8J56j53q3J88q9k3j42J55k9K11n5j77
4164a13J18k03K38k9k88J58J29k2R8j17l0P9k01K33p6N7m7K06j99k0MK07j48J21
4188A55r6N9j03Q4p9o4N2o3N1j5o5O2J08j44k08K80jJN8L9K9k89K04%o5J30K0
4215A40j73k8J81j56ml3K03k2j63J08j36m5m0J02j69L44j3j69K10k29J43Q8k69
4238a30l4J82M0j1j27J66j23K7j52J75N3JR9j70R5qj8q6J19j1k8n4L5j40Q0k89
$$ plain form
4264 -309 25 22 95 53 -59 -72 64 19 44 275 148 154 139 -111 -151 -85 -195 94 34 36 -30 2 -142 -78 20 -15 206
4291 206 166 231 100 -10 -290 -113 -98 69 -107 149 -15 28 27 -196 184 -79 50 124 120 109 68 -143 -119 47
4315 47 85 31 -65 247 -1 -184 -48 -41 115 60 -91 80 74 -47 -226 -74 67 136 -14 105 184 -51 -66 12
4339 12 -15 -10 18 10 92 -160 -41 -21 -163 -120 124 -2 -7 25 -40 -108 -24 -118 -2 -89 -13 -153 22 182 61 27 -13
4366 -13 -58 97 141 42 -101 4 -6 -231 28 190 95 -24 -26 -27 9 -64 92 47 -100 39 -78 -2 19 -148 -18
4391 -18 142 113 150 26 -16 -41 -23 41 118 45 247 101 28 29 -172 66 -57 121 132 107 64 -25 10 -15 -158 -93
4417 -93 -30 24 91 153 51 -13 -94 -108 148 86 100 -63 1 -81 106 -21 -183 -53 84 77 41 50 -73 -102 -64 314
4443 314 34 132 -65 0 -104 92 97 -79 -99 -20 138 -123 -81 -39 21 -123 -11 -202 54 45 8 7 -79 -31 -29 30
$$ packed form
4264c09L34lP3m2j12j3J36m5K5K31j27Oj5k50m0O6j10K89o0Ko6L2j44O4R8l5K21
4291B06m0O5j31j10k80J77J5J67j76K56j64M3jk23L80k63J29P4mj1m1k11K4J66
4315D7L8n4r6L12k48j83J36PJ56n5j51J71oj21j79J52J41O9j50J19P9k35j5P8
4339A2k7NK8qQ2k52J19K0j42M3K44j26nL2o5o8Q4r4J16q7P6j40J75J60j21l4m0
4366a3m5J55M4r9j43J05j0k25K59J62r5j19kjL6p3J56m5j47J39j17P6K1j67J30
4391a8J60k9L7j24m2k5J8O4P7p3K02j46p3Jk01K38j23J78J1k5m3q9L5k5j43O5
4417i3O3N4O7O2j02o4q1j4K56o2J4j63O4q2J87j27j62J30J37pl6Rj23k9L8L78
4443C14k80R8j97O5j04J96Nj76k0P9J58k61M2M2O0j44J12j91K56rl7jq6M8KN9
$$ plain form
4469 30 130 194 84 54 -54 -260 -21 -22 50 40 -155 -25 -8 91 5 -125 -137 103 49 102 -57 5 56 -175 169
4494 169 140 -68 154 84 -66 12 -150 36 18 0 66 26 -142 -139 -16 -140 1 253 136 -6 18 -105 -134 -122
4518 -122 0 201 101 -95 19 122 -125 -142 64 -24 -61 60 22 4 18 -80 41 -60 -22 95 -15 99 -150
4541 -150 -24 -70 50 -20 -48 98 151 123 -32 -97 -99 -48 140 50 39 -42 -72 102 -145 -107 -194 32 131 24 29 171
4567 171 -25 112 -40 -24 -36 104 40 -171 52 -268 30 28 131 96 185 94 38 -130 -13 -18 -74 187 47 90
4591 90 157 44 -212 28 -19 90 -87 126 5 -26 -22 -53 0 -10 3 -97 85 33 23 30 -23 -164 -31 85 29
4616 29 49 -7 120 15 119 -114 -115 107 165 -80 -186 -27 -28 -34 50 -41 0 125 -59 -128 -75 -27 -33 111 -53 11
4642 11 24 -166 -67 -170 -117 -37 -75 217 33 3 -25 57 80 24 9 -28 144 117 86 112 -105 -2 -165 187 147 144
$$ packed form
4469C0J00O4j10l0j08k06K39jP2j0j95J30J7R9q6j30j2K40n4N3j59O2N1k31L44
4494A69k9k08K22p0j50P8j62J86j8j8O6m0j68LJ23j24J41K52j17j42K4j23k9J2
4518a22J22K01j00j96J14J03k47j7K06q8l7J21l8j8J4r8J21j01L8J17j10J14k49
4541a50J26m6J20p0k8J46N3k8j55o5kN1J88r0j1q1l0J74k47L8q7K26R9j07NJ42
4567A71j96J37j52J6j2J40o4k11K23l20K98kJ03l5Q9r1n6j68J17nn6K61j40M3
4591I0O7j13k56K40m7J09j77K13j21l1Ml1N3j0J3j00J82n2j0Pn3j41J33J16n6
4616B9K0n6J27j05J04k33jK22N8k45j06J59joQ4r1M1J25j84o9N3M8oJ44j64O4
4642A1J3j90R9j03N3Q0l8K92j84l0k8Q2K3n6j5l7J72k7l1K6k17J03j63L52m0l
$$ plain form
4668 144 105 -47 -48 -139 -7 159 118 -159 -7 -21 -70 -283 -26 -38 -71 23 -106 -114 17 -83 34 -40 127 9
4692 9 -2 53 -140 37 -3 -219 -44 -30 197 -98 120 -175 61 -67 -145 -34 87 61 -209 -20 -181 -22 -39
4715 -39 -94 -18 68 72 27 33 -166 -22 -192 -69 -16 14 64 115 -132 19 41 -5 13 23 255 -105 -19 -92 109 -64
4741 -64 52 103 26 -6 31 18 -46 109 -39 -92 79 -8 117 63 -144 -5 -119 26 69 184 -88 -27 -55 155
4765 155 -171 -12 -64 -25 207 42 -10 -15 -139 -8 40 205 132 33 -52 -3 80 131 37 -78 -48 -54 59 132 61 -161
4791 -161 57 -78 -72 -9 174 -97 32 -16 -136 -165 -2 34 -57 283 41 65 -36 -64 -82 -59 10 -4 -57 -1 -39
4816 -39 -6 -118 149 -7 36 170 143 -40 -71 -110 -21 -170 59 108 11 -69 -102 -105 35 31 178 181 -55 -35 44 -16 -141
4843 -141 -59 -114 -29 103 15 -163 -50 11 46 25 105 -21 63 -38 -40 -56 -157 3 -6 11 5 92 7 -81 -60 -7 -109
$$ packed form
4668A44l9j52jr1J32J66m1k77J52j4m9k13K57j2l3R4j29qJ31j00J17p4J67j18
4692Ij1N5j93J77m0k16J75J4K27k95K18k95K36j28p8J11J21k6k70J89j61J59j7
4715c9n5P6Q6Mm5Oj99J44j70J23N3L0N0N1k47J51K2m6J8J0K32l60Q6p3K01j73
4741f4J16N1p7l2L7j3o4J55j48n3J71q7J25n4k07J39j14J45M3J15k72O1k8K10
4765A55l26J59n2L9K32j65n2nj24J31M8J65p3r9q5M9Q3N1r4j15L0oJ13P3p1k22
4791a61K18j35OO3J83k71J29m8j20k9J63L6r1L40k42K4j01k8j8K3O9j4n3N6l8
4816c9L3j12K67j56M3J34k7j83l1l9Q9j49K29M9r7q0l3lJ40mJ47Lk36K0P9o0j25
4843a41Q2n5Q5J32q8j78J13O1L5k1Q0j26Q4j01kj6j01J60rJ7oQ7q5q8K1N3j02
$$ plain form
4870 -109 66 237 -8 -26 110 64 -61 -52 -121 -20 -52 15 98 -118 46 10 13 56 -8 42 62 39 -112 -5 21 -97
4896 -97 -54 -44 -2 44 41 -24 103 15 85 -291 137 -30 -44 89 -14 58 99 8 138 192 -31 1 -76 -107 -207 -95
4922 -95 -78 97 -98 -6 -3 121 -12 -39 124 -18 -87 135 -61 -13 97 49 0 11 -20 13 25 -127 135 -4 -115
4947 -115 17 -93 -52 -164 -20 -23 8 35 -8 116 -56 -8 -161 43 144 110 -106 -54 110 -161 73 -2 -104
4970 -104 -122 48 -62 -38 177 -59 25 -7 140 -15 -149 -74 147 -98 -114 26 -94 54 -137 -200 76 33 28
4993 28 -48 -34 -109 -35 79 -68 9 -98 40 -119 38 -184 -3 -36 -5 22 148 -77 44 -54 -42 -106 35 89
5017 89 -118 -172 58 188 -203 -146 91 8 250 83 244 75 -115 -3 -84 -108 -6 -48 -46 -47 -51 -174 27 -196
5041 -196 -28 134 155 -64 -39 65 -71 34 -22 70 -95 148 -30 61 -374 -83 -5 27 49 18 3 -140 25
$$ packed form
4870a09J75J71k45j8J36m6j25Ro9J01l2O7Q3k16J64l6LM3o4N0K0k3j51J07K6j18
4896i7M3J0M2M6lo5J27q8P0l76M28j67j4J33j03P2M1r1J30N4k23L2p7l1j00J12
4922i5J7J75j95R2LJ24j33k7J63j42o9K22j96M8J10m8m9J1l1L3J2j52K62j39j11
4947a15J32j10M1j12J44lL1K7m3J24j72M8j53K04J01l4k16N2J64k71K34p5j02
4970a04j8J70j10K4K15k36Q4l2J47j55j34P5K21k45j6J40j20J48j91o3K76m3n
4993B8p6J4p5P4J14j47P7j07J38j59J57k22J81l3L1K7J26k25J21r8J2o4J41N4
5017H9k07n4K30J30l91N7K37q3K42j67J61j69j90J12q1k4J02m2Kjmj23K01k23
5041a96J68J62K1k19K5J04j36J05n6R2j65K43j78R1m35K91P8L2K2l1j5j43J65
$$ plain form
5064 25 74 82 3 -146 -1 82 -5 138 62 -104 -264 -94 -11 23 -92 -20 -66 -124 -50 -111 2 118 98 63 -174 -25
5090 -25 -74 15 -129 74 208 47 151 -57 194 -96 15 -19 -102 -152 27 75 -58 -20 27 -93 201 9 73
5113 73 60 8 -156 111 -189 59 -129 -24 66 68 -235 -33 -30 -24 77 28 -22 -164 -67 -25 91 -136 85 -164 11
5138 11 173 41 -56 -95 48 -37 -115 -33 69 -70 30 106 -15 -17 51 -57 20 -124 11 15 -55 4 59 -146 -120 6
5164 6 -10 -23 38 64 72 -166 81 17 -2 47 -30 -155 51 -55 -3 -64 -88 -4 221 12 -86 133 -26 26 75 -164
5190 -164 13 -59 -92 69 -120 3 -1 -59 -138 -20 -16 -25 -12 72 69 28 33 -103 37 12 96 -82 -50 11 93 105 16 -88
5218 -88 -5 -248 4 169 78 54 -62 -71 60 -84 26 -23 136 79 7 46 24 134 72 -34 -89 -71 113 94 -279
5243 -279 92 -75 52 60 23 -4 144 36 -26 -129 32 39 36 7 -138 -145 -31 -165 -127 43 -28 165 26 50 51 52
$$ packed form
5064B5M9Qp9j49J45Q3q7J43p6j66j60J70Q3L4j15P2m6n8P4o1J13J16k0l5k37J49
5090b5m9Q9j44K03J34j61J04k08K51k90J11l4q3n0J79M8j33L8M7j20K94j92O4
5113G3j3n2j64K67l00K48j88J05R0Kl03K02LOJ01m9n0j42R7M2J16k27K21k49J75
5138A1J62j32r7l9J43q5p8Q2J02j39J00P6j21kO8j08P7j44J35Mp0N9N5k05K6J26
5164Fj6j3O1K6Qk38K47o4j9M9p7j25K06j06N2o1k4Q4K25k09r8K19j59N2M9k39
5190a64J77p2l3J61j89J23mn8p9J18MrJ3Q4lm1Nj36J40k5Q4j78L2O1Q2J2q9j04
5218h8Q3k43K52J65r1k4j16rJ31j44J10m9J59n7p2L9k2J10o2j06n5J8J84j9l73
5243b79L71j67J27Ql7k7J48j08o2j03J61Plk9j45pJ14j34L8J70p1J93j39K4JJ
$$ plain form
5269 52 -62 121 -57 144 30 43 -19 -46 54 98 156 -10 40 73 -79 22 -117 -44 -107 -28 21 46 32 -4 51
5294 51 -17 -130 130 -96 85 117 48 -131 134 -197 -58 209 -108 44 83 -43 -71 -133 -80 -82 -24 2 -15 57 -84
5319 -84 60 -17 -56 57 115 41 -12 17 -14 -81 -19 48 94 59 19 36 -30 -53 -32 -112 -90 47 -103 14 119 -52 -8
5346 -8 -30 -59 137 50 -3 104 -157 22 -176 -21 14 132 25 -77 124 -125 91 -73 52 -64 39 216
5368 216 68 -131 -53 -152 -197 79 54 -80 -47 42 -78 47 -106 -133 64 18 18 -34 -149 -150 -106 92 140 72 85 28
5394 28 32 81 48 61 37 -42 -38 32 -57 20 -74 -179 -68 -49 -24 201 135 128 -117 21 -220 -43 -53 77 -29 200 -67
5421 -67 -181 -3 -119 24 -127 134 168 11 -50 -33 -61 -60 32 -10 38 -99 -35 -104 -79 54 20 94 -66 67 -26
5446 -26 9 -180 -46 -10 139 -32 2 124 -199 5 76 77 -34 -58 69 125 -58 91 -114 8 6 74 -87 140
$$ packed form
5269E2j14J83j78K01j14J3o2k7J00M4N8j66N0L3j52J01j39P3o3P9M9K5j4l6N5
5294E1o8j13K60k26J81L2o9j79K65l31J39K67l17J52L9j26k8o2N3kN8K6j7P2j41
5319h4J44p7l9J13N8p4n3K9l1o7O2O7M6l5m0J7o6k3K1q0K2J37j50J17J05j71M4
5346hk2k9J96q7n3J07k61J79j98J55L5J18j07j02K01k49K16j64J25j16J03J77
5368B16j48j99P8r9m5K76k5j34L3Q9j20J25j53k7J97m6%n2j15jM4J98M8o8J3n7
5394B8MM9l3J3k4p9MP0q9P7r4j05J11J9K5K25o6pk45J38k41J77j0J30j06K29k67
5421f7j14J78j16J43j51K61L4j57o1J7k8JR2m2M8j37O4o9K5J33l4P4j60J33r3
5446b6L5j89J34L6J49j71L4J22l23K04P1Jj11k4J27N6j83J49k05J22kO8j61K27
$$ plain form
5470 140 53 42 109 -118 -5 -124 8 111 4 28 -128 -4 -70 -11 -37 -13 43 -17 55 -17 24 -106 77 23 239
5495 239 -32 -90 -40 -130 23 28 116 185 121 13 -65 -123 29 61 37 -59 61 -32 -224 42 16 -136 110 74 46 -37
5521 -37 -92 18 -3 -60 59 -10 18 141 108 -25 -129 25 -19 -26 271 160 -26 95 -64 -85 1 -53 -156 133
5545 133 82 -13 35 -98 -25 42 53 23 -128 -138 -67 67 75 -80 34 155 60 -49 70 -10 69 53 58 -36 -48 -1 36
5572 36 144 -44 -67 42 83 -117 -74 56 147 -41 -122 -50 87 -67 -16 169 -2 -77 228 99 146 167 -240 -42
5596 -42 44 44 17 -80 -72 -130 -29 -14 -59 77 37 31 -22 -106 -132 -92 42 -116 -35 132 -14 -141 -76 -58 -118 -18 -214
5623 -214 16 -61 27 -108 -44 36 -31 -78 -2 -224 -34 28 -58 -39 -50 -161 -33 -25 -37 -3 -113 -177 5 7 44 206
5649 206 -23 -85 128 50 -113 -24 43 -1 -38 -62 -126 40 4 -58 -50 -104 -75 23 20 18 -135 184 -134 68 127 216 -82
$$ packed form
5470A40q7j1O7k27J13j19J32J03j07K4j56J24o6N9k6K4N6o0P2p2M1j30J83n4K16
5495B39k71n8N0r0J53NQ8O9o4j08p8n8J52L2k4r6J20r3j92K66k6j52K46l6k8q3
5521c7n5J10k1n7J19o9K8J23l3j33j04J54m4pK97j11j86J21j59k1Q6n4j03K89
5545A33n1r5M8j33P3O7J1l0j51j0P1J34Qj55J14J21r5j09J19q0P9j6Nr4j2M7L7
5572C6J08j88k3J09M1k00M3J30R1j88q1P2J37j54N1J85j71p5L05j29M7K1m07J98
5596d2Q6%k7r7Qn8J01J5m5J36m0on3q4k6M0J34j58Q1J67j46j27O5J8o0J00j96
5623b14K30p7Q8j35O4Q0o7m7P6k22J90O2q6J9j1j11J28Qj2L4j10o4J82KL7J62
5649B06k29o2K13p8j63Q9O7m4l7k4o4J66l6o2Qn4K9R8lkj53L19l18K02N9Q9k98
$$ plain form
5676 -82 -99 -10 -107 -54 189 166 209 -69 -97 9 -117 83 32 145 -101 25 -40 -91 -9 -56 -81 47 85 40 -17 8
5702 8 141 6 -36 43 -70 65 51 -97 -46 -1 -12 -30 30 -75 147 74 -81 -55 -115 -197 -51 19 79 -34 -12 7
5728 7 48 -94 83 45 -21 77 123 74 67 96 58 101 107 58 81 226 10 -39 91 -101 -115 -85 211 -14 41 -63 -38
5755 -38 36 91 -138 51 63 -120 -100 150 84 99 -48 -74 -189 -53 24 -102 72 -112 -73 -175 97 134 99 15
5779 15 39 -63 -83 68 181 -13 16 -108 -60 -129 7 -77 18 132 -50 85 -1 -90 -19 62 28 49 163 47 15
5804 15 32 1 -202 -73 89 180 3 42 164 39 -37 161 139 -46 28 -17 70 -61 159 97 18 -51 129 -143
5828 -143 67 -70 16 -32 125 -10 4 -8 -67 -102 73 27 -260 116 -10 128 -32 93 37 -23 -11 18 -3 27
5852 27 -68 -10 52 -59 25 -97 -51 -9 -15 114 15 -3 -16 53 46 -33 79 151 -18 44 10 -23 -99 33 9 47 24 32 75
$$ packed form
5676h2j7Q9r7N3K43k3M3k78k8J06j26K00n1J13k46J26o5n1Q2m7k5J28L8m5n7K5
5702HJ33j35m2P9j13J35j4j48N1M5j1j8O0j05K22p3j55K6o0q2J46P0O0j13K2J9
5728GM1j42J77l8o6R8M6m9pK9l8M3Om9K3J45k16m9J30j92j4L0K96k25N5j04K5
5755c8P4N5k29J89J2j83K0K50o6J5j47k6j15J36P7j26J74j84L9j02K72L7l5q4
5779A5K4j02k0J51J13j94K9j24M8o9J36q4R5J14j82J35q6q9P1Q1l4K1J14j16l2
5804A5J7l1k03J29J62R1j77L9J22j25p6J98k2j85P4m5Q7j31K20o2p9o9J80k72
5828a43K10j37Q6m8J57j35J4j2n9l5J75m6k87L76j26J38j60J25n6o0J2K9k1L0
5852B7r5N8O2j11Q4j22M6M2oJ29r9j8j3O9pp9J12P2j69O2l4l3p6J32k4L8k3QM3
$$ plain form
5881 75 -30 -8 -100 -75 -84 -28 11 16 -150 -82 -28 186 40 56 -42 -137 -133 -196 -51 -145 -58 -35 134 17 -45 7 12 -25 120
5910 120 18 48 18 26 117 -35 -1 -158 64 -159 -122 46 -113 229 13 -116 -299 12 7 -72 -141 -100 59 -45
5934 -45 -167 126 52 -67 68 -27 97 -42 -37 20 12 -21 -39 -58 -59 -40 -132 65 -127 -8 -112 173 193 -107 29
5959 29 190 -89 -135 165 -57 116 -30 -35 -76 -142 113 26 -104 -33 -115 11 -11 -61 -160 -56 155 -25 -73 -138 265
5984 265 -39 147 67 -94 125 48 -53 47 89 105 60 -76 -82 63 -116 -106 47 -31 -198 73 57 31 48 76
6008 76 38 113 101 -27 -8 -39 78 -72 25 106 -119 -87 6 161 86 104 82 -9 30 34 -29 41 86 -34 -142 44 -202
6035 -202 -112 -143 -82 66 -68 161 -10 69 48 56 39 -226 -35 -193 -56 52 -20 55 34 13 -105 -35 16 131 -123
6060 -123 22 -47 -83 -80 -62 -125 35 152 108 97 -143 25 -79 55 136 49 104 -27 -49 124 -25 -41 -13 18 -8
$$ packed form
5881G5j05K2r2K5rN6L9Nj66O8N4K14j46J6r8r5Mo3J45r4Q7K3J69j17o2N2Nl7J45
5910A20j02L0l0QR1j52L4j57K22k23L7J68j59L42k16j29j83L11np9o9M1J59j04
5934d5j22K93p4j19J35r5J24j39NN7ql3j8j9jJ9r2J97j92J19j04K85K0l00J36
5959B9J61k79m6L00k22J73j46nm1o6K55q7j30P1q2J26k2n0r9J04K11j80m8o5M03
5984B65l04J86q0j61K19p7j01J00M2J6m5j36oJ45j79J0J53p8j67K71j6k6J7K8
6008G6l8P5j2j28J9l1J17j50R7Q1k25L2R3J55p5J8k2r1L9Mo3P0M5j20j08J86k46
6035b02R0l1O1J48j34K29j71P9k1Qj7k65J91j58J37J08p2P5k1k1j18P0N1J15k54
6060a23J45o9l6LJ8o3J60J17m4j1k40J68j04J34Q1q7N5j31k2J73j49j6K8L1k6
$$ plain form
6085 -8 -27 50 79 14 15 -4 -77 122 -103 -136 -69 -65 22 -30 -114 152 92 185 127 -115 -119 -28 11 55 -31 1 -201 54 -46
6114 -46 97 14 160 -18 105 87 3 -122 -163 141 -101 110 50 -88 -89 -33 -62 -37 -38 -84 34 -53 18 85 -95 -50
6140 -50 105 71 1 -59 182 -2 -135 -77 -179 77 -33 -164 87 121 -56 -12 47 25 -50 -1 -41 -53 -102 -45 18
6165 18 -142 10 -160 -131 194 158 -21 -41 171 198 148 -29 -4 -78 0 204 0 -90 -177 40 51 -81 146 -83
6189 -83 61 -240 92 -166 87 29 -78 61 -61 -83 -87 25 186 4 -47 -75 19 -60 81 -108 -24 -13 15 -67
6213 -67 82 -91 -5 -195 -91 100 -18 -24 -52 140 -120 31 24 171 -69 52 21 125 1 21 6 -81 -60 -48
6237 -48 -14 25 92 28 -10 158 32 -129 -46 110 190 128 139 -118 -134 98 -139 -70 -11 70 -38 32 -24 -172 -8
6262 -8 -27 103 -48 -140 -126 53 -58 13 -10 96 75 150 -3 21 -87 10 155 -57 -84 -23 -8 121 190 -59 79
$$ packed form
6085hj9P7K9o5Jj9p3J99k25l3O7MQ7n2q4K66o0R3n8k42mR1L9M4q6L2k02K55j00
6114d6J43q3J46j78J23j8q4j25m1L04k42K11o0j38jN6k9K5jm6J18q7P1O7j80M5
6140e0J55l4p0o0K41j84j33N8j02K56j10j31K51L4j77M4N9k2p5M9m0j2m9N7O3
6165A8j60J52j70K9L25l6j79k0K12K7n0j77K5p4P8K04k04r0q7K17J1j32K27k29
6189h3J44l01L32k58K53n8j07J39j22k2mJ12J61j82n1k8R4p9J41j89Q4J1K8q2
6213f7J49j73Q6j90J04J91j18ok8J92k60J51pJ47k40J21l1J04j24K0j5q7K1J2
6237d8L4L9O7o4l8J68j26j61Q3J56Q0o2J1k57j6K32k37O9N9Q1j08P0n6j48J64
6262hj9J30j51r2J4J79j11P1k3J06k1P5j53K4j08R7J45k12k7O1J5J29O9k49J38
$$ plain form
6287 79 -35 -58 -33 192 -50 67 172 37 -12 70 -40 -44 93 21 -112 59 -6 -53 77 9 147 -56 25 -106
6311 -106 -44 -49 20 37 94 39 32 -58 -116 -37 73 54 -110 26 -84 -11 -13 107 58 -47 37 -64 30 49 17 73 -119
6338 -119 -125 -170 -59 65 -36 14 -146 -76 179 85 -90 26 -26 141 14 48 51 -16 0 -129 61 107 46 29 -16
6363 -16 -1 -17 -18 88 -48 197 29 74 -43 -16 -31 33 133 -35 5 15 -156 -151 11 -133 66 -50 -88 -15 85
6388 85 44 -109 96 78 105 50 66 -23 -69 174 -114 -139 14 -10 30 18 -8 -47 89 -63 35 10 113 50 -22 62
6414 62 130 -64 90 -46 82 45 -69 151 76 -104 140 -33 44 199 105 -4 -215 36 8 158 -83 52
6436 52 -100 -143 -34 -55 14 -260 -56 113 -104 23 130 -64 -100 4 11 30 84 -53 93 152 -134 -17 63 168
6460 168 20 138 54 -76 13 54 -204 -46 195 84 -59 101 -29 41 235 -216 12 -140 52 -21 -87 -153
$$ packed form
6287G9j14k3K5K25k42J17J05j35m9Q2j10mJ37p2j33J71o5m7J30o8J38k03Q1j31
6311a06O2nO9J7N7n5pr0n8P9J10j9j64J36j10P3kJ20m9j05Q4j01R4J9l2N6j92
6338a19om5J11J24j01N0j60P0K55r4j75J16n2J67j27L4Lo7J6j29J90M6o1j7m5
6363a6J5j6jJ06j36K45j68M5j17K7j5O4J00j68M0J0j71NJ62j44J99j16l8P3J00
6388H5m1j53K05j8K7n5J6q9m6K43k88k5J53k4M0j2k6l9J36j52R8k5J03o3p2Q4
6414F2O8j94J54j36J28l7j14K20p5j80K44j73P7J55r4j09k11K51k8J50k41J35
6436E2j52m3J09k1O9k74K04J69k17J27J07j94l6J04PJ9N4j37J46N9k86J17Q0J05
6460A68j48J18q4j30Q9M1k58J58K41j11j43J60j30P0J94m51K28j52J92p3o6o6
$$ plain form
6482 -153 -58 -288 -34 -45 41 -17 112 1 -128 20 -142 41 30 -91 -98 -116 -76 48 144 -51 245 -124 27
6505 27 2 12 -58 82 -169 -96 22 -106 -31 -165 -86 -87 103 67 79 -19 34 -50 -31 -181 -40 -39 -13 -119 -85 -103 86
6532 86 -36 116 -70 38 -101 221 -99 34 -64 -14 123 36 109 -68 -90 64 64 -20 -1 -1 -84 -88 -103 49 47 -102
6558 -102 103 15 141 218 99 183 -86 10 -3 -48 66 -91 -32 34 -51 34 68 0 76 128 -2 -21 -68 -9 136 -2
6584 -2 -79 7 36 -16 -109 11 -13 33 2 -20 20 43 165 -29 -148 142 -103 -121 -141 -124 39 25 139 -12 38 -203
6610 -203 -70 -19 -18 25 -132 160 98 -92 -145 -4 12 30 -31 -3 -25 -16 172 104 8 8 126 -90 37 5 -30 -83 42
6637 42 97 -49 107 76 -172 46 41 67 -52 93 50 77 10 -201 -21 -11 -25 -97 104 56 -10 -26 -54 -21 -108 55
6663 55 72 81 -22 -45 -23 -86 -71 -96 -160 -3 65 -25 8 -191 119 -24 67 -74 -9 -168 -18 118 17 8 9 -23 84
$$ packed form
6482a53R5k30K54j1Q6n8J29j11j29J48j62J83j1j21pj8M0J24R6j95K96l69J51
6505B7k5J0p0J40k51P3J18j28P5j34P9jJ90l6J2r8N3q4J9j50J41JK6j06L4j8J89
6532H6j22J52j86J08j39L22l20J33r8N0J37q7P3j77k2J54%q4J9%q3mj5J52kj49
6558a02K05q8J26P7j19Q4k69R6j3m5J14j57N9O6q5Q5L4o8P6N2j30j9m7N9J45j38
6584bp7Q6K9n2r3J20k4M6l1k2M0K3J22j94j19K90k45j8k0J7J63j4J14j51N0k41
6610b03J33N1JM3j57K92o2j90n3J41J6J8o1K8k2RJ88o8r6%J18k16J27l2l5n3J25
6637D2N5j46J56l1k48K18nK6j19J45m3K7o7k11J80J0j4p2K01m8o6j6k8L3q7J63
6663E5J7Rj03k3K2o3J5k5o4J57O8r0L3j99L10j43R1j41O5j59J50J36j01rJl2J07
$$ plain form
6690 84 -82 -87 24 -11 46 26 -13 99 88 -86 23 -56 78 -75 23 -4 -141 -58 105 -213 -108 66 -235 -41
6714 -41 83 64 172 -8 71 22 86 -26 -21 60 -44 142 -109 -6 -122 -50 41 -17 -42 185 180 14 165 21 30
6739 30 150 68 115 -25 -43 -10 149 19 62 89 75 -2 -32 -133 36 66 28 -17 53 -51 11 79 -43 57 24 46
6765 46 -136 0 -15 34 -18 128 -33 4 98 -20 27 -6 -18 155 -149 -46 -105 -8 108 105 -126 16 -87 87
6789 87 -5 -109 28 -49 53 31 9 -23 104 -30 72 -116 -62 91 -28 -42 32 28 -30 5 -7 -3 -21 -12 -29 129 -12
6816 -12 -83 0 29 -50 29 41 -21 90 87 -6 21 -138 59 -114 -110 88 32 -96 41 20 -140 -44 129 -37 30 63
6842 63 -31 -54 -250 -145 -140 -21 -139 -164 93 3 -46 26 -9 2 19 81 4 165 106 -29 93 -112 -48 -29 -104 -85
6868 -85 -19 -34 25 77 -22 28 -80 47 -14 140 95 56 -48 -216 -72 66 142 -1 -54 -32 158 -140 29 -135
$$ packed form
6690H4j66nJ11l5N7k0l9J12j1j74J09p9J34j53R8k7j37Q3J63l18J05J74l01J94
6714d1J24j9J08j80P9m9O4j12NQ1j04J86k51J03j16P2R1n8k5K27nj66J51j44R
6739C0J20q2M7j40j8L3J59j30M3K7j4p7l0j01J69L0l8m5P0j04O2O8j22J00l3K2
6765D6j82J36j5M9n2J46j61L7R4j18M7l3j2J73l04J03n9R7J16lk31J42j03J74
6789H7r2j04J37p7J02k2k2l2J27j34J02j88N4J53j19j4P4mn8L5j2Mj8Rj7J58j41
6816a2p1Q3K9p9P9J2o2J11lr3K7j59J97j73MJ98n6j28J37k1j60R6J73j66O7L3
6842F3r4k3j96J05NJ19j18k5K57r0m9P2l5J1J7O2p7J61n9j35J22k05O4J9p5J9
6868h5O6j5N9N2r9N0j08J27o1J54m5l9j04j68J44J38P6j43n3K2J90k98J69j64
$$ plain form
6892 -135 -78 57 -32 -27 5 -70 -164 94 -140 127 -122 262 -133 35 86 -23 11 15 2 116 -177 82 -13 -110 89
6917 89 200 87 125 -59 -26 -88 -101 156 71 -119 54 74 -55 29 -93 99 11 61 -177 35 9 15 -185 -60
6941 -60 14 15 -15 110 -77 -150 -90 -104 10 -111 82 71 27 358 11 4 48 -61 -81 -36 -59 181 221 65 61 -187
6967 -187 15 1 47 19 -9 -28 -27 9 -49 -36 -24 -59 -7 96 7 53 49 125 -130 -3 5 -142 80 -6 -86 44 -103
6994 -103 59 15 -103 2 20 -73 -52 -94 14 68 -19 2 -57 22 10 -12 51 -115 -4 -60 90 -48 -33 -34 -148 -8
7020 -8 -10 -259 -10 45 -57 -81 115 81 17 -44 52 -79 21 -53 24 -52 87 32 111 109 23 -63 -74 71 120 35 -56 -88
7048 -88 -22 136 129 162 102 -3 36 -120 -4 -5 -15 -135 1 49 -76 -45 -175 -16 -33 110 156 155 111 2 -32 60
7074 60 -101 87 -5 -23 -42 68 43 -13 88 -80 84 -97 -122 166 34 18 -48 57 15 -82 -90 49 27 21 62 108
$$ packed form
6892a35N7J35q9NL2p5r4K58k34K67k49L84l95J68N1j09L4Mj3J14k93K59r5r7J99
6917H9J11j13L8j84L3o2j3K57q5j90J73K0j29Q4j22J92q8N0k38K12k6Ok00J25
6941f0P4Jl0J25j87p3O0j4J14j21J93j1m4L31l47pM4j09k0M5k3K40M0j56mk48
6967a87K02j4M6k8k8j9JL6n8J3J2l5N2J03q9M6mP6k55J27Qj47K22q6q0J30j47
6994a03J62m4j18J05J8r3K1m2J08N4q7K1n9P9j2k2O3j66J11n6J50j38J5jj14J40
7020hkk49K49N5j02k4J96l4o4o1R6j31J00p4P7p6J39n5P9kq6q6j1J45M9q5r1l2
7048h8O6J58pL3o0j05L9j56J16jj0j20J36M8j25L1j30J59j7J43M6jm4j09l4R2
7074F0j61J88r2j8j9J10k5n6J01j68J64j81k5K88j32j6o6J05m2r7qJ39k2oM1M6
$$ plain form
7100 108 -121 27 54 57 -41 -27 51 64 46 -123 -120 164 -52 -104 119 83 -92 56 53 -13 -113 60 119 -30 -146
7125 -146 159 -70 -105 41 -46 47 112 78 -92 19 -184 54 29 -9 29 -6 -38 -98 -36 -27 146 63 -15 -21 109 -32
7151 -32 -22 -82 147 106 62 30 -47 -41 -153 -30 -52 65 -60 3 189 -8 2 -36 29 -27 -131 74 -43 95 -242
7176 -242 50 53 -104 -124 44 207 -119 -81 80 147 73 43 119 -91 53 -95 -13 -71 103 -54 237 120 90 47
7200 47 -73 -138 54 5 -56 167 -22 -63 32 -161 -21 82 -16 -97 -42 -68 118 -28 -44 -4 59 -91 -43 125 -2
7225 -2 20 -44 18 -138 -40 -63 -28 -13 -60 74 81 -46 -251 60 -36 -181 18 131 -17 -24 90 94 54 -109 -39 62
7251 62 35 -35 71 75 109 98 130 212 233 -78 -71 90 65 59 -56 84 -77 92 -46 64 37 -134 106 -75 -135 -79
7277 -79 -128 -80 -47 -19 87 -14 -13 39 13 -67 64 -77 -39 -57 84 202 -1 -1 -90 -70 -5 -94 15 -101 42 84
$$ packed form
7100A08k29J48K7Lr8J4P8J3j8j69LK84k16n2K23l6j75J48lo6j00J73N9j49j16
7125a46L05k29l5J46q7R3O5l4j70J11k03K38k5l8L8l5l2o0O2RJ73q3p8oJ30j41
7151c2J0o0K29m1m4l2p7Oj12J23k2J17j25O3J86j97J0l8O5n6j04K05j17J38l37
7176b42K92Lj57k0J68J63l26L8J61O7p4l0P6k10J44j48Q2n8J74j57K91j17l0m3
7200D7j20o5J92m9o1K23j89m1R5j93J40J03r8q1N5k6J86j46j6M0O3j50M8J68j27
7225bK2o4O2j56R8k3L5J5m7J34Pj27k05L11r6j45J99J13j48pJ14Mm0j63P0J01
7251F2k7p0J06ML4j1L2Q2K1l11PJ61k5oj15J40j61J69j38J10k7j71K40j81o0N6
7277g9m9M8L3K8J06j01JN2k6q0J31j41L8j8J41J18k03%q9K0O5q9J09j16J43M2
$$ plain form
7303 84 -58 371 121 -15 -143 -34 12 51 -55 58 44 -27 -136 -36 -53 38 209 -52 -168 -62 -21 -19 48 -70
7327 -70 162 -91 11 -48 96 7 162 -45 143 -3 -74 -28 92 -59 52 -124 -63 187 -87 133 50 -35 6
7350 6 -14 61 -30 -83 19 5 -35 143 144 -73 -168 54 -91 -115 56 94 38 14 180 -110 173 -83 -96 -173 -63 57
7376 57 1 37 156 -192 -84 6 -12 35 119 -103 -5 -122 50 59 30 -64 -17 -274 -111 51 89 -138 -28 40 25
7401 25 5 -154 85 -19 46 -18 -73 13 -166 -28 -14 42 -116 -143 -18 -100 65 5 168 67 8 -39 -8 84 35
7426 35 49 154 -49 18 -49 142 21 175 -33 -54 84 -85 71 -34 135 -73 -131 -85 -9 -44 -98 111 -260
7449 -260 -226 2 -84 -10 -36 -125 52 -12 -69 -65 -93 -82 20 92 4 17 59 -79 -17 -43 22 68 28 39 -191 133 29
7476 29 53 114 -91 -18 117 59 -13 -123 5 -62 -75 81 -16 48 -40 139 -60 42 93 -29 163 28 64 -76
$$ packed form
7303H4j42M29k50j36j28J09M6L9j06J13j4p1j09J00j7R1J71k61j16J06M1KO7j18
7327g0K32k53J02n9J44q9J55k07J88j46p1M6J20j51J11j76O1K50k74K20q3q5M1
7350Fk0P5r1n3J02j4m0J78Jk17r5K22j45k4J71L8n6k4J66k90K83k56j3p7J10J20
7376E7n6L6J19l48J08R0j8M7Q4k22R8j17J72Rk9r4M7k57J63J62L8k27J10O8j5
7401B5k0j59K39j04O5o4n5Q6j79J38J4N6j58k7J25q2J65o0J63j01n9m7L1R2m9
7426C5J4J05k03O7o7J91j21J54k08k1J38j69J56j05J69k08n8M6P6l5n4K09l71
7449b60L4K28q6P4k6q9J77o4n7Mk8J1J02P2q8J3M2j38O2k6O5M6m0J1k30L24j04
7476B9K4O1k05P3J35n8p2j10J28o7j3J56r7O4q8J79j99J02N1j22J92j35L6j40
$$ plain form
7500 -76 -60 97 -2 -55 34 -50 -139 -95 -125 -33 -30 -155 -29 -19 91 -45 -139 -13 -3 -29 -57 -8 -34 72 92 -44 -13
7527 -13 -77 -82 11 -53 -100 22 -26 48 62 23 -19 -126 -170 0 -36 61 -42 223 -34 141 67 -95 92 -48 -8 -133
7553 -133 95 -61 -227 98 109 4 -22 -41 -82 44 -57 -55 36 19 102 -95 2 2 -55 -125 31 56 -176 -112 66
7578 66 99 -20 -77 -114 -63 20 -23 -43 46 132 25 -75 166 122 146 -36 -12 -17 48 48 119 -18 -257 17 -3 -52 -13
7605 -13 -41 -22 -4 -104 13 -55 -41 21 -153 -151 74 92 13 -8 -128 0 -96 99 142 -74 -5 68 99 57 -32 -3 55
7632 55 137 -19 -31 122 -69 20 88 1 35 -40 67 14 -14 64 52 75 -28 -61 -21 -17 190 -39 150 -61 4 73
7658 73 -33 42 12 -84 -94 12 21 121 8 11 42 -66 103 -178 -75 -38 124 23 17 20 39 0 124 -45 -131 -22
7684 -22 -25 12 26 48 4 -180 48 -80 -11 -69 -6 33 -22 82 103 108 -85 112 30 -16 -281 33 74 -39 -77 -9 -96
$$ packed form
7500g6J6J57r9n3Q9q4q9M4l0R2Lj25J26J0J10j36r4J26J0k6k8M9k6J06K0j36L1
7527a3o4nR3o4m7J22m8P4J4l9m2j07m4J70l6R7j03K65k57J75p4j62J87j40M0j25
7553a33K28j56j66L25J1j05k6j9m1J26j01KR1j7Q3j97R7%n7p0J56K5k32O4J78
7578F6L3j19n7l7N1Q3m3k0Q9Q6j07j00K41m4K4j82K4nO5%P1j37k39K74k0m9L9
7605a3k8J9J8j00J17o8J4O2j74KK25J8p9k1j20J28r6J95M3k16O9P3L1m2q9K9N8
7632E5Q2j56j2J53j91Q9O8q7L4p5J07n3k8P8j2K3j03l3M0MK07k29J89k11O5O9
7658G3j06P5l0r6j0J06RJ00j13LL1j08J69k81J03L7J62j01oLJ9l9J24j69q6J09
7684b2lL7J4K2m4j84K28j28O9n8O3L9n5J04K1Nj93J97q2m6k65L14M1j13l8O8q7
$$ plain form
7711 -96 61 180 -172 3 -53 164 -179 -25 155 -114 -53 -75 70 69 -66 -6 11 142 32 -50 -28 36 22 -119
7735 -119 -37 102 -120 121 127 -163 -15 87 -178 37 -43 88 -139 87 170 63 191 -31 -47 -79 -44 -66 -45
7758 -45 3 3 -17 71 110 -45 -9 82 22 0 -58 25 55 59 -49 41 -25 -187 -30 64 -38 96 71 -87 23 176 16
7785 16 -37 103 -20 87 -116 2 120 15 -27 -36 -4 -46 -159 -50 5 128 -67 -175 55 91 -100 67 72 91
7809 91 31 -118 -12 -62 129 139 180 -166 45 69 -173 -76 -73 -5 -238 -133 -33 38 -76 138 69 12 -45 82 30
7834 30 -7 -57 50 74 105 -61 -94 82 232 63 52 67 70 78 -17 6 -39 -18 -48 -3 -29 -22 -37 -153 63 2 -103 77
7862 77 28 153 50 -118 35 98 -123 -76 95 44 73 -12 24 136 -29 35 -50 -80 -51 -261 92 107 91 -93 106
7887 106 38 125 2 24 -161 -145 -16 22 99 2 140 19 -67 36 4 71 -22 110 108 -36 -39 162 -66 6 209
$$ packed form
7711i6J57J19l52J75n6K17l43J54J80k69O1k2J45jj35O0J7J31j10q2K2O4j4j41
7735a19Q2J39k22K41Ok90J48J02k65K15q0J31k27K26Q3j07J28k22j6l2L5k2K1
7758d5M8%k0Q8L9j55L6R1o0k2n8Q3L0Mj08R0o6j62J57R4j02J34k5j58J10J53j60
7785A6n3J40j23J07k03J18J18j05m2rL2m2j13J09N5J23j95j08K30L6j91J67NJ9
7809I1o0j49J06n0J91J0M1l46K11K4k42R7LO8k33J05J00P1j14K14o9n7n7J27n2
7834C0l7n0J07K4L1j66l3J76J50j69j1J5LQr5K3m5K1l0M5k6Pj5j16K16o1j05J80
7862G7m9J25j03j68J53O3k21M7J71n1K9q5L6J12j65O4q5l0K9k10L53J5j6j84J99
7887A06o8Q7j23K2j85J6J29L8P7r7J38j21q6J03l2O7r3J32kj44lK01k28P2K03
$$ plain form
7912 209 45 -112 -101 53 -21 -56 -62 -149 94 244 36 -151 -26 -52 57 -212 -29 7 39 -53 29 24 4 11 -119
7937 -119 -53 48 43 76 -27 42 41 2 224 19 9 -20 11 120 76 -63 -122 -87 -16 29 -66 -32 214 -70 -135 -57 -18
7964 -18 91 -150 39 15 -77 -54 81 -74 -208 4 -74 98 -20 9 -142 -195 -20 32 29 -165 -201 -85 4 100
7988 100 -71 23 -127 54 0 -4 22 21 -51 133 -15 18 -96 90 -65 99 -46 -60 40 133 141 36 -37 35 -13
8013 -13 -176 79 41 87 -190 44 78 -13 186 13 116 45 115 13 -125 -153 -7 -18 197 -65 -40 41 113 89
8037 89 73 134 -35 -156 86 -64 16 -13 5 9 -156 -12 12 -107 -55 62 -75 5 -106 88 60 107 39 27 -127
8062 -127 -30 156 48 124 161 19 142 -121 23 -44 48 92 143 -1 50 -174 70 87 12 125 113 149 36 -98
8086 -98 -130 19 -90 70 -195 -35 -149 -69 -90 4 -104 -77 -39 -66 -4 -63 41 -14 -19 80 -259 7 31 158 -51
$$ packed form
7912B09j64j57J1J54p4l5oq7K43J50k08j87J25k6J09k69J83L6L2r2Q2nk0Pj30
7937a19O6J01nL3j03O9jl9K22k05j0k9L1J09m4j39n9L5P1M5r5L4K46k84o5P8L9
7964a8J09k41J89k4r2K3J35j55j34K12p8J72j18K9j51n3J75N2lj94l6J16Q9R6
7988A00j71R4j50J81n4mK6jp2J84j48L3j14J86j55J64j45j4J00R3Qj05p3P2m8
8013a3j63K55l8M6k77K34L4r1J99j73J03p1P0j02j38k8J46j1K15k62K5Q1P2k4
8037H9j6O1j69j21K42j50Q0k9J8Mj65J44K4j19N2J17j37Q0j11J94k8M7o8j2j54
8062a27R7J86j08P6L7j42J23k63J44o7R2M4N1j44N1k24K44J7p5J13j2L6j13j34
8086i8l2J49j09J60k65J60j14Q0k1R4j08K7L8k7O2n9J04n5nR9l39K66K4J27k09
$$ plain form
8111 -51 63 -81 151 40 -38 38 -40 -73 -134 131 -18 80 37 -98 -63 -124 -179 34 40 98 107 -40 -28 146 -51 -3
8137 -3 -204 -8 5 94 47 76 -23 -52 -14 32 20 -73 -122 -255 -139 -58 -97 -100 201 53 36 -53 105 -13 84 95 -12
8164 -12 -116 198 -49 57 94 -78 155 -90 29 -235 57 23 32 -37 -106 51 -165 -82 139 39 -105 -36 -230
8187 -230 -43 38 167 -82
$$ packed form
8111e1J14j44K32j11p8P6p8l3o1K65j49R8m3j35L5o1n5K13ON8Rj47J2J74j97M8
8137ck01J96J3Q9m7K9r9k9L8M6j2r3m9j33J16Q1l9lL01j48j7q9J58j18R7J1j07
8164a2j04L14k47J06L7j72K33k45J19k64K92l4Ro9o9J57k16Q3K21j00j44O9j94
8187b30J87Q1J29k49
8191h2
$$ Imaginary data points
##PAGE= N=2
##DATA TABLE= (X++(I..I)), XYDATA
$$ plain form
0 0 0 0 0 0 0 0 0 0 0 0 0 0 0 0 0 0 0 0 0 0 0 0 0 -1 7 -8 8 -8 8 -8 9 -11 15 -16 16 -18 23 -25 27 -31 34 -38 42 -47 52
45 52 -57 64 -72 77 -85 93 -104 113 -126 140 -155 172 -190 213 -239 272 -310 360 -424 514 -640
66 -640 846 -1231 2225 -13862 -11551 2339 8219 12569 7452 378 -8109 -10853 -8399 -385 7165
81 7165 11733 9359 2839 -5956 -11052 -11085 -4954 3373 9579 10786 6427 -1475 -8040 -10409 -6938 178
97 178 7229 10556 8336 1564 -5551 -10270 -9027 -3580 3862 8757 9291 4658 -2267 -7996 -9317 -5772
113 -5772 597 6886 9342 7206 1273 -5459 -9000 -7925 -2710 3586 8053 8121 3869 -2423 -7268 -8357
129 -8357 -4913 809 6326 8413 6130 878 -4926 -7985 -6942 -2283 3432 7061 6986 3407 -2041 -6334
145 -6334 -6977 -4129 967 5370 7194 5204 675 -4341 -6783 -5922 -2146 2786 6149 6084 2824 -1609
$$ packed form
0@%%%%%%%%%%%%%%%%%%%%%%%jQj5J6j6J6j6J7k0K6l1L2l4M1m8N2n8O5p2Q0q9R9
45E2j09J21j36J49j62J78j97K17k39K66k95L27l62M03m52N11n82O70p84R38j154
66f40J486k077L456j6087K311J3890N880M350n117p074q487k744K454Q014P550
81G165M568k374o520q795n096l3O131Q327O206J207m359p902o565k369L471P116
97A78P051L327k220o772p115m719J243N447P442M895N34m633o925n729j321L545
113e772O369O289K456k136n933o732l541J075N215O296M467O8m252o292m845j089
129h357L444N722N517K087k283n252n804l059J043M659N715L629p5l579n448m293
145f334o43K848N096M403J824j990m529n016k442Q61L776M932L363o5l260m433
$$ plain form
161 -1609 -5253 -6139 -3684 682 4615 6351 4629 686 -3315 -5680 -5394 -2061 2359 5109 5325 2831
177 2831 -1137 -4422 -5551 -3511 162 3877 5509 4286 1075 -2728 -5100 -4948 -2143 1576 4312
192 4312 5034 2844 -840 -3934 -5138 -3599 -320 3131 5037 4211 1451 -1968 -4456 -4437 -2284 1231
208 1231 4013 4407 2937 -379 -3341 -4556 -3711 -721 2372 4339 4062 1670 -1358 -3732 -4116 -2461
224 -2461 651 3340 4277 2994 164 -2698 -4121 -3638 -1194 1992 4000 3976 2013 -1139 -3577 -4187
240 -4187 -2601 306 3237 4183 3079 419 -2471 -4000 -3759 -1471 1789 3718 3963 2208 -740 -3180
256 -3180 -4171 -2718 -67 2783 3960 3201 856 -2120 -3694 -3466 -1478 1219 3481 3742 1967 -570
272 -570 -2971 -3718 -2622 31 2392 3696 3040 1031 -1851 -3642 -3652 -1742 1047 3267 3602 2257 -331
$$ packed form
161a609l644q86K455M366L933J736j722l943m001k365K86L333M420K750K16k494
177B831l968l285j129K040L673L715J632j223l211l803k372J52K805L719K736
192D312P22k190l684l094j204J539L279L451J906q26k760l419k488J9K153L515
208A231K782L94j470l316k962j215Q45K990L093J967k77k392l028k374l84J655
224b461L112K689R37j283k830k862j423M83K444L186K008k4j963l152k438o10
240d187J586K907K931R46j104k660k890j529K41K288L260J929K45j755k948k440
256c180r91J453K651K850J177p59k345k976j574K28J988K697K262K61j775k537
272e70k401p47J096K653K361J304o56k009k882j791j0J910K789K220L35j345k588
$$ plain form
289 -331 -2604 -3374 -2651 -367 2198 3574 2794 893 -1514 -3132 -3416 -1766 832 2729 3479 2332 -78
306 -78 -2339 -3315 -2464 -396 1856 3183 2845 1332 -1352 -2852 -3077 -1813 792 2545 3053 2199 106
323 106 -2131 -3030 -2501 -768 1479 2981 2871 1333 -747 -2616 -2944 -1967 104 2174 2812 2129 449
340 449 -1676 -2753 -2639 -975 1251 2666 2787 1395 -370 -2237 -2952 -1964 -162 1738 2781 2225 632
357 632 -1476 -2603 -2561 -1119 686 2408 2973 1737 -207 -1915 -2818 -2241 -415 1642 2642 2499 968
374 968 -1112 -2424 -2560 -1472 408 2177 2666 1968 118 -1965 -2893 -2428 -563 1393 2694 2433 1107
391 1107 -759 -2526 -2696 -1624 291 2142 2688 2106 421 -1653 -2861 -2183 -922 1168 2573 2566 1462
408 1462 -600 -2324 -2833 -1665 4 1933 2794 2059 469 -1541 -2601 -2474 -695 983 2310 2562
$$ packed form
289c31k273p70P23K284K565J376p80j901k407j618k84J650K598J897P50j147k410
306g8k261r76Q51K068K252J327l38j513k684j500k25J264K605J753N08q54k093
323A06k237q99N29J733K247J502j10j538k080j869l28R77K071K070O38o83j680
340D49k125j077J14J664K226J415J21j392j765j867p15R88J802J900J043n56j593
357F32k108j127M2J442J805J722N65j236j944j708r03N77J826K057J000j43j531
374I68k080j312j36J088J880J769M89o98j850k083r28M65J865J956J301k61j326
391A107j866j767j70J072J915J851N46n82j685k074j208O78J261K090J405pj104
408A462k062j724n09J168J669J929Q61p35j590k010j060J27J779J678J327K52
$$ plain form
424 2562 1559 -556 -2333 -2805 -1844 -26 2031 2926 2361 469 -1557 -2684 -2560 -857 1188 2646
440 2646 2598 1562 -461 -2290 -2866 -2025 -31 1785 2751 2209 596 -1478 -2726 -2460 -1031 1057 2448
457 2448 2686 1554 -472 -2135 -2822 -1853 -195 1738 2620 2050 656 -1216 -2638 -2392 -951 882 2288
474 2288 2382 1452 -331 -2087 -2534 -1711 -121 1662 2501 2147 590 -1310 -2269 -2436 -1054 886 2238
491 2238 2477 1409 -389 -1984 -2574 -1580 -101 1632 2344 1976 663 -1314 -2175 -2266 -989 708 1916
508 1916 2187 1357 -181 -1741 -2247 -1702 -86 1336 2149 1912 789 -913 -1815 -1993 -977 513 1788
525 1788 2256 1353 -92 -1469 -2106 -1386 -300 1163 1962 1652 629 -847 -1663 -1998 -1002 410 1355 1873
543 1873 1370 78 -1255 -2000 -1462 -249 1015 1927 1673 707 -724 -1681 -1826 -1007 184 1395 1865 1378
$$ packed form
424B562j003k115j777m72R61J818K057Q95n65j892k026j127J24J703K045J458
440B646m8j036k023j829n76Q41J994J816R66n42j613k074j248K66J429K088J391
457B448K38j132k026j663o87R69J658J933Q82n70j394j872j422K46J441J833J406
474B288R4r30j783j756m47Q23J590J783Q39l54j557j900r59j67J382J940J352
491B238K39j068j798j595n90R94J479J733P12l68j313j977q61r1J277J697J208
508A916K71q30j538j560n06N45J616J422Q13k37j123j702r02j78J016J490J275
525A788M68r03j445j377o37P20J086J463P99l10j023j476q16l35R96J412R45N18
543A873n03j292j333p45N38J213J264R12k54r66j431r57j45Q19J191J211M70m87
$$ plain form
561 1378 310 -1251 -1901 -1408 -365 847 1523 1749 801 -386 -1443 -1904 -1118 90 1127 1785 1443
578 1443 329 -1005 -1549 -1340 -576 477 1513 1601 978 -244 -1115 -1697 -1229 -82 1084 1673 1323 341
596 341 -810 -1561 -1623 -616 319 1412 1511 1108 100 -1201 -1531 -1347 -223 809 1596 1568 770 -665 -1556
615 -1556 -1704 -893 261 1199 1638 1091 -98 -1227 -1777 -1324 -384 1038 1478 1348 572 -528 -1391 -1578
633 -1578 -877 166 1245 1602 1020 223 -858 -1582 -1212 -445 802 1583 1380 617 -529 -1319 -1538 -975
651 -975 129 1209 1446 1093 217 -817 -1642 -1279 -447 545 1436 1603 703 -330 -1321 -1565 -821 -90 1161
670 1161 1474 1245 72 -685 -1425 -1303 -608 506 1278 1392 733 -207 -1105 -1440 -1127 -62 830 1505 1235
689 1235 277 -542 -1530 -1395 -632 426 1318 1478 851 -217 -1232 -1369 -1138 -215 1004 1427 1265 436 -525
$$ packed form
561A378j068j561o50M93J043J212O76K26r48j187j057m61P86J208J037O58l42
578A443j114j334n44K09P64J053J036Q8o23j222q71n82M68J147J166N89l50r82
596C41j151p51o2J007R35J093R9m03j008j301l30J84J124J032P87k8p98j435q91
615a556j48Q11J154R38M39n47j189j129n50M53R40J422M40j30p76j100q63j87
633a578P01J043J079L57n82p97j081p24L70P67J247P81k03p63j146p90k19N63
651i75J104J080K37l53q76j034q25L63Q32R92Q91J67r00j033r91k44P44P31J251
670A161L13k29j173p57p40J22O95J114P72J14o59r40q98l35L13J065Q92O75k70
689A235r58q19r88J35P63J058Q92J60o27j068j015j37K31R23J219M23j62q29r61
$$ plain form
708 -525 -1231 -1274 -640 354 1314 1321 779 -210 -868 -1373 -972 -255 800 1439 1192 379 -543 -1151 -1329 -613 198
729 198 988 1504 902 58 -916 -1358 -1080 -287 511 1338 1151 507 -429 -1189 -1464 -666 119 1023 1258 1047
749 1047 90 -721 -1470 -1332 -246 415 1265 1083 656 -1 -1243 -1384 -936 -90 911 1394 1006 283 -677
768 -677 -1188 -1283 -537 568 1149 1420 832 -110 -943 -1227 -830 192 801 1285 1054 448 -605 -1151 -1103 -507
788 -507 398 982 1344 797 -148 -1238 -1471 -905 109 868 1270 1056 239 -783 -1217 -1308 -708 417 1185
807 1185 1302 961 -169 -1005 -1180 -864 -246 831 1147 1060 241 -588 -1186 -1255 -629 327 1034 1310 788 -214
827 -214 -1051 -1358 -1076 -181 721 1280 992 275 -544 -1402 -901 -540 432 1078 1301 768 -127 -806 -1298 -889
847 -889 22 893 1260 1014 341 -632 -965 -1249 -540 348 1009 1226 690 -102 -895 -1340 -966 -97 710 1086
$$ packed form
708e25p06m3O34R94R60Pn42r89o58n05M01P17J055O39k47q13r22o08j78P16Q11
729A98P90N16o02q44r74m42K78P93P98Q27j87o44r36p60k75P98P85R04K35k11
749A047r57q11p49J38J086O61Q50j82m27o57j242j41M48Q46J001M83l88p23r60
768f77n11r5P46J105N81K71n88r42q33k84L97J022O09M84k31o06j053n46M8N96
788e07R05N84L62n47r45j090k33N66J014P59M02k14q17j022m34r1O00J125P68
807A185J17l41j130q36j75L16O18J077L16q7q19q29n98o9O26R56P07K76n22j002
827b14q37l07K82Q95R02N59k88p17q19q58N01L61R72O46K23n33q95o79m92M09
847h89R11Q71L67k46o73r73l33k84P09Q88O61K17n36p92p93m45L74Q69Q07L76
$$ plain form
867 1086 933 528 -427 -1281 -1118 -497 331 844 1040 866 29 -744 -1128 -771 -191 696 943 941 421 -399 -979
888 -979 -993 -579 213 884 949 790 -64 -680 -909 -661 -166 531 1001 882 445 -333 -865 -961 -511 188 793
909 793 1031 655 -48 -706 -880 -899 -252 510 869 788 356 -316 -766 -1039 -699 -10 727 908 587 307 -520
930 -520 -896 -818 -273 320 801 849 495 -226 -456 -878 -614 104 508 967 779 224 -397 -882 -717 -548 134
951 134 765 875 382 -19 -606 -825 -710 -104 425 855 687 219 -316 -816 -740 -364 247 731 875 558 -32
972 -32 -512 -1058 -720 -168 375 705 904 304 -272 -642 -838 -489 45 533 876 736 91 -564 -917 -783 -335
993 -335 418 640 720 434 -260 -711 -902 -546 -311 531 817 631 162 -310 -760 -778 -349 178 646 850 577
1014 577 -67 -832 -785 -832 -335 353 701 779 257 -380 -651 -1000 -373 244 629 887 428 43 -585 -784 -699
$$ packed form
867A086j53m05r55q54J63O21Q28N13J96j74q37p73l84L57N80Q87K47kn20q20n80
888i79j4M14P92O71O5j59q54o16k29K48M95O97M70j19m37p78n32r6M50O99O05
909G93K38l76p03o58j74j9O47P62L59q1m32o72m50k73L40O89P37J81l21k80q27
930e20l76P8N45N93M81M8l54p21k30m22K64P18M04M59j88n55o21m85J65J69O82
951A34O31J10m93m01n87k19J15O06N29M30j68m68n35n00P6L76O11M84J44l17n90
972c2m80n46L38N52N43L30J99o00n76l70j96L49N34M88L43j40o45o55l53J34M48
993c35P53K22Q0k86o94m51j91L56K35Q42K86j86m69m72m50j8M29N27M68K04k73
1014E77o44p65M7m7M97O88L48P8n22o37k71l49O27O17L85K58m59l85o28j99Q5
$$ plain form
1035 -699 -188 346 820 682 327 -218 -763 -842 -425 53 703 931 508 164 -571 -871 -710 -236 447 784
1055 784 688 359 -235 -817 -976 -557 230 660 916 750 38 -434 -790 -818 -216 430 732 840 306 -226 -682
1076 -682 -727 -592 21 735 763 764 294 -476 -688 -746 -216 391 880 845 266 -276 -769 -754 -631 64 515 763
1098 763 520 94 -344 -844 -924 -261 391 926 864 483 -85 -689 -754 -515 88 575 927 657 345 -454 -736
1119 -736 -854 -380 217 773 852 530 -172 -529 -698 -645 20 488 898 752 436 -434 -688 -889 -445 224 722
1140 722 813 521 -302 -437 -886 -825 -47 384 707 790 284 -397 -710 -758 -427 250 711 825 742 -52 -385 -818
1162 -818 -549 153 408 716 704 250 -336 -831 -881 -565 154 763 796 506 -131 -566 -760 -648 -155 318 744
1183 744 789 250 -229 -647 -776 -572 190 776 799 455 -24 -457 -837 -700 -245 446 716 727 394 -263 -714
$$ packed form
1035f99N11N34M74j38l55n45n45p9M17M78O50K28m23l44p35l00J61M74O83L37
1055G84r6l29n94n82j59M19P87M30K56j66p12m72l56k8O02O46L02J08n34n32m56
1076f82m5J35O13P14K8Jm70p70k12n8N30O07M89l5n79n42m93J5J23O95M51K48
1098G63k43m26m38n00q0O63O52N35o2l81n68o04o5K39O03M87L52k70l12p99k82
1119g36j18M74N97N56P9l22p02l57j69N3O65M68M10j46l16q70k54k01M44O69M98
1140G22R1k92q23j35m49O1P78M31L23Q3n06o81l13m8L31O77M61J14q3p94l33m33
1162h18K69P02K55L08j2m54n86m95n0L16P19O09L3k90o37m35j94J12M93M73M26
1183G44M5n39m79m18j29K04P62N86K3l44m79m33l80J37M55O91K70J1l33o57m51
$$ plain form
1204 -714 -905 -533 68 551 767 630 137 -476 -735 -656 -153 532 709 734 354 -159 -632 -827 -409 1 525
1225 525 782 704 106 -299 -752 -533 -88 279 849 599 396 -345 -731 -609 -477 74 641 859 724 61
1245 61 -549 -949 -726 -175 333 606 523 271 -205 -608 -639 -420 -33 411 786 692 203 -248 -780 -615 -146
1266 -146 244 520 560 311 -146 -573 -594 -525 78 431 754 480 167 -432 -584 -746 -234 219 671 756 362
1287 362 -207 -439 -663 -423 -107 329 752 559 16 -396 -726 -525 -276 187 680 706 308 10 -447 -776
1307 -776 -438 -201 333 675 551 194 -183 -499 -548 -342 229 492 640 394 45 -507 -558 -481 -151 228 606
1328 606 407 255 -9 -579 -625 -390 77 337 688 424 -20 -345 -543 -523 -27 203 527 580 342 -203 -548
1349 -548 -659 -492 54 323 613 271 -98 -388 -547 -464 -130 318 493 548 314 33 -482 -658 -445 59 425
$$ packed form
1204g14j91L72O01M83K16j37m93o13k59P9N03O85J77K5l80n13m73j95M18M10N24
1225E25K57p8n98m05m53K19M45L67N70k50k03p41l86J22J32N51N67K18j35o63
1245F1o10m00K23N51N08K73q3k52m76m03l1K19L87M44L75r4m89m51n32J65M69
1266a46L90K76M0k49m57m27k1O9O03L53L23k74l13n99j52j62N12M53M52Q5l94
1287C62n69k32k24K40L16M36M23j93n43m12l30K01K49M63M93K6l98k98m57l29
1307g76L38K37N34L42j24l57l77l16m9K06N71K63J48k46l49n52n1P7L30L79L78
1328F06j99j52k64n70m6K35M67K60L51k64m44l25j98K0M96K30L24N3k38n45l45
1349e48j11J67N46K69K90l42l69k90j59Q3L34M48J75N5k34k81n15j76K13N04L66
$$ plain form
1370 425 739 466 134 -235 -518 -447 -194 348 405 537 331 77 -631 -640 -473 -157 391 509 414 74 -206 -556
1392 -556 -370 -199 -22 473 639 534 -32 -543 -462 -281 -146 312 523 498 220 -182 -481 -665 -200 91 385
1413 385 684 507 32 -354 -568 -477 -214 322 522 458 245 -230 -568 -535 -297 93 321 364 547 -64 -410
1434 -410 -467 -379 -57 277 635 581 268 -254 -496 -471 -234 15 533 601 315 -26 -231 -453 -380 -164 318 531
1456 531 494 129 -312 -413 -497 -394 -95 392 495 284 -87 -239 -574 -417 -207 103 554 506 263 -76 -632
1477 -632 -332 -274 -14 433 440 267 61 -395 -667 -501 -140 229 411 431 293 -35 -490 -595 -377 84 553
1498 553 628 408 -112 -173 -501 -524 -208 322 415 435 279 -283 -352 -531 -369 -53 211 499 445 -108 -59 -531 -376
1521 -376 -93 244 470 546 184 -232 -335 -469 -218 98 478 289 348 94 -256 -409 -432 -83 164 491 495 290
$$ packed form
1370D25L14k73l32l69k83P1K53N42N7J32k06k54p08rJ67L16N48J18r5l40k80l50
1392e56J86J71J77M95J66j05n66n11Q1J81J35M58K11k5k78m02k99j84M65K91K94
1413C85K99j77m75l86k14R1K63N36K00o4k13m75l38L3K38L90K28M3J83o11l46
1434d10n7Q8L22L34L58n4l13n22k42K5K37K49N18O8k86l41k05k22P3K16M82K13
1456E31l7l65m41j01q4J03K99M87J03k11l71j52l35J57K10L10M51m8k43l39n56
1477f32L00N8K60M47Pj73k06m56k72J66L61L69J82K0j38l28m55j05K18M61M69
1498E53P5k20n20o1l28k3L16N30R3K0j56n62o9j79J62L16K64K88n4n53M9m72J55
1521c76K83L37K26P6l62m16j03j34K51L16L80j89N9k54l50j53k3L49K47L27Mk05
$$ plain form
1543 290 -33 -453 -390 -437 -136 326 515 480 78 -273 -420 -295 -77 201 381 526 404 -40 -267 -528 -561
1564 -561 -22 272 460 447 95 -128 -504 -398 -36 204 479 622 315 -73 -449 -568 -305 -68 246 461
1584 461 372 132 -171 -468 -374 -277 218 509 387 195 -3 -313 -524 -372 -297 339 456 414 35 -47 -359 -323
1606 -323 -74 193 571 478 286 -27 -334 -452 -194 -213 174 542 437 3 -185 -466 -213 -214 116 278 423
1627 423 292 -80 -455 -401 -415 -257 86 363 324 155 -275 -596 -527 -178 -94 479 324 284 122 -168 -413 -344
1649 -344 66 99 570 427 244 -166 -288 -394 -204 -113 364 433 146 116 -322 -441 -441 -5 71 286 258 125 -199
1672 -199 -279 -332 -258 -22 177 386 197 159 -160 -148 -441 -19 207 475 221 259 -25 -420 -328 -185 121 227
1694 227 438 220 42 -278 -314 -372 55 145 288 261 153 20 -222 -352 -164 -110 226 382 344 30 -142 -308
$$ packed form
1543B90l23m20O3m7L01M62J89l5m02l51j47J25K18K78J80J45j22m44k27k61l3
1564e61N39K94J88j3l52k23l76J06L62K40K75J43l07l88l76j19K63K37L14K15
1584D61q9k40l03k97R4R7M95K91j22j92j98l10k11J52P5O36J17m2l79q2l12L6
1606c23K49K67L78r3j92l13l07j18K58j9L87L68j05m34j88k81K53jL30J62J45
1627D23j31l72l75N4j4J58L43K77l9j69m30l21O9L49Q4N73j55m0j62k90k45O9
1649c44M10L3M71j43j83m10j22j06J90R1M77O9k87l0m38j19%M36P6K15k8j33l24
1672a99q0n3P4K36J99K09j89l8l19J2k93M22K26K68k54L8k84l95R2J43L06J06
1694B27K11k18j78l20l6n8M27R0J43k7j08j33k42j30J88N4L36J56l8l14j72j66
$$ plain form
1716 -308 -261 -103 111 366 246 69 4 -242 -333 -99 -86 25 348 232 -17 -36 -332 -446 76 113 277 285 78
1739 78 -163 -239 -372 -412 -93 243 348 186 74 -15 -312 -436 -134 47 231 236 340 18 -313 -360 -191 -3
1761 -3 117 215 243 192 -60 -363 -319 -33 70 164 221 260 118 -182 -277 -176 -107 65 297 322 101 -199 -427 -289
1785 -289 -171 121 324 391 318 21 -271 -356 -154 -150 241 346 322 224 -158 -389 -176 62 -46 196 224 388 114
1808 114 -186 -343 -259 -169 47 88 337 -2 -31 -328 -285 -188 11 268 644 231 93 -58 -294 -193 -111 75
1830 75 188 71 284 -85 -361 -210 -131 113 188 428 318 205 -72 -334 -376 -169 105 441 300 224 -175 -312
1852 -312 -418 -365 -177 179 233 157 27 -129 -323 -318 -115 224 312 299 353 171 -101 -344 -202 -8 235 319 364
1875 364 117 -148 -240 -231 -217 136 304 258 93 0 -169 -281 -275 -14 122 289 282 52 -141 -187 -246 -9 -36 171
$$ packed form
1716c08M7J58K14K55j20j77o5k46r1K34J3J11L23j16k49j9k96j14N22L7J64Qk07
1739G8k41p6j33m0L19L36J05j62j12q9k97j24L02J81J84NJ04l22l31m7J69J88
1761cJ20R8K8n1k52l03M4K86J03R4N7L9j42l00r5J01O9J72K32K5k21l00k28J38
1785b89J18K92K03O7p3k97k92q5K02ML91J05k4r8l82k31K13K38j08K42K8J64k74
1808A14l00j57Q4R0K16M1K49l39k9k97M3R7J99K57L76m13j38j51k36J01Q2J86
1830G5J13j17K13l69k76J51P9K44P5K40j10j13k77k62m2K07K74L36j41p6l99j37
1852c12j06N3J88L56N4p6j30j56j94NK03L39Q8j3N4j82k72k43J42J94K43Q4M5
1875C64k47k65r2RJ4L53J68m6j65r3j69j12OK61J36J67pk30j93m6n9K37k7K07
$$ plain form
1899 171 506 97 -30 -190 -157 -168 3 97 501 422 -32 -241 -274 -347 -75 176 73 277 144 52 -158 -281
1921 -281 -317 54 72 300 207 69 -67 -99 -287 -236 168 329 230 164 -51 -205 -234 -310 -76 199 398 280 214
1944 214 67 -101 -359 -59 143 322 139 250 -67 -392 -327 -408 -266 98 407 307 147 -56 -52 -163 -82 67
1966 67 169 183 151 181 -101 -266 -335 -135 25 101 176 134 -109 -314 -221 -284 75 154 328 243 -171 -310 -160 -294
1990 -294 -260 58 176 225 152 -46 -128 -186 -171 67 345 350 166 -35 -151 -274 -227 10 96 159 145 21 -49 -448
2014 -448 -69 -41 -49 130 244 232 69 -20 -152 -215 1 77 238 304 83 -159 -296 -204 -240 -49 87 269 41
2037 41 -39 17 -11 -281 -189 43 217 248 191 13 -88 -173 -110 3 150 129 197 40 -190 -303 -258 -126 -87 120
2061 120 267 253 -91 -406 -109 -341 35 -50 174 302 -151 -161 -243 -196 -89 20 203 265 58 144 -151 -292
$$ packed form
1899A71L35m09j27j60L3j1J71R4M04p9m54k09l3p3K72K51j03K04j33r2k10j23
1921b81l6L71J8K28r3j38j36l2j88N1M04J61r9o6k15j54k9p6K34K75J99j18o6
1944B14j47j68k58L00K02J79j83J11l17l25O5q1J42L64L09j00j60k03Mj11Q1J49
1966F7J02J4l2L0k82j65o9K00J60P6P5m2k43k05R3o3L59P9J74q5m14j39J50j34
1990b94L4L18J18M9p3j98q2n8J5K38K78Nj84k01j16j23M7K37Q6O3j4j24p0l99
2014d48L79K8qJ79J14j2j63q9j32o3K16P6J61O6k21k42j37R2l6J91J36J82k28
2037D1q0N6k8k70R2K32J74L1n7j78j01q5O3J13J47k1O8j57k30j13M5J32L9K07
2061A20J47j4l44l15K97k32L76q5K24J28m53j0q2M7J07J09J83O2k07Q6k95j41
$$ plain form
2083 -292 -250 -132 71 209 249 51 -105 -197 -287 -23 -22 -3 181 28 -72 -36 -255 -220 -174 -46 105 172 126 -39
2107 -39 -163 -248 -299 -60 71 179 278 142 -171 -77 -168 -179 -2 -1 138 87 167 -141 -209 -250 25 85 195 192 192 -159
2133 -159 -226 -205 -58 66 240 115 96 -47 -119 -222 -190 82 22 55 269 91 -1 -168 -118 -15 34 -34 230 100
2157 100 -277 -45 -325 -234 -74 63 186 204 74 97 -219 -235 -110 44 206 111 158 173 -20 -191 -126 142 152
2180 152 274 228 35 18 -111 -321 -111 68 164 142 -39 11 -168 -156 -77 32 124 182 231 32 -130 -52 -290 -37
2204 -37 -32 78 75 96 -21 -170 -317 -276 -202 203 133 195 58 -33 -146 -250 -162 -142 88 121 158 119 -3 -353 -205
2229 -205 -84 50 32 341 101 -84 -179 -149 -100 -125 217 186 129 225 -50 -100 -139 -72 56 184 257 309 -18 -55 -231
2254 -231 -263 -262 209 208 246 -103 -119 -151 -93 -40 -161 127 172 158 10 -119 -390 -302 -142 24 278 294 -17 -60 -248
$$ packed form
2083b92M2J18K03J38M0j98j56r2r0K64JJ9J84j53j00L6k19L5M6J28J51O7m6j65
2107c9j24q5n1K39J31J08R9j36l13R4r1j1J77JJ39n1Q0l08o8m1K75O0J10l%l51
2133a59o7K1J47J24J74j25j9j43p2j03L2K72o0L3K14j78r2j67N0J03M9o8K64j30
2157A00l77K32k80R1J60J37J23J8j30K3l16j6J25J54J62r5M7J5j93j71O5K68J0
2180A52J22m6j93j7j29k10K10J79R6k2j81N0j79J2P9J09R2N8M9j99j62P8k38K53
2204c7NJ10lK1j17j49j47M1P4M05p0O2j37r1j13j04Q8K0K30L3L7l9j22l50J48
2229b05J21J34j8L09k40j85r5L0M9k5L42l1n7R6k75n0l9O7J28J28P3N2l27l7j76
2254b31l2JM71jL8l49j6l2N8N3j21K88M5j4j48j29k71Q8J60J66K54J6l11m3j88
$$ plain form
2279 -248 -221 -1 70 100 150 192 -52 -6 -155 -92 -51 -11 267 292 216 -106 -124 -244 -278 -18 107 397 191 58
2303 58 -147 -304 -284 9 167 333 93 15 23 -361 -299 -85 91 238 322 263 113 -148 -301 -23 -162 208 224
2326 224 167 24 160 -101 -240 -37 127 322 290 77 18 -153 -211 -246 -25 14 166 252 219 -63 -175 -228 -35
2349 -35 -131 119 200 102 117 -212 -227 -244 -2 14 80 193 57 -27 -10 -89 -57 -25 -58 321 253 27 -70 -74 -396 -67
2375 -67 82 209 21 260 -59 -165 -165 -33 -235 44 275 187 89 -195 -296 -329 -102 10 268 241 228 -24 -185
2398 -185 -190 -286 -94 106 107 233 19 24 -133 -102 -155 42 390 176 273 2 17 -271 -270 -83 180 86 102 137 -217
2423 -217 -114 -209 -351 64 220 20 234 68 4 -294 -159 -241 84 196 169 229 -79 -36 -65 -81 -47 124 359
2446 359 85 -58 -175 -209 -238 -187 33 118 348 144 -15 -94 -148 -142 44 48 77 255 106 -10 -236 -243 -170 140 34
$$ packed form
2279b48K7K20P1L0N0M2k44M6j49O3M1M0K78K5p6l22j8j20l4K60J25K90k06j33
2303E8k05j57K0K93J58J66k40p8Ql84O2K14J76J47Q4n9j50k61j53K78j39L70J6
2326B24n7j43J36k61j39K03J64J95l2k13n9j71n8l5K21L9J52Q6l3k82j12n3J93
2349c5r6K50Q1r8J5l29j5j7K42J6O6J13j36q4J7p9L2L2l3L79o8k26r7ml22L29
2375f7J49J27j88K39l19j06%J32k02K79K31q8r8k84j01l3K27J12K58k7j3k52j61
2398a85nr6J92K00JJ26k14Nj57L1n3J97L48k14R7k71J5k88JJ87K63r4J6L5l54
2423b17J03r5j42M15J56k00K14j66o4k98J35q2L25J12k7O0l08M3k9j6L4J71K35
2446C59k74j43j17l4k9N1K20Q5K30k04j59p9n4OJ86MK9J78j49j16k26pP3L10j06
$$ plain form
2471 34 204 107 -48 -131 -145 -142 -110 98 187 210 62 -33 -199 -285 47 -17 40 89 -36 75 -148 -101 -181 -182 153 125
2497 125 220 207 -177 -366 -219 -283 -107 152 373 226 -99 -125 -283 -275 -226 49 260 269 133 -109 -216 -216 -262 -101
2521 -101 44 199 138 -90 -261 -242 -376 52 52 269 232 197 -244 -156 -219 -108 84 93 235 153 109 -251 -170 -212 -329
2546 -329 76 174 156 89 10 -173 -277 -180 -106 201 -60 325 108 -84 -128 -112 -183 56 267 183 36 -161 -167 -213
2570 -213 26 -50 99 178 179 208 -119 -164 -128 -45 21 226 103 71 -11 -85 -64 -69 -108 109 220 54 14 -307 -150 -281
2596 -281 -258 70 153 19 218 78 -162 -160 -90 -288 134 129 74 -101 -133 -275 -40 -94 -28 158 169 100 15 -104 -165
2621 -165 -161 -114 171 282 224 47 -30 -256 -75 88 -100 148 231 208 106 26 -229 -151 -73 -23 218 135 50 252
2645 252 -245 -208 -71 -12 86 351 148 36 -67 -413 -184 -262 -9 103 288 39 -98 -179 -200 -202 -78 133 283
$$ packed form
2471C4J70r7j55q3j4LL2K08Q9K3j48r5j66q6L32o4N7M9j25J11k23M7q0jL35k8
2497A25R5j3l84j89J47o4J76K59K21j47l25k6j58QM9K75K11Rj36k42j07%m6J61
2521a01J45J55o1k28j71J9j34M28%K17l7l5m41Q8o3J11J92RJ42q2m4l60Q1m2j17
2546c29M05R8j8o7p9j83j04R7P4L07k61L85k17j92m4J6p1K39K11q4j47j97om6
2570b13K39p6J49P9JK9l27m5L6Q3O6K05j23l2q2p4K1nl9K17J11j66m0l21J57j31
2596b81K3L28Q3j34J99j40k40KP0j98M22nn5j75l2j42K35n4O6J86J1o9q5j19o1
2621a65MM7K85J11n8j77p7k26J81J63j88K48Q3k3j02q0k55P8P8N0K41q3q5K02
2645B52m97L7J37N9R8K65k03j12j03l46K29p8K53J12J85k49j37q1k1kJ24K11J50
$$ plain form
2668 283 61 -43 -29 -115 -259 -224 77 164 177 75 -39 -227 -141 -167 -30 -84 132 174 50 -19 -161 -81 -312 98
2692 98 81 170 26 92 -50 -230 -191 -91 113 137 344 117 -69 -141 -91 6 138 239 192 34 97 -241 -204 -66
2716 -66 -271 4 95 160 171 -64 -197 -323 -212 14 195 56 173 -157 25 50 -252 -104 -11 187 149 -8
2738 -8 -50 -122 -140 41 53 98 186 29 -14 -20 -114 -120 170 -64 286 200 267 -162 105 -125 -32 14 62 226 166 25 -110
2765 -110 -289 -181 -225 -70 187 172 131 26 -34 -251 -90 -126 277 128 312 62 -46 -211 -10 -53 -46 62 348
2788 348 51 -15 -103 -209 -254 -95 166 216 185 71 -36 -8 75 -159 -15 61 132 -71 38 -143 -330 -129 -215
2811 -215 25 92 107 28 -36 -253 -163 -84 -16 59 188 111 137 -65 -107 -195 -83 54 229 118 -8 -25 -116 -225 -324
2836 -324 90 216 197 71 212 -60 -101 32 -44 43 73 68 217 -118 -189 -57 -174 143 160 268 408 333 -103
$$ packed form
2668B83k22j04J4q6j44L5L01Q7J3j02j14j88Q6k6J37n4K16M2j24o9j42Q0k31M10
2692I8j7Q9j44O6j42j80L9J00K04K4K07k27j86p2N0R7J32J01m7j58O3l38L7J38
2716f6k05K75R1O5J1k35j33j26J11K26J81j39J17l30J82K5l02J48R3J98l8j57
2738hm2p2j8J81J2M5Q8j57m3or4oK90k34L50q6O7m29K67k30R3M6M8J64o0j41j35
2765a10j79J08m4J55K57j5m1j05o0k17J61l6M03j49J84k50j08j65K01m3PJ08K86
2788C48k97o6q8j06m5J59K61N0l1j14j07K8Q3k34J44P6P1k03J09j81j87K01q6
2811b15K40O7J5p9o4k17R0P9O8P5J29p7K6k02m2q8J12J37J75j11j26j7r1j09r9
2836c24M14J26j9j26J41k72m1J33p6Q7L0nJ49l35p1J32j17L17J7J08J40p5m36
$$ plain form
2859 -103 -185 -173 -234 -16 50 126 213 -79 -271 -242 -18 96 136 174 156 23 18 -86 -62 -252 20 211 270 123 -24
2884 -24 -152 -98 -118 -32 70 210 392 21 -197 -341 -198 -24 66 81 265 6 99 -169 -81 -199 -138 121 192
2907 192 85 119 -157 -257 -252 12 120 98 204 31 73 -1 -216 -187 65 -17 16 289 73 39 -334 -316 29 9
2931 9 286 301 148 92 -44 -218 -160 -71 70 244 96 35 -129 -166 -300 -98 62 162 196 -18 85 -311 -176
2954 -176 -182 -217 -30 50 106 106 -109 -147 -69 6 55 87 121 92 48 -34 -249 -181 52 -45 194 39 -118 43 -189 -216
2980 -216 -108 109 119 72 24 -55 -77 -106 -120 2 177 66 143 28 197 -253 -421 -96 -112 204 164 153 196 -249
3004 -249 -123 -46 -18 52 86 117 6 15 -172 -181 -50 39 230 246 160 34 -54 -62 -16 -29 -39 2 274 97 -41 -137 -359
3031 -359 -91 -71 117 194 89 201 91 -231 -69 49 56 214 100 101 -29 -188 -214 61 54 58 315 44 23 13
$$ packed form
2859a03q2J2o1K18O6P6Q7k92j92K9K24J14M0L8j8j33nj04K4j90K72J91N9j47j47
2884b4j28N4k0Q6J02J40J82l71k18j44J43J74R0J5J84k59R3k68Q8j18O1K59P1
2907A92j07L4k76j00NK64J08k2J06j73M2p4k15K9K52q2L3K73k16l4l73J8L45k0
2931IK77J5j53n6j36j74N8Q9J41J74j48o1j64l7j34K02J60J00L4k14J03l96J35
2954a76ol5J87Q0N6%k15l8P8P5M9L2L4k9m4q2k15O8K33r7K39j55j57J61k32k7
2980b16J08K17J0m7m8p9k2k9j4J22J75j11P7j15J69m50j68L25j6L16m0j1M3m45
3004b49J26P7K8P0L4L1j11Rj87rJ31Q9J91J6q6j26q8qM6j3j0M1K72j77j38r6k22
3031c59K68K0J88P7j05J12j10l22J62J18PJ58j14Jj30j59k6K75pMK57k71k1j0
$$ plain form
3055 13 -45 -105 -35 99 74 182 69 158 30 -142 -131 -5 111 15 44 138 165 -47 -209 -3 42 34 124 24 -78
3080 -78 -120 -249 -212 73 125 108 217 152 -21 -151 -31 -62 3 202 136 179 76 -92 -102 -194 40 156 65 41 87
3105 87 -84 -160 -95 -145 61 197 162 103 -133 -193 -84 -13 138 17 195 176 -89 -103 -163 -188 89 -183 62 136
3129 136 107 101 -124 -228 -182 -53 -13 202 74 39 -27 -225 -216 -134 23 13 179 149 -152 92 -156 -188 -171 43 28
3154 28 99 137 -150 -95 -261 -147 96 90 37 -46 -17 -97 -189 -25 -160 -116 -37 125 1 -130 -122 -100 -194 -34 218 98
3180 98 35 69 -95 -57 -195 -138 47 1 7 169 15 -132 -235 -269 20 11 272 99 -48 28 -359 -204 -204 -116 102
3205 102 195 -6 31 -85 -90 -217 -25 208 189 13 29 -14 -13 -216 81 25 106 79 33 149 -26 -129 -15 -193
3229 -193 -48 240 -6 -140 -80 -22 -5 -186 -10 -113 301 165 117 -152 -89 -54 -11 -5 94 34 105 -116 -113 -130 -158
$$ packed form
3055A3n8o0P0J34k5J08j13Q9j28j72J1J26J16r6K9R4K7k12j62K06M5qR0j00j02
3080g8m2j29L7K85N2j7J09o5j73j30J20l1O5J99o6M3j03j68j0r2K34J16r1k4M6
3105H7j71p6O5n0K06J36l5n9k36o0J09P1J51j21J78j9k65j4o0k5K77k72K45P4
3129A36k9ok25j04M6J29M0K15j28l5o6j98RQ2J57j0J66l0l01K44k48l2J7K14j5
3154B8P1L8k87N5j66J14K43on3q3K9q0r2J64j35M4P9J62j24j31QK2r4J60K52j20
3180I8o3L4j64L8j38N7J85m6OJ62j54j47j03l4K89rK61j73j47P6l87J55%Q8K18
3205A02R3k01L7j16nj27J92K33j9j76J6m3Jk03K97n6Q1k7m6J16j75j03J14j78
3229a93J45K88k46j34O0N8J7j81J76j03M14j36m8k69O3L5M3OR9o0P1k21Lj7k8
$$ plain form
3254 -158 -8 95 81 59 164 -84 -129 -84 -114 73 167 276 120 -129 -74 -33 -129 19 111 176 72 -135 -22 -155
3278 -155 -178 133 56 226 0 4 -38 -157 -56 -184 70 48 202 5 106 -128 -276 19 -145 35 -97 93
3300 93 57 -142 -50 -135 -114 -74 -84 -68 89 4 32 -125 -32 5 -187 -45 43 130 -122 -84 -121 -34 -34 -61 170 177 43
3327 43 16 -82 -136 -114 40 -117 86 107 84 -20 -251 158 57 136 -19 107 24 42 -214 -8 -50 47 141 280
3351 280 145 -106 -52 -210 -313 56 109 11 92 66 59 -103 -40 -26 45 66 89 10 -187 -42 -193 152 -75 20 131
3376 131 143 -70 48 -233 -17 -2 -36 200 -73 115 31 56 33 -29 5 53 27 25 41 -41 -189 -16 -215 26 264
3401 264 126 -6 -51 -61 -252 -118 52 31 295 50 38 171 -126 -65 -26 64 150 54 1 -104 -67 -117 -63 -30 69
3426 69 -26 9 62 -13 -149 89 -152 76 -25 -49 139 225 -81 -149 -155 -111 208 33 -94 105 24 42 -123 -94 -21
$$ packed form
3254a58J50J03j4k2J05k48m5M5l0J87R4J09j56k49N5M1r6J48R2O5j04k07J13j33
3278a55k3L11p7J70k26Mm2j19J01j28K54k2J54j97J01k34j48K95j64J80j32J90
3300I3l6j99R2q5K1M0j0J6J57q5K8j57R3L7j92J42Q8Q7k52L8l7Q7%k7K31Pj34
3327D3k7r8n4K2J54j57K03K1k3j04k31M09j01P9j55J26q3J8k56K06m2R7R4J39
3351B80j35k51N4j58j03L69N3r8Q1k6pj62O3J4P1K1K3p9j97J45j51L45k27R5J11
3376A31J2k13J18k81K16J5l4K36k73J88q4K5k3o2L4M8k6kJ6q2j48J73j99K41K38
3401B64j38j32m5j0j91J34J70k1K64k45j2J33k97O1L9R0Q6r6n3j05L7n0N4L3R9
3426F9r5L5N3p5j36K38k41K28j01k4J88Q6l06o8oM4L19j75j27J99q1J8j65K9P3
$$ plain form
3451 -21 -39 141 204 -4 30 -24 -121 -210 8 167 186 180 -59 16 -46 -12 -135 57 231 64 -93 18 51 -53 -73
3476 -73 88 50 133 12 64 17 -102 125 -177 64 225 105 71 -96 -68 -20 -287 -249 163 434 -222 -27 39
3499 39 142 -27 -112 137 -9 49 -7 131 -71 -141 -69 30 22 -19 138 78 35 -178 -71 -34 8 116 26 134 -50
3524 -50 42 -74 -97 -75 88 122 262 12 -40 -64 -141 -54 46 95 197 167 0 -210 45 -47 -105 -59 35 203 9
3549 9 -63 -99 -120 -83 102 70 67 14 91 46 -34 -21 25 -72 238 20 11 -12 -89 67 60 25 111 72 -82 144 -117 -31 -2
3578 -2 -189 106 -26 147 179 -124 -18 -154 -63 -122 -28 -40 -53 34 33 -44 -42 60 -44 44 221 -35 68 -63 -133
3603 -133 -36 -11 48 -24 98 -16 73 -106 -183 89 92 61 83 13 54 42 -7 -169 36 1 92 -55 -90 -98 -111 -62 116
3630 116 -75 129 147 68 22 -16 -144 -30 -56 110 229 227 123 60 -135 -70 14 -20 149 47 -153 114 -285 181
$$ packed form
3451b1j8J80O3k08L4n4r7q9K18J59J9ok39P5o2L4j23J92J74j67j57J11L3j04k0
3476g3J61l8Q3j21N2m7j19K27l02K41J61j20l4j67K8M8k67L8M12K71o56J95O6
3499C9J03j69q5K49j46N8n6J38k02p0P2R9qm1J57o0m3k13J07L7M2J08r0J08j84
3524e0R2j16k3K2J63L4J40k50n2k4p7Q7J00M9J02l0j67k10K55r2n8M6R4J68j94
3549Ip2l6k1L7J85l2ln3P7m5q0J3M6r7L10k18rk3p7J56pl5Q6l9j54K26k61Q6K9
3578bj87K95j32J73L2l03J06j36R1n9R4j2j3Q7jp7KJ02j04Q8J77k56J03j31p0
3603a33R7K5N9p2J22j14Q9j79p7K72Ll1K2p0M1j2m9j62K05l5R1j47l5qj3M9J78
3630A16j91K04J8p9m6l8j28J14k6J66J19kj04o3j95O5Q4l4J69j02k00K67l99M66
$$ plain form
3654 181 -192 -50 8 -12 216 -202 -42 -173 -9 -55 -119 12 -25 -28 44 -71 -130 -230 -233 72 85 71 64 241 -124
3679 -124 -126 85 44 98 245 78 94 -122 -39 -98 71 80 97 53 93 -14 -122 -234 -55 0 -107 108 50 58 -91
3704 -91 -222 -227 -51 -44 169 -64 -103 -39 -161 55 -197 -22 -47 68 111 123 -156 -118 -83 6 105 222 40 -182 -3
3729 -3 -118 15 -165 -7 160 13 -2 -129 -70 -183 -76 32 101 199 49 -89 108 -111 16 115 -51 -158
3751 -158 18 10 173 178 -66 -55 128 63 11 97 -28 -98 -91 -56 -61 16 154 -32 49 49 -105 59 -9 -19 66 45 40 14
3779 14 19 -41 70 45 -31 -28 172 136 87 65 7 40 -62 -74 32 55 14 -69 -84 202 -91 -33 149 -25 142 141 -53
3806 -53 108 -28 -93 -38 -25 -75 -24 -33 -15 -3 -94 -148 12 93 16 -40 51 -33 -6 -81 -12 34 104 -17 -134 -116 76 -70
3834 -70 -122 -33 118 -4 -102 34 30 42 82 10 72 141 -5 92 -223 15 127 -69 -48 159 101 68 117 -25 -37 5
$$ packed form
3654A81l73J42N8k0K28m18J60j31J64m6o4J31l7lP2j15n9j00lL05J3j4pJ77l65
3679a24kK11m1N4J47j67J6k16Q3n9J69RJ7m4M0j07j08j12J79N5j07K15n8Qj49
3704i1j31nJ76PK13k33l9O4j22K16k52J75k5J15M3J2k79L8L5Q9R9J17j82k22J79
3729cj15J33j80J58J67j47j5j27N9j13J07J08O9R8j50j38J97k19J27R9j66j07
3751a58J76qJ63Nk44J1J83o5n2Q6j25p0PL5nP7J38j86Q1%j54J64o8j0Q5k1nk6
3779A4No0J11k5p6LK00l6m9k2n8L3j02j2J06K3m1q3j5K86k93N8J82j74J67jj94
3806e3J61j36o5N5J3n0N1rJ8J2r1n4J60Q1p7n6R1q4K7p5O9M6P0j21j17J8J92j46
3834g0n2Q9J51j22r8J36mJ2M0p2O2O9j46R7l15K38J12j96K1K07n8l3M9j42j2M2
$$ plain form
3860 5 -154 -105 47 -11 162 70 -68 128 25 -48 118 -58 -63 41 -58 -199 99 -49 42 205 -36 -77 82 -85
3884 -85 -158 -84 -123 42 7 128 75 -45 3 -281 -62 47 119 197 243 102 -61 7 6 -72 -11 8 150 -59 41
3909 41 -12 -61 -126 167 -64 39 87 -29 105 -31 -37 -38 27 -56 18 31 122 10 -322 -11 77 151 138 -119 -7 -184
3935 -184 8 -60 -68 210 -94 10 -37 -71 -13 -161 111 97 67 36 104 75 -243 6 -66 39 85 148 50 -17 15 -142
3961 -142 -194 24 222 -40 217 11 1 -101 -114 -63 -53 -24 57 12 -7 43 -58 -61 -45 62 172 28 239 -34
3985 -34 -151 -186 -126 0 168 59 41 -29 13 -184 -121 76 139 120 47 25 166 -127 -5 49 38 -87 24 186
4009 186 132 -100 63 -202 0 22 213 -29 -121 26 57 142 -49 -6 6 78 58 123 -261 -321 -57 -67 -50 -54 -99
4034 -99 103 -116 56 -24 -67 -207 72 99 34 -42 92 51 -12 -30 -48 137 -41 33 61 -60 -199 -100 44 4 39
$$ packed form
3860Ej59M9J52n8J73r2j38J96j03p3J66j76nJ04r9j41K98j48R1J63k41m1J59j67
3884h5p3P4l9J65l5J21n3j20M8k84K19J09P2P8M6j41j63O8jp8O1J9J42k09J00
3909D1n3m9o5K93k31J03M8j16J34j36ojO5q3P4J3R1j12l32L11Q8P4j3k57J12j77
3935a84J92o8qK78l04J04m7l4N8j48K72j4l0l1O8k9l18K49p2J05M6O3r8o7L2j57
3961a42n2K18J98k62K57k06j0j02j3N1J0K9Q1m5j9N0j01lJ6J07J10j44K11k73
3985c4j17l5O0J26J68j09j8p0M2j97O3J97O3j9p3k2J41k93J22N4j1j25J11J62
4009A86n4k32J63k65K02K2J91k42r2J47L1Q5j91M3J2P2k0O5l84o0K64j0J7mm5
4034i9K02k19J72q0m3j40K79K7o5p6J34m1o3j8j8J85j78P4K8j21j39R9J44m0L5
$$ plain form
4059 39 162 25 -10 -239 -1 -4 -99 47 42 69 12 -40 -91 -25 -44 201 -24 129 71 -228 10 -193 -272 -19 -30
4084 -30 79 102 -20 -57 -70 -67 -93 -80 12 -39 39 26 -116 -22 130 145 208 -26 145 -63 -263 -105 16 -165 68
4109 68 -29 14 54 25 87 -13 71 82 19 79 -25 -5 108 -57 -130 13 -59 62 -51 -25 -100 -57 38 -240 144 -73
4135 -73 163 59 -3 25 37 76 69 -126 69 -40 64 71 -100 -52 40 169 -103 51 35 -59 -169 -118 17 147 -176
4160 -176 246 112 69 84 -48 -241 -133 103 -71 150 51 78 38 -25 84 -122 30 98 67 40 -55 -37 -8 114
4184 114 -104 -127 51 -65 126 46 -125 -2 17 -11 74 156 30 45 -157 -28 -46 -120 104 -35 -10 109 -20
4207 -20 -98 -52 -129 -121 79 104 -69 120 -81 -177 -54 76 -130 112 96 106 3 -98 -4 2 13 63 42 30 56 -152
4233 -152 120 -115 81 176 151 91 62 -24 -198 -172 -117 -21 8 -32 56 66 -1 -128 -162 -165 38 143 27 -57 -18 -54
$$ packed form
4059C9J23j37l5k29K38lr5J46nK7n7n2n1O6j9K45k25J53n8k99K38k03p9K53j1
4084c0J09K3j22l7j3Lk6J3R2n1P8j3j42R4J52J5O3k34J71k08k00J58J21j81K33
4109F8r7M3M0k9O2j00Q4J1o3O0j04K0J13j65p3J43p2J21j13K6p5M3R5k78L84k17
4135g3K36j04o2K8J2L9pj95J95j09J04Pj71M8R2J29k72J54j6r4j10N1J35J30l23
4160a76M22j34m3J5j32j93J08K36j74K21r9K7m0o3J09k06J52O8l1k7r5J8K9J22
4184A14k18k3J78j16J91q0j71J23J9k8Q5Q2j26J5k02J29j8p4K24j39K5J19j29
4207b0p8M6p7QK00K5j73J89k01r6J23J30k06K42j6J0j03j01R4OJ1N0k1j2K6k08
4233a52K72k35J96R5k5o0k9q6j74K6N5R6K9m0Q8J0o7j27l4lK03J05j16q4L9l6
$$ plain form
4259 -54 -132 -24 -109 78 242 105 80 -77 -78 -58 31 231 106 71 145 -11 -126 -230 -71 -1 -101 14 13 -33 30
4284 30 -76 20 -33 -27 -25 -18 41 140 33 -97 -32 140 -5 176 312 166 113 -22 -69 78 57 62 185 225 184 -72
4310 -72 -32 -149 -88 38 78 87 79 -2 -97 -163 -156 93 -17 107 163 -173 -146 -96 -91 17 -72 -41 105 -4 37 51 -84
4337 -84 41 -67 58 -32 165 34 -83 -351 -123 -8 65 -33 42 59 -109 3 -46 96 87 -33 -49 32 109 -23
4361 -23 35 -61 44 -157 100 -41 38 14 -178 92 -94 -186 43 85 -88 -52 -105 -151 -18 -60 -47 21 39 59 -9
4386 -9 18 -36 -70 -54 151 128 -21 -132 -218 -96 -67 -72 -91 82 150 51 -126 -210 -104 -54 -150 106 -14 62 -74 -111
4412 -111 -69 -12 -19 -102 127 66 -112 -18 4 -34 2 10 107 22 -77 126 -170 5 11 -66 59 150 -40 103 -35 30 -18
4439 -18 -127 112 52 34 221 133 62 -191 -46 28 -30 -24 48 60 47 -4 -92 94 -91 -69 142 -67 88 -54 -162
$$ packed form
4259e4p8J08q5J87J64j37k5j57jK0Q9K00j25l5P4j56j15j04J59P0j00J15jm6O3
4284C0j06R6n3OKPN9R9j07j30O5J72j45J81J36j46n3j35m7J47k1NJ23M0m1k56
4310g2M0j17O1J26M0Rqq1r5o6PK49j10J24N6l36K7N0NJ08q9L1J46j09M1J4j35
4337h4J25j08J25r0J97j31j17k68K28J15P3r8P5J7j68J12m9J42rj20j6Q1P7j32
4361b3N8r6J05k01K57j41P9k4j92K70j86r2K29M2j73L6n3m6J33m2J3O8J8K0o8
4386iK7n4l4J6K05k3j49j11q6J22K9nj9J73O8r9j77q4J06N0r6K56j20P6j36l7
4412a11M2N7pq3K29o1j78R4K2l8L6QR7q5r9K03k96J75Op7J25R1j90J43j38O5m8
4439a8j09K39o0j8J87q8p1k53J45P4n8OP2J2j3n1q8J86j85K2K11k09J55j42j08
$$ plain form
4464 -162 52 -76 -85 141 130 30 -150 127 37 7 246 168 -78 -18 -117 41 56 -164 -89 103 5 35 -133 -3
4488 -3 140 -204 -122 87 231 122 39 -38 -112 -91 43 -23 -32 34 63 91 -33 -53 -54 -142 -59 -1 44 139 44 73 29 15
$$ packed form
4464a62K14j28rK26j1j00j80K77r0l0K39p8k46O0r9J58J5k20P5J92r8L0j68J30
4488cJ43l44Q2K09J44j09q3p7p4K1J34o6rO6K9K8j24k0jq8Q3N8M5R5r5K9m4j4
$$ [...]
8191B8
##END NTUPLES=NMR FID
##END=
