##TITLE=1H_Pr CCl4-2
 200.13Hz,.
 8 sc
 
 29.4.2026
##JCAMPDX= 6.0         $$ Bruker NMR JCAMP-DX V2.0
##DATA TYPE= NMR FID
##DATA CLASS= NTUPLES
##ORIGIN= UXNMR, Bruker Analytische Messtechnik GmbH
##OWNER= pz
$$ XWIN-NMR		Version 3.5
$$ Mon May  4 14:05:18 2026 Russian Standard Time (UT+4h)  she@DPX200
##.OBSERVE FREQUENCY= 200.131
##.OBSERVE NUCLEUS= ^1H
##.DELAY= (6, 6)
##.ACQUISITION MODE= SIMULTANEOUS
##.ACQUISITION SCHEME= undefined
##.AVERAGES= 8
##.DIGITISER RES= 18
##SPECTROMETER/DATA SYSTEM= spect
##.PULSE SEQUENCE= zg30
##.SOLVENT NAME= CDCl3
##.SHIFT REFERENCE= (INTERNAL, CDCl3, 0, 14.3821)
##AUDIT TRAIL= $$ (NUMBER, WHEN, WHO, WHERE, WHAT)
$$ ##TITLE= Audit trail, XWIN-NMR		Version 3.5
$$ ##JCAMPDX= 5.01
$$ ##ORIGIN= Bruker BioSpin GmbH
$$ ##OWNER= she
$$ F:/spectra/data/she/nmr/H-C/1/audita.txt
$$ ##AUDIT TRAIL=  $$ (NUMBER, WHEN, WHO, WHERE, WHAT)
(   1,<2026-05-04 14:03:19.68 +0400>,<she>,<DPX200>,
      <created by zg, POWCHK disabled, PULCHK disabled
       configuration hash MD5:
       00 E9 B6 7A A2 85 ED C7 34 08 36 98 17 FE 4E 26
       data hash MD5: 16K
       7F 27 D8 63 72 68 80 5A BE 1E B0 E2 F7 D9 EA 6F>)
$$ ##END=
$$ 
$$ hash MD5
$$ 56 70 8E 79 E1 6A 62 80 20 94 44 8A 60 8C 7C 7D
##$RELAX= 
##$RELAX= 
##$RELAX= 
##$RELAX= 
##$RELAX= 
##$RELAX= 
$$ Bruker specific parameters
$$ --------------------------
##$DU= <F:/spectra>
##$EXPNO= 1
##$NAME= <H-C>
##$PROCNO= 1
##$TYPE= <nmr>
##$USER= <she>
##$AMP= (0..31)
100 100 100 100 100 100 100 100 100 100 100 100 100 100 100 100 100 100 
100 100 100 100 100 100 100 100 100 100 100 100 100 100 
##$AQSEQ= 0
##$AQ_mod= 1
##$AUNM= <au_zg>
##$AUTOPOS= <>
##$BF1= 200.13
##$BF2= 200.13
##$BF3= 200.13
##$BF4= 200.13
##$BF5= 200.13
##$BF6= 200.13
##$BF7= 200.13
##$BF8= 200.13
##$BYTORDA= 1
##$CFDGTYP= 0
##$CFRGTYP= 5
##$CHEMSTR= <none>
##$CNST= (0..31)
1 1 145 1 1 1 1 1 1 1 1 1 1 1 1 1 1 1 1 1 1 1 1 1 1 1 1 1 1 1 1 1 
##$CPDPRG= <>
##$CPDPRG1= <>
##$CPDPRG2= <>
##$CPDPRG3= <>
##$CPDPRG4= <mlev>
##$CPDPRG5= <mlev>
##$CPDPRG6= <mlev>
##$CPDPRG7= <mlev>
##$CPDPRG8= <mlev>
##$CPDPRGB= <>
##$CPDPRGT= <>
##$D= (0..31)
0 0.7 0 0 0 0 0 0 0 0 0 0.03 0 0 0 0 0 0 0 0 0 0 0 0 0 0 0 0 0 0 0 0 
##$DATE= 1777888999
##$DBL= (0..7)
120 120 120 120 120 120 120 120 
##$DBP= (0..7)
150 150 150 150 150 150 150 150 
##$DBP07= 0
##$DBPNAM0= <>
##$DBPNAM1= <>
##$DBPNAM2= <>
##$DBPNAM3= <>
##$DBPNAM4= <>
##$DBPNAM5= <>
##$DBPNAM6= <>
##$DBPNAM7= <>
##$DBPOAL= (0..7)
0.5 0.5 0.5 0.5 0.5 0.5 0.5 0.5 
##$DBPOFFS= (0..7)
0 0 0 0 0 0 0 0 
##$DE= 6
##$DECBNUC= <off>
##$DECIM= 32
##$DECNUC= <off>
##$DECSTAT= 4
##$DIGMOD= 1
##$DIGTYP= 9
##$DL= (0..7)
0 120 120 120 120 120 120 120 
##$DP= (0..7)
150 150 150 150 150 150 150 150 
##$DP07= 0
##$DPNAME0= <>
##$DPNAME1= <>
##$DPNAME2= <>
##$DPNAME3= <>
##$DPNAME4= <>
##$DPNAME5= <>
##$DPNAME6= <>
##$DPNAME7= <>
##$DPOAL= (0..7)
0.5 0.5 0.5 0.5 0.5 0.5 0.5 0.5 
##$DPOFFS= (0..7)
0 0 0 0 0 0 0 0 
##$DQDMODE= 0
##$DR= 18
##$DS= 0
##$DSLIST= <SSSSSSSSSSSSSSS>
##$DSPFIRM= 0
$$ [...]
##$SUBNAM0= <"">
##$SUBNAM1= <"">
##$SUBNAM2= <"">
##$SUBNAM3= <"">
##$SUBNAM4= <"">
##$SUBNAM5= <"">
##$SUBNAM6= <"">
##$SUBNAM7= <"">
##$SUBNAM8= <"">
##$SUBNAM9= <"">
##$SW= 18.0517599122864
##$SWIBOX= (0..15)
0 0 2 0 0 0 0 0 0 0 0 0 0 0 0 0 
##$SW_h= 3612.71676300578
##$TD= 16384
##$TD0= 1
##$TE= 0
##$TE2= 300
##$TE3= 300
##$TEG= 300
##$TL= (0..7)
0 120 120 120 120 120 120 120 
##$TP= (0..7)
150 150 150 150 150 150 150 150 
##$TP07= 0
##$TPNAME0= <>
##$TPNAME1= <>
##$TPNAME2= <>
##$TPNAME3= <>
##$TPNAME4= <>
##$TPNAME5= <>
##$TPNAME6= <>
##$TPNAME7= <>
##$TPOAL= (0..7)
0.5 0.5 0.5 0.5 0.5 0.5 0.5 0.5 
##$TPOFFS= (0..7)
0 0 0 0 0 0 0 0 
##$TUNHIN= 0
##$TUNHOUT= 0
##$TUNXOUT= 0
##$USERA1= <user>
##$USERA2= <user>
##$USERA3= <user>
##$USERA4= <user>
##$USERA5= <user>
##$V9= 5
##$VALIST= <valist>
##$VCLIST= <CCCCCCCCCCCCCCC>
##$VD= 0
##$VDLIST= <DDDDDDDDDDDDDDD>
##$VPLIST= <PPPPPPPPPPPPPPP>
##$VTLIST= <TTTTTTTTTTTTTTT>
##$WBST= 1024
##$WBSW= 4
##$XGAIN= (0..3)
0 0 0 0 
##$XL= 0
##$YL= 0
##$YMAX_a= 57423
##$YMIN_a= -64043
##$ZGOPTNS= <>
##$ZL1= 120
##$ZL2= 120
##$ZL3= 120
##$ZL4= 120
##$ABSF1= 10
##$ABSF2= 0
##$ABSG= 5
##$ABSL= 3
##$ALPHA= 0
##$AQORDER= 0
##$ASSFAC= 0
##$ASSFACI= 0
##$ASSFACX= 0
##$ASSWID= 0
##$AUNMP= <proc_1d>
##$AZFE= 0.1
##$AZFW= 0.1
##$BCFW= 1
##$BC_mod= 2
##$BYTORDP= 1
##$COROFFS= 0
##$CY= -3
##$DATMOD= 1
##$DC= 2
##$DFILT= <>
##$DTYPP= 0
##$F1P= 0
##$F2P= 0
##$FCOR= 0.5
##$FTSIZE= 0
##$FT_mod= 4
##$GAMMA= 1
##$GB= 0.15
##$INTBC= 1
##$INTSCL= 1
##$ISEN= 128
##$LB= 0.25
##$LEV0= 0
##$LPBIN= 0
##$MAXI= 10000
##$MC2= 0
##$MEAN= 0
##$ME_mod= 0
##$MI= 1.114404
##$NCOEF= 0
##$NC_proc= 0
##$NLEV= 6
##$NOISF1= 3.799351
##$NOISF2= 2.8
##$NSP= 1
##$NTH_PI= 0
##$NZP= 0
##$OFFSET= 14.38212
##$PC= 1
##$PHC0= -4070.328
##$PHC1= 13.59229
##$PH_mod= 1
##$PKNL= yes
##$PPARMOD= 0
##$PSCAL= 0
##$PSIGN= 0
##$REVERSE= no
##$SF= 200.129724274929
##$SI= 16384
##$SIGF1= 3
##$SIGF2= 2
##$SINO= 400
##$SIOLD= 16384
##$SREGLST= <1H.CDCl3>
##$SSB= 0
##$STSI= 0
##$STSR= 0
##$SW_p= 3205.1282051282
##$SYMM= 0
##$S_DEV= 0
##$TDeff= 0
##$TDoff= 0
##$TI= <>
##$TILT= no
##$TM1= 0
##$TM2= 0
##$TOPLEV= 0
##$USERP1= <user>
##$USERP2= <user>
##$USERP3= <user>
##$USERP4= <user>
##$USERP5= <user>
##$WDW= 1
##$XDIM= 8192
##$YMAX_p= 0
##$YMIN_p= 0
$$ End of Bruker specific parameters
$$ ---------------------------------
##NTUPLES= NMR FID
##VAR_NAME=  TIME,          FID/REAL,        FID/IMAG
##SYMBOL=    X,             R,               I
##VAR_TYPE=  INDEPENDENT,   DEPENDENT,       DEPENDENT
##VAR_FORM=  AFFN,          ASDF,            ASDF
##VAR_DIM=   8192,          8192,            8192
##UNITS=     SECONDS,       ARBITRARY UNITS, ARBITRARY UNITS
##FACTOR=    0.0002768,     1,               1
##FIRST=     0,             0,               0
##LAST=      2.2672688,     0,               0
##MIN=       0,             -64043,          0
##MAX=       2.2672688,     57423,           0
$$ Real data points
##PAGE= N=1
##DATA TABLE= (X++(R..R)), XYDATA
0@%%%%%%%%%%%%%%%%%%%%Nj2J5j6J6j6J6j6J7k3K9l1L2l3L9m5M7n4O1o3O9p7Q5
$$ 0 0 0 0 0 0 0 0 0 0 0 0 0 0 0 0 0 0 0 0 0 5 -7 8 -8 8 -8 8 -8 9 -14 15 -16 16 -17 22 -23 24 -30 31 -32 37 -40 45
43D5r2J00j08J17j31J45j57J70j89K09k30K56k87L24l68M24m95N83o99Q57j077
$$ 45 -47 53 -55 62 -69 76 -81 89 -100 109 -121 135 -152 172 -196 228 -267 316 -383 474 -603
64f03J399j902K746m345Q133k6781j1253Q8745j13269R4171m0606k8135Q6304
$$ -603 796 -1106 1640 -2705 5428 -21353 -32606 56139 -57130 37041 -3565 -31700 54604
77E4604j13675J02108n4469j3300P6537j11283J05673o2187m941P0170j08640
$$ 54604 -59071 43037 -11432 -24732 51805 -59478 46195 -15992 -20933 49237 -59403
88e9403J07597o7941M354N9816j01387J06121p3673J5208M9295r5611J06967q0204
$$ -59403 48194 -19747 -15393 44423 -56964 49157 -24516 -9308 39987 -55624 51343 -28861
100b8861K4541M0350r0400J06955q4678L2010L1719q3340J04825q8458M0336K1623
$$ -28861 -4320 36030 -54370 52585 -32093 -83 31636 -51704 53121 -35337 4999 26622
112B6622p5580J02594r2517M8745J2551o9039J00522r5392N5647M089o2364R7312
$$ 26622 -48958 53636 -38881 9864 22415 -46624 53898 -41494 14153 18242 -44122 53190
124E3190r6944O2105m782n4219R3203r8470O8588j4095m5530Q8684r9259P3810
$$ 53190 -43754 18351 13569 -40650 52553 -45917 22671 8576 -36954 51730 -47529 26281
136B6281k1759l8006Q3389r8048P7078k8486k9908P7000r6275Q1004l6642k0519
$$ 26281 4522 -33484 49905 -48143 28935 449 -29459 47541 -48734 32270 -4372 -24891
148b4891O9989r4305Q4303m3743j2762O4589r1964Q6001m8912n773N7552q8370
$$ -24891 45098 -49207 35096 -8647 -21409 43180 -48784 37217 -11695 -17468 40084 -48286
160d8286Q7283n5023L056N0326q5249Q9175o0903J0517M3859q2384R0364o5470
$$ -48286 38997 -16026 -12970 37356 -47893 41282 -19621 -9104 34755 -47629 42735 -22735
172b2735J7133L7345p7823R0141o9856K4559K9192p2912R0160p4865L2298K1926
$$ -22735 -5602 31743 -46080 44061 -25795 -1236 27956 -44956 45204 -29661 2637 24563
184B4563o8060Q9874p8605L8617J5191o3512Q8208q1135M4920P381n6700Q5672
$$ 24563 -43497 46377 -32228 6389 21580 -41932 46276 -34859 10061 17442 -39258 46414
196D6414q3373N1230o36n0202Q2753q4982N6085p268m3989P9283q5589O0691j4135
$$ 46414 -36959 14271 13635 -36567 46186 -38796 17289 10021 -33968 45315 -40274 20417 6282
209F282l7007P4530q5185O4979k1577k9393P0069q4776O8867k8027k3184O5313
$$ 6282 -30725 43805 -41380 23599 2022 -27371 42698 -42078 26789 -1238 -24422 40891
221D0891q3768P2086l4321j5843N9980q1999P4743m0301r128N4666q0549P7277
$$ 40891 -42877 29209 -5112 -20955 39025 -42974 31769 -8532 -17660 37006 -43543 33734
233C3734m5947k029M9344p8514P9442n1627M928M3369p5879Q0945n6658J1696
$$ 33734 -12213 -14242 35102 -43412 36030 -15597 -10669 32700 -43179 37766 -18892 -7196
245g196L7315p2394Q1402o0881J8249L0858o8971Q2149o5257K4489K4938o4946
$$ -7196 30119 -42275 39127 -21754 -3505 27353 -41618 40531 -24726 -237 24701 -40245
257d0245Q1462o8343L0640J7659n9553P9910p1252L6741J1112n4643P7934p3142
$$ -40245 41217 -27126 3514 21173 -38380 41530 -29722 7019 18131 -36512 41422 -31720
269c1720M1601M625m8738P5482p4623M6602j788m3287P2523p5534N1056q270l7162
$$ -31720 9881 14506 -34232 41250 -33373 13229 11441 -31846 40677 -34857 16199 7929 -29233
282b9233O9231p6162N5128j4351l1225O5950p6744N9069k0262k5311O1952p6117
$$ -29233 39998 -36164 18964 4613 -26612 39338 -37406 21663 1401 -23910 38042 -38075
294c8075O2662k6589j9310N8164p5926O6431l2835j2935N3857p5011O8927l7821
$$ -38075 24587 -2002 -21312 36852 -39074 27357 -5478 -18413 35444 -39567 29360 -8461
306h461o909M8864p3222P1234m3544L0M3427p1055P3269m8646N814L8300o8311
$$ -8461 -15370 33494 -39728 31506 -12038 -12008 31419 -39636 33633 -15013 -9199 29101 -39210
319c9210P3705n2054J1817L2366o4879P4077n6018J7872K6340o1021P3517n9252
$$ -39210 34495 -17559 -5742 26624 -38255 35822 -20196 -2324 24016 -37005 36512 -22740
331b2740K3675K0119n6502P2438o1994K9244J3777n1761P0763o4050L4292Q226
$$ -22740 935 21054 -35448 36990 -25004 4240 18017 -33744 37019 -27031 7261 15487
343A5487m7913O9700o6200L9054K531m2950O7633o7800M3192l309l7853O5479
$$ 15487 -32426 37274 -28926 10128 12659 -30291 37342 -30458 12734 9425 -28428 37051
355C7051o9461M7796r070l2475O2734p0433N2280j4954k7239N9501p0649N5718
$$ 37051 -32410 15386 6316 -26159 36575 -33858 18422 3468 -23771 35730 -34919 20799
367B0799k0777k1626N6586p0579N9185k6281j6148N2346o9511O1847l1502j0413
$$ 20799 22 -21604 34982 -35597 23588 -2693 -18841 33505 -36006 25841 -5661 -16074
379a6074M7909o8025O3520l6040m609M3402o6282O5191m0334R86L8483o3791O5727
$$ -16074 31835 -36190 27330 -8710 -13319 30083 -36199 28992 -11342 -10356 28127 -35664 30063
392C0063m3992O750L3020o0700O6458m7996J1830K8028n7617O6380n1037J7344
$$ 30063 -13929 -7179 25841 -34859 31599 -16397 -4567 23461 -34156 32224 -18813 -1469
404a469K2812n4367O5922n4029K2400J7475n0651O5688n6492K7054J1797m6916
$$ -1469 21343 -33024 32898 -21131 1269 18744 -31907 33781 -22711 4343 16140 -30776
416c0776O4789n8941L1713P050m3222O3766o1033L6423J088l8546O1971o2885
$$ -30776 34013 -24928 6785 13835 -29387 34379 -26654 9769 10857 -27689 34282 -28603
428b8603M0860m097l3999N9668o3567M4511r422k9062N7279o4516M8113j4469
$$ -28603 12257 8160 -25839 33829 -29738 14773 5351 -23711 33568 -30948 17165 2696
440B696k4062N3876o3836N0721j9253j9149N0129o3087N3226k3874j4332M6701
$$ 2696 -21366 32510 -31326 19395 142 -19007 31122 -31965 21261 -2613 -16945 29756
452B9756o2193N5539k8430q631M2241o0484N6539l2422l770L8520n8486N7582
$$ 29756 -32437 23102 -5328 -13959 28282 -32202 24337 -8085 -11855 26665 -31821 25761
464B5761l5946R89L3770n6147N8939m0096O108K9696n4106N9411m3041J0756K4850
$$ 25761 -10185 -9196 24574 -31573 27366 -12730 -6622 23074 -31032 28379 -14662 -3906 20944
477B0944n1584N9385m6515J6923J9676m8258N9664m9666K0672J5273m5410N9419
$$ 20944 -30640 28745 -17770 -847 18829 -29429 30235 -19431 1241 16514 -28896 30523
489C0523n1414K4541J0566m1001N7214n3347K9027N162l7175N5919n4526L3954
$$ 30523 -20891 3650 14216 -26785 30429 -22918 6109 11271 -25904 30015 -24511 9443
501I443O3l4418N4737n5377L5981l561k9169N2156n7063M0846q725k5778M9802
$$ 9443 9506 -24912 29825 -25552 10429 6868 -22301 29855 -27208 13638 4913 -20865 28937
514B8937n5737M1770j3419j9940M6650n5562M4574j8439j5675M2907n3890M6748
$$ 28937 -26800 14970 1551 -18389 28261 -27301 17273 -1166 -16841 26066 -27824 18924
526A8924k1830j1285M0092n3967M8570k6442n616L6369n3194N0864k9740k634
$$ 18924 -2906 -14191 25901 -28066 20504 -5938 -11554 24815 -28379 22485 -7255 -9889
538i889L3846n2053N1000l3231K539L0531n1212N3183l6623O827K5973m8684N4265
$$ -9889 23957 -28096 22904 -10327 -7788 22743 -28469 24714 -11909 -5082 20891 -27793 26472
551B6472m0811J1838K1091m6559N4710m2928J5677J7253m4355N5195m5322J9399
$$ 26472 -14339 -2501 18590 -27969 26741 -16187 -510 16743 -27612 27583 -17739 1660
563A660J3425m1080N3823m7269K3618Q337l7244N3338m8750K5593N473l3960N0883
$$ 1660 15085 -25995 27828 -19441 4177 12514 -24730 28608 -20142 5451 10924 -23036 27847
576B7847n0237L0691N02l0448M9054m9623L2189l938k6177M7008n0773L6647r090
$$ 27847 -22390 8301 8803 -21645 27409 -22214 9975 6037 -20140 26868 -23905 12742 3652
589C652k2765M5960n1397L8633j2515j8223M2465n1425M1696j6519j3750L9102
$$ 3652 -19113 26847 -24550 14083 1568 -16655 25810 -25615 16081 -438 -14188 24914
601B4914n0939M3667k0670r874L7157n0825M5827k4213n754L4096m9730M7414
$$ 24914 -26025 17642 -3028 -12902 24255 -26570 19257 -4956 -10710 23386 -26344 21070
613B1070k8337j261K9550m7748M9132l1947K409K6905m6279M9378l4531O863K3322
$$ 21070 -7267 -8528 21022 -26726 22406 -9541 -7132 19773 -26506 22872 -11659 -4796 18526
626A8526m4327M9669l6509J0335J9117m2445M9898l9398J4230J5934l8924M8490
$$ 18526 -25801 23868 -12641 -2306 16811 -25634 24264 -15134 -904 15030 -23894 24596
638B4596m1245J8138J1635l6052M7372m2458K1722O988l3192M7225m2422K4109
$$ 24596 -16649 1489 13124 -22928 24444 -18014 3708 10696 -22496 24729 -17693 6416
650F416K745l0714M6580m4129K5981J4k6723M4958m5755K9915m685k3406M3299
$$ 6416 9161 -21553 25027 -19102 6879 6893 -19830 25128 -20627 9288 4603 -18803 24496
663B4496m5626L2335r027j8641M1340m8417L6602j1917j6788L8814m6884L8771
$$ 24496 -21130 11205 2178 -16463 24877 -23540 13062 1145 -15643 23171 -23713 15058
675A5058j6490j3156L7464m6306M0868j9961r678L4018m6161M1831k2728m970
$$ 15058 -1432 -14588 22876 -23430 17438 -2523 -12201 21817 -24344 17487 -5241 -10211
687a0211L1491m5641M3136k5912j414K7772m3613M3884k7953K189K4761m1432
$$ -10211 21280 -24361 18775 -7137 -8551 19221 -24392 19492 -8461 -6272 18489 -22943
699b2943M3951l1462P101K0017m0604M4966l3282R632J8388l9475M5264l5041
$$ -22943 21008 -10454 -3353 16664 -23940 21026 -12256 -2624 15764 -23711 21553 -13488
711a3488J2671J4857l6292M4767l6995J5808J1179l4199M4636l8864J9331P250
$$ -13488 -817 14040 -22252 22515 -14480 1328 12507 -21692 22944 -15920 3411 10661
723A0661l2113M4996m1056K2825L506k8967M3201m1663K5737q17k4275M0955m3327
$$ 10661 -21452 23544 -17512 5313 8819 -20148 23053 -18610 7127 6310 -17965 22990 -20337
736b0337L0142n547k1737M0590m3291L0613p321j9006L8628m3839L2503j0456
$$ -20337 9805 4258 -17479 23111 -20180 10433 3112 -15894 22734 -21105 11398 942
748I42j4417L5339m4008L5815j4938j2043L4265m3750L7966j7520q435L0642m1653
$$ 942 -13475 21864 -22144 13671 -1267 -13310 20955 -22795 15171 -2349 -10784 19858 -21795
761b1795L7202j9657m720K8096m1020L9641k3283j795K5408m1078M0328k5139
$$ -21795 15407 -4250 -8970 19126 -21894 17747 -5536 -7331 18077 -23001 17327 -7812
773g812K274K2435l8971M1415k8643N220K0076l8451M2514l1231Q722J6686l6256
$$ -7812 -5538 16897 -22074 19341 -9302 -4082 15994 -22457 20057 -11174 -2452 14234 -22022
786b2022M3226l3489J1915J3429l3831M2722l5815J5408R851l1842M2189l7413
$$ -22022 21204 -12285 -370 13059 -20772 21950 -13865 1543 11394 -20448 21741 -15672
798a5672J9150O609k9632M1373l8126K1329L175k7026M1154m0006K4435j64k3876
$$ -15672 3478 10087 -19545 21828 -16298 5031 8206 -18820 22334 -17672 6763 6599 -17277
811a7277L9017m0277K7150l893k0752L7232m0303K8953o976j7568L5846m0936
$$ -17277 21740 -18537 8613 4720 -16032 21200 -19103 9850 2874 -14694 21152 -19784
823a9784L1250j0319j4533L3907m0841L2837j3314j0991L1551m0467L4335j5961
$$ -19784 11466 1147 -13386 20521 -20320 12517 -797 -11788 19763 -20704 13631 -2330
835b330p735K8972l9471L5893j9246m686K6755l8987L7144k2033j321K4337l8252
$$ -2330 -10065 18907 -20564 15329 -3917 -8603 18152 -20835 16309 -5724 -7045 17292 -20960
848b0960L8367k4766J920K1595l7000L9104k7075N166J8630l5813L9656k9443
$$ -20960 17407 -7359 -5439 16156 -20844 18260 -8815 -3649 14981 -20832 18824 -10619
860a0619Q590J5382l3595L9804l1809J2122J2239l1810L9838l3308J4308R181
$$ -10619 -2029 13353 -20242 19562 -12247 -125 12114 -19696 20142 -13166 1142 10323
872A0323k9018L8452l3869J7256N636k6692L8125l5680K0015L179k4873L7399
$$ 10323 -18695 19757 -14112 3144 8780 -17912 20213 -15467 4548 7727 -17146 20253
884B0253l6399K2337j46k2026L6001l6760K4173k868j9528L4898l7377K6425n858
$$ 20253 -16146 6191 6045 -15981 20020 -16740 7433 4565 -14963 19935 -17442 8983 3125
897C125j6530L2658l7306K8668r209j3635L1176l8323L0847j1868j0259K9393
$$ 3125 -13405 19253 -18053 10615 1406 -12229 18947 -19376 11471 -397 -10656 18737
909A8737l8151L2308j5114o916K6602l6944L3570j8158m096K4884l6786L5455
$$ 18737 -19414 12894 -2220 -9136 17466 -19478 14092 -4066 -8162 16722 -20064 15391
921A5391k1069q87K1895l4898L5725k2952J725J9985l4071L5715k4573M419J6855
$$ 15391 -5678 -6565 15330 -19568 16157 -6795 -5070 14915 -19156 16559 -8014 -3595 13260
934A3260l2472L6367k6507P776J3384l0503L6422k8540J0597J1349k9015L6035
$$ 13260 -19212 17155 -9352 -1576 11808 -18695 17727 -10813 -216 11133 -17882 18153
946A8153l0497J3587Q459k6480L5301l1531J6287N230k4927L4693l2403J7918
$$ 18153 -12344 1243 9702 -16778 18523 -13008 3279 8509 -16418 18275 -14128 3790
958C790L160k2818L4547l3148J9733L09k0445L3455l3801K1989l034j7362L1909
$$ 3790 6950 -15868 18679 -14469 5264 5573 -14872 18583 -15218 6771 3737 -13625 18284
971A8284l4596K4587n711j4782K9501l3423K5938r123j2242K8801l4708K8273
$$ 18284 -16312 8275 2564 -12218 17283 -16140 9798 675 -11567 17234 -17474 10799
983A0799j1431r089K6635l5145L0616j4644o489K4720l3994L1081j6340m319K3190
$$ 10799 -632 -9721 16914 -18231 12385 -2259 -8748 15972 -18022 13059 -3281 -7600 15590
996A5590l3395L1882j9202r22K0774l2513L2356k0718J357J8423l1252L2934k2750
$$ 15590 -17805 14077 -5125 -6047 14727 -17786 14570 -6148 -4791 13632 -17620 15314 -7436
1009g436M407J5430k9430L2923k4439O503J3024k7953L3627k6217R328J0297k6500
$$ -7436 -3029 12401 -17029 15894 -8545 -2042 10982 -16971 16656 -9561 -233 10064 -16436
1022a6436L3246k7815J2449P887k5059L2533k8687J4720M724k2927L2553l0177
$$ -16436 16810 -11005 1444 9331 -15728 16805 -11882 2838 7562 -15365 17188 -12989
1034a2989J7010K086k0698L1871l1237J9288l3j8919L0788l1912K1350k948j6528
$$ -12989 4021 6107 -14591 17280 -13957 5331 5298 -13621 17167 -14745 6605 3657 -12871
1047a2871L0044l2323K3095n753j3706K8454l2700K4669p891j1555K6872l2094
$$ -12871 17173 -15150 7945 2192 -11514 16940 -15760 8909 1018 -10537 16335 -15759
1059a5759K5827j0366r160K5559l2225K7156j2729o640K3492l1606K8248j4598
$$ -15759 10068 -298 -9458 16101 -16124 11032 -1697 -8337 15155 -16451 11797 -2801
1071b801m426K1167l0392K8962j6724j587J9330k9876K9670j8695R44J7326k9318
$$ -2801 -7227 13940 -16452 12510 -4214 -5801 13529 -16347 13323 -5372 -4428 12898 -16420
1084a6420L0276k0472L751J4586k7934L0766k2288O065J2396k6125L0336k4233
$$ -16420 13856 -6616 -2865 11721 -16213 14553 -7735 -1670 10726 -15399 14937 -9296
1096i296Q827J0176k4986L0760k5666J1096P499k3082L0418k6874J3113N509k1559
$$ -9296 -469 9707 -15279 15481 -10185 911 8410 -14672 15746 -11128 1985 7494 -14065
1109a4065K9868k7601J5349K643j9200K8673k8049J6933K56j7132K8108k8686
$$ -14065 15803 -11798 3551 6194 -13006 15667 -12382 4551 4807 -12325 15783 -12903
1121a2903J8641k242j5211K7436k9375K0278m371j2868K5669k8963K1614o535
$$ -12903 5738 3496 -11715 15721 -13654 6624 2253 -10615 15054 -13909 7705 1170
1133A170j0996K4234k8728K2968q883q370K2899k8723K4344j1040o230K1288k8728
$$ 1170 -9826 14408 -14320 8648 -235 -8605 14294 -14429 9915 -1125 -7355 13933 -14795
1146a4795K5299j2929m081J9566k7830K5932j4558j970J7705k7141K6881j6849
$$ -14795 10504 -2425 -6506 13060 -14770 11162 -3396 -5366 12339 -14802 12079 -4770
1158d770P24J5417k6170K7309j8479L159J3707k5421K7719k0197N346J1216k3743
$$ -4770 -4046 11371 -14799 12510 -5969 -2810 10897 -14524 13195 -7002 -1656 9560 -14183
1171a4183K7912k1707P650R110k2633K7695k2791R805O942k1069K7022k3358J1203
$$ -14183 13729 -7978 -328 8782 -13851 13844 -8947 858 7800 -13269 13753 -9605 1598
1184A598N110j9362K6599k4165J3273K374j7271K5849k4869J4456J068j5866K5137
$$ 1598 6708 -12654 13945 -10220 3053 5427 -11844 14005 -10864 3592 4660 -11206 13931
1197A3931k5459J6224j311j4050K4222k5499J8015l625j1962K3023k5905J9447
$$ 13931 -11528 4696 3385 -10665 13557 -11942 6073 2448 -9514 13509 -12396 7051
1209G051n895r906K2074k6070K0541p892p408K0320k5893K1873j0005n647J8989
$$ 7051 1156 -8750 13324 -12746 7795 -97 -7505 12815 -13078 8795 -1210 -6857 12132
1222A2132k5485K2974j1975l305J7378k5012K3473j3382j413J5590k3828K3558
$$ 12132 -13353 9621 -2354 -5659 11719 -13293 10180 -3202 -4615 10975 -12853 10705
1234A0705j4685J18J4156k3454K4393j6476K497J2334k2627K4562j7582M278J0697
$$ 10705 -3980 -3862 10294 -13160 11233 -5243 -2746 9588 -13039 11523 -6059 -1781 8916
1247H916k1466K4718j9016O199Q207j9547K4070j9449P421O901j8811K4248k0820
$$ 8916 -12550 12168 -6848 -649 7558 -11989 12081 -7368 53 6954 -11857 12391 -8429
1260h429R852M861j8043K3813k0534J0830K929j5389K1837k1288J2964J282j4633
$$ -8429 1423 6284 -11759 12054 -8480 2350 5279 -10110 11727 -9561 3403 4685 -9948
1273i948K1975k2443J4421j41j3137K1977k2997J5654l189j1176K0996k2625J6847
$$ -9948 12027 -10416 4005 3864 -9273 12704 -10293 5361 2172 -9004 11992 -10633 6214
1286F214m721q879J8916k3007J7421n347p239J7683k2382J7448p310m684J6420
$$ 6214 1493 -7386 11530 -11477 5944 597 -6642 11041 -11341 6107 -1203 -5887 10533
1299A0533k1627J8185q274m252J5632k1658K1036j2168k970J5359k1046K1134
$$ 10533 -11094 7091 -1183 -5435 10197 -11461 9575 -2593 -5563 9796 -11250 9884
1311I884j4026R8J3258k0344K0396j3587J394J1088j9228K0636j4319M053Q020
$$ 9884 -4142 -4044 9214 -11130 9266 -4321 -2927 8161 -11067 9569 -4750 -697 7323
1324G323j8396K0951j5610N282P866j8119K1618j7580P003O243j7044K0796j7398
$$ 7323 -11073 9878 -5732 -450 7416 -10703 10915 -6665 338 6581 -10463 10333 -7065
1337g065P521M628j4891K0760j9011R817K679j3317J9471j8763J1099K13j2010
$$ -7065 456 5084 -9807 10953 -8058 1759 4438 -8879 10592 -8171 2928 3141 -8869
1350h869J9731j9715J2425j138j0511J8822j9818J3388k815r036J7461j9278J4352
$$ -8869 10862 -8853 3572 2434 -8077 10745 -9073 4315 1500 -7536 9925 -9353 4999
1363D999l684q330J7237j9537J4884n411o238J5971j9678J6104o776n177J4920
$$ 4999 1315 -7015 10222 -9315 5569 158 -6080 9891 -9787 6317 -459 -5636 9284
1376I284j9179J6900q409l631J4148j9011J7190r459j743J2581j8257J7585j1366
$$ 9284 -9895 7005 -1404 -5035 9113 -9898 7292 -2167 -3910 8671 -9586 7999 -3367
1389c367n8J1722j8136J8056j2447J724J0146j7225J8220j3042L182Q439j6776
$$ -3367 -3425 8297 -9839 8217 -4230 -2506 7640 -9585 8635 -4407 -1225 7214 -9562
1402i562J9014j4602L819P499j5784J8963j4730N275N929j5536J8705j5537O957
$$ -9562 9452 -5150 -1331 6168 -9616 9347 -5383 -108 5821 -9715 8990 -6547 410
1415D10M585j3826J8317j6353Q436J851j2615J8044j5503Q622J059j0756J7038
$$ 410 4995 -8831 9486 -6867 1569 3420 -9195 8849 -6654 1968 3027 -7729 9309
1428I309j6786J0355n11r655J5767j6337J0740j159q411J6012j7017J1698k414
$$ 9309 -7477 2878 2367 -7288 8479 -7858 2882 1723 -6688 9324 -7693 4005 1591
1441A591q009J5315j7434J3568m365o022J3687j6843J3553m976n723J4023j6396
$$ 1591 -6418 8897 -8537 5031 666 -5356 8331 -8512 5041 65 -5658 8365 -8031
1454h031J4101p553l118J2701j6949J5248q004j529J0684j5746J5062r173o92
$$ -8031 6070 -1483 -4601 8100 -8849 6399 -1605 -3134 7550 -8196 6866 -2307 -2999
1467b999J0452j6201J5606r023NR070j5009J5278j0614J906P797j4950J5629j1438
$$ -2999 7453 -8748 6858 -2165 -2160 6910 -8099 7179 -3435 -1529 6268 -8682 6947 -4491
1481d491K733P767j4459J6353j2009L870N328j3245J5858j2433N299M296j2694
$$ -4491 -1758 6009 -8450 7903 -4106 -236 5092 -8153 7705 -4728 571 4867 -7827
1494g827J5833j3230N634K716j0577J5609j4447P710J879r559J3497j3565R070
$$ -7827 8006 -5224 410 3126 -7451 8158 -6289 1421 3300 -6259 7238 -6327 2743
1507B743m99r137J4853j4396R297r80p382J3299j4421R752j681p142J3984j4985
$$ 2743 2244 -6893 7960 -6436 2861 1881 -5501 7798 -6623 3129 1448 -5694 8290 -6695
1521f695J0509l311o296J3317j5172J2333m629l802J0644j4676J3077o120l316
$$ -6695 3814 503 -5793 7524 -7648 4685 56 -3746 6898 -7778 5299 -821 -4137
1534d137J1292j4475J2991o639k673J0717j4550J3692q170j206R107j2916J2755
$$ -4137 7155 -7320 5671 -968 -3641 7076 -7474 6218 -1952 -3158 5949 -6967 5788
1547E788q145l72Q412j2977J3163r205J403P416j2670J3470r814K361O264j1320
$$ 5788 -2357 -2729 5683 -7294 5869 -3336 -1933 5483 -7187 6283 -3531 -1170 5094 -6226
1561f226J2363r999K580N364j0621J3552j0661L336M611j1020J3833j2464N462
$$ -6226 6137 -3862 -1282 4082 -6539 7013 -3648 -312 4299 -6721 7112 -5352 110
1574A10L694r604J2300j0604N698J161p810J0939j0724N563J890q573J2465j2333
$$ 110 3804 -5800 6500 -4104 1594 2755 -5055 5884 -4840 723 2613 -5960 6505 -5828
1588e828Q054O47q101J2069j1913Q231j391o320J0971j2141R615l089n848J2186
$$ -5828 2226 2873 -5228 6841 -5072 3159 1768 -4552 6419 -5722 3893 804 -5044 7142
1602G142j2682Q622k859m112J0406j2108Q973l686l633R670j1486R881n467j782
$$ 7142 -5540 3082 223 -3889 6517 -5591 3382 -304 -3937 5733 -5753 4128 -1339 -3121
1616c121Q821j2506J1661o142j184Q046j2455J1543n883j147P208j1177J1314
$$ -3121 5700 -6806 4855 -1287 -2471 5575 -6880 4663 -1220 -2367 4841 -6336 4978
1629D978p182J07O663j0962J2366q675J840M594r822J1032p502J611M451r978
$$ 4978 -2204 -2097 4566 -6396 5970 -2705 -865 3729 -6093 4939 -2563 -952 3499 -6479
1643f479J2293q325J625M190q657J1127j0269N452K445q449J0694r242M983R64
$$ -6479 5814 -2511 -886 3304 -5353 5774 -4495 957 3402 -5047 5647 -3595 1388 2352
1657B352q050J2198j0966N013K639o972Q766r067M670M20o492J1855j1122O049
$$ 2352 -5698 6500 -4466 547 3186 -3786 4980 -4087 583 1003 -5489 6366 -4756 1293
1671A293J59n924J0476j1182Q062j734n544J0154j0472P370j724l792Q472j1347
$$ 1293 1452 -4472 6004 -5178 2884 1150 -4394 5760 -4712 2658 934 -2858 5614 -5733
1685e733R531l887l098Q267j0404R281l868k337P404j0047R070m237k452P097
$$ -5733 3798 -89 -3187 5080 -5324 3957 89 -2248 5156 -4891 4179 -58 -2510 4587
1699D587j0360R449m337q06N994r183R010n699k51N294q817R679o276l55O555
$$ 4587 -5773 3676 -661 -1467 4527 -4656 4354 -1345 -1596 3698 -5119 4560 -1716 -2071 4484
1714D484r644J0668q367K099M338q197J0447q256J888L862q470J0188q348K425
$$ 4484 -5160 5508 -2859 -760 3578 -4619 5828 -2428 -540 3322 -5148 5040 -3308 -883
1728h83M084q130R626p698L656K142p762R794q086L533N73n513R386q309M743
$$ -883 3201 -4929 4697 -3001 655 2797 -4965 4829 -3257 276 849 -4664 4722 -3587 1156
1743A156M46n625R710j0920P163K63o373R438r991N890p49l565Q178r595O254
$$ 1156 1602 -4023 5687 -5233 1930 2193 -4180 5258 -4733 1157 408 -3157 5021 -4574 1680
1758A680q64n367R706j0107P288j907l994Q944j0322Q237l593k274P447r596P912
$$ 1680 816 -4551 5155 -4952 2336 429 -3565 5379 -4943 3294 -299 -2573 4874 -4722 3190
1773C190l729j710O536r267Q695m296j382O557r318Q169m588q79O100r176Q777
$$ 3190 -539 -2249 4287 -4980 3715 -581 -1963 4594 -4724 3445 -1143 -2022 4078 -5098 3679
1788C679n216k19N517q577R099o405R27M757q434Q946o059J491L738q127R287
$$ 3679 -1537 -1756 3761 -4816 4283 -2122 -1195 3562 -4872 4074 -1985 -494 3244 -4883 4404
1803D404o783K022L639p741Q991o838K299K890p129Q649p470L164K422o682Q782
$$ 4404 -2379 -357 3282 -4459 4532 -2306 -7 2883 -4246 4403 -3067 97 2519 -4163 4619
1818D619p799M075J224o045Q545q207M490Q06n603Q481q182M831M6m756Q205q505
$$ 4619 -3180 895 2119 -3926 4619 -3588 902 1708 -3895 4586 -3596 1235 1281 -3475 4730 -3775
1834c775N642r71m230P960q501O021j582l535P334q645O483k058k651O554q364
$$ -3775 1867 896 -3334 4626 -3875 2146 564 -2971 4363 -4282 2201 143 -2508 4046 -4318
1849d318O832k570k406O578q529P093l081j524N978q369P649l873j289N873q620
$$ -4318 2514 -56 -2462 4116 -4413 2680 -401 -1925 4053 -4316 3333 -540 -1829 4044 -4576
1864d576P795m207m53M847p799P863m623m04N075p863Q137n298Q64L984p393P684
$$ -4576 3219 -988 -1441 3406 -4393 3470 -1153 -1557 3518 -4345 3792 -1506 -642 3342 -4051 3633
1880C633n663J507L429o955P899o138J912L206o965Q523o745K451K086o109P899
$$ 3633 -2030 -523 2906 -4049 3850 -2288 -376 2830 -4135 4388 -2357 94 2180 -3929 3970
1895C970o772L137J666n732P879o813L339Q36n077P680p361M275K91m645P295
$$ 3970 -2802 335 2001 -3731 4148 -2665 674 1510 -3567 4113 -3248 1027 1318 -3327 3968
1910C968o995M342k47m187O928p279N046o13l701O714p425N332j291l400O704
$$ 3968 -3027 1315 1068 -3119 3809 -3470 1576 963 -2738 3976 -3449 1883 592 -2808 3896
1925C896p467N505j729k695O281p669O162k515k062O113p559O204k656j916N681
$$ 3896 -3571 1934 205 -2490 3791 -3878 2284 -231 -2293 3820 -3739 2465 -191 -2107 3574
1940C574p758O694l344q99N034p089O785m209k11M334o868P215m486J30M026p020
$$ 3574 -4184 2510 -834 -1733 3301 -3788 2997 -1212 -1423 2911 -3957 3258 -1228 -1098 2928 -4092
1956d092P244m725O79L572o297O839n114J408L369o510O923n049J479K411n922
$$ -4092 3152 -1573 -894 2678 -3619 3220 -1894 -486 2883 -3627 3296 -1753 -274 2137 -3785
1971c785P487n937K286K247n695P046o215K859J699n374P346o649L381R83m748
$$ -3785 3702 -2235 51 2298 -3397 3649 -2566 293 1992 -3382 3964 -2685 696 1679 -3069
1986c069O708o516L758M64m397O515o446M139j05m054O475o323M224n08l596O174
$$ -3069 3639 -2877 881 1345 -3052 3463 -2983 1156 1051 -3003 3472 -2851 1373 865 -2731 3443
2002C443o571M762j056l337O278o906M965j576k170N608o837N538k175j710N286
$$ 3443 -3128 1634 578 -2759 3519 -3387 1578 2 -2168 3440 -3397 2141 -34 -1744 3542
2017C542o999O103k755j661M388n555N563l144p4L532o338O210l577n58M094o325
$$ 3542 -3457 2646 -109 -1770 2618 -2937 2626 -518 -592 2940 -3398 2812 -765 -1323 2771 -3554
2033c554O177m413Q28L367n806O401l996O3L592n903O301m819J464K041m957O640
$$ -3554 2623 -1790 -962 2405 -3401 3000 -996 -933 2659 -3244 3057 -1762 -298 1743 -3214 3426
2049C426n722J870K551n989O362m612K001J432m755P237o083K767J058l728N260
$$ 3426 -2296 -426 2125 -3864 2498 -2114 -113 1319 -3436 3801 -2282 485 1543 -2185 3075
2064C075n106K737j57l164N807n762L610P5l134M552n564L697o2k392N085n648
$$ 3075 -2031 706 549 -2615 3192 -2570 1040 1115 -2019 2533 -3031 666 604 -1788 3297 -2351
2080b351K323R35k441M734o194M575j059l319N102m808M193j530j912M934n416
$$ -2351 -28 907 -1534 3200 -2994 1581 522 -2797 2305 -2503 1690 160 -1752 3182 -2234
2095b234M895k190j341M334p731O393k116j980L860n378N363l147j55M047n876
$$ -2234 2661 471 -870 3464 -4267 2126 10 -1970 1890 -3488 1875 -1272 -1427 2620 -3256
2110c256N442l373n45M328n771N221l187M85L295n283N069m016N09L728o100O030
$$ -3256 2186 -1187 -1732 2596 -3175 2046 -1141 -656 2639 -2644 2425 -1591 -1082 2646 -3454 2576
2126B576m359J256K724m784N662m752J267K279l829N270m683J526J676m459N771
$$ 2576 -1783 -527 2197 -2587 3075 -1677 -410 1869 -1960 3310 -1373 153 1829 -2630 3141
2141C141n272K814O58m514N764m342J951J145m251N221m978L323j91k703N233
$$ 3141 -2131 683 1341 -3173 2591 -1751 200 1345 -2906 2315 -2663 660 469 -2234 2999
2156B999n632L165N70l816N861n719L819q36k241M436m296L238j211j844M197
$$ 2999 -2633 532 1102 -2714 3147 -2572 1247 411 -1830 2606 -1690 1548 337 -1507 2690
2171B690n059M390o50k831M313m905M087k557j524M754n255M405k442j091L955
$$ 2690 -2369 2021 1371 -1460 2853 -2052 2035 -522 -2046 2708 -2547 1858 -584 -1675 2280
2186B280m816M771k736j260M259n301M308j915l52K611m349N140m005P35K633
$$ 2280 -2536 2235 -501 -1761 2498 -2803 1505 -410 -762 1849 -2500 2640 -1365 -630 2003
2201B003l903M802l923P62K787m922M827l462L8K533l543L962k345K9K569m772
$$ 2003 -1900 2902 -1021 -259 2528 -2394 2433 -1029 -991 1542 -2001 1961 -384 -355 2214 -2558
2217b558N102l282Q68J735m195M150l520K000M86k944M721m515Q42J875l956O851
$$ -2558 2544 -738 130 1865 -2330 1820 -1700 300 786 -2158 2563 -1952 -1110 765 -3191 3660
2233C660n649K936k74l880N613m794L285O38l900N643n186M132j652j033L278
$$ 3660 -1989 947 673 -3207 2406 -2388 897 1535 -2365 3278 -1908 2224 572 -461 2817
2248B817n635L901o10j781L977n878M123j371o21L614n220L632j502r88L618m166
$$ 2817 -2818 1083 473 -1308 2669 -3209 914 -457 -1078 2536 -2684 948 -554 -1542 2076 -2090
2264b090M422k753j144L616m647N011l360k83L202n031M486j928l42L283n372
$$ -2090 2332 -421 -1565 2051 -2596 2415 -945 -1228 1974 -3057 1429 -499 -841 2442 -2930
2279b930N424l323NK461l561M776l865M9K852m877N025k549P55J415l967M927
$$ -2930 2494 -829 -824 1637 -1924 2852 -1013 -964 1888 -2989 2036 -513 242 1657 -2310 2617
2295B617l926J233K082m210M707m880L134Q64m880N405l639J820L99k557M588
$$ 2617 -1309 -76 2006 -2204 2503 -2377 757 1621 -3259 2146 -1493 327 726 -1831 2757
2310B757m554K095K12k087L215m209L824O21l145L857m230J965M58k556M775n624
$$ 2757 -1797 298 510 -1577 1638 -2571 1253 1874 -1271 2586 -1644 321 779 -1777 2998 -2626
2326b626L265L90k901L929m272L568o08k177L270m464M082p26j850M033m525L766
$$ -2626 639 1029 -1872 2057 -2215 1353 745 -1432 1838 -2626 1456 730 -1120 2913 -1612 2154
2342B154k003j168K592m056L866j945q2K802m411M151k040j224K806l198L783
$$ 2154 151 -1017 1575 -2481 1385 -560 -642 2160 -2251 1900 -140 -1364 1442 -1756 2027
2357B027k806L51K202l551M167l169J07K015l205L610k410N6K207m257M832l666
$$ 2027 -779 -428 1774 -1777 2390 -779 -672 1343 -1862 1748 -662 -606 1601 -2656 2176 -1490
2373a490J216J265l000M334l849J469J341l346M250l588J360J228l008M235l990
$$ -1490 -274 991 -2009 2325 -1524 -55 1286 -2060 2190 -1398 -38 1190 -1818 2417 -1573
2388a573K033P98l239M194l800K139N78k844L931l855K341j7k461L927m173K599
$$ -1573 460 1258 -1981 2213 -1587 552 1130 -1714 2217 -1638 703 686 -1775 2152 -2021 578
2404E78p0k048L614m228K948j2k354L581m103L161m42k063L584l872L059j199
$$ 578 508 -1540 2074 -2154 794 782 -1572 2009 -2094 1067 625 -1438 2146 -1726 1333 134
2420A34j227L344m526L364j307o95K972m286L748j852p29L031l859L489k075o48
$$ 134 -1093 2251 -2275 1089 -218 -913 2059 -2227 1521 -331 -1060 1971 -1888 1601 -474 -1122
2436a122K971l796L473j931j02K040l696L972k563J96K377l749M160k917M49J619
$$ -1122 1849 -1947 1526 -405 -507 1533 -2163 1809 -754 -558 1819 -1930 2230 -687 -238 1381
2452A381l206L806l057R71J396l337L995l211J345R24k664L631l139J258O85k628
$$ 1381 -1825 1981 -1076 -105 1291 -2046 1949 -1262 83 1007 -1657 1974 -1165 93 778 -1850
2468a850L788l329K056K34k588L870l571J658J63k046L666l693K157L53k417L282
$$ -1850 1938 -1391 665 899 -1689 2181 -1390 268 431 -1615 2051 -1642 515 868 -1549 1733
2484A733l513K329q8k009L542m117K934n88j614L121l356K882q52j240K609l547
$$ 1733 -1780 549 461 -1548 1994 -2123 811 223 -1391 1730 -1626 1256 404 -836 1773 -1774
2500a774L033j235j146L296m051L267j435q35K598l511K982j317q67K212l431
$$ -1774 1259 24 -1122 2174 -1877 1390 -45 -880 1718 -1793 1189 -128 -995 1217 -2214
2515b214L930j490q59J649l355L755j590jJ198l489M002j967N58Q68l095M227
$$ -2214 1716 226 -633 1016 -2339 1416 -174 -175 1023 -2466 1536 -431 127 995 -2100 2127
2531B127k898N45J568l121K974k320Q48J291k816L530k960Q17J512k538L014k910
$$ 2127 -771 -226 1342 -1779 1195 -1125 -277 1014 -1802 1728 -1232 -415 1097 -1441 1573 -1337
2547a337J510O33k201L254l034J440M34k266L147l071J788J58k023L019k830J934
$$ -1337 173 806 -1395 1859 -1175 265 699 -1567 1580 -1491 297 455 -1568 1451 -1379 555
2563E55P1j803L101l556K479m74j365K698l244K386o62j424L052l340K550r40
$$ 555 626 -1177 1924 -1632 847 373 -992 1706 -1538 848 186 -1238 1814 -1526 1024 84
2579H4r43K540l292K497q51p69K187l330K939j492l26K033k874K866j612j13J873
$$ 84 -859 1681 -1611 886 35 -734 1453 -1877 1062 -430 -756 1277 -1597 1269 -343 -456 1417
2596A417l162L150j591l40J797k907K668j607J86J773l000K918j981K08J510k649
$$ 1417 -1745 1405 -186 -526 1271 -1636 1032 -575 -389 1384 -1616 1302 -679 -471 1039 -1610
2612a610K915k156M47J008j825K736k612J212j87j741L158k940J169J521l490
$$ -1610 1305 -851 -404 604 -1221 1515 -1097 115 -72 -1813 1345 -1595 -426 1095 -2395
2627b395M230k578J202K86k003K810k883J943n21j448L133k639J671m01j494K436
$$ -2395 1835 -743 459 745 -1258 1552 -1331 612 91 -1357 1776 -863 808 407 -1087 1349
2643A349k703J953n37j079K776l317K183l53j065K272l192K512j087p46K003k031
$$ 1349 -1354 599 62 -1017 1759 -1558 625 272 -793 1479 -1713 799 -288 -1034 969 -1062
2659a062J864p72n36J863k680K181r09o09J920k786K574j353n21K244k812K565
$$ -1062 802 30 -506 1357 -1323 858 -51 -660 1260 -1526 1048 -305 -826 1418 -1394 1171
2675A171j404j75J510k544K595j691kJ820k975L231k038J71J371k593K929j993
$$ 1171 -233 -408 1102 -1442 1153 -538 -540 1280 -1695 1536 -502 -331 1040 -1553 1376 -617
2691f17L82J206k637L058k110O78Q48k132K986k552J095L80j872K699k529J299
$$ -617 -235 971 -1666 1392 -718 -40 808 -1324 1662 -890 205 585 -1287 1412 -1117 182
2707A82K95j417K270k601J625R0j572K317k352J401J35j518K547k583J741l48
$$ 182 477 -940 1330 -1271 354 444 -1128 1189 -1163 238 373 -1145 1402 -1181 560 212
2723B12j266K215k292J741m29r85K150k509J867p49o86J821k303J912q40l98K045
$$ 212 -1054 1161 -1131 610 181 -804 1346 -1163 704 -45 -731 1090 -1213 699 -141 -539 1506
2740A506k995K321p48p69J924k514K210j007n70J524k154K530j830J21J422k271
$$ 1506 -1489 832 84 -685 1239 -1275 935 -72 -642 882 -1272 1258 -572 -451 971 -1300
2756a300K570j881J66J419k433K501j638M21J047k437K568j770M94J044k072K448
$$ -1300 1270 -611 -445 974 -1459 1042 -596 -175 872 -1565 1003 -767 -273 771 -1301 1147
2772A147k100Q17R15k038K648k389Q64N37j566K464k075Q66N89j998K824k448
$$ 1147 -953 -136 779 -1259 1389 -1000 -136 401 -1165 1299 -776 90 679 -1319 1505 -943
2788i43J001K97j551K660k498J442O3j727K607k406J503k08j094K414k589J967
$$ -943 58 355 -1196 1464 -1034 408 471 -1256 1351 -1055 448 240 -854 1560 -1029 938
2804I38p98j103K269k404J836o62o48J937k359J762q46p65K065k261J831j022
$$ 938 140 -963 1306 -1098 738 76 -572 1365 -994 768 -78 -843 1222 -1039 792 -230
2820b30l33J878k639K122j104j92J903k667J992j186k9J418k141K327j725L09
$$ -230 -563 1315 -1324 798 -306 -498 1405 -1262 730 -456 -485 933 -1208 1119 -606 -297
2836b97J239k153K109j455N43J011k419K263j669P83R67j983J903j641P50L68
$$ -297 942 -1211 898 -557 -14 997 -1422 841 -828 -45 922 -1061 842 -799 -49 319
2852C19j523K426j908N73Q37j877K536k158R63N54j802K123j946J129J25j182
$$ 319 -1204 1222 -686 -113 724 -1153 1383 -775 188 742 -1060 1063 -883 246 371 -811
2868h11J886k079J160K01j164J740j824J088K70j356K267k509J706l12r05J360
$$ -811 1075 -1004 156 357 -807 933 -891 197 467 -889 1378 -1131 575 263 -642 718
2884G18j815J869o90p73J957k382J822q32n48J482k017K062j193l5J379k223K070
$$ 718 -1097 772 82 -691 1266 -1116 706 -126 -674 808 -1209 853 -340 -375 1004 -1219 851
2901H51j300k59J842k507K192j548n34K517k384K309r42l2K20j650K198j238P1
$$ 851 -449 -708 1134 -1373 819 -729 -1263 1254 -1130 1179 237 205 425 -1225 973 -265 -194
2918a94J165k294J437q92O96N61j642K427k294J905o78j039J742j451P35N19j825
$$ -194 971 -1323 114 -778 -82 479 -1163 1264 -1030 875 197 -842 900 -551 184 703 -1122
2935a122J801j366R16L85j719K248k232J524j58j155J837j815J300l25q43J898
$$ -1122 679 -687 229 614 -1105 1143 -1089 435 277 -878 959 -856 444 119 -724 1174
2951A174k082J340k71q73J753k058J529q6j014J622j940J413n57m94J656k220
$$ 1174 -908 432 161 -712 1041 -1017 512 426 -588 1034 -906 507 -50 -544 1112 -1108
2967a108J711p11m79J756k152J631p30k57J009j601J575o93k47J275k090J956
$$ -1108 603 -108 -587 1169 -983 648 -82 -339 670 -931 644 -49 -296 979 -1111 845
2983H45j168j73J479k000K023j286n5Q91j597J872j275N19R18k000J837j372L64
$$ 845 -323 -496 983 -1017 1006 -280 -335 556 -1041 831 -444 75 993 -1007 830 -542 -178
3000a78R77j663J635j504O74N75j470J842j819R97L45j265J636j705J041M49j063
$$ -178 799 -864 771 -733 -59 516 -954 888 -931 66 411 -854 782 -923 118 567 -496
3017d96J552j975J242P5j267J898j681R24r4q79J505j576J274k04r95J806k039
$$ -496 1056 -919 323 398 -869 1029 -652 272 178 -701 804 -772 502 298 -697 1109 -930
3034i30J472m14o79J555j871J527p84m75J565j788J161l48n84J571j944J846j067
$$ -930 542 128 -551 1004 -867 660 -124 -599 966 -822 339 -9 -593 978 -966 880 -187
3051a87k54J297j831J748j467N61Q26j597J961j431L14P53j720J915j560O29R82
$$ -187 -441 856 -975 773 -694 -133 693 -904 1057 -374 -60 693 -1027 888 -672 -43 939
3068I39k054J972j439M67Q48j610J821j470J88P79j224J559j263N36M90j359J589
$$ 939 -1115 857 -582 -115 733 -877 944 -526 -338 441 -783 776 -487 49 539 -820 769
3085G69j384R66K61j253J835j969Q15M24j192J605j531Q75m9p81J729j921J193
$$ 769 -615 351 612 -641 1194 -775 40 464 -728 877 -654 221 172 -609 1120 -801 392
3102C92j40p84J313j779J412j68q95J623j910J311J4j168J726j628J276o43k76
$$ 392 252 -532 781 -998 414 246 -649 974 -936 375 389 -779 947 -681 595 -48 -324
3119c24J491j996J422p48l78J478j815J450o35n09J330j763J815q18m63J200j453
$$ -324 1167 -829 593 -155 -533 945 -870 580 -55 -564 766 -997 818 0 -463 737 -716
3136g16J335j116M25P36j746J894j139L69Q05j595J609j175K10P12j452J305q58
$$ -716 619 -497 -72 664 -1082 812 -327 42 847 -748 861 -314 -104 608 -844 461 -397
3153c97J5Q97j640J948j241P60K97j236J280j010R27K01j415J548j351Q95q5o77
$$ -397 -382 515 -1125 823 -418 342 639 -597 683 -327 600 801 -614 934 -417 478 393 -284
3171b84P91j217R54N43r88J062j712J225K69j707J537q64J254j034l1J038r97
$$ -284 507 -710 244 787 -201 861 -851 374 643 -1064 473 -391 863 -171 -202 836 -161
3188a61N88qj073J430k344K011p37l8M92j519J897l36n29Q28r44J545j241K45
$$ -161 427 419 -654 776 -1568 443 -294 -332 160 -1359 538 202 -327 501 -443 1102 -139 106
3206A06Q50j951J108n39j21J136j437K553j933l46R50j088J996j910K22M78j183
$$ 106 956 -995 113 -426 -547 589 -848 1705 -228 -574 376 -712 1284 -626 -404 74 -1109
3223a109J672m03O5m94o61K592k898J950p5j944J989j053J47J157j785J706j317
$$ -1109 563 160 225 -269 -930 1662 -1236 714 639 -1305 684 -369 -222 935 -850 856 -461
3240d61Q70k76j68J788j871P15n14o58R98p09M24K30j147J352m50K77k16n42P19
$$ -461 409 133 -35 1753 -118 597 83 -575 423 -286 138 368 -779 573 123 400 184 -358 361
3259C61j343K123j181j028J549r63J120o47m25J506j817J319r76M47R30k399K676
$$ 361 -982 1141 -40 -1068 481 -482 638 -9 -434 1072 -745 574 -402 45 975 -1424 1252
3276A252j386M7P71j314J435q97j78N27o55J170j110J024K76k254J690j048M62
$$ 1252 -134 -87 684 -630 805 -92 -270 257 -398 772 -338 686 962 -1292 398 -650 -188
3293a88Q22j667J842q50M3K22j037K322k108J323m40j121J030n88J82J042j203
$$ -188 634 -1033 809 -41 2 224 -813 1509 -599 724 284 -837 193 -395 -213 829 -374
3310c74J047j415M99O76p76J938j952Q23p59j067K597j505K04k01j04J285j281
$$ -374 673 -742 -243 433 -343 1595 -357 466 -293 -1360 1237 -268 -64 -265 -369 916 -365
3327c65Q60l11o47J284j310J069o6q63J596j766R19k64o72R43j211J184k06p40
$$ -365 495 184 -463 821 -489 580 514 -349 1247 -519 400 136 -536 407 -804 380 174 -566
3345e66J606j934J295o32k68R94j863K183r02j90J017r90J433j137k6O70j125
$$ -566 1040 -894 401 -231 -499 495 -1368 815 -87 -277 740 -250 1183 46 20 690 -435
3362d35J163j318P54M49j486J647m54o66P44r69Q95q13P8R95j257J963j756P14
$$ -435 728 -590 164 613 -873 774 320 -346 398 -571 324 -489 -411 584 -673 1290 -466 248
3380B48L62j092J294j222N72K00j410J434r49R38K40j007J421j632Q84p2j058
$$ 248 610 -482 812 -410 162 362 -1048 386 -563 375 615 -392 1029 -603 281 209 -849
3397h49J471j078P71m65j278K020j668J524j8j354J462j475J668k73k14M73j937
$$ -849 622 -456 315 -150 -1428 592 -1076 448 430 -924 538 -937 731 458 244 717 -1220
3414a220J714J00n45O89j414J161j116O79J305j868K145j747r9O03j205J622p26
$$ -1220 494 594 49 738 -676 485 -631 48 1353 -515 1630 -117 -216 387 -818 804 78
3431G8l16L59p16J130j053Q36P16k366K085j002l73J223o24M48j539O30P81j870
$$ 78 -238 121 -595 535 -518 318 1034 -1332 753 -249 -622 601 -23 425 -1114 -484 297 -1573
3449a573K644q23j17O45j387P69n48R4J036n91J198j895J233m27r44N78m04J314
$$ -1573 1071 248 131 776 -611 158 -390 -296 740 149 1347 -548 685 258 -686 -108 -512 802
3467H02q46p16J337o12q6P69p36M63k07K56l41o71J748k892K110n31r74Q78r6
$$ 802 -44 -760 577 -35 -121 648 -88 375 168 424 83 -588 1160 -1732 378 -153 -1127 -249 -345
3486c45P24j57j182K539k308J697k66j130O15j063O27l31O93J38j800K272m67
$$ -345 379 222 -960 1579 -729 968 702 -428 187 -876 -249 -580 113 251 -1549 723 256
3503B56J16j26j210J295r71J21K27j319L271k414P00L66q79J063N12n83J000j961
$$ 256 372 246 -964 331 -640 -519 -292 -1611 1660 -754 -54 312 -567 496 1008 425 1425 -536
3521e36Q61r7l37L98j340K117j623J072n08j188K744k082P76k0p21J482j712R34
$$ -536 325 228 -109 289 -1051 1066 -557 515 7 -1181 1563 -519 257 237 -484 998 -714 220
3539B20j05j202J817j744Q99J30q2R46j021M73L47j278J845k147J346q76l56K018
$$ 220 115 -1087 730 -1014 -115 15 -67 879 -142 331 678 -600 1245 -902 444 -432 -788 1230
3557A230k309J647j004K48O90p58Q04L0j429K310k740K218m66l71Q47k109J277
$$ 1230 -1079 568 -436 -188 502 -256 548 578 -851 1459 -1281 937 471 100 947 -1162 115
3574A15N38n92L04r35J601j294M2J051k343J903O8k53k31J35P14r74jJ739k352
$$ 115 653 61 365 -570 1031 -263 -221 830 -1513 390 458 205 -26 109 823 -151 -152 1587 -765
3593g65J399j687L26J479j782J502q02j559K525q68P41j060Q26p33K7J560k212
$$ -765 634 -1053 -727 752 -1030 472 -330 -1889 636 -232 509 -551 275 -458 -431 1129 -1083
3610a083O32M55j087J988j1j063L0p38J621j904K005j142l5J097j493J402p24
$$ -1083 -451 4 -1083 905 894 -169 -139 -877 744 -1160 845 -297 -332 765 -728 674 -50
3627e0K56P66k053J486m38l54P58j184J230k64p47J532j153Q56L81j750J550j252
$$ -50 206 972 -1081 405 -33 -387 371 -813 417 153 -594 938 -215 641 1022 -728 822 -430
3645d30Q13k76k50R57j555J244m39k41J104j794J577j146J25J406j913J306n69
$$ -430 383 107 -143 814 -741 503 64 -177 927 -867 710 -436 -311 1095 -818 488 -81
3662h1P8N88j376J486j074M10L63j209J563j057K11O56j301J387j104M68L46j139
$$ -81 -3 585 -791 695 -379 31 394 -815 748 -309 -98 558 -743 644 -460 8 354 -785
3680g85J269j029Q14r8r31J401j203O05J47q04J570j547P33n9p82J526j633J027
$$ -785 484 -545 269 171 -760 641 -562 43 190 -614 956 -591 142 83 -699 827 -806 221
3698B21j44o36J194j347J117m65k60P33j127J058k05n54J263j497R41n09j08J000
$$ 221 77 -559 635 -712 405 -60 -320 413 -714 344 139 -415 848 -649 292 -217 -325 675
3716F75j575J444n07n13J333j761J527r11j97J364j583J102m44j37Q98j456J336
$$ 675 -900 544 37 -476 857 -904 623 -288 -485 879 -704 398 -46 -183 715 -741 595
3733E95j051L6P64q21J388r89J82K25j286J495p21k69Q28j355K058j469K06R12
$$ 595 -456 -420 344 -477 911 -78 104 329 -957 538 -183 -452 376 -979 1079 -390 -184 728
3751G28j884K035j258O55L67j164J041j248P67O19j480R52q47R75M0j143J580
$$ 728 -1156 879 -379 276 643 -521 520 -728 39 658 -822 130 -717 258 298 -845 735
3768G35j457J114Jr57J142j370J425m18p23J761k059J340m30k37R81j953J700
$$ 735 -722 392 393 -564 578 -792 633 215 -508 1253 -806 534 104 -133 848 -1105 595
3785E95p09m23J171j114J239n28q28J141j089M74K52r34J562j384J329p99l15
$$ 595 -114 -537 634 -480 759 231 -597 544 -545 -71 181 -753 809 -575 754 -45 -360
3802c60J078j169K136j999K41K20n12J285j068l4J287j372N90n54MJ577j788J192
$$ -360 718 -451 1685 -314 -73 147 -365 920 -148 -182 1105 -267 323 -231 -227 1350 -438 754
3820G54j361M33J66j208J830j226L74J126j950J358n92k07L15o03J982k109J005
$$ 754 -607 -174 -8 -1216 614 -612 -238 888 -1062 296 -296 -503 -188 -791 1191 -918 87
3837H7K38j712J762j392R97M55j389J492j580J331J68j566J663j440N75J47n92
$$ 87 325 -1387 375 -1017 -20 435 -954 538 -1042 289 457 -1109 554 -886 -311 -164 -756
3854g56J801k254J682j33n40J410k592J910L04j732J316j163J715j058l7J360
$$ -756 1045 -1209 473 340 -200 1210 -1382 528 832 -900 416 -747 968 -90 -127 1233
3870A233j909J073m60j50Q44j334J418j035L01Q59j522J210p59P5O46j308J714
$$ 1233 -676 397 -63 -213 631 -703 715 -320 -19 840 -682 528 -231 -156 490 -818 896
3887H96j303L62P44j544J890j484J34Q28j387J646j268L99N22j052J372j289L86
$$ 896 -407 -45 699 -845 1045 -439 -305 523 -864 782 -486 -87 435 -617 755 -534 -148
3904a48N58q51Q66q25M36O11j462J726j727Q70J65r63J534j315O68J08j058J677
$$ -148 410 -441 425 -400 36 647 -815 911 -816 54 219 -744 790 -525 143 251 -807 870
3922H70j648J116n9r54J457j494R89k44m35J101j318J144j84q96J086j408J497
$$ 870 -778 338 279 -675 782 -712 277 33 -402 699 -619 525 341 -555 531 -877 620
3939F20m72n58J132j347R84n32k87J169j551J422o39k11J220j993J649r86M4J108
$$ 620 148 -410 722 -625 359 -173 -460 709 -842 580 -59 -270 950 -1043 606 -380 -336 772
3957G72j570J553j144J83P52j128J212r67L48M56j251J174p15L15O27j535J745
$$ 772 -798 755 -389 -206 546 -582 630 -337 11 467 -784 390 -325 -10 617 -918 827
3974H27j222k67O52q48J738k317J673j31l29N84j043P91M11j323J527j334O41
$$ 827 -395 -662 -10 -858 880 -1437 236 105 -224 360 -683 108 519 -804 723 -611 30
3991C0J09m14J465j926Q39L8n62J600j729R34K18j279J574j439J071o29o12J090
$$ 30 139 -275 1190 -736 103 141 -421 1179 -550 384 602 -677 897 -542 529 -100 -712 378
4009C78j392J110K68k63O7j044J041l29m86J023O9j77M2p20J514j676J115K24
$$ 378 -1014 96 364 101 168 -876 165 -164 -650 373 442 265 307 -413 1101 -575 540 764
4027G64j251J189j886K545j662j55Q90o42m8n84j3K044j426J614j962J30J674
$$ 764 -487 702 -1184 1361 -301 -456 434 -208 -256 -840 -853 1191 -235 1379 -583 -453 1221
4044A221j897K442l191J715L66n22R94r06J82P74k365J564n00R34j051m12J905
$$ 1221 -676 1766 -1425 290 656 134 1128 222 404 1178 -1187 377 -123 811 -240 -652 1253
4061A253j960J004K40j064J068j582J001O3r96J300j130P87l36J30l82N4J96P5
$$ 1253 -707 297 537 -527 541 -1041 -40 23 -973 327 -803 -16 -352 -222 -604 -550 -354 -279
4079b79j245J977n78o6Q92j82K32k051O25J641j205N26j901J500K7n46J359j603
$$ -279 -1524 453 -125 -191 701 519 751 -1300 -675 966 -239 287 -1614 -114 -87 -633 726 -877
4097h77J112l09M37n18r1Q31l18p09R54q99R02m60o49J41n11K094j128r90K521
$$ -877 235 -74 363 -155 -246 585 267 -442 512 -387 515 55 -594 -453 -964 1130 2 -988 1533
4116A533j577J191j642J212P20j686J560k664J229M80j202K013k541R6P67P05
$$ 1533 -44 1147 -495 717 1437 -249 1311 -1353 -124 356 -846 1167 -1374 -1278 -511 194
4132A94J298k401l88J531m87n9l3Q37M25k002K514k242K035k509q92K849j011
$$ 194 1492 -909 -1297 234 -253 -312 -345 492 917 -1085 1429 -813 1222 -1287 -2179 670 -341
4149c41m31P28j238K821k354Q76k28R01Q45k464J249K74j036J422j674R34o15
$$ -341 -772 -44 -1282 1539 -815 61 -167 734 1579 -885 364 638 -398 1024 -650 284 -331
4166c31M53M55k71R59r51k10p51l23J171K22j225P83o61J446j205J665o26j707
$$ -331 122 577 306 1265 314 104 -647 -970 201 423 -802 -19 -680 766 -439 1226 600 -1107
4184a107J279m52K86R4j855J159L49q08J912p12N40K4k6K6j954J772j483J821
$$ -1107 172 -280 6 100 -1755 -596 -247 -1055 857 145 685 709 683 709 -1245 527 -956 865
4202H65J93j405J235o04K7J36k337L267j846M18n1n19J334j94l62J53j311K438
$$ 865 1058 -347 888 284 311 447 -1890 1377 -469 -51 -102 -621 713 519 157 310 -1001 1437
4220A437k696K461j174k49J598j313N59L22j945J213o45L18l91P39J424l091K181
$$ 1437 -1259 1202 28 -221 1377 64 623 945 -1000 213 -432 -114 -505 234 1658 -1433 748
4237G48n35l06J806k008O32j350O62Q93j069J423j031o02J430j525J411j80o14
$$ 748 213 -93 1713 -295 337 -1013 -351 542 -527 896 -135 -737 693 -832 579 399 -215
4254b15J104j585J711q11p17R51j294J293p55Q42M50k295J540p51J09J048j377
$$ -215 889 -696 1015 204 -513 438 -856 437 -318 524 974 -1321 219 -532 -423 625 -752
4271g52J556m02q50J421j918J417j663J245M74k045K323j398R46J15j089J479
$$ -752 804 402 -448 973 -945 472 -1191 54 528 -1517 806 -592 354 469 -620 859
4287H59r47j37N25q95J404q50N09J92j762K682j906J184m98j037J085j513J023
$$ 859 -88 -225 300 -595 809 -41 468 660 -1102 1580 -326 858 360 -677 408 -1105 -82
4304h2J06m68J088j674J592p13n08J145j100J260o37m00J512k055J753q89M0P94
$$ -82 24 -444 644 -1030 562 -151 -659 486 -614 646 9 -391 1121 -934 819 -70 -30 764
4322G64j834J606p84j52J192j582J803r89J10M81j641J562o81l05J344j361J047
$$ 764 -1070 536 -248 -400 792 -790 1013 24 134 615 -1026 536 -145 -450 894 -467 580
4339E80r45N24K54j430J758r40N92M07j605J338o88j00O24j467K178j525L39N49
$$ 580 -365 159 413 -1017 741 -199 393 800 -805 533 -155 -255 369 -1098 1080 -445 -106 443
4357D43j268J709j406K70M59p92J209j385P61Q65j892J913j604Q13L25j252J743
$$ 443 -825 884 -522 -252 207 -585 624 -761 0 865 -1027 886 -718 95 420 -832 911
4374I11j891J654p0j030J557j984J021P8o08J225j455Q50l11m46J328j793J325
$$ 911 -980 674 604 -426 1131 -853 168 246 -362 863 -592 258 -53 -499 829 -964 361
4391C61n62k23J504k055J542p29k34J330k073J788q33m43J378j865J824q08l20
$$ 361 -201 -424 1080 -975 567 -162 -396 934 -1139 649 -184 -627 751 -1114 710 -98 -418
4408d18J290j778J456m77m10J144j309J102l95o55J298j815J693j596P38R94j591
$$ -418 872 -906 550 73 -337 807 -502 600 205 -450 848 -967 726 -870 -132 862 -729
4425g29J747j331K19M85j280J469q48L98J56j358J852j142M74O02j501J825j596
$$ -729 1018 -313 -94 391 -889 580 -268 130 286 -1072 780 -362 112 714 -787 1038 -558
4442e58Q27K57j534J465j145R16%n16J080j325Q93J14j414J334j234J053j41o23
$$ -558 269 526 -1008 457 -688 228 228 -288 792 -533 360 474 -940 394 -840 213 72 -551
4460e51J289j821J449k54r75J927k302J300L93n02J244j846J322p78j52Q17j048
$$ -551 738 -1083 366 112 -863 1064 -1238 62 455 -47 1197 -649 673 -105 -257 560 -488
4477d88L69R8K04P13k414J777j64p08J317j349J147q77P9R82j585J738j695J101
$$ -488 -119 -21 183 896 -1518 259 95 -613 704 -645 502 -375 -296 686 -899 839 -856 245
4495B45J12j513J427k20n50J034r72R32l40q1O05j084J131j144K72O02j156O53
$$ 245 357 -1156 271 51 -499 535 -437 495 155 74 679 -405 726 -418 -146 456 -700 -47
4513d7k39J96K97m81J238r37K31P58j712J010o10R6R52j473Q98p93M98L3k63J539
$$ -47 -286 -90 207 -274 964 27 258 1016 -696 314 -296 -200 752 -721 177 -616 -118 -85 -348 1191
4533A191j609O36L27j108J692k068J769p45n47J251j196R67j055J86J130j525
$$ 1191 -418 218 545 -563 1129 -939 830 85 -462 789 -407 560 -495 -309 821 -704
4549g04J601j272j96J340j628J427m6r50J549j789J107j34j068J388j527J819
$$ -704 897 -375 -571 769 -859 568 522 -428 1121 -668 439 305 -763 625 -902 917
4565I17j589Q71l5n18P66l81k98P48r88J642j399m09J801k079J973j474M33J347
$$ 917 -672 199 164 -354 412 31 -267 481 -507 1135 -264 -673 1128 -951 1022 -452 -19 1328
4583A328k812K097r22n77J608j733J776j280O13L80j317J115n76R33l94k52Q10
$$ 1328 -1484 613 -309 -886 722 -1011 765 -515 98 478 -839 276 -300 633 239 -13 797
4600G97j217k10J195j425J620j639L21J320k398J037m55J879j68j072P39n86L80
$$ 797 -420 -630 565 -860 760 -879 -558 762 -1636 -599 -1054 825 657 -415 324 -262 118
4617A18m06n16J657k085J634n76j2J074j192M13r01rJ290p36J164j135K61R28
$$ 118 -288 -804 853 -1232 402 -174 -186 888 -304 109 -792 -801 489 -247 917 -218 43 971
4635I71k280J649K71j136Q62j293J944j772J64J739j544k03J43o8P06n39R14j416
$$ 971 -1309 340 611 -525 337 -956 988 -784 -620 1119 -425 -628 -485 -553 153 -386 528 -888
4653h88J1K029k679K836j397J55N52j251J637j873K155j513n09J459j374J389
$$ -888 -877 1152 -1527 1309 -88 67 619 -632 1005 -868 1287 -226 -735 724 -650 739
4669G39q52o57Q14k18O59k06o50P93j235K161j189j26J12j324J678r69L60N98
$$ 739 -113 -770 44 -174 485 279 -371 422 -813 1348 159 33 145 -1179 499 -470 -110 488
4687D88j443R69Q55j203J355j469J358j136j358K241j726J472l24k50L20k62J23
$$ 488 -955 14 869 -334 1021 -448 910 -226 -1584 657 -1069 403 79 -171 149 -113 10
4704A0k03l4J372k020J866o84q12J324k332K506j075J11Q68k599K341n65m21R09
$$ 10 -193 -227 1145 -875 991 307 -505 819 -1513 993 -82 29 897 -1702 639 74 -347 562
4722E62j248J265m23O6Q99j966J640j359O57J300k155J202j101R97M49j586Q78
$$ 562 -686 579 156 222 1121 -845 795 -564 93 1393 -762 440 -661 336 785 -801 77
4739G7l76P62J322k341J716j749L53L35p05J377j062M30l1m32J377j125M29m7
$$ 77 -299 463 1785 -556 1160 -589 -236 99 -606 771 -291 139 108 -324 1053 -72 357 310
4757C10j334J890j048N80K08j42m62q90J219O93j676J524j101J653j114j234J618
$$ 310 -1024 866 -182 398 606 464 2 -888 331 1024 -652 872 -229 1424 310 -924 694
4774F94j533J169j150O46P4j03L96j89k19J171j064O18n00p96J735j081N71O70
$$ 694 -839 330 -820 -174 -100 -203 193 4 -215 956 -108 510 10 -786 949 -132 439 1109
4792A109n04l58o53J490j165j22M12l41O0m77J25R79j408J453m93k56J269j086
$$ 1109 605 247 -406 1084 -81 -203 209 -132 -72 -549 -424 555 -853 600 107 -149 1120 34
4810C4N78p16o82J280j070J141j011N5O75p90J295j492J616p46r27K041j423J94
$$ 34 612 -104 -786 494 -576 565 -446 -391 284 -506 789 -703 913 167 -760 1281 -142 52
4828E2M37j370J507j296O66K40j010R12j098R13M59q36J205j364Q84J52r32J160
$$ 52 489 -881 626 -670 -4 236 -774 138 -960 -47 412 -424 781 -583 301 453 -479 681
4846F81j449J190p1r02R98r88J091k87p48J016j193R99j4p45J362j740J270m43
$$ 681 -768 422 351 -551 447 -541 550 263 -485 531 -662 337 323 -422 940 -800 470 27
4864B7m31J165j395Q66n3j83L98o62P14j96m93Q33j454J678j020N58P11j811J298
$$ 27 -404 761 -634 232 179 -4 394 -268 446 250 -243 590 -864 814 -206 352 1063 -748 550
4883E50j134J161L81j546J251j113K11O32j271J626j148M1J179j352R95j488J359
$$ 550 -584 577 958 -588 663 -450 -239 393 -878 748 -400 -359 820 -532 463 -1025 334
4900C34l44j230K597j610J034m05q25Q47o93q2N56p47R38p86J224k71j083J387
$$ 334 -10 -1240 1357 -253 781 376 -449 398 -295 -377 179 -568 370 -416 808 537 -546 841
4918H41j052J036o14J81K91j917J563M4O4J65j188J175k65n93J208j645J292o66
$$ 841 -211 825 211 392 683 -1234 329 373 437 602 -586 589 324 -269 939 -706 586 -80
4936h0l57R32j303J260l07o87R54p75Q48n09l59P95p81R59p44k5N72j073J466
$$ -80 -437 495 -808 452 145 -542 412 -363 485 -24 -383 412 -369 590 -154 -179 393 -680 786
4955G86j110nJ138j256R34p03J52O31r01R50o08k17J86r40K080j299p8N74j589
$$ 786 -324 -329 809 -447 487 -216 -64 567 -334 616 8 -209 -23 -963 1117 -182 -260 314 -1275
4974a275K661j837L50N64r67R93k33n4L26q93J346j404L29O52j460J448j104Q07
$$ -1275 1386 -451 -101 463 -504 489 256 202 528 -365 981 -423 -94 558 -902 546 -558 249
4992B49j23K40N3r20J472r82P61P08j021j020Q42n45J003j177o46R76P05K52j036
$$ 249 126 366 419 -501 971 -11 750 1458 437 -583 259 -286 717 -460 -1106 -130 575 827 -209
5011b09N39j51M00O68j635j06M18j027J736j373K711j874J41J65j203J342l46
$$ -209 330 179 579 1247 -388 -494 -76 -1103 633 -740 1971 97 238 403 -800 542 196
5028A96k0j45q47J813l82j693J837r87J596j691N6J222j237M49p01R91K7j016
$$ 196 176 31 -816 997 615 -1078 759 -228 1368 -323 -267 955 -282 167 -534 457 484 -532
5046e32J096p22N7K41r68Q66M7l62N23j86M42o03K05L67n68O08l56l6M11j205
$$ -532 564 -158 -101 140 -828 38 85 -277 246 60 502 -101 104 471 -97 511 155 119 530 -675
5066f75O42o83J586p91p37P33m61K35N83o70O23j001J251n98o27J529j636Q83
$$ -675 -33 -716 870 79 -658 75 -386 -151 432 -238 385 -616 635 37 -590 939 -697 186
5084A86j73P80K94j005L15l98Q25o04n23J035o25p22J802j416K44L75l33L82o69
$$ 186 13 793 1087 82 397 -1 824 220 -303 732 107 -615 1187 -229 15 390 57 439 -230
5103b30M53r15M02J020n86L44k46o07R84j170J514p68q5R37j894O19l28K94R1
$$ -230 223 -692 -290 730 144 488 242 -365 619 -551 963 195 110 1047 -847 -228 -556 -262 -171
5122a71m49P05k54J04Q34j157J269j493Q29L46j257J155j199P90J76p55J210j180
$$ -171 -620 85 -169 -65 769 -388 881 -612 217 563 -694 461 -738 52 228 -527 683 -497
5140d97O83O2m38Q56j116N30K73o88J177j138M97J01o33Q91j148O41K48p20R98
$$ -497 186 248 -190 666 -450 80 353 -335 842 -296 201 302 -331 560 -588 53 301 -419 579
5159E79r33N16k46m73R63o79L21P3o24J125j132N90J9k21N03q96P05j43m11O69
$$ 579 -354 162 -84 -557 406 -273 48 121 -503 622 -510 80 99 -122 381 -515 190 47 -364 305
5179C05p65N38j93K9R36j299Q33m32n6L76p95Q10l81J5M61j150J426q80L45J76
$$ 305 -460 78 -115 -86 850 -449 384 -48 -104 272 -523 287 -94 -79 382 -768 658 -222 123 299
5199B99p28M57k71J48L49o75R54p31L31J42o99O36l70L99p1n24O67o10N50j2o72
$$ 299 -429 28 -243 -95 254 -421 533 -198 133 275 -424 212 -158 241 170 -354 313 -297 253 241 -431
5220d31Q77r17L46K90m98P66q38L93M68p43P85r72P32j88l75Q64r18M31ol70L73
$$ -431 446 -471 -125 165 -333 433 -405 -12 456 -287 498 -474 258 70 -305 559 -359 72 66 -304 69
5241F9m82O78n11K26O32j063P24n33j95O38o74O62n8l24N02j142J234m67j01O27
$$ 69 -413 265 -246 -20 612 -451 273 -260 -455 183 -491 171 113 -211 291 -851 383 -84 -185 442
5261D42p97P40k46k17P69r54O33m60n7L09o70P15m62M18K15q65J061p88N9M00
$$ 442 -355 385 139 -78 691 -263 370 -90 -147 162 -508 207 -255 163 378 -487 574 -214 -155 245
5281B45n64Q66r14N93L81p13Q04j197Q9N65J12M07k10r95J242j118N71n23O63
$$ 245 -319 547 -367 226 607 -106 698 -499 -410 155 267 674 464 -531 711 -407 164 -359 304
5300C04J18o50Q33o85L41L21m05N23n58L10L25j064J653j664Q60k43k21J48j76
$$ 304 422 -228 605 -80 261 582 177 700 142 452 777 -287 1366 -298 562 319 98 246 70
5319G0k62J088k008J094m43Q87n45Q21K67j597R47J76k47j76n42O08j002J142
$$ 70 -192 896 -1112 -18 -461 426 -119 702 969 -628 319 495 248 72 -470 138 -864 278
5337B78L8l02O31q41O94k2r24N36N0J90P4m50M82p85N96K97o78M38p23N17N13
$$ 278 316 14 645 -196 498 476 -448 88 138 328 402 -48 434 -351 245 542 -136 302 -421 96 609
5358F09p85O77q34N03K27j094J081n82J98Q87j093P54j076O84K67j089J198q67
$$ 609 -176 501 -333 170 397 -697 384 -198 0 887 -206 548 -528 156 423 -666 532 -335
5376c35L4O08r61R96n92M34Nn43R14r61L75O6k54M81r09R64k63k00N81q28N34
$$ -335 -301 307 -654 342 -250 184 189 -354 560 -401 -26 40 -214 267 -642 322 59 -141 440 -388 146
5397A46k21j98P83j032P55n01L5O78p10K47L9l38O75o99N47k39k2N24q31N04m19
$$ 146 -75 -273 510 -522 233 -268 -233 445 -265 -18 21 -317 358 -341 206 -33 -55 469 -362 142 -277
5418b77j44N97m39N20l12rM62j013R25m63n5K63o26J186r92N32L94j128R96o58
$$ -277 -421 176 -263 257 -55 -64 398 -615 310 -153 -208 55 -571 615 -377 155 549 -579 417 -241
5438b41M5K20l41P45o71K32K69p23Q75r36N58M85r02P59m30O5M61o76P15q45O03
$$ -241 -196 24 -317 428 -243 -11 258 -465 410 -526 32 517 -385 374 -56 9 470 -206 509 -336 267
5459B67K3r39R55n87L52K98p42P26l61j16J92l98Q51r09O16k96l16Q46o31M50
$$ 267 290 -649 306 -281 71 369 -373 353 -8 -124 68 -330 521 -388 228 -68 -384 462 -169 281
5479B81l62j78Q16q25P86l66k76K56k22J52L6k26M49p60P00j16j89L42n82N59
$$ 281 -81 -259 557 -268 518 152 -124 132 -90 62 98 -128 321 -439 261 145 -44 298 -284 275
5499B75n0m89O63r42Q66l51k36N81l98O48n75P6J00n74R50k71j69J15l39L98p00
$$ 275 225 -264 399 -543 323 -28 -264 317 -81 567 -8 68 168 -406 544 273 104 219 -120 278 -422
5520d22N36o2m04N77n75L04L96q97Q78m88K41L11p87P78r65P73j46l10O21n05
$$ -422 114 52 -352 225 -350 -46 350 -547 331 -157 84 395 -392 386 -579 194 48 -262 359 -146
5540a46L23Q8n55P27p76L82J36m55J001j005L16j74q8L84l17j6K20l05L44k56
$$ -146 177 265 -290 437 -339 43 179 -276 725 -280 36 -138 -226 158 -159 -175 45 -260 84 -172
5560a72M92m08j74O87r68P83k50j5M91p65O67l87k49L59l32M77l42jO82q43M59
$$ -172 320 -88 -262 425 -543 240 -10 -25 466 -299 368 -19 -268 91 -241 236 -106 -107 575 -268 191
5581A91n05J89M25m85K78j65J2M44p33N44m90k20N80m88P21k54r84J421j423J597
$$ 191 -314 -125 300 -185 93 -72 -60 384 -349 195 -295 -515 65 -423 298 44 -940 481 -942 655
5601F55k52p99Q2M53P26n17l61k49N30l17N6Q5J08P20k42j142J76M12j17P51q83
$$ 655 403 -396 -314 139 865 348 -13 -262 268 -49 7 92 200 920 678 -464 -288 124 7 758 -125
5622a25P58k73J94M39l39n8k54l62N91m28J47l85m81Q12r17M16M01Q4l13j03J95
$$ -125 633 360 554 993 654 596 342 -20 571 143 290 -95 -576 236 -681 -265 136 220 -93 -196 -1
5643am41L2O44n13P91n99M56o44J00m0L40n64P35r24J739j282L96M30j200P48
$$ -1 -442 -410 234 -279 512 -87 369 -275 -175 -215 125 -439 296 -628 1111 -171 225 655 -545 203
5663B03l38o31J250q92J019r3o00Q30p78O11m41oM1p45O62l31J82M80q58Q83l73
$$ 203 -135 -766 484 -408 611 518 -82 748 -30 581 140 134 175 -570 92 -239 -57 423 -435 448 75
5684G5k30J178j896R02l68P9M97j055J158m55k49L52K88r7J0L8m36o67J101l32
$$ 75 -155 1023 -873 29 -339 -260 237 -818 340 -115 -364 -12 276 179 189 227 -209 -876 225 -107
5704a07M9j14m48P14j09k34K64n83M91P7O14n65k19M57p00J070k50j494J748r37
$$ -107 -58 -172 -620 94 -15 -249 15 -568 -77 0 614 49 -170 287 -413 657 407 -1087 661 -276
5724b76R63p87j56Q82m05k18n30J39l07Q57L5k57K13O62o19j01J97K96m00j29
$$ -276 687 -100 -256 626 221 3 -527 -388 -695 162 197 -60 153 815 196 95 292 588 188 59
5744E9N90p29O35J15j310N71J374j641N33J56j56J97p08K50N10J036n91r47j0
$$ 59 649 -80 555 670 -640 -69 1305 -336 197 353 197 394 -314 -64 446 1482 891 -56 -66
5763f6Q52m20j132L6J575r41J112j683Q57k52q01J278P76o32o6n2o51J068j48
$$ -66 786 366 -766 -730 845 -96 1016 -667 190 -62 -863 415 1191 559 493 441 -210 858 710
5782G10p65l00O14l52R45m60q16P48J41q28q4J17P38n08O33N99j667J152k63n28
$$ 710 -55 -355 259 -93 852 392 -424 324 465 -363 -447 -330 408 -100 533 1132 -535 617 354 -174
5802a74L74m96J290j691J088j77q41J053l25J46p50J48Q40q19L04K65p43O03L40
$$ -174 200 -296 994 -697 391 214 -627 426 101 247 -503 -355 485 -334 -30 235 -508 95 435
5821D35J7m81k17M56q15J017n78J06J50j93K52k53k10M49p13J002q20K58N34n69
$$ 435 452 -29 -246 210 -605 412 -166 -60 90 -103 149 -104 -314 135 -578 424 -396 -138 396 -173
5841a73M11l25P4L50k61M33o42P7M13p36P35k43l3J92j66j36q1j7N62n45M46n01
$$ -173 238 -87 -13 337 76 509 -133 -56 357 -379 356 113 80 272 106 -30 -111 -128 434 -111 335 -166
5863a66J30M76o77M52n06m2L65m12L84j73P6L86m18R2l16M42L71o72R50j111N34
$$ -166 -36 440 -237 215 -291 -333 32 -380 4 -169 -93 293 -125 -33 -349 93 464 -208 742 -369 165
5884A65m9j09J55k35K1P29j085L72K74p50K24j82L77j53m18R04j30J82p28P17
$$ 165 116 7 162 -73 -52 677 -408 -36 238 -512 -288 -470 -93 -246 -664 240 110 292 -436 281
5904B81K7p24Q03j065N59O2O6J76n52O70l99p2K71n37N55j10J50K69o21N59Q2
$$ 281 308 -416 387 -678 -119 -57 9 185 -367 303 -96 -168 103 -434 121 11 161 430 -191 368 450
5925D50r37P77k56J08j068J010j18o33P76M4k85J91m48K19M24k34p1q6K96q14
$$ 450 -487 290 34 142 -926 84 -34 -667 109 153 -132 59 -389 -170 254 20 -51 -137 159 -655
5945f55N35L09k04J61J02K63r8q41J035p19m56J003p08P60q33M08mm15K32J15
$$ -655 -120 189 -15 146 248 511 413 -428 607 -112 -568 435 -273 487 -346 62 58 -357 -125 -10
5965a0k95N55o03R22q85O61L91o17m44n83J482p68j87J63l5N27k52J91k66k22
$$ -10 -305 250 -353 569 -316 345 736 119 -325 -908 574 -194 -381 -218 -253 274 22 213 -53 -275
5985b75L88J48m44Q79p15N1lJ47K33r49M05j93N90J5j09o53J092j120K97P9P73
$$ -275 113 261 -183 696 -19 32 29 176 409 -540 -135 -328 262 277 168 -485 607 -513 -216 -137 636
6006F36m70m63L71J49N19o04j010Q93q0J11k18M60q2j57L60q31L54J05j21L00
$$ 636 166 -297 74 223 742 138 -872 21 -59 52 -166 294 212 55 415 -416 -62 43 -78 222
6026B22k92L34j22l40M65l87K29J93o16K18n0M4L36l79L75l49M29R6n15K85n17
$$ 222 -70 264 142 -198 267 -120 109 302 -314 -96 -146 -102 234 -145 230 -119 310 406 -109 176 -341
6047c41J10L3j6O25p14L88j5k27J43l6L63r9l54K89m53N82P2n01M40o00M18R7
$$ -341 -231 -198 -214 411 -303 85 70 -157 -14 -50 313 214 -140 149 -304 278 350 -151 289 -311 107 204
6069B04k38M55p29O19j66k00O5k32J86k1P7p4k64M46j30k06L32l87M21k66j1N1
$$ 204 -34 421 -308 311 145 -55 10 -222 -36 -57 20 -54 -318 128 -2 -208 124 -263 158 -108 -119 -68
6091f8l70P30m07J80P2l36M88l81L0K75k41l3j00Q2K26k00L09k26L09l00k86L98
$$ -68 -438 292 -115 65 137 -199 289 -92 -62 213 -28 -61 -161 -79 147 -53 256 30 339 39 -247 151
6113A51q09K21O97j9p38k0J48L39n0n09k09P96n1K50K34n93j2N38r04K143k009
$$ 151 -658 -437 260 241 -497 -517 -369 -30 -80 -589 -798 -2 -53 197 431 -162 -174 364 -540 1603 -406
6134d06p71M13O46o29Q7R44o3N99k32P8m82o49N06L02k62q00Q73l94J078p95n53
$$ -406 -1177 -764 -118 -747 -660 284 221 820 588 666 184 -465 41 343 81 -719 154 -240 838 43 -510
6155e10N61k16N93m21m42K81m53O31J0J76m13l67R20n94O32o92q4O2K1J64k18
$$ -510 51 -165 428 7 -435 -154 -607 24 34 210 -203 -570 350 -244 388 -304 -388 -326 -305 -141 -359
6176c59P39j36o18Q53l96r1p9p97J623p24j12K00q86J115o75J51L00O4P4l69K43
$$ -359 380 244 -374 479 83 -8 -87 -884 739 15 -97 103 -783 332 -343 -192 108 172 246 -123 120
6197A20j04l07O61o78l41Q81m38J31K9K65j21k45L41l08J66r8J4M13n91L14l33
$$ 120 16 -291 370 -308 -649 232 -206 -75 -46 219 98 -147 194 -114 52 -46 -32 381 -210 104 -229
6218b29R6L5J27K13l16k28O37l83r0J21j58M41l54K4L42m46M62n58M62j46k73
$$ -229 -133 -98 29 242 -74 -302 335 -48 -138 -17 -175 266 -88 -64 278 -168 294 -264 198 52 -221
6239b21N53o64M59j75k44L95j25J58j76RJ34l27N46k14k48L8q8J52k28K34M14
$$ -221 332 -332 127 -48 -292 103 -22 136 -40 -31 103 -224 322 108 -140 -102 -190 -38 -266 -32 382
6260C82o00L42j85l9M18n60M93k46J36K1j66L65n46N77j27l63J60l87M81K7l72
$$ 382 -218 124 -61 -100 318 -242 251 5 141 162 -4 361 -185 392 265 -98 62 -325 156 183 -189
6281a89L08l09P6J8N5K73l93J6m2p4M58l22K35P9m41O23m93J13j46K18K31p29
$$ -189 119 -190 -114 -96 -41 232 -161 -145 -187 -261 197 -125 110 189 -252 371 -122 -9 -155 63 294 -435
6303d35R19p93K54K10l92M61j87r7L27k75M42o04j39N29k68J52l24O5N82n37N04
$$ -435 484 -309 -55 155 -237 224 37 -60 267 -8 434 -170 -309 220 -48 104 -220 -155 427 -110 394
6324C94j5k89J11l94L34m9j55L32l08M56l33l13M40l66N48m85L18j34l91M87n31
$$ 394 379 90 201 -193 141 92 -63 269 -39 417 84 -229 211 -155 393 -92 226 92 -299 188 -343
6345c43M7O64l29J46l19N2J43l13L23k05J08J21q0K14k72J52R7m12K07l15J99
$$ -343 -296 368 39 185 -134 -82 61 -252 71 -134 -26 95 15 229 -43 109 206 -206 1 -314 -115
6366a15K30l16N97n53K1L57m67L97j12j16J60o02P82l80J45J15m84K75N4K38k45
$$ -115 115 -201 396 -157 -136 221 -246 151 39 -77 83 -519 263 -117 28 143 -341 -66 -12 226 -19
6387a9r4M17n06L90j39m11Q32o27M37l41k38M10n21K46J43l1L04n61L83m76L46
$$ -19 -113 304 -202 188 49 -362 470 -157 280 -61 -299 111 -410 -164 -21 -52 252 -309 74 -402 -56
6408e6L41q00M26K80k80K53k37L50k65L9J03l88N42l79k13N50o62O19m09N0n2
$$ -56 285 -515 -89 191 -89 164 -73 277 12 51 154 -234 308 -71 -284 266 -396 223 -186 -136 -188
6429a88q3L91q6k05J24l10N54l15J6J65q2L93q12K45K11o5K71r9R2k50O5K21k96
$$ -188 -271 120 34 -171 -47 -357 197 -118 -102 63 -19 374 -438 -193 18 -47 224 125 217 -33 32 253 -43
6452d3P9J97l08K0r8K35K09n67O20o29L53j68l6M08k99K6O1J7J6k48L44q9j36
$$ -43 36 233 -75 -55 -153 82 291 -276 344 -285 68 -100 -136 272 -27 -1 60 77 93 -155 189 100 -36
6475c6M69p29J95K02k55N53o20J75R2j96K46m45N34K9k61k9k86O39k35r6M48n97
$$ -36 433 -296 -101 101 -154 399 -221 -46 46 -150 96 -349 185 214 -47 -76 -362 277 42 -54 394 -203
6497b03L19m66O4J96k57P07o12M0M31m36O22m36J43L2l60J47j0N0J53m68M58j83
$$ -203 116 -350 -286 -90 -347 360 -252 -212 219 -217 405 -31 112 144 -216 -69 -79 -29 124 -344 114 -69
6519f9K10J73q02R67p65L73P1l44L13l87L41J22o82P36n24L27O9n38Q99p95M29
$$ -69 141 314 -488 479 -286 87 158 -186 127 -260 81 203 -479 257 -267 60 129 -409 490 -305 124
6540A24n7k11M81o38L88l1m76O03k42K68l82K21J35l69M04m18J62N87p45J93j97
$$ 124 67 -144 337 -301 87 56 -420 183 -59 209 -173 48 183 -186 218 -200 -38 549 -196 -3 -200
6561b00m2K76k41K53K22m60N12n49N06o7j81L59o74L82j02m27O74o75R83o31j06
$$ -200 -242 34 -207 46 268 -192 320 -229 277 210 29 388 -286 96 -6 -433 241 -434 549 -82 -188
6582a88L18k96M73n70J31Q9p9L52m47K65J52m88K73L52l58J12l22M53m53rM32
$$ -188 130 -166 307 -263 -132 -43 -122 230 -217 48 200 -288 -15 337 -21 91 -231 222 -231 -240 192
6603A92m65N91o33K08J99j34L55n77O3K59m35P01n60J87L79m26N19o62L61M7l98
$$ 192 -273 318 -315 -107 92 -42 313 -264 -201 58 -377 324 -236 -49 330 -96 423 -239 122 169 -229
6624b29N68n09M0J42m72R57r17M37J38m09L48m64N40j89k7K78l03J60o8L6K95
$$ -229 339 -170 -130 12 -460 497 -420 17 155 -254 94 -370 170 -19 -46 232 -71 89 21 57 352
6645C52q30O68l53J84J30o89O20j30p8K88l71L96n04j15N80n6K39l38q4J36m08
$$ 352 -478 190 -163 21 151 -538 82 -48 -126 162 -209 187 -317 -432 148 92 331 -7 -91 45 -363
6666c63N09k02P1M4l01O78n70M7k1j11L17m60M47Q5l11M28m96K20K00m99N20l5
$$ -363 146 -56 15 59 -242 436 -134 -87 -108 -219 98 -362 85 170 -141 287 -209 11 211 -288 232 197
6688A97k88J60j54K53n86K11J20r0N12k07L01m02k10M84l36J36o7j74L66k15N6
$$ 197 -91 69 -85 168 -418 -207 -87 -177 335 128 429 27 -183 301 -35 101 34 -140 226 11 67
6709F7j78p0P58r11L84Q7j38M70o39p9K08q8L05m49K53p5p0L93p79O77l04j00
$$ 67 -111 -181 577 -334 50 137 -1 469 -170 -249 -41 -129 176 -273 -20 -95 -165 228 -551 126 -178 -278
6731b78N20m86N28k79Q3K41m94M11j78l74O05o04L56j56J80L63p82N01p2k31J18
$$ -278 242 -244 284 5 88 329 -165 246 68 -306 299 -305 51 -105 75 438 -344 157 85 -146 -28
6752b8k37N57n56J86K83n67M78k15J15L43l79J37m27K43J87l30M25m62L96O6l19
$$ -28 -265 292 -264 -78 205 -362 116 -99 16 359 -20 117 -310 -67 120 -210 215 -247 149 215 -104
6773a04M57n35J81L2k19M20k87N5m3L4L29p72N84m32K02L62m76N98m13R1K04l56
$$ -104 353 -182 -1 31 -188 232 -55 0 -43 -9 320 -452 132 -300 -98 264 -212 386 -27 64 268 -88
6795h8K42j38j84L37m72K96K8l40M53l54N50m37j56M17p70Q72l01L6J94o00O53
$$ -88 154 16 -168 169 -303 -7 21 -319 134 -220 330 -107 -263 154 -616 256 -45 -9 185 -415 238
6816B38n99L24K08j40k28O3J64M4j48L90n84K40k5j79N39n06K12L48p18N59k82
$$ 238 -361 -37 171 31 -197 -134 30 74 -74 316 -268 -28 -53 -232 307 -199 13 361 -357 202 -80
6837h0K22l6m80N41m55J48K36m09M29K08j09o9l1K98o24M03l54j72O40n14K31
$$ -80 142 106 -374 167 -288 -140 96 -313 116 324 215 146 115 413 -211 192 -162 -334 306 -208 23
6858B3m7k0K73j94q2J31L8K7k09J51j3r6L54m19K69n06L10Q9n45M75l66K45K44
$$ 23 -24 -44 229 35 -47 84 122 149 -60 91 78 -18 336 -83 186 -320 -10 79 -466 9 -357 -112 132
6881A32k88N38k12L3q4k86N57m30K13J97n15L12j49j15J08j58K03k66J38K40n53
$$ 132 -156 382 170 203 119 -167 390 -40 173 370 -145 167 18 -97 11 -147 56 -210 -72 168 -385
6902c85O88l93J08P0PO7k19j6P8j38J85n00N70J00n11M15k41j0o2K81p1l73N43
$$ -385 303 -90 18 88 95 162 -57 -73 5 -133 52 -448 122 222 -289 126 -115 -125 -187 94 23 -350 193
6925A93O3l89P03q59N80k77j4R7l47L46J16n21L99j29K53l94O3J71k41J88K31
$$ 193 256 -133 570 -289 291 14 0 97 -250 96 212 -309 90 -39 214 -180 -117 54 -187 1 232
6946B32k08K72j51K69j56l46K25n78O51k09J30k43K83K8k61j63O22n87K42q0q1
$$ 232 24 296 145 414 258 -88 137 -441 210 1 131 -112 171 199 -62 -225 397 -190 52 -28 -109
6967a09J89k53J68j40J48L2k47K52J1R2j35l90Q21m19j53M37n74L09q4L3L14n38
$$ -109 80 -173 -5 -145 3 35 -212 40 51 143 8 -382 439 20 -133 304 -270 39 -45 -12 302 -236
6989b36O68m54k06J25L7L31k55K14k05j33J44k78K76O5m07M33m8K67l47l08L56
$$ -236 432 -22 -228 -103 -66 265 10 224 19 -114 30 -248 28 93 -314 119 71 338 -9 -317 39
7010C9m41P33n51K59q3k46K91m0k02M31j89L5J25k27J33j62Q8L17l63K8r7J46
$$ 39 -402 331 -220 39 -44 -290 1 -39 -241 190 1 36 161 -66 67 -95 -7 310 -53 -25 -122 24
7032B4r0K77N2o55N36l36l5L98o16O65n91L49m1j29O35m56K63l07r3M12l92J06
$$ 24 -66 211 263 -392 144 -192 -227 171 -445 220 -371 -22 -63 -192 443 -13 250 -57 -150 262 -130 -24
7054b4K05k86K43j57J61j14l5K64n08K86L91m81M22l83Q2j99J10M41o65N85l92
$$ -24 181 -105 138 -19 142 28 -7 257 -251 35 426 -55 367 -16 66 -133 -23 418 -247 338 -54
7075e4J33K27m18M64k51j81J99k37O2K51k62K36m72L26P7j44K16n10O63m69J78
$$ -54 79 306 -112 352 101 -80 119 -118 -56 195 -67 169 -303 23 100 -44 172 -338 325 -144 34
7096C4L68p85M30j18J21J5k39K86p7j44L64p19P35m27Q9L96o92O55m5m32M15m89
$$ 34 402 -383 47 -71 50 65 -174 112 35 -109 255 -464 271 -156 -67 329 -363 292 247 -185 230 -259
7118b59O38m31J20J63l41J305q27k36k53j24O71j83m10K65l44M39l52J45J89j38
$$ -259 379 -52 68 231 -110 1195 368 132 -121 -245 426 243 -167 98 -246 193 -159 -14 175 37
7138C7n8l72N70l95M3J99k64J67j49j4N35n31L30p1k75J81L7m3J22k39L65m79
$$ 37 -21 -393 177 -218 -175 24 -240 -73 -222 -236 299 -232 98 27 -248 -67 -30 -73 49 -190 175 -304
7160c04L80J05j02j17r3L50j35l70L78l67M87J89o44L85l88L33k35o4L19j68J85
$$ -304 76 181 79 -38 -131 219 84 -286 92 -275 212 401 -243 142 -246 87 -148 -212 107 -61 124
7181A24L3n68N89r8o7j76K45K46n31K96j05j97M67k28K14k51L26k75k05K49l10
$$ 124 157 -411 178 80 13 -163 82 328 -203 93 -12 -209 258 30 244 -7 319 44 -161 88 -222
7202b22N25j74j72M44p87L59k9l4L36l91K75j56j60L17l07K03N6j92K77j99j32
$$ -222 303 129 -43 401 -386 -27 -56 -90 246 -145 130 -26 -186 131 -176 27 83 -109 168 -31 -163
7223a63J98P4r0j92L36K4k08K23l12N47n99p0Q98q84N14k51k15N4J21j19K32L2
$$ -163 35 109 19 -173 163 187 -21 202 -110 437 -162 -232 666 -218 296 45 -170 -116 5 -114 118 150
7245A50J19p00N04J42o47L86n8J84o1J7K97m09K59l15M1L54l69K37k65K4K84l09
$$ 150 269 -431 73 215 -432 -46 -104 80 19 36 333 -76 183 -132 -91 263 -106 131 -134 -110 174 -135
7267a35J60K01j69J15l58L75l01j86J65l57N03K6L5o3j44L26k91Q1J45l42L27
$$ -135 25 226 57 172 -186 189 -112 -298 -133 -490 13 39 74 11 -133 193 -98 -17 128 -214 113
7288A13k91J48J43n62O46l75K25No8J27k81R1K21l13L47l65J38O7j77N00m75M80
$$ 113 -178 -30 113 -449 197 -178 47 52 -16 111 -170 -79 142 -171 176 -189 -51 16 -161 339 -136 344
7310C44l83j67M46m25L40R2L9M2o53O01l6l53M68j79k01o7J09Q5j58p4j3J03L43
$$ 344 -39 -206 240 -185 155 247 286 328 -325 276 240 -113 355 176 -25 -92 17 102 -56 -130 -143 -40 303
7333C03n26J80j71K22O2k93M53k78L39q1k14L40n15J08K23q6L0l93J57J50m24
$$ 303 -223 -43 -214 8 70 -223 230 -48 291 210 -4 336 -179 -71 152 66 96 -297 -140 10 -414
7354d14P07n59M43J54m22L14m37L28p6m23M42P5O0j77j28M46n13N05l39k7K00
$$ -414 293 -266 177 331 -91 223 -214 114 38 -385 57 132 192 15 -113 333 -180 325 -14 -41 159
7375A59l48J28J29j01J2J01J15q8j74K60j30o8o9J24j17mn7K29j69M15m99K13
$$ 159 -189 -61 68 -33 -21 80 195 107 -67 193 63 -5 -74 50 -67 -71 -128 101 -68 347 -152 61
7397F1J30k13K36o31M58o2j52L60j94J30j88R9q2P7J31j45J08j04m71O13l11J6
$$ 61 191 -22 214 -417 41 -21 -173 187 -7 123 -65 34 -48 29 160 15 123 19 -452 161 -150 -134
7419a34J71l78M05k14J16N4l89N24m09L37K91j73K69o05N0K89n61J56J11L11m59
$$ -134 37 -341 64 -150 -34 20 -369 155 -254 83 374 201 470 -135 -85 204 -357 -201 -90 221 -238
7440b38O7K19j59K75O7k52Q4k28L34n1Lj11k67Q7K84k66J58l2l4j01j7J38p3L07
$$ -238 -171 48 -111 164 231 -21 63 -165 169 118 121 10 -257 -170 114 -152 6 -26 -60 -161 -178 -40 -113 194
7464A94Qj49M6q2K76l80k07M37m67M73k87Q2j3j63K05R9j92K61l55M01j16m04
$$ 194 202 53 99 17 293 -87 -294 143 -324 149 -138 -56 -69 -232 -27 72 -120 141 -214 187 71 -333
7486c33O35j93K80n72P0K95j37Q8k43o0L70l00Q5o3L1J94j29J28J1k51L73m16
$$ -333 302 109 389 -183 -113 182 45 133 -110 -170 200 -100 -15 -78 -47 147 18 146 157 -94 279 -137
7508a37L06k65J28Q6m37P68o31l8L05k81M69n81K85J10l11N48m86M39j65j07L
$$ -137 169 -96 32 118 -319 449 -182 -220 85 -196 273 -308 -23 87 -224 324 -162 277 112 5 8
7529Hk76M05m3l53L49Kn8k6j13K57k36L40j57j68L29n54L94l16K69J03n33N65
$$ 8 -268 137 94 -259 90 92 34 8 -105 152 -84 256 99 -69 260 -294 100 -216 53 156 -377 188
7551A88l40K64K32o14K36K61k24k76J44J63k1J56j23k92K60j47J35J23k68M94
$$ 188 -152 112 344 -270 -34 227 3 -273 -129 34 13 169 46 -246 14 -133 2 125 -143 351
7571C51q7j14k0m44M51j67J36L0k74N88l61k3j71l0j8m0L67l44J72L46m90J02
$$ 351 264 150 130 -314 137 -30 106 136 -138 450 89 66 -105 -135 -153 -193 174 -170 2 348 -142 -40
7593d0K47j84J1j94k9L76j52J15k83M06k06j92L97m35M1K03k32K12l27L18j26
$$ -40 207 23 34 -160 -189 187 35 150 -133 273 67 -125 272 -163 -122 81 -151 61 -266 52 -74
7614g4N9J97n53N83m4k91J78m62M21j63J7K59n12K72L64l69J66n02K83m7k28Q48
$$ -74 -15 182 -371 212 168 -123 55 -407 14 -149 -132 127 -385 -113 251 -118 48 -454 -171 -218 -446 402
7636D02p75K54j17LJ92j093J463j026P98m63M17J22n78m09P97k50O10n91l70P9
$$ 402 -373 -119 -236 -233 -41 -1134 329 -697 101 -362 55 177 -401 -810 -13 -263 347 -244 -614 -535
7656e35K35L23K89k14k11q36J210L82j359P31J89J97l40l49K9k97Q07o31L77M79
$$ -535 -300 23 312 98 -113 -949 261 643 -716 15 204 401 61 -288 -259 -556 251 -380 -3 476
7676D76o31J4L65K44n61p94O10M50j40L45n49j22O07j294N81J96Q6ON89m12r14
$$ 476 -155 -141 224 468 -93 -887 -277 173 33 378 -171 -293 314 -980 -399 -203 -117 -111 478 66 -848
7697h48Q23j05P43r79J99R28p35l07P59j393Q27O6k33L63K31l39o29J215k34k49
$$ -848 -25 -130 613 -366 -167 761 26 -281 478 -915 -88 -22 -255 108 339 0 -629 586 352 103
7717A03O4j50K17n61k92P55M51p75J98l63Q42j617J576p38M70k81R1L1l64j28
$$ 103 167 17 234 -327 -619 136 587 -188 10 -353 489 -1128 448 -290 180 -101 -10 21 -343 -471
7737d71P57j244J243j088P22N75k27l88M05K57o68j18m6o4J53P51j026Q34m87
$$ -471 286 -958 285 -803 -81 494 267 -121 284 541 -127 -245 -291 -355 -202 549 -477 357 -130
7756a30K64k74K36k66J41j86o9k7L79k10mO13r21Q44j043l42N02L42r1j90P56
$$ -130 134 -140 96 -170 -29 -215 -284 -311 68 -142 -146 467 -454 390 -653 -995 -493 -151 -242 -432 324
7777C24m93J27J67k98K55K89m55J03M6L01O5m89K07k92jnj1N08j083J300p52j14
$$ 324 -169 -42 125 -173 82 371 -84 19 65 366 431 -58 149 -143 -144 -149 -160 348 -735 565 -187 -301
7799c01R30m76j52J60k6j07r9K50j35R7k90n8K65k21J95L76n53N05n71K72L6k01
$$ -301 629 153 1 161 135 28 -71 179 44 141 -149 -207 58 -163 32 408 -145 360 -211 61 97 -104
7821a04O21n89K24j75k47M14k15K39o7j04J42l11J35k46K70K36k73J48L6j80J58
$$ -104 517 -72 152 -23 -270 144 -71 168 101 -3 139 -172 -37 -283 -13 223 -50 98 134 -46 112
7842A12j55J62k69MK16k61N32l48J42q7o5K44q4m00M20l11L33l79J78j9k19N05
$$ 112 -43 119 -150 -146 70 -191 341 -7 135 48 -17 227 143 -257 163 -148 185 -194 -16 -35 -254 251
7864B51k0l0l9k85J90K4j22L60m13L19l49k4N26o25K33J1j86J25o2J87R5k3j9
$$ 251 231 201 162 -123 67 91 -31 329 -84 235 -114 -138 388 -237 -4 7 -179 -54 -116 71 166 143 124
7887A24J22j36J40l03J40j90L0J15J66j17k38N11p23M74J8n91M23q9K38l53O9
$$ 124 246 110 250 -53 87 -103 -73 42 208 91 -147 364 -359 115 133 -458 -35 -124 114 -239 -170
7908a70O65o42L76j36k41M27p61O62l83K8N98o45L61k58L7L92n54N91j10m61K99
$$ -170 495 -147 229 93 -148 279 -482 180 -203 -175 423 -222 139 -119 -82 310 -244 347 237 -224 75
7929G5k82M79k15j87K47k27L22l60K30k2l72N65n61M06k2m36N96k87Q5o5q4L32
$$ 75 -207 272 57 -130 117 -110 212 -148 82 60 -312 253 -308 98 76 -360 236 -51 34 -31 -115 217
7951B17j83P1J75l27R1r1L24l20k17M51k09J5q4K0L76l90K43P8m84M27k23J89
$$ 217 34 105 280 -47 44 -47 277 -43 -260 191 -18 -3 -87 -67 309 -81 162 240 -244 183 -40 149
7973A49m5m38K49l07L44J5n2J79l91K86j48p7N65m73J38p0RM25m67K47o3j00L41
$$ 149 104 -334 -85 -392 -48 -33 -85 94 -297 -11 -159 -236 329 -144 -6 -76 -67 358 -109 138 75 -25 316
7996C16l40k75M30l40K09l0J88k52L2L49l56N7M4jj46k57N47j67J42Jk27K46j99
$$ 316 -24 -299 131 -209 0 -30 158 -94 -62 287 -69 -12 32 31 -115 -372 175 8 150 151 -76 170 -29
8019b9L39l68j01L96k29l07M26k51J49M2j10n5j64Q24n90J63P0m42J26j79J92
$$ -29 310 -58 -159 237 8 -299 127 -124 25 67 -43 -98 -262 562 -28 135 205 -237 -111 -290 -98
8040i8K12k78M37m01J24J47k59L47M3N7l78l9K73j53k3J44j07O0k35M47k00l01
$$ -98 114 -164 273 -128 -4 143 -116 231 274 331 -47 -86 187 34 11 155 48 108 -127 320 120 -181
8062a81O27p70K49m2K75k48j2J43j27J18k54K15L75k60o8J97m70L54o3p9L47n06
$$ -181 446 -324 -75 -117 158 -90 -102 41 -86 32 -222 -7 368 108 40 237 -233 121 58 -21 326 -180
8084a80N62n07r8L45j94L80k37o5K72m07J42j05K08Q8l84L81k34p9K29L5L2j33
$$ -180 382 -125 -223 122 -72 308 71 6 278 -129 13 -92 116 204 -180 201 -33 -112 117 152 184 51
8106E1o8M9j49K82r6J29l16L6M57l57k95J24o4L92j21o9Qp4O5k99P98p94J72J40
$$ 51 -17 32 -117 165 69 198 -118 -82 375 18 -277 -153 -217 175 54 -15 -7 -81 -16 -315 483 -311 -139 1
8130Aq0M20k30j77M4qn0K21k2p2n2p9J10r1K67l29M25m69N3L95l81R8j92K00q
$$ 1 -79 341 111 -66 -22 -30 -80 141 119 47 -5 -84 26 -65 202 -127 298 -171 -118 277 -104 -6 -198 2 -6
8155fKK99n12N0M35o36N67n57N67J01k40J61m49L76k71j16L97l99K55j99Q6K13
$$ -6 -4 295 -217 -167 268 -368 199 -358 209 310 70 231 -218 158 -113 -229 168 -231 24 -175 -89 124
8177A24l61K66j19j27Q7k2K41r1k24L21j26R4J88l20
$$ 124 -237 29 -90 -217 -130 -152 89 -2 -226 95 -31 63 251 -69
8191f9
$$ Imaginary data points
##PAGE= N=2
##DATA TABLE= (X++(I..I)), XYDATA
0@%%%%%%%%%%%%%%Qj6J6j6J6k4L2l2M0m8N6o6P5q9J04j21J38j56J77k01K28k56
$$ 0 0 0 0 0 0 0 0 0 0 0 0 0 0 0 8 -8 8 -8 8 -16 16 -16 24 -24 32 -34 41 -48 56 -65 73 -83 94 -107 121 -135
36a35K90l28L64m06M54n05N64o26O91p64Q43r30J025j128J242j367J505j661J832
$$ -135 155 -173 191 -215 239 -266 298 -328 363 -401 442 -488 537 -591 651 -716 789 -872 960
55I60k022K238k481K762l087L469l930M490n191O099p327R088j1874J7208m6330
$$ 960 -1062 1176 -1305 1457 -1630 1839 -2091 2399 -2792 3307 -4020 5068 -6806 10402 -35928
70c5928P5840n2300j0283P3777j15149J18548q1555J8826M7923r6918J10568q2505
$$ -35928 39912 -12388 -22671 51106 -64043 54505 -27050 -8224 39699 -57219 53349 -29156
82b9156K3331M4799r8149J16598r2421L5012L3380q8121J10269r1833M0428K4500
$$ -29156 -5825 38974 -59175 57423 -34998 14 33394 -54727 55542 -36291 4137 28637
94B8637q0569J08068r7224N1788J2360p1533J04681r9361N7679M632o4927J01224
$$ 28637 -51932 56136 -41088 10700 23060 -48473 56208 -43153 14526 19158 -45769 55455
106E5455j00756O3936m721n5542R6014j01659P0562j4411m7132R1983j03624P7231
$$ 55455 -45301 18635 13914 -41628 54386 -47273 23289 8878 -38254 53729 -49895 27336
118B7336k2939l8844Q6583j02691Q1419l0815l0542Q0550j01206Q5350l9070k1171
$$ 27336 4397 -34447 52136 -50555 30864 49 -30493 50057 -51149 34201 -4869 -26040
130b6040P3547r9065Q8850m6659j2844O7404r7251R1567n2721m647O0124r3276
$$ -26040 47507 -51558 37292 -9367 -22211 45193 -52058 39509 -13212 -17859 42265 -51011
142e1011R2338n8372L799N1661q8636R3219o3858J1936M4235q4427R3640o8955
$$ -51011 41327 -17045 -13246 38415 -50221 42998 -20860 -8924 35311 -49116 44524 -24431
154b4431J9541L6710p9384R3042p2677K6414K9224p3816R1363p6368L3958K1080
$$ -24431 -4890 31820 -47564 45478 -27199 -785 28439 -45377 45986 -30382 3576 24656
166B4656o8547R1115q0695M1017J3905o3699Q9621q2800M6283O316n6706Q6848
$$ 24656 -43891 47224 -33471 7546 21451 -42248 47373 -35427 10856 17172 -39534 47314
178D7314q5496N3248j601n0672Q4442q7687N9285r063m4495Q1431q8753O3638
$$ 47314 -38182 15066 13465 -37207 47235 -40452 18833 9770 -34725 46706 -42047 21591
190B1591j5554l7428P6869q8410O8423k3414l0156P2480q8696P2433l0111k3002
$$ 21591 6037 -31391 45478 -42932 25491 2077 -28079 44401 -44295 28138 -1973 -24975
202b4975O7366q7077P5328l6257j5603O1323q4954P7923m2488q011N5142q2318
$$ -24975 42391 -44686 30642 -5615 -21218 40105 -44849 33074 -9414 -17425 37717 -44601
214d4601P9634m7941r37M9321p9492Q0956n3380O122M3142p6416Q1975n7677J2845
$$ -44601 35033 -12908 -13845 35476 -44016 36940 -16440 -10318 32824 -43592 38383 -19294 -6449
227f449L6686p2802Q2427o2374J9777K9995o9050Q3080o6656K6019K3813o4949
$$ -6449 30237 -42565 39862 -22512 -2735 27260 -41790 41290 -25366 653 24466 -40483
239d0483Q2770p0631L2341J7377o0647Q2031p3746L8953J0008n5084Q0074p6279
$$ -40483 42287 -28344 3997 21374 -39273 42758 -30988 7965 17973 -37111 42963 -33316
251c3316M4608L183m9623P8196p8127M9524l422m3663P4744p8783N4491j0084
$$ -33316 11292 14475 -35148 43048 -35079 14445 11023 -32640 42104 -36679 17812 7728
263G728l7567P1482p9439N8124j6394l1002O7481p9102O1815k2234k4972O2671
$$ 7728 -29839 41643 -37796 20328 3934 -27068 40413 -38689 23126 892 -24080 38591
275C8591p7709O4850k8412j8568N8398p6930O7740l4029j1924N3600p5571P0076
$$ 38591 -39118 25732 -2680 -21248 37150 -39780 27960 -6069 -17993 35607 -39964 30112
287C0112l9287n766M8823p3719P1572m4117M64M3607p1621P3609m9224P123L7698
$$ 30112 -9175 -14941 33882 -39837 31735 -12382 -11918 31689 -39932 33677 -15547 -8424 29274
300B9274o8980P5136n3809J3127L2254o5854P5701n8026J9413K6150o2465P5966
$$ 29274 -39706 35430 -18379 -5252 27002 -38852 36849 -21177 -1764 24386 -38079 37887
312C7887o2122K5752J9873n8107P5075o4534L0682J3632n3273P3919o7384L6565
$$ 37887 -24235 1517 21390 -36717 38358 -26176 4506 18138 -35135 38784 -28600 7965
324G965P549m8467P1530o8858M1478Q91m2955O8979o9868M5801n067l7535O6154
$$ 7965 15514 -32953 38577 -30281 11197 12088 -30867 38112 -31756 14045 8978 -28557 37597
337C7597p0749M9852j0683l2168O2928p1001N3310j6309k6381N9464p1149N6961
$$ 37597 -33152 16700 6017 -26151 36777 -34224 19086 2777 -23604 35860 -35289 21672
349B1672k2227k0566N6053p0775N9816k7238j5147N2090p0038O2705l2644r204
$$ 21672 -555 -21121 34932 -35843 23973 -3265 -18412 33678 -36360 26345 -6299 -15503
361a5503M7584o8911O5000l7357l733M3433o7227O6923m2457K454L8496o5608
$$ -15503 32081 -36830 28170 -9187 -12920 30513 -36714 30209 -12248 -9794 28702 -36906
373c6906O8516m6746Q224L3119o2183O9078n0758J3795K7622n8923O8977n3589
$$ -36906 31610 -15136 -6912 26207 -35976 33102 -17656 -3861 23761 -35162 33815 -19774
385a9774J8822K2566n5368O8460n6708K4221J6623n1283O7193n8719K8683J1294
$$ -19774 -952 21614 -33754 34706 -22002 2219 18842 -32441 34752 -23967 4716 16010
397A6010m7252O6215o0872L3540N793m2821O4295o2073L7504L42l8062O1863o3281
$$ 16010 -31242 34973 -25899 7641 13434 -29387 34908 -27165 10339 10681 -27381 34482 -28799
410b8799M1793n407l3250N9989o4495M5731j0766k8394N7188o5175M9311j5522
$$ -28799 12994 7587 -25663 34326 -30169 15562 4796 -23598 33590 -31585 17726 2204
422B204k3338N4179o5566N2978k1234j8106N0846o5145N5681k6122j2971M7389
$$ 2204 -21134 33045 -32521 20457 -777 -18883 31963 -33182 22499 -3623 -16594 30795
434C0795o4281N7688l0405p925M3171o2772N9791l4938k465L9026o1082O0792
$$ 30795 -33486 24202 -6203 -14128 29043 -33729 26062 -8876 -11341 27685 -33397 27395
446B7395l8566K245L4513n8483O1379m2213P828K9036n5449O1672m5271J3013
$$ 27395 -11171 -8926 25587 -32896 28483 -13730 -5902 23134 -32315 29357 -15914 -2901
458b901K4574n2837O1179m8049J7251J9568m9162O0794n0205K2128J4341m5684
$$ -2901 21673 -31164 30015 -18034 -783 18785 -30377 30417 -19788 2340 16681 -29003
470b9003N9936n2473K6474R358m2240N9333n4150K9771M469l7248N7269n6894
$$ -29003 30933 -21540 4934 14292 -27948 31385 -22765 7006 11475 -25773 31496 -25398
482b5398L4870n84l3127N5323n7862L8659n035l0125N4060n8483M2717j0834k4467
$$ -25398 9472 8888 -24239 31084 -26778 11881 6846 -23279 30781 -27702 15015 4181 -20286
495b0286N0420n8415M4159j4174k0992M8509n8200M7537j9108j6311M4144n6567
$$ -20286 30134 -28281 15878 1704 -19288 29221 -28979 18558 -550 -16861 27283 -29284
507b9284M9308k3579j1047M1012n5636N0299k7527n769L7403n4377N1921l1324
$$ -29284 20024 -3555 -14602 26410 -29226 21073 -6454 -12223 25180 -29197 22724 -8600
519h600j81L2643n3046N3402l3761J979K9736n0924N4207l7741O999K5060m8083
$$ -8600 -8781 23862 -29184 24218 -9543 -7564 22172 -28752 25455 -12286 -5287 19773 -28310
532b8310N5325m2241J2334K0674m5513N4894m3566J7418J5371m3107N4523m6409
$$ -28310 27015 -15226 -2892 17782 -27731 27163 -16403 1015 16386 -26721 27802 -18607
544a8607K1143J2180m0663N4220m9128K6132O571l6980N3919n0540K9165K819
$$ -18607 2536 14716 -25947 28273 -20855 5277 11848 -25132 28787 -21753 7412 10231
556A0231l3866N1548n0431L2237k036k9498M9964n2297L6591p170k5251M7332
$$ 10231 -23635 27913 -22518 9719 7683 -21815 28149 -24148 12443 5273 -19978 27354
568B7354n2292L8162j0573k1024M4985n2479M1196j4512j7534M3202n2679M2875
$$ 27354 -24938 13224 2651 -18373 26612 -25867 15329 817 -16717 26485 -26194 16681
580A6681j7185j4344M0184n1675M4541k1721r286L7074n0724M6184k5544n025
$$ 16681 -504 -14848 25336 -26339 18202 -3519 -12805 24269 -26455 19729 -5815 -10840
592a0840L4353n0542M7708k8175j507L1199m9583M9508l1712L168K7147m6847
$$ -10840 23513 -27029 20679 -7496 -9003 22196 -27387 22121 -9591 -6423 20724 -26123
604b6123M9645l5710Q048K2585m4502N0033l7568J1419J9257m2562N0619m0515
$$ -26123 23522 -12188 -4140 18445 -26057 23976 -13592 -2173 17084 -25478 25141 -15374
616a5374J5671J4721m0095N0964m2666J8999J0327l6675N0583m4743K2708O294
$$ -15374 297 15018 -25077 25887 -16779 2220 12547 -24128 26455 -18288 4420 10714
628A0714l3618M8656m5898K5950L323l1345M8173m6248K8970j486k7631M6604
$$ 10714 -22904 25752 -20146 5804 9127 -22218 25955 -20293 8677 7191 -20440 26164
640B6164m8117L2012n096k2958M2699m7488L5301j0430j8537M0191m7158L6998
$$ 26164 -21953 10059 4963 -17995 24704 -22784 12517 2087 -16450 23741 -23417 13581
652A3581j1689j6666L8304m8286L9532j5695j1861L5220m7228M1529k0066q100
$$ 13581 1892 -14774 23530 -24756 14776 -919 -12780 22440 -24788 16741 -3325 -11425
664a1425L3791m6221M1374k3489l456L0663m6002M3826k6934J22K8412m5721M6120
$$ -11425 22366 -23855 17519 -5970 -9426 21237 -24765 19061 -7873 -7751 20661 -25060 21060
677B1060k9815K352K4021m2434M6635l2921P433K0860m1381M7150l5970J1550
$$ 21060 -8755 -6403 17618 -24816 21819 -11102 -3669 17191 -24190 22960 -13010 -1460
689a460J6642l9637M7673l7597J4516J3114l6221M5687l8544J8142R133l3688
$$ -1460 15182 -24455 23218 -14379 137 13251 -22970 22717 -15827 2315 11448 -22240
701b2240M5691m0517K1788N534l0245M3703m1231K3685K242k7488M2715m2365
$$ -22240 23451 -17066 4722 10256 -19989 23714 -17517 6168 8410 -19078 23637 -18728
713a8728K5671p77k4420M1500m3799L0221n400k1234L9737m3550L2234r187j7848
$$ -18728 6943 6166 -18254 23246 -20553 9668 4268 -16966 22771 -20779 11455 2268 -15580
726a5580L8094m4333L4675j2422j4651L6095m4409L7398j5997j1013L3496m3447
$$ -15580 22514 -21819 12856 434 -14217 21878 -22531 14867 -1130 -12143 21353 -22094
738b2094L6077j8051o998L1598m3036L8419k0893l552K7765m2446M1439k4391
$$ -22094 13983 -4068 -11066 20532 -22504 15915 -4978 -8530 19235 -23211 18228 -6163
750f163j009K5128m1614M2860k7769L419K2037l9102M2454l0334P064J8091l7094
$$ -6163 -7172 17956 -23658 19202 -8567 -5148 16889 -22213 20241 -10093 -3029 15062 -22032
763b2032M3086l2776R854J5962l6375M2304l3870J2913J2497l2335M2166l4734
$$ -22032 21054 -11722 -1868 14094 -22281 20023 -13847 -934 11563 -20772 21394 -13340
775a3340J5131R404l1463M2190l7661J9094O774k9368M1533l8662K2137J783k5968
$$ -13340 1791 11195 -20268 21922 -15739 3355 10129 -19239 22294 -16368 5769 7552 -18416
788a8416M0665m0178K4905j015k3125L9169m1220K8058m712k0612L8601m2106
$$ -18416 22249 -17929 6976 5961 -17164 22005 -19215 8843 4131 -16481 22120 -19986
800a9986L0654p972j7553L6101m1830L2448j1140j4177L4437m1992L4485j4513
$$ -19986 10668 2696 -14857 21244 -20586 11862 722 -13455 20982 -21010 13475 -1038
812a038j0651L1960m1446L5728j7107p540K9103m0430L6839j9904m114K6606l9249
$$ -1038 -11689 20271 -21175 14553 -2554 -10094 19009 -21421 15418 -4486 -8600 18006 -21243
825b1243L7997k2948p43K4040l8216L8918k5220J975K1389l7021L9536k7735N992
$$ -21243 16754 -6194 -6937 17103 -21113 17805 -7415 -5440 15949 -21072 18464 -9271 -3279
838c279J7675l5183L9834k9961Q917J5095l3427L9952l1692J1942J2111l1528
$$ -3279 14396 -20787 19047 -10914 -1997 13098 -20329 19623 -12069 -127 11984 -19544
850a9544L9795l3591J5473Q131k9475L9894l5771J8791N299k7304L9355l6847
$$ -19544 20251 -13340 2133 10264 -19211 20683 -15088 3703 9002 -18302 21053 -15794
862a5794K1075J667k4224L8022l7582K3461j223k0978L6449l8817K6223m422j8768
$$ -15794 5281 6948 -17276 20746 -16836 6625 5402 -15576 20873 -17944 8279 3857 -14911
875a4911L5093l8345K7856p391j5882L3611l8893L0043j0534j2648L1252l8708
$$ -14911 20182 -18163 9693 2302 -13580 20031 -18862 11181 647 -12001 19251 -19457
887a9457L1730j3239r840K9457l8098L2747j5845o948K7356l7334L3512j8357
$$ -19457 12273 -966 -10806 18651 -19447 13300 -2545 -9493 17863 -19471 14041 -4316
899d316l498K4612l6656L5487k1169q19K1981l5127L5861k3355K379J9205l3797
$$ -4316 -7814 16798 -19858 15629 -5540 -6359 15622 -19505 16356 -6999 -4620 14585 -19212
912a9212L6247k5719N834J6581l2635L6616k7375Q374J3887l1480L7511k9699
$$ -19212 17035 -8684 -2850 13731 -18904 17712 -9663 -1289 12598 -18882 18629 -11070
924a1070J1043J0854k9382L7088l0743J3744Q036k6979L6714l2940J6609N081
$$ -11070 -27 10827 -18555 18533 -12210 1534 9570 -17409 19305 -13635 2974 8055
936H055k4971L5506l3563J9595J608k1722L5188l4398K0906q33k0112L3495l4091
$$ 8055 -16916 18590 -14973 4622 6230 -15492 19696 -14702 6204 5371 -14741 18754 -15337
949a5337K2584l893j6112L0578l4889K5913o422j4448L0053l5010K7214r595j1917
$$ -15337 7247 3354 -12758 17820 -17069 8844 2422 -12026 18027 -16983 10231 636 -11281
962a1281K9146l5766K9525j1779r373K7001l5727L0600j4559p033K5936l5101
$$ -11281 17865 -17901 11624 -155 -9528 17473 -18254 12346 -2213 -9246 16690 -18411
974a8411L2199j7579l511K3227l4040L2633j9766j241K1029l2981L4054k2251
$$ -18411 13788 -3791 -7302 15925 -18115 14518 -5248 -6489 14540 -18441 15613 -6638
986f638K301J8199l2319L4236k3866N488J5684l0984L4230k5816Q262J2428k8797
$$ -6638 -4337 13862 -18457 15779 -8087 -2599 13085 -17899 16331 -9485 -1223 11205 -17592
999a7592L4337k7196J0750R905k6800L3733k8498J3174O745k4530L3187k9672
$$ -17592 16745 -10451 299 10204 -16596 17137 -11361 1813 8558 -15972 17215 -12457
1011a2457J5629M285k2730L2909l0706J7638J667k0654L1912l1635J9996r82j8416
$$ -12457 3172 7457 -15273 17636 -13070 4568 6235 -14419 17493 -14142 5854 4872 -13544
1024a3544L0539l1846K1950l649j5896K9627l2588K3689n826j3897K8223l2671
$$ -13544 16995 -14851 7099 3450 -12446 17181 -15407 8282 2456 -11441 16782 -15889
1036a5889K5462r234j0788K6974l2982K7074j1620q366K5402l3049K8755j4145
$$ -15889 9573 339 -10449 16525 -16457 10617 -1003 -9369 16033 -17016 11739 -2406
1048b406n596K3417l2328K9623j6450k969K1281l1791L0682j8255n31J9040l0582
$$ -2406 -8002 15415 -16913 12710 -3740 -6709 14572 -17219 13463 -4792 -5323 13717 -16865
1061a6865L1194k0386K215J6524k9133L1148k1849M165J4643k8083L1367k3106
$$ -16865 14329 -6057 -3842 12682 -16451 14697 -7152 -2987 11656 -16427 14940 -8166
1073h166O421J2411k6554L1284k4627Q879R949k4712L0917k6192J1464P020k3055
$$ -8166 -1745 10666 -15888 15396 -9231 -352 9597 -15115 15802 -10390 1074 8094 -14961
1086a4961L0816k7383J3994M633k1173L0377k8360J5646K501j9740K9630k8969
$$ -14961 15855 -11528 2466 7099 -14074 16303 -12057 3589 6090 -13650 15980 -12989
1098a2989J8164o99j7164K8713k9624J9927l077j4986K7790k9923K1267n434j2566
$$ -12989 5175 4476 -12688 16025 -13599 6328 3251 -11735 16055 -13868 7399 1965 -10601
1111a0601K6309l0488K3396q117r961K4377k9873K4633j0076q110K2968k9508
$$ -10601 15708 -14780 8616 499 -9462 14915 -14958 9675 -401 -8511 14457 -15051
1123a5051K5302j1865n871K1353k9127K6168j3836l320J9218k8573K7346j5807
$$ -15051 10251 -1614 -7485 13868 -15259 10909 -2927 -6247 12971 -15602 11744 -4063
1135d063j163J7439k7327K7465j7419Q93J5749k6395K7965j9098L006J3535k5192
$$ -4063 -5226 12213 -15114 12351 -5068 -4175 11574 -14821 13144 -5954 -2948 10587 -14605
1148a4605K8078k0639N475J1265k3820K7921k1801P829Q995k2905K8207k3315
$$ -14605 13473 -7166 -1691 9574 -14246 13675 -8126 -297 8698 -14207 14000 -9315
1160i315J0381O728k1436K8106k4389J2248M208j9567K7616k5519J4324K077j7518
$$ -9315 1066 7794 -13642 14464 -9925 2323 6531 -13036 14580 -10939 3385 5462 -12056
1173a2056K6557k6077J6073j98j5501K5461k6302J7500k537j3539K4751k6701
$$ -12056 14501 -11576 4497 4299 -11202 14259 -12043 5457 2920 -10619 14132 -12569
1185a2569J9001m344j1844K3721k6705K0134o631r596K2244k6720K1263q017p692
$$ -12569 6432 2088 -9756 13965 -12740 7394 763 -8833 13411 -13309 7954 -63 -7755
1198g755K0655k6029K2050j0233n339J8996k5908K3331j2447l311J7798k5593
$$ -7755 12900 -13129 8921 -1312 -6651 12345 -13563 9768 -2679 -5990 11808 -13785
1210a3785K4379j4245q95J5576k4540K4708j5719Q27J4143k3957K4939j6826K832
$$ -13785 10594 -3651 -4546 11030 -13510 11198 -4521 -3694 10449 -13508 11431 -5395 -2563
1223b563J2145k3017K5628j8693N226R820k1403K5396j9850O842Q595k0808K5448
$$ -2563 9582 -13435 12193 -6500 -1274 8546 -12857 12539 -7311 -469 8126 -12682 12766
1236A2766k0970Q881O154j8924K5030k1693J0278M631j7665K4475k2580J2508
$$ 12766 -8204 677 6831 -12093 12937 -8756 1522 6153 -11512 12963 -9617 2891
1248B891K268j5998K3732k2965J3371L85j3702K2695k3611J5289j160j2366K1415
$$ 2891 5159 -10839 12893 -10072 3299 3684 -10018 12677 -10934 4355 3195 -9171 12244
1261A2244k2711J6189l495j0912K0630k2682J6809m930q800J9249k3188J8749
$$ 12244 -10467 5722 2227 -8685 11945 -10737 6072 1142 -7658 11591 -11597 7152
1273G152p834o318J8114k2726J8911q221m874J6998k3206K0423j0307k453J5027
$$ 7152 -682 -7000 11114 -11612 7299 -922 -5796 11202 -12004 8419 -1888 -4341 10686
1286A0686k3002K0602j1455r58J3992k1416K1083j3371M39J1831k0253K2875j5131
$$ 10686 -12316 8286 -3169 -4127 9865 -11551 9532 -3839 -3400 8431 -11822 11053 -4078
1299d078K307J0117k0527K2070j5363L481R634j8930K2457j6574M919O867j8029
$$ -4078 -1771 8346 -12181 9889 -5474 -1993 7641 -11289 11168 -5406 -487 6380 -11649
1312a1649K2136j7598P786M899j6024K1264j8127Q160M453j5157K1007j9574J0270
$$ -11649 10487 -7111 675 5574 -10450 10814 -7313 847 5300 -9857 11150 -8424 1846
1325A846K235j3939K0251j9372J2400Qj2268K0050k0088J2896q83j1652J9256
$$ 1846 4081 -9858 10393 -8979 3421 3429 -8839 11211 -8877 4019 3136 -8516 10740
1338A0740k0229J4570l570q919J7954k0202J5117m590p286J7241k0614J6004o475
$$ 10740 -9489 5081 1511 -7408 10546 -9656 5461 871 -6415 10826 -9788 6216 -259
1351b59o163J6125j9578J6661p113n545J5283k0082J7837q882l339J4224j9291
$$ -259 -6422 9703 -9875 6786 -327 -5872 9411 -10671 7166 -1716 -5055 9169 -10122
1364a0122J7758r816j336J2216j9022J8423j1651P37J1312j8807J8753j2563K214
$$ -10122 7636 -2180 -3516 8700 -10322 8101 -3550 -2813 8499 -10308 8445 -4118 -1904
1377a904R239j7320J9000j3998L714Q240j7146J9348j4215M091P521j6031J8879
$$ -1904 7335 -9985 9015 -4983 -1269 6971 -10175 9173 -5042 -951 6570 -9461 9418
1390I418j5663O409N229j4564J8582j6044P494M160j3852J8530j6480Q150K845
$$ 9418 -6245 164 5393 -9171 9411 -6633 861 5021 -8831 9699 -6781 1369 4214
$$ [...]
8191e9
##END NTUPLES=NMR FID
##END=
