##TITLE=1H_Pr CCl4-1
 200.13Hz,.
 8 sc
 
 29.4.2026
##JCAMPDX= 6.0         $$ Bruker NMR JCAMP-DX V2.0
##DATA TYPE= NMR FID
##DATA CLASS= NTUPLES
##ORIGIN= UXNMR, Bruker Analytische Messtechnik GmbH
##OWNER= pz
$$ XWIN-NMR		Version 3.5
$$ Mon May  4 13:59:26 2026 Russian Standard Time (UT+4h)  she@DPX200
##.OBSERVE FREQUENCY= 200.131
##.OBSERVE NUCLEUS= ^1H
##.DELAY= (6, 6)
##.ACQUISITION MODE= SIMULTANEOUS
##.ACQUISITION SCHEME= undefined
##.AVERAGES= 8
##.DIGITISER RES= 18
##SPECTROMETER/DATA SYSTEM= spect
##.PULSE SEQUENCE= zg30
##.SOLVENT NAME= CDCl3
##.SHIFT REFERENCE= (INTERNAL, CDCl3, 0, 14.3821)
##AUDIT TRAIL= $$ (NUMBER, WHEN, WHO, WHERE, WHAT)
$$ ##TITLE= Audit trail, XWIN-NMR		Version 3.5
$$ ##JCAMPDX= 5.01
$$ ##ORIGIN= Bruker BioSpin GmbH
$$ ##OWNER= she
$$ F:/spectra/data/she/nmr/H-C/1/audita.txt
$$ ##AUDIT TRAIL=  $$ (NUMBER, WHEN, WHO, WHERE, WHAT)
(   1,<2026-05-04 13:56:37.51 +0400>,<she>,<DPX200>,
      <created by zg, POWCHK disabled, PULCHK disabled
       configuration hash MD5:
       00 E9 B6 7A A2 85 ED C7 34 08 36 98 17 FE 4E 26
       data hash MD5: 16K
       E3 81 4A 4C 58 5B 4D 62 A9 62 FA 57 43 83 80 A3>)
$$ ##END=
$$ 
$$ hash MD5
$$ 0C 28 A7 55 DD 28 AB 1B BD C9 14 B1 D0 E3 5E 30
##$RELAX= 
##$RELAX= 
##$RELAX= 
##$RELAX= 
##$RELAX= 
##$RELAX= 
$$ Bruker specific parameters
$$ --------------------------
##$DU= <F:/spectra>
##$EXPNO= 1
##$NAME= <H-C>
##$PROCNO= 1
##$TYPE= <nmr>
##$USER= <she>
##$AMP= (0..31)
100 100 100 100 100 100 100 100 100 100 100 100 100 100 100 100 100 100 
100 100 100 100 100 100 100 100 100 100 100 100 100 100 
##$AQSEQ= 0
##$AQ_mod= 1
##$AUNM= <au_zg>
##$AUTOPOS= <>
##$BF1= 200.13
##$BF2= 200.13
##$BF3= 200.13
##$BF4= 200.13
##$BF5= 200.13
##$BF6= 200.13
##$BF7= 200.13
##$BF8= 200.13
##$BYTORDA= 1
##$CFDGTYP= 0
##$CFRGTYP= 5
##$CHEMSTR= <none>
##$CNST= (0..31)
1 1 145 1 1 1 1 1 1 1 1 1 1 1 1 1 1 1 1 1 1 1 1 1 1 1 1 1 1 1 1 1 
##$CPDPRG= <>
##$CPDPRG1= <>
##$CPDPRG2= <>
##$CPDPRG3= <>
##$CPDPRG4= <mlev>
##$CPDPRG5= <mlev>
##$CPDPRG6= <mlev>
##$CPDPRG7= <mlev>
##$CPDPRG8= <mlev>
##$CPDPRGB= <>
##$CPDPRGT= <>
##$D= (0..31)
0 0.7 0 0 0 0 0 0 0 0 0 0.03 0 0 0 0 0 0 0 0 0 0 0 0 0 0 0 0 0 0 0 0 
##$DATE= 1777888596
##$DBL= (0..7)
120 120 120 120 120 120 120 120 
##$DBP= (0..7)
150 150 150 150 150 150 150 150 
##$DBP07= 0
##$DBPNAM0= <>
##$DBPNAM1= <>
##$DBPNAM2= <>
##$DBPNAM3= <>
##$DBPNAM4= <>
##$DBPNAM5= <>
##$DBPNAM6= <>
##$DBPNAM7= <>
##$DBPOAL= (0..7)
0.5 0.5 0.5 0.5 0.5 0.5 0.5 0.5 
##$DBPOFFS= (0..7)
0 0 0 0 0 0 0 0 
##$DE= 6
##$DECBNUC= <off>
##$DECIM= 32
##$DECNUC= <off>
##$DECSTAT= 4
##$DIGMOD= 1
##$DIGTYP= 9
##$DL= (0..7)
0 120 120 120 120 120 120 120 
##$DP= (0..7)
150 150 150 150 150 150 150 150 
##$DP07= 0
##$DPNAME0= <>
##$DPNAME1= <>
##$DPNAME2= <>
##$DPNAME3= <>
##$DPNAME4= <>
##$DPNAME5= <>
##$DPNAME6= <>
##$DPNAME7= <>
##$DPOAL= (0..7)
0.5 0.5 0.5 0.5 0.5 0.5 0.5 0.5 
##$DPOFFS= (0..7)
0 0 0 0 0 0 0 0 
##$DQDMODE= 0
##$DR= 18
##$DS= 0
##$DSLIST= <SSSSSSSSSSSSSSS>
##$DSPFIRM= 0
$$ [...]
##$SUBNAM0= <"">
##$SUBNAM1= <"">
##$SUBNAM2= <"">
##$SUBNAM3= <"">
##$SUBNAM4= <"">
##$SUBNAM5= <"">
##$SUBNAM6= <"">
##$SUBNAM7= <"">
##$SUBNAM8= <"">
##$SUBNAM9= <"">
##$SW= 18.0517599122864
##$SWIBOX= (0..15)
0 0 2 0 0 0 0 0 0 0 0 0 0 0 0 0 
##$SW_h= 3612.71676300578
##$TD= 16384
##$TD0= 1
##$TE= 0
##$TE2= 300
##$TE3= 300
##$TEG= 300
##$TL= (0..7)
0 120 120 120 120 120 120 120 
##$TP= (0..7)
150 150 150 150 150 150 150 150 
##$TP07= 0
##$TPNAME0= <>
##$TPNAME1= <>
##$TPNAME2= <>
##$TPNAME3= <>
##$TPNAME4= <>
##$TPNAME5= <>
##$TPNAME6= <>
##$TPNAME7= <>
##$TPOAL= (0..7)
0.5 0.5 0.5 0.5 0.5 0.5 0.5 0.5 
##$TPOFFS= (0..7)
0 0 0 0 0 0 0 0 
##$TUNHIN= 0
##$TUNHOUT= 0
##$TUNXOUT= 0
##$USERA1= <user>
##$USERA2= <user>
##$USERA3= <user>
##$USERA4= <user>
##$USERA5= <user>
##$V9= 5
##$VALIST= <valist>
##$VCLIST= <CCCCCCCCCCCCCCC>
##$VD= 0
##$VDLIST= <DDDDDDDDDDDDDDD>
##$VPLIST= <PPPPPPPPPPPPPPP>
##$VTLIST= <TTTTTTTTTTTTTTT>
##$WBST= 1024
##$WBSW= 4
##$XGAIN= (0..3)
0 0 0 0 
##$XL= 0
##$YL= 0
##$YMAX_a= 45581
##$YMIN_a= -50558
##$ZGOPTNS= <>
##$ZL1= 120
##$ZL2= 120
##$ZL3= 120
##$ZL4= 120
##$ABSF1= 10
##$ABSF2= 0
##$ABSG= 5
##$ABSL= 3
##$ALPHA= 0
##$AQORDER= 0
##$ASSFAC= 0
##$ASSFACI= 0
##$ASSFACX= 0
##$ASSWID= 0
##$AUNMP= <proc_1d>
##$AZFE= 0.1
##$AZFW= 0.1
##$BCFW= 1
##$BC_mod= 2
##$BYTORDP= 1
##$COROFFS= 0
##$CY= -3
##$DATMOD= 1
##$DC= 2
##$DFILT= <>
##$DTYPP= 0
##$F1P= 0
##$F2P= 0
##$FCOR= 0.5
##$FTSIZE= 0
##$FT_mod= 4
##$GAMMA= 1
##$GB= 0.15
##$INTBC= 1
##$INTSCL= 1
##$ISEN= 128
##$LB= 0.25
##$LEV0= 0
##$LPBIN= 0
##$MAXI= 10000
##$MC2= 0
##$MEAN= 0
##$ME_mod= 0
##$MI= 1.114404
##$NCOEF= 0
##$NC_proc= 0
##$NLEV= 6
##$NOISF1= 3.799351
##$NOISF2= 2.8
##$NSP= 1
##$NTH_PI= 0
##$NZP= 0
##$OFFSET= 14.38212
##$PC= 1
##$PHC0= -4070.753
##$PHC1= 13.59229
##$PH_mod= 1
##$PKNL= yes
##$PPARMOD= 0
##$PSCAL= 0
##$PSIGN= 0
##$REVERSE= no
##$SF= 200.129724274929
##$SI= 16384
##$SIGF1= 3
##$SIGF2= 2
##$SINO= 400
##$SIOLD= 16384
##$SREGLST= <1H.CDCl3>
##$SSB= 0
##$STSI= 0
##$STSR= 0
##$SW_p= 3205.1282051282
##$SYMM= 0
##$S_DEV= 0
##$TDeff= 0
##$TDoff= 0
##$TI= <>
##$TILT= no
##$TM1= 0
##$TM2= 0
##$TOPLEV= 0
##$USERP1= <user>
##$USERP2= <user>
##$USERP3= <user>
##$USERP4= <user>
##$USERP5= <user>
##$WDW= 1
##$XDIM= 8192
##$YMAX_p= 0
##$YMIN_p= 0
$$ End of Bruker specific parameters
$$ ---------------------------------
##NTUPLES= NMR FID
##VAR_NAME=  TIME,          FID/REAL,        FID/IMAG
##SYMBOL=    X,             R,               I
##VAR_TYPE=  INDEPENDENT,   DEPENDENT,       DEPENDENT
##VAR_FORM=  AFFN,          ASDF,            ASDF
##VAR_DIM=   8192,          8192,            8192
##UNITS=     SECONDS,       ARBITRARY UNITS, ARBITRARY UNITS
##FACTOR=    0.0002768,     1,               1
##FIRST=     0,             0,               0
##LAST=      2.2672688,     0,               0
##MIN=       0,             -50558,          0
##MAX=       2.2672688,     45581,           0
$$ Real data points
##PAGE= N=1
##DATA TABLE= (X++(R..R)), XYDATA
$$ [...]
2315E17j051M42O95j162J396j205M63O33j231J307j628N83Q00j099J672k159R62
2332f5L78r24J674j448K81Q03j328J422j085J41J23m55J581r19K38n19o09J351
2350F40j034K13O46j440K230j628P80n71n91J502j524J201j76m93J163j735J210
2367C93j01p65L26m66J343p87J44P79k026K028j282L04N38j274J609j301l12J062
2385B12o56M27m38M8L29o00R73l00m19J546j944Q03L18N01k9j139N60o64l19J71
2405f20j004K113j108L73M49j010J468j367R27L06q00O27q83O04L19p67Q65j101
2423f09N20K30m86Q61j404P18K67j038J561r79M41K35o29J005j095M34J64q05
2441f09J731j223J71k21r7O27j125J274n67o36J197j039J241q96k74N89l25L58
$$ plain form
2315 517 -534 -92 603 -559 837 -368 95 728 -503 804 -824 -241 559 -540 1132 -1027 -65
2332 -65 313 -611 1063 -385 -104 699 -629 793 -292 -151 -28 -483 1098 179 417 -102 -711 640
2350 640 -394 -181 465 -975 1255 -373 407 -164 -755 747 -777 424 248 -245 918 -817 393
2367 393 292 -473 -147 -613 730 -57 87 866 -1160 868 -414 -110 428 -846 763 -538 -850 212
2385 212 -444 -17 -455 -407 -78 -678 295 -5 -424 1122 -822 -19 299 800 771 -368 192 -472 -791 -620
2405 -620 -1624 489 -619 -246 203 -807 661 -706 221 527 -273 354 -529 75 394 -373 492 -609
2423 -609 -89 141 -345 516 -888 -170 97 -941 620 -359 82 317 -312 693 -402 32 196 -609
2441 -609 1122 -101 70 -151 -248 379 -746 528 -39 -675 522 -517 724 -172 -446 143 -182 176
2459A76n44M87P74j044R79q80J6K16m65K90O99q87J000j710P51k95M07M16k49
2478A37Q0n45Q9m61r7J308n85K38o2r06N87J17L1l58l8J041j122K04k1J211r35
2499h7o16o6L49m80J347j395J316R41j900R76r48P0Q48j241J927r06J001l61o7
2518G08J38q28J227j229k80Q47j544J029k69m32K74k15J248k15n13R52j334R62
2536E26m87r89J116q36J319o16j16L12n65O52k10k76O06j043J048q68N40L65r03
2555d25J044r46K47O08j048Q99p08N06k4n87R31n80J53N15q17Q09p95J56L8m25
2575d49Q84o52L34K35o22P07q59N46o6n80J047p18K63L3n03Q38q74M88Q0q34P11
2596Ij11K18J56q00R33p43N39k63k16O33n79M64n67K16N84j004R31l10l70O94
$$ plain form
2459 176 -368 119 893 -151 828 -52 -36 180 -285 5 704 -183 817 -893 -142 -437 -30 386 137
2478 137 217 -328 -239 -700 -797 511 -74 164 102 -804 -217 -100 -69 -427 -465 576 -546 -342 -363 848 -87
2499 -87 -703 -769 -420 -900 447 -948 368 1309 -591 385 -563 -493 355 -886 1041 135 1136 775 708
2518 708 846 18 1245 16 -264 583 -961 68 -201 -633 -359 -574 674 459 -54 898 -436 526
2536 526 39 -950 166 -670 649 33 -83 229 -336 316 106 -170 436 -607 441 -427 113 478 -425
2555 -425 619 -327 -80 528 -520 379 -329 177 153 -434 497 -83 70 585 -232 577 -218 -62 -24 -449
2575 -449 435 -217 117 352 -270 437 -422 124 58 -522 525 -193 70 103 -400 438 -436 52 132 -702 9
2596 9 -102 116 272 -528 405 -338 201 -62 -278 355 -224 240 -327 -111 473 -531 400 90 -280 414
2616D14q33M15m5j8P38j268J080p11K52L86j215J100n97pP55p09N06k12l03N36
2636B64m87N61o26K35M06n74N23l98K45J89p36P06k37j04L40m69O61p11L3K75
2656I6k49O45o87J31N24p59K67j63K23K10o19R31r94N68K32p47P76o74K54q7n63
2677f85O36o05P09J3q62J077o07J018m00m50K75l00O31j34m03j70k65J531m97
2696E12j407J226j335J082q06L09J040k597J979K61n13J161j422O37o37L64Q32
2713F86o69O7m43P3R45j555R35l20M50J22p81J023n49K32L81q79O75j28K09m87
2733a3m85N78m27O36K98r46O81m74o1N40K9L88j278O78k98J42J91p25N07m85L61
2754a63P97j393K48J40l46O41k56O42o07J30M34m71M00k82j61J79lO68n81m58
$$ plain form
2616 414 -419 -4 -49 -67 671 -597 483 -228 24 410 -805 295 -302 -309 446 -263 243 31 -272 264
2636 264 -223 338 -288 -53 353 -221 302 -96 149 338 -398 308 71 -33 307 -162 499 -212 -179 96
2656 96 -153 492 -195 -64 460 -299 -32 -195 28 238 -381 550 -444 124 356 -391 385 -289 -35 -122 -685
2677 -685 -49 -654 55 68 -794 283 -324 694 294 -156 119 -181 450 316 -87 -257 -522 1009 512
2696 512 -895 331 -1004 78 -728 -419 621 -1976 3 264 -249 912 -510 127 -510 -146 686
2713 686 17 84 -359 -286 659 -896 39 -281 169 291 -490 533 -16 216 597 -282 393 265 474 -13
2733 -13 -498 80 -347 289 587 -359 322 -152 -213 327 356 744 -534 144 -154 -12 179 -546 -39 -524 -163
2754 -163 634 -759 -511 -371 -717 -76 -332 310 -297 -167 267 -204 196 -86 -247 -68 -71 597 16 -442
2774d42N63p10M85k80n87Q08j99L80O3l29L74m68P26K61j127R98r24L29K30q02
2794f51J125j289J251o98R83L10j563K6M20p21J098k24o5L80j083Q94o54R70l00
2813B09o28Q83n68M69l70J62l1j054J613r25LJ88o37L64J03P2l58j69J664j119
2833a29K72J56o69R74j323R03k47o2N23q38L28M6j89M55p61Q93j1r51J291j053
2853c92Q12k03o99J390j046J003o52l31L24p82Q19k28n01J030p43K2J55M2Q76
2872H96j618O68J53j63K20n13N89l18k86M44n09Q50m73R6n10J90J235r92j08O90
2892E41j160R52k32l24R33j120J234j105L49K94p62R61o78M03L89j284J198q14
2910b25K11O82j456J477j131M13J39m01P19P8l10j86o16J235p14K72L5j93O60
$$ plain form
2774 -442 121 -589 -104 -384 -971 -163 -362 18 81 -248 126 -342 384 645 -482 516 -408 -79 151 -651
2794 -651 474 -815 436 -262 721 1031 -532 -506 -86 -807 291 67 2 382 -701 193 -461 509 209
2813 209 -419 464 -104 365 -5 157 126 -928 685 -240 -237 -49 -686 -322 -219 -147 -505 -674 990 -129
2833 -129 143 299 -370 604 -719 184 -63 -125 398 -440 -112 -66 -255 200 -561 332 321 -630 661 -392
2853 -392 420 217 -482 908 -138 865 213 -118 206 -576 243 15 -486 544 -199 -177 -22 20 896
2872 896 -722 -54 99 -64 156 -357 232 -86 -372 72 -437 413 -60 36 -474 -284 951 -41 -149 541
2892 541 -619 333 101 -223 710 -410 824 -281 68 362 -400 561 -117 286 675 -609 589 -225
2910 -225 -14 668 -788 689 -442 -29 110 -291 428 506 196 10 -606 629 -85 187 222 29 689
2929F89p76k03J113j101J412j628M97K73m14M75r87R58m9k67P48j287K42N0P2
2948a83N6k48Q54l10n87R41j215J422L46p56l81m59M45J00mq6k76K27k19k02J97
2969c38l10L67P59r33P78j54m87j48J56O63p17K33K95L30Q6j105J052l91j90L13
2989B59o54Q62J15l11l30k15J539n37r64k92L90Q2m32J98K35l82O19l57K7J86
3009C8m87R17p45K95L16j513J317j14j9N49q91N32l14O1J63J23J46p81L15L61
3029B69n26M29k85M65n52%N63n58J76o0q24J273q89J022rj399J232r43L45N11
3049B40l64k53N22m33K85p02J070J1r31K28J77J00n81R20q82k7K54o08J281L1
3069C38o39J796p97p33M01k80n47n93O80j62L82N80p88N88j41P7n70m33J570p02
$$ plain form
2929 689 -87 -290 823 -278 1134 -494 3 276 -138 337 -650 308 259 -8 740 -547 -305 -255 -183
2948 -183 -127 -375 479 169 -418 523 -692 730 1076 320 -61 -520 -75 25 21 -65 -341 -114 -333 -535 -338
2969 -338 -648 -281 478 -455 323 169 -318 -466 -310 353 -364 -131 164 494 580 -525 527 136 -54 259
2989 259 -395 467 582 271 -59 -274 1265 728 -236 -528 -138 -56 -488 -290 -55 -437 182 -175 -148 38
3009 38 -449 468 -277 18 334 -1179 138 24 5 554 -337 195 -119 -58 105 228 374 -407 -92 269
3029 269 -257 172 -113 352 -200 -200 363 -195 -19 -79 -903 370 -519 503 494 -905 327 -616 -271 240
3049 240 -124 -377 145 -288 -3 -705 365 376 -555 -327 -150 -50 -631 289 -593 -620 -366 -974 307 338
3069 338 -301 1495 698 -35 366 86 -461 -1054 -374 -536 -154 426 -362 226 85 162 -408 -841 729 27
3089B7K52r84J75M62l09L2N89q63L33m19N49J17m75Q79K20j309J061j387J327
3108B77j374P59M66j278J759j48n11J01o01J013k70j57Q66j605J198p23Q70M5
3126F87r53M84j26p16J198r86P84q24O46m86J06J27n01R20P2q99Q98j63L0K3m69
3147a48K89o00J032o36l03L89o79L88j71K17N40j194J165j57L3R87j516L26j70
3166b08n84K98l40N83l50J323r21l1Q38p38M57n21J62K85K3n02P75q35J28J269
3186A111j970K162j546O40o85L02R64k047R87k48P26l92n63L30j27J74J59o79
3204g02L01l28K67P29o44Q47n92j24M97r70J332l85p10R10p91J024n24k22m40
3223e25j93Q98j76m67R30j137R11j13l77K71j52M90q52J070n94o48J544j280R89
$$ plain form
3089 27 279 -705 -530 -68 -377 -345 244 -619 -286 -705 -156 -39 -514 365 585 -724 337 -1050 277
3108 277 -1097 -338 128 -1150 609 461 -50 51 -550 463 193 36 902 -703 495 -228 642 687
3126 687 -266 218 92 -624 574 -412 372 -452 194 -292 -186 -59 -560 360 432 -467 431 268 298 321 -148
3147 -148 141 -459 573 -63 -366 23 -656 -268 -439 -222 318 -876 289 132 165 1152 -364 -38 -208
3166 -208 -792 -494 -834 -251 -601 722 -199 -230 608 -130 327 -194 -32 253 276 -226 549 -286 -158 1111
3186 1111 -859 1303 -243 397 -288 14 978 -1069 -82 -330 396 4 -559 -229 -356 -182 -23 -702
3204 -702 -401 -729 -462 267 -377 470 -122 -246 251 -719 613 228 -482 428 -363 661 137 -85 -525
3223 -525 -718 180 4 -463 467 -670 241 128 -249 22 -130 360 -492 578 -16 -664 880 -400 589
3242E89q54p0P76j223R35j43J10P1j419J675m22M5P4l44K38Q4j67M96j474O31
3262c92N37l0O0n96J474l01o53N09o84l01K59m88O67j401K575k53m91J44r82L3
3282c14J35o24J417m26R8n7m94N05n56M90n01K8L94n85R04l75r3N74p98N28n19
3303b69R3M36q76R47l69j5K65n16N48n03J29L66n75J077q02K1O5m42Q14n87J15
3324g8K84o30J011q91M41P8p88Q76p05M16K08m71M66k78J90K0o87P87q96Q79J93
3345D25q60O20p60O45j09k99M37k51L68J2l61O18q81Q33m29k44O35r71Q06k89
3365e5n51J034q11P39m84k92P16n39N16j82j88L56p43P64o49K04N95n76N98m55
3385cP8J59q17Q62k89j10J44l90L79r7J96L7o36P15j67k58L87o70O51n87K52L94
$$ plain form
3242 589 -265 -335 441 -782 153 10 120 191 -1228 447 25 70 144 -200 38 122 -45 451 -1023 -392
3262 -392 145 115 175 -421 1053 752 99 608 -76 -377 -118 -606 61 -1340 1235 982 491 635 -347 -314
3282 -314 -179 -803 614 188 286 229 -265 240 -316 174 -327 -299 95 -490 414 39 -54 520 -278 250 -269
3303 -269 -176 260 -616 331 -38 -53 212 -304 244 -259 -130 236 -339 738 -64 -43 22 -420 394 -193 -78
3324 -78 206 -424 587 -304 137 215 -573 303 -402 14 222 -249 217 -61 129 149 -538 249 -647 232 425
3345 425 -435 185 -575 70 -39 -338 99 -152 216 228 -133 485 -396 437 8 -236 399 -572 234 -55
3365 -55 -606 428 -383 356 -128 -420 296 -243 273 91 -97 259 -484 280 -369 -165 430 -146 452 -3
3385 -3 75 234 -583 279 -10 -120 24 -366 13 -84 112 149 -487 228 61 -197 190 -480 171 -416 -164 230
3407B30p20Q19p23M66K06o79O38l73J87L85p99O46n21M06J87n06M26m67J78K72
3427B58q58Q59o90N73j04o95J070o88L93K80p37P07q84O64k5n22J009r86N04L1
3447A59o57P41n11L82j32k21M28n37N65k32n38Q08n35K66K25n50Q11p83L78%l77
3468c10N99q81P05j39L2M61q70N54n1n58P09p33P56l78J10J94p97Q68l96j63N97
3489C09l77N40o66K8O42j007R92p29K07K50n43O71n59K34M79q25N86m56L8L77
3509A91n55Q01m00k98M67m02M88l20K5K97n58L65j27J67M5m20O87p02L83J57m85
3530a94L47k91K6M52p28Q82r13L74J50p21R39l56L03j00j22L49p56P03l41l77
3550c74O82l99M72k91m96R08m98J45j45k08M28o85R35l89k20N64j137J045j26
$$ plain form
3407 230 -490 329 -394 72 278 -401 237 -136 51 436 -363 283 -238 168 355 -151 275 -192 -14 258
3427 258 -600 259 -431 142 38 -657 413 -275 118 398 -339 368 -516 148 123 -399 610 -376 128 159
3447 159 -498 243 -268 114 -18 -239 189 -348 217 -15 -553 255 -280 -14 211 -339 472 -311 67 67 -310
3468 -310 289 -592 113 -26 6 467 -403 151 100 -458 251 -482 274 -104 6 200 -597 271 -125 -288 309
3489 309 -68 472 -194 -166 476 -531 461 -268 -61 189 -354 317 -242 -8 471 -354 232 -224 -186 191
3509 191 -364 437 37 -261 206 -196 292 -28 -3 294 -264 101 -26 141 186 -234 453 -249 134 291 -194
3530 -194 153 -138 -112 340 -388 494 -419 -45 105 -616 323 -33 270 170 48 397 -359 344 3 -374
3550 -374 308 -91 381 90 -406 502 4 149 4 -204 224 -461 474 85 -135 429 -708 337 211
3569B11j20K69q32O53j85j7L00p73O03j3l90O19q13O29J58k23k1l97P37n65l2
3590b02O22o02K57k14K11K0l61O26l95p9K03l52M60o50M85K98m59L75l02P3L95
3611D09j088Q28m48J82L74o07O41m84o5M92l45L77m78M53o5m37O19q12K16M72
3631B34m18N23p86L83J52k29L77l65M02l03n8L76o51M86j4m38O51n47M25J85o05
3652b20M42o18J43M37o05P33n76K68K62l49L94o68P39l10r0O35q62N92l18k45
3672b16M94o38M92o3k79L56o27P11Lk37P0m23P54o17J87M34p97O41k71k20P09
3693D63q63O41o04J90L63n27M58k11J8M37m60P21p60K99O5n92P71m78J08rk51
3714b21P43m30j13L25o52M39l16J15N72n84L31l51K74j71j98L73m66M85K28p23
$$ plain form
3569 211 91 360 -472 181 -4 -21 279 -494 109 96 -294 325 -488 141 299 76 55 -342 395 -170 -202
3590 -202 420 -182 75 -139 72 92 -269 357 -38 -117 86 -266 194 -456 29 327 -132 243 -59 14 409
3611 409 -679 149 -299 -117 257 -350 291 -193 -258 234 -111 266 -212 241 176 -261 358 -454 -238 234
3631 234 -184 339 -447 -64 88 -141 236 -129 273 -30 -88 288 -363 123 109 -329 322 -225 200 385 -220
3652 -220 222 -396 -253 184 -421 312 -264 4 266 -83 311 -357 382 72 -18 617 -245 347 29 -216
3672 -216 278 -360 132 69 -210 146 -481 230 233 -4 66 -357 397 -220 -33 401 -396 245 -26 -246 463
3693 463 -400 241 -363 -173 190 -337 121 -90 -72 365 -95 626 -134 165 230 -362 409 -69 39 30 -221
3714 -221 522 92 -21 304 -348 91 -225 -110 462 -122 209 -142 132 -39 -237 136 -330 155 383 -340
3734c40M00l92l7O44p21Q43o65L68n5k26M80p13L78K08o39Q95m55J42M1k83N54
3755D27n94L51k02P6K28m22K76O5o96P59m38J63N5j11N79q69M04J9k6L06m44L66
3777B72l87J72J80n79L58Q7O4J03n52M37j08j56L87p07M91l02n3N35l97O2K0r1
3799a64K86p20O28N2k1j36m08N39l2k39M30l07L39l87r5L06m36P59o77M94J71
3820C82n37P81o87L4l9j26N36m89K66n6j04L95o01J44P00r84N78k22J02J57m99
3841b69N75o27K83K69l17J52j21J74J74m25L63m78L40p7j37M49q41M72L75k64
3861G0L51p41J12N33m74L34o18M78P5n69P80o65O41l09k21M44n07N70k47k40P74
3882E71o07K23l7k77M10p44N31J17k39K74m35P21n37J17L50r66Q07n39qN05o46
$$ plain form
3734 -340 60 -332 -369 275 -446 397 -268 100 45 -181 299 -414 -36 172 -467 428 -27 115 156 -127 427
3755 427 -167 184 -18 58 286 -136 140 205 -491 268 -170 -7 48 -63 516 -353 51 70 44 350 -94 272
3777 272 -115 57 237 -342 16 103 167 270 -282 155 47 -109 278 -429 62 -240 -293 242 -155 -93 -73 -164
3799 -164 122 -598 30 82 61 -75 -483 56 24 -215 215 -92 247 -140 -235 71 -365 394 -283 211 382
3820 382 -155 626 -61 -27 -66 -192 344 -145 121 65 -39 356 -245 -101 599 -385 193 -29 73 230 -269
3841 -269 306 -321 -38 231 -86 66 -55 119 293 -132 231 -247 93 16 -121 328 -513 -41 334 70
3861 70 421 -320 -208 325 -149 185 -433 45 120 -449 331 -334 307 -2 -223 221 -286 284 37 -203 571
3882 571 -36 187 150 -127 283 -461 70 187 -52 222 -213 508 -29 88 438 -528 279 -260 -268 237 -409
3903d09P19k01k42L28m12O11l87k7Q3l82O45m87L25K3n46P96o95J29J39m48Q77
3924D39o05J37K98o49M13k65L36J09l19K84m45N51j72l74L66j91l2J03k18M84
3944B50n68L00K61m11M55o54L11k22j75J037j013K41M43m06M85n30N37l73l5K12
3964A45k48L32j53k80M99n30M43j41k98M38l15J19j18K12K17o84N58l03q0N14
3984C27n37L63k05o3L97l60k0m58N19J80m46O30n89Q4K81k47N08o75L19J77l08
4005a23K55k54Q3L8J2K93l26K40Q2n92O27o06K96k9k29O62o16J73j5l15M60l06
4027a90J64L02n02P52n82M0J09l14M05k26J05Ln15Q93p41o6J49j30J087j146P41
4048C38n90N54n11o4M48k22j49J35o64P37k9K87J21k79k47M04o79R73o41J61m13
$$ plain form
3903 -409 310 109 -133 195 -217 394 7 -20 63 -319 326 -161 164 187 -359 437 -258 -129 10 -438 439
3924 439 -166 -29 269 -380 33 -232 104 213 -106 178 -267 284 112 -262 104 -87 -119 -16 -234 250
3944 250 -318 -18 243 -168 287 -367 -56 -278 -453 584 -429 -188 255 -151 334 -196 341 -32 -67 145
3964 145 -103 229 76 -204 295 -235 208 67 -231 207 -108 11 -107 105 322 -362 196 -107 -187 327
3984 327 -210 153 -52 -115 282 -78 -98 -556 -37 143 -303 327 -262 -178 103 -144 364 -311 8 185 -123
4005 -123 132 -122 -39 -1 11 304 -22 218 300 -292 335 -271 25 -4 -233 429 -187 -14 -29 -344 116 -190
4027 -190 -26 276 -226 526 -56 -16 93 -221 184 -42 63 66 -449 444 -297 -363 -214 -344 743 -403 338
4048 338 -252 302 -209 -273 175 -47 -196 -61 -725 12 -17 270 391 112 -135 269 -410 563 -78 83 -330
4069c30N65m43j60M95P4j95K34R1lr75o95J952k162J700l85n61L32J70N53l63
4089a06l75L17L25P9j162j89J389j49m39N92k5K51j124M71r73J393K85n83k7N71
4109E21m52o83j61L86N59j65L46j007R97m36K73j04p69P79n61L3P05r79J714o32
4129C64j14Po12L89l14J2k14J264q51l94M21J92kJ76j38K07J81p73L99j80J49
4150A69J35o12J186j118K71l31J48L32n11J22N89n56N13l07N47n66p0N85o78R42
4170G90j080L89q6k33p0N36p1m6J6m88l84M92L63j29l69J98M3J471j783Q10m46
4191g7N81k22o13J014j014L73m13M24J67j62n23O55m78N47l19O67l98l4Q40j137
4211a22M96p34r39J332k9K31j77j02O10o42o6Q8NK15n84J9J41K7Q73n14m53P89
$$ plain form
4069 -330 235 -208 -368 127 201 6 240 331 328 -647 -1342 610 -1552 148 -237 -798 -466 -296 257 -106
4089 -106 -481 -164 161 240 -922 -1111 278 129 -310 282 257 508 -616 -145 -1118 275 560 -23 -50 521
4109 521 69 -614 -775 -389 170 5 351 -656 341 -95 178 74 -695 84 -477 -444 261 -718 996 364
4129 364 250 257 -355 34 -280 -268 -482 782 -69 -463 -42 150 148 324 186 393 574 -199 200 20 169
4150 169 304 -308 878 -240 31 -300 -152 180 -331 -209 380 -176 337 30 577 11 -59 526 -152 790
4170 790 -290 99 13 -220 -290 246 175 129 145 -343 -727 -235 128 -1 -370 -172 -129 1342 -441 369 -77
4191 -77 504 282 -331 683 -331 42 -371 53 220 58 -465 190 -288 259 -60 607 209 175 1015 -122
4211 -122 374 -360 -1299 33 4 235 58 -44 566 -76 -142 -54 -49 166 -418 -399 -258 -231 642 128 -325 464
4233D64p34o36J207r01P5L98n22Q93o5r13J28J036p08O67n76k39N27j033J035
4252A03m6R0l02j33K91j2l35R94m83k87J95j47K79m65M28q8j88K57n34N89m90
4273b84o0O18m31L01j10J0Q9m00M72j75k41L55o01N64k55L23J88m40L85m14Q4
4294b2K05k59L66k76K6K9k77K41j26J47k3l27P07m99j50O7J00K5n8Mn6J74J1L2
4318F1j16O2k26L46j35K47j28l68M67l65K71j3k57K08r4M8K80n04M43k28k4J48
4340A23n22N16l72L97k65J81J08j60J67k16n4K30k94R9j9J03J61j31J26K0l71
4361a73L22l27J38K17k03K41l21J33r8OL83m59K18l51K0L43QL99n29K15k67k20
4383c05O41l75K03K00o31L35j32j53K45m56P14l32K04j13l54M73n21M21q4pJ33
$$ plain form
4233 464 -270 -906 301 -600 -525 -127 -649 244 179 -734 -606 430 -278 389 -187 -426 101 -932 103
4252 103 57 147 -155 -288 3 -9 -344 650 167 -120 75 -72 207 -258 170 82 -106 151 -383 206 -284
4273 -284 -344 274 -157 144 34 44 133 -267 205 30 -211 144 -457 107 -148 175 363 -77 308 -106 -22
4294 -22 183 -76 290 14 40 69 -208 33 -93 54 31 -296 411 -88 -238 -171 -71 -46 -104 -100 -156 18 29 61
4318 61 -55 7 -219 127 -8 239 111 -257 210 -155 116 103 -154 54 -40 8 288 -216 227 -1 -25 123
4340 123 -399 117 -255 142 -123 58 166 6 173 -43 -97 133 -161 -62 -81 22 183 52 178 198 -173
4361 -173 149 -178 -40 177 -26 215 -106 27 -71 -65 318 -141 77 -274 -254 89 97 496 -33 182 -85 -305
4383 -305 336 -39 164 364 -267 68 -64 -217 28 -428 286 -46 158 45 -309 164 -357 64 -20 -27 106
4404A06k41pR9j76L19qJ2k4k15L77n21M96J79p47N27k77J14K07j79J05j85P8j64
4427a25K25N1j48J25O6l0L8k21%j33l2M18m71L94j07k60M31q5Q9ok83L92m20J10
4451A8K18m75L51l12L02l3j82N26o83M76j93j86L06l75L06P9N9M9m51M32m85M88
4473B35l5l22L40j42l80K20l4L74q1n7m81J05M28k21k86M75k35JN5L3j4m84N45
4496C9j39L1J35j80K24q6P8J38j85K46l68J79K1j64K06m52L60N2k80L02n22M63
4518I8Oj32K40m32J24J44j6L26o01L23Q7k39K28j31J1K77o61M86k98K94K1k02
4540d7L47m32J82j49k25O34n87Q3Mq6O31n16J96j72J57m1K7p7J08K30l21m7P6
4563b5n0o2L66j78J01qm59L89l99L49K17k53M03m14p8j3J03J54q1J68k69l0K79
$$ plain form
4404 106 -135 -142 -43 -219 100 92 104 80 -135 242 -279 217 396 -351 176 -101 13 220 41 146 -39 39 -125
4427 -125 100 151 3 128 194 164 202 -19 -19 -152 -184 234 -237 157 50 -210 221 136 225 219 -64 328 -92 18
4451 18 236 -239 112 -200 102 69 -113 413 -270 206 13 -173 133 -242 64 143 202 251 -200 232 -253 235
4473 235 200 -122 218 76 -304 -84 -118 256 175 118 -363 -258 170 -51 -337 138 -97 -96 -41 -8 -22 -506 39
4496 39 -100 -69 66 -114 110 24 102 240 55 301 -67 112 133 -31 175 -277 83 135 -145 157 -365 98
4518 98 104 -28 212 -220 -96 48 32 358 -243 80 167 -72 156 25 36 313 -348 138 -160 134 155 -47
4540 -47 300 -132 50 -99 -324 310 -277 -194 -190 -276 355 -161 35 -137 20 -21 6 -71 37 267 -54 -101 -25
4563 -25 -75 -137 229 51 152 144 -315 74 -325 24 241 -12 391 -23 -101 -114 -11 143 62 230 -39 -69 210
4586B10m68L87k12o4L61m24L32p5m3J57l20K56l25J70K7J05P6j23k24L38j94J10
4608E7M7m28J76o0M54l03L12l64j54O73n83O14n53K79K31l77j56K06q7J12l02
4629b06M07j17k80L35k29J4K17k5k3o19K42M41k77L89m21J77K13m46L22j65K43
4650A92k13j84N63l05k46L22j76K28k61J26R0k35M24m27K84k41J42Q4j76L33p8
4671B46l11p8lM25j10q4L7j21l0K76m14K99k29K69k88kJ56n34O06Lm04M08n10
4694c93P90k03k43J22j75K09k58J80l8l06M6K32M17J35j96N04j179j66K92q76
4714a106M22r0N20q8M65J24p25k25N70j76R96o95J76p60J55q5L67O26j179N45
4734a63J137r91o0l88q51P78j41N61l89Q95M89j823R43Q4m59J374j663N11R99
$$ plain form
4586 210 -258 129 -83 -147 214 -210 122 47 4 161 -159 97 -228 -58 -31 74 150 27 -197 141 -53 57
4608 57 104 -324 -148 -208 246 -57 255 -109 -263 410 -173 441 -112 167 398 21 -135 71 -16 96 -206
4629 -206 201 84 -196 139 -90 -76 141 116 93 -526 -284 157 -120 269 -152 25 238 -208 114 -51 192
4650 192 -21 -205 358 53 -193 129 -47 181 -80 46 136 -99 325 -102 182 -59 83 167 -9 324 246
4671 246 -65 -143 -146 279 169 85 122 1 -29 247 -167 132 -97 172 -116 -118 38 -496 110 113 -291 117 -393
4694 -393 397 194 -49 73 -102 107 -151 29 -9 -315 -269 -37 380 515 319 823 -356 -522 -230 -1106
4714 -1106 -684 -774 -254 -342 123 247 -478 -703 -133 -309 687 -8 168 -592 -437 -522 -155 471 -708 -163
4734 -163 974 -17 -77 -465 -1316 -538 -679 -118 -507 388 877 -946 -3 81 -378 996 -667 -156 843
4753H43p16L09n62o32J551n26j2mq9R16j779J364j029j12J617q14n87J00P60q59
4773b61Q8o4j40N55l11m80P41j078J070k90n62J561k508K334m20j058R92l31K58
4792I6k50m58J50M02n0j016J498l72l34M8L58j58r86J4Q14j94M73P5n23J15N51
4813B53j44j0j00N41o11j30J87p56P60K5O8k44Q6J10k6K3J16K7k00k5K0L64l58
4836b4m2l93O03K54n62L97o17P90l04k47M24l72j4j34K02L99l73J60l37m6M84
4857B48m47L15N8m40L28m25N47k00k24J67k10L39j3J3K29m33J47J80k66L06l80
4878a61K31m3j31L81m53K88l37M5K61l63J83J0J4R0j98M28j99j50O4l51P03l8
4900B74l17L24n72M15l10K48J08m85N94j06k76m4n6M93m09J94n2N9L22m44l5l4
$$ plain form
4753 843 127 436 -126 -758 793 267 255 251 162 1078 -701 663 -366 -478 1139 325 -262 -162 598 -261
4773 -261 -173 -237 -377 178 -133 -613 128 -950 120 -170 -732 829 -1679 655 235 -823 169 -162 96
4792 96 -154 -612 -462 -60 -110 -1126 372 0 -334 -286 72 -86 -1072 -1058 -244 -438 35 110 -413 -298 253
4813 253 109 99 -1 540 -71 -201 -14 -770 -10 15 83 -161 -75 35 9 32 148 175 -25 -50 -30 334 -24
4836 -24 -66 -459 144 398 -164 233 -384 406 102 -145 279 -93 -107 -241 -39 360 -13 147 -190 -236 248
4857 248 -199 116 174 -266 62 -363 184 -16 -240 -73 -283 56 43 56 285 -148 -1 179 -87 219 -161
4878 -161 70 27 -104 277 -176 112 -225 -180 81 -282 -99 -89 -75 15 -183 245 46 -104 -40 -391 312 274
4900 274 -43 281 -291 124 -186 62 170 -315 279 173 -103 -147 -203 290 -119 75 23 82 404 -40 -75 -109
4922a09j54M68m96Q2K90k89J62k16L92m23%K41Q1J25k39J59M61p55M81m57P5K38
4944A17m78O06Mm18L40n39M27J65k40J70n23M99l9m7M2l62J87Kk47L62k61N03
4966B70k97k6K61m55L95R8j08L09r08P49l27k23K01j42M94l38k97M06l86Q79p08
4987a53j17L39k40L16k34j73M63k83K38k46P6M6j66M28m59J78K74l50J31m17N16
5008A67L5o61O35m08N17r5p34P17l46K42j63j26P20n89L37j09l22L85m03k1K81
5029E9k06K98j56l7M61l77J0m73K12n4n7N59n10M51j95L0J98k90K87k27j70M79
5051B92m35L45j67R4K17p65P29n08J04K42l23L15j26j19L00n96M84p1j92J44k2
5072e8J34o1r3K46n06N22m08J50K78n50O34j65k38J30k34J52K14l44K68l38K34
$$ plain form
4922 -109 -263 205 -291 -209 81 -208 -46 -262 130 -293 -293 -52 29 154 -85 74 535 -220 261 -196 -121 117
4944 117 -361 245 249 -169 171 -368 59 224 -16 154 -369 130 91 44 86 -276 -89 -87 -334 28 -233 270
4966 270 -27 -53 208 -247 148 246 138 447 -461 288 -39 -262 -61 -203 291 -47 -344 62 -324 555 -153
4987 -153 -270 69 -171 145 -89 -262 201 -82 156 -90 -14 32 -134 294 -165 13 287 -63 68 -349 167
5008 167 202 -459 176 -232 285 190 -544 173 -173 69 -94 -220 500 -89 248 139 -183 202 -201 -222 59
5029 59 -147 151 -5 -42 419 42 52 -421 -209 -263 -320 239 -271 180 -15 15 213 -77 210 -17 -187 292
5051 292 -143 202 35 129 346 -419 310 -198 -94 148 -175 140 14 -105 195 -401 83 12 -180 -36 -58
5072 -58 76 15 -78 168 -338 184 -224 -74 204 -346 288 123 -115 15 -219 -67 147 -197 71 -267 -33
5093c3j53J01L12k27L29k51k24J95k41N84m70p6L34m16O01n60K63J59m44M41n06
5114b82L18K81m38K25m39L03J03l93M08j65J1L40o72N23k04J33K6k40M26k70K15
5135B09l94J22L31l32J19j37K75J9l91K63mk81O41o16L79r5Q6Mn91P30l85R2J00
5158A44k82K95k04M4j78K5K79l18QM26n76M57k59o5L15l24K80l95K15mj86O69
5180C66n17O3L92n56N46l40R3L2l52N76n54R5L15m57N12n73M59L52m66M11m78
5201h1L42j35l27L92l40p0L67l94M75l44L68m47j12K35j00J99L03l31J18k15R9
5222Bj2k70O70n32K31j81m9O64o47K84l14K10J67k79P7l30N20k05k75O08l38J40
5244A41L63o67M37k61k26L66k90K98l40k5N92o76O00k79j40K20m59O56m81j47
$$ plain form
5093 -33 -186 -85 227 0 329 78 -146 49 -192 392 -78 -154 180 -236 365 -195 68 227 -217 224 -282
5114 -282 36 317 -121 104 -335 -32 71 -322 86 -79 -68 272 -400 123 -81 52 78 -162 264 -6 209
5135 209 -185 -63 268 -64 55 -82 193 212 -179 84 80 -201 440 -176 203 108 194 198 -393 337 -48 44 144
5158 144 -138 157 -47 -3 -181 -156 123 -195 -187 239 -337 120 -139 -204 111 -213 67 -328 -113 -117 -303 366
5180 366 -151 -88 304 -252 294 -46 47 79 -273 303 -251 -156 159 -298 214 -359 100 452 -14 397 -81
5201 -81 261 126 -201 191 -149 -219 148 -246 229 -115 253 -194 -306 -71 -171 28 331 0 118 -97 2
5222 2 -10 -280 390 -142 89 -92 -141 523 -124 160 -154 56 223 -56 21 -309 211 6 -269 339 1 141
5244 141 504 -163 274 13 -213 153 -137 161 -179 -204 388 -288 312 33 -107 113 -346 310 -171 -318
5264c18L91n05O58k47M4R8m05K07l16K74P2n9L35k63K27L26p80O94o98K19L16
5285B70l95K92n48L86P0o35P06j05J75l2l26K89jm9J89n29L69j96j74L88l27N02
5307C19o35K99p6k34M29k38J7K50m42O58p53J32K24j10M52n74L49o4j94K69m23
5328c45L53L16m00L97m12qJ28j03K28k95L49q4j90M36p08N78j68j27L29p12O64
5349B26l68j46M57k68L71k23j72L86p04Q75n33p0M92n89L05k04O1K67j46K34k21
5370C0k9L4L9N9m10K82K50n68M54k14p7K50n77N33k59M1M09o48Q06q08M94J91
5392B82m71N18n52M63Q1o09M38j41M6K08o88O01r8r2L49n17L60o54R56k52o63
5413d35Q71o05O45n23N9K59o17M04P7l88M30l29J84m0j08K37k36J31K1l03O17
$$ plain form
5264 -318 73 -432 226 -21 23 121 -284 -77 -393 -119 -47 -106 229 -34 193 519 -261 433 -265 -46 270
5285 270 -125 167 -381 5 75 -560 146 41 216 184 -142 147 146 97 286 -243 126 -70 -244 144 -183 319
5307 319 -316 -17 -93 -327 102 -136 -119 131 -311 347 -406 -274 -50 -160 292 -282 67 3 -191 78 -345
5328 -345 8 324 -76 321 -91 -99 29 -74 154 -141 208 124 -66 370 -338 240 72 -55 274 -438 226
5349 226 -142 -288 169 -99 272 49 -123 263 -441 434 -99 -169 323 -266 39 -165 -104 163 17 251 30
5370 30 1 35 74 133 -277 5 255 -313 141 -73 -150 100 -477 56 -203 -162 247 -401 405 -403 91 282
5392 282 -189 329 -223 240 321 -288 150 9 55 263 -425 176 78 -14 335 -182 178 -476 480 228 -435
5413 -435 436 -169 476 -47 12 271 -346 58 135 -253 177 -152 32 -8 -116 121 -115 16 37 -266 351
5434C51j008J024n60K0M73o26M67m72K70N45q51L60n1PK72p03O58r9l57O38m44
5455h6L12n92L7N05k90L09n53J4N11l27N79m06k42L47n11O64k60Q8R9o45Q79m98
5477f6K23K4m48O11o39L76K1l51O77o81J99O7l63N39n36N88j02o1J56l75J47m0
5499c4j47N10l33L06m83J9O13m97L68l23l59O86n69L40J09l32L89n85M58m38P3
5520b29P95p45L50j03k99M04m44M81l91K56L43n55O16o32j29P08m06M31n30j13
5540a92L53m68N38n86L7N44l38J33J33k24K90n93O63j91l69M04o44O01o16M59
5560f6K8l84R34n50J36M0m25P36o67qK22j0L74n89L20j8l69M87j98J96J19l75
5582f7J71k97L92k62k65O06n96J83L95m92M82n20K29k5j62P30o65M14k79j69N80
$$ plain form
5434 351 -657 367 -193 -173 300 -326 141 -331 -61 484 -367 -7 -58 -51 221 -482 176 77 -280 358 -86
5455 -86 226 -366 -329 176 -114 195 -358 -344 167 -160 419 13 -229 118 -393 271 11 99 198 -447 432 -66
5477 -66 157 181 -267 344 -295 81 102 -249 428 -253 -54 13 -350 189 -347 241 139 78 234 -141 6 -34
5499 -34 -181 329 -4 302 -181 -162 451 -46 322 -1 -360 326 -243 97 206 -126 263 -322 136 -302 -229
5520 -229 566 -179 171 68 -231 173 -271 210 -181 75 418 -137 479 -153 -282 426 20 451 -79 -192
5540 -192 161 -307 231 -355 -318 226 -112 21 154 -70 220 -373 290 99 -270 134 -510 91 -525 -66
5560 -66 -38 -422 512 -38 98 138 -287 449 -218 -226 -4 -14 360 -229 91 73 -296 191 -7 189 308 -67
5582 -67 104 -193 199 -63 -328 278 -318 -135 260 -232 250 -270 -41 -66 -228 502 -163 251 -28 -197 383
5603C83l71l8K0k38L70l13K37Mk67M24l97L17J3l10N11l97J35j10r7K62m31L91
5625I8k11q4P10p65M90k03j63O04o48L57j41j50L12l60M52l95P9K72k35K43k91
5646b9n2K70p60Q24m16Q3K63n50R17q51K97L64n17M12m96k0K95k48M00m01K22
5667Gj03j84P63o50L67l61j47M91l74L55j60m6L13l41J40J69o56O91n58J39L72
5688B27m24L34l17L18m6l00M58l83J52k4k02K52m62K63r9K65m2m23O77j87j06
5709f9L47n95N11J2k16J89k64L14Q3n89M93o63M14p5K60J64n64L09j87J84J19
5730A77m71O52m50j75M44n43N83l32k74M93l95O21m73pK94j82K79m68%N69n73
5751b31K23j85K44J97q68O49m09M54M2m79O96n99L31L64p35N39m79K77J6m97P78
$$ plain form
5603 383 12 -26 -6 -244 126 -187 50 54 -213 211 -186 131 144 -166 345 -52 83 -27 -124 138 -293 98
5625 98 -113 -197 513 -252 238 35 -128 476 -172 185 44 -106 206 -154 298 -97 -18 254 19 262 -29
5646 -29 -81 189 -571 253 -163 -80 183 -367 550 -301 -4 360 -157 255 -241 -261 34 -214 186 -215 7
5667 7 -96 -280 483 -167 200 -161 -308 183 -191 164 4 -42 271 -70 70 239 -417 274 -284 -145 227
5688 227 -197 137 -180 138 92 -208 250 -133 19 -5 -207 45 -417 -154 -253 12 -30 -453 224 37 -69
5709 -69 278 -317 194 206 -10 179 -85 229 312 -277 216 -447 -33 -108 152 316 -248 61 -126 58 177
5730 177 -294 358 -92 -267 177 -366 217 -115 -389 104 -291 330 -143 -150 144 -38 241 -227 -227 342 -231
5751 -231 -8 -193 51 248 -620 29 -380 74 116 -363 333 -266 65 429 -306 233 -246 31 47 -450 328
5772C28n14J11J35o68Q09m58L16mk07M91o32K9K11j30M25k60m1J13k86R47j051
5793c36O64k59m78O67l83J44pk16M46l26M7K02k22M30n64M19j37l28N11l54K67
5814A87j57l6M28p19J87q1L3L00n08L34j21J93K91p41P92l82J10K69q23P75l34
5835cj68O77o78K24j03J86M4n49P18p39M68q8r2M87m84K7Q6o20J039m97j10l2
5857b07K93L20j62m89K75n34J028r39M78N2l04L17M9o06L43j600J992j62j9J72
5877B97o87J022p80J04N09p71K52n04Q3O91o76R84j165J184p24M3L76r24R62l31
5897e5j87K9j29K53k77o8M15p02Q45k44%L79l33O12l03p18N94k53M08q42P65J26
5919C15q57J455j071J42O9j48m79M12k19Q26m58o49P08N42N00j501K55M00K8J54
$$ plain form
5772 328 -186 -75 60 -608 201 -257 59 55 -152 339 -293 -264 -53 -183 242 -18 -59 54 -232 715 -336
5793 -336 328 69 -409 258 -125 19 12 -204 242 -84 -37 165 -57 373 -191 228 91 -237 274 -80 187
5814 187 30 -6 422 -297 -110 -191 -158 142 -366 -32 -153 40 331 -410 382 0 110 379 -444 331 -3
5835 -3 -171 506 -172 52 -51 135 179 -370 348 -391 77 -11 -103 384 -100 -73 13 -607 432 -65 -175 -207
5857 -207 86 406 244 -245 30 -504 524 -415 63 115 -189 128 177 -429 -86 -1686 306 144 125 297
5877 297 -390 632 -148 -44 465 -306 -54 -558 -475 216 -460 524 -641 543 -181 -138 238 -686 276 -55
5897 -55 -242 -213 -342 -89 -366 -434 -19 -721 124 -120 -120 259 -74 538 235 -483 111 -142 266 -576 189 315
5919 315 -542 913 -158 -16 53 -95 -574 -162 -381 445 -13 -662 46 588 1088 -413 -158 242 270 424
5939D24r55J18N50l95M23L13l05M1Q05j038n48J683j621j2k28N65O05l01J089
5958A213j599K73L70MJo1n3P90j539K66J59p59J397p72O31j49O3Q1m41L08o01
5979d18R72n11j09o9K89L07J63j006Q07j274N21O78k16m80K81o58J572p74j59
5998h4mm1N60p29P65j252J104r10N86m63L61J0NK47L99m47o34P29l28Q15m61o03
6020c75O15m6L25l18N6K67p59N26l15K76o42J36R27j072r3N12j7L55n76J86K95
6041B63r10M64j30K69L74j495J742o66N36K75l62J54l64l21L83m18J44l7J78P9
6061A58pk19o48Q31K81k75K13K31k38l91L29m43l3j51J19n18j92J852k100J405
6081B04m65Q12j036M99M0r97J145o06K26J0j58P41l76j16M00r49R96o01N81k38
$$ plain form
5939 424 -531 -413 137 -258 165 478 173 214 1019 -19 -567 1116 -505 -517 -745 -180 425 124 1213
5958 1213 -386 -113 257 261 262 201 148 938 -601 -335 -176 -935 462 -310 321 172 235 316 -125 183 -418
5979 -418 554 43 -66 -135 154 461 624 -382 425 -849 -328 350 134 -346 -65 -723 849 75 -84
5998 -84 -88 -129 431 -298 467 -785 319 -591 -5 -468 -107 -97 -92 155 554 107 -527 202 -126 689 228 -375
6020 -375 240 194 519 201 257 524 -235 291 -24 252 -390 -254 673 -399 -492 20 3 358 -218 -32 263
6041 263 -647 -183 -313 -44 330 -1165 577 -89 447 722 360 514 150 -171 212 -206 -62 -99 79 158
6061 158 151 -68 -716 115 396 121 334 565 327 -64 265 -178 -211 -362 -243 -761 -953 899 -1201 204
6081 204 -261 551 -485 14 54 -943 202 -404 -178 -168 -326 415 39 -77 323 -626 370 -231 350 112
6101A12l26K79m46L70l22J94M40p60O73l72j11K84l60L75M8k93N00p00N68j91
6121c8J2J85m10N11j48P8p0m27N28m84Q8J33m06N44p4R8Q2j25k88J06J63J55k60
6144d7J24k59K09R6j50L3k7K2K09n98K22p9nj41J95N42o49L81Q4j75P9j94M31
6167C03l91j0K01j60K07k62o1M62m45K52J86n36N04m09M53j9k52J09m55N53j49
6188H1j6J16m40K17R2M1O9l45J91N9l56N58k99Rl0l3M18p30Q79m79j71K11k69
6211b27K84j21n46O80k02J69l2L8J51n37O3K98j60J64n7K73j43k5K66m64L98n96
6233c26N29J06l06M34l82l04L38j49M67l79m2o8M6R8j66J02O6m38P84o16L35j3
6255A16j86J41k5l78L83k91L80k70J81K74l58J82o65R37k25j99p8j07K41m8k73
$$ plain form
6101 112 -214 65 -381 -11 -333 -139 301 -459 214 -158 -269 15 -345 30 78 -215 285 -415 153 -38
6121 -38 -26 159 -251 260 112 190 120 -307 221 -263 -175 -42 -448 96 22 120 202 77 -211 -105 58 213 -47
6144 -47 77 -182 27 123 -27 6 -21 1 210 -388 -166 -245 -250 -391 -196 346 -303 78 162 -13 66 -128 303
6167 303 -88 -98 103 -57 150 -112 -173 289 -156 96 282 -254 250 -159 294 275 23 132 -323 230 81
6188 81 65 181 -259 -42 50 91 160 -185 6 65 -291 267 -32 -23 -53 -86 332 -398 481 2 -169 42 -227
6211 -227 57 -64 -610 70 -132 37 5 43 194 -343 -280 18 -142 22 -35 238 95 70 336 -128 270 -326
6233 -326 203 309 3 437 55 -249 89 -60 407 28 -14 -82 -36 62 -104 -2 64 -374 410 -206 129 116
6255 116 -70 71 46 -332 51 -240 140 -130 51 325 -33 149 -516 421 196 -3 -81 -188 53 5 -268
6276b68N82j25K30m33k06N04k94J30j08j08L22o03M63j0j38K91k53P1ok27L34
6297A48k11K31j91M8o5kK29l13J63Q6l25L63j17k18L60n14M27j00j82K05l60N17
6319A79j26Q1jo85K78L40k63N40m84K24K15n61J13l41L55k35L35J86l22K25j4
6340C9K0L30l60o2n6K28q1k54M43o64L22L3k66K68j53j2K87J89k9l86K89R5l31
6363a11K13j47J84j10k17J44L8K7J11q0j07j7L1n3l72O01j90k5R5K09J09m05M1
6386c1L12m57M66n45M97l50R4K36l30K4K05l0j65O7L20k51k5P0k51K43j39j19
6408a59L42m36J26mL8J41l33L01l36K52O6j19K41k6j24J34m34O65j93q5K51j42
6430A66L29m20n5R1k22J76q7l86Q91o15J75l74L21K18k4mk47k46K93L9K07k18
$$ plain form
6276 -268 314 189 419 -14 -220 284 -10 120 12 -96 226 -377 86 76 -62 229 -24 47 41 -186 148
6297 148 -63 168 -23 25 -40 -42 187 -126 37 123 -202 161 44 -174 186 -328 99 -1 -183 22 -338 179
6319 179 53 134 133 -552 -274 66 -197 343 -141 83 298 -263 -150 -491 -136 -371 -36 150 -172 53 39
6340 39 59 389 29 -33 -89 139 58 -196 247 -417 -95 -62 -328 -60 -213 -225 62 251 222 -164 125 220 -111
6363 -111 102 -45 139 29 -188 -44 -6 21 132 52 -55 -72 -41 -94 -466 135 -55 -80 15 224 333 -72 -31
6386 -31 281 -176 290 -255 242 -108 -14 222 -108 -84 121 91 -74 -7 313 62 37 107 -144 99 -40 -159
6408 -159 183 -253 -127 -131 -93 48 -285 16 -320 -68 -2 -121 120 94 -30 104 -330 335 142 57 308 166
6430 166 495 75 20 111 -111 65 -22 -408 483 -132 43 -331 -10 208 184 180 -67 -313 -20 19 226 8
6452HJ56j42R32p80o11L3M91k32l24J124r28J27P0R82r55k99M5O80p86M20L68
6473C79J76M21o83j280Q76M62m02l5p87K21L02O74N38j176p11J239j08m63J060
6492G03L27j075n17R63n5k45l63M66p67j54J260l63l77N78q74M21l56J48P34j226
6512g72L94L39L07k13l74K70J19K06K23r12L19l14O94o4r54Q99m91N00j87l0L86
6533C45n74K17rk92P12p19M12j96M7J16j03L85l64M46j04j62K2k06k74K90N01
6554D90j74j39o67j05Q25o70Q76q27N65n02m3K48L38p82j86J063L04m04k83k63
6574c36L2O71p94P18q94Q74n05KJ97k19K46j21l91M16J98L26j58k20K14n04J36
6595a12m2l02O86j69K59p8j5j57R2Q5m25o28J403o14K97j085L28L80pj76K61l64
$$ plain form
6452 8 164 22 954 174 -437 -404 87 -145 -469 655 -273 -146 -76 906 -49 -348 -303 377 -409 11 379
6473 379 555 976 293 -987 -111 351 -51 -86 -873 -652 -350 324 862 -314 -1025 214 106 -357 703
6492 703 1030 -45 -562 401 346 101 -262 204 -563 -717 543 180 -197 381 -493 -72 -428 -280 454 -772
6512 -772 -378 -39 268 55 -319 -49 70 276 499 -413 -94 -408 286 222 -732 167 -324 176 -11 -41 345
6533 345 -229 -12 -21 -313 399 -320 92 -104 -57 59 -44 341 -23 423 319 157 179 -27 -301 -11 490
6554 490 316 177 -490 -595 230 -440 436 -391 174 -328 -371 -123 215 -567 -753 310 614 210 -73 -336
6574 -336 -304 367 -427 291 -603 271 -234 -232 -35 -254 -8 -129 -520 -104 94 420 262 42 256 -248 -112
6595 -112 -154 -456 230 61 320 242 227 70 162 247 -178 -806 597 -17 280 -805 -477 -97 -104 -280 -19 -383
6617c83o7J047o32p63J296j97q75M74l26K01K98K29j65J65j022M06l1o0N0m94
6637h49L44J14K52q9k6M78M2m06j40M90J05n84L71k29l5J02j9M50j226R00p4q21
6659h50R85l48J1K73J25j15K5M25m64m81N25m7k27L7l8O43q21M70J39l34K41p72
6681e98R60o73K48L76j04l96J64l9J81m16N82m78J8K57j44J11k22K64mk46j8L02
6703A25j80J40j6l64K35L50k96k21P94l18k07j52K62j14L20l75N3J87k48J26k08
6724a07L29j23Q8Q8o22P21n15N07q42L57O07o72L83l22N8N4k42J58M22k39m21
6745c33M78j40m20O55N0l02M64n41Q2l2J43O84j178R13o12k44N45k48j1k32NN51
6767B77l52O7J4QJ75n07Q15o15QJ17k25J20M50J31n41j49N36J70m67o2J52j86
$$ plain form
6617 -383 -450 597 -35 -798 498 301 -574 -100 -426 -225 73 302 137 302 -720 -314 -345 -405 -355 -849
6637 -849 -505 -391 -139 -228 -254 224 266 -140 -280 210 315 -269 102 -127 -162 -60 -79 371 -855 45 -29 -850
6659 -850 135 -213 -202 71 196 81 106 531 67 -414 111 64 -163 -126 -164 479 -342 128 267 -67 174 -598
6681 -598 362 -311 -63 313 209 -187 -23 -62 119 -297 285 -193 -175 82 -62 49 -173 91 87 -159 -177 125
6703 125 -55 85 69 -295 -60 290 -6 -227 567 249 42 -110 152 38 358 -17 36 223 -25 101 -107
6724 -107 222 99 187 275 -347 374 -141 366 -476 -119 488 -184 199 -123 -65 -11 -253 -95 327 88 -333
6745 -333 145 5 -415 240 290 -12 452 -89 -7 -39 104 788 -390 523 -89 -333 212 -36 -47 -279 -274 277
6767 277 -75 -8 6 14 189 -318 497 -118 -110 7 -218 -98 352 483 -58 -207 329 499 32 -30 122 -64
6789f4N5L7K19k92N05j04k51p5m86O4L56o9J95J96l52l5N8L69j043R76m86n13
6811g40M45O31j70j73j40N60n45L14l67M3l52K19K99J64m45K18j21J62M28q66
6831d36O45m78Q31o11M42o64j66M23k10l2K59l86P19j8l26n7J9j05j70L10l75
6852c86J101k49p71L21k21n0M01o46L76K55k04J95m31N47N4o5n23k15O71o17o8
6873e25J018m85J99L21j121O02j7k13j82L22L36q66L42L96j29J70o5J56M49j243
6893e35R73K4m64l89o2M2J45K01j05K34l82L93l37K92L91p17k28k72K47L32P89
6914E72o46Q65j150j68m2M1J416r35L52k96m04L39J43K05n51p2Q99p10L11J06
6934B75o17J003j07q00qJ76M66n85Q17j164K73K85j37k66N53j09J29q99O40J91
$$ plain form
6789 -64 -9 28 247 -45 460 356 105 30 -456 -392 -36 -105 90 286 -66 -101 -43 326 -717 259 -227 -740
6811 -740 -295 336 166 -7 -147 413 -132 182 -185 -142 -494 -275 24 188 -257 -39 -160 2 430 -436
6831 -436 209 -269 562 -49 393 -271 -437 -14 -224 -256 3 -383 336 318 -8 -65 -46 -151 -321 -11 -386
6852 -386 715 466 -305 16 -205 -255 146 -500 -124 131 -73 122 -309 238 292 227 -296 -511 160 -457 -525
6873 -525 493 8 207 528 -593 9 -8 -221 -403 -81 255 -611 -269 127 -2 168 103 259 708 -535
6893 -535 438 462 -2 -391 -453 -411 -266 -65 -170 64 -318 75 -262 30 421 -296 -524 -796 -549 -217 572
6914 572 -74 791 -359 -527 -569 -528 888 -47 305 9 -395 -56 87 292 -259 -331 568 -142 169 275
6934 275 -342 661 554 -246 -254 -78 388 -197 620 -544 -271 14 -123 -389 164 55 184 -715 -75 116
6954A16n38M22L84L3n92O35n39j90K7J044j237O94J22q63O57j009O52j71M30k71
6974a94K83j62n38J173n31l60L9J98N47o47J22Q3n84M79K73L23q96L31L5l25K91
6995f0j01l52P92m57l86M06j02O7J32j43j88Q64o86O65j210Q82K48k73j230J692
7015E60n43m8p27P67n38K87J124n23n50q76J794p68M41q62P58K7n46n2L05J67
7035A97m16k49L93R16p12q42J233M51o62m32J58j45J08k55J81Rp84Q11k15M07
7055A52J49m63n33O37K8P44k03n75R5n7q40Q6P69j14P44j694J599p95M35M2j267
7076a061J241N33l79q51M99k78N13j43n6k54Q36r03O44l20j87J40N21n90j65M18
7096A58K17k49J38j26N2l90K91m51M11j17K58m44J80j4L3J45l08J05K81m88O08
$$ plain form
6954 116 -422 0 384 417 -175 460 -79 -269 -242 802 -435 259 381 -482 175 -834 -182 -353 77 -194
6974 -194 89 -73 -611 562 31 -329 -290 -92 455 -192 -70 13 -571 -92 181 504 -392 -61 -26 -351 -60
6995 -60 -161 -513 279 -178 -564 -158 -260 -193 -61 -204 -392 472 -214 451 -759 123 371 98 -1132 560
7015 560 17 -31 -758 9 -529 -242 882 359 -191 -1067 727 -41 400 -462 296 323 -223 -275 30 197
7035 197 -219 -468 -75 841 129 -713 520 971 309 -123 35 -110 -2 -257 -76 -67 -851 -40 -255 152
7055 152 301 -162 -695 -58 -30 714 511 -64 31 -26 -866 -780 -11 -125 619 -1075 524 -271 164 206 -1061
7076 -1061 180 713 334 -517 -18 -296 217 74 18 -236 600 -303 341 21 -166 -26 495 -95 -260 158
7096 158 375 126 264 138 190 -200 91 -360 51 -66 192 -252 -72 -86 -53 92 -216 -111 170 -318 290
7117B90m71J92k20M21j81Rj56K70k19M10o17K84K56l78K21j91J44o7j79J76J6
7138A0m46L42O5J01J40k87R7j81J98j84m8K13j25N59o22J29j0l88O23l43J24K25
7160A92k04M45l48k88L62j81N1J44M6rk35K22k66oJ24l18M11n16K83K44j48lj93
7183a91J51J88k97L27l76M36m42L26Oq1p7M43l45q6j97K71l47P4L17j99N7q4k60
7206c86M14l34M34n4l21J02J00k09K75J8K2j25K9O4k08J41k57K04K92k63j05K1
7228a46M15n25M60J09k50O4k35L3L42l77N8K08k14K88l18M45l67j63K27N5O7j09
7250F7j54l2P8J88k07J51q5j6L06n26J82O3J08m0o46N99j31J58K30j71l6j50j01
7273a65M99k49j29J27k67pO4K72j7k97M64k98k02M39l98p5K10K10j09j50K56k71
$$ plain form
7117 290 -181 11 -209 212 31 40 -116 154 -65 345 -272 12 268 -110 111 -80 64 -3 -182 -6 10
7138 10 -436 -94 -29 72 212 -75 22 -159 39 -145 -193 20 -105 454 -168 -39 -49 -437 186 -157 -33 192
7160 192 -12 433 85 -203 159 -22 29 173 219 210 -25 197 -69 -75 49 -269 142 -374 -91 153 5 2 -191
7183 -191 -40 148 -149 178 -198 238 -204 122 128 47 -30 413 68 -18 -215 56 -291 -217 100 -99 -42 -126 -386
7206 -386 28 -306 128 74 -247 -145 -45 -254 21 39 61 -64 -35 29 -179 -38 -295 -91 201 -62 -167 -146
7228 -146 269 -256 204 313 63 127 -108 -75 267 -110 -52 156 -58 230 -88 357 -10 -173 54 109 176 67
7250 67 -87 -119 -41 147 -60 91 6 -10 296 -230 -48 15 123 83 -563 36 -95 63 293 122 86 -64 -165
7273 -165 334 85 -44 83 -184 -191 -127 145 128 -169 295 -3 -205 234 -164 -239 -29 181 72 -78 178 -93
7295i3K6J05l9M14o82L74j65k42J68Q8R1R5l86O40m30M1j13N6L20k02K61l66L00
7318B61l79j45L66j99J79O3k66J58k89J38J64J8L3j37j4K56j48K02l94M66p4n32
7340b73K13M3J60P7l72K51j58m1J2o0K23j73qK38l2J1l72J41J07j78J55j02K46
7363A08k03J56L0r9J4mj12L8J09O5p1l45K28J47L5q5n6J15m76N27j73m8L41k70
7387b9L26k91o7M4J4K4pk0J65k57m2j76L70J33j07k10M7q8J91k89J73J16k72K00
7411e2J35K29m35K82j58j06L27l66J75L3p4J50k80K44J42j80j80n2Q1J66k1J89
7433B49k39M1J04k26P2k73M88m06j47M23j37j14L36j99M05n72J00J72m9K51m20
7454a41J59j25M2K2j15J59j03j36L21k27K59K4m82L47k26J35l2L2N0nM9K59m09
$$ plain form
7295 -93 -67 38 -1 413 -269 105 -60 -302 -134 -46 45 140 -246 394 -36 5 -108 -52 268 66 327 -39 261
7318 261 -118 -263 103 -96 83 146 -120 38 -251 -113 51 69 102 -35 -49 207 59 261 -133 333 259 -273
7340 -273 -60 -17 143 220 -152 99 -59 -100 -88 -148 75 -98 -106 132 100 111 -261 -120 -13 -191 -36 -138 108
7363 108 -95 61 91 -8 6 2 -110 -72 37 102 31 -314 -86 61 96 11 -45 70 -406 121 -52 -100 241 -29
7387 -29 297 6 -61 -17 -3 21 14 -6 159 -98 -140 -316 54 187 80 -130 -83 -171 20 -269 -96 20 -252 -52
7411 -52 83 312 -123 159 1 -105 222 -144 31 64 -10 140 -140 104 246 66 -114 -166 -85 81 60 249
7433 249 10 51 155 -71 1 -272 216 -190 -337 86 -51 -165 171 -28 377 -195 -95 77 28 279 -141
7454 -141 18 -107 -65 -43 -158 1 -102 -238 83 -144 115 139 -343 4 -222 -87 -119 -87 -37 -42 7 266 -143
7477a43L31k44M0J75p2M5j41o9m1L69j32j23K05l02j27K17Ln1j7j91M57l28J95
7500E6o1o1N23m79L72m78J52p7j84M35l21L19J79l18J38j34m27N52l58J13J26
7521F7k48K36k61l7JJ39J42n3j74j00M89k19J65N1k40MJ30n3M6j05n8R0j0N7j18
7546e9J30k45L9K82k00J95K2l63Q8J40J71J7l23jQ9J99J2k51L7j32M50m47j78
7569c28M41l6L32l09K8k99K70K8k17lO9l7R4k71J36J60K6p9M5o0K7k92K7Q7J36
7594b5K22m82L22n52M41L28l51K14l24L24j67L5R0j76Q4J27r2jk86L09M1m14N50
7617B17j35q7J59l44M02j14N9k66k4k2J31O3J3j73O8O7R1j81M0O7j63J03K28p3
7641A26p7j88N4J55l73M94l14J73Op1K02l58J05m1O5M99l89l8J67k22M0j24M24
$$ plain form
7477 -143 188 -56 -16 159 87 132 -9 -78 -119 250 118 -5 200 -102 -229 -12 -9 -60 -77 -268 189 -139 56
7500 56 -5 -66 457 -22 350 -128 24 -53 -237 198 -123 196 375 57 195 61 -366 186 -172 -59 67
7521 67 -181 55 -206 -243 -242 -103 39 -14 -188 -288 201 -18 147 198 -42 -38 92 39 85 -20 -78 12 2 59 -59
7546 -59 71 -174 -135 147 -53 142 164 -199 -111 29 200 217 -106 -107 -18 181 193 -58 -21 -153 297 -150 -328
7569 -328 113 77 409 100 128 -171 99 127 -90 -93 -24 -61 33 -238 -102 58 84 5 50 -10 17 -275 -248 -161 -25
7594 -25 197 -285 37 -515 -74 254 -97 117 -207 117 -50 -15 75 -101 -17 110 18 17 -269 40 81 -333 217
7617 217 82 -5 154 -190 212 98 157 -109 -133 -155 -24 39 52 -121 -53 14 105 -76 -36 31 -132 -29 199 126
7641 126 49 -139 -85 70 -303 191 -123 50 56 -15 187 -171 -66 -107 -42 457 68 30 197 -25 15 -109 315
7664C15k36j23K24k04J23r9l0J07l53%N32p0Qk25LJ12j88K14j48Mj86K41n1J83
7688A53J31l58J63O7k20J50P4r8Kk36P6r5L22j74m82N60j51o8L00k25J08k9J3
7711a7J68m99L22J0R7j31N6l5mJ5O6q4J08k6r0K62j25J08j41P8l08oL61l24K07
7736F8j87J34J9j1k18K77j29K92n23K48M2j73N37n02j20K39j86R9Q2M5J46l69
7758a90K91l95N05l00k19M87l02K03k18L09J57n97J94N3j80J14Q5k87M76l15K63
7779A34k57j37j3L70J96M4l35n38L53M94m85K90l65j49N43k51K07j26J28J71j87
7800H7K19j25k68Q0l03K63K84j69j72%L8N3k46K38j67J24j57J15L0O3M3k3r9j31
7824b23L96m40K08Q6m6J20k6k3j78O6J14J05n02L20O2k14L0j2J20l7j5L03l87
$$ plain form
7664 315 79 -44 180 -24 99 0 -30 77 -276 -276 256 186 194 -31 -28 84 -104 110 -38 -34 -220 21 -30 153
7688 153 284 -74 89 156 -64 86 160 62 64 -172 -96 -191 131 -43 -525 35 -116 -184 116 -109 -1 -30 -17
7711 -17 151 -348 -26 -16 81 -50 6 -29 -33 -18 48 -36 72 46 -44 218 93 201 60 138 -170 -176 185 -139 68
7736 68 -119 15 34 23 -195 82 -47 245 -278 -30 12 -161 376 -126 -246 -7 -193 -94 -12 33 179 -190
7758 -190 101 -294 211 -89 -308 179 -123 80 -138 171 328 -269 -75 -22 -202 -88 -3 -290 186 -129 134
7779 134 -123 -260 -273 97 293 337 2 -536 -183 311 -174 116 -249 -398 145 -106 101 -25 103 274 87
7800 87 306 181 -87 -7 -310 -47 237 68 -104 -104 -66 -13 -259 -21 -188 -64 -221 -106 -76 -13 30 7 -92 -223
7824 -223 173 -267 -59 27 -19 101 75 52 -126 -60 54 159 -343 -23 39 -175 -145 -157 -37 -74 -89 214 -173
7847a73M43j41k78K98l01K31K92n61K47n6J25m20L88K12l63N3Q0k4j13J35m0k11
7869a77Q5M02m67K1j0r9P1P8J74k02k48O20j12q5J00O5l69P8j0m26N91k81l1O57
7893D25p78N23r7l03M60m05J52J80l05K20o98O50j18K1J5M63K05m53o22N33k21
7914a53M01j10m19M9n8N72K41o32K52q17M35K73J53r2l08N48l80O49n70K17j269
7935a018N75M63K14m44M61j63j30l39j92M48N4L38j32L49o35P97j573R66N11m32
7955A18m78J251j036r3Q01q19lm12J019q72L89L19r0j175J326K85n01j081J016
7974c6m37l74q3N58P92j174J0O52R18p34m80p06K325p60n04l9L07K53j70l18L13
7995C13l73n41J089j667R94n82Q15q57J282j20n53K7Q54n73j47L62l52n11M25
$$ plain form
7847 -173 270 129 -149 149 -152 79 371 -190 57 1 126 -294 94 306 -57 -4 76 52 -61 74 34 -177
7869 -177 -92 310 -157 -136 -146 -245 -174 -96 78 -124 -372 248 136 51 151 216 -153 -75 -85 -511 80 -201 -232 425
7893 425 -353 170 73 -230 230 -175 -23 157 -148 72 -626 24 -94 -73 -58 405 610 157 -465 68 -153
7914 -153 248 138 -281 -232 -290 282 523 -109 143 -674 -239 34 187 95 -213 335 -45 604 34 251 -1018
7935 -1018 -443 20 234 -210 251 88 -42 -381 -573 -125 -71 267 135 484 -151 646 -927 39 550 118
7955 118 -360 891 -145 -238 563 -256 -259 -671 348 -524 -135 184 94 -1081 245 530 29 -1052 -36
7974 -36 -473 -847 -930 -372 420 -754 -744 -92 826 92 -388 -1094 1231 471 -33 -72 235 488 318 0 313
7995 313 -60 -601 488 -1179 -185 -767 48 -809 473 353 -200 -173 681 108 -39 323 -29 -540 -115
8014a15J99o00R27n84K81J23j56qn5K22p0j06L56o07j16J025j015K18J49k17K2
8035a27K43j23K23k79k16N18j270Q71j40K68L14r08R54J32l82J52j45j87l12M
8055d10j97Q47k4n74J32P30m87J26j32N6k55m27Q36l62M77j046J151j96o4O6M3
8076B90P51j096L98m26M86o29M01l99P40p86l10J300j464J126r73N4N44J0K17
8095B34M13K43n73p32N94q99P86k22o64P22jj66P3L13O77k50j343J061r57P87
8115I6m20Q13m56K44P62k249N67J612j268J215j526q3P75j093R37r03R21j23n19
8134f98P31J89J68p96O51J35l1n7j94j42m17N35j66p99J502j012J46J28j009Q62
8154b74N27J02k11L93j059P91k11J21K4ln56J48O75m24j1k6M3J62r92J198j70
$$ plain form
8014 -115 84 -516 411 -173 108 231 75 67 12 234 164 58 414 -193 -309 716 -299 -81 68 -149 -127
8035 -127 116 -7 216 -63 -279 239 -1031 -160 -300 -32 282 -626 328 460 78 230 85 -102 -414 -410
8055 -410 -607 240 216 -358 -226 504 17 143 11 67 -188 -615 221 -141 336 -710 441 245 181 247 290
8076 290 1041 -55 343 -83 403 -226 175 -224 516 -270 -580 720 -744 382 -591 -537 7 17 234
8095 234 647 890 317 -415 179 -720 66 -156 -820 -98 -99 -265 -192 121 798 548 -795 266 -691 96
8115 96 -324 489 33 277 1039 -1210 -643 969 -299 916 -610 -693 82 -1011 -74 -977 -56 -179 -698
8134 -698 33 222 390 -406 245 380 349 292 98 -44 -461 74 -92 -891 611 -401 -255 -127 -1136 -274
8154 -274 253 355 144 537 -522 269 58 179 203 200 -356 -208 467 43 32 6 49 211 -781 417 247
8175B47j06k29k48M16k08l39O09k80L71R1n38K57m19L93k0k17
$$ plain form
8175 247 141 -88 -336 80 -128 -467 142 -138 233 324 -214 43 -376 17 -3 -220
8191b20
$$ Imaginary data points
##PAGE= N=2
##DATA TABLE= (X++(I..I)), XYDATA
0@%%%%%%%%%%%%%%%qJ6j6J6j6K4l2L2m0M8n5O3p2Q6r7J09j25J44j65J86k09K34
37A23k62K95l30L69m12M57n06N59o17O81p53Q31r14J007j110J222j345J484j640
56h61J814k010K237k501K812l186L641m213M955n956P396r687J4099l8759O1905
71C1686m0248j1122O1050r1924R2522o2202J3154L8465p6458Q7051o4800J7581
83e245L7180p9556R3202p2048K4810K9616p1467Q6444o9944K8657K2074o4660
95d0937Q4551p4385L7615J2720n8807Q3368p6629M0878R389n5319Q0492p6189
107c3253M4968K267m8150P6372p7160N0091n053m2659P5149p9332N4298r129l7998
120b9589P0239p7703N6657j4722l1902O6469p6571N9245k1338k5098O2992p7076
$$ plain form
0 0 0 0 0 0 0 0 0 0 0 0 0 0 0 0 0 -8 8 -8 8 -8 16 -16 16 -24 24 -31 32 -40 46 -51 58 -67 77 -88 98 -111 123
37 123 -139 156 -174 195 -217 240 -266 293 -324 357 -396 435 -479 528 -582 640 -705 779 -861
56 -861 953 -1057 1180 -1321 1491 -1695 1946 -2267 2688 -3268 4128 -5559 8540 -30219 31686
71 31686 -8562 -19684 41366 -50558 41964 -20238 -7084 31381 -45077 41974 -22826 -5245
83 -5245 31935 -47621 45581 -26467 -1657 27959 -43508 42936 -27008 1649 23723 -40937
95 -40937 43614 -30771 6844 19564 -39243 44125 -32504 8374 17763 -37556 42936 -33253
107 -33253 11715 13982 -34168 42204 -34956 15135 10082 -32577 42572 -36760 17538 8409 -29589
120 -29589 40650 -37053 19604 4882 -27020 39449 -37122 22123 785 -24313 38679 -38397
132c8397O2655k6244k0098N9094p4896O3123k9079j4889N3948p3360O5226l3938
144f855r089M8762p0713O6552l7882m739M5633o9133O6988m1383J512L9834o6574
157c7087O7323m4490N914L5183o2486O7048m7578J0145L0527n9260O7746n0676
169a7691J4808K5859n7319O7298n3162J9195K1440n4612O7898n5403K3505J6646
181A8462n1398O7838n8780K8261J2032m8477O6814o0181L1582Q647m4467O4288
193C4621o1607L5925L173m0948O3444o2800L9011j062l6932O1197o2663M1783
205A3142n991l2537N8601o3087M4875r935k7870N5201o3109M7014j3654k4160
217b1510N3377o2290M8822j8018j9739M9535o0591N0548k1962j5040M6214o0412
$$ plain form
132 -38397 24258 -1986 -22084 37010 -37886 25237 -3842 -18731 35217 -38143 27083 -6855
144 -6855 -15944 32818 -37895 28657 -9225 -13964 31669 -37464 29524 -11859 -10347 29487 -37087
157 -37087 30236 -14254 -8340 26843 -35643 31405 -16173 -6028 24499 -34761 32985 -17691
169 -17691 -2883 22976 -34343 32955 -20207 -1012 20428 -34184 33714 -21689 1816 18462
181 18462 -32936 34902 -23878 4383 16415 -32062 34752 -25429 6153 14800 -29667 34621
193 34621 -26986 8939 12112 -28836 34608 -28192 10819 9757 -27175 34022 -28641 13142
205 13142 7151 -25386 33215 -29872 15003 5068 -22802 32399 -30710 16304 2650 -21510
217 -21510 31867 -30423 18399 381 -19358 30177 -30414 20134 -1828 -16868 29346 -31066
229c1066N2617k5314j1732M4032o0175N4621k8978o591M0269n9121N5308l2686
241h816k247L7820n7850N6369l5264Q8L4495n5881N7663l8680N452L0041n3837
254c0647N8276m1519R142K6095n1610N7884m3396J2478K2551m8995N9217m7044
266a7568J7702J7158m5940N7236m6720K0091J3184m2481N5581m8163K3248J0933
278A4261m0889N4945m9549K6344O259l5940N3081n0659K9394L439l3684N1484
290B8486n1457L2330j443l0807N0643n1873L5195m891k7032M8337n3064L8958
302A3382q537k4732M8165n4157L9646j1560k0623M5155n3293M1878j4279j8198
314a7153M3346n3051M3288j7692j3617M0358n1748M4072k2180q699L8114n1795
$$ plain form
229 -31066 21551 -3763 -15495 28537 -31638 22983 -5995 -12586 27683 -31438 23870 -8816
241 -8816 -11063 26757 -31093 25276 -9988 -9900 24595 -31286 26377 -12303 -6851 23190 -30647
254 -30647 27629 -13890 -4748 21347 -30263 27621 -15775 -3297 19254 -29741 29476 -17568
266 -17568 134 17292 -28648 28588 -18132 1959 15143 -27338 28243 -19920 3328 14261
278 14261 -26628 28317 -21232 5112 11371 -24569 28512 -22147 7247 10686 -22998 28486
290 28486 -22971 9359 7916 -22891 27752 -24121 11074 6183 -20849 27488 -25576 13382
302 13382 4845 -19887 28278 -25879 13767 2207 -18416 26739 -26554 15324 1045 -17153
314 -17153 26193 -26858 16430 -1262 -14879 25479 -26269 17803 -4377 -13076 25038 -26757
326b6757M6310k4840o352L4590n0511M7908k7032m051L2390m8195M7092k9004
338h452R39K8314m7023M7770l1662M159K5967m5612M8655l5426Q642K1342m3083
351b5470M9504l7773J1813J9004m2931M9915l8801J4064J5681l9761M8742l9471
363a5484J7412J1727l6542M8248m2100K0089Q416l4353M7812m3659K4021N297
375A0884l2458M7030m4676K4834L066l0792M8546m6993K8846j358k6635M4944
387B5238m6498L0938m172k4016M2394m4959L1323o288k1497M1271m5957L4231
399A2008r857j7440L9144m6291L5002j1782j5181L7034m5240L7047j4824j2504
411a2884L4225m4169L8568j8526q425L2086m3282L8589k0124o829L0292m1892
$$ plain form
326 -26757 19553 -5287 -11639 22951 -27560 20348 -6684 -10735 21655 -26540 20552 -8452
338 -8452 -7513 20801 -26222 21548 -10114 -5955 20012 -25600 23055 -12371 -3729 17613 -25470
351 -25470 24034 -13739 -1926 17078 -25853 24062 -14739 -675 15006 -24755 23987 -15484
363 -15484 1928 13655 -22887 25361 -16739 3350 11766 -22587 25225 -18434 5587 10884
375 10884 -21574 25456 -19220 5614 8680 -22112 26434 -20559 8287 6929 -19706 25238
387 25238 -21260 9678 5506 -18510 23884 -21075 10248 3960 -17537 23734 -22223 12008
399 12008 2151 -15289 23855 -22436 12566 784 -14397 22637 -22603 14444 -380 -12884
411 -12884 21341 -22828 15740 -2786 -11211 20875 -22407 16182 -3942 -10771 19521 -22371
423b2371L9243k1969l131K7553m2805M1280k4472M66K4298m1086M1922k6549K876
436d745K1794l9117M2214k9089M207K0246l7442M2282l0783P922J7475l7390M3533
449B1107l3061J0641J5051l4151M1544l4145J2898J2350l2886M1188l4381J5949
461B104P858k9395L9509l4854J8343N486k6727L8732l6663K0833K800k4658L7365
474B0733l6630K1337J067k3688L7156l7117K3642j590k0449L5476l7364K5202
486G775l324j9286L5795l9705K9439p793j6772L3208l7357K8476q926j3782L1185
499A8933l8530L0935j0902j1365K9766l7808L2469j5284p524K6786l7334L2605
511A2747j5230n645K5577l7038L3271j7788m042K3696l4224L3112j9296j655K2235
$$ plain form
423 -22371 16872 -5097 -8228 19325 -23480 17800 -6672 -6206 18092 -22994 18928 -7621 -4745
436 -4745 17049 -22068 20146 -8943 -4736 15510 -21932 20350 -10433 -2511 14964 -22426 21107
449 21107 -11954 -1313 13738 -20413 21131 -13014 -116 12234 -20652 20536 -13845 2104
461 2104 9962 -19433 20076 -14778 3565 9051 -17676 21056 -15607 5226 8026 -16632 20733
474 20733 -15897 5440 6507 -17181 19975 -17142 6500 4910 -15539 19937 -17427 7775
486 7775 4451 -14835 20960 -18745 10694 2901 -13871 19337 -18020 10456 1530 -12252 18933
499 18933 -19597 11338 436 -10929 18837 -18971 13498 -1786 -9310 17476 -19858 12747
511 12747 -2483 -8128 17449 -19589 13682 -4106 -8148 15548 -18676 14436 -4860 -6515 15720
524A5720l5267L4732k0286L04J9283l3011L4050k2973L421J8194l2927L4624k4600
537h736N933J5870l1180L5617k6685Q580J1572k8962L5069k7965J0009J1522k8264
550a7620L5267k9697J3129Q772k7696L5351l0116J4881N988k4593L4358l2399
562a4375J8887L851k3682L2798l1563J8611K132k1164L2280l1565J9064J79j8449
575a2996L0438l1365K0673l059j6358K9911l2283K2576m870j4093K8432l2459
587a5453K2828n817j2409K7481l2845K5624r751j0715K6884l1301K6117j0993
599c50q966K4666l1200K6887j2319o479K3837l2804K7410j2817n151K1954l0859
612a6191K8549j5560k793K0059k9904K9424j9010M72J8160l0031K9998j8611J286
$$ plain form
524 15720 -19547 15185 -5101 -4797 14486 -18525 15525 -7448 -4027 14167 -18760 15864 -8736
537 -8736 -2803 13067 -18113 17504 -9181 -601 10971 -17991 17078 -10887 -878 10644 -17620
550 -17620 17647 -12050 1079 9851 -17845 17506 -12610 2271 8259 -16334 18024 -14375
562 -14375 4512 8363 -15319 17479 -14084 4527 6659 -14505 17775 -13790 5274 5453 -12996
575 -12996 17442 -13923 6750 3691 -12667 17244 -15039 7537 2667 -11426 17006 -15453
587 -15453 7375 1558 -10851 16630 -16215 9409 -342 -11057 15827 -15474 10643 -350
599 -350 -9316 15350 -15850 11037 -1282 -7761 16076 -16728 10682 -2135 -7286 14668 -16191
612 -16191 12358 -3202 -5995 14064 -15840 13584 -5426 -4954 13206 -16825 13173 -5438 -4152
625d152J7343k7974K8426k0189K260J5310k6932K9456k0776N078J2698k5868K9700
638A4380k1967P251J0289k5360L0560k4360R913Q399k3853K9682k4179J1084N576
651G415k2287K9985k5098J1655N432k0419K7569k5967J5168L004j9711K7231k4946
664a0969J4432J112j7026K6661k6342J6350p84j5412K6039k6410J9266l729j3910
677a0722K5704k8174J9876l429j3489K3717k5415J9137o928r535K2748k6085K0518
690G923q267p988K1046k6618K2238r314p364K1297k6692K3170j1053n672K1096
703A3802k6481K3633j4294l592K0144k7571K3914j3156n40J6299k5836K5810j5155
716c023j203J5671k5463K5816j6619K047J3471k4646K5546j7704K755J3303k4297
$$ plain form
625 -4152 13191 -14783 13643 -6546 -4286 11024 -15908 13548 -7228 -2150 10548 -15320 14380
638 14380 -7587 -336 9953 -15407 15153 -9207 706 9105 -14748 14934 -9245 1839 7415
651 7415 -14872 15113 -9985 1670 7102 -13317 14252 -11715 3453 6457 -13254 13977 -10969
664 -10969 3463 4575 -12451 14210 -12132 4218 3434 -11978 14061 -12349 6917 3188 -10722
677 -10722 14982 -13192 6684 3255 -10234 13483 -11932 7205 277 -9258 13490 -12595 7923
690 7923 -344 -8332 12714 -13904 8334 -980 -8344 12953 -13739 9431 -1622 -7294 13802
703 13802 -12679 10954 -3340 -6932 13212 -14359 9555 -3601 -4141 12158 -13678 12132 -3023
716 -3023 -4226 11445 -14018 11798 -4821 -2774 10697 -13949 11597 -6107 -3352 9951 -14346
729a4346K7070j9013L797J2511k4044K7115j9757N142J0227k2144K6007k0436
741g871P363R109k1972K6201k1732R963O281j9523K4911k1541J0901M716j9113
754a2307K5520k3171J2269L213j7013K4363k2895J3394J045j5801K4502k3837
766a0718J4858l67j4340K3404k3734J5775k681j1821K2503k3713J6106k689j2373
779i790K2452k3908J7817n246r261K0149k3806J8793o157r423K0575k4260J9617
792G552p461p624J9772k4325K0608r572n447J8004k3564K0988j0681l699J6649
805A1200k3613K1370j1376k689J6043k3490K2473j3066q96J4307k2519K2145j3547
818c658K92J2740k1579K2396j5164K223J1528k0537K2026j5714L672J0304k0366
$$ plain form
729 -14346 12724 -6289 -2492 10019 -14025 13090 -6667 -1525 8702 -13442 12565 -7871
741 -7871 -508 8601 -13371 12830 -8902 1061 7342 -12181 12730 -8811 2090 6806 -12307
754 -12307 13213 -9958 2311 5524 -11489 12874 -10021 3373 4418 -11383 13119 -10718
766 -10718 4140 3773 -10567 12837 -10897 4878 2197 -9624 12879 -10834 5272 2583 -9790
779 -9790 12662 -11246 6571 1325 -7936 12213 -11593 7200 1043 -8380 12195 -12065 7552
792 7552 91 -7533 12239 -12086 8522 -1050 -6497 11507 -12057 8931 -1750 -5449 11200
805 11200 -12413 8957 -2419 -5108 10935 -12555 9918 -3148 -4044 10263 -12256 9889 -3658
818 -3658 -3366 9374 -12205 10191 -4973 -2750 8778 -11759 10267 -5447 -1775 8529 -11837
831a1837K2339j6469M807R001j9365K2747j7908O466P199j8451K2855j8287P256
844C53O182j7305K2370j8911Q578L864j5904K2315j9553R973L084j5808K2184
857A1422j9877J1028J929j4216K1660k1253J3040j48j3156K0852k0837J3539o55
870C328j2152K0418k1226J4734k859j0688J9921k1151J4496l261r359J8370k0261
883i690J5802n466p820J7951k1309J6967o418o384J6622k1046J7740p514n285
896e850J6105k0868J7740q642l506J4774k0526J8553r758k484J3997k0356J9056
909H235j0786j215J2726j9795J9684j2513J88J2199j9157J9564j2929J298J0722
922H221j9019K0015j3789K794R329j7950J9984j4818M347P966j7168J9698j5356
$$ plain form
831 -11837 10502 -5967 -1160 7841 -11524 11223 -6685 -219 6980 -11471 11384 -6903 353
844 353 6535 -10770 11600 -7311 1267 5131 -10773 11542 -8011 1962 5046 -10762 11422
857 11422 -8455 2573 4502 -9714 11946 -9307 3733 3585 -9571 11281 -9556 3983 3328
870 3328 -8824 11594 -9632 5102 2243 -8445 11476 -9675 4821 1560 -7799 10571 -9690
883 -9690 6112 646 -7174 10777 -10532 6435 17 -6367 10255 -10791 6949 -565 -5850
896 -5850 10255 -10613 7127 -1515 -5021 9753 -10773 7780 -1978 -4462 9535 -10821 8235
909 8235 -2551 -3766 8960 -10835 8849 -3664 -3476 8723 -10434 9130 -3799 -2501 8221
922 8221 -10798 9217 -4572 -1778 7551 -10399 9585 -5233 -886 7080 -10088 9610 -5746
935e746N229O991j6266J9666j5998O270N472j5393J9556j6348P358M341j4363
948i231J9343j7304Q662L087j3841J9567j7557R317J733j2096J8049j7260J0497
961B966O32j1628J7973j8160J1731l71j0733J7160j7608J1469r57r553J7448j9535
975i166J3506k856q288J6609j8575J3695l770p955J6372j9086J4744m712o266
988e748J4770j8025J4737o342m755J4134j8141J5800o722m066J2915j7938J5582
1001F201p567k711J2017j6772J5751q670j859J1749j7274J6309r434j48R448j5817
1015h777J6413j0157M49R172j6059J6844j0934J312Q532j6089J6885j1953L209
1028a153O887j4698J6636j2955M794N840j4262J7614j4024N068N684j3248J6584
$$ plain form
935 -5746 -517 6474 -9792 9874 -6124 146 5618 -9775 9781 -6567 791 5132 -9231
948 -9231 10112 -7192 1470 4557 -9284 10283 -7274 2043 3776 -8320 9729 -7531 2966
961 2966 3598 -8030 9943 -8217 3514 3143 -7590 9570 -8038 3431 2474 -7079 10369 -9166
975 -9166 4340 1484 -6804 9805 -8770 4925 1155 -6800 9572 -9514 5230 518 -5748
988 -5748 9022 -9003 5734 -608 -5363 8771 -9370 6430 -292 -4358 8557 -9381 6201
1001 6201 -1366 -4077 7940 -8832 6919 -1751 -3610 8139 -9135 7174 -2260 -2408 7040 -8777
1015 -8777 7636 -2521 -2072 7100 -8959 7885 -3049 -1737 6795 -9294 7591 -4362 -1153
1028 -1153 5734 -8964 7672 -5283 -489 5351 -8911 8703 -5321 -253 5431 -7817 8767
1041H767j4549O338L777j2215J6321j4215P416K579j2063J6323j5494Q228K811
1054D024j1917J6531j5299Q711O65r655J5610j5348R434l1r134J5268j5324J0315
1068C850j564q223J3448j4207J0349j546q479J4541j5434R942j378o616J3718
1081H401j5623J1574k913o916J3056j5594J1994m019m045J1684j4968J2169n569
1094g69l848J1338j4695J3576p057k188J0319j2692J1152o750j284R809j4853
1107g942J3646p540r37R610j4360J4611r409l36Q372j3577J4633q527j00P504
1121E648j3284J4537j0473K898O027j3393J5311j1356L118O187j1887J4032j1055
1134c690L470M211j0869J3630j0452L932L923j0756J3398j1591N725K711r877
$$ plain form
1041 8767 -5782 556 4333 -7882 8439 -5776 1640 4219 -7844 8479 -7015 1213 4024
1054 4024 -7893 8638 -6661 2050 2715 -6940 8670 -6678 2756 2725 -6409 8859 -6465 3850
1068 3850 2286 -5937 7511 -6696 3653 2107 -6372 8169 -7265 2677 1299 -5317 8401
1081 8401 -7222 4352 1439 -5477 7579 -8015 3979 -40 -4085 7599 -7369 4800 -769
1094 -769 -4617 6721 -7974 5602 -1455 -3643 6676 -6016 5136 -1614 -2898 6911 -7942
1107 -7942 5704 -1836 -2773 6837 -7523 7088 -2321 -2657 5715 -7862 6771 -1756 -1856 5648
1121 5648 -7636 6901 -3572 -674 5353 -8040 7271 -4085 -967 5220 -6667 7365 -3690
1134 -3690 -220 3991 -6878 6752 -3700 232 4155 -6601 6797 -4794 931 3642 -6235
1147f235J3947j3158O388J765q462J2821j2352O586J666r129J3418j2153O234
1160A336L57p040J2372j2255P712k57q364J3319j2331Q068j500o882J2323j2968
1174f110R034j579n545J0923j2210R224l287m940J0887j2054R815l855m516J0326
1188F113j2955J1162m467k921R655j2348R528n070j340Q413j2112J0839o016j400
1202b919Q116j2211J1952o016j608P832j1456J0544o025o51Q099j2506J2747p486
1216a588n1P204j2232J2000q462J722O502j1480J2380r050J941N798j0717J1880
1230E847r534K937N075j0436J2128r082K909L954j0596J2621q943M365K597r133
1244e291J1505j0627M650K944q112J1256r860M524K516p830J0128r242M979P11
$$ plain form
1147 -6235 7712 -5446 942 2707 -5755 7066 -5286 1300 2966 -6163 7255 -4898 1336
1160 1336 1693 -5347 7025 -5230 2482 2225 -6139 7180 -5151 2917 1417 -5465 6858 -6110
1174 -6110 2924 1345 -4200 6723 -5487 3737 450 -4490 6397 -5657 4158 303 -4213 6113
1188 6113 -6842 4320 -147 -3068 6587 -5761 3767 -1303 -2643 5770 -6342 4497 -1519 -2919
1202 -2919 5197 -7014 4938 -1078 -2686 5146 -6310 4234 -1791 -2442 5657 -6849 5898 -1588
1216 -1588 -1639 5565 -6667 5333 -3129 -1407 5095 -6385 5995 -3055 -1114 4684 -6033 5847
1230 5847 -3687 -750 4325 -6111 6017 -3065 -156 3798 -6798 5823 -3120 1245 3842 -5291
1244 -5291 6214 -4413 237 3181 -4931 6325 -3535 989 3505 -4325 5803 -3439 1540 2251
1258B251p411J0312r382N616K63o387J0044r771O590m49o209J0447j0062O190
1272B042o18n682R533r496P009j836n273R600j0757Q871k425m399R254j1136Q134
1287B821k366m031R229j0825Q481k979l507P810r755Q461m174j743Q243j0739
1301e074Q826m370k371P767j0247R501n233j157O990r794R837n506j300O372r133
1316d892R515o488p4N879r215R152n719M01M952q435R198n797j11N549q992R701
1332D624p575K489L699p824R690q029K028M215p842R928q342K494K899n973R500
1347E981q697K607J406n932R418q772M529J674o950R983q903N252R08o980Q619
1362D143p063M618j07o061Q293p319M898J67n109Q502r261N997Pm555P512q532
$$ plain form
1258 2251 -5160 5152 -4230 1386 1649 -4738 5306 -4465 2125 1676 -4533 5914 -4148 2042
1272 2042 1424 -4258 5275 -4221 2788 952 -4321 5279 -5478 3393 968 -3431 5823 -5313 2821
1287 2821 455 -3576 5653 -5172 3309 330 -3177 4633 -5122 3339 -835 -2578 5665 -5074
1301 -5074 3752 -618 -2989 4778 -5469 4032 -1201 -2358 4632 -5162 4675 -831 -2131 4241 -4892
1316 -4892 4623 -1865 -1939 3940 -5275 3877 -1842 -1441 3511 -4924 4274 -1523 -1634 3915 -5077 4624
1332 4624 -2951 -462 3237 -4587 5103 -2926 -898 3317 -4525 5403 -2939 -445 2454 -3519 5981
1347 5981 -2716 -109 1297 -4635 4783 -3989 540 2214 -4736 5247 -3656 1596 2504 -4476 4143
1362 4143 -2920 1698 1591 -4470 3823 -3496 1402 1569 -3540 4962 -4299 1698 1705 -2850 4662 -3870
1378c870N824j186l768P644q425N955j636l329O891q193N975k283j639O204r109
1393d945P511k667k606O873q600P450l450o83N693r506P047k711j756N964q649
1408e035P580l709p01N924q250Q014m672j418O261r463Q603m405O83N128q730
1423d190Q689o323p34N754p723P847m729M60L838o259O707m835J944K010n979
1438c523P389n643J339L099o834Q327o475K956K527o594O696n892K385K345n731
1453c629P588o396K983J220n619P386o361L528O94m950P666p069L695Q01n019
1468c482P280o768M106n9m079O915p451N059m04l967P008p441M843q74l648O772
1484C810p195N034j243k851N988o974N238j415k932O110p105N671k088k238N643
$$ plain form
1378 -3870 1954 768 -3000 4644 -3781 2174 538 -2791 4100 -4093 1882 -401 -2040 4164 -4945
1393 -4945 2566 -101 -2707 4166 -4434 3016 -434 -1117 4576 -4930 2117 -594 -2350 3614 -5035
1408 -5035 2545 -1164 -1865 4059 -4191 3823 -849 -2267 3994 -5469 3134 -1271 -588 4540 -4190
1423 -4190 4499 -1824 -2558 3196 -4527 3320 -1409 -949 2889 -3370 3337 -1498 446 2456 -3523
1438 -3523 3866 -1777 -438 2661 -4173 4154 -2321 635 3162 -3432 3264 -2628 -243 2102 -3629
1453 -3629 3959 -2437 546 1766 -3853 3533 -2828 700 1394 -3556 4110 -2959 736 1537 -3482
1468 -3482 3798 -2970 1136 1077 -3002 3913 -3538 1521 1117 -2850 4158 -3283 1560 686 -2962 3810
1484 3810 -3385 1649 406 -2445 3543 -3431 1807 392 -2540 3570 -3535 2136 48 -2190 3453
1499C453o745N740k551j827N287o921N823k745j599N252o808O124k926j278M549
1514B828o157N944l189k11L734o466O385m183J88L690n725N874l804m2L638n799
1530c295O488m719Q07L348o181O328l856N95K864n827O582m889J061K767n155
1545c082O180m809J690K147n302O504n209J957J548m599O059n503K439J748m460
1560b692O239n662K408J093m250O024n502L003N14l539N731n925L538o3l650O404
1576C671o264M057j77l597N489o250M421o72k977N421n919M155q06k672N240o062
1592b942M439j182k340M987n580M424k016j484M259n646N004j920j561M248n383
1607b693M748k465j242M364n762N079k537p37L812n601N156k780k98L344n528
$$ plain form
1499 3453 -3292 2448 -103 -1930 3357 -3564 2259 -486 -2085 3167 -3641 2483 -443 -1721 2828
1514 2828 -3329 2615 -574 -785 2949 -3517 2868 -1315 -1127 2563 -3162 2712 -1092 -1134 2504 -3295
1530 -3295 3193 -1526 -719 2629 -3552 2776 -1080 -485 2379 -3448 3134 -1755 -694 2073 -3082
1545 -3082 3098 -1711 -21 2126 -3176 3328 -1881 76 1624 -2975 3084 -2419 20 1768 -2692
1560 -2692 3547 -2115 293 1386 -2864 3160 -2342 661 1175 -2364 3367 -2558 980 917 -2733 3671
1576 3671 -2593 1464 1287 -2310 3179 -3071 1350 678 -2299 3122 -2797 1358 552 -2120 3120 -2942
1592 -2942 1497 315 -2025 2962 -2618 1806 -210 -1694 2565 -3081 1923 3 -1558 2690 -2693
1607 -2693 2055 -410 -1652 2712 -3050 2029 -508 -1245 2567 -3034 2122 -658 -956 2388 -3140
1622c140N090k819j85L018m783N367l388K14K770m865N151l575L15K780m739N384
1638B595l519O50K452n004N160l652J526J596m344N081m110J425J854m385N417
1653B742m784K367J271m058N055m693K573P25l488M955m682K541L93l143N066
1668B840m489J777R59k806M563m915L036n74k714N067n130L260m56k809N462n318
1684b247L028j21k190L760m118L703j743j376L816n772L980j88k394M188n543
1699c217L972n59j382L059m188L382n60k390M919n148L556k443r61M015m977M535
1715A613j955j248L068m181M387k623l08L571n112M652l264P16K556m273M307
1730A906k502M71K378m658M885l696J177J223l784N161m005Q90J815l492M269
$$ plain form
1622 -3140 1950 -869 -1054 1964 -2819 2548 -840 -626 2144 -2721 2430 -1145 -830 1950 -2789 2595
1638 2595 -924 -274 2178 -2826 2334 -1318 208 1804 -2540 2541 -1569 -144 1710 -2675 2742
1653 2742 -2042 325 1596 -2462 2593 -2100 473 1198 -2290 2665 -2017 524 917 -2226 2840
1668 2840 -1649 128 1087 -1719 2844 -2071 965 391 -2323 2744 -2386 874 418 -2391 3071 -2247
1684 -2247 781 660 -1530 2230 -1888 1815 72 -1304 2512 -3260 720 532 -1862 2326 -3217
1699 -3217 755 196 -1186 1873 -2315 1067 507 -1883 3036 -2112 1444 -999 -1960 2055 -2922 1613
1715 1613 -342 -1590 1478 -2703 1684 -939 -1247 2324 -2788 1864 -1400 -684 1872 -2401 1906
1730 1906 -596 -125 2253 -2405 2480 -1216 -39 1184 -2600 2561 -1444 -554 1261 -2231 2038
1745B038l554J420J808l637L996l423J586Q81l363M169l659J953R59l772M792
1760B194l642J915L05l115M985l632J643K81k440L785m399K932p62j616N476o192
1776b282K726O51k673L936m541L538j057k575K990k428J652P20j238J711l844
1791b714M240j967j865M700m784L205r48j159L567m082K845m12k370L764l834
1806a814K975j744r17L504m089L284j725m60L197m193L217j773m90K838l821L268
1822A257j896K08K295l868L633k349L93J933l531L818k648J86K385l876M136l163
1838a087P09J669l439L976k844N43J782l259L851k939Q96J194k967L706k930J417
1854B78P97l208M247l685J830P86l037L785l181J878J93k253L300l244K233j72
$$ plain form
1745 2038 -1516 -96 1712 -1925 2071 -1352 234 1115 -2248 1921 -1738 215 1174 -2598 2194
1760 2194 -1448 467 772 -2343 2642 -990 653 934 -1506 2279 -2120 812 50 -1566 3910 -2282
1776 -2282 444 1095 -1578 2358 -2183 1355 298 -2277 713 -1715 -63 657 -581 1130 -2714
1791 -2714 1526 -441 -2306 2394 -2390 815 -133 -1292 2275 -1807 1038 626 -1744 2020 -1814
1806 -1814 1161 -583 -1500 2004 -2085 1199 -526 -986 2211 -1982 1235 -538 -1028 1810 -2011 1257
1822 1257 -639 -431 1864 -2004 1629 -720 -327 1606 -1925 1893 -755 -569 1816 -2060 2076 -1087
1838 -1087 -378 1291 -2148 1828 -1016 -473 1309 -1950 1901 -1038 -142 1052 -1915 1791 -1139 278
1854 278 1075 -2133 2114 -1571 259 1045 -1992 1793 -1388 490 683 -1570 1730 -1514 719 547
1870E47k346L212l079K235L6k014L444l710K490n93j823L674l602K307j88j871
1886a281L046l394K504o31j679L152l083K308q23j262K914l487K917q90j367K569
1902A513l364K963j308n87K331l240L031j675n04K531l564L352j658k66J725l041
1918a761K814j612J90J831l171L223k069Q8J870l034K970k259RJ977k798L528
1934A796k189j38R20k202L737k533m98J455k755M086l148J92J045j849M788l821
1950a114J116O46k425L062k512Q13R76j463L978l897J418L29k772L643k956J193
1966C5J12j336K624l255K991j407r43K555k764J357M21k577L778k919Q99Q42p94
1983c81K480m881L828j163n18K360m389M340j070k437L385l311L270k068j156
$$ plain form
1870 547 -1799 1413 -1666 569 605 -1409 2035 -1675 815 222 -1601 2073 -1529 778 590 -1281
1886 -1281 1765 -1629 875 244 -1435 1717 -1366 942 119 -1143 1771 -1716 1201 311 -1056 1513
1902 1513 -1851 1112 -196 -783 1548 -1692 1339 -336 -840 1691 -1873 1479 -179 -445 1280 -1761
1918 -1761 1053 -559 -369 1462 -1709 1514 -555 -467 1403 -1631 1339 -920 -911 1066 -1732 1796
1934 1796 -393 -531 389 -1813 1924 -609 -1107 348 -2407 1679 -1469 -1277 -232 -2081 2707 -1114
1950 -1114 2 648 -1777 1285 -1227 -414 562 -901 3077 -820 598 927 -1845 1798 -1158 35
1966 35 147 -1189 1435 -1820 1171 -236 -1179 1376 -1388 -31 390 -2187 1591 -1328 -429 413 -381
1983 -381 2099 -2782 1046 -117 -635 1725 -2664 1676 606 -1831 1554 -1757 1513 -555 -1711
1998a711L330k763K004j718l41K689l549M533k906L52K145l745L541k179j56K226
2014A752m219M155j839j162K213l264L652k421J346J509l214L267k696Q77N07
2029D63j954L087j067j287J408j733K805k740O68J218k541M186k362N04R5k022
2045a272K406j852K31J375k458L579k722M33J371j824K402k482Q20J76j071J894
2061A006k525K033M25j879K021k957K048Q14k040J718k178J689N1q10K304l247
2077a527K250p93m11J682j875J377j95j334K271k481J374Q9j829K259j616R73
2093B14O1r05J765k195J693q93n57J566j715K057j065Q5M05k084K205n42l48R22
2111F69q22Q26j815k14K362j647K109j760o7K500l170J332r64R45R47k101K182
$$ plain form
1998 -1711 1619 -1144 860 -858 -1199 1490 -2059 2474 -432 -80 2065 -1680 1861 -318 -474 1752
2014 1752 -2467 1688 -151 -1313 900 -2364 1288 -1133 213 1722 -1492 1775 -921 -44 463
2029 463 -1491 1596 529 -758 650 -1083 1722 -1018 -350 868 -1673 2513 151 655 750 -1272
2045 -1272 1134 -718 -487 888 -1570 2009 -713 -280 1091 -733 1669 -813 7 183 -888 1006
2061 1006 -1519 514 939 -940 1081 -1876 172 986 -1054 664 -1514 175 226 -584 1720 -1527
2077 -1527 723 -70 -481 1201 -674 703 508 -826 1445 -1036 338 427 -1402 857 -759 214
2093 214 275 -630 1135 -1060 633 -260 -817 749 -966 1091 26 111 516 -1568 637 95 -253 669
2111 669 -153 673 -1142 -1356 1006 -641 1468 -292 -359 2141 -1029 303 -661 284 1231 -870 1312
2128A312j926N86J018k642K456k568K474p1k114K544p29l47J77j083K584j981
2144c10J422N52k416K569k836J817N74j666J448k554J400J548l013K721k250J883
2160H89P3k581K017j418J128J477k272M35n48m38J205j332J327n90R28j152O57
2177a95J549l063K287Q42k464Q31j135J762k34r91J319j676K007j934M67J674
2193A046k398K549j253m40J414k005J521r20k62K250k078J601j628O40N32j516
2209i47K188j438J88J19j230K234k015J212Q46k304K465k228Q10L45q92J317j297
2226f27R67O65j774J458j601J481j12j201J025p12P08k49p53J746j603Q76k33
2243F1o76J681k022J344m37q11J789j859R30P3o51J507j366R22k41j168K044k681
$$ plain form
2128 1312 -614 -28 990 -1652 804 -1764 710 639 -1475 1069 340 -7 170 -913 1671 -310
2144 -310 1112 1664 -752 1817 -1019 798 1372 -294 1154 -1400 0 1548 -1465 1256 -994 889
2160 889 962 -1619 398 -1020 108 1585 -687 -252 -800 -1238 -33 -1365 -38 -628 300 -852 -195
2177 -195 1354 -1709 578 1420 -1044 -213 -1348 414 180 -811 508 -1168 839 -1095 -628 1046
2193 1046 -1352 1197 -56 -496 918 -1087 434 -486 -748 1502 -576 1025 -603 37 569 -947
2209 -947 1241 -197 -9 110 -1120 1114 -901 311 1157 -1147 1318 -910 -100 245 -647 670 -627
2226 -627 340 1005 -769 689 -912 569 457 -744 281 -431 277 28 -725 1021 -582 294 61
2243 61 -615 1066 -956 388 -49 -860 929 -930 0 73 -578 929 -437 485 244 -924 1120 -1561
2261a561J659n26M02J607j926L14K83p71O25k89L85l65p45J638j230J301k8l01
2279D72R3j467K044q49j193J719j948J419n79J47J280j884J216q84l05J177j161
2296g03J092l07p5L44j616K096j741P85N42j583J744r54K15L83r62R49m89P31
2314D51k8j199J032p11K91J22o51J460j385N94J033j522J241j695J008Oq25J441
2332F63j468J158m34q15J346j175P44N6k20J018j324Q72r3q34J043j228J058n25
2350a58n0R27j803J529k94o87O59p22R13l68n92J342j329R04j54k90J082j973
2368a064J723q22m50P00j072J629j075M07K12j075R82k92K31Q62j636J470o94
2385C6J83m79l88J205r43P7M95j219J137m10JM76j426J906j494N87O39q24J104
$$ plain form
2261 -1561 98 -428 -26 1581 -345 -31 252 -519 106 -183 202 -163 -908 730 -500 801 773 472
2279 472 565 -902 1142 293 -900 819 -1129 290 -289 -142 1138 -746 470 -414 -719 458 -703
2296 -703 389 82 7 351 -1265 831 -910 -125 417 -1166 578 -376 -161 222 -740 209 -280 451
2314 451 423 -776 256 -455 -164 -42 -693 767 -618 -24 1009 -513 728 -967 41 47 -778 663
2332 663 -805 353 -81 -896 450 -725 19 75 -145 873 -451 421 328 -506 537 -691 367 -158
2350 -158 -208 719 -1084 445 151 -536 123 -599 314 -54 -646 696 -633 271 117 -173 909 -1064
2368 -1064 659 -163 -613 87 -985 644 -431 -24 188 -887 95 -197 34 896 -740 730 36
2385 36 219 -260 -648 557 -386 -309 186 -1033 104 -306 -305 171 -1255 651 -843 -256 383 -441 663
2404F63j087J9J151j042J145j568L52K46k38O44j382J293j92m16J04o80J183J20
2422C15r24J240j222J165l82m57O58j036J501l43j051J018j021Q25j74L20j34
2439B98q10J522j019k24L45q04J000j32R0l99o85J322p27J07N43j162J195l88
2457G2k59O94j167Q25j073R63N90j037J291j583R02m96p58J859j607P52O54j446
2475h24J303k34m40K78l44J553j871L60K7o8K67m00J54L06p33J579j326M83O40
2494G10q67J20j137Q05M18k52J607j755N61j26o92O69q95O92l04n68J054j685
2512a645O94R80p16L62M01P86r84N11j23p58J11k99l39J769j102k8j68N06l95
2531d37m20J524r16n78J746j404J810j375J01N89j024O29j037Q72K99o00N75m92
$$ plain form
2404 663 -424 -405 746 -296 849 -719 -367 -121 -359 285 -1097 196 4 -412 -308 -988 195 315
2422 315 -609 631 -591 574 192 -265 393 -643 858 515 -536 482 -539 286 112 432 298
2439 298 -512 1010 -9 -233 112 -692 308 176 266 -133 -818 504 -223 -116 427 -735 460 72
2457 72 -187 507 -660 165 -908 55 645 -392 899 -684 218 -278 -1036 823 -784 -32 622 -824
2475 -824 479 245 -195 83 -261 1292 -579 -219 -192 -260 7 -393 -239 67 -666 913 -413 70 710
2494 710 -157 -37 -1174 -369 49 -203 1404 -351 210 84 -608 61 -834 -142 -446 -1014 40 -1645
2512 -1645 -951 29 -687 -325 76 862 -122 389 266 -492 -381 -680 -1019 750 -352 -380 -548 -42 -437
2531 -437 -857 667 -249 -827 919 -485 1325 -50 51 640 -384 245 -792 80 379 -221 354 -138
2549a38J86M01j081J367j254N80J64o60R14j103O17J44k79N77n58K90j13m71J119
2568G02j071K61M33m88Q62r73L81n6k98Q16j132P32m1k52P96r95L81j93j70O83
2588C78o09M50k42j32O64r18P15j85l88O87r54P46j11r2N76r47Q83n18j94M74
2608B83o34Q20m50m5O52j234J011o10o3O65q41P34o38M73N5o19R98o95N0M02p91
2629d77Q59o86L07M7m14P64l96Q0R0n37Q36p42K61N44p15O18r15Q45j07l36M09
2650C35p16M22j74k77Q72o33L82R5n41O49q77N77j13k32L52n96R56n38m37R20
2670D26j051R60Q7p38Q32j424J062J44k10M80j269M36N26p33O69p43J367j074
2688b53q20J292k50q1N87p19O9o69L00K45R26k76p25L44p9k28J617j841J129o13
$$ plain form
2549 -138 48 449 -632 735 -519 61 225 -435 479 -624 -7 137 -142 435 -123 167 54 -417 702
2568 702 -369 -108 325 -163 699 -274 107 51 -247 569 -563 169 128 -124 672 -323 58 -135 -305 378
2588 378 -231 219 -23 -155 509 -409 306 121 -267 420 -534 212 101 9 585 -362 521 3 -191 283
2608 283 -351 469 19 -26 626 -608 403 -207 -270 395 -446 288 -350 123 178 -441 557 -138 -88 314 -477
2629 -477 382 -304 3 50 -364 400 4 84 174 -363 473 -269 -8 536 -179 439 -476 369 262 -74 335
2650 335 -381 41 -133 -410 462 -171 211 306 -235 414 -463 114 1 -231 121 -475 481 -57 -494 426
2670 426 -625 335 422 -316 516 -908 154 298 88 568 -701 -265 261 -472 197 -546 821 -253
2688 -253 -1073 219 -31 -112 475 -244 -175 -844 -544 -299 627 351 -374 -30 -109 -337 1280 -561 568 -45
2708d5k0P93p15J21l40M0N25m90M14o15O8Q55r75J280j062L66o51Q39o9m76l03
2729d60J251k03m9j160J87M59p03Q79j66M05j92q15J579j430Q94k20l90L30p12
2748e16J224o12j60N76m51n29J95R54l10j013J699j495N33N20r34M6M48q15P26
2767H6r83Q93m7n61Q59m87O18k47k13P04r13r4J15O4P64j059O79l62j41J239j063
2788a49R81j132J69R5q77J468m72m98K40M57n5k04k66N03m21P00n32O01n06m94
2808c92P98m44n2L74p08R11p11J97k01j84L15o5L61j60p06J397j033J93R71j092
2828b31J005r53M73l32J28J282j638J067n05r27J220j739R43O18j100J107j177
2845g59Q92L10j422J799j177K69j31l7Q65j322Q48j53m64L05P74j90n61J62R2
$$ plain form
2708 -45 -65 728 13 134 -206 -166 359 -131 283 -332 -264 591 -384 896 -166 200 -451 388 319 -157 -460
2729 -460 791 588 539 -621 -434 25 -678 201 35 440 248 -567 1012 -418 476 256 -134 196 -516
2748 -516 708 96 -64 512 61 -468 -273 681 371 -642 1057 -438 95 615 -319 -273 175 -640 86
2767 86 -897 -4 -51 -612 247 -240 378 131 -82 622 -291 -385 -270 -206 558 -501 178 -184 -325 914 -149
2788 -149 832 -300 -131 -36 -913 555 83 -415 -175 282 227 23 -243 260 -161 539 7 608 102 -392
2808 -392 406 -38 -90 284 -424 487 -224 -27 -228 -412 -97 -162 199 39 -667 730 -303 -110 861 -231
2828 -231 774 -179 294 -38 90 1372 -266 801 296 -631 589 -1150 -207 411 -689 418 -759
2845 -759 133 443 -979 820 -357 -88 -219 -256 609 -713 135 -18 -482 -177 597 407 -154 8 100
2864A00o59M25j93l05J163q46j66J19n12K048j588R67o22l02J243j753R90n15
2882d06L22O61r1k75m50J9N70k24J68k32l45k99N69L71k5M02k78r16J452q91n77
2903d75Q29p00R41j250N01M50q43R88o58j58o4r7R05j000O75M44r25l21N67N69
2923C78o82L54j33k9J0n58L93O58q92Q90p32k21J060j036O64o49N7O69q69P37
2943F9o56n0M37Q54k78m69o69Q59n00N92L24j075J319j277J258l53l17M03r61
2962d90M95l98q1Q39j099J024n87k39J447j897N74M46l38J221q65M44r10P13N4
2981C53j079J162l66r5R99j206J26L35l13l4K17M06m26O5M49j011J492j670P78
3000A82J99o25O37j363J184r9n71K9K9P77J10o73M10kk69k65M11O15j442N42L72
$$ plain form
2864 100 -559 -134 -327 -632 531 -315 -481 -362 -874 1174 -414 553 -69 -371 872 -881 109 -406
2882 -406 -84 577 486 211 -239 -220 350 126 294 62 -283 -582 -13 358 333 735 457 -459 993 102 -475
2903 -475 354 -346 595 -655 -154 296 -547 441 -217 -375 -439 -536 369 -631 44 488 -437 -758 -191 378
2923 378 -304 50 -83 -112 -102 -660 -267 391 -501 389 -343 -564 496 -540 124 -525 -468 201 -668 69
2943 69 -587 -637 -200 654 376 -93 -762 97 -403 189 513 -562 757 -520 738 385 68 471 -490
2962 -490 5 -393 -474 365 -734 290 -297 -536 911 -986 -412 34 -304 917 52 496 -414 299 353
2981 353 -726 436 70 -25 974 -232 -106 229 -84 -118 99 505 79 144 593 -418 1074 -596 182
3000 182 381 -244 393 -970 214 115 -456 -427 -398 379 489 -184 226 224 -45 -310 101 716 -726 -184 188
3021A88l99K28n85Q10L03o41J6j55N93k75k60P88r56O56p60m18J567p23N91j041
3041d73O2O42nJ49o87K59Q32j130P27j025P73J67m24K12m0k56M8K52l85L51q53
3062h04J708r40J70k06n39K070j184P3p87k32O91r43M79R6J52L57q5k40o31J88
3082f07J448j748J329q43K80R27p76J49l27l4O43j306K251q08j427N55m87K349
3100A568j671P92j059N31L49r75O30n27j97M66r08J749q30L23O46o28n09J109
3118H59j109L37o62N48N52j046P73j220J281l25j84J65k73K3N95n86Q93r26M49
3137A44K7p98J201o28Q6J63l00N31n38K40r5N54n50l68N09o37O1O02n96P81l31
3158E8o53R72m93M74p86L31N39j079M00k15l01J297r13N83r81M07O42j090P69
$$ plain form
3021 188 -211 17 -568 242 545 -96 -80 -235 358 83 -177 611 -345 311 -449 -867 700 -23 568 -473
3041 -473 -411 231 226 375 -312 -53 779 -351 376 -649 124 291 -133 79 39 -217 -169 83 -302 49 -804
3062 -804 904 -36 134 -72 -611 1459 275 348 -439 -671 20 -923 -444 -348 -196 161 76 -164 -795 -607
3082 -607 841 -907 422 -421 -141 786 10 159 -168 -202 441 -865 1386 578 -849 -294 -781 1568
3100 1568 -103 689 -370 161 510 -465 165 -362 -559 -93 -1001 748 -82 241 887 259 -250 859
3118 859 -250 87 -575 -27 525 -521 252 -968 313 -12 -196 -31 -304 -281 314 -272 621 -305 144
3137 144 171 -627 574 -54 32 195 -105 426 -112 128 33 587 37 -331 178 -459 -398 204 -392 389 58
3158 58 -595 377 -116 358 -428 -97 442 -637 -237 -452 -753 544 -369 214 -767 -360 282 -808 -39
3177c9j46k84K40k7M74l98l68J128q70R57k18p34L50p20M45J79K33J07r17M16
3197a92K5q9O30r52P46m61P85p40p77J597r74N58M35p07N93n56l95J044j261J214
3217E23q45J77l37L39K47n40M08L54k97N12n91J99k41o47K007j839O29J63n63
3236c42J20p6M07J42r60M26m93J260m03r9k75k60J035q65M57M84j204P62l13k01
3256c98j0n71J559r86N27p98M00P9L91k37J631j835Q11J30n35p51K73J1N47O3
3276C01l22l5J40k11o11O00n04J120n38L76m8n53L74l33N60l56j8M53o09K10K88
3297B84q36P76n13M27k17k08L46m70K15M33l59N42n60N20k96j46L29m83L16j84
3317h4p4P09r32O15p8m20P41p46M24o1l57N29n61L45K40o56O26p12N13K2l70P07
$$ plain form
3177 -39 -185 -469 -229 -256 218 -180 -548 580 -290 667 449 -285 65 -655 -210 -31 202 309 -608 -192
3197 -192 -167 -256 374 -578 168 -293 492 -248 -1025 572 -402 156 591 -116 477 -79 -474 570 -691 523
3217 523 -322 -145 -482 -143 104 -436 -28 326 29 541 -50 149 -92 -739 1268 -571 58 221 -342
3236 -342 -222 -298 109 251 -709 -283 -776 484 81 -18 -293 -553 482 -383 74 558 -646 116 -197 -398
3256 -398 -408 -979 580 -406 121 -677 -277 -198 193 -44 1587 -248 563 693 158 -593 -320 -309 238 301
3276 301 -21 -56 84 -127 -738 -138 -642 478 -60 316 268 -285 89 -244 316 -40 -58 395 -214 -4 284
3297 284 -552 224 -289 138 -79 -287 59 -411 -196 237 -122 420 -140 380 84 -62 267 -216 100 -84
3317 -84 -158 551 -381 234 156 -264 477 -269 155 94 -263 266 -295 50 290 -366 260 -452 61 83 -287 420
3339D20j016Q89l04m25P99p34O45j88m20O94o33P12j97l99L36p03R22l95k70M31
3359A64k42M37n29mN50q21P14k91m6J42m03O46m38J6K55m36M41p9j76O18j089
3380e71Q67k65j91L52m60K77o9J9N29q19M79j06J37K6o24N78l23L37J29p78J045
3401E69n47R4m8o42Q89j003O39k47Q4O83p79M52j88m55M79j11J51P2m15M79l74
3422b18N01m69m25Q50o59L68J64l05P68p81M12o1n58O90n20K50q8j92R40j139
3442d72P28k08k30N58o43L97j41k87M98l99P96r79K51M61o60M05k95j50P16o09
3462b63N99l34m57M67n12J032q68L78L96p38L77l43N2L59p95J044o81J41N65p51
3482c32O99k92L2L70p77L73K31l47L76n63M90l57k2M03j079J225o20J96L24p91
$$ plain form
3339 420 -596 293 -11 -436 363 -371 274 86 -334 360 -273 439 242 -157 179 -524 398 3 -267 164
3359 164 -78 359 -170 -174 376 -445 269 -22 -68 74 -329 317 -121 -105 150 -286 155 76 -100 518 -571
3380 -571 296 31 -160 192 -268 9 -60 -41 488 -331 148 42 179 205 -419 159 -164 173 302 -476 569
3401 569 22 116 68 -574 315 -688 -49 -296 -212 471 -308 144 -44 -499 -20 -131 20 92 -323 156 -218
3422 -218 283 -186 -611 239 -420 -52 112 -193 575 -206 206 145 -413 277 -243 7 -81 -273 667 -472
3442 -472 256 48 -182 376 -267 130 -11 -298 200 -199 597 -382 -131 330 -330 75 -220 -370 346 -263
3462 -263 336 2 -455 12 -500 532 -336 42 438 -300 77 -266 -214 145 -650 394 -287 -146 419 -332
3482 -332 367 75 107 477 -300 73 304 -43 333 -230 260 -97 -119 284 -795 430 -190 6 330 -461
3502d61P35l81N5L00n39J067j145M74J9k47N17l84K90k26m14O53o97L61K56k04
3522B9K89n12L58q3k58P36r48O18L2m80M38l26K68J8n39Q78q61L75J40n96P74
3543C50q87N77Rk11N85p96O68k19qM60j077P91j63J4K84n77N85o41o8N30o24O58
3565B40j42m0J05p27N89k60n4L96o14Q78m18k30M50p68Q78m91L51J4m37N10l29
3586i9J68J29o42Q04n31L75J8o80P45l73L4K00l72O77n23Q2J55l64P18p37Q6J69
3608C9l71P67o42L87j85m33R46n65J80l5l72R08n90o5l0j28M51n25M82j74l00
3629b55M22m62K05L35p49R21p54M55J23o04N57p69Q31k12o2K63l57M24j74o16
3649d78R80q02L19K54m55L40n62P33k47p6M4l05M45l18k55O89q25R97n24j22K05
$$ plain form
3502 -461 274 -107 -52 248 -291 776 -369 105 124 -123 394 10 300 74 -340 313 -384 -23 233 29
3522 29 318 -194 164 81 -177 559 -389 229 261 -219 219 -107 161 179 -360 518 -343 32 172 -424 350
3543 350 -537 40 49 -162 423 -373 295 76 68 528 -549 242 79 93 377 -200 385 -256 -324 206 -418 240
3565 240 98 58 163 -564 25 -235 -289 107 -507 371 -47 -277 173 -595 283 -208 143 157 -280 230 -99
3586 -99 69 198 -444 360 -171 204 222 -458 287 -86 -52 148 -224 453 -70 12 167 -197 521 -216 -130 39
3608 39 -332 435 -207 180 -5 -438 508 -57 123 88 -284 624 34 -31 -61 -189 262 -263 219 45 -255
3629 -255 167 -295 -90 245 -504 417 -337 118 241 -363 194 -575 256 44 -18 245 -112 312 138 -478
3649 -478 502 -300 19 273 -182 158 -404 329 82 6 50 -255 190 -128 -383 306 -519 478 -46 -168 37
3670C7k42L28k26JM76q12P15k70k19M61o39N55k47K69p5m82P08m54j54N35n52
3691b87P63p48J92K61n45P43n44J39O6o16J006o82L20o6m32Q61o53K69J09l53
3711a97M59o82O31j64o00R96o88L67P6l88P38j020N70J63n80O59o30N15P2p73
3731d76P60l93K54M2n72P08o75P41o37p6N12n37L69p8j43Q19o89O71p92J0L09
3752A27j97K96j57k57N65p15L05k99R4M73o32M32o7k58K02l19N21j61J38P4o55
3773d90P96m06L09on89M59k60J51O70j127O93l72K12J64m21K70l12K72K95n25
3793b17L63m12J73K07n01O19l76J02K14o25N56l71L18L26o82L58k61K11J61m74
3813c11P05p39M28N4j77M48n94J49K07n73O15n17K92j77k60Q25p27N63m2l91K79
$$ plain form
3670 37 -205 123 -103 -102 374 -438 277 7 -212 249 -390 165 -82 187 112 -370 338 -116 -270 265 -287
3691 -287 476 -272 -80 181 -364 379 -165 -26 40 -576 430 -252 68 2 -430 431 -222 47 156 -197
3711 -197 262 -420 211 47 -553 443 -245 122 198 -190 548 -472 98 261 -319 340 -290 225 297 -476
3731 -476 284 -109 145 187 -385 323 -352 389 -248 -324 188 -349 20 -58 -201 618 -71 600 -192 -182 127
3752 127 -70 226 69 -188 377 -338 -33 -332 -238 235 -397 35 -32 -290 -88 -407 114 -47 91 165 -490
3773 -490 306 -100 209 203 -386 73 -187 -36 634 -493 200 -172 40 204 -217 53 -259 13 308 -217
3793 -217 146 -266 -93 114 -387 232 -144 -42 172 -453 103 -268 50 376 -306 52 -209 2 163 -311
3813 -311 394 -345 83 137 -40 408 -186 -37 170 -403 212 -305 -13 -190 -450 375 -352 211 169 -222 57
3834E7l82L24o0k37M14l12M95l59k32M29m92N22j46j46L13l73K60K82m96O43q73
3855c69P63m04j4N63o30J18q4J2K64n89L79j63%K92m14O35l67j32L59q02Q58j75
3877A00k29M71m33M04m49Q1L33m32N30m57j27L84o28Q04m99L24O7o82O38j85j97
3898a82K03l98O86o41N60j44m45N45o50N60j16j33L11j30J2m46J63P35o07M45
3918C28j92l14L59k39J71j47l00N55l82K70j37l09N83n26N49k52Q5M37p63M42
3938B18m52L34J19n04K66J56l00M11n27N75l15K5L54n90N53l91l95N92p41O84
3958G2j25l18O64m54M64l48m3L75o28N88j92l00N49l59K58m28K24K08m62P55p79
3979b79K0M98m13M20o50M51K41m94L62k62J57L22m75Q8r9J64K74n79P02p69J03
$$ plain form
3834 57 -325 -1 -61 -298 116 -196 299 -60 -292 137 -355 167 21 -125 188 -185 75 357 -139 504 -369
3855 -369 394 -10 -24 539 -91 27 -57 -45 219 -370 9 -154 -154 138 -276 359 -8 -140 219 -583 275 100
3877 100 -129 342 -91 313 -136 -55 278 -154 376 -81 -208 176 -452 352 -147 177 244 -438 200 15 -182
3898 -182 21 -377 309 -332 228 84 -361 184 -466 94 -22 -155 156 26 38 -408 -245 490 -117 328
3918 328 136 -178 181 -58 113 -34 -334 221 -161 109 -28 -337 246 -280 269 17 102 539 -224 218
3938 218 -234 100 219 -285 -19 137 -163 248 -279 296 -19 6 360 -230 323 -68 -463 129 -612 72
3958 72 -53 -371 293 -161 303 -45 -88 287 -341 247 55 -245 304 -55 203 -225 -1 207 -255 500 -279
3979 -279 -259 239 -174 246 -404 47 288 -206 156 -106 51 373 -102 -14 -113 51 325 -254 448 -321 -218
4000b18J94r7M20n54PL82k86N29l50l4J56l55P00j009K04N69l85M31m50L00k13
4021e9l06N66m35L55P9n25O81l98Q9k04j20J87p2J19R7j71R06j175O02j90j3O26
4043F39r91O48O1m98O83o04K31n00O92n54l01J55J032j403R47q33Q62n61R8Q85
4063F88j860J481m05L19m7j409J208l19n19J398p77K54K20m63P53j206K27M51
4081fN21J72r70r4P15m04M40p87L1j2J35O43j123Q57k67m44J2Q84l38q2k45n00
4103h62Q88N42r54l89K60Q96l06r41M97j60R2K10K13n40J329k157J638k6m1m13
4123b24j247J602N10k42p12K9R8L34l05M62q80J051k06M6m42pj2m49J064j032
4143e62Q92m63J35J51j03j87Q06j280N46L47q47O4P10l17m33L45N0O8K60o38M5
$$ plain form
4000 -218 -24 -121 299 -255 -248 134 -152 377 27 -7 149 -206 494 -515 -311 258 -127 304 -146 154 -59
4021 -59 -365 201 -234 121 200 -325 356 -42 47 -157 -277 -90 -162 -43 54 -117 789 -386 216 26 13 639
4043 639 -352 296 357 -141 542 -62 169 -331 361 -193 -494 -339 693 -710 237 -596 266 -295 -197 688
4063 688 -1172 309 -96 223 176 -1233 -25 -344 -863 535 -242 12 232 -231 522 -684 -457 -6
4081 -6 515 687 -283 -377 338 -66 374 -413 -382 -394 -259 384 -739 118 -149 -593 -581 303 -35 -117 -362 -862
4103 -862 26 568 -386 -775 -515 381 75 -866 -369 -529 -437 -227 -14 -554 775 -1382 256 230 189 -224
4123 -224 -1471 131 641 399 -313 -284 -186 148 -157 305 -575 476 270 316 -126 -133 -145 -594 470 -562
4143 -562 330 -133 2 153 50 -137 669 -611 -65 282 -565 -501 209 -108 -541 -196 -146 -78 182 -456 -411
4164d11M17M7j34l37O69n72p57J579n84J67rj32l03P05m27M2r0L69o07L26K49
4185B07k19J09K50j052O33J85M21J1K20m95p76R10j188J138q70M87N01j243J134
4204C63p22J73O93o7n01K05l33K06j57P72m73j94J43n14K18L10k50P96r89N92
4224B71j35r6N7o76M22J47p90L50K60J81J75j93Jj077K60Q63p79J047q91J114
4244E11q48L2R6l80N56p4K20l01N03k61l46L48j67j86M17j90K75l28mJ7O8k81
4266c23N20m47O49l76j5N60o75J69Q1k19J07j07K78o7m5j10q1L4r5L88j69k52
4288a95J17j40L22k77Q8M48l81J11K7j76J25l63K26K00n27O32l18m1R6j65L63
4309A72k49J81K4m70M27m54M13M4j69J39l41M73j32r4M50n49K55m8j16J66k85
$$ plain form
4164 -411 6 53 -81 -418 251 -321 -1078 501 -83 84 75 -57 -360 345 -82 -40 -130 239 -368 -42 207
4185 207 -12 97 347 -705 -72 113 534 545 765 270 -506 404 -784 354 -516 -29 472 -771 363
4204 363 -359 -186 507 440 -61 144 -189 17 -140 632 159 -35 108 -406 -188 122 -128 668 -321 271
4224 271 136 40 97 -579 -157 -10 -800 -450 -190 -9 166 -27 -26 -1103 -843 20 -759 288 -603 511
4244 511 -337 -305 -209 -589 -33 -107 113 -188 315 54 -292 56 -111 -297 120 -70 205 -123 -127 -110 -42 -323
4266 -323 197 -250 399 23 8 568 -107 62 143 -76 31 -76 202 135 90 -20 -101 -67 -162 226 57 -195
4288 -195 -78 -218 104 -173 -85 363 -18 93 120 -56 69 -294 -68 132 -395 237 -81 -122 -26 -191 172
4309 172 -77 104 128 -342 85 -369 44 88 -81 58 -283 190 58 -36 414 -135 120 72 -44 122 -163
4330a63J29J52j46J13l62L18J15k72M24l65L26l73PL45n45M37j65l8K65j74m9
4351b1L6j3K35n80M96j71J19Q2k76K43j93MK70l13K75p3n8N5k59N03m63J74L33
4374D05o07K28J92j50j02l2K72m80N5O22p50O08m62K02K99m69K19l0Q4kk98L34
4396A38L3j53J76l58L55n56J71L97m69O00m77J07J02l20N27l09K4p0J1K9k04m8
4418b94L06qJ02n20M09M9j12L92o09K99P2q0J3k75O04n73QM71l18j20J63L87m79
4441a13K4K69k62Q9J74l49K61m26J03K79k55L05k53Q7J29m60N34m6j17K90l95
4462a32K50q2j42N10m49N2k9j5J6k08J42J8M5pj29L13l22K27J58l72K90l59K43
4485A8j71R8M13k59o7j24k31N21l15jQ4k48M12l24L95m2j28M2l82L46j39k7N80
$$ plain form
4330 -163 -34 118 -28 85 -277 41 156 -116 308 -57 269 -104 -97 248 -297 140 -25 -63 202 28 -21
4351 -21 15 2 237 -343 153 -18 101 183 -93 150 -43 -39 231 -82 193 120 62 117 -142 361 -102 72 405
4374 405 -202 26 218 68 -34 -66 206 -274 -219 403 -347 261 -201 1 300 -169 50 20 104 102 -196 138
4396 138 171 18 194 -164 191 -365 -194 203 -266 334 -143 -36 66 -254 273 -36 -12 -82 -71 -42 -246 -294
4418 -294 12 4 106 -414 -5 44 -68 324 -285 14 86 6 19 -256 348 -225 -217 254 -64 -184 -21 366 -113
4441 -113 -89 180 -82 7 181 -168 93 -333 -230 49 -206 99 -154 -67 62 -398 136 90 -27 263 -132
4462 -132 118 36 -106 404 -45 7 -22 -37 -21 -229 -87 -69 -24 -31 -160 153 -169 58 216 -156 134 -225 18
4485 18 -153 -55 358 99 32 -92 -323 198 -117 -118 -34 -282 130 -194 201 159 31 73 -309 37 -102 -129 451
4508D51o09K07r2k27L19j77lJ99JN3k96J26j83J69J39j70O7K61m51M07m10L08
4530H9J6l50M71k77J38J04l23L28l66Q9K05l76L61m95N76k71J86L5k78L21m9l43
4552b09M49m65K16K01l73L69k96J97l6k62L46k20P8m0P5K79m22J42Lj01K29n75
4574d15N04l64L08J02k08J36j82J99k60k04P22k19k63K05l45Q6J17J83k70kL98
4595B28m59K42K74n15L96l49J34J53r2P2l51M75j31j76M76m81J37J47m98L17o3
4616f4j6K40k28K92l29J4K79l15N40m83J76J66j97L8l20L73oj96J20j48Q4K21
4638B41m40L41m26K49j9m17O21l58M65k88k76L10m03L89J40k02K13l76L57o8K38
4659B91O7m41L92k62J96k11N1j43r2J61J40k54J57j10K02k6k53N46n15N5J77m82
$$ plain form
4508 451 -158 49 -43 -270 49 -128 -131 68 69 122 -174 -48 -231 -62 77 -93 -26 235 -216 191 -219 89
4530 89 105 -245 226 -51 87 191 -132 196 -170 -81 124 -252 109 -386 190 -81 105 140 -138 183 134 -209
4552 -209 240 -225 -9 192 -181 188 -108 89 53 -209 137 -83 -5 -45 30 309 -113 29 32 -69 160 -415
4574 -415 89 -275 33 135 -73 63 -119 80 -180 -384 338 119 -144 61 -284 -198 -81 102 -168 -170 228
4595 228 -231 11 285 -230 166 -183 -49 104 12 84 -267 208 77 -99 377 -104 33 180 -318 -1 -64
4616 -64 -80 160 -68 224 -105 -91 188 -127 413 -70 106 272 75 113 -207 166 160 -36 84 -64 20 241
4638 241 -199 142 -284 -35 -54 -471 150 -208 257 -31 -307 3 -400 -11 129 -73 140 -236 121 53 291
4659 291 358 -83 309 47 243 32 83 -60 -152 9 149 -105 52 -58 144 118 -135 411 -104 -49 128 -354
4681c54M88m37K59O9m14N49m6r7l5K7K63k26J92k55l29J09J60R9K69m90J04J92
4703I7m79M19N1p6n0k56O05p16J290j762J398q55O6J73l36J119r48l03P28J00
4723B65r17J524j692J486q62K34l45j80M90K84N93p59m5O49m32k17j87K50j096
4742i57P83N60j289Q46o2q33R59L81k65j57M56n85O6Q85o65j68k7l05M16J73m39
4763b27J191j398J014k18m1P6l34j178Q52k73R16o84l56J317n3j369J213r03N38
4782H3j280J007L30L1o8l25m12R30n49J98p41P38n74P65j54k15j84l12k85O89
4802c28O8Q99J12q11m1k50M52m57R11p93L90o18J22n93J667n65j46L77l77j72
4822a53k56N75m64J66R3j63J25l36O66m48n11N67K4J23L07o57O89l95L58l25M7
$$ plain form
4681 -354 134 -303 -44 25 -389 160 114 17 -18 9 272 46 238 -17 -346 -237 -77 22 291 -199 -95 97
4703 97 -382 37 88 12 -38 -294 311 -405 885 -877 521 -334 -268 -95 -431 688 -260 -563 165 265
4723 265 -652 872 -820 666 -196 38 -307 -487 3 287 880 121 76 725 293 76 -111 139 -957
4742 -957 -174 386 -903 -57 -119 -952 7 388 123 -34 422 -163 -97 788 123 -45 -72 -377 39 212 -227
4763 -227 964 -434 580 362 321 397 63 -1115 -263 -536 380 -304 -660 657 604 -765 448 -455 83
4782 83 -1197 -190 140 171 103 -222 -634 296 -253 -55 -796 -58 -632 133 -21 -236 -420 -732 -1017 -328
4802 -328 -260 639 751 -60 -101 -351 101 -356 555 -238 152 -466 -344 -937 730 165 19 396 19 -153
4822 -153 -409 166 -298 -132 -39 -202 -77 -413 253 -195 -706 -139 -115 8 315 -342 347 -48 310 -15 32
4843C2j54j44J23N44n40J60m0j9k03L33j36l09N63k00K2J77l21J54j53K81k01
4864c1r8J36p5l5L42m61K76N4l69M33l09N34m75N5J73n68M53p4k58M29k67J70
4886C5P8l33M97k56J45l80J37p9j92N27k05r6K17k75l5L9J12J64l12M51k26J38
4908A51j06nJ8j65J44J88k81J95j89J46J98l79L87l40M8k5p2K3k78P82n65R3k8
4931f0Q8j0J00j78j71L9l8J81p5M63n46L11k19j71L91j22Q6k29j1L40m13M29l59
4954a74J92M30m35J4K30j27j60rK46n49K99K27l68J71K11k37K4mL2p7j32M95n24
4977b25L77r2k7j05k81J70l9M50j93q7L62n32M53j93k83L62k80J77L94o68L54
4998I4Rj26L2j79N60n47M19j96k07K15j94L65k12k10K61m54L86m5k87O60n62K87
$$ plain form
4843 32 -122 -266 -143 401 -139 21 -19 -38 -241 92 -44 -353 210 10 32 209 -112 42 -111 170 -31
4864 -31 -129 7 -68 -103 239 -222 54 108 -261 172 -137 397 -78 -23 150 -418 35 -39 -297 132 -135 35
4886 35 113 -220 277 21 166 -214 -77 -156 -348 179 -26 -122 95 -180 -215 -176 -64 100 -212 239 13 151
4908 151 45 40 58 -107 37 225 -56 139 -50 96 294 -85 302 -38 10 -15 -87 -64 -342 440 -125 -32 -60
4931 -60 28 18 118 -60 -231 -192 -230 -49 -124 339 -207 104 -115 -286 105 -17 69 -160 -171 169 -244 185 -174
4954 -174 18 448 13 27 257 130 -30 -39 207 -342 -43 184 -184 -13 198 -39 -15 -19 13 -64 -196 299 -225
4977 -225 152 60 33 -72 -353 -183 -222 228 35 -52 310 -222 231 38 -245 117 -163 14 408 -260 94
4998 94 103 -23 9 -170 390 -157 262 66 -141 74 -120 245 33 -177 84 -370 16 -29 -316 344 -218 69
5020F9J21o25O56k88L3o5L2J86l25K53l9O8p3r9L0o7mL66l41L18l49p1O78p28
$$ plain form
5020 69 190 -435 221 -67 -34 -99 -67 119 -206 47 8 76 3 -96 -66 -133 -137 229 -112 206 -143 -214 464 -264
$$ [...]
8191B2
##END NTUPLES=NMR FID
##END=
