##TITLE=1H_Pr C8_Am
 CDCl3,8 sc, 
 21.9.2021
##JCAMPDX= 6.0         $$ Bruker NMR JCAMP-DX V2.0
##DATA TYPE= NMR FID
##DATA CLASS= NTUPLES
##ORIGIN= UXNMR, Bruker Analytische Messtechnik GmbH
##OWNER= root
$$ XWIN-NMR		Version 3.5
$$ Tue Sep 21 13:14:37 2021 Russian Standard Time (UT+4h)  she@DPX200
##.OBSERVE FREQUENCY= 200.1314
##.OBSERVE NUCLEUS= ^1H
##.DELAY= (6, 6)
##.ACQUISITION MODE= SIMULTANEOUS
##.ACQUISITION SCHEME= undefined
##.AVERAGES= 8
##.DIGITISER RES= 18
##SPECTROMETER/DATA SYSTEM= spect
##.PULSE SEQUENCE= zg30
##.SOLVENT NAME= CDCl3
##.SHIFT REFERENCE= (INTERNAL, CDCl3, 0, 15.7039)
##AUDIT TRAIL= $$ (NUMBER, WHEN, WHO, WHERE, WHAT)
$$ ##TITLE= Audit trail, XWIN-NMR		Version 3.5
$$ ##JCAMPDX= 5.01
$$ ##ORIGIN= Bruker BioSpin GmbH
$$ ##OWNER= she
$$ F:/spectra/data/she/nmr/H-F/1/audita.txt
$$ ##AUDIT TRAIL=  $$ (NUMBER, WHEN, WHO, WHERE, WHAT)
(   1,<2021-09-21 13:13:21.12 +0400>,<she>,<DPX200>,
      <created by zg, POWCHK disabled, PULCHK disabled
       configuration hash MD5:
       00 E9 B6 7A A2 85 ED C7 34 08 36 98 17 FE 4E 26
       data hash MD5: 16K
       7A 70 ED 48 A9 F1 A8 31 DD 07 74 28 05 01 F8 01>)
$$ ##END=
$$ 
$$ hash MD5
$$ EC 94 BF BD 2B 0E F2 E4 FE 0A 16 63 69 A6 88 B3
##$RELAX= 
##$RELAX= 
##$RELAX= 
##$RELAX= 
##$RELAX= 
##$RELAX= 
$$ Bruker specific parameters
$$ --------------------------
##$DU= <F:/spectra>
##$EXPNO= 1
##$NAME= <H-F>
##$PROCNO= 1
##$TYPE= <nmr>
##$USER= <she>
##$AMP= (0..31)
100 100 100 100 100 100 100 100 100 100 100 100 100 100 100 100 100 100 
100 100 100 100 100 100 100 100 100 100 100 100 100 100 
##$AQSEQ= 0
##$AQ_mod= 1
##$AUNM= <au_zg>
##$AUTOPOS= <>
##$BF1= 200.13
##$BF2= 200.13
##$BF3= 200.13
##$BF4= 200.13
##$BF5= 200.13
##$BF6= 200.13
##$BF7= 200.13
##$BF8= 200.13
##$BYTORDA= 1
##$CFDGTYP= 0
##$CFRGTYP= 5
##$CHEMSTR= <none>
##$CNST= (0..31)
1 1 145 1 1 1 1 1 1 1 1 1 1 1 1 1 1 1 1 1 1 1 1 1 1 1 1 1 1 1 1 1 
##$CPDPRG= <>
##$CPDPRG1= <>
##$CPDPRG2= <>
##$CPDPRG3= <>
##$CPDPRG4= <mlev>
##$CPDPRG5= <mlev>
##$CPDPRG6= <mlev>
##$CPDPRG7= <mlev>
##$CPDPRG8= <mlev>
##$CPDPRGB= <>
##$CPDPRGT= <>
##$D= (0..31)
0 1.2 0 0 0 0 0 0 0 0.06 0 0.03 0 0 0 0 0.0002 0 0 0 0 0 0 0 0 0 0 0 0 
0 0 0 
##$DATE= 1632215600
##$DBL= (0..7)
120 120 120 120 120 120 120 120 
##$DBP= (0..7)
150 150 150 150 150 150 150 150 
##$DBP07= 0
##$DBPNAM0= <>
##$DBPNAM1= <>
##$DBPNAM2= <>
##$DBPNAM3= <>
##$DBPNAM4= <>
##$DBPNAM5= <>
##$DBPNAM6= <>
##$DBPNAM7= <>
##$DBPOAL= (0..7)
0.5 0.5 0.5 0.5 0.5 0.5 0.5 0.5 
##$DBPOFFS= (0..7)
0 0 0 0 0 0 0 0 
##$DE= 6
##$DECBNUC= <off>
##$DECIM= 32
##$DECNUC= <off>
##$DECSTAT= 4
##$DIGMOD= 1
##$DIGTYP= 9
##$DL= (0..7)
0 120 120 120 120 120 120 120 
##$DP= (0..7)
150 150 150 150 150 150 150 150 
##$DP07= 0
##$DPNAME0= <>
##$DPNAME1= <>
##$DPNAME2= <>
##$DPNAME3= <>
##$DPNAME4= <>
##$DPNAME5= <>
##$DPNAME6= <>
##$DPNAME7= <>
##$DPOAL= (0..7)
0.5 0.5 0.5 0.5 0.5 0.5 0.5 0.5 
##$DPOFFS= (0..7)
0 0 0 0 0 0 0 0 
##$DQDMODE= 0
##$DR= 18
##$DS= 0
##$DSLIST= <SSSSSSSSSSSSSSS>
$$ [...]
##$SUBNAM2= <"">
##$SUBNAM3= <"">
##$SUBNAM4= <"">
##$SUBNAM5= <"">
##$SUBNAM6= <"">
##$SUBNAM7= <"">
##$SUBNAM8= <"">
##$SUBNAM9= <"">
##$SW= 20.0188988654967
##$SWIBOX= (0..15)
0 0 2 0 0 0 0 0 0 0 0 0 0 0 0 0 
##$SW_h= 4006.41025641026
##$TD= 16384
##$TD0= 1
##$TE= 0
##$TE2= 300
##$TE3= 300
##$TEG= 300
##$TL= (0..7)
0 120 120 120 120 120 120 120 
##$TP= (0..7)
150 150 150 150 150 150 150 150 
##$TP07= 0
##$TPNAME0= <>
##$TPNAME1= <>
##$TPNAME2= <>
##$TPNAME3= <>
##$TPNAME4= <>
##$TPNAME5= <>
##$TPNAME6= <>
##$TPNAME7= <>
##$TPOAL= (0..7)
0.5 0.5 0.5 0.5 0.5 0.5 0.5 0.5 
##$TPOFFS= (0..7)
0 0 0 0 0 0 0 0 
##$TUNHIN= 0
##$TUNHOUT= 0
##$TUNXOUT= 0
##$USERA1= <user>
##$USERA2= <user>
##$USERA3= <user>
##$USERA4= <user>
##$USERA5= <user>
##$V9= 5
##$VALIST= <valist>
##$VCLIST= <CCCCCCCCCCCCCCC>
##$VD= 0
##$VDLIST= <DDDDDDDDDDDDDDD>
##$VPLIST= <PPPPPPPPPPPPPPP>
##$VTLIST= <TTTTTTTTTTTTTTT>
##$WBST= 1024
##$WBSW= 4
##$XGAIN= (0..3)
0 0 0 0 
##$XL= 0
##$YL= 0
##$YMAX_a= 673862
##$YMIN_a= -891742
##$ZGOPTNS= <>
##$ZL1= 120
##$ZL2= 120
##$ZL3= 120
##$ZL4= 120
##$ABSF1= 10
##$ABSF2= 0
##$ABSG= 5
##$ABSL= 3
##$ALPHA= 0
##$AQORDER= 0
##$ASSFAC= 0
##$ASSFACI= 0
##$ASSFACX= 0
##$ASSWID= 0
##$AUNMP= <proc_1d>
##$AZFE= 0.1
##$AZFW= 0.1
##$BCFW= 1
##$BC_mod= 2
##$BYTORDP= 1
##$COROFFS= 0
##$CY= 11.3945322036743
##$DATMOD= 1
##$DC= 2
##$DFILT= <>
##$DTYPP= 0
##$F1P= 2.36226072786647
##$F2P= -0.459571619588291
##$FCOR= 0.5
##$FTSIZE= 0
##$FT_mod= 4
##$GAMMA= 1
##$GB= 0.15
##$INTBC= 1
##$INTSCL= 1
##$ISEN= 128
##$LB= 0.24
##$LEV0= 0
##$LPBIN= 0
##$MAXI= 10000
##$MC2= 0
##$MEAN= 0
##$ME_mod= 0
##$MI= 1.114404
##$NCOEF= 0
##$NC_proc= 0
##$NLEV= 6
##$NOISF1= 3.799351
##$NOISF2= 2.8
##$NSP= 1
##$NTH_PI= 0
##$NZP= 0
##$OFFSET= 15.70392
##$PC= 1
##$PHC0= -14080.18
##$PHC1= 18.8009
##$PH_mod= 1
##$PKNL= yes
##$PPARMOD= 0
##$PSCAL= 0
##$PSIGN= 0
##$REVERSE= no
##$SF= 200.130013532006
##$SI= 16384
##$SIGF1= 3
##$SIGF2= 2
##$SINO= 400
##$SIOLD= 16384
##$SREGLST= <1H.CDCl3>
##$SSB= 0
##$STSI= 0
##$STSR= 0
##$SW_p= 3612.71676300578
##$SYMM= 0
##$S_DEV= 0
##$TDeff= 0
##$TDoff= 0
##$TI= <>
##$TILT= no
##$TM1= 0
##$TM2= 0
##$TOPLEV= 0
##$USERP1= <user>
##$USERP2= <user>
##$USERP3= <user>
##$USERP4= <user>
##$USERP5= <user>
##$WDW= 1
##$XDIM= 8192
##$YMAX_p= 0
##$YMIN_p= 0
$$ End of Bruker specific parameters
$$ ---------------------------------
##NTUPLES= NMR FID
##VAR_NAME=  TIME,          FID/REAL,        FID/IMAG
##SYMBOL=    X,             R,               I
##VAR_TYPE=  INDEPENDENT,   DEPENDENT,       DEPENDENT
##VAR_FORM=  AFFN,          ASDF,            ASDF
##VAR_DIM=   8192,          8192,            8192
##UNITS=     SECONDS,       ARBITRARY UNITS, ARBITRARY UNITS
##FACTOR=    0.0002496,     1,               1
##FIRST=     0,             0,               0
##LAST=      2.0444736,     0,               0
##MIN=       0,             -891742,         0
##MAX=       2.0444736,     673862,          0
$$ Real data points
##PAGE= N=1
##DATA TABLE= (X++(R..R)), XYDATA
0@%%%%%%%Qj6J6j6K4l2M0n6O4q0J04j20J44j76K16k56L02l58M16m88N68o56P53
30D01q63R90j126J275j442J627j829K052k299K569k864L187l538L920m341M800
46B519n300N846o444P103p825Q619r497J0472j1564J2789j4171J5750j7574J9706
60A0429k2237K5300k9098L3952m0406M9459o3164Q6588j37131M32854m62357o77037
72g92848J028083L24479n94748k73414L23925o1590p277K29184j04139l91070
82c19415K36974L97925k16129l94883J55912K98767n647k63066j62696J74730
92i7528L51176o1818m12708m6316M12781J19172k61321j13539M9066J2302J58582
103A09849R5653k82660j74530L16621J81091k64221j06975J98287k3580j42643
$$ y = [0, 0, 0, 0, 0, 0, 0, 0, 8, -8, 8, -8, 16, -16, 24, -32, 32, -48, 56, -64, 80, -96, 120, -136, 166, -192, 224, -264, 304, -352, 401, -462, 528, -598, 677, -765, 862, -967, 1085, -1214, 1355, -1509, 1678, -1860, 2060, -2281, 2519, -2781, 3065, -3379, 3724, -4101, 4518, -4979, 5493, -6071, 6718, -7453, 8297, -9277, 10429, -11808, 13492, -15606, 18346, -22060, 27399, -35765, 50823, -86308, 346546, -115811, -792848, 235235, 559714, -35034, -308448, 15477, -46113, -53390, 175794, 71655, -319415, -82441, 315484, 99355, -295528, -139616, 159151, 153504, -109562, -272258, -97528, 253648, 191830, -220878, -267194, 145587, 264759, 3438, -110101, -61035, -48733, 109849, 205502, -77158, -251688, 64933, 246024, -18197, -125172, 73115, 49535, -93108]
113i3108J38860P0212k33656m156K54459o9597k40457J12488K15714r9963j85275
124a34479L9493J37355M4616o7663j22948p635J58225M8274j21353q228M3442
135I099q0501O1540K00072j33840k92982J73571L33821j95376l12715K22835K41036
146B26560k47523j40970K49703M5995k12745K4770J34482q9067n7068J37637j4403
157E7371j79801N0719J82453n7274j40475L6022O6125m404J696k2382l9763L7574
169a2139M4465m8064k4038P2200N399q7421J5541Q5296j9576m0423J5769k8378
181b1369q593R5204R900j34531j8727J41435K1386j22805q395Q2931k1406l8597
193b3567L9322r827m2171M1279K5557o1169j1026O8024O768o1350r251L5608J2978
$$ y = [-93108, 45752, 115964, -117692, -121848, 132611, 63014, -177443, -64955, 150759, 50796, -134479, -94986, 42369, 86985, 19322, -103626, -111261, 46964, 95238, -26115, -34343, 9099, -71402, -9862, 190210, 56370, -236612, -63041, 270780, 75404, -237311, -14476, 226560, -20963, -161933, 87770, 133765, -78980, -54210, 80272, -8795, -65863, 71774, 57371, -122430, -71711, 110742, 53468, -87007, -50985, 15140, 10736, 12432, -9950, -49713, -12139, 32326, -15738, -39776, 32424, 37823, -49598, -34057, 51239, 31663, -8760, 7009, -21369, -29962, 65242, 75142, -59389, -78116, 63319, 84705, -38100, -46495, 36436, 15030, -23567, 15755, 5928, -36243, 5036, 30593, -30576, -41602, 26422, 33190, -28160, -37411, -1803, 11175]
206A1175J2925j4560o6477J8510J03282j8570j00850K1680P0536k4812k2983L9091
218B8947k2067n9568N9952P1516q6864o5928R4744M1565q3288j4467N5325p622
230A2245k4455K1878q520l8478L6514N1034n8386n5297N9625M5840l5503k5729
242a9232m864M048M3681J8306o5590l7408P2167M8670o5615m0937N0838J9546
254B3610k2995Q791r973k8186M0582L7287n7718m1085O1930M1719n6954l5340
266c8332M2935J7768j8916L880j2883k0645L7190K5709m8017k4696M2368J8899
278B5260l1043r434J8113n486j932J9537j8148k4081L6865J6467m5007k616M1251
291A9746q013l0240J6457J8814k3990m628L0933j2495l0603K8348J8458l4806
$$ y = [11175, 24100, 9540, -56937, -38427, 64855, 46285, -54565, -32885, 37651, 12839, -10144, 28947, 6880, -52688, 7264, 78780, -8084, -74012, 20732, 62297, -20991, -35458, 19867, 12245, -12210, 9668, 1148, -37330, -816, 50218, -8168, -63465, -3840, 42000, 6497, -19232, -24096, -20048, 23633, 41939, -23651, -61059, 11108, 59778, -5837, -46774, 4064, 23610, 615, 9406, -567, -28753, 11829, 49116, -8602, -49687, 12243, 53962, -2992, -38332, 4603, 22371, 3455, 7335, -5548, -26193, 10997, 36706, -11311, -36007, 6361, 25260, -5783, -15217, 2896, -2590, -4522, 15015, -3133, -27214, 9651, 26118, -18889, -21505, 19746, 11733, -18507, -2050, 16764, -7226, -11854, 19079, 6584, -24019, 4329, 22787, -12019]
303a2019j434K9070j2775j8557J9530R138k3373q99K3756r387j8559J9559L764
316G814k2860J4546J6655k7171m517L1321n003k8622J1494K4344j6188j6188K1720
329G345K095k1759J6150J3340k8520o8L0577j0100k5394J3749J7991j5112j0013
342i719J5996k240j4525J6232N604k5959P593K4657j7307j6375J9244O467j6659
355f991J609J3363j0480q876K0266m34k5833J3155K2485k3058j1286K4616j53
368H383j9769P443J4107j2197q736J7691J89j9561J1252J5041j9759m006K0532
381A0610o747j3356J1712N150j2332J630J2679q465j2182J7133O740k3414M090
394f752K1214j3972j1654J7374N61j5544P566J2638j3418j0383J9199N641k2571
$$ y = [-12019, -13453, 15617, 2842, -15715, 3815, 12953, -10420, -11319, 12437, 3050, -15509, 4050, 7814, -15046, -500, 16155, -11016, -15533, 15788, 10785, -17837, -6343, 18001, 1813, -14375, 7345, 9440, -12319, 3831, 17171, -11349, -11417, 19160, 9060, -16334, -2585, 15406, 294, -9719, 6277, 4037, -10488, 5744, 11348, -14611, -7018, 17639, 332, -16043, 3201, 9668, -6991, -5382, 7981, -2499, -11375, 8891, 8457, -17376, -4221, 18264, -4794, -16080, 8536, 8383, -11386, -3943, 10164, -2033, -10769, 6922, 7111, -12450, -1198, 13843, -5916, -9922, 10610, 3863, -9493, 2219, 7369, -4963, -3333, 9346, 881, -11301, 5832, 12572, -10842, -6752, 14462, 490, -11164, 6210, 6771, -8773, -1207, 11431, -1987, -12370, 6829, 12470, -10101]
407a0101K887J9097j1914p639J4872m763j2799J2510Q851j4822o798J5179L250
420G810j3830L424P717j1710L597J5189j5701j2170K0901P076j9438k934J4404
433D335k86r178O746J794j4121Q790J7667j8118j3789K0343O960j4688m0N842
447B257m844J301J1097o882j8260J3561K1050j8761j5893J7764O369r891K209
460A077rp684O762J1493r344j5268J1314J4757j2635o936R767n316k256J5854
474A1576p074k0578J1580K1232j1342k0462R458J6741q934q090P082m323j157
487d291J3348n736j5792R245J2014p689o150M580l74l446R590L549k0128j119
501a2399K6256l347k3919N887J5549m379o244J718p61n34O090O44j0571J436J2414
$$ y = [-10101, -7214, 11883, -31, -7670, 7202, 2439, -10360, 2150, 11001, -3821, -10619, 4560, 7810, -6020, -2596, 5121, -6589, -2992, 12197, -3504, -15674, 5227, 12303, -7135, -10069, 4335, 4049, -5129, 1617, 3411, -10710, -1920, 15747, -2371, -16160, 4183, 11143, -3545, -3585, 2257, -2587, -1286, 9811, 2929, -15331, -1770, 19280, 519, -15374, 2390, 8759, -1132, 1077, 1068, -6616, 146, 11639, 2295, -12973, -1659, 13098, 463, -6473, 3294, -2022, -4278, 11576, 4502, -16076, -4496, 16736, 5394, -15068, -5610, 11131, 2197, -5893, 1189, -3134, -4291, 9057, 3321, -12471, -3226, 8788, 1099, -5051, -471, -845, -4291, 5299, 8848, -11280, -12399, 13857, 10510, -13409, -7522, 8027, 3648, -2596, -878, -1639, -2173, 3917, 4561, -6010, -4574, 7840]
516G840o278p360J0136k836r240J2870N894j8654l943K1277M323k2104l266K0534
530I193j590j3676O735K597p966O078N216r072j711P193j207n333M165M369r804
545d813j468J4584n074j4057J0674Q543j2013k646R371m13o330J826M766n006
559b056k220P539j310o058M787r91l897J0216r1j6140K465J8312j234j8092q91
574i661J6475L08j0999K827J886m483P100L114j1668n27J0728L55q042j659N874
589A628J500j692L13n782j531J4245K55j8333J316J5667l54r156k421K775K538
604I68K811M14q781l037J3622J311j4514K980J0257o371m214O796j14o331K345
619a858P263n521q180R039O501j0389k280O591j181R7K039m398k536N486M156
$$ y = [7840, 1562, -5798, 4338, 1502, -7738, 5132, 11026, -7628, -11571, 9706, 14029, -8075, -11341, 9193, 7603, -6073, 662, 3259, -4707, 1371, 6587, -2485, -4196, 2997, 1790, -3543, 622, 4991, -4813, -6281, 8303, 3229, -10828, -154, 8389, -3624, -6270, 3101, 2688, -3642, -1816, 2950, -2056, -4276, 3263, 1953, -4105, 682, -309, -4206, 6010, 5919, -10221, -7756, 10556, 9322, -8770, -9661, 6814, 7122, -3877, -1050, 836, -3647, 3453, 6567, -5101, -5628, 5100, 5455, -2587, -4246, 1628, 3128, 1436, 1749, -4033, -5564, 8681, 8936, -9397, -8081, 7586, 7232, -1924, -4345, -1570, 968, 3779, 4193, -4588, -7625, 5997, 7308, -7206, -4226, 6031, -340, -4554, 2242, 2128, -4203, -1858, 5405, -116, -8296, 743, 7244, -3145, -5425, 1166, -15, 82, 2121, -2277, -4813, 673, 4829]
634D829m412n792M540L900m337K339J555o943K296P716l834n143K369K873K81
649B237j767j117k64J740L829m406p692R570Q048j2682n814J1422L017p286k092
664c257M596k48l695M272K485q133L66P862k767l884J675l6Q26J682l072j333
680b661L221K520m049m511P180M045r663r99Q873k656m737L858J178l542o5L609
696A601j15l914K164K426m854J802N376n890l350P480L77n398M87M244p67m152
712b483K416L708m517j472N112j915k636L308k1j520M48p02N53K033j066k936
728a690l26M896R44p730R45Q117m304n651N624K231m987r6L288k63l380J498L416
745B532m574r13N576j939m019L572N07k167J466L53j175q2R41O16k340J102L235
$$ y = [4829, 417, -5375, -835, 3065, -1272, 1067, 2622, -4321, -2025, 5691, 1857, -3286, -917, 1956, 2237, 470, -647, -911, 829, 4658, 252, -7440, 2130, 10178, -2504, -8318, 3104, 6121, -1165, -3257, 1339, 1091, -2604, 1668, 4153, -3980, -3614, 4248, 1481, -2403, -728, -764, 62, 1744, -1328, -2661, 560, 3080, -969, -5480, 1700, 5745, -3918, -4917, 3956, 1300, -3437, 421, 1599, -1943, -2008, 1601, 1486, -2428, -264, 2162, -2692, -890, 4486, -1404, -4754, 2726, 3103, -2295, -1808, 2436, 1669, -2483, -67, 3641, -876, -2348, 2764, 849, -1787, 1521, 1500, -20, 428, -274, 279, 2312, 1246, -1690, -2016, 2880, 3824, -3906, -2961, 5156, 852, -4799, 825, 3056, -1931, -2027, 1261, 998, -2382, -884, 2532, -2042, -2955, 2621, 682, -3337, 235, 742, -1425, 41, 394, -781, -863, 78, 694, -1646, -544, 2691]
762B691m248j594O118j212m509K586J674j583K75K43q12m19J999J326m676j22
778b263O690k434o033M484K527l059rM34r21M07K254K12n008J75O754j585n987
795c362K749K337j373N73j385j548K917J392k521k815K225M690l656m374M316
810A65J436k720J556m39k893K843K389k515l017J769M061k293l668L670O14k407
826a449K274n88k853L544J544l578j040K865J603k742j656L521j44k680K809l22
842A108l339L109J749l408J85J719k73j145LJ611j197j754L362l89l811L277J473
859B280l913R38K073j212j069R12Q00j034j191K555k45l394K739J051l157J817
875e0J264k949O54K330p81j924Q2K717q07k859K717R97l111J458J485k882J155
$$ y = [2691, -1557, -3151, 2967, 1755, -2754, -168, 1506, -77, 198, 441, -371, -790, 1209, 2535, -2141, -2263, 4427, 1993, -4040, 444, 2971, -88, -97, 337, -584, -177, 2077, 2289, -2719, -2544, 4210, 2625, -3362, -613, 1724, 351, 924, -461, -2009, 908, 2300, -221, -3036, -811, 3879, 223, -4151, 165, 1601, -1119, 437, -2, -2895, -52, 2337, -178, -3195, -1426, 2635, 342, -3326, 344, 958, -1449, 825, 237, -2616, 928, 2472, -1106, -2146, 719, 2322, -420, -2076, 1445, 1301, -1379, 1430, 1108, -2231, 878, 2627, -781, -596, 1123, 850, -295, -292, 1319, 122, -1632, 1730, 1341, -2470, 807, 2280, -1633, -695, 1378, 166, -903, 9, 809, -225, -1416, 1139, 894, -2500, 239, 1290, -1867, -50, 1214, -1735, -1081, 1249, 468, -1456, -1374, 1343, 536, -2323, 394, 1391, -1720, -262, 1223, -1659, -504]
892e04K093j828j243J261J669j188j922K308N81k790J990J519l439R96K466j561
908D08j086J023N27k27j269R33P48j376J115L79k895K197K057l568mK265m36j443
926f52L61J166o03j752K286O41l538J326K737k657l71J473p89o7O42o85j18j66
944g66J226J38k537J647J845k788L04J951j995K24J698j136q79P58J015K0j918
961a193Q89J503j931O75J630k669J0L219j819j626J035J348P9k274O91K210j862
978h5l59J861j819M3J754j273j81N58j060R85P58j178n09j21J736L06l463Q78
996a169L408k264j613K009l29q17N27P12m31j576R34K334k382j375K195p9m33
1013c49P21j480J91J613k93p47p93N94K039j699j190J617k87N36N96k190K29K312
$$ y = [-504, 1589, -239, -1482, -221, 1448, 260, -1662, 646, 1227, -1563, 427, 1946, -1493, -497, 1969, 408, -678, 345, 872, 645, -624, 309, 1057, -319, 796, 1175, -1720, 477, 2534, -1034, -1038, 1227, 791, -652, -291, 875, 272, -1480, 806, 1447, -2091, -765, 1972, -685, -1056, 417, -372, -439, 203, -482, -600, -766, 460, 598, -1939, -292, 1553, -1235, -931, 1020, -975, -751, 947, -189, -1068, -310, 705, 725, -1193, -304, 1199, -732, -57, 1573, -1096, -1086, 2133, 314, -1312, -277, 1071, 1150, -1124, -433, 1777, -85, -444, 1417, -402, -359, 1395, 122, -59, 499, -561, 424, 1182, 4, -505, -626, 1110, 1416, -2047, -1169, 2239, -25, -1638, 371, 42, -775, -248, 464, 33, -1543, -609, 1725, -657, -2032, 163, 84, -349, 372, -1108, -917, 696, 403, -344, -1137, -543, 1496, -203, -1393, 224, -63, 473, 1069, -1121, -892, 1420]
1031A420p61r93O48n41K72M48M27n78k272J856M013m052l347M357K034k798k010
1048a877J564K239j592j864K244M46k258J165Q87p92m96q58J875J275l361j183
1064b586L621J069k613k006K081L193k853k663L271K39k030J450L21j222k7M20
1080c35R78o22j483J433L71o63R00j405o52L099k73l178Q33J869O72j835j670
1097a961K723J165k648J38J233l37J20j041Q43J592k581j226M202K4m022n04L721
1114A441J896m612k261N831P35n497R73L583j366k453P67K456n32l291J769K821
1130B260k513j663J244J729L50l173p48M484l95l557N54K111J8j268m56J765o34
1147A08j581K004L15k355R07J190p72L73l9p88P20L96L76j520p98L239J94m043
$$ y = [1420, 659, -334, 314, -227, 45, 493, 920, 342, -1930, -74, 3939, -113, -3460, 897, 2931, 133, -1877, -313, 1926, 334, -1530, 714, 1160, -1098, 67, 954, 162, -334, -1192, 683, 1958, -1403, -2586, 1035, 2104, -509, -2515, -434, 2759, -94, -2757, 514, 753, -1277, 173, 494, -728, -755, -335, 643, 21, -1462, -29, 342, -321, 579, -826, -1478, 1621, 1348, -1830, -997, 872, 1544, -291, -1961, 762, 1927, -721, -583, 650, 313, 433, -608, 235, 1827, -754, -1980, 2222, 2246, -1776, -2280, 1441, 3337, -1275, -3536, 2295, 3030, -2467, -1494, 2089, 723, -1730, -963, 1493, 961, -2330, -561, 2260, -253, -1916, -672, 1057, 1407, -1766, -2514, 1970, 1575, -1982, -1428, 683, 701, -567, -1023, 742, 108, -1473, 531, 846, -1509, -602, 588, -184, 189, 150, -638, 82, 478, 854, -666, -1464, 1775, 1969, -2074]
1165b074J270K799j240j188r1J154Q03j954K2J773j015q39R71O42j25k256k18
1182a566M454j211m817J949L789j492l013Q13K894r09l086K168J915l265j05K608
1198A126p40j652K75J430O77k455j67K382k04j302j74K34J424m22k025J632O41
1215F80j744J296P48j837J5J305N53j163j377K208P46k580J044J745k192k47J843
1232A043n61q78o6J363K58k215N34K347j452j235J097K43K76p02q74J556p6j541
1250h83J053Q03j467l13Q30J246p26k619K462J511l161j64K734q06j743N11J557
1267H25k20k151Q52K204k151q61K291m26j270M74M48J034j252j415J977O07j443
1284d77j0P23M50p63r86J921M95k501L89K395j458r43R46O44m53j135J218J124
$$ y = [-2074, -804, 1995, 755, -433, -524, 630, 1433, -521, -499, 1274, 259, -580, 391, 1033, 908, -1348, -1566, 2888, 1677, -3140, -1191, 2598, 1106, -1907, -1094, 1800, 891, -2195, -27, 1888, -1377, -1482, 1126, 386, -1266, -991, 439, 1116, -1339, -1506, 876, 672, -630, -804, -570, 854, 432, -1593, 39, 680, -1064, 232, 980, -857, -842, 463, 1016, -147, -1524, 684, 1430, -1150, -106, 1639, -553, -800, 1043, 482, -396, -462, 901, 1159, -1056, -522, 1825, 373, -862, 235, 478, 754, 52, -822, 734, 658, -883, 170, 973, -494, -807, 23, 1269, 543, -2076, 386, 1897, -1264, -1428, 1306, 500, -1243, -732, 825, 605, -1546, -694, 1510, -641, -1502, 789, 363, -907, -433, 15, 1049, -203, -1618, 359, 966, -477, -487, 236, 686, -77, -1063, 858, 1353, -1148, -759, 1636, 178, -765, 181, 825, 372, -763, 455, 1579]
1302A579k280k33K152q27j186J203J56o30l15K74J353j187j233J783L7j109K17
1319b46R7L53j16j011J274O39k356N99J997j001j285N14J336l07k112J048K434
1336A857k436j258K494K82j587R1P04P46j511m90K346q41j775J360J060r58n56
1353d72O1J080J12j625P71J306j724mJ090j13k84o75O54Q97j533k64K034j087
1371B24r81J228J93m07o95O5J386j134q11J776l73j477R21P18m65m80m41J172
1389D19K48j821Q42R76j481K28O29L0l9q26N12J244j548n25J574j81r23L90J43
1408a09Q55j192o73K040l27j533J017N34r00k5L41N81m30j021J222Q83j780M44
1426g3O96n48P9K0P5M33q85L8R63o74l58O39j07j93K7n77R55j56r28R45K9j046
$$ y = [1579, -701, -934, 1218, 391, -795, 408, 564, -66, -381, -107, 1246, 59, -1174, 609, 646, -463, -246, -149, 204, 88, -923, 351, 990, -1366, -767, 1230, 229, -1056, -542, 794, 487, -1625, -577, 1857, -579, -1837, 657, 939, -648, -557, 147, 893, -618, -1108, 1238, 397, -1378, -18, 1042, 84, -472, -411, 669, 781, -844, -73, 1233, -491, -495, 595, 482, 198, -477, 177, 1074, -459, -723, 1311, 224, -757, 471, 664, 257, -438, -373, 1013, -121, -932, 844, 471, -1006, -85, 633, 168, -312, -753, 419, 667, -1154, -312, 664, -817, -589, 40, 70, 31, -795, -283, 961, -587, -1112, 462, 281, -642, -252, -109, 746, -446, -1119, 921, 594, -939, 78, 612, -288, -313, 28, 609, 179, -842, 380, 1263, -517, -73, 623, 75, 154, 174, 249, 682, -203, -165, 798, 124, -234, 405, 298, 105, 132, -445, 510, 354, -574, 371, 400, -646]
1448f46O59O0j46q8k81P40k74j152J100P89j613L42Q87m88n8k20K67N35j272M46
1468d13J025q91k58N12j71K34k00m12J023j86j113R61L49p00j9j08Q22J74j534
1487i05J082O31j199J62R11n65j48J0J04N45q04K8R36r67J92P39q46J15K90m65
1507a54M14J32o47L65j70j75L49l15J07L31o62M31N38j261P78L40q00p4O81l43
1527a35j89j5M53K95j086K35Q79o69l59Q72m31J73L5l74M69P5n23M15j13o6M83
1548D24p68K74Q33j289M26P62o96n9L82j53K53k33j54N23m69k76P07q39M41O24
1568G13j098J8J102o19k62K07j85L98m87k15J265r43m46P21m47K98K28p42K97
1587a97N96q38Q2L83Q1K0q20N56P51j060l31J267k38m90P1o0L51r8n15N26Q5k49
$$ y = [-646, 13, 73, -73, -161, -442, 298, 24, -1128, -28, 761, -852, -510, 377, -111, -169, -389, -122, 413, -859, -413, 612, -279, -537, -25, -196, 38, -162, -574, 449, 263, -850, 111, 460, -240, -259, -367, 455, 629, -905, 177, 808, -391, -229, 682, 117, -31, -21, 83, 628, -176, -148, 788, -179, 13, 752, -94, 21, 311, -154, 260, 392, -255, 110, -60, -235, 114, -201, -94, 237, -425, 6, 544, -717, 61, 401, -399, -473, 208, -135, -324, -339, 114, 409, -677, -442, 437, -232, -591, 281, -150, 23, 58, -316, 153, 228, -295, 120, 7, -59, 424, -344, -70, 763, -526, -100, 662, -34, -93, 289, 136, 389, 156, 2, 525, 56, -220, 487, -352, 89, 713, -385, -367, 735, 116, -146, 61, -124, 274, -213, -428, 837, -106, -552, 169, -278, 20, 248, -494, -197, 399, -439, -357, 26, 107, 127, -693, -137, 614, -446, -777, 490, 252, -238, -167, -227, 124, 26, -489, 37, 122, -127]
1609a27L9n5M42K20j174O22J102r77n23Q12P7j79m12kJ078p93p43Q76K19o78M26
1630B50m42M71L68q11O2R55o47n87L10L87P0j011K02J285q65p01Q59J52l71l8
1650a02k83N64R4p05N6M90j58O9p18L76R64j075l49J078j06n80J56J44M00m23
1670a08o35P70K94p62J82K69K18K07j034M17J072j016l69R57j30k77l59K97Q61
1689H54p02r08J312O4q28K73j63M73k48m58L10P19q42L1J73j45N04p07j95J076
1709E93o27m81O54k11N5k4l70O57n2n68K44J23j82P2l93L06N39n92j91Q18m66
1730i6j00P0K6M37j41p55R80l9p37K45L32j39J28n08M49O82r49j79O67j4k30l09
1752a80J63O67n48m86Q15o2n29J38J91J35j96l94L12L44o39M33J19l99J73j25
$$ y = [-127, -88, -143, 299, 519, -655, -33, 1069, 92, -431, 381, 458, 279, -133, -135, 943, 150, -593, 283, 502, -176, 250, -192, 279, 647, -164, -102, 853, 206, -381, -71, 316, 386, -625, -423, 862, -3, -704, 155, 307, -64, -102, -385, 179, 273, -432, -376, 114, -44, 25, -693, -317, 647, -428, -777, 301, 195, -385, -229, -85, 315, -108, -743, 27, 321, -441, -259, 10, 228, 435, -599, -182, 890, -126, -495, 462, 332, 55, -304, -7, 854, 152, -756, 556, 620, -208, 65, -98, 375, 127, -331, -21, 698, -144, -113, 60, -85, 419, -288, -483, 593, -34, -515, 139, -72, -17, -41, -411, 246, 194, -374, -130, -7, -189, -117, -510, -204, 335, -257, -448, 370, -96, -196, -126, -100, 337, 196, -559, 421, 382, -355, -110, 222, 83, 211, -297, 152, 834, -115, -294, 373, 359, 129, -180, -17, 650, 102, -384, 431, 369, -160, -22, 169, 304, 108, -286, 26, 370, -269, 164, 283, -116, 57, -68]
1772f8r9N26n36k26P32n14N8L78m99J39Q8r8J97j90k83O54n33k7N95n32l13O16
1794F5k3o8k15J15L56L6o26N58K07p94K87L04j51L24o63K94P04j074J89O71m73
1815B3l0P4K59R1n95K9O93m96l07P55l50L2L7j42J97r6m90K77L58n21K27l3j97
1838b05M12k91O5L83o54o2O67o46k4L48r9L3n9j51N40m51m36R57m92l77P22j46
1860C4k82K47m9L13p7m72L80L04p51N12l02J49L47n68K84M49n90p1O73m73o3P
1882Am8M93n26M3N02l28m15O17j20m12L14r8k3J63k72K14j17l27M37K6l20K39
1904D3n1n0K80m00M2K57o08J72M33l6k54n6n8O62m58l26P09m29l61M87J33k45
1926a14K1j68N76j85m59M61p2l12N47l46N1L82l98j64N61l24j96L15j79K11l2
$$ y = [-68, -167, 359, -177, -403, 329, -185, -127, 251, -248, -109, -21, -119, 78, -112, -395, 259, -274, -301, 294, -238, -551, 65, 42, -26, -241, -126, 230, 266, -360, 198, 405, -389, -102, 202, 51, 375, -288, 6, 710, -364, -175, 496, 23, -7, 67, 326, 417, -178, -149, 544, 48, -259, 496, 146, 178, 215, 73, 270, 174, -316, -39, 319, -202, 25, -8, -205, 207, -84, -19, 364, -290, -352, 315, -331, -355, -7, -106, -73, -132, -283, 257, -194, -630, 327, -165, -542, 180, 34, -248, -1, -50, 263, 186, -286, 94, 398, -353, 159, -143, 6, 353, -215, 69, 518, -72, -143, 530, 57, -6, 1, -47, 446, -80, -37, 465, 137, -278, 339, 219, -193, 121, 23, 0, 163, -109, 105, -12, -339, 98, 124, -196, 43, -8, -58, 222, -178, -136, 121, -487, -315, 118, 82, -172, -228, -286, 376, -82, -408, 301, -128, -489, -2, 131, -114, -93, -261, 315, 130, -329, 132, 60, -252, 295, -51, 0, 382, -16, -180, 381, 57, -139, 176, -3, 208, 176]
1947A76j68M10m17k48P10j34m66M80k59k96N44j29j58o1k3K58jm21N68k28o34
1968d97M35L35l12j7j61J45O7l01P4N66l78n9j29j34N54m49r0O90k61m49L44J77
1990A50k56J75n34O06K0n58N10N5k18L05m32n3P51l95l82M76k08m9J85P6J08l11
2012B1k57L79K57o39N00l80J13K67m15J09L66k06j84J15j09J54r3l89P13j47m57
2033b82J80J93j04J07k95K09K35p27L01L49k56r1k4k00O49k49k81O66l55l31M01
2054I5r1O6r2k36N14j24m27M09P9m22L28mj94L29j87j00M10l46j33K80o18O96
2076B32p4j95M0J76l20M72k66k14L41j43k05L37k17O3j26n2L33j78m53O67j34
2097H4l60J95K59m02L19m39J89M56n47K01k1l5l1J45k20N04l48l71O46j61j94
$$ y = [176, 8, 418, 1, -247, 463, 329, -137, 343, 84, -212, 332, 203, 45, -16, -39, 219, 218, -203, 365, 137, -497, -62, 273, -39, -56, -217, -72, -5, -306, -232, 334, -44, -103, -232, -366, 188, -261, -351, 339, 78, -371, -27, 150, -106, 69, -465, 141, 161, -397, 113, 168, -50, 255, -177, -230, 521, 126, -256, 220, 12, -37, 148, 224, 332, 21, -236, 143, 400, -239, 261, -119, -6, 261, -154, -45, 321, 115, -69, 46, -63, 91, -2, -391, 322, 175, -282, -102, 91, -13, 94, -201, 8, 243, -484, -183, 166, -90, -181, -205, -405, 244, -5, -286, 380, 25, -306, 95, 4, 70, -22, -258, 256, 132, -295, 114, 193, -229, 99, 95, -99, 230, 43, -57, 353, 7, -126, 154, -464, 232, 158, -37, 3, 179, -141, 331, 65, -149, 192, 49, -156, 181, -36, 27, -99, -151, 182, 4, -449, 218, 84, -276, -81, 178, -224, 95, -344, -155, 301, -246, -45, -66, -101, -132, 13, -207, 297, -51, -422, 224, 63, -131]
2118a31K20m41K66K73l67J07K76l07K55j76l24O81l27k16K86J24l32K54k58L75
2138B38p7l75M94J51p39N47N3l41L28k94p9M43j48l83N03l12Oj1m09O38J0o78
2160d35M20N1k90J58p7K89l4l31J93M14o13Q4L02l32L34k68j74O29j84m49J63
2181a50K17k08L8k13K89J94m20J03L59k71N1R1j66M78k43m71Q03k35m18Q7J93
2202A08R3j92k79M90J52n82L26J21l10K67k59J0K55j03q9n3O8o4O1j12K65j23
2224E0m28L15J64j39R1k09l1L61l56k9M39l97P0P0j94M59l56l36P26j98m69L15
2246h2K52j74j76l6M19J05n66K30L04m35P7R8l4J63j80k06N22k00m20L88K49k04
2268I4R2l85M54j49k44K33J66m37J63K15l12L93k74pK19m87L21J95n18L81J9k80
$$ y = [-131, 89, -352, -86, 187, -180, -73, 203, -104, 151, -25, -349, 332, 5, -211, 75, 199, -133, 121, -137, 238, 161, -214, 280, 431, -308, 239, 292, -49, 279, -15, -94, 349, 201, -182, 321, 9, 15, 4, -405, 233, 243, -435, -15, 36, -254, -96, -173, 116, 82, -249, -56, 358, -255, -171, 131, -201, 133, -135, -309, 320, 136, -313, -150, 67, -141, -103, -316, -27, 167, -253, -150, 209, -62, -11, 80, -86, 392, 149, -322, 481, 246, -172, -85, 108, 201, 9, -270, 220, 372, -210, 116, 237, -73, 194, -65, -55, 200, 97, 8, -45, 23, -41, 20, -92, 173, 50, -378, -63, 101, -38, 53, -156, -187, 174, -182, -211, 228, -169, -99, -29, -223, 236, -120, -456, 270, 72, -397, -82, 170, -4, -180, -216, 203, 308, -258, -28, 276, -159, -82, 16, -18, 145, -35, -241, 281, 81, -339, 49, 298, 94, 186, -199, 255, 106, -138, 95, 261, -176, -13, 202, -110, 283, 9, 2, 221, -266, 55, 250, -268, 113, 132, -148]
2290a48K12K89n05J60k3R1o6j33K5M60n24mJ2Q7L32l91k49N70j56l15K70J71j55
2313A0k18Q9K55J86r14N87M25o81J03M05k63L28m10j25N32l15j69M05j82o3P9
2334F4j30L29m5n79N27J40l24O7J39k89J13j03K21N1m19L51pn79O65R2n69O0J92
2357c3J35j47K17l75M38m72k7K57m9q0J08Nj13Q5k57N18n5l24L4L07k85k9q4L39
2381A13kl44L80J43l75j00M53l03J49j75J06L07m49m9L60k73P3J39j49N4M1k31
2403a32J7L94n10K74J25j53pK9K7N9j51P8J83n11J70K54l60K15ml1M7k49L48m1
2427G1n65L56L95k94j68L06r6O4k26j83M84m1l13K33R0j05j48KK66j45l06K05
2449a18N33o44K22K44k34J04m6j2K94m98J04K64j44o5K45j16m2j12J00J5Nk49
$$ y = [-148, 64, 353, -152, 8, -15, 76, 10, -123, -98, 362, -162, -166, -154, -67, 265, -126, -375, 195, 39, -276, -6, 165, 10, -208, -119, 136, 322, -592, -5, 420, -261, -158, 247, -16, 312, -98, -223, 309, -6, -175, 230, 48, -15, 64, -66, 263, 218, -361, 166, 306, -18, 49, 188, -101, 12, -91, 130, 181, -238, 113, 106, -473, 192, 284, -285, -225, -33, 102, -45, 172, -203, 235, -237, -264, -7, -56, -136, -28, -23, -136, -51, -308, 210, 155, -169, -135, 172, -113, -142, -226, 113, 111, -233, 147, 290, -85, -185, 268, -35, 114, -61, 45, 352, -97, -146, 214, -59, 14, 153, 4, 58, 99, -132, -115, 279, -231, 43, 168, 15, 8, 37, 64, 123, -28, 50, 233, -278, -108, 146, -214, 1, -3, -34, 13, -236, 112, 71, -494, -138, 257, -37, -205, 101, 5, 69, -157, -340, 144, 103, -210, 23, 113, 8, -140, -138, 128, -17, -323, -118, 415, -229, -7, 237, 3, 107, 61, 49, 343, -155, -51, 213, 69, 4, 249, 133, 91, -21, 79, 94, 99, -150]
2471a50L01po4J71j47l39L70j85J59L0l84K54J17j65q9L32l31Q9j06K90n6j66
2493g6l36M72l11p0L62p0q3j18q9L93%l85L15J49j99q7K10R7L0k64K5J81k80J20
2517a4K63k52M3R2j55K90j76k55M71m59J42L39m40n0L33k09J97j14j84M03j95
2538G0k55K42L8q8K2r0K07J5k61K01J60n04J66J39k23J44o3J0K71m44K8N01m45
2561a59L0K16k77J31j09KK98j6j72Q5J26l73K83p2L9J9m02L87J43l43J29L21m55
2584a69N2K09m1K3k03K86J65m80J40K37l25K76j08n3o2O0j50L32l4l49K68nl1
2607C8j10R2j11J65o1N5Q1j91k14L93k47R5n1oK33j03n0K3k37J31K04j05o1M3
2631Fm6J28o7l32L21n6j31L37j48r6K51k39k1J56q7O0N3r2j28K88j38Nj10J4K95
$$ y = [-150, 151, 144, 80, 251, 104, -235, 135, -50, 109, 139, -245, 9, 126, -39, -128, 204, -127, -38, -144, 146, 90, -76, -412, 60, -251, -321, 41, -29, -112, -230, -319, 74, 74, -311, 4, 153, -46, -133, 77, 174, 204, -60, -35, 146, -134, -14, 249, -3, 40, 132, -23, 267, 91, -164, 307, -152, -10, 329, -111, -161, 172, -37, 160, 46, -138, 265, 70, -185, 57, 95, 7, 29, -61, 146, 161, -100, 101, 261, -243, -77, 62, -161, -17, -80, -70, 201, -243, -215, 286, -159, -129, 87, -190, -59, -168, -166, 132, 116, -56, 29, 155, -218, 65, -7, 32, 51, -351, 36, 179, -164, -35, 286, -169, -117, 92, 51, 74, -129, 157, 322, -158, -18, 219, -106, 170, 62, 9, -53, 7, -143, 189, 155, -194, 74, 69, 38, -72, 20, -91, 74, 13, 68, 149, -42, -256, 137, -110, -15, -66, -72, 161, 58, 8, 31, -206, -75, 129, 24, -37, 6, -40, 88, 21, -311, 10, -46, -177, 160, 12, -84, 167, -72, -93, 63, -24, 36, 89, -3, -131, 157, 19, 24, -86, -72, 223]
2656B23l49R5J46m1j11Q9p4J06o7l02M80j55o3J86k56J20R5k63R5K21k13K8J48
2679A38k45K88j18l02L77j32j35J97k91r5N70l75L2K24k20J6J97j91lp2R4K15
2701A69k43k08L85l56K79K9j49p7K59j32J8K64k06j5N7j47Q9m8J78P1k50o0K02
2724A09q6Q5J10l17J73P6j75K35k78j3L45l74O4K00k16NJ26l21K95n7p9n2m8K4
2748a69K27j71l1K12j34oK70m78R1L02m01L22j22j65L11k02Pk1J94N5m4j11K2
2771d2K51l54K48j56k1N1J38k37K28j02j57M76l29r9J30j19K11Pp0kJ1j40J30
2794E3j8j32K08l01N4J90p0oL60m60J78O6j89O3J33j40l8J39j46J78l92J07K26
2817F3j06k43L72k14K13O8j04j34J82l14J44L2p1n1N1j0Q9L7m8K07k21m2K21q4
$$ y = [223, -126, -31, 115, 74, -37, 52, -22, 84, 17, -285, 195, 40, -23, 163, -93, 27, 122, -141, -46, 175, -38, -10, 138, -107, 181, 63, -239, 138, 6, -129, 68, -223, -318, 252, -123, -91, 133, -87, -71, 126, -65, -68, -140, -46, 169, -74, -282, 103, -253, 26, 55, -94, -171, 88, -44, -26, 238, 32, 17, 74, -73, 16, -32, 146, 217, -33, -93, 109, 23, 108, 218, -99, 74, 150, -25, 210, -68, -81, 264, -110, -46, 154, -62, -57, 69, -252, 43, -14, -93, -145, -193, -169, 58, -113, -144, 68, -66, -72, 198, -280, -189, 113, -288, 34, -88, -253, 58, -144, -137, -158, 36, 91, 47, -64, -42, 209, -145, 103, -53, -74, -23, 115, -122, 106, 4, -153, 323, -6, -105, 25, -94, 117, 124, 54, 52, 63, -77, 53, 35, -97, 111, -190, -136, 54, -16, -22, 338, -122, 56, 122, -67, -4, 129, -11, -49, 90, -56, 122, -270, -163, 63, -43, -286, 86, -128, 85, 153, 49, -85, 97, -217, -73, -41, -112, -163, -112, -122, -33, 4, -44, 163, -58, -100, 121, 37]
2841C7m8J28j66K46k30m4K76j82RK25j80k01K53j08l5J53k70J24J53k98L40o4
2863A18k34K36k83J27L7j91R4J62l02M5K04j33QJ67k37M07m92J63Q9n2o3R8P4
2886D2q8l5j46K39Q4k86K75k38N0K17j68k04L39j78j2K09q2PJ98k17m3k7L0O5
2910C1J79l36K53J23j60j2l0j73L54k51j32L1O9K16k26j7J23J13l12K05o4j1R6
2933F9l53K00K97l48L2P1l8j00K52j81J49p3l30M48l20m9K47j05M3q1K53J18l32
2956a31K9J54J51k90P6R7o4J08j37M0mj19Q4K33k27pJ41j64J25M3k17K50j02j79
2980a10K85q0j77K51j62n4P8l04M35j22j76K10p1j93J46j4j83K39j40J98P1j55
3002b8p3K09m1j46P1j46K16j9j72L35j76j99Q6Q3j46LJ25l2P4k14J14J92j82J08
$$ y = [37, -11, 117, -49, 197, -33, -77, 199, 17, 26, 251, 71, -130, 123, 15, -20, 133, -137, -13, 140, -158, 182, 118, -116, 120, -163, -36, 1, -190, -96, 66, -236, -191, 13, -120, -112, 55, -182, 225, -267, -104, -15, -67, -130, -32, 42, -46, -81, -227, 12, 96, -190, 85, -153, -103, 114, -54, -258, 81, -97, -109, 100, 18, 25, 223, 6, -37, -64, -34, 31, 210, -126, 127, 250, 90, 78, 48, -125, 229, -22, -154, -123, -54, 162, -64, -81, 42, 155, -157, 48, -16, -27, 69, -284, -84, 213, -135, -103, -32, -70, -170, 82, -99, 50, -23, -353, 95, -225, -274, -27, -132, -89, -170, 83, 201, -131, -102, 52, 203, -87, -11, 86, 22, 130, -7, 33, 29, -90, -6, 227, 0, -7, 134, -30, 95, 138, -79, 171, 69, -110, 175, 95, -82, 169, 7, -47, 31, -273, 162, 40, -136, 74, 3, -190, -44, -58, -241, -2, -142, 56, 127, -28, -101, 108, 67, -79, -8, -154, 62, 43, -129, 206, 30, -169, -83, 0, -146, -143, -18, -50, 24, -190, -76, 116, -66, 42]
3026D2P5l26KJ67m5O4r0j0M46l69L9K03j94K7p0m5J76j44R0J00j31j15J20J06
3050A18OO8l14L62k08j06K14r0k09J95O1j82j6j62K34l8q7J08l3k8P5l0R7j63
3074a28No6K91k04l3K17j27j61K64j79L10j45k99K79K8k22J90J81k73J47j85J39
3096B9J78j69j61K18j5l9J04k57J56J83k40K74k02j60K50j26oM2k1l7L5j85K27
3119G8q3j16K68j05l07K21J52j91N4r1J45j22k5oJ79j80O1L8J8k6m3m5K36k39
3143a29P4Q8j61K04m0j30m1M5j65N51n5m15K13R3k77J68q5o4L15l16J91J54k59
3166d1n3K13k06k3K09j6j14J24l37K35J35j37J25l8Kr7r7J76J14l36M08j46k52
3189a52L5J18K4j35p0%L34K0j08Q3k65J59l7p9K4q6J06J86l18K4J10j9qm9L9J5
$$ y = [42, 117, -209, -207, -40, -85, -21, -111, -121, 325, -44, -5, 198, 4, 31, -39, -84, 92, -52, 38, 138, 7, -108, 12, 118, 124, 192, -122, 240, 32, -74, 140, 50, -159, 36, 97, -85, -101, -263, -29, -67, -154, -46, -79, -107, -32, -62, 35, -128, -123, -189, 102, -102, -135, 82, -45, -206, 58, -121, 189, 44, -255, 24, 52, -170, 20, 201, -72, 75, -110, 29, 207, 38, -123, 95, 80, 41, 145, -112, 44, 227, -13, 261, 59, -101, 149, 23, 17, 59, 38, 1, 36, -149, 78, -5, -121, 147, 42, -265, -44, 108, -83, -29, -120, 25, -97, -122, -128, 51, -129, -68, -30, -12, -38, -81, -126, 110, -129, -55, 33, -128, 76, 36, -94, -135, -90, -255, 296, 241, -174, 39, 132, -145, 23, -62, -126, 189, -127, 64, 218, -41, -94, 119, -87, -110, 99, 83, -31, 93, -244, -9, 126, -11, 114, 76, 78, -19, -116, 60, 174, -162, 246, 100, -152, -117, 1, 25, -110, -180, -180, 154, 174, 66, 149, -116, 43, 6, -73, -49, -135, -29, 157, -161, -137, -27, -46, -54, -103, -64, -49]
3215d9j2q1K79k38j2J19k2n9J19K03k96J66o8m2J93q9j96J32j27J63l0j99R3j6
3239f9j39K93j19p4J72o4P7j9j75LJ37k13K78j18j35K01J60l06KMM3J23j49r8
3263a85J97j30J80k0j95R4J23q3N2n0k96N07j96p9Qp5K05R5k11j57L07j4rj36
3287f8J9pJ06N0j90R0J34N0l00J63j10l1J38l8r6K9K68l00m8R9OK44j67p8K49
3312B12k15LJ18k0N6k38j34M09j29j23R7j00J38r9l3q1J19m7N6n0n7K21l1k00
3336a28J95Lj33JJ25j63R9k12L18j18j61K91j45j68K25P2p7J98l40l6J95l8OM2
3360E1r3L07j08j69J79j2k56J00O9k0J28j03L8j48J98j23j01O6o2R4j12J39K5
3383H7j10m2K09j90OP4k22J82N9j62K04j29R0m6j01o6J41j94K92l7j23P5q6J46
$$ y = [-49, -61, -142, 137, -101, -113, 6, -16, -75, 44, 247, -49, 117, 49, 7, 200, 111, -85, 47, -80, 83, 53, -146, -53, -69, -208, 85, -34, -108, 64, 0, 77, 58, -117, -114, 23, -190, 88, -30, -165, 36, 196, -110, -108, -104, -61, 62, -87, -185, 12, -118, 62, 42, -153, -59, 64, -19, 33, -17, -313, 194, -2, -81, -73, -148, 57, 152, -59, -216, 91, 77, 68, -68, -49, -56, 50, 100, -90, 0, 134, 184, -116, 47, -63, -94, 44, 6, -90, -61, 207, -93, -141, -42, -36, 208, 41, -37, 212, -3, 0, 118, 98, 154, -84, -218, 191, 62, -61, 36, -64, 74, -25, -58, -139, -20, -67, -11, -61, -118, 103, 72, -128, 67, 70, -63, -62, 63, -100, -1, -213, 105, -13, -174, 117, -28, -196, 29, 101, 24, 222, -118, -154, 41, 3, 9, 51, -42, 265, 157, -12, 167, 155, -101, -1, 68, 48, 176, 73, 111, -37, 161, 38, -63, 3, -59, 35, -77, 62, 87, -23, -65, 144, -46, -40, 34, -188, -6, 53, -109, 95, -34, 56, 10, -91, -157, -16, -210, 82, 45, -78, -3, -89, 57]
3407E7q4q4n8K99j35j65J95kj6J08k35J44k7j14L04j77p9J69k05K95j37o8J58
3430A43M4m9j47J69k28Q0M9p2J74k51K41m0j02J32q0l88K83K57m92L58J2j72K78
3453A99k27k5J64j77JK5Op2J92k90L26n2r6k7K5m9J08j17N0J25k96K29O5k86n0
3478b49L64k11K42j59lJ31J3j82K72l4l02K07j14L6pk24M29l3k88J83R3k38R0
3501A6m7j39M02k04j2j3M2J01k18l7N8J78k71J00L05m57K40k54J78R6j31m6rM
3525a18j8J61o0R2P2l36L54J39k98K0J7m4P0j88J85J69l02K9K32k17L6K07j85
3548A7j06Q3l04M92r3q1K3N9p9j5r4K67k21P6r4K13N8j01j7k47K83k13K04l3j58
3573h1P1j25LK15j46j36L52j69L9l2q2J35Lk69J05J43j25K7o1q9J95O2l12M65
$$ y = [57, -27, -111, -169, 130, -5, -170, 25, 23, 7, 115, -120, 24, -3, -117, 187, 10, -69, 100, -105, 190, 53, -15, 143, 187, 138, -9, 160, -68, 12, 61, -11, 163, -88, 153, 113, 11, 143, 63, -325, -42, 215, -277, 81, 93, -79, 199, -28, -53, 111, -66, -65, -40, -34, -106, 86, -204, 122, 70, -26, -53, -28, -77, 31, -86, -36, 89, -207, 22, 87, -199, -249, 115, -96, 146, -13, -16, 115, 128, -54, 218, 184, -118, 89, -25, 11, 4, -220, 209, 176, -112, 71, 164, -74, 16, -31, -170, 232, 28, 16, 3, 45, 146, -72, -109, -51, 127, -144, -44, 261, -196, 44, -210, -32, 64, -67, -113, -122, -118, -136, 25, -35, 57, 129, -207, 147, 286, -12, 8, 25, -19, 51, -137, 48, 217, -85, -56, 176, -41, -5, 202, 17, -89, -6, -310, 182, 89, 8, 31, 90, 11, -4, -98, 169, -52, 24, -70, 143, 201, 100, 83, -164, 119, -94, 110, 77, -81, -10, -135, -132, 83, -63, -199, 153, -16, 23, -9, -91, 44, 47, -222, -117, 26, -99, -72, -133, -222, -27, 35, -277, 188]
3597A88p3k59kJ09J68n6l19K73R4l64L19p3L9J08k49J34N8r7k7K31j17q2Q7r1
3621aO4K39l10l1L3N1P3j31m7J67Q1j35R4k29J52J09l77J20M2j00L29j76o3o8
3645a14k1j1J8Q3m9K54k55j60K79j80J2P1j21L05r6k59K67Q4j32N6J45k83K6q4
3669a65O2K17l30J75K80k61J61O1k92J80j20j52L26j52%K60j50j70J06P7n1m8
3691A4K1P8o4j12K34r0j28J57l0K2j02k2P6L6l54J80K14p0j49Q0j48J08k28L16
3715C9K35k63j96K49j82k3R8Pl0o0kJ78P1l74K01%o8K30k28J35J19k38L4O6J88
3740A86r0O5j70KJ19j63O5j53K14J51k71J08j40P7N4J32l15L1J16j2j8M9j93J87
3764C1J27k15K78k70J36K02m89k1M40k77lq7j30L04j26K19m3n1k4J15j09j29K27
$$ y = [188, 115, -144, -146, -37, 131, 75, -244, 29, 123, -241, 78, 5, 44, 152, -97, 37, 95, -2, -29, 202, 85, 3, 90, -1, 63, 302, -8, -39, -6, 45, 118, -13, -60, 107, 188, 53, 147, -82, 70, 179, -198, -78, -36, -136, 193, 17, -46, -114, -135, -146, -128, -45, -94, 160, -95, -255, 24, -156, -144, -73, -194, 111, 15, -244, 23, 107, -25, 31, 176, -107, -81, -165, -103, 114, -216, -41, 239, -22, 139, 200, -92, 88, -32, -184, 142, -10, -10, 250, 100, -70, 36, 113, 62, 14, 35, 113, 49, -63, 171, 81, -47, 110, 80, 102, 0, -22, 54, 90, -264, -84, 130, 60, -89, -9, -157, -49, -277, 39, 274, 11, -185, 64, -118, -141, -43, -36, -66, -126, -128, 50, 121, -253, -52, -52, -120, 110, -118, 17, 136, -102, -68, -2, 186, 96, 161, -9, -7, 112, -51, 14, -139, 75, 226, -45, 63, -77, 0, 54, 186, -129, -98, 18, 6, -12, 37, -156, 31, 158, -57, 221, -49, 87, 289, -200, -221, 219, -58, -61, -148, -278, 26, -100, 119, 76, 25, 1, 116, 7, -122, 105]
3787A05j19l8l3j17J30L7Q2j3n9J57j00q0n9K71o0j64R6j13J20j43J3K25k9j73
3811f4K64k17l8l5k2K0J76kL9J3j29l6K00k55J56R1k01M2o3O8k1J2R1L8j60J85
3837A52j02k37J84j35j83L75r0j33L12j49j12L15k42J1J12j90K16k24J16j18J46
3858B4m9J6J65k48K66k65J1K33k41kJ60j55J70R5j85O2P1j74J73j49j5K03j24
3881D2OJ03k46L15j81l4J27j99J02O2P9k95K14Q0k57J08q1k11L06l8j36M2R4R
3905A1K59m24J23o0j77K86pj29J83j10q3J48k66J33K72j62J56m5l17L16r5j46
3927a34K02L6l7o4j25J50J61k04o4Q4R2j10n7L8J77j67j5R4J2k02J55j64K9K56
3951A43j64J01j11j65L55l8j60R8j07N4l2j26K06O4j87l5R0o2R3Jj08L06j49l42
$$ y = [105, -14, -52, -85, -202, -72, -35, 47, 34, -25, 132, 32, -48, -107, 164, 104, -60, 36, -77, 43, -100, -87, 138, 109, -64, 200, -17, -55, -90, -112, -92, 84, 82, 121, 134, 5, -31, 169, -86, 70, 161, -40, 2, -61, 7, -14, -2, 89, 127, -33, 152, 50, -187, -3, -138, -321, 54, -36, -169, 143, -6, -118, 197, -45, -34, 78, -112, 104, -120, -4, -122, 24, -25, -9, 156, -92, 174, -91, -80, 153, -88, -90, 70, -85, 85, 180, -5, 57, 128, -46, 127, -22, -37, 166, 42, 48, 151, -95, 220, 39, 5, 132, -67, 35, 97, 176, -119, 95, 175, -82, 26, -55, -266, 40, 2, -134, -92, 2, 11, 270, -154, -31, -91, -268, 18, 11, -118, 65, -45, -128, 20, -246, -113, 159, -3, 153, 108, -209, 107, 12, -134, 68, 104, 67, 3, -122, 28, 189, -15, -79, 5, 97, -13, -70, -32, 145, -22, -37, 57, 69, -133, 22, -142, -113, 143, -21, 80, -31, -196, 159, 121, -39, 59, -48, 6, -26, -152, 54, 118, -69, -104, -14, -76, 17, 18, -90, 216, 67, -275]
3975b75M13j80J75j82q0R6J06n8PM7p5J72j52J9j01K36k28J84k92mL35j67p6J84
3999A04j17O2K05m00K27O8k24K42m8k06J27k58K29Q0L6k49J91j32m9J34j65K96
4021A53j29m8J82j10o1q8l1J01n9P2o5J49J4j71L8j47L04j30j06J33j4J8l5P9
4045D9R7k75j21L62oj57%J90j37K10j73j17N0K05j80O5j08K65k75P3O7r5q5J70
4069G4r0N1J09m0r8R6o2l7N0j44J76J48k58J10m6N2o0K03l17n1K21j07Mp9J04
4094IJ58j27r0m0P6R0j39j19K88o5j98K22j57j10K10j09K52L5l91rL70j45J38
4117A49j98j07K00q8J44m6k45K2J89K41j71j10J19j16P0j44O5J48j47J50q9pJ52
4140A81l02n3L32j63J12j33N1q5Q9m7J22k28K0J46J2j23N4j36J03j5p0J92j88
$$ y = [-275, 138, -42, 133, -49, -129, -33, 73, 15, 22, 69, -6, 166, 14, 33, -68, 168, -60, 124, -168, -172, 163, -4, -80, 104, -13, 49, 254, -146, 81, 149, -75, 167, 119, -87, 40, -218, 11, 91, 127, -122, 69, -63, -112, 22, -143, 153, 24, -24, 158, 48, -13, -101, -132, -31, -90, -18, -83, 66, 80, -91, -53, -200, 104, -26, -132, 1, -13, 5, -30, 49, 146, -129, -250, 112, 106, -51, -51, 139, 2, 212, 39, -78, -28, 177, -3, 62, -46, 219, -56, 17, 84, -11, -96, 74, -16, 35, 144, 104, 6, 102, 40, 3, 53, -91, 85, 233, -25, 85, 39, 91, 31, 234, -83, -134, 87, -20, -16, -95, 9, 167, 40, -50, -90, -14, 76, -63, -182, 106, 41, -157, 65, -92, -202, 8, -101, 151, 186, -205, -214, 156, 11, 149, -49, -156, 44, -44, 100, 54, -191, -169, 20, 261, 90, -20, 99, -17, 53, -91, -26, 122, -25, 125, 36, 29, 181, -121, -174, 158, -5, 107, -26, 25, -60, 29, -18, 104, -124, -104, 42, 54, -69, -15, -151, -48, -63, -133, 59, -129]
4163a29L7R8P8j79K65l44Q2K04p1j45O1j90m3K34p3J03J23j91J69k14P0J83p3
4186E5j84K49k02%J13O3j25o6J76Pj28q7J89qj24K02q5n4J69j46n8K26j07j86
4210a11K07k42L06l0l02L41j79r0N5O8P7j04p0J46L2K7k46Q5M7N0Jj73M4l5N7
4235c9l3Pk4j70J33R9K86l55j01L15j45qJ22k46P9%o1L75l34k2J62K4M0O6k61
4260i1J41J06l02N7K46k01L3p2J04R4N7Kj23q8R4L9k57K11J9n6K2J53j89J02r9
4285Br1K69j40j06K54k37m0M4K2M8K7k11K21r8J3J8m6L6j25kQ9l1n8p0Q2J65o9
4312c4o1j5K86k07J3J89n7j07Q3k1p4L0l1J16j08q8J34o3l4%j9l0K43j89j2J37
4338H1K7q8K5j10J43q5k32M73n7j03q6j50N9O2j05J80J88k95K35k12J20j63J1
$$ y = [-129, -92, 6, 84, -95, 170, -174, -92, 112, 41, -104, -43, -233, -276, -42, -115, -12, 111, -80, 89, -125, -55, 128, 55, -129, 120, -82, -82, 31, 94, -31, -97, 79, 86, -42, -129, 60, 52, -72, 130, 45, -9, 160, 14, -44, 182, 75, -111, 96, -146, 160, 130, -172, 169, -10, -100, -45, 23, 100, -4, -74, 72, 104, 131, -115, -30, 17, 67, 68, -105, -61, -96, -39, -72, -65, -89, -259, -126, -27, 259, -96, -197, 118, -27, -35, 87, -159, -80, -80, -141, 234, -100, -122, 40, 64, 104, 170, -91, 50, 156, -146, -89, 157, -44, -11, -83, 21, 115, 172, 174, 51, -37, 57, 96, -161, 50, 69, 13, 35, 188, -1, 101, 2, -89, 180, 40, -66, 188, -49, -89, -45, -23, 25, 52, -159, 62, -36, -23, -5, -51, -15, -140, -142, -53, -84, -142, -212, -130, 35, -34, -95, -110, 176, -31, -18, 171, 114, 7, 90, 69, -5, 25, -6, 110, 2, -86, 48, -15, -49, -49, -68, -98, 145, -44, -56, 81, 108, 20, 45, -65, 78, -7, -239, 234, 177, 74, -12, -162, -103, -41, -146, 34, 222, -73, 162, -50, 70, -93, -82]
4361h2Q8l7Q0k4q4Q3o3J60j77q8J84j64J56k8j61J06MN2L4Oj47O1KO8P8J8r4N4
4389H5k04K9K53k83J37k8P1R3l6M9o5j94M1J04J50k64J89j93O1K4j13J93m4o0
4413el4J05r6J35j23p4P4K6q9J80p0j24j13L2J11P9j28P3K49j85o2j09K18r8j54
4438a82Q5k5J11P1p2l9J24Jq9J68k75J4O4j4J18J41j47K9n3j29J74m4p4K5k6L9
4464eN1J51l1ON3j97J20k39k3J99j82J95p4r9n4M5K0J61l11Q9N2m7J27J64j16
4489E5J7J6j46J44r5l24L66Kj42N7m1n5K31j21M9p8q9J33p9J6J61p1r1K13k36
4514a08JJ68M4j53J07k98L83j0m08L19j6jK3j34M5J19j6P%q0M4j7k9M5k17J27
4540e5R4j5j36P0P7n6J78o8j23N5j66J15J66l06J49J68k30J38o6k34K50N0j95
$$ y = [-82, 6, -31, 49, 25, -59, 24, -39, 121, -56, -144, 40, -124, 32, 4, -157, -51, -47, 5, 39, 45, -102, -41, -39, 29, 107, 125, 31, 85, -119, -90, 163, -120, 17, -11, 60, 153, 117, 166, 101, -93, -52, 52, 202, -62, 127, -66, -5, 19, -94, 99, 55, -5, -39, 66, -30, 105, -18, -92, -18, 8, -81, 99, 29, -95, -208, -176, -65, 14, -114, -41, 208, 23, -39, -148, 70, -28, -182, -97, -122, -11, 60, -12, -51, 73, 74, -15, 153, -122, -108, -44, -58, 60, 201, 54, 83, 30, -99, 75, 31, -43, -18, -44, -5, 46, 197, 166, 172, 225, 28, 148, -91, -114, 85, -97, 98, 24, -75, -129, -84, -64, 97, -214, -125, -73, -120, 7, 171, 55, 72, 88, -58, 86, -9, -333, 33, 35, -107, -50, -91, -146, 85, -36, 13, -65, -154, -21, -100, -84, 77, 6, -85, 128, -108, -107, 61, 105, -48, 59, -239, 144, 134, -274, 45, 29, 28, 51, -83, -38, 81, 65, 72, 72, -8, 36, 19, -10, 35, -182, -55, 39, 24, -112, -42, 35, -21, 157, 89, -34, 21, -145, -30, 136, -170, -21, 147, -83, 55, -11, -245, 5, 55, -140]
4563a40J47j92L00r9j02N9J04k11L4M7L4J18nn7N6n1j90J62Oj6j28K13j61J09
4587C7q8J87m2j70P7N7m0J30k16K0L53j97k1K7j27P4j1j60K75j41j34J98K7j36
4611b1M0j13K3J25k83L62j29N3M8j7j59J65k10Q2J49j77K6o3J10m3J46k01N3k4
4635e8J6Q6k3j88K05o8o1R9M8o4O1j28J1Q8R8k17J62k56L32p9j74P4J3N7j09J15
4661D0k28K62Q4p4O9j98p9L90l31O9P0Jj61O8j97K32rj13K25k44n1J31j18J53
4685ik9j09J70K09l09J20P9j78qo9J41j0l5mk7J18n7O4n7j1K6j46J15L1n6prm4
4713a01J62m7K12j20m6n8P0j67J49M6k5k0l2N1j5o8N5m9J15P2o2k22K52j00J3
4738F5j48l8J51jK5q0J54p8o3O0j2m4k63L62J0k64QJ05m9l5J74j85Q3Q6o6R9n7
$$ y = [-140, 7, -185, 115, 16, -86, -27, 77, -134, -100, -53, -19, 99, 94, 37, 93, 42, -148, 14, 20, 4, -124, 89, -72, 37, -51, 136, 94, -76, 1, 58, 18, 148, -68, -48, 305, 108, 87, 114, -13, 61, 50, -110, 165, 24, -110, 88, 115, -21, 19, -94, -71, 54, -229, 133, 4, 57, 105, 88, -71, 94, -116, -34, 115, -62, -36, -99, 11, -32, 114, -87, -34, -58, -42, 44, 21, -167, 38, -30, -91, 8, 56, -8, 53, -75, -64, 24, 122, -95, 67, -189, 143, 64, -110, -36, -23, 34, -75, 40, -188, 74, 158, 84, 153, -45, -124, 266, -65, 4, 74, 75, -86, -18, -215, 17, 8, -105, 120, -124, -175, -44, -162, -9, -38, -147, 23, 232, -77, 43, 122, -56, -64, -133, 8, -2, -37, -41, -68, 50, -7, 57, 0, -11, 15, -131, -16, 15, -41, -48, -57, -101, 61, 14, 226, 106, 60, 2, 72, -95, 54, 100, 75, 55, 23, 74, 59, -9, 46, -3, 112, 184, 122, -100, 152, 52, 65, -83, -121, 30, 29, 54, -26, 128, 50, -13, 47, 35, -9, -272, 90, 100, -164, -156, -51, -100, -135, 39, -146, -63, 23, -43, 56, -1]
4765ak15L64j97k2R9p4RLJp6J61j13O4k0m5J52n6n8M5J14j71K11l7k02J37q9R1
4792G5j97J46O1P6l16J82J23j62J48k44L4Q3l9p7J39j86P4J36j12Q1q2m7N7Rk49
4817b87K34n4L0K7op6K07L4j65M1K3j12Oj37L06n4j48P4K54k47J26k24%J26n8
4842h0J64l8j20J02M8k75L59q4j71J36J23l27K69p1p6m0N4J8R7j65J53J34j89
4865B1j36Q5M8nj32J73N0j16k41K09o1j20K79R6L3j24j7q5m5J26j38J56j21O0
4889ek15oJ88L3J19r5p9L8L0l2K2R7m2Q7j24m2pr9N2K20k08J54N3j68J21m9o5
4916b2nn0P7M9p8n2K29q4J08j27j86K67j68n0J45j05J87j73P0LR8q9m2jl9k2J08
4943D8L9jl8n1k7O5l90N69r5k87J43l3n6J59j35j51K18R2o3o3r6K88j07j70R7
$$ y = [-1, -216, 148, -49, -71, 28, -46, -37, -34, -33, -109, 52, -61, 3, -17, -62, 90, 34, -24, 21, 135, -36, 175, 138, -64, 73, -16, 75, -122, 24, 85, 161, -155, 27, 150, -12, 136, -108, -74, 9, -30, -107, 32, -154, -80, 56, -56, 25, -57, -104, -47, -38, -287, -53, -107, -77, -50, -56, -132, 75, 109, -56, -15, 8, -104, -98, -235, 71, 17, -131, -57, 197, -50, 76, -148, -148, -22, -80, 84, 46, -74, 28, 76, -199, 160, 76, -95, 41, 164, -163, 106, 35, -41, -81, -27, -9, 88, -77, 76, 210, 21, -115, -30, 18, 13, -119, 54, 104, -12, -253, -44, -105, -225, 54, 150, 183, 59, 42, -43, -88, 38, -100, 56, -65, -5, -220, -226, -38, -5, 114, 19, -60, -22, 8, -24, -2, 95, 53, 140, 16, -26, -33, -132, -80, 140, -68, 86, 139, -29, 92, 43, -22, -27, -77, 0, 49, -29, -81, 148, 64, 172, 45, -141, 126, -42, -92, 53, -52, 135, -38, 32, 35, 133, 44, 2, 1, -38, -60, 48, 87, 86, 48, -3, -30, 35, -355, 214, 119, -168, -25, -58, -114, 45, -90, -241, -23, 69, 6, -57, -153, 135, 28, -142, -45]
4968d5J0m2J9P7J27k06j34L24k44n2K69Oj89J77j48n7J06K0J5J3k0j07R8l9j3
4993c5J70l85K81J37k32K31j47j23L86k67l1J16n6k46J20J8m4r9Q4J58J0j01P9
5016B4M6k59L40r1j13j6Q2j02O2O2r5N2j2J01j53O2Q2l0L7j59J4P0K2j89K70o7
5042D0k7N6j47J09N6k20P8J89j05L4Q7l39J29J63k75K14n8q3O3N3l1J63j47L9
5066D1j22L6N2r7J14j6R7k28R5Q7m5o6r9qJ41l1J57j21r5M9j4Mp9K24j13K15j72
5093FM2R8J01l15K20j34p4MP2j14Q3j13Q4L74m74J19J57l3l2k1k49J84m0o7K56
5118A34k09K58j48J2QJ40j70j68K26j08J36j88J86n7%j22J59k24n2J32R9j12M
5141f4P0k9l8k5PO6o0R4r3N4J46q5q1N5k10K45M8j15N6j25O2J14M5k71J81q3J4
$$ y = [-45, -35, -77, -58, 19, 146, -60, -194, 130, -114, -166, 103, 109, -80, 97, -51, -108, -2, 18, 33, 46, 26, -81, 17, -22, -35, 135, -250, 31, 168, -64, 167, 20, -103, 283, 16, -15, 101, 45, -201, -81, -63, -107, -206, -122, 36, 46, -55, 24, 70, -189, 151, 60, -53, -69, 13, -89, -27, 35, -60, -8, -20, 81, -72, -10, 72, 42, 79, -80, -66, 4, 26, -163, 107, 40, 13, 69, -78, 31, 87, -133, -55, 134, 29, 63, 150, -189, -60, 103, -172, 42, -16, -99, -36, 17, -14, 149, 2, 41, -81, -45, 7, -90, 24, 8, 105, -123, -28, 59, 14, -52, -151, -159, -18, -49, 108, -13, -108, -59, -73, -69, -148, 76, -37, 178, 6, 48, 146, 247, -68, 152, 18, -56, -52, 20, -94, -11, -124, -40, 334, -140, -21, 136, 103, 71, 50, -199, -15, -55, -122, 134, -75, 183, 35, 47, 55, 195, 25, -143, 83, -25, 111, -77, 109, 52, 52, -70, 89, -135, -187, -55, 44, -68, -64, 6, -23, -61, -86, -79, -13, -73, 21, -72, -18, 128, 43, -38, 17, -193, 52, 100, -15, 41, -84, -22, 92, 137, -134, 47, -36, -22]
5168b2J64l53J92M8O1l3oK0Rl18L33j05J5M4K5m9K48k11kP3j6j67l0J28Q2q3j39
5195i2J92j8j08n3K35k56N4R9j00O0l4o4O5J11j97J35j35J50j22J16J5m3Pq8J69
5220I8j45K90r7j15J45q2k48J47j32J84j1M5j14K78k33m1j3J41%q4p9J50o1N5
5244G8l1j75o8L27k83J23p0J27o0R7p6J51K2j47J5k0L8L8j32p2J67j45j6Q2N3
5269B3l3k8j8J30j14L7rL7j0L6j56R0p1k3j26K55j47J4Q5j76K46j46N2J03j2r4
5295e5J98j25j79J60J09j33j00L0o1M52k21K1J3j23j17P8K59k03j11P9J13p1J74
5318A87j40j29NR0p4R3Jj74K22j40R7l9K2n1O5p2P0j6j5M3m5jj35J06j20L13k49
5345h6q7K30m9p1J60k04L58j99oJ82k49nJ71j46N2j5P9k13K02n0k58K10R3M9j51
$$ y = [-22, 142, -211, -19, 29, 90, 57, 51, 71, 80, -238, 95, -10, 5, 49, 74, 25, 273, 62, 60, 133, 117, -50, -80, 48, 130, 47, -92, 100, 82, -26, -79, 156, -100, -46, 53, -47, 13, -21, -85, -20, 91, -106, 29, -106, 44, -78, 38, 53, 10, 17, -71, 98, -47, 243, 146, 31, 176, 94, -154, -7, -139, 45, 34, 79, -35, 243, 10, -31, -44, 97, 97, 13, -66, 84, 23, 78, 47, -128, -196, 131, -152, -29, -99, 28, -32, 65, -11, 140, 162, 15, 30, 10, 48, 86, -46, -118, 49, -96, -112, -30, 23, -10, -38, -56, 74, -40, -3, -12, 25, 15, 51, -105, -15, -86, -109, -235, 20, -127, -113, -28, -204, 42, -104, -52, 51, 39, -55, 143, 18, -161, -1, 108, -25, -125, -95, -156, 296, 75, 96, 109, -14, -131, -53, 206, 3, -108, -29, 84, 13, 187, 47, -82, -77, 13, -61, 32, 33, -141, 81, -59, 38, -1, 21, -30, 35, -37, 33, 17, 2, 45, 0, -1, -136, -30, -150, 163, -86, -173, 57, 8, -63, 97, -107, 251, 52, 46, 228, -21, -26, 145, -1, 51, 36, 115, -98, 104, 54, -204, 6, 99, 148, -3]
5370cM5lK57l86J55l3n3J38M0m0j92Q4M5p0J5p1J65pm4n0j23M33l29j11K97k08
5396d9M3jn2J6O1j64J19K6j45J04N0L8p3J64j89J47j03pJ26k16O1j6p8J0K61j57
5422b4K28r3j85J86L1k56J77j64o1J61q2K54Ql79J15J07j87K37j47J83o8j74J48
5445A5j6j68K07j69K36j08j8k5J38l6Q4j27n5K3l9j06J08J92k48J64Q3j23r5J2
5469g1j15J28J57j29K48k56k2L2m5q2L1o4K41q2j47M6K21q0Q4l4m5N3l1n7mP3
5495E0L1P9k33K00q1j84K29M1k07j4P6J30j16j6M0R7k76J37P2j8j29J86j52R5
5519C7L2j57J51j39J46j03l4n7K41n9L8j76N4J20l2m8j28Q4m2J66j22J1J21k1
5543H3k30J73m3j25K22j21J15P0r5K7k01K62m6k8j2Kl8j56J1J8J59j77R2O4j02
$$ y = [-3, 42, 39, 296, -90, 65, 32, -21, 117, 157, 117, -75, 9, 54, -16, -1, -72, 93, 86, 42, -8, -131, 302, -27, -138, 159, -49, -6, -7, -59, -43, 18, -146, -27, -1, -146, -42, 8, 46, -27, 137, -52, 95, -8, -15, 111, -105, -44, -60, -138, -128, 133, -24, 204, 111, -74, 112, 143, -113, 64, -100, -161, 0, -82, 172, 180, -199, -84, 23, -164, 73, -74, 109, 41, -133, 15, -1, -169, 38, -131, 105, -3, -21, -46, 92, 56, 140, 13, -42, -19, -58, -164, -56, 136, -112, 52, 135, 12, -83, -71, -186, -58, 99, -30, 218, -38, -60, -28, -73, -155, -124, -188, 53, -29, -176, -130, 91, 11, 95, 61, 16, 69, 38, -19, -23, 50, 81, 160, -73, 127, 46, -138, 91, 132, -75, -89, -13, 117, 1, -15, 25, 122, -154, -17, 55, 37, -92, 94, -58, 37, 69, -88, 63, -76, 70, -33, -67, -124, 117, 58, 96, -80, -26, 94, 62, 14, -114, -30, -72, 94, -28, -17, 104, 83, -147, 26, -17, -142, 80, -41, 74, 144, 49, 76, -125, 137, 91, 63, 51, 53, 15, -141, -130, -112, 47, -130, -38, 26, -76]
5568g6K4R6K54j66l46K61J8L0k8n8O4j40r6K07j13J02j55l4J22N2j17J38j88N3
5592i6O0JL8j19K71J7p5j32n3q2k2K82J25k35No7J34k54K03kJ15k89P0j5J28K4
5618C2p6j19M55l22n5J17M0J09Kj69p0K47l54J88m6J89j94R9k29L02k26p1N2k5
5642a24l9J55n5K08j96k28M74k36k42L84r8l5oK1J54p0k02N4J19k3N5o4p9J50
5666G7o4j07J86j63M8O5j24j03K45MkK2k94L35j23o3pJ1J00j3k5Q1n2n2K59j81
5692F0j00P2J10o8Mj69R7O8q6Q7j20J3K5K03l09P8K08k33j09J78j16J15l8j12
5716a42P9q1J05k9K7P2j33Q9o6M4q5J88L2k94J89q8J32nj31J82j7p4j3Q3j38J3
5742f1J57p5j03K31k45P8Q7j0K4k17J98n8q5Q1J35j71p6K17k55Q4M2N6rR4j22
$$ y = [-76, -52, 44, 298, 132, -214, 47, 65, 95, 67, 9, 73, -67, -163, 44, -69, 33, -122, -156, -34, 18, -99, 39, -149, -96, -36, -35, 3, -116, 155, 172, 97, -35, -88, -170, -192, 90, 215, -20, -15, -82, 52, -202, 1, -1, 114, -175, -105, -120, 8, 32, -44, -163, 292, -30, -85, 32, 72, 181, 183, 14, -56, 191, -163, 25, -21, 168, -26, 73, -156, 146, -80, -151, -99, -124, -163, -8, -63, 145, -51, -279, 195, -41, -283, 101, 3, -32, -38, -17, 137, 67, -135, -81, 38, 15, 70, 6, -73, 77, 13, -94, 92, -71, -23, 42, -82, -185, 60, 64, 62, 84, -210, 125, 2, -61, -68, -57, 43, 30, 5, 86, 34, -18, 241, 60, -40, 32, 142, 74, 78, -91, 6, 74, -12, 75, -45, -32, -7, 196, -113, -35, 173, -60, -169, 9, -107, 8, -30, -142, -63, -144, -39, -68, -41, 31, -102, -13, -79, -35, -120, 68, 100, -194, -5, -93, 39, 34, -97, 85, 68, -6, -19, 64, -74, -61, 96, 21, -82, 149, -96, -18, 69, 59, 83, -134, 64, 6, -79, 2, 137, -34, -110, 107, -148, -64, -22, 34, 25, 119, -3]
5767cO6j24n5O6mJ8K09q7j59lQ8kl4J81m2j47j19l0J82J05r4J08k54K24j20j02
5793a32M7K9J38K2o9L8j5k31L37l03K7N9o5J71J25k80n3J47K2o2K5Mj58J15Q2
5818B0K2P8k29J26r8P7P5k03K41p6l4J45l13R3M0j22K03L2j79l6K59k90L27k75
5842a17O3lP3koJ1k20J78nj3J35k39J62N5j22lo8J90j59P9j00O5J37l1q0J3q4
5869i1J61l8q5P5mj0pr6J08p0K6n9Q7Q7j3j19j2J77O3q3j66J8p5K42k45K46k62
5896a45K01n6N1n7R5j19j75K99j16RN7k22L24o9JN5K2l20J32L6r2L96m35N3J55
5921H0j83J76j7j37J49rj15N2r6P9J26k11j1J36p2L62l37m6J3M7J37p4j6k5J59
5946A67j88J2J52k24J70j69QJ76K3j15J31m7k15Q4Q2J29j16K7p3n7L7LL7M4k5
$$ y = [-3, 63, -61, -116, -50, -54, -36, 173, 86, -73, -76, 12, 10, -24, 157, 115, -32, -151, -181, 1, 106, 12, 120, -134, 90, -30, -132, -85, -56, 82, 104, 35, 73, 58, -173, 164, -139, -112, -53, -118, 53, 178, -102, -155, -8, 14, -48, -23, -19, -177, -62, 20, 42, 120, -109, 17, -81, -4, 71, -132, 109, 33, -1, 144, -169, -76, -36, -158, 45, 77, -102, -138, 121, -169, 158, -117, -54, -57, 16, 14, 8, 19, -201, -23, -28, -41, 94, -145, 17, 72, -50, -53, -121, 69, -90, -11, -111, -46, 91, 60, -20, -7, -91, 70, 32, -53, 22, 18, 8, 1, -95, 13, -57, -31, -90, -3, 84, 71, -48, -60, 117, 180, 97, -69, -51, -126, 116, -129, 117, -145, 56, 0, 51, -6, 89, -30, -205, 94, -22, -13, 44, -178, 146, 77, 78, 133, 155, -165, -33, 3, -89, 307, -128, -75, 80, -103, 73, 56, -81, 68, 59, -56, -4, -100, -21, 105, -106, -117, 19, -53, 309, -28, -74, -61, -14, 123, 49, 33, 8, 167, -21, -9, 143, -81, 89, -80, -72, 104, 127, 12, 143, 96, -119, -35, 47, 176, 60, 87, 14, -43, -6, -3, 34, 78, 53]
5971E3M0j41M8m4r2J63j91K52p9P2p9J4q6nK22m44K70l2l1J63j37j36L4K32k56
5996a90J42j8M2J64k82l7K48j50K18j01o6M5j46L3J84l5j77L37j17J0j12m1o5
6019a14K47k18J32n4n3Kq9J40R9j9j93K48j96j9J12r4J57k08j0L8L1o1k3K02j88
6044a31K20l61J30J52r5J07j19J65J05j70J22k73J77P0M7j83k0O1JMl7j57L39
6067A54k04O2Q3j13q0K23k1j58j1J53j25n3N8m8J27r2j0L9L6j3J52k3r5j15M3
6092c1J99k45J05K9r4K40k90Q6L3J6j05j5J71j16O0L8Q0j17k22J09J80j84J28
6115E5j59K14r2J38k07p7K66j45J6q3J04K0Q7j10p0o6J19M4p0pK6j0kR0Kj5j15
6142d7K61k86O5P9K6j93J28Nj5L8l7k5m6k51L27M0j32O8Lo6m2J82r0M9P6k20J41
$$ y = [53, 93, -48, 0, -44, -136, 27, -164, 88, 9, 81, 2, 16, -70, -75, 147, -297, -27, -59, -90, 73, -64, -200, -166, 66, -190, -48, -66, -24, 140, -142, -179, 69, -81, 137, 36, -30, 15, -131, -98, 86, 51, -126, 211, 94, 104, -8, -49, -114, 133, -85, 47, -7, -60, -58, -147, -7, 92, 73, -120, 128, -68, -87, 25, -69, 88, -120, -130, -92, -61, -122, -145, 57, -131, 89, -272, -142, 10, -85, 22, -97, 68, 173, 3, 125, -148, 29, 99, 146, -37, -57, 4, 5, 9, -28, -185, 154, -50, 12, 95, -18, -98, 125, 104, -54, -65, 88, -37, -90, -32, -80, 47, -45, -55, -16, 20, 7, 159, 136, 41, -74, -31, 168, -77, 28, 57, -37, 203, -87, -1, 32, 48, -57, -72, 99, -17, 43, 81, 161, 44, -178, -69, 111, -73, 55, -104, 110, 18, 156, -51, -128, 138, -7, 9, -74, 30, 50, 137, 27, -43, -109, 10, 54, -16, -23, 3, -7, -9, 81, 83, 68, -47, 214, -72, -7, 72, 98, -95, 33, 38, 23, 61, 24, -1, -47, -298, 29, 69, -63, 5, 8, -58, -100, 82, -8, 41, 117, -103, 38]
6169C8j18P4j4K0p8JL8N1J65l33O2J47j29O6Ro7j3J10j90J64J4q1K01j77J19o4
6195A5J44l24K74j21J35l5j27J53l7j25K08j90J58j45MM2L0j53O3Q2j34J19n8
6218b2l5J54m0j30%L4j7j6K27k15K7j2P1j10Q0Nj10J78qqj18p4R5M0N6p4l6J51
6246I3k36J65n2j11J99j09P1N0j85K86j58l8R1j21l7J08P1j09J48j27j33K76r1
6269E1j23K44k6M8l44O4J02j64L48j7j61M3k14O9R2J50j41r1K11j24m5Ln5RO9
6294bk2QO5l5Q5R5j78J58l96K33q1L7q9L75l51pK02q0K7R1r6j99R6j3J13L2j95
6321a27J18p0O9m3j9J84j33J14j51J42n7k0m5j72K16M7k5M0J09j61j5k41K17Q0
6345E7K8j40N2L9J3q4k1J08n9J73k92K93k13LJ8J2NK8J5L4n8N0P2k66j3J30k23
$$ y = [38, -80, -6, -20, 0, -78, -77, -39, 12, 177, -156, -94, 53, -76, -10, -1, -68, -81, 29, -161, 3, 17, -64, 137, -40, 79, 15, 159, -165, 109, -12, 123, 88, -39, 114, 77, -48, 160, -30, 128, -17, -13, 29, 59, -94, -31, 51, -83, 36, -22, -57, 97, 57, -73, -73, -39, -56, -72, 155, -60, -33, -45, 26, -84, -4, 1, -109, 69, 61, 53, -65, -139, -44, -4, 52, -22, -58, 93, -143, 22, -30, -141, 58, -51, 20, 70, -115, 171, 13, -25, 66, -55, -92, 16, 87, -22, 126, -1, -134, 142, 51, -72, 172, 146, 194, -150, -86, 16, -148, 200, 183, 22, 65, -149, -80, 12, 162, 21, -70, 141, 17, -28, -25, -80, -71, -2, -24, -16, 49, 14, 99, 194, 16, 174, -222, 11, -70, -33, -122, 253, -98, -105, 97, 17, 44, 135, 39, -160, -64, -77, 36, 68, -127, -9, -79, -10, -53, -72, 112, -21, 93, -58, 84, 27, 7, -38, -210, 6, 53, 28, 68, 177, 16, 1, -240, -23, 57, 85, -55, -3, 36, 49, -35, -56, 52, -7, 166, -126, 167, -46, -43, -25, -13, -8, 20, 35, 69, 11, 61, 133, -133, -146, -16, -239]
6372b39K78n4J05k4j45P4l1p2J73qk87L99r8j12l1N7J39o6j33J74J09k12r3N8
6396c9k1K45k61K14j93J37mj52K31j63mJ31j49K0j54J64nJ15j41n0K09j13R4o2
6420D9k0k9M3j36J47p5O1l64M38k72K37j32J86o8m7j8qJ00o3m5l7L1j52J35j76
6445b15L20k02J57N5p7O9o4r4j1J87j98J2J45j38R8j18J2P3N2O5pj52j14N1R3
6470aJ29l9r5j10L21l21J59r8k0J48J83k03l7R9j13R5M7j51K7k43K56K3j7j03
6494f4J36p0J17k73K01r1j56K85k25J02Q5L9j89p5K85j79j6J72p1m4j63N3J38
6517cJ90k16K45k68qP8j7J32j51n7J24j20J93j3j4r1J29k6M9p6l9j5Jj02J90p2
6543D3n0Q2J4l1n2P8j70J27j55J85j08N8j74K94q4r3K50j87M3j21OJ57n6j39J72
$$ y = [-239, 39, -15, 90, 66, -79, -5, -36, -108, 65, 57, -230, 169, 71, -41, -72, -15, 124, 58, -75, 99, 208, -4, -97, -39, -60, 185, -76, 138, -55, 82, 78, -74, 157, -6, -10, 121, -28, -8, -162, 2, -3, 112, -29, -79, 130, 17, 111, 49, 29, 0, 43, -93, 54, -21, 40, -324, 114, -158, 79, -53, 133, 65, 18, 0, -8, 92, 29, -16, -53, -22, -174, -39, -215, 105, -97, 60, 115, 38, 107, 43, -51, -62, 125, -73, -61, 84, -54, 44, -74, -62, 11, 63, 128, 121, -31, -145, -94, -1, 128, 89, -6, -116, 205, -116, 43, -55, -75, 73, 256, 53, 16, 115, 2, 97, 144, -7, 20, -223, 33, 56, 39, -64, 72, 2, 119, -154, 47, -44, -200, 85, -140, -38, 47, 86, -103, -178, 107, -72, -88, 84, 13, -31, -194, -141, -3, 187, -29, 216, -52, -60, 18, 1, 133, -18, -75, 49, -71, 122, 109, 95, 4, 133, 107, 156, 80, 41, 26, 27, -75, 115, 43, -7, 75, 89, 58, 6, 84, -86, 41, -114, 71, -37, 21, -153, 141, 57, -36, 214, 27, 70, -51, -45, 112, 56, -83, 89]
6568H9k65J46R4o5n3Q0m2J01k47J67J35j6o6p0L9K3q2J59j99j27J31J90j71J67
6592A18Q6j69p6O8m2r9J44j11L7J2N0K3o2L3N8LMl0p5P0l9j11J14K8R4k2k2j03
6620a9q7K74j30j61R6P1Q7r0j95L40l14n0J58N9k4m3Q5r1O7j40J48l9J02k51M5
6645a02J38j8k5RJ05k28J48J7j24j3K25r9j24oJ6J48p2lJ04j42K0m1J36l0K8n1
6671A6J9r2OR4k15J73J28j59J2j13K46m3j0j70K5M8n7J38P6K8l17P2J74j52j26
6696a99J67pK8J04n8q6j4M3p3J40k5M7j0j28L6l6j17J67J07j53QrK53j99J07q6
6722Gj24J82N9o1o6r4J11J05o1o2j08J21J84j32j08r5J23O4N0j76K42k46k5m5
6746a55l6O7J83J4k63L0K15q8k1N2l0P1rr1oO2Q3j56Q8n6Q1N4l02K21l6k2M5q2
$$ y = [89, -176, -30, 64, -1, -54, 26, -16, 85, -162, 5, 140, 124, 58, -12, 27, 50, -32, 127, -72, -199, -68, 122, -49, 118, 204, 35, -41, 27, -15, -114, 30, -81, -44, -32, 18, 41, -21, 12, 70, 73, 77, 47, -28, 42, 3, -108, 6, 34, 128, 106, 84, -19, -106, 168, 38, -123, -27, 44, 131, 41, -154, 186, -128, -178, -20, 39, 15, -28, 57, -34, 33, -107, 41, 2, 104, -147, -102, 36, 18, -7, 2, 107, -121, 27, 44, -80, -93, 132, 33, -91, -97, -81, 67, -5, -8, 96, -46, -26, -67, 69, 39, 67, 16, 35, -57, -51, 43, -172, 1, 129, -30, -18, -131, 115, 72, 62, -108, -83, -35, -92, 46, 122, 150, -167, -95, 79, -73, -199, -32, -39, -11, 93, 35, -51, -65, -22, -95, 45, 20, 67, 57, -71, -35, -71, -188, -21, 86, -67, -59, -68, 185, -14, 93, 7, -117, 65, 124, 63, -3, -97, 14, 119, 58, -4, -112, 9, 193, 61, -47, -142, -19, 45, 95, -81, 161, -85, -110, -155, -191, -124, 59, 73, -190, -160, 55, -33, -54, -2, -32, 39, 30, -61, -67, -5, 78, -78, 10, -46, 35, 89, -213, 8, -28, -50, -5, -87]
6774h7L8L0l7o2Q0P1p4N9N4k53K14J14j39M2o0j36N6j3J59P7n5l04K61O9q9p0
6800e5l2O0l2lN2j06M1J29o9j15P2J94o2K4J59k37l0n1M0J8j30J28j11o5K11l8
6826hJ06o3j33M9N9n5n3K64k59J9J4J5kJ49q2M8r6LpN0n2J58J5j84J36l2l9p1
6854e1L3J34K2l6m2J1j07J46n0K6j75M0N5r7J42o8m9n2J89l6l6J0n5q2K09r7p5
6881i1j0J04O2p7K4k07J52j50L40K0j75j42Q3M3J6Q9j09J12l06K67j55m3K09P0
6905A26n7j55K6M0O0o7J15kq6j4J17j9J05k77O7n7J25qJ0j63R2K3M8o6J43M8l15
6932a41J02J87k10J59Mk24J43m2m2J00k0j34O3O5j15Q2Q9j1n0L7M0r3n4J13l6
6957A2J1J37k15n5J32j59K04j32K01j23l7L8j51K30K8L9k52L1J10Q6q1m0J21j26
$$ y = [-87, -49, -19, -56, -118, -38, 33, -41, 18, 72, -181, 33, 147, 8, 50, -10, -146, -90, -103, 56, 133, 78, -226, 35, 104, 15, -55, -87, -27, -59, -62, -10, -116, -75, 54, -15, -130, -58, 136, 74, 98, 257, 20, -10, -61, -21, -3, -133, -5, -116, -181, 30, -8, 98, 35, -98, -49, 10, -45, -98, 166, -93, -74, -60, -45, -47, 102, 20, 68, -28, -25, -32, 18, -34, 124, 139, -45, 91, 59, 20, -51, -18, 116, 138, 102, 60, 71, -36, 110, 60, 86, -89, -49, 6, -91, 51, -17, -66, -118, 71, 35, -1, 9, -46, -128, 81, -16, -91, -101, 3, 65, -12, 12, -195, -43, -193, 147, 167, -8, -150, -67, -24, -8, 81, -28, 84, -222, 45, -110, -153, 56, 126, 69, -86, -60, -20, 40, -27, 88, 86, 0, -14, 103, 84, 189, -88, -21, -78, 47, 39, 49, -114, -22, 1, 49, -17, 126, 174, -141, -39, 148, -62, 97, 101, -123, 20, -22, -64, 36, 16, -118, -55, 10, -105, -23, 66, 55, 5, 42, 82, -11, -65, 48, 12, 23, 160, -55, -110, 22, -137, 67, -65, 136, 13, -24, 14, -137, 93, 121, 160, -92, -61, 49, 135, 54, 14, 135, 9]
6981Im4O1J19j18o0O2J54k93R6Q7j27R8p1K13l15J27k3J92l1j28P6j06jK7j6J6
7007DQ7m8N0p5J40j11Q6j63Q6PJ47k31mJ45j85P7rn8J9p2J50j16PpJ60q2K5O8
7035I7j48K27l49K63o1k0J44r9j39m4j2J59M6j45OJ78j55P1M8O3k00J89r2L1j86
7060a28m1L24j32j30r2J60o6J57m6j10J46o2J07J21j96q6OJ80n6L9k77R3Q8j16
7084a17J99j77J73n1k0Oj68K58j4j28l4n1J18N7j2j09J9P3j47J57Q7P0k72O1R4
7109G2j43J79k55J77K6Jq2P7R1n7o8k0j9R8j28N0J03o7j05N0J3o2MR4l9Q4Q2q3
7137G3p5J14j96P3M2r9O0O8j77K06j55J79q9r3J6j32K71q2Jp8PJ49j01Q4K8j62
7163f8J03k2Nl6o1J62kJ35k99J02K0P4j9lK8j8j42J90j27J86j80l8p2j00J76k7
$$ y = [9, -35, 26, 145, 27, -33, 29, 183, -110, -14, 73, -54, 44, -27, 186, -129, -2, -25, 167, 136, 8, 84, -22, -23, 4, -12, 4, 91, 43, 93, 18, 158, 47, 133, -30, 56, 63, 210, -21, -25, 120, -65, 12, 3, -55, -36, -108, 42, -74, -67, -74, 86, 4, 29, 97, -51, 176, -173, 90, 29, 9, 153, 54, -85, -129, -141, 18, 64, -81, -75, 103, -52, 19, 67, 130, -70, 119, 27, 58, -128, -169, 155, 23, -107, -199, -39, -105, 52, 6, -104, 42, -20, 87, 208, 12, -74, -68, 112, 56, 95, -182, -89, -1, -117, 82, -95, 78, 27, 7, 13, -155, 103, 89, -39, -73, -124, -6, 51, 39, -70, -51, 22, -125, 32, 119, 189, -83, -22, 72, -71, 108, -147, 30, 56, 57, -25, 52, 143, 86, 18, -2, -21, 77, -51, -1, 102, 35, -70, -20, -7, -69, -65, 29, -10, 74, 156, 73, -2, 112, -84, -11, 31, -68, -8, 60, -117, 89, -66, 113, 24, -69, -53, -185, 86, 4, 5, -73, -66, 83, -18, 66, 94, -68, 35, 13, 18, -18, -79, 83, 81, 216, -83, 19, 39, 113, 94, 91, 119, 101, -41, 149, 22, 208, 28, -10, -82, -182, -6, -33]
7189c3O0J59l35L54j53q6O5j1J52j29j34K52j61nQ3k86K77j15O5j63J37J26j6
7212A03J48l80k5K11R2q1j66N3N4k2Q4n3p9j7J34J4j18J02k25K28j09r5J18P1
7236D2n1M0n2J26j82l1J34m3J59J4k33m7N3J89j61o7J62o5O1j13o0J17j2o9J15
7261B6q9Q3R2k17J03j16R9J11n9k8O5k35J99M1jO7q1k37Q5R3o2J64j12oJ79l11
7287a47K93m2j73P2k5o3J63j40M8J8j72R2J27QP5l04L03N9j22M0j69J6K8L7m8
7312b6m7K9N8k5O0j10M0K55k39k04J34K2J36j31M2P8k6n2L6J64j65J7j52Q8l9
7337e7O2q3O3L6J9%j79K07j51P7J0J9k4q8K76k52m1l0Q3nJ54N0r3m9QP2p6j70
7365a62J44o3J90r1o8j13K68j81M9J7j39K90j05n8K56j35q9P2l0M6k62J23K5M1
$$ y = [-33, 27, 186, -149, 205, 52, -34, 31, 20, 172, 43, -91, 161, 0, -5, 78, -208, 69, -46, 19, -144, -7, 119, 103, 251, -129, -154, 57, 149, 68, -98, -45, 9, -13, 71, 18, -61, -78, 56, 70, -48, 54, -171, 57, -52, -147, -29, 42, -9, 31, -21, 105, -77, -108, 26, -17, 142, 156, -77, -124, -71, 118, -43, -110, 52, -13, 48, -65, -125, -8, -20, -89, 26, -63, 20, 112, -105, -2, -118, -19, 92, 33, 5, 70, -165, 34, 75, 74, 141, 60, -177, -92, 1, -61, 103, -9, -15, 164, -147, 146, 104, -69, 3, -22, -85, 78, -62, -14, 4, -168, -76, 51, 59, 134, -170, 133, 192, 70, 110, -59, -43, -15, 22, -26, -73, -44, 14, -11, 49, -61, -21, 234, -5, -209, -75, -53, 83, -48, -6, 72, 46, -6, 30, 194, 29, 46, -106, -18, -57, 5, -78, -15, 21, 40, 40, -139, 68, -83, -6, 4, 23, -1, -89, 187, -65, -106, -136, -53, -58, 96, 146, 53, 4, 12, 84, 8, -162, -18, -81, 109, 18, -50, -163, 105, -76, -27, -10, -149, 141, 36, -22, 234, 99, 10, 82, 52, 98, -164, -41, -16, 25]
7389B5j45K07k4j10M8j01J49n6j23J93p1p9j9J60j78J75K6q1K03k55K06k75J28
7412Cp8K4o8N6k8J68j21J28j04P2p6j0j20Q1K43j77j13K11j52J49j14k6K58k73
7436f7L0P3J32k01J83q0P7j92%o0L68j83k34J67J29j39R9j55Q7L4k15J05ll3K17
7461A39j95O9l2j2k4O4j53n5K98j63K02j4j39L8j05J5m8J63L4L5j59r1K90j76
7485a9O0q4l7L0J13q7j3j19K53k64K06M9j13K3J57j90O0j36K00j85J10L3J30j73
7509DJ1k1lJ08j48Q5K7o3m2P3n1Nm4K5L9P0R8l50J69l5oj2J39Rj20J15j32N0j3
7538a3p3K4LR7j44J96j50j16K40k02K69j54K8P9k45K76r0j01K3p7K94k39K05j59
7562b9J97l40J50k08K90p8j0J9k41L74k01K48j45O6k37L07j94L6o0p5K06Q4j81
$$ y = [25, -120, 87, 63, -47, 1, -100, 49, -7, -130, 63, -8, -87, -106, 54, -124, 51, 77, -4, 199, -56, 150, -125, 3, -75, -51, -119, -63, -91, 77, -44, 84, -20, 52, -24, -34, -154, -73, 170, -7, -120, 91, -61, 88, -26, -52, 206, -67, -37, 36, 168, -33, 150, 70, 147, -45, -45, -105, 263, 80, -154, 13, 142, 3, 102, -53, 34, 68, -147, -42, -45, -78, 139, -56, 13, -19, -31, -55, 9, -144, -199, 99, -64, 138, 124, -15, 23, -82, -67, -115, 48, 82, 117, -42, -133, 157, -19, 41, -43, -80, -50, 63, -24, -37, -156, 97, -167, 39, 88, -25, -2, 155, -35, 25, -111, 89, -96, 14, 47, 177, 4, 15, -6, -9, 99, -49, 36, 63, 0, -42, 31, -20, -15, -59, -34, 5, 75, 173, -177, -8, -43, -49, -61, 78, 87, -33, 82, -50, 0, -13, -86, -62, -59, 38, -106, 90, -60, -176, 64, -138, 131, -23, 5, 84, -161, 115, 25, -76, -53, -130, 164, -75, 130, -29, 168, -172, -22, -230, 60, -18, -28, -9, -250, 124, -77, 171, 26, 92, -145, 162, -32, 4, -56, -131, 75, 159, -22]
7585b2O4n2k8L9q0J74j51o8K29j59j73J27J11O9o6l9O3pQ1q0j99K02J2k51K39
7610C5q7j4J4r2K15q2J42n5r4J25J4Oj90P0j08M7j2M2n4q1K19l5p6j0NJ45L0o1
7638E8nk9q8K44k26n2J17pP1j8p9k7qJ45j22J42N1k06J04j65J35j45J06p4J10
7663C2P5j56k3O8k9K39k14J29r4J00k66Q3O0p0K8L4m3R2j22Q3nJ1j19J5J60j48
7689h0R3k81K16N2j30q8J85n0J17M3l0q4J02k1j9Q8j59J53j34O4j64J22mQ3j30
7714e6%rJ35L4j64j02J83J08r6j6J9K0j65K07o0p9j68K26j9J9J5j42J09qM3P4
7740A08j32j9j21J96k29J91q8j54K89OqJ17m5j38p1P0J67l32J19K12l7K4j23k
7764@j37P5J26j44J45k13J92n8N2J75j26r3o1J91n4j74J12n6MJ20j03k9J41K8
$$ y = [-22, 42, -10, -38, 1, -79, 95, -56, -124, 105, -54, -227, -100, 11, 80, 14, -25, 38, 31, 112, 32, -167, 35, 47, -204, 35, -52, -66, -52, -144, 71, -11, 131, 76, -18, 107, 121, 127, -63, 7, -101, -54, -66, -24, -78, -159, 60, 25, -51, -61, -56, 89, 119, 58, 53, 24, -64, 180, -46, -98, 19, 12, 83, 65, -14, -41, -49, 96, -26, 116, 167, -39, 65, -100, 35, -110, -4, -78, 32, 107, -49, -72, -4, -33, 206, -8, 121, 27, 127, -139, -56, 4, -66, -38, -4, -47, 45, -77, 6, 1, 12, -107, -92, 68, -80, 13, -268, -52, 0, -130, -218, -33, -83, 34, 77, 47, -37, 65, 44, 25, 113, -46, 107, -27, 37, -127, -5, -9, 74, -56, -56, -65, 70, 104, -60, -162, 21, 129, 33, 17, 36, 56, -109, 98, 38, -41, -209, 17, -2, 17, 32, -110, -1, -9, 34, 108, -24, -43, -164, 32, -197, -6, -94, -248, 41, 47, 39, 156, 111, -27, -98, -28, 139, -193, -74, 138, 101, 125, 2, 0, -137, -62, 64, -80, 65, -148, 44, -14, 38, 213, 87, -6, -67, 124, 70, -104, 8, -48, -44, 76, -27, -56, 85, 113]
7788A13j56n5K47J8k25R1O1j42P1mQ5k19N3l7J16K5LR4j53Lq3J18k36K45j18J28
7814D3o9r2n2J45J4M7j92K3K12j32L7K1j14N6l4M8J63j55K6M9l7j93J57P0k7n8
7840d4L8J1N4j84J63J02O0k76J05p5M4j10R2J37j18P9J9k36K68j35p9J8m4J30
7864A9R1j69P6J17l06M1j2J01J92j53J4mk8Q7l8n0Q6k20N1K63j36j1J08K3j70
7889b8J05Q6P0j95k30J84j64L22q6k58K06j12N4k9MJ45M2j59m1K9O3j5n1K8Q1
7914E1k38J78M8j32J78N4j14l1j7J4J12o0K37k34j69Q0j15j6J11L0j56J32j09
7937a66Q5J45o5r5R9j06OJ06q8M5J76k30P4k5r1P7NK6J0Rj1R4n3r4Q4pq2L1QQ9
7967E6j12J8j54L00q9q4N1j05J73J9l3o8J35L1l24L53j62J62k58L0J52k30J91
$$ y = [113, -43, -98, 149, 167, -58, 33, 94, -48, 23, 19, 104, -115, -62, -99, 17, 42, 45, 139, -14, -11, -94, 24, -212, 33, -85, 43, -26, -118, -170, -25, -11, 36, -156, -133, 79, -53, -16, 5, -109, -53, -87, -39, 124, -31, -5, 44, 7, -186, -29, 41, 14, -44, -6, 5, 59, -125, 38, 140, 200, -76, 29, -46, -2, -112, -20, 117, -1, 78, 97, -139, 129, -6, -85, -67, -111, 19, 110, -59, 17, 134, -172, -131, -143, -42, 150, -3, 11, 7, -21, 66, 28, -22, 64, -156, -105, 158, 22, 11, 119, 142, -28, 77, 163, 233, 38, -192, -8, -172, 150, 64, -194, 12, -100, -46, -75, -71, 74, 116, -43, -84, -55, 8, -7, -58, -30, 51, -187, -9, 39, -93, 85, 139, 25, -6, -23, -9, 103, 43, 280, 46, -123, -43, -158, -174, -63, -33, -189, -57, -166, -81, 64, -1, -96, 3, -103, -97, 9, -79, -34, 142, -88, -14, -39, -130, -53, -48, -22, -12, -3, -14, 80, 27, -67, 17, 10, -72, -41, -33, 56, -56, -38, -192, 108, 19, -65, -14, -119, 54, 73, 40, -28, 107, 138, -186, 167, 5, 167, -91, -61, 91, -139, 52]
7990E2j7J5n3N7j53R8N7J72n2q1j50m0K15m8K0j30J17k13K02O4j55km9J90j49
8015c3O4J7q6j47K69Q4l08q2M03m7j82J46q6j9K59k10j20p0J37q1K40j80K29j82
8039A5J7Q5j87N6Jj10N8J34j30J66o1n7o8jQ0j36J19N8j02J03l9o9j47J46M6O4
8065D1k9Q4j57lJ04r2j6J83j01M2o3J56R0j76q6L4P9m3N4O5j44N4L7oq9q1M7Q
8093hL3J4l9p2nJ39l5j1p5O0r0O0L5j33K08j82m3K59j29Qm5n0O7J23J25k02O8
8120H0n3k8P7j0m7J43l06J73q6l1J74j66O4N6ok8n3o8J21p9K24r6N5k72K35j79
8146a06n2J30P5j22J71j34l4J26j42J66k89K12K8k3k1p2K3Q6k26J42M7j0J21m
8170I2n4n6q4J16j7j61K47n5q0M5o6J79r7k69K64j05N7q7Q1O1J09
$$ y = [52, 35, 50, -3, 54, -99, -1, 56, 228, 176, 95, -55, -95, 120, 72, 92, -38, 79, -134, 68, 132, -23, -25, -74, 116, -33, 31, 48, -38, -185, 84, 168, -140, -222, 181, 134, -48, 98, 12, -7, 252, 42, -78, -148, -11, -92, 148, -32, 197, 15, 32, 117, -70, -14, -13, -123, -65, 69, -61, 105, 44, -13, -81, -82, -2, -138, -19, 39, -63, 40, 1, -68, -215, -69, -23, 41, 12, 96, -61, -64, 40, -52, -68, 115, 14, 56, -7, 149, 239, 63, -23, 11, 90, 47, 101, 166, 22, 76, 113, 107, 18, -63, -16, -8, 25, 39, 0, -72, -77, 62, 27, 16, -59, 1, -89, -29, 6, -127, 81, -101, -144, 115, -14, -6, -51, -101, -34, 89, 214, 12, 80, 27, -1, 76, 66, 19, 162, -144, 29, -57, -88, 86, -80, -16, 40, 34, 6, -47, -115, 6, -73, 151, 55, 110, -162, 73, -106, -158, -28, 47, -75, 96, -38, -72, 54, -88, 78, -211, 1, 29, 6, -15, -87, -64, 22, -204, -62, -15, -25, 96, 92, 38, -18, -102, 14, -3, -164, 83, 28, -52, -7, -73, 106, 9, -260, 4, -101, -44, -131, -50, 11, 120]
8191A20
$$ Imaginary data points
##PAGE= N=2
##DATA TABLE= (X++(I..I)), XYDATA
0@%%%%%%Qq%qJ6j6J6k0K8l2M0n2O0p2Q8j05J27j51J77k07K40k77L18l65M17m74
32b52N37o07O86p73Q66r68J079j203J341j490J651j825K019k232K461k710K986
49A566l290L624l991M398m856N371n952O612p374Q265r321J0597j2174J4178j6816
64i163K0463k5845L4560n0952R1835l70409n82231J109769M55835p72998l41945
75d41081M67595P4907j52836J28305n4685l32353J96349M10277k14914l93534
85c11970K14125L49968q1061k87701p8416K11560K59342j28685l92548O241M35512
96A96367R6460l42463j24869J62340O6113N6919L4483k40593j51364L06525J84043
107B43961k96380j52194K33765M7637j67343Q4843J07889j95031m0436K47961
$$ y = [0, 0, 0, 0, 0, 0, 0, 8, 0, 0, -8, 8, -8, 8, -12, 16, -16, 24, -28, 32, -40, 48, -57, 70, -81, 96, -111, 129, -148, 170, -195, 222, -252, 285, -322, 364, -409, 457, -511, 568, -635, 706, -784, 867, -958, 1061, -1171, 1290, -1420, 1566, -1724, 1900, -2091, 2307, -2549, 2822, -3130, 3482, -3892, 4373, -4948, 5649, -6525, 7653, -9163, 11300, -14545, 20015, -30937, 60898, -309511, -891742, 218027, 673862, -99136, -441081, 26514, 101421, -51415, 76890, 22205, -310148, -113799, 296478, 81564, -311970, -97845, 252123, 171062, -116639, -195055, 16505, 275847, 147162, -245386, -239145, 196367, 292827, -49636, -174505, -12165, 53948, 110867, 145350, -95243, -246607, 59918, 243961, -52419, -204613, 29152, 76789, -90554, -5711, 102178, -92853, -133289, 114672]
117A14672l6565k51857R7026K29936j09845j97290P9354J68599M372j02972q6272
128i0842K8148J47403L4586j48522l7087Q7651k9481J0825J41480j01555k51239
139b08633J56990L19659j86759l33273K05945K79543k38264j93977K52255R0894
149A44380k36479q199J76427n8021r5555J13502J8133j61607L6372J87331n7420
160E8864j65732N0539J06428j8762k8024q871k4425L1787M6338m1831l5539N9164
172B9936J4628q1331N914R0765j9569o8233J7578O820j3122O2817O707j20403
184f7493j5271J40924K0793j35664j7768J04160o095o1158L2243J3917m3002K7945
196f469L5324n2082j6359O6796Q895o5768o741N2478J2165j3079j3234l9846J6841
$$ y = [114672, 78107, -173750, -76724, 153212, 43367, -153923, -74569, 94030, 98402, -4570, -90842, -62694, 84709, 119295, -29227, -66314, 21337, -8144, 2681, 144161, 42606, -208633, -51643, 268016, 81257, -252016, -46071, 233472, -4792, -198769, 53486, 144380, -92099, -100298, 76129, 18108, -77447, 36055, 54188, -107419, -71047, 116284, 58864, -106868, -56329, 50099, 31337, 3313, -5558, -29983, 1804, 48142, 6311, -29228, 29936, 44564, -36767, -30853, 59912, 40343, -27890, -10312, -3492, -16614, 46203, 52910, -67493, -82764, 58160, 78953, -56711, -74479, 29681, 23586, -37572, -5329, 8588, -34414, -6469, 28855, -23227, -39586, 27210, 36105, -29663, -36404, 16074, 28239, 15160, 1926, -37920, -21079]
209b1079Q9255j8471j06747K0176Q8424k2756m7901L0205p66m9672M1468O6763
221F8899p5730p1965R2751N4843r1569k8050P0403K282m0370J4924P722l0064
233b5924K3287M5415m8724n4632O2506N2583n0278l6228J6688J5044K5687P640
245C3064n6836k8504P0835M4835o9932m7070N9378L1694l8320n058O519k0036
257a9431K6046L3136n0870l9638O0919M1997o0598m0105N1085K7734l2316p016
269i057L166j3452K6621K4576m4590k5500M6649K2645l6876j4623K5175K614j0208
282b860J3194p535k3514K8654K1614m2448r308M4157l540l5949J2217K4563k0262
295a017j2549K7705m151l2521K1133K5498l3495j0454L3089o737k4081J6955J3421
$$ y = [-21079, 68176, 49705, -57042, -36866, 51558, 28802, -19099, 11106, 10340, -39332, 2136, 68899, -6831, -78796, 13955, 68798, -22771, -50821, 19582, 21864, -18506, -3582, 4140, -25924, -2637, 42778, -5946, -60578, 1928, 54511, 4233, -31995, -15307, -263, 25424, 33064, -23772, -52276, 18559, 63394, -6538, -53608, 5770, 37464, -856, -5914, 605, -19431, 6615, 39751, -11119, -50757, 10162, 52159, -8439, -48544, 2541, 30275, -2041, -9057, -5891, -19343, 7278, 31854, -12736, -38236, 8413, 31058, -5818, -20441, 4734, 7348, -2860, 10334, 2799, -20715, 7939, 29553, -12895, -22203, 21954, 18414, -17535, -5318, 19245, -1017, -13566, 14139, 9988, -22533, -1400, 24098, -9397, -19851, 13238, 6501, -17580, -625, 12796]
308A2796k1878n071K3896l794k2181J4761J2605k2205N476K1046k1521j0535L0198
321A3593o34l0014Q715K6581j3539k0982J9248R913k2657P022J8832k3558o891
334a4371L1028n862k8939J2710K1846j4429j4495J5917M393j6158R332J1256k2335
347a0107Q22K6746j3246k1171J9402J1161j8268k144J4683n781j1323J5495M638
360A0907k4124O510K5706j9209j7567K4963N157k2789M293J6853j0156j1473J4853
373C924M799j9344N642J8171j6548r780K1271j876j7683R909R200j2244j561J2612
387F492m996j2733J2951J0402k1022j873K3576r078j7196J6640N975j6830M327
400c365J3760j0486j1147J6092Q775k1695j590K2046q062j3876J4432R91j4557
$$ y = [12796, -9082, -14153, 9743, 5949, -16232, -1471, 11134, -11071, -5595, 15451, -6070, -16605, 13593, 12959, -17055, -8340, 18241, 4702, -16280, 2968, 12881, -9776, -2754, 16078, -7480, -14371, 16657, 10795, -18144, -5434, 16412, 1983, -12512, 3405, 7798, -8360, 972, 12228, -10107, -9285, 17461, 4215, -16956, 2446, 13607, -4661, -6805, 7878, 2097, -9226, 6269, 10907, -13217, -6707, 18999, -210, -17777, 7186, 12343, -10446, -6153, 10700, 544, -10929, 3924, 8723, -10621, -4979, 13192, -3356, -13136, 8135, 6259, -11424, -1515, 7685, -4559, -6120, 6492, 1496, -11237, 1714, 12116, -8906, -10779, 12797, 3719, -13477, 3163, 9138, -7692, -3365, 10395, -91, -11238, 4854, 13629, -8066, -9656, 12390, 4328, -9548, 4884, 5875, -8682]
413h682R718J0636j4302p577J5121N267j5156k82J1526q206k415J4509j0458j4104
427a4405J9174R445k1013m630J6886J483j1924L176N873j0362K880J6729j4003
440f91j6528K0328J0488j8404l493J0481k169k203P830m142j4600J0022K0315
453A7234j6344j9401J9160J1592j4516j642M957n423M152R621q329j3326J0222
466b043J5884j1880j1788J1630J200o442J1028k389j9005R861K1332j1502k1473
479a5587J0386J9260r225j3180Q461J836m639R790k584j5614Q226J4254r251r159
493g026O006L139l801M419L529j5010k797K4053r66k6418M949K0158n562j0432
507e759K798K492o57L013R82q459r3J2412l746j0850Q695K811j0031Q162P715
$$ y = [-8682, 1036, 11672, -2630, -10207, 4914, 10181, -4975, -5257, 6269, -1937, -4352, 10157, -301, -14405, 4769, 14214, -6799, -11429, 5457, 6940, -4984, -1808, 4065, -6297, -3417, 13312, -691, -17219, 3109, 13597, -4807, -8300, 2181, 12, -2191, 5639, 1497, -13103, -3081, 17234, 890, -18511, 649, 12241, -2275, -3917, 1040, -4383, -231, 9390, 1061, -12265, -2043, 13841, 1961, -9827, 1803, 3003, -3439, 7589, 5200, -13805, -3944, 17388, 5886, -15587, -5201, 14059, 4834, -8346, 115, 1951, -2688, 7102, 4518, -11096, -2870, 11384, 2133, -7026, -1020, 2119, -1682, 2737, 6266, -8744, -11541, 12512, 11546, -14872, -9923, 10235, 4673, -5759, -2961, -469, -1126, 1887, 2869, -5590, -5683, 6729, 2983, -7867, 828, 3639, -6392, 1770, 9485]
522I485j6278m525K0161M168k1713m212K1764J112j7569M428Q406q159K414O948
536F430q103l203Q125L18o224K373M984o865l356J2699j668j4948Q025J1769j1967
551a611n515J1195N79p788J184N269l140l670O150O22p490L110L000m916N860
566B839J761j3625J797J7498k392j8188j07J7662J091j4499J194P097m416L271
580I83M157j0070j594J1482K71r247r18O836K137m114q63j570j190J0561J117
595G978j7250P82J7881j250j2501p45N812K707o0j206n565k223J1324K762j4732
610f286P07J2771n002p248O761J585o579J432O798m015q063P230P886j0228m514
625f765R003L82l502J878k982k170N559L227n161n375M693N587m896j119L453
$$ y = [9485, -6793, -11318, 8843, 13011, -8702, -12914, 8850, 9962, -7607, -3179, 5227, -2932, -518, 6430, -1673, -4876, 3249, 3567, -2657, -284, 4700, -2165, -5521, 7178, 5510, -9438, -1413, 10356, -1611, -7126, 4069, 4648, -3140, -1956, 3313, 173, -3497, 2653, 3275, -4215, -1105, 1895, -3021, 2839, 4600, -9025, -7228, 10270, 7878, -10310, -10417, 7245, 8336, -6163, -4969, 2128, -2288, 983, 5140, -4930, -6524, 4958, 5229, -4018, -4936, 1900, 4037, -77, -940, -2510, -3700, 6861, 7978, -9272, -8490, 9391, 8141, -4360, -5105, 707, 3414, 3354, 2148, -3417, -5640, 5684, 8446, -6286, -5579, 7192, 2190, -5058, 1703, 3288, -3291, -1859, 4939, 924, -7139, 91, 7977, -2251, -6765, 2238, 2620, -882, 996, -1986, -4156, 1403, 4630, -531, -5906, -1213, 4374, -522, -1641, 1812]
640A812n100O52P505l426o527L506L707r01k185r18J081J241K094k775n939O959
656G86Q328j1699o570J2365M130r301k279N679J489m417K078L479o589r75Q513
671E017j702o126K445J667m64J132k178j371K798J883l602l492N485M410q590
686b688k980R626q97o985L495K780l917n45L396J15l838R35L516l634n88N659
702C450m325m455P357J717o952N96M706q07l770J229M247l344k889N146m60m034
718b588L156J086k636Q12J90m4J772j147k446O61L595R19o407j90Q359k472p520
735d900N276L967n550q26L824l3l113N24L563k926k412N320o60n123L348J981
751B260l327Q99J328j801j29J111M29j753M3K988k729k728N440P2n636K073L042
$$ y = [1812, -3288, -2636, 4869, 1443, -5084, -1578, 2129, 1228, -957, -1875, -794, 447, 2541, -234, -6173, 786, 9114, -2585, -9155, 3210, 7340, -1961, -4240, 1439, 2928, -1489, 589, 4068, -2521, -3496, 5017, 3315, -2811, -366, 1301, 837, 1969, -209, -1580, 1218, 3101, -501, -3993, 1492, 5902, -2688, -5668, 3958, 3061, -3924, -429, 2351, -1566, -2111, 1285, 1400, -2438, -1503, 2013, -1621, -2209, 3450, -875, -5330, 2027, 3744, -3208, -2612, 2094, 1287, -2483, -1254, 2993, -351, -3240, 1906, 1446, -2588, 568, 1654, -982, -170, 20, -24, 1748, 601, -1845, -1184, 2411, 3330, -3077, -3267, 5092, 2620, -4900, 376, 4343, -1207, -2033, 1791, 1758, -1355, -831, 2732, -194, -2606, 2714, 2054, -3069, 279, 2260, -1067, -168, 1160, -641, -770, 341, 770, -983, -940, 2048, -681, -3409, 2031, 2103, -3533, -1460, 1582]
768A582j966o78Q60n23j12R95J293l465r66O202j250o651M026M204m013q15J572
785B95n24J47J583J15l541k01N991p75p017K726M347k479o11K8j288K383J494
802B673k932k076K468L759k985m887M215L046m158L74J607k997J899K569k707
817a32k650J860L691j840m084K671K385l015Q09R45k863K287K192l740j177L425
833G64J084k743j978L286J116l222J537J342l341J737K595l075o63K527m96r96
849e26K6J263n03j620K195Q47l570K000K751l965l13L400j133j481Q88Q28o79
866D08j184J859P17l377J387K488l109L29K348k768k77K890r20j947K44K273j89
883A172l259J688K319l178L4K687k739J23K634j905j288J572J106r73j863J500
$$ y = [1582, -384, -1062, -202, -725, -837, 158, 1451, -2014, -2980, 3222, 1972, -4679, -653, 3551, -462, -1277, 295, -229, -82, 1501, 1616, -1925, -2126, 3865, 3090, -3927, -1201, 3146, 667, 56, 84, -1204, 1179, 2673, -259, -2335, 133, 3892, 907, -3980, 235, 3281, -877, -503, 1104, -1893, 6, 2575, -132, -2782, -922, 2769, 929, -3155, -484, 1901, -1114, -305, 640, -2223, 64, 2256, -1484, -2661, 764, 1848, -895, -2873, 413, 1529, -1693, -156, 1186, -2155, -418, 2177, -898, -1561, 966, 470, -526, -500, 763, 260, -1360, 835, 1682, -1888, 112, 2863, -1102, -1415, 1985, 852, -629, 259, 1087, 408, -776, 1083, 1800, -1577, -190, 2298, -811, -482, 1866, -902, -1179, 1711, 791, -1156, -912, 1361, 1172, -2087, -399, 1920, -1258, -1224, 1463, -1276, -1153, 1481, -424, -1712, -140, 966, -7, -1870, -370]
899c70J711k806N01K792l078j07K995j539j544J410M92o2j055K50J220j207K26
916a71J077k237J232K413k937j013L148l12j865O38R79n22j249J293J522l008
932a012jL437k260j477K154l14r98J099n54l78L17M22J71j778O46K316k293j077
950a580K621j390n31J701p51j223Q19Q23j12j523J61J977j691m65K172j964p10
967a666L405j296k485J523J466m00j773K75K253j218j356K112o92j225K315p92
983D46j084J337q57K90R08j006n16N73Q70M20k591L6L622j720k507K455L71j539
1001d92N02Q03n08j143N02K254j578k501K482O28j469Q66j001m57K074l50j584
1018i72pN90J398q16k197J775P69p86L11j030m40K525n97j648Q39K65m22P91o8
$$ y = [-370, 1341, -1465, -964, 1828, -1250, -1357, 1638, 99, -1445, -35, 457, 395, -660, -410, 810, -397, -171, 906, -1331, -99, 2314, -623, -1636, 1512, 1200, -665, -27, 952, 430, -819, 474, 1996, -1012, -1013, 2424, 164, -1313, 841, 527, -471, 628, 74, -304, 13, 435, 606, -1172, -526, 1790, -503, -1580, 1041, -349, -880, 821, 70, -1153, -334, 489, 377, -1146, -985, 992, -699, -1164, 1008, -956, -1666, 1739, 443, -2042, -519, 947, 547, -1226, -951, 1302, 84, -1272, 840, 148, -1077, 1238, 446, -638, 699, -158, 132, 1040, 34, -482, 91, 961, 1381, -1210, -1174, 2448, 728, -1779, 676, 1047, -492, 10, 813, 305, -838, -336, 1918, 340, -2161, 321, 949, -520, 346, -655, -1112, 962, 612, -972, -979, -389, 1009, 193, -2004, -229, 540, -246, 65, -965, -1405, 1120, 523, -1125, -286, -21, -443, 348, 280]
1037B80m01j376R68L662l136l644M233K501l461j784K055K118j430k315K087J362
1053A719k710Q04J462j048n68N2J007J415l014j217L811O13l036j254K076K655
1069B767k405k995L319J080k708N77J136j209MM97L91o4j704R90J087j037J29
1086a45l58r94K611J3l216Q06K516k81j824j214K395J644k909m34K048k18m59
1103a9m26R8J440j600j578L797K56l954j34L786J343m176j979N257J447n819L29
1120a932M459j345k713J012K142l75k840J042L146k264k267K126J477n23k301
1135a156o42L851J33m180N87K937n68j576l05J216J23j782J339J240k522M17J890
1152A002j192m04M86n42M89O80o04o00p34K243P74l474K66L533j354j984Q02R69
$$ y = [280, -121, -1497, -529, 3133, -3, -3647, 586, 3087, -374, -2158, -103, 2015, 585, -1730, 357, 1719, -991, -187, 1275, 227, -341, -289, 718, 2133, -881, -2098, 1713, 2326, -710, -1964, 112, 2767, 362, -2633, 686, 1766, -942, -365, 771, -438, -434, 63, 454, 390, -1314, -324, 763, -274, -145, -503, -1497, 1114, 1127, -2089, -1283, 1233, 952, -872, -2086, 309, 1953, -956, -1390, 658, 440, -19, -445, -347, 1093, -507, -2085, 1712, 1968, -1986, -2120, 1666, 3009, -1167, -3146, 2111, 3558, -2261, -1932, 2527, 1182, -1531, -519, 1623, 1248, -1592, -550, 2596, 332, -1935, 191, 1668, 1145, -1156, -1798, 2053, 2186, -1994, -1407, 1530, 962, -614, -919, 297, 420, -1362, -23, 1217, -1305, -888, 1002, -190, -594, -108, -650, -161, 519, -85, -685, -1419, 824, 1598, -1876, -1610, 1923, 569, -1415, -613, 356]
1170C56O25j366p61K154n39j549J266Q84o39j411k6L275k81m760J651M321j996
1187A204l320J191K987o49l195J394K589k689q71K919o26j899N59J212M40j906
1203f60p23K505R1k215K25O45O60m8j925J071J529j936M91Q12j302k76J522L34
1221H00j153j078J425J496k570r0K486j586j113K229l33j371K68R71N34j754J9
1238h20K292q60j793J342P66n00k12r37J196N50j703P35J077j395l22J177Q15
1255A408j094j934J667K228k802j076K994n59j908O31J473j38k233N11K379j258
1271B89j919K178L09j646L24O79N92q51j679J723J215j865l07J082P2l70p65R97
1289E8J207k556j69K870j098j729J340M97l67r90Q53J310j495j154K631n43j912
$$ y = [356, 981, -385, -1146, 1008, 469, -1080, 186, 1070, 431, -980, -1006, 2269, 1988, -2772, -1121, 3200, 1204, -2116, -925, 2062, 1413, -1782, -388, 2201, -488, -1359, 1560, 934, -965, -406, 806, 1246, -660, -1383, 1122, 1213, -1002, -777, -132, 528, 480, -1445, -374, 1155, -781, -290, 522, -780, -1056, 466, 800, -353, -1431, -6, 1490, -1080, -1170, 1316, -270, -1383, 846, 513, -858, -590, 381, 915, -839, -820, 1472, 612, -1181, 161, 927, 427, 215, -722, 474, 1024, -679, 56, 1133, -262, -584, 593, 1408, 314, -1620, 47, 2275, -527, -1603, 1391, 832, -1076, -445, 1028, 890, -1343, -832, 1547, 289, -1630, 548, 857, -789, -465, 214, 806, -45, -1724, -1, 1214, -651, -958, 124, 196, -174, -939, 58, 1265, -1291, -1460, 1410, 312, -1417, -77, 420, 53, -937, -84, 1226, -269, -1423, 1208, 665, -1247]
1306a247J255P36q65j06K35J133r43j164J462P52j509M1P15m9m18l96O20Q06j794
1325g36J6K110r20j450P35J168k85j649M34K278j676j909K662L69k075O1J022
1342A55M32j128n55J890j02k250J358J473j562o65M18P62K92j459M53J313j123
1359b98n97J331k00n99k29O19Q99j147q25J931l58j517J367M37r79j04L3J040
1377H04l44j309J547K98j890Q35J271q64o66j70J012L93j447L13J120j094k43
1394d34R17k60l60k10M0J247p75j189J587m9j159K11N39L14o94p80J467J63j685
1413a110O28J321j143k32P21jj12j102R97Q80j530J40J094o19k54L60k3K93m09
1432a01k39J065o86o92P32J12k22K62m32N73J52j049P41M82q43P4O19l64O5j55
$$ y = [-1247, 8, 744, -121, -227, 8, 1141, 198, -966, 496, 1248, -261, -220, 495, 446, 28, -368, 252, 1058, -736, -720, 1390, 470, -980, -245, 923, 638, -1011, -577, 1701, 25, -1884, 778, 1147, -928, -867, 155, 587, -541, -1096, 794, 692, -1558, -200, 1273, -289, -954, -536, 226, 518, -941, -488, 825, -298, -895, 436, 236, -363, -592, 27, 926, -221, -1046, 885, 527, -990, 377, 814, -165, -269, -236, 804, 460, -849, 698, 996, -894, -59, 1212, 348, -318, -488, 524, 917, -530, -217, 903, -191, -434, 483, 223, -137, -347, -307, 940, 165, -1024, 563, 514, -645, -434, 105, 419, -275, -1055, 412, 575, -1110, -482, 839, -304, -536, 185, 184, 72, -1030, -33, 847, -683, -543, 551, -68, -322, 38, 15, 308, -101, -340, 725, 39, -653, 79, 191, -31, 231, -201, 372, 524, -525, 216, 698, -145, -71, 548, 184, 249, 94]
1452I4K69K37j228O34J034j538k50J396m23l87K05KK69n85l18J242n79q05J011
1471B80j33k75R7l56M40L19j409P67P17q93j64M67L03K35j311N07J271j348k80
1490g66J301l74m35K47L2J50l44j77P89m35m13J036o98k02R47p09K49K73n22J36
1510H5L01m37L07j00l47O06k91j66Q03j007J83R13j101J9O99l12l26Q7J11K71
1530B98o39l42J336q20o81J135k01l66K70l48K10L95o51K71o1j10L28k44j95R71
1550E56q65j66R84o92m64P41n9m7n1j88M70r8m12P13m36j61Q01p31k81J070l48
1571C36n92L17L28J71p33j06J019k64r30Q59l08j99N74o75J60N65o77k47Q13j12
1591B99k39l43J70Q09q29o50J255j40q93N41qLl1p60O46M80p42J50J18K23K18
$$ y = [94, 363, 600, -628, 6, 1040, -498, -748, 648, 225, -162, 43, 45, 314, -271, -589, 653, 74, -731, 280, 147, -128, -31, -387, 53, 372, -1037, -270, 447, -446, -610, -143, 160, 395, -916, -409, 862, -486, -766, 535, 161, -274, -27, 5, 155, -189, -366, 423, -12, -425, 611, -87, -289, 658, -51, 198, 471, -51, 85, 386, -51, 256, 156, -191, 415, 124, -42, 761, -246, -63, 850, -251, -232, 467, 155, -171, -84, 27, 298, -341, -683, 653, -167, -848, 287, 86, -280, -10, -358, -148, 247, -404, -133, -194, -304, 24, -220, -415, 556, -309, -475, 509, -183, -647, 94, 35, -12, -63, -251, 219, 121, -291, 422, -14, -175, 626, -105, -386, 684, 336, -256, 61, 389, 560, -173, -279, 740, 476, -454, 405, 97, -102, 472, -203, -43, 522, -155, -402, 411, 299, 60, -283, -113, 696, -133, -783, 472, 332, -561, -20, -28, -25, -56, -816, -170, 310, -432, -282, -164, 59, 277]
1612B77r14P9J344q03q63R49K78m39l08J09P47l90p70R68J39n22M9L4K20L40p94
1633b70j63J336o58n69L11L25J64o85k26J343m64j093R56J40o14K65j62K82L38
1652E56r44J85P25m17j27j78K32N86q10n71J046J55q97N8M30K17k96p95P20O22
1672D97r35P5K87J73R6p67K21J001o89q07J118K22p87j45J01Q26l23q24Q92M59
1692F91j011K54L06j6m6l31M8Q99p89k92N51o0J64m84k50R59j97r83R43R6n02
1713e0J75r8L22L2m90o3M86m57PJ08k70M05p4o05P81k6n01M2J10L37k23q06P05
1736a53P07j092K39K62Q3k64k52K84P56p00n85J047p7m64q7J64O15m34n13P75
1756C11J59p32J42L04q6O4n12L16O50p18j06O45n48J65n6j67N91k94m21P70j74
$$ y = [277, -637, -558, 786, -17, -880, 69, 347, -92, -400, -291, 456, 66, -704, 264, 403, -119, -70, -36, 184, 524, -270, -433, 903, 245, -324, -13, 312, 476, -209, -435, 908, 444, -649, 307, 447, -167, 98, -64, 218, 556, -388, -203, 522, 105, -22, -200, 32, 618, -192, -763, 283, 438, -459, -401, 29, 246, -50, -845, -125, 497, -438, -363, -76, 97, 193, -574, -353, 648, -41, -848, 270, 492, -295, -440, -339, 487, 164, -660, 232, 691, -320, -66, 240, 224, 178, -153, -105, 794, 5, -287, 264, 204, 368, -116, -366, 593, 396, -587, 356, 452, -50, 125, 27, 349, 381, -109, -172, 314, -143, -136, -28, -298, 107, 33, -572, 209, 183, -318, -276, -166, 171, -52, -858, -153, 554, -538, -299, -37, 46, -218, -470, -186, 570, -130, -715, 332, 255, -209, -296, -132, 483, 49, -464, 311, 470, -262, -120, 184, 98, 162, -350, -34, 616, -102, -208, 437, -111, 54, -2, -169, 422, 128, -293, 477, 303]
1777C03l36L90l43J03J68m36J59J37k29J90j51l78R36m42m97M26J50l61J35k7
1797a03N4J28n84M24K98o34J77M01j70R5m82J75P46o82m15R56k15n23K55L2L93
1818C26l67m42R00p9o77N05r1l31K12J23l0K62m03J88M08o12J49K19j88K21j31
1839A62j75L63m99j35O93k66l52M82k71L9L8k19L39l06k29N12p5o51M53K97m08
1860b08J16j5J88M1n63N27J66o50J99J79k08K51j14l19O22m22l16Q75k87k60K37
1881C9k93L18J42k46L11j87m16O72J25p47M86q2r2K39l14J76J21n65L17N38n85
1902d3J03J1j3K45k16j91N21m29m24O05j05j57K6j26M45j65m82P97k67o07N18
1923D6K38l18j61P4J61Q8m84J86M17o77M74j7l51L99k45n9O42l41n56N19p4O2
$$ y = [303, -33, 357, 14, 117, 285, -151, 8, 145, -84, 106, -45, -423, 513, 71, -426, 0, 150, -211, -76, -103, -49, 79, -505, -81, 217, -417, -240, 161, -9, 86, -396, -221, 525, -157, -572, 384, 169, -354, -99, -67, 326, -41, -483, 417, 338, -339, 166, 75, -256, -44, 79, 49, 311, -92, 96, 504, -108, 41, 260, 72, 293, 162, -13, 350, -149, -284, 409, 143, -209, 273, 2, 41, 79, -140, 199, -107, -336, 176, 101, -550, -97, 200, -208, -92, -107, 81, 122, -441, 86, 252, -398, -199, -20, -228, 23, -91, -410, 212, -210, -526, 349, 62, -198, 39, -254, 64, 206, -40, 271, 84, -332, 340, 465, -282, 204, 122, 30, 269, -45, 131, 252, -313, 4, 542, -43, 60, 71, 58, 303, 87, -104, 417, -12, -436, 169, 64, -93, -67, -193, 252, 87, -395, 402, 135, -472, 46, 284, -34, -195, -121, 40, 128, -356, -170, 247, -430, 44, 27, -324, 75, -170, -229, 413, 72, -484, 35, -39, 23]
1945B3Q2l43L19M5l06M02N0p37O56l4m82M49p4r8J62j53J47J53n76N23R9n21M35
1968B21J58m59J94j29o8N31m77j12K85j23j11J77l35N28j09o08O44K29r95L22
1988b37J50j28J00j74L03Q9n76M12J95l59J10qL9K74l35l55M73l1q4K99m38L02
2010B1J85n79N40Q9m53J38J09k33L39p1k18L34j03j29N7N9K28n4n22Q04j68o89
2032c16K52L16q2j63N4j43L24l96O1M78l50j34J62l25L68J90o90N04J95o48L29
2053a4J66l08J64l16K77L36o21J23K86l22N9J84k53K08p7k18N28k03m9K05l47
2074a92J86K55m64L9L34k21K31m6k35M81k31l06J93J47k86J26j1Q9K89n88M27
2095B17K14m43N5K37j14q4j81J97K26l99j73M96m60L5K36k27M16k62l48M90Ok97
$$ y = [23, 105, -238, 81, 126, -180, 222, 272, -465, 191, 157, -325, 124, 50, -48, 114, -39, 108, 261, -315, 208, 307, -214, 221, 379, -80, 114, -15, -83, 448, -29, -141, 144, 21, -90, 87, -248, 280, 171, -437, 207, 436, -559, -237, -87, -215, -115, -289, 14, 103, -473, -61, 134, -225, -115, -123, -84, 190, -145, -500, -27, -58, -142, 157, -281, 21, 206, -373, 167, 256, -197, -59, 50, -183, 156, 85, -133, 201, 98, -31, 26, 85, 313, 259, -263, 541, 373, -316, -64, 252, 170, 7, 61, -82, 242, -154, -93, 385, 35, -99, 63, -262, 106, 296, -394, 110, 305, -343, -14, 152, -156, 8, -308, -31, 305, -316, -193, 93, -229, -170, 14, -239, -31, -108, -326, 202, -1, -50, 155, -192, -6, 249, -215, -176, 158, -63, 168, 122, -113, 368, 137, -169, 24, 171, -115, 11, 0, 89, 378, -210, 217, 431, -12, 43, 280, 166, 82, -99, 98, 324, -75, -248, 248, -212, -177, 59, -168, 248, -14, -362, 128, 134, -163]
2117a63K1P0j0K73k36k65L73k91K48K21o16K88M00o94L83Q7k78J01j02J3K87j57
2139d7j8M03m79k60P90l51r3J70j84L20r1l41L83k3k01Nj56L24L17p06K97K21
2161B80k71j22K38j10P9m9k64M15j57j61J67J42j23lj90K68J03m99J24L43l27
2182a17Q0j24rK46l35J26L97l54M7P2j99O0q0j34L74K28n41K78J22r8k17j64N11
2205A69J64l99k3L42l16J50p2j14L01M5k55L14j35j41j7l4K39J69n01J52M14m39
2227A3Q3M7k42K20j48j96M69j37k69J15N5J33j68k36N43K3o95J14L76k28J7p2
2249a83K22J15m99J57N41m67k19L99o4j6r1j70M41k54o8J85R1k68K03m49M91P0
2271A67n03M25K17l58P3j3K2Jo9j22M26j70p9K49k37j84M83k96o2L69k48j05J8
$$ y = [-163, -142, -72, -82, 191, -45, -310, 63, -228, 20, 241, -375, -87, 313, -381, 2, 89, -189, -88, -190, -177, 110, -47, -65, 338, -141, -401, 389, 38, -55, 115, -69, 251, 160, -181, 202, 179, -22, -17, -173, 151, 468, -238, 59, 280, 9, -113, 125, 15, 94, 45, -219, 196, 39, -122, 45, 187, 64, 61, -129, 139, 242, -257, -133, 210, -117, -37, -161, -170, 76, -259, -133, 264, -90, -43, 29, -170, -110, -190, -324, 50, 278, -263, 15, 137, 39, -178, -342, 169, 333, -66, -89, 253, -63, 87, 15, -99, 202, 247, -8, 306, 171, 30, 13, -21, 218, 387, -114, 38, 452, 13, 96, 143, -99, 121, -27, -223, 246, 109, -160, -45, 10, 143, -25, -261, 282, 305, -390, -276, 100, -128, -111, -183, 39, 154, -345, -188, 353, -114, -333, 66, 2, -14, -105, -275, 166, -88, -156, 29, 120, -148, 55, -394, 97, 167, -336, 89, 306, -52, 21, 8, 30, 31, -38, -160, 266, 96, 17, 266, 29, -155, 328, 32, -30, 339, 91, -14, 4]
2294DJ0l7q1m7L66j8m97L92j7Rn1k71M34j01n92L45N13l80k12P4K69K2n30L75
2318b1M10n78k54N38Pr3k97O8K61m1k97M22P2l58K5J17J32N3l53J64L52n49Q5
2341a35M08l00J16lj29L80m42K15J3r7r7N12n41j21N36l14k73L44K6N2j67j36
2363a53M87l30j23K42k1m6k1k70M61k5n14K33K97l03k3nK3J41m70M04K96n12j06
2386c38N04j76k11M6J90J19k65j51L80m9l03M15k05J7J16k94K44K34l44K04L1
2407A64j03l2K3q0J19N9r3J41k45r3M58l20j78M39l36K55j65R1q2j28l17P01n9
2430B19m21K71j91J2nq4L97p0l71L44J83m01J2k7J76L0k77o6N31n28M5K94l62
2453b89K81j74J08l7j2q7L36j33j77K88j84kJ38j40J21J66m93M31j69k66M25O9
$$ y = [4, 14, -23, -104, -151, 215, 197, -300, 92, 75, 84, 33, -238, 196, 95, -497, -152, 361, -19, -231, -157, 112, 134, -396, -21, 389, -189, -443, 95, 102, 9, -288, -220, 41, 0, -297, 125, 197, -161, -136, -19, 113, 166, -187, -23, 329, -220, -135, 273, -27, 89, 86, -43, 337, -105, 110, 123, 26, -71, 441, -100, -221, 315, 1, -272, 72, 98, 150, -17, -153, 334, 4, -119, 123, 102, 56, 35, -235, 226, 201, -313, -80, 217, -86, -109, -114, -91, 50, -420, -16, 280, -232, -338, 166, -10, -221, -175, 15, 134, -131, -282, 98, 49, -254, 161, -44, -27, 89, -205, 39, 273, -71, 133, 164, 61, 29, 52, -28, 91, 150, 57, 198, -47, -140, 318, -2, -180, 259, -77, 178, 13, 104, 22, -106, -423, 278, 219, -202, 69, -122, -110, -115, -199, 198, 128, -243, 101, 284, -117, -105, -132, 44, 74, -203, -269, 262, -266, -221, 73, -289, -8, -182, -74, -111, -123, -210, 126, -7, -184, 104, -80, -82, 56, -84, 37, 203, -290, 141, -28, -294, 131, 200]
2475B00oj07P1k72L20l22N0L66m27QO97m70j83M5P6J12k86m5M56k12l56M26L9
2498A80m30L28k8M9L4m14J79J66k25K7J82m9n0k70K08L79n57l0L14R9k13K25o1
2521D3k25qO0N16m56k04M76j09l18L12p9QK6j54L06j53k25L75j45o3J81j36J44
2544A72J09m23K57K02m94N1L65j56k64K02J02k9p3j23K17J9m23M21j52k58K32
2565d6k8Q7J51l65L37J06n55J95J31j75J43r5j13L82l01J01J80j46p0J55j16N8
2587A6m1r9J82n9r3K30J0k41R6J63l8K3j84J75l5j69J85R5l47J73J84j40J6j21
2611a9j3K53k01JK82j48j45J9l9Q5k56J97L18l21j78M96j80m03J40K28r8K0j49
2634a11kK27l29K79j25j92K54m6J1Q4j42R9J54m16J62K28k16R2m7j3J00j6k27
$$ y = [200, 194, 87, 158, -114, 206, -116, -66, 300, -127, -119, 578, 108, -75, -30, 46, 158, -128, -173, 283, 71, -285, 141, 180, -250, 78, 50, 99, 133, -281, -102, 64, -161, -134, 48, -1, -51, -321, -113, 266, -291, -321, -7, 92, -121, 104, 43, -182, -190, -130, 386, -70, -274, 202, 93, -225, 87, 8, 16, 42, -112, 194, 41, -184, 191, 46, -17, 164, 28, 172, 281, -142, 115, 317, -177, -126, 239, 83, -181, 21, 123, 94, 21, -102, 115, 134, -289, 132, -20, -278, -46, -74, 13, 164, -201, 136, 242, -313, -118, 13, -162, -19, -114, -227, 155, -146, -45, 135, -11, -81, 74, -42, 16, -25, -124, 58, -1, -94, 136, 146, -95, 1, 164, 126, 149, -35, 140, 105, -64, 121, 216, -131, 42, 226, 86, 102, -19, -32, 221, 20, 21, 303, 155, 10, 29, -10, 75, -181, 16, 334, 13, -165, 331, 151, -252, -112, 116, 18, 38, -111, -113, 114, -215, 64, -61, -253, 1, -45, -34, 50, -92, 7, 161, -255, -93, 135, -81, 11, -36, -49, 51, 35, -192]
2657a92J98j08p7L69k77J65q7j17K16J30j60o5K07k70K80k13k07L77k11k4K75
2678B09k45M2J07l21L56o9p1K09k14J3J52j93k2K28k65j53L17j04q5L24k71K04
2700A48q3k58K90q4j69J87ojn6r6R1J29j44k31L89l12oJ54r7K90q7j86K40j24
2724b2m3K98p3k58J24k4Q9r5P1J21k31j30L13n6q7J64j12n9O3P0k06J92k12Q4
2748a9M4k59L85l9k04J21o7o6J97k53P8J40j9r2l0j32K14p8o1J29K2k55K99j91
2772a36Q8M8R4j03J54k51N1N7o7O4N0j15R7P1j25J36r0k90L81R7l69L40k22K3
2796a7J08k06J89J82n14K62J84j84O6K0k00L39k50K2k6q1J98o4r5J51K4m72N48
2819A84n5j83K14j13j45J84k98J72K37l85J36J01k76K35j86L7K89k08l3K78k71
$$ y = [-192, 6, -102, -179, 190, -87, 78, -9, -126, 90, 220, 60, -5, 202, -68, 212, -1, -208, 169, -42, -66, 209, -36, 6, 113, -208, 148, 79, 8, 217, 3, 16, 168, -25, -47, 181, -84, -237, 80, -24, -109, 215, -56, 148, 65, -193, 97, 13, -156, 31, 25, 24, -32, -128, -37, 92, -52, -283, 106, -206, -212, -58, -155, 135, 48, -138, 102, -22, -65, 233, 160, -98, 26, 2, 91, -4, 67, 188, -43, -173, 140, 84, -3, 161, 49, -10, 53, 123, -83, 109, -103, -19, 25, -234, 151, 112, -92, 29, -38, -104, 93, -160, -82, 58, 39, -53, -83, -215, -1, -79, -140, -11, 11, -244, 55, -136, -48, 0, 94, -9, 145, -106, -55, 2, -65, -1, 49, -66, 31, 102, -23, 113, 23, -267, 114, 211, -158, 182, -40, -17, 91, -115, 74, 256, -258, 4, 188, 4, 70, 90, -110, 229, -21, 1, -25, -106, 92, 28, -67, 84, 108, -364, 184, 129, -54, 160, 47, -98, 86, -212, -40, 197, -188, -52, 49, -227, 8, -178, -141, 148, -60, -93, 185, -86]
2840h6J11n3j27K82j49k38O2K17k61K74J30k78J94j21K0J95r8o5J02j11M3J39
2862A82k56J53k8k06J11J29k20L25j32l25K93j45J11R0j38j6K2Q5J52k0o3K1j21
2885Dm0L8J66j56p3l3n1L34k39O7K23l50J91j91l2K98j69k0J03l30L0K66j10J21
2909D7p5j85J97J51k53K68J5k09j21J49j9P4j25J68N4k30K25O8j81k36K57m0J05
2932A04j48mJ44j37O6K7K8K8l3j34K44j57j20K74j11j08po1J04J1p1l1K24l50
2956b18K59K20l16n9J35j56J13K43k16M3r8j07J37R9j69J19pmQ2l08K20J0k38
2979b16L23p5j73K73q4j37R7qq8L18l62J25Q7r5M2L2m9L2r2N7J59k15k72M67j08
3004C8l4L5oj30R3k10K48R7k32K96j30J2n5Kp6J50k19P4P4j39j25K55j24J16q4
$$ y = [-86, 25, -28, -155, 127, -22, -260, -198, 19, -242, 32, 162, -116, 78, -43, -23, 172, 74, 9, 111, 0, 43, 182, -74, 79, 51, -155, -44, 85, -135, 190, 58, -267, 26, -119, -8, 82, -56, -72, -50, 35, 187, 167, 104, 125, 4, -36, 2, 168, 12, -61, -94, -145, 189, -50, 17, 240, -110, 81, -110, -142, 156, -13, -33, 70, -260, -230, 36, -74, 47, -28, -213, -16, 135, -118, 150, 165, -44, -165, -16, -35, 39, -86, 82, 136, -94, 131, 199, 18, -218, 39, -1, 104, -44, -48, 96, -41, 25, 52, 80, 108, 75, -59, 185, 28, -92, 182, 71, -37, -44, -105, -1, 10, -61, -92, 132, -218, 41, 261, -55, -114, 21, -135, -22, 221, 5, 48, -50, -157, -20, 79, -90, 29, 22, 18, 100, -208, 12, 22, -216, 107, 32, -141, 132, 48, -89, 8, 0, -88, 230, -132, -7, 80, -15, 27, 59, 10, 42, -50, 7, 166, -49, -321, 146, 38, 4, 39, 33, -97, -4, -214, 34, 131, -101, 195, 65, 77, 22, 24, -52, 98, -121, -47, 27, -112, -237, 18, -106, 10, -74]
3029g4R7j89J04q5K77j42j9Q9j82J16J0P0Lo0k80M05kk58K19L5k16J59j85K6K05
3054A23k54J20J10l34L36J70k63rJ00j97L26k90l7L77k82k16L33j00K12l26r7
3075a98K47mj86J52j12j05J59P3mj51pM3Q3q8j58L12k17J44J10k27K28k26J15
3098a7n0j06MJ97p1P6j06Q1P7J27l19K53r4k01J94K45l31J01j09pK06Rq1k8k22
3123a72K21J14k93n5J78j9J04n4j4J07j38m5J71l9k8Q6l13K74j94p7L00K4k40
3146a02J36j72K27K5k55l5J15l9J15K76m87O7K3nK49k45l4J67O8p0p5m5N5K08
3170A67k08%J45l29K07Q0l2N1L3k37L43j89QO1j20J64p9j72M8J93m10L68L4j26
3194@J05l8j62L16l15OJ86l2j42J04k13K29j05j39J75L3j42k5J19l4P4k27J66
$$ y = [-74, 23, -166, -62, -147, 130, -12, -31, 58, -124, -8, 2, 72, 75, 15, -265, 140, 138, -120, 99, 134, -82, 77, -108, -82, 123, -131, -11, 99, -235, 101, 271, 8, -1, 99, -98, 228, -62, -99, 278, -4, -220, 113, 13, 225, -101, -198, 49, 45, -141, 11, -101, -206, -47, 26, 22, -129, -136, -93, -10, -98, -256, 56, -161, -17, 93, -134, 94, -132, -17, -67, -173, -169, 28, -43, 33, -73, 8, 85, 212, -107, 146, 52, -149, 45, 290, -41, 60, -49, -56, 150, 159, 78, 50, -172, 49, 163, -130, -185, -7, -26, 78, 24, 10, 117, -21, -66, 105, 66, 38, 124, -189, 85, -109, -186, 114, 138, -102, 34, -138, 89, 114, -141, -176, -61, -100, 15, 291, -196, -129, -106, -111, 138, -107, -141, 26, 94, 24, -51, -96, -41, 167, -41, -41, 104, -225, -18, 62, 30, 81, 114, -123, 220, 31, 39, 100, -20, 144, 65, -107, -59, 134, -276, 92, 126, 0, 105, 67, -95, 221, -94, -88, 98, 66, -76, 28, -185, 44, -61, -200, -25, 8, -134, -159, -40, -74, 0, -227, -61]
3217f1J80k86n2L27j31n0Qj3K32j47N4n6m3l31L09O4K9J13k55M2J66r5J9J8k0
3242B1M3p6M6P7Jj18K67m17J13J92j15l9Q2j14RJ84j99J27k33J56J83j09k09K01
3266G3j75OR3l1J71j10o5o1L3M5P3N1n6Kj93P8J64k53J19J52j30J8o7j44J84J15
3292I2j11Q9j57j11L09n7j1O1O8j45J23j55r5J16r1K38Q7l19K05Kk51J22J09k00
3316h2J01j02L9J42j46J03J4J11l57K08m5J36j04o8J79j50K28r6l19L47l0k03
3338i4K36j3j05k6j66J27p4O5j35P2N4n9J20p8pj2P9K4n6k6J01j61K2Q4J4l1J36
3365I1j20m3J46k3O1j98O7Kj67O1J60l1J2K16k70L4L0L6j5J5j63J0J53J85k51
3390bj16K34j26Q4k51L55j81K0N0k50J90K1j80J43J32k78J27j86R4J38p0k50L23
$$ y = [-61, 119, -167, -219, 108, -23, -73, -65, -78, 154, 7, 61, 5, -38, -369, -60, 4, 33, 146, -109, -67, 99, 4, 23, 41, 21, 64, -12, 34, 111, 112, -6, 261, -156, -43, 149, 34, -5, 77, -37, -28, 156, -43, 84, -149, 7, 190, 81, -128, 73, -102, -96, -3, -34, 137, 27, -38, -99, -66, -21, 52, 103, 47, 49, -144, -66, 98, -155, -36, 116, -14, 4, -63, -207, -23, 92, -19, 70, -87, -198, 111, 54, 43, 104, 172, 27, 150, -5, -100, 16, -75, 163, 250, -69, 136, 138, -113, 9, 118, -82, 19, -83, -44, 98, -48, 55, 69, 180, -177, 31, -14, 122, 18, -50, 129, -21, 207, 111, -208, 139, 109, -94, 142, 129, 24, -2, -168, -41, -115, -50, -185, -113, -59, -118, 2, -76, -83, -95, -16, 8, -48, -74, 27, -134, -112, -28, -14, -45, 91, -29, -72, 74, 51, 112, -86, -19, -17, -184, -123, 37, 6, 18, 234, -36, -2, 28, 64, 49, 64, -99, -89, 64, 249, -2, -118, 116, -10, 74, -177, 178, -3, 17, 67, -183, 7, 28, -152, -9, 123, -155, -28, -214, -120, 18, -52, -302, 21]
3413B1j07o2R2Q7n9j06j0J66m3j84J63j3m2J63j28j32K41o0j61K68k44J43J39
3436A32l81K95K9M6K6j08k29K08o2O4O4l43K25K38k51K11k21n6K14l4r4N3J29
3459A55j70K2Q4j63K01k50J83k6k16N8J38n3M9j08P8Q3J9l40K44jq6j0K5l7J17
3484dq9K11k13n1N5K4K31j37j40J9J34k21K15J49l31K35Oj76o6J75j13K40j67
3507a4o4K91l87J32M1K2Q2l8j8R1p6P0r6N3n8J00Rl15L47m5K4k28r7O3K41k67
3533a37Q0J24n7m2j02k8L69l36OQ8P9k85L25k15J27K09j92R0j81K03k32J20n2
3556c9N8j25r3L81k64r0K11k20K60K9j61O5k4L6j8J18r3K36k09J05p0n5j06J00
3580C2O6J75k86k12K73l8j19K71j72J1J02l04M01k17j42K37P5l50J00J11P3j07
$$ y = [21, -86, -148, -56, 31, -28, -134, -144, 22, -21, -205, -42, -55, -97, 66, -62, -194, 47, -13, -174, 94, -150, -7, 132, -249, 46, 75, 121, 147, 39, -190, 18, -44, 20, 84, -259, -34, 204, -47, 164, -57, -113, 101, 67, -27, 26, 155, -15, 7, 91, -72, 129, -121, 62, 36, -180, -122, 16, -37, 12, -96, -18, 65, 84, -256, -12, -13, -99, -109, -84, -121, -4, -93, 118, -95, -146, -91, -67, 164, 27, -113, -94, 40, -181, 34, 183, -148, 87, 93, -83, -149, 26, -87, 153, -14, -78, 213, -174, -42, -1, 21, 103, 65, 47, 138, 62, 132, 36, 89, 31, 131, 140, -175, 172, 127, 151, -77, -174, -111, 130, -137, -57, 67, 10, -32, -134, -162, 207, -129, -123, -35, 44, -241, 84, -131, -4, 205, 13, 103, -78, 125, -107, 13, -39, 19, -106, -199, 182, -82, -172, 39, -181, 79, 108, -53, 12, -12, 24, 6, 124, 31, 267, 58, 163, 93, 38, -68, 32, 98, 273, -13, -225, 48, 10, -109, 162, -10, 1, 103, -201, 200, -17, -159, 78, 153, -197, -97, 14, 87, -20]
3602b0O4r8J82k27K4K38l06m3K34k43J25m1O2J96j32O4q3M0j3l6K5p5PP0l9J29
3628A04k49J23K19k88R6N6lL1j39N8K58l23Q1J73j74n8j05J76j29R0k99L89n9
3651B8j55K87j03J36j74j10J28J32j75j55K31k25P6P5K0Mj94K75j25r9j7J07j7
$$ y = [-20, 44, -54, 128, -99, -75, 163, -143, -186, 48, -195, -70, -111, -49, 147, 15, 79, -4, 36, 23, -13, 12, -63, -56, 14, -25, 104, -145, -22, 197, -91, 5, 61, 58, 89, -50, 8, 266, -57, 24, 197, 23, -35, -140, 36, -93, -3, -302, 87, 28, -127, 160, 57, 193, 19, -91, 37, 169, -6, -161, 70, -155, -79, -4, 16, 20, -174, 101, -24, -123, -140, -33, -50]
$$ [...]
8191A87
##END NTUPLES=NMR FID
##END=
