##TITLE=1H_Pr C8_2
 CDCl3, 8 sc, 
 6.07.2021
##JCAMPDX= 6.0         $$ Bruker NMR JCAMP-DX V2.0
##DATA TYPE= NMR FID
##DATA CLASS= NTUPLES
##ORIGIN= UXNMR, Bruker Analytische Messtechnik GmbH
##OWNER= root
$$ XWIN-NMR		Version 3.5
$$ Tue Jul  6 10:56:43 2021 Russian Standard Time (UT+4h)  she@DPX200
##.OBSERVE FREQUENCY= 200.131506
##.OBSERVE NUCLEUS= ^1H
##.DELAY= (6, 6)
##.ACQUISITION MODE= SIMULTANEOUS
##.ACQUISITION SCHEME= undefined
##.AVERAGES= 8
##.DIGITISER RES= 18
##SPECTROMETER/DATA SYSTEM= spect
##.PULSE SEQUENCE= zg30
##.SOLVENT NAME= CDCl3
##.SHIFT REFERENCE= (INTERNAL, CDCl3, 0, 15.7039)
##AUDIT TRAIL= $$ (NUMBER, WHEN, WHO, WHERE, WHAT)
$$ ##TITLE= Audit trail, XWIN-NMR		Version 3.5
$$ ##JCAMPDX= 5.01
$$ ##ORIGIN= Bruker BioSpin GmbH
$$ ##OWNER= she
$$ F:/spectra/data/she/nmr/H-F/1/audita.txt
$$ ##AUDIT TRAIL=  $$ (NUMBER, WHEN, WHO, WHERE, WHAT)
(   1,<2021-07-06 10:55:12.56 +0400>,<she>,<DPX200>,
      <created by zg, POWCHK disabled, PULCHK disabled
       configuration hash MD5:
       00 E9 B6 7A A2 85 ED C7 34 08 36 98 17 FE 4E 26
       data hash MD5: 16K
       F5 33 17 77 2F 4F 0E 60 07 BA 00 BE 88 18 FC 9C>)
$$ ##END=
$$ 
$$ hash MD5
$$ 47 78 74 D1 26 0E C4 91 A1 3B 70 55 F7 78 3A 2F
##$RELAX= 
##$RELAX= 
##$RELAX= 
##$RELAX= 
##$RELAX= 
##$RELAX= 
$$ Bruker specific parameters
$$ --------------------------
##$DU= <F:/spectra>
##$EXPNO= 1
##$NAME= <H-F>
##$PROCNO= 1
##$TYPE= <nmr>
##$USER= <she>
##$AMP= (0..31)
100 100 100 100 100 100 100 100 100 100 100 100 100 100 100 100 100 100 
100 100 100 100 100 100 100 100 100 100 100 100 100 100 
##$AQSEQ= 0
##$AQ_mod= 1
##$AUNM= <au_zg>
##$AUTOPOS= <>
##$BF1= 200.13
##$BF2= 200.13
##$BF3= 200.13
##$BF4= 200.13
##$BF5= 200.13
##$BF6= 200.13
##$BF7= 200.13
##$BF8= 200.13
##$BYTORDA= 1
##$CFDGTYP= 0
##$CFRGTYP= 5
##$CHEMSTR= <none>
##$CNST= (0..31)
1 1 145 1 1 1 1 1 1 1 1 1 1 1 1 1 1 1 1 1 1 1 1 1 1 1 1 1 1 1 1 1 
##$CPDPRG= <>
##$CPDPRG1= <>
##$CPDPRG2= <>
##$CPDPRG3= <>
##$CPDPRG4= <mlev>
##$CPDPRG5= <mlev>
##$CPDPRG6= <mlev>
##$CPDPRG7= <mlev>
##$CPDPRG8= <mlev>
##$CPDPRGB= <>
##$CPDPRGT= <>
##$D= (0..31)
0 1.2 0 0 0 0 0 0 0 0.06 0 0.03 0 0 0 0 0.0002 0 0 0 0 0 0 0 0 0 0 0 0 
0 0 0 
##$DATE= 1625554511
##$DBL= (0..7)
120 120 120 120 120 120 120 120 
##$DBP= (0..7)
150 150 150 150 150 150 150 150 
##$DBP07= 0
##$DBPNAM0= <>
##$DBPNAM1= <>
##$DBPNAM2= <>
##$DBPNAM3= <>
##$DBPNAM4= <>
##$DBPNAM5= <>
##$DBPNAM6= <>
##$DBPNAM7= <>
##$DBPOAL= (0..7)
0.5 0.5 0.5 0.5 0.5 0.5 0.5 0.5 
##$DBPOFFS= (0..7)
0 0 0 0 0 0 0 0 
##$DE= 6
##$DECBNUC= <off>
##$DECIM= 32
##$DECNUC= <off>
##$DECSTAT= 4
##$DIGMOD= 1
##$DIGTYP= 9
##$DL= (0..7)
0 120 120 120 120 120 120 120 
##$DP= (0..7)
150 150 150 150 150 150 150 150 
##$DP07= 0
##$DPNAME0= <>
##$DPNAME1= <>
##$DPNAME2= <>
##$DPNAME3= <>
##$DPNAME4= <>
##$DPNAME5= <>
##$DPNAME6= <>
##$DPNAME7= <>
##$DPOAL= (0..7)
0.5 0.5 0.5 0.5 0.5 0.5 0.5 0.5 
##$DPOFFS= (0..7)
0 0 0 0 0 0 0 0 
##$DQDMODE= 0
##$DR= 18
##$DS= 0
##$DSLIST= <SSSSSSSSSSSSSSS>
$$ [...]
##$SUBNAM2= <"">
##$SUBNAM3= <"">
##$SUBNAM4= <"">
##$SUBNAM5= <"">
##$SUBNAM6= <"">
##$SUBNAM7= <"">
##$SUBNAM8= <"">
##$SUBNAM9= <"">
##$SW= 20.0188882624521
##$SWIBOX= (0..15)
0 0 2 0 0 0 0 0 0 0 0 0 0 0 0 0 
##$SW_h= 4006.41025641026
##$TD= 16384
##$TD0= 1
##$TE= 0
##$TE2= 300
##$TE3= 300
##$TEG= 300
##$TL= (0..7)
0 120 120 120 120 120 120 120 
##$TP= (0..7)
150 150 150 150 150 150 150 150 
##$TP07= 0
##$TPNAME0= <>
##$TPNAME1= <>
##$TPNAME2= <>
##$TPNAME3= <>
##$TPNAME4= <>
##$TPNAME5= <>
##$TPNAME6= <>
##$TPNAME7= <>
##$TPOAL= (0..7)
0.5 0.5 0.5 0.5 0.5 0.5 0.5 0.5 
##$TPOFFS= (0..7)
0 0 0 0 0 0 0 0 
##$TUNHIN= 0
##$TUNHOUT= 0
##$TUNXOUT= 0
##$USERA1= <user>
##$USERA2= <user>
##$USERA3= <user>
##$USERA4= <user>
##$USERA5= <user>
##$V9= 5
##$VALIST= <valist>
##$VCLIST= <CCCCCCCCCCCCCCC>
##$VD= 0
##$VDLIST= <DDDDDDDDDDDDDDD>
##$VPLIST= <PPPPPPPPPPPPPPP>
##$VTLIST= <TTTTTTTTTTTTTTT>
##$WBST= 1024
##$WBSW= 4
##$XGAIN= (0..3)
0 0 0 0 
##$XL= 0
##$YL= 0
##$YMAX_a= 1033292
##$YMIN_a= -888071
##$ZGOPTNS= <>
##$ZL1= 120
##$ZL2= 120
##$ZL3= 120
##$ZL4= 120
##$ABSF1= 10
##$ABSF2= 0
##$ABSG= 5
##$ABSL= 3
##$ALPHA= 0
##$AQORDER= 0
##$ASSFAC= 0
##$ASSFACI= 0
##$ASSFACX= 0
##$ASSWID= 0
##$AUNMP= <proc_1d>
##$AZFE= 0.1
##$AZFW= 0.1
##$BCFW= 1
##$BC_mod= 2
##$BYTORDP= 1
##$COROFFS= 0
##$CY= 11.3945322036743
##$DATMOD= 1
##$DC= 2
##$DFILT= <>
##$DTYPP= 0
##$F1P= 15.9154993809931
##$F2P= -4.1035820241983
##$FCOR= 0.5
##$FTSIZE= 0
##$FT_mod= 4
##$GAMMA= 1
##$GB= 0.15
##$INTBC= 1
##$INTSCL= 1
##$ISEN= 128
##$LB= 0.24
##$LEV0= 0
##$LPBIN= 0
##$MAXI= 10000
##$MC2= 0
##$MEAN= 0
##$ME_mod= 0
##$MI= 1.114404
##$NCOEF= 0
##$NC_proc= 0
##$NLEV= 6
##$NOISF1= 3.799351
##$NOISF2= 2.8
##$NSP= 1
##$NTH_PI= 0
##$NZP= 0
##$OFFSET= 15.70392
##$PC= 1
##$PHC0= -11919.35
##$PHC1= 18.00099
##$PH_mod= 1
##$PKNL= yes
##$PPARMOD= 0
##$PSCAL= 0
##$PSIGN= 0
##$REVERSE= no
##$SF= 200.130013532006
##$SI= 16384
##$SIGF1= 3
##$SIGF2= 2
##$SINO= 400
##$SIOLD= 16384
##$SREGLST= <1H.CDCl3>
##$SSB= 0
##$STSI= 0
##$STSR= 0
##$SW_p= 3612.71676300578
##$SYMM= 0
##$S_DEV= 0
##$TDeff= 0
##$TDoff= 0
##$TI= <>
##$TILT= no
##$TM1= 0
##$TM2= 0
##$TOPLEV= 0
##$USERP1= <user>
##$USERP2= <user>
##$USERP3= <user>
##$USERP4= <user>
##$USERP5= <user>
##$WDW= 1
##$XDIM= 8192
##$YMAX_p= 0
##$YMIN_p= 0
$$ End of Bruker specific parameters
$$ ---------------------------------
##NTUPLES= NMR FID
##VAR_NAME=  TIME,          FID/REAL,        FID/IMAG
##SYMBOL=    X,             R,               I
##VAR_TYPE=  INDEPENDENT,   DEPENDENT,       DEPENDENT
##VAR_FORM=  AFFN,          ASDF,            ASDF
##VAR_DIM=   8192,          8192,            8192
##UNITS=     SECONDS,       ARBITRARY UNITS, ARBITRARY UNITS
##FACTOR=    0.0002496,     1,               1
##FIRST=     0,             0,               0
##LAST=      2.0444736,     0,               0
##MIN=       0,             -888071,         0
##MAX=       2.0444736,     1033292,         0
$$ Real data points
##PAGE= N=1
##DATA TABLE= (X++(R..R)), XYDATA
0@%%%%%%%Qj6J6j6K4m0N6p2Q8j04J28j68K08k46K93l49M14m88N70o63P71q92J028
30E50j179J346j532J741j972K225k502K806l143L514l916M353m835N362n938O568
46C448p252P998q818R717j0704J1790j2988J4318j5804J7474j9355K1497k3964
59a2643K6840l0247L4352l9410M5823n4258O5917q3182J11635j69162M67518r24447
71e61264j8315J612871j293194l84228J317497o14737p38137J244523l74743r18945
81g28672J079730J75005j243220O67087P35070j014778q0067R05638m56432m33564
91c94203O03442m4837m87570M39480J38350o09936K97069N28500p17491j36309
101c83505Q70426l89214o43292P83630Q5454p61056M86003K90525p22420L95646
$$ y = [0, 0, 0, 0, 0, 0, 0, 0, 8, -8, 8, -8, 16, -24, 32, -40, 48, -56, 72, -96, 112, -134, 159, -190, 224, -264, 306, -357, 414, -478, 550, -629, 717, -815, 926, -1046, 1179, -1323, 1483, -1660, 1854, -2062, 2291, -2544, 2818, -3120, 3448, -3804, 4194, -4624, 5093, -5611, 6179, -6809, 7509, -8295, 9179, -10176, 11321, -12643, 14197, -16050, 18302, -21108, 24715, -29543, 36374, -46808, 64827, -104335, 363183, -561264, -579579, 1033292, -259902, -644130, 673367, 58630, -679507, 565016, 190273, -728672, 351058, 526063, -717157, -50070, 685000, -329778, -409845, 495793, 39361, -394203, 209239, 164402, -323168, 116312, 254662, -355274, -58205, 470295, -247196, -383505, 486921, 97707, -545585, 238045, 323499, -437557, 48446, 338971, -383449, 12197]
111A2197M16160q55843K73752P58050q94719j35177R94171n71480m98841Q60453
121C58723k29308n45073O82402j22333n85462O83987N0648p91164N40590M23725
131D66735q04553J33520O13401n03754j51784M96680k56884k00008M11832j57570
141D7615l17846M10615Q5711n03210J86822M32118m18741k09264N19596j00212
151A33204m16401L69104J13061m48251K78134K46115n54971J87437N14958o23645
161b01255j19501P63862m13170m73399P26695q2625n95854N37792J03900o02548
171c56103M27531K53022o72962K72710N00425o44438m5418O42354l85338l06488
181c14705N28166j13777l45159L56480Q141l34959K68826J31760l75886J12119
$$ y = [12197, 428357, -427486, -153734, 604316, -290403, -425580, 568591, -2889, -501730, 358723, 129415, -415658, 266744, 144411, -441051, 242936, 293584, -497580, 43010, 466735, -337818, -204298, 409103, -94651, -246435, 250245, -6639, -206647, 205185, 47615, -270231, 140384, 226095, -277115, -90293, 341825, -76916, -286180, 233416, 133204, -283197, 85907, 198968, -249283, 28851, 274966, -280005, -92568, 422390, -201255, -320756, 443106, 29936, -443463, 283232, 200607, -395247, 142545, 246445, -356103, 71428, 324450, -348512, -75802, 424623, -219815, -265233, 377121, -8217, -314705, 213461, 99684, -245475, 111005, 119146, -215813, 53013, 184773, -191113, -78994]
191g8994L16417k95606j45823L60026n9596k90925K18508J18636k69069R1359
201c5067J83243k55855K3369K85093k68888j27358M10263j57578l25997L91827
211A23052M1774l99521K59427J61316l70326J67052K20430l72705R0934L30807
221B52240l64915o8596M25408k39118k33622L86310p1510k83359K82032K2350
231A07220k75459K12696R5194k92397J25323K07049k64716l0397K70688j38862
241A6339j57948K21219n528j86693J36162O8474j83416P2343J41536j85797k6398
252h9707K28874j28600j62715K48322l692k48331J82625J04704k57104J02380
262b3244J71077k46791K6706K39260k21724q1511K95255j38689j95856K83106
$$ y = [-78994, 237423, -58183, -204006, 156020, 96424, -194501, 24007, 142643, -126426, -35067, 148176, -107679, -84310, 200783, -68105, -195463, 214800, 57222, -268775, 123052, 164826, -234695, 24732, 186048, -184278, -17226, 203204, -169501, -78567, 252240, -112675, -181271, 244137, 5019, -228603, 157707, 86197, -197162, 84870, 107220, -168239, 44457, 139651, -152746, -27423, 179626, -85090, -115487, 155201, 16339, -141609, 79610, 74082, -112611, 23551, 92025, -91391, -19048, 122488, -63309, -89707, 139167, 10567, -152148, 96174, 92482, -155849, 26776, 131480, -125624, -23244, 147833, -98958, -72252, 167008, -54716, -136227, 159028, 20339, -175517, 107589]
272A07589k1744k53760K15045O8889k56144J39451J33505k41961N7491J94311
282A42672k00558m5441K27124j16038j34576K03859k0351j73605J45346N3683
292H2115j75093P8404J10506j54787l92J54214j04025q4961J63592k6295j47470
303a04192J32895N1032j70867P8370J12377j64355J1141J58926j29950o5604J82567
314I2340o8749j34510J72876M696j79159J36467P3030j94597Q0809J29654j79526
325f6669J0421J67134j34507o1636J75737p0254j18748J58477m608j52294J22039
336B5092N5882j62270O7939J05869j41424J137J31003r1559n9731J27500l2534
347B6904j01204J05579K2499j23631O9744P3683j25410J7354J10930r5204m2680
$$ y = [107589, 85845, -167915, 47130, 116019, -140125, -674, 132831, -109130, -51639, 142672, -57886, -103327, 123797, 7759, -126817, 77042, 56691, -116914, 28432, 82115, -92978, -14574, 95932, -58855, -59247, 94967, -9058, -94019, 69573, 43278, -104192, 28703, 79735, -91132, -12762, 99615, -64740, -53599, 105327, -24623, -90227, 92340, 23591, -110919, 61957, 66653, -112506, 23961, 96991, -97606, -16797, 112857, -66669, -56248, 110886, -23621, -85257, 90480, 20226, -98522, 59955, 55347, -96947, 25092, 80974, -81296, -13357, 92512, -48912, -47775, 83228, -8331, -68062, 59438, 26904, -74300, 31279, 53778, -69853, -109, 73574, -51836, -34482, 76448, -18756, -61436]
358f1436J21871m2948q9863J06658J1708j18119P9369N9670j30778M1554J02663
369H0349j22547j0069J29811q6273o3868J29899l3164j01964J08554J7620j21822
380g3474P8793N9888j27144M0340R5375j13537o646J14299p6318n2739J08220
391D7057k6244q2399Q2452J9621r3491N1185N3923r1863J6757P9127p5164k3480
403d2519R0280l8106o1951P7485J0091q2651M6956M9882q4212J4471P4827p5530
415b0977j5368R1398n6840n0677R7204j9614q3931P8959K7826r7312M3438O0970
427E5076q9058J3293P6142p8034j0459Q8689o2442m1469R2869k4957p1885O9568
439A7333K0613p5141L0953M4082n9917P483N0071n1313q253O0959l8022l8292
$$ y = [-61436, 60435, 17487, -72376, 34282, 45990, -72129, 7240, 66910, -63868, -22314, 80349, -42198, -52267, 77544, -8729, -72597, 57302, 24138, -77826, 30728, 48348, -73474, 5319, 65207, -61937, -21597, 73778, -39759, -46405, 67894, -8424, -61163, 47057, 20813, -61586, 20866, 40487, -53004, -1819, 52104, -39759, -23002, 56125, -19039, -42519, 47761, 9655, -52296, 25189, 35280, -47371, -415, 49467, -34745, -20274, 54553, -20977, -36345, 55053, -1787, -52464, 44740, 25126, -58805, 20154, 47980, -49332, -5894, 55076, -33982, -20689, 55453, -22581, -33040, 55649, -6793, -48262, 44607, 19650, -52235, 17333, 37946, -37195, -6242, 37840, -22077, -14594, 35477, -15836, -24089, 36870, -1152, -39444]
451c9444O3311J580o3622L2002M4157n5733p565N6383l5571k3073N6601l0972
463a946l5544O9696j6747o7738O6721K8058q6688K6032O6150o7164j0908O5867
475C5789m6650j6198O4684m8578k8757Q1721l1378o3904P1771J7791p2496K4154
487a2051M3244m1595l603L0693k6710K318L2124l6127j1891N1139j3551m6565
499c2575L0560L5231l9196k0882M3996j027l4170K2358L445k0916L0834r041m2384
512c3767M9023K3076p4328J6912O7762n2752l1498O1663j6571k9307M0441k5757
524e103j8155O2482l6209n1269P7327N529p6771L4770M2484m4296l486K2903j7293
537g087J1846J0720l9957J6302M3659m2555k6391M8571P874l8739l551L0605M848
$$ y = [-39444, 23867, 25447, -38175, -6173, 37984, -17749, -25314, 31069, -4502, -27575, 29026, -1946, -37490, 32206, 15459, -52279, 14442, 42500, -44188, -18156, 47994, -19170, -30078, 35789, -10861, -27059, 37625, -10953, -39710, 42011, 10633, -53271, 18500, 36291, -36205, -12051, 31193, -10402, -14005, 16688, -10022, -7704, 24420, -11707, -23598, 27541, 13990, -32575, -2015, 33216, -5980, -26862, 17134, 16107, -18063, 4295, 7740, -13176, 17658, 8617, -33767, 15256, 38332, -35996, -19084, 48678, -4074, -35572, 26091, 9520, -19787, 20654, -5103, -23258, 39224, 3015, -48254, 29073, 34602, -42169, -7399, 35085, -9211, -12697, 10206, -7087, 4759, 15479, -24478, -8176, 35483, -7072, -33463, 15108, 22982, -15757, -19308, 11297, 16145]
550A6145k9087j42K1268m817k110o888j2472L3413O643n7516J8953O2140n0099
563d569m0489O6390J143n1029L1018M800k5410M1240k0526m7716P2189R412q7373
576e0920L9487N9175o0642j4340M3839j3779n466J1022k7177J7121L4858m7698
588a4520j5863N7402q403m2285J4515K3919m35k3438r531L3023M869l3529L813
601a0463K0095J598q409j9251J1826L4962k8373l8044M9557K0807n6805P109L7025
614B1634k1455M41J039k2236M0479N766o6744L4457N3683o1401j6050N3115j4415
627H313j8697J5121j6825J2788K8144m9853p737O6606k7007n0387M5508J5961
639B1935l0745K519M01Q033J4536k8807q350L7519l921l0713N327K2848K481k2344
$$ y = [16145, -12942, -13084, 8184, 3367, 1257, -5631, -18103, 15310, 21953, -35563, -16610, 45530, -4569, -45058, 21332, 22475, -28554, 2464, 7264, -18146, 23094, 2568, -45148, 27041, 36453, -50920, -11433, 47742, -12900, -27240, 16599, 2820, -2646, 8376, -18801, -1680, 33178, -14520, -30383, 27019, 18616, -23669, -9154, 14765, 14330, -9108, -18639, 14384, 19253, -14276, -10463, 9632, 11230, 2821, -16430, -4604, 30358, 1985, -36059, 13498, 34305, -22500, -15391, 21634, 179, 620, 1659, -20577, 19902, 25668, -41076, -6619, 47064, -14337, -30387, 22728, 8313, -10384, 4737, -12088, 700, 28844, -21009, -28746, 37860, 10853, -39534, 5974, 21935, -8810, -6291, -5890, 2143, 16679, -12128, -20478, 17041, 13120, -17593, -12266, 10582, 13063, -9281]
653i281j2035L2466J1394m4157L330M1737k0824j7774J8402q763J0902J0496m4180
666b8287J9360N0631n4758k3049O3892j2307m0554K7335M888j2816J8671k0125
678g119j4712M9698j4778n0449M4369K2725m5880N372K1168q196M878j2304q523
691a3751L2034o258l3372J9351K1597j9636r351P589Q278N905k0092p676L4082
704A8700o839l3013K1757J4419j8679M055n348O83K4622k4423k0165M2306k314
717A5761l8414K1042J6271k0618O022K34j1541K5258n955l5726L3211J9628m6028
730b0855R869K9043k3166K32Q921j5428J7646N288l1735J5612K5554k8605q402
743a6026K5805n671j0463N919m879P982O637k2641P022K1605j9091o400J4454
$$ y = [-9281, -21316, 11150, 22544, -21613, -18283, 23454, 2630, -15144, 3258, -5505, 5397, 15893, -28287, -8927, 41704, -13054, -36103, 27789, 15482, -25072, 2263, 7151, -5665, 13006, -7119, -21831, 27867, 13089, -37360, 7009, 29734, -16146, -10774, 10394, 2198, 7076, -5228, -13751, 18283, 12025, -21347, -1996, 19601, -35, -9386, -1797, 6481, 12386, -7706, -15382, 18700, 11861, -21152, 605, 15024, -3655, 400, -4948, -4265, 20357, -4066, -24231, 18075, 15761, -22653, -1611, 14660, -5958, 64, 298, -11243, 14015, 8060, -27666, 5545, 25173, -20855, -10986, 18057, -5109, -4877, 4044, -11384, 6262, 11550, -20185, -4573, 20981, -7624, -16026, 9779, 4108, -6355, -436, -5315, 2667, 9304, -13337, -6315, 15290, -3801, -10201, 4253]
756D253m111K130k271j0794J7934L144k4717J1447J6822j8406j752J2333q956
769b944M443N752j8897J1750J7928k9246J984K7702k1374o573K0291j3584k99
782c067J4598j9232K455K1817k0275q431K5068q301j5168J6568k184j0058J3963
795G753p968q189J9409q642j3898J8810k035j2214R916j282m214O730n827k341
809c992R607n062o091Q738j576n511O212l666k571R900q529m550J5396r566p505
824h766J6491r011p221J6476r865o998J6590p422j0193J6039l231j3704J5433
837D618L92j6426J4656L683j8266J2970O140j7540J0673O216j5586R051O059j3652
851g012O460O960j0631J459Q009o177j347N528l981P2M185n962J980M740o243
$$ y = [4253, 142, 2272, 1, -10793, 7141, 10285, -14432, -2985, 13837, -4569, -6321, 6012, -2944, 1499, 7251, -11646, 104, 18032, -11214, -9230, 18472, -2902, -9475, 10816, -2768, -3067, 11531, -7701, -5246, 16571, -3704, -12135, 12933, 4632, -10536, 6032, 3848, -6210, 7753, -215, -8404, 11005, 2363, -11535, 7275, 5240, -6974, 2942, 1660, -2554, 4176, -1651, -3992, 5615, 553, -5538, 3200, 1624, -3887, 2325, -1341, -3912, 5988, -2541, -7091, 8305, -1261, -8766, 7725, -1286, -8507, 7969, -1896, -8894, 7696, 274, -9919, 6120, 2889, -10815, 4618, 5010, -11416, 3240, 6923, -11343, 1627, 7767, -9773, 900, 7116, -8470, 581, 6640, -7012, -552, 6408, -4223, -2764, 5245, -932, -2279, 3249, -732, -660, 3525, -2437, -457, 4283, -1960]
866a960J868K534l918M724k878m405J0226m005r033J1466K9r734P426J613q211
881d258P206K011j2177R677P019j8487O647J4245j7350L62J4326j2355r2J0631
895G405j2349J552J2059j1748m514J4673m318j0849R977K260q397M978R4m585
909c762P240l107o211P576N82n347J015J480K715k945m534O669J850p766K704
924a841M442m399N76K280m522L094N089j0909J985J3494j2716m964J6310p657
938B62p339J2253n555m614J0901o683o493J3388j978j2823J0047O315j3370M240
952a449P917r671K888M678q470M935M782r605K795O254m683k414K957J550j455
967A009k438K062J918k392r95J764L83j492K023k221j243O562n434m971J1678
$$ y = [-1960, -92, 2442, -1476, 3248, 370, -4035, 6191, 2186, -6847, 4619, 4648, -5086, 2340, 3953, -4258, 2948, 4959, -7218, 2459, 9478, -9009, -2362, 11883, -5467, -5105, 9221, -3134, -3226, 7405, -4944, -3392, 8667, -3081, -7595, 7078, 2760, -8089, 1888, 4148, -4249, 729, 823, -3762, 3478, 371, -5840, 1736, 2318, -3029, -2014, -534, 2181, -764, -5298, 1371, 3221, -4545, -1841, 2601, -1798, -1222, 1058, -3464, -370, 4719, -6190, -4205, 9289, -3427, -8391, 7919, 262, -7077, 5176, -379, -4993, 5908, -775, -7268, 6120, 4142, -8681, 1366, 7681, -5689, -1449, 6468, -3203, -315, 4363, -4107, 828, 5610, -3995, -1200, 5054, 371, -2043, 914, 2464, 1009, -1429, 633, 2551, 159, -836, 928, 1311, -181, 1842, -379, -1622, 4940, -494, -5465, 6213]
982F213l702j0269J2264o75j0312R349M02q831Q038J073j0203P260N962j2839
996f270L153J1328j2017j761J2162q251k982R295p508m27Q008p064k313P957k895
1011D15n137M696K132m065k89K273J43l82j468L96L206k890o43K281j929K805
1027A544q37o071Q448J529j2172P455P059j1128J997P015o884P61N792q498J952
1042b038J0711j1860m001J6428p215j0867J4118j561q252P879k803l609R051n148
1056H33p033J0318J453j0329K542P888m494l512K405P93K035l291l332O789qn723
1072b666K066R12K150k23q269N538Q684j1958k447J2206l979o512M982m48j398
1087a362N182p003l419J5067o105j5105J6427M410j5961N695N719o156M711k684
$$ y = [6213, 2511, -7758, 4506, 3831, -6481, 2868, 3270, -5561, 2477, 3550, -6653, 607, 6569, -6270, -3117, 8211, -3806, -5567, 6595, -1656, -4638, 4657, -2851, -3278, 4730, -2334, -4647, 3310, 415, -4722, -26, 2106, -1959, -2248, 25, 168, -214, -1682, -1286, 1920, -970, -1613, 668, -1261, 1544, 707, -5364, 3084, 4613, -7559, -104, 6955, -4173, -2176, 4839, -2045, -1284, 4508, -3990, -2038, 8673, -3187, -7188, 9240, 2025, -8842, 5276, 3715, -4537, 3342, 539, -3070, 5981, 833, -6200, 4118, 5571, -4758, -2216, 5672, 1178, -2334, 71, 864, 2899, -392, -3724, 3065, 3057, -2666, -600, 312, 2462, 2239, -6030, -492, 8192, -3766, -6213, 5993, 2014, -4498, 484, 36, -1362, 3820, -3183, -6602, 8465, 2360, -12745, 3682, 8092, -7869, -2174, 3545, -2611, 2100, -584]
1101e84o467J1650R51j4709O139J1726j0078n548Q660P60k899j157k734P399J639
1116D748j1171L662Q232m600l856J23M361M692j0214k714J3640k535j1489O321
1130h00O132n775j71l6j643Q821m020j3345J4834P442k0181M409J3965j0167j952
1145b487M432m607O609J175j3283O567J3062j3619p184J5263J9j0490L461K033
1159I51J585J386r754L107J1339q928o537Q161K655k848m953M3R973k357j2318
1174h495O940R508r063m798P239Q4n11r34p054Q889P355j7833J659J8148j1252
1189a18q429J1142j513k078K909p781M137J0860j2440o577J6898j396j4492P347
1203a531N866n210J586l273n67J0356p413q936J3258J898j0221J270M301J632
$$ y = [-584, -7051, 4599, 5550, -9159, -3020, 8706, -1372, -6920, 1740, 2500, -399, -1556, -4290, 3109, 4748, -6423, -2761, 5471, 871, -2985, -2862, 1499, 6191, -4023, -6737, 6903, 4368, -7121, -800, 5332, -443, -614, -650, -2293, 6528, 2508, -10837, 3997, 11439, -8742, -4333, 9632, -535, -2487, 1945, -2662, 3947, 5122, -8161, -1594, 11468, -2151, -9335, 5928, 5947, -4543, -1082, 951, 2536, 3922, -5832, -2725, 8614, -314, -6851, 1310, 3965, 1117, -3836, -3793, 6180, 3823, -8495, -1555, 7953, -1110, -5908, 1331, 1415, 904, -30, -7084, 1805, 9160, -8673, -7014, 11134, -118, -8547, 2595, 1082, -996, 1913, -5868, -1731, 9129, -3311, -9888, 7010, 5614, -8878, -1531, 4335, -875, 711, -2562, -3129, 7227, -186, -9122, 4136, 6034, -4187, -2917, 1384, 3016]
1217C016j679o491M459Q025p868o336R783J979p137J249M92K119L814r830r51
1232e356J5914r075j1278J4245J124r592N004p87j530P214o978o292J4169m81
1246F301j5296Q030R639j0986q01N447l675M568j768q379R966L563j2606L049
1260b948Q188n017k282O57J472L091l972m656P497K544q802J546N653l239J60
1275a08j091k528Q680l051j0794J1042M159j2528M218N296n681K926n3n548P644
1290B583J751j1504N104R935j1574j279J0006n966j430N634o771K856O337j0102
1304d420J056R726o897l432O127q53j762J240k407K009K909m882j036P006l784
1319F00l041M357j817N00J983o041M113M735q843J867O790o433n10N028m671J059
$$ y = [3016, 1337, -5154, -695, 7330, -538, -6874, 2909, 4888, -2249, -1000, -508, 1611, 5425, -4405, -5356, 10558, 1483, -9795, 4450, 5574, -4018, 986, 199, -1331, 5883, -1095, -7387, 6782, 6301, -8995, -965, 8674, -2312, -3113, 2334, -1341, 3227, 1459, -6920, 3046, 6609, -5997, -2948, 5240, 223, -2059, -1402, 70, 3161, -811, -5467, 2030, 4574, -4228, -2682, 2971, -268, -108, -1199, -3727, 4953, 1902, -8892, 2150, 6309, -6219, -2001, 3295, -2386, 540, 487, -5061, 2583, 4334, -7170, -2066, 7869, -3705, -4984, 5022, -944, -2374, 3260, -3511, -655, 5682, -4420, -3364, 6362, -535, -3967, 2160, 1307, -455, 785, -1622, 387, 3296, -1586, -2622, 4384, 600, -2441, 1916, 99, 599, 2582, -3459, 654, 5389, -3454, -1587, 5203, -1230, -1740, 3288, -1383, -324]
1335c24M364o677L04Q252o861l743R782m170n443Q320l336l948P592m497l657
1350d042Q221l828m667O756p67n057M435r7l350L162J3l574L841om353M526o12
1367F01l466M158j271k546M732l166j877N343l883j086M989l004k532N288j904
1382C76l889N297r19m278N515p95n773O488K73p408P063J307p726N699J760o293
1398c303M143J235m744L609J671n221K165M010m917K24L908l563N38K304l860
1413a801K829J603n359L290K281m459J947J078k078K288j091k616L994M32n033
1428b695K733L092m717Q66L070l800J508K691o300L731M046q098K344N672n913
1443a770j15L790k808M39J784l448Q61M219m637j857O432k334l995M157o26j156
$$ y = [-324, 4040, -2637, -2333, 5919, -942, -4685, 5097, 927, -4516, 3804, 468, -3480, 4112, -385, -4042, 4179, 351, -4316, 2440, 1673, -3384, 1051, 954, -2396, 766, 779, -2795, 1046, 1040, -3313, 1213, 601, -2865, 1293, 22, -2524, 2208, -958, -2835, 2508, -1375, -2461, 2528, -476, -3008, 2280, 376, -3513, 1784, 865, -3413, 2102, 1307, -4466, 2022, 2295, -5113, 1950, 3257, -4469, 1230, 2990, -3303, 840, 2075, -2669, 940, 2611, -2610, -445, 3565, -1352, -1128, 2780, -783, -245, 2059, -1801, 1028, 2631, -2728, 562, 2843, -1616, 331, 1409, -669, 1619, 528, -2088, 1906, 2338, -2695, 38, 3130, -1587, -721, 2349, -1451, 57, 2748, -3552, 179, 4225, -3873, -1529, 4143, -1770, -1885, 1905, -903, -464, 1320, -2128, -1267, 2952, -1685, -3542, 2890, 556, -3439, 718, 92, -1064]
1459a064K466l559O74M398m648p84M428j712j739J219l70J089P46l266J098L388
1475B364k805k486M773o19l145K815j285k56L642m893n25O291m166k804N493j164
1491A230k630K055m06q20K568j784k763N440q30n128L807K353m763K260P39k394
1507a066L113j628k551M467o44l760K108J827j893R0Lk80J735j037k510L279R53
1524B206m691K159K345l107J461j14j883L685j828l453M613J60m079K164J866
1539A504k643P93R20k151J917J123m400K450L409n328P79L817l808O42K047k811
1555a740K021R93l445J940K240l600L55K402j739m96J524j211M22J523k669Q12
1571f68L226l904k20L650k715rJ787k336J622J016l024J596K638l351m25K899
$$ y = [-1064, 1402, -2157, -1483, 2915, -1733, -2517, 1911, 199, -1540, -321, -691, 398, 1144, -2122, -1024, 2364, -441, -2927, 1846, 1227, -1918, 897, -388, -644, 2998, -1895, -2420, 3871, -295, -3099, 2394, 1230, -1400, 655, 249, -571, 1997, 213, -2550, 2890, 2060, -3068, 739, 3092, -1671, 589, 1328, -1066, 2047, 419, -2132, 2335, 1691, -2069, 39, 1866, -27, 63, 66, -214, 1521, 484, -2026, 1253, 2206, -2485, -326, 2019, -1088, 373, 259, -1624, 2061, 233, -3220, 1393, 1553, -2526, -362, 1504, -1139, -346, 574, -1577, 340, 1463, -2937, -487, 2922, -2406, -1627, 2190, -1618, -976, 1071, -1740, 281, 1274, -2171, -231, 2009, -1591, -1236, 1166, -573, -1069, 455, -756, -334, 1189, -1480, -668, 2558, -1346, -1566, 2084, -631, -640, 1147, -1189, 433, 1449, -1575, 21, 2659, -692, -1117, 1782]
1587A782j373j615K385r17n71K445k722o24M614l657j968N151k420j756K535j234
1603E5k86J868k367J44L055k336k268L465J36l309K103J95j279K380k274j158
1619a876M490k399l236M737r68k483J945m25m08J655k245n69L836j469l616L357
1635C26J401l528J353P36j360K498k016k592N274r26m853M080J446l413J058J05
1651d11j54J823j686k007L892N93m897K067L370l150m24J273j082K570j452l621
1667c296N222L48m904K036K765k242j97J08LK207j393l286L565K482n256J19M186
1684B467k334p96J169j394K573q8m715L595L360n567j45L803j143j083j31k22
1700f51K234j0m212J830M537m371k048M238p59j222Q30k343L027J395n444J740
$$ y = [1782, 409, -1206, 1179, 262, -309, 2136, -586, -1210, 3404, -253, -2221, 2930, 510, -1246, 1289, 55, -231, 1637, -730, -586, 2469, 133, -2135, 1330, 1466, -1843, 260, 455, -824, 1556, -718, -1876, 2614, 215, -3021, 1716, 748, -1735, 210, -215, -623, 1032, -1213, -1782, 2054, 585, -3031, 326, 1727, -1801, -448, 288, -1072, 1426, -590, -3182, 2092, 1166, -3687, 393, 1839, -1574, -516, -411, -565, 1258, -428, -2435, 1457, 2050, -2847, -780, 2590, -560, -984, 289, -793, 1777, 325, -3296, 1926, 2274, -2630, -594, 2171, -71, -268, -160, -157, 2050, 657, -2629, 936, 3418, -1838, -1719, 2467, 133, -663, 506, -888, 1685, 1597, -3118, 477, 3837, -1730, -1875, 1928, 785, -298, -429, -651, 1583, 1573, -2639, -809, 3728, -643, -2691, 1547, 788, -434, 396, -1947, 1080, 2475, -2969, -1229]
1716a229M781l721k485K971N68m57q14j662K615K123n162m93O010k400l759L674
1732E60l44n34Q16l132K468L710n660q62N694j775l251K052P73m32L61k171P80
1749i47L992l462l058N627qm457K062O60j66J272l219N74M354l401k628M228O98
1766B121l207N10P16L92J157k720r96N218j802m759M375J841l824Q88L04k64K663
1783B613l434j488N047r83m606K829K448k698k20O04l71J790j324l069M428J120
1799B686n541J951L005k880K85J82n04K702j617l163L798J010m048P82K566j502
1815b88k53L42r74K156j75l819L026K817m529J17L424k628M74M63j919L022l5
1832A221m157K753K507l580l05K678r56o15J064j712J075K376m336P38M165l356
$$ y = [-1229, 3552, -169, -2654, 317, 885, 428, -386, -2048, 567, 2690, -2472, -2965, 3045, 645, -3114, 560, 216, -318, 498, -2634, -166, 3544, -2116, -2978, 2716, 941, -2310, -258, 515, 83, 444, -1727, -947, 3045, -417, -3475, 2152, 2144, -2313, -251, 409, 243, 1515, -1704, -1130, 3224, -177, -2805, 1423, 2121, -1086, -576, 140, 532, 1689, -1031, -2027, 3191, 1389, -3370, 1005, 2846, -978, -90, 214, -50, 2613, -821, -2309, 2738, 1755, -2851, -22, 2426, -272, -492, 112, -259, 1531, 207, -2862, 1566, 2686, -2855, -904, 2101, -779, -494, -312, -816, 1886, 269, -2894, 904, 1914, -2134, -1352, 1214, -288, -541, -199, -1173, 983, 808, -3011, 15, 2832, -1697, -1580, 1844, -784, -310, 153, -1766, 1256, 1221, -2936, -183, 2324, -1256, -1561, 1117, 161, -454, 610, -1102, -27, 2349, -1987, -1249, 2916, -440]
1848d40r96K788j485j63J329k344J618J720l273K09L072j735j525K382q66m82
1864a91J386j958J80L202l320o20L679k516j029K610j606j11J992k553K08K932
1880B285k557r30K647j132j401J755m43j457K567j395j715L683j813k018L188
1895A264r77j814K366j334p62K383j561p82K050p75j394J941m8k088J893j08j906
1912a652K433l63k515K923n14k142K735q50j994L026o45k186K396k55j592J505
1928C10N2j719J729N49k555J846J017k686J903P37k561K032J68k004J956K27k315
1945a314J851Q14k268J109P57j525R42N02j807J236R23k289J073J954k970P45
1961b67J343j652J017N06k095J723O94k702J286J496j838M00Q62j046J12Q16j391
$$ y = [-440, -1436, 1352, -133, -296, 1033, -1311, 307, 2027, -1246, -1037, 2035, 300, -1225, 1157, 291, -191, 1195, -763, -583, 2619, -701, -1321, 2358, -158, -1187, 1423, -183, -294, 1698, -855, -647, 2285, -272, -1202, 1445, 313, -1088, 667, 224, -1233, 1334, -61, -1776, 1907, 94, -1924, 1264, 287, -1527, 839, -495, -1257, 1126, -435, -1217, 833, 58, -1336, 605, 557, -1531, 362, 254, -1652, 781, 418, -2097, 826, 312, -1830, 905, 55, -1939, 1087, 442, -1744, 652, 397, -1195, 310, 362, -1357, 372, 921, -1634, 212, 1229, -1457, 446, 1183, -1378, 654, 822, -1182, 774, 1001, -1314, 537, 1351, -917, 192, 949, -576, 366, 868, -939, 297, 1220, -1069, 4, 1958, -1012, -267, 1076, -576, 441, 947, -1148, 575, 1269, -1433, -147, 1349, -489, -89, 773, -273, -161, 655, -736]
1978g36N47J890k926j51L108k019n97J801j384N48P92k376J148J969k667j62K134
1995I19r31q43Q84k25j76Q64j619M10K490k524q61K729q80j546J404p22M11J062
2013H46k079N17K080j735j152K254r0j580J046L1m50J484j796p34L149j417k428
2030b054L044j29j810J416n69P9J496j809m58K174o79j787J201J134j730K87K66
2047G2k33J204j111j467K930k00k688J774N97j310J006n63l66J533r26j576J840
2064E16O68k370P56J374j254L0M98j011J573k0k601J960J402k837Q44J095j085
2081d62P12k87j069J502O0k050J217J479j914j1J507r69k87R60j305J075P92k381
2099a431O37K124k187L33J112j022L45K5m79Q15L79j648N63J390j155p81K005
$$ y = [-736, -189, 1701, -1225, -1376, 1732, -287, -884, 917, -467, 81, 873, -1503, -355, 1614, -1053, -1215, 919, -12, -855, 29, -196, -372, 492, -1127, -717, 1773, -751, -1612, 1117, 237, -1309, 95, -627, -216, 846, -1233, -716, 1364, -371, -1523, 731, 641, -939, 107, 138, -312, 1172, -624, -1358, 1791, 374, -2054, 990, 861, -949, 467, -102, -23, 1473, -336, -794, 1380, 701, -1086, 115, 1249, -481, -194, 72, -161, 1043, -68, -1535, 1395, 1195, -1493, 281, 878, -432, 574, 11, -355, 1178, 252, -1324, 516, 1184, -1186, -430, 944, -310, -280, 218, -793, 780, 760, -1841, 119, 1521, -1316, -472, 623, -462, 250, -37, -1106, 396, 456, -1594, -377, 1102, -812, -823, 684, -285, -572, 388, -917, 158, 950, -1431, -794, 1330, -857, -524, 588, -434, -89, -64, -543, 272, 651, -997, -434, 956, -199, -980, 1025]
2116A025r84j80P79j204M46J178j921K64K323k202Q0J132o07n3J97n13N23R01
2134A184j594m27J858p76j079J669k04j230J398j070q7J459j612m11K487j344
2150B21p60J297o99k13M49k39l69J021q21q21J621K39j989J338M13j243R02l83
2168c6n31J473j465n98J799m41j032Q19L32q60N26k23n3M32jj358J488K92k081
2187a518J515Q66j602P99r0p98J267n98j193J801L43j728N34R44n77k73K23l39
2205d24N45L60j526J308R84j747LJ287q72K62p2m06J096l59j569J264R71j287
2223a82k54R63m95J2L12n73O44N41j909P36J744j762m69J688j023J24K6o61J199
2242F61K48j885L99J777j068r66J191K07n70J10q87J029J016k050O1K239j457
$$ y = [1025, 41, -139, 640, -564, -118, 1060, -861, -597, 1726, -476, -396, 736, 129, 76, 273, -240, 283, 1184, -410, -837, 1021, 245, -834, 835, 631, -599, 799, -271, -358, 1101, -511, -922, 1565, 221, -539, 758, 59, -154, 295, 56, -313, 708, -113, -934, 687, 926, -1063, 275, 688, -555, 347, -36, -567, 906, -559, -1157, 642, 201, -831, -12, 320, -540, -14, -237, -290, 142, 141, -1217, 271, 563, -1518, -3, 863, -739, 60, -30, -828, 439, -159, -1352, 449, 792, -936, -402, 542, -35, -308, -85, -424, 121, 481, -1045, 263, 1247, -500, -497, 790, -82, 180, 108, -298, 798, 439, -1130, 134, 1105, -182, -436, 527, 32, 44, 356, -217, 427, 968, -941, -205, 1539, -223, -692, 996, -27, 97, 123, -538, 661, 909, -976, -577, 1200, 132, -834, 357, 564, -6, 104, -783, 246, 1262, -788, -727, 1512, 55]
2259E5r58J071j12J16Q2j101Q10R51j660l02J633j36j522R62K42l15M16p89J0
2278e47J770j611j113K344n14j121P42R9J13M55j667O34J469j173r05J349M45
2295G69j580O34L18p3M95p21o81K021p32j828J854L11j319M31P1k7R50j427k04
2314g38J533M1j840R49J222j148l30M51k33J103j034j030J956m6j691P19P53n00
2332A37j90j10J79R31q11j086J383P63j866O3J524j056k54N42n79J050n3j952
2350a385J301R12j719K56Q78m57J59k04k07Q39j08j216N20J230j429m06J436k13
2368A87m83K87j058J027P89j722N54J237j056k24P30k15n5k28l9L36M57j158J95
2387d39J354r43o65J239n63M2L87j124Q07Q14j082l33J710j124l78N59m1j39L42
$$ y = [55, -903, 168, 56, 172, 254, -847, -37, 914, -746, -1048, 585, 449, -1073, -111, 131, -184, 232, -557, -547, 1223, -388, -1501, 843, 329, -792, -50, 49, 162, 617, -1050, -416, 1053, -120, -1025, 324, 769, -811, -177, 141, 68, 563, -158, -839, 1182, 450, -1378, 476, 787, -532, -101, -30, -57, 893, -534, -738, 795, 836, -1004, -55, 1167, 19, -311, 140, -93, 1010, -24, -1054, 902, 856, -835, -116, 637, 137, -53, -163, 16, 947, 136, -950, 433, 1196, -670, -607, 917, -139, -393, 149, -430, 620, 567, -1385, -84, 828, -891, -635, 243, -214, -55, -259, -466, 373, 265, -951, -431, 799, -630, -1036, 400, 187, -296, -9, -1067, -40, 749, -973, -419, 818, -238, -462, 268, 53, -2, -230, -269, 67, 524, -634, -439, 915, -28, -693, 546, -17, 25, 412, -712, 95, 909, -173, -506, 1204, 80, -298, 261, 220, 81, 423]
2406D23n92JJ000n19r48J364k50j163J145k29k45Q07j075o5J326j059m15J038
2424E44m46m08N05l71m6O65m07o17J197l32j057J214rj202J410l75j206J581n68
2443G2r84J409m50o74P03j63n91P97r7p62J206n60n52O48J83p39L42L02j005J025
2463A10L12p88Q49j40j414J126J40o05P03q4m74L63R6l63J23K84l23J41M78j101
2483e67M92N06j152P17O01j023N49M54q62M68K47p85P53K79j077K46P92r08j29
2502c99R79m39p6M26r27L49P06j132M08R28j064N7K60k17K60J05p27P09M51j093
2522d36L23N46n82j83N31m39O5N61m96j31Q63j062k23J079m81m62O61n28J73L08
2542H7n68L63M47o69m09J185k69q63R64l74o7P01j108j35J477r92m07J164l11
$$ y = [423, -169, -168, 832, 313, -635, 729, 479, -684, 461, 232, -13, 794, -281, -346, 980, -79, -494, 544, 98, -310, 195, -176, -222, 443, 36, -581, 616, 284, -773, 441, 432, -770, 640, 265, -941, 640, 72, -912, 497, 47, -627, 76, -87, -678, 119, 22, -740, 466, -94, -646, 2, 185, -554, -212, 90, -915, 110, 422, -366, 483, 343, -1071, 55, 195, -410, 293, 209, -265, 98, 194, -169, -46, 238, -85, 56, 534, -567, -75, 431, -721, -4, 597, -426, 123, 577, -285, 183, 430, -355, 398, 677, -400, -154, 638, -270, -399, 580, 141, 65, 491, -436, -87, 619, -513, -105, 823, -241, -184, 76, -141, 119, 224, -503, 206, 657, -436, -113, 433, -149, -332, 199, -240, -175, 386, -110, -241, 622, -440, -663, 416, -65, -527, 134, -394, -221, 87, -481, -118, 329, -340, -749, 436, 167, -696, 268, -106, -173, 528, -580, -715, 762, -230, -637, 527, 216]
2561B16n26K99j70M46j70k25j92Q95k61q92O69N04j028O16j75j84P87o78n01J486
2581I16n91q06R49j21l16l3q8P5M22l09n27P07L60j514R78N06q91L74L63p01P17
2602D70j92j007J289j79j054M74P44o22j16L28l54O32m7r52M31M91q25l75J210
2621C46o88O46k18p72J263l67j064J016N61j230J93M20j30QJ10m35L94M75j185
2640f57M40P90j000k32J030o16n1M15o75N97O25j036L53N63l72q86Q95n7n7J90
2660B59m87m0R00r86l9J179q08n05R88l95j23M67m26K13L59n48j10N87l73l99
2680b87P40k93j0p8j23l09J088q44k06J000m48p49Q39j71j68L51p00K96M24m92
2700a40l93J096k45n99K78K5k57L99j6m74O33o0o12K36M80r45Q97l49k25O52p67
$$ y = [216, -310, -11, -181, 265, 95, -130, -322, 573, 312, -580, 89, 593, -435, 181, 6, -178, 609, -69, -570, 916, 325, -481, 468, 347, 31, -2, -90, -15, 407, 98, -429, 278, 638, -876, 102, 608, -283, 91, 454, -247, 470, 278, -729, 560, 381, -673, -199, 545, -77, -193, 135, -219, 413, 366, -586, -155, 336, -489, -864, 346, -342, 304, 86, -686, 577, 210, -854, 162, 723, -507, -314, 106, -24, -16, 94, -341, 53, 528, -657, -217, 573, -427, -659, 371, -245, -296, 119, -556, 41, 666, -370, -17, 546, 174, -712, 183, 126, 69, 259, -228, -268, 632, -354, -393, 786, -22, -527, 461, 66, -57, 410, -16, 197, 556, 8, -102, 485, 112, -287, 453, 160, 150, 72, -51, -360, 728, -116, -322, 678, 230, -519, 320, 149, -19, 332, -368, -72, 352, -140, -533, 563, 318, -281, -3, 22, -235, 164, 148, -326, 307, 247, -365, -129, 351, -594, 303, -46, -271, 381, -386]
2721c86k7O72p6r14P98M29o70j1M48k53k08J33n04P93Q4r31P17K94q39M01J55
2742A05k30M88k69o22Q10j81n82N13N62p44j26N91l42j8M69r97O92L97r99M50
2762c3O27q53J31L91l82K61M6l38J32P16j066J84P82k50p57P69m60l5N53r33Q98
2783C83J99j122K78P52o61L3K78N4k96l54m1M01M41l28o58J069l99m44L50J89
2803A24l00Q1m03K87O30q25k80Q12l81N0Q4j88M60p8l38J91O78l87r14J044o0
2824B87p80M60Rl78J054n91m18Q84n39m67P40j77l31N4K26R7L36n67L7M05J51
2845D92q77N32L37p23J64J04n7M03n76k27Q98j08p14J63O44n12L2N9n6L22j2m40
2867a52M20J60p84N86K58o78J89J45n38P17k14n56Q67j37n83O1Q20o41J82j11
$$ y = [-386, -413, 259, 183, -731, 67, 496, -174, -185, 263, 10, -198, -65, -569, 224, 308, -623, 94, 388, -451, -50, 105, -125, 363, 94, -528, 282, 101, -481, 32, 594, -150, -276, 315, -27, -45, 424, -573, 119, 516, -483, -33, 594, -259, -128, 263, -119, 142, 188, -150, -18, 698, -368, -184, 598, 348, -409, 360, -100, -135, 418, -515, 383, 582, -540, -262, 490, -171, -138, 140, 194, -102, -456, -497, -96, 345, 17, -641, 428, 29, -415, -65, 124, -176, -95, -498, -211, 419, -406, -686, 126, -255, -205, -121, -309, 151, 73, -265, -74, 604, 217, -697, 347, 287, -493, -33, -24, -402, 652, 61, -357, 527, -12, -479, 261, 84, -247, -193, 33, 130, 466, -101, -64, 341, 492, -385, 147, 484, -239, -75, 29, -28, 375, -201, -428, 470, 362, -352, -189, 455, -57, -25, 34, -22, 300, 288, -152, 268, 428, -356, 230, 488, -190, -1, 144, -394, 323, 109, -447, 420, 283, -300, -239, 581, -60, 122, 11]
2887A1l16M71K71r82L46N17k56k94P94o66K20q1l55M81J60q02N79L73o22l29N84
2908A04O1l19L37n58M47J96q17K64O92n53J6K01k62M6L21n11M63j55l00N6M11
2929A40O9l55J96R7k02L87l08l32O83l28l25Q88k86n85N83m86N3O09o15L69L9
2950B91m02n9K25J79k47R6O0l64M46n3o06Q86k51q05P41R2q8J75j80l17O62n01
2972b0o16R90k12l31J35K24k12J3K44l35K9J71p23Q15j14o72N33M91p18N11k90
2993h7k29O93m63o12N43J99R0j73J84l99L51J22n12M74K1n51L84J77o08L64J74
3014A42m68M49J13l60K00K3k09P2J59j85j42K20j70J36L37m64m0N02m11N45q8
3035C61m69J73K10m73J68L71o42O95k08k65L07M0m83L59M26p06j23Q41p90k85
$$ y = [11, -305, 166, 437, -545, -199, 318, 62, -232, 562, -104, 116, 35, -320, 161, 321, -481, 98, 471, -151, -480, 104, 165, -154, 183, -375, 72, 268, -549, -285, 407, -146, -130, 71, -191, -145, 176, -335, 128, -27, -327, -271, 140, 209, -146, 50, 147, -55, 332, 24, -308, 375, 47, -278, 610, 324, -261, 322, -164, -111, 498, -117, 252, 291, -111, -170, 55, 234, -13, 83, 143, -221, 225, 172, -434, 452, 201, -604, 137, 229, 141, 316, 136, -181, 481, -20, -636, 354, 142, -189, -54, 170, -42, -29, 215, -120, -91, 80, -643, 172, 58, -614, -81, 410, -308, 203, -87, -316, 377, -86, -698, -155, 44, 134, -39, 145, -254, 97, 219, -293, 181, 202, -349, 35, 212, -396, -32, 142, -326, 123, 236, -124, 76, 99, -110, -38, 121, -64, -206, 14, -156, -20, 317, -147, -187, 315, -96, 449, 361, -108, 65, 275, -198, -30, 341, -301, 394, 186, -79, 228, 268, -215, 144, 570, -136, -259, 582, -208, -493]
3055d93P04k19R8p1j92M58L01p45J05L34k95q8J17l0j52K57p7j60K34k53n11Q67
3077A89ol07L64m71P2M18l88j25P50o91K4K14J01k92m7L80l35M2P5l12N63o98
3099d80P0N21J14m21L77l48R3L28m62l1N35l76l39L56K91l38O7K06k85J41J27
3120A46o38Q75q4o11O76l47k43K83J21l50N00j90k65L46Q4n09L24K89m07K55k90
3141c5o7M98M3p51M65M37j241L40O37j68q4M2m30O63k14m53J17M69j46m54M16
3162H4K6J44m48o7K20L71n97M8Q16j031K15J68l95L32M7k38N29p4n49L97J7l75
3184c60RP10l52j62M50n86O2N23n25j72Q17m44l31M29j22P9P2l65K84K18l69k29
3206c64O18n9n78M26j24J4K74m37K04L82k66l18M71k42l02P47m19LJ4k02n5M66
$$ y = [-493, 211, -8, 90, 19, -173, 285, 586, -159, -54, 280, -15, -103, 14, -16, -168, 89, 12, -148, 86, -167, -678, 189, 183, -124, 240, -231, -159, 259, -129, -254, 496, -195, -171, 43, 144, -148, -195, 185, -150, -108, -33, -345, 218, -480, -410, 111, 225, -196, 181, -167, -74, 254, -208, -239, 296, -80, -419, -63, 228, -110, -43, 163, -122, 19, 146, -492, 383, 299, -312, 364, 17, -226, 57, 178, -172, 328, 138, -127, 219, 303, -206, 118, 407, 0, 255, -35, -102, 396, 439, -312, 153, 590, -651, -311, 326, 158, 74, 116, -314, 349, 135, -318, -201, 268, 122, -332, 84, 110, 254, -194, -261, -41, 330, -267, -219, 597, -434, -219, -51, -446, -114, -67, -305, 224, 150, -399, -2, 15, -360, -351, 359, 7, -155, 295, -291, -229, 294, -231, -403, 414, -30, -361, 68, -54, 25, 97, -268, 16, 234, -135, -364, 254, 195, -383, 43, -81, -67, 207, -230, -26, 356, 90, -228, 243, 1, -301, 446, 27, 30, 44, -158, -213, 253]
3228B53l83l01P16K57p64L76r4j48M48n39j08O75n09j37O94m07l09N94k25j36
3248d7M2j82L4L31q4m77N98r9n73N29J33n37O03o33j5N30L8n79J54K22O5q9K01
3271A65Q2m26P5l6K69M6m77J33L35l18J76P3k51L04jn15M61J70p03M44M1k06J90
3294C1j63r6L51p6l7m3N20o70J2N43l70j29O53m09j54J58m76O11K5m35O6L96j6
3317B92l47N39o24J54K42k98PN77p65N3N31l20k94M47k85K9J76m81L54L93o25
3338b45K23Q5O6l06J03M3oj27j93J39J97l2n02P11l49j52J75J00j07L27k97j29
3360b76L49p3l28K16K55l37j0J64j21j8J38m98M19K17o96P26j62R2N8k7j63J79
3382A04n00M12M7j0k51M29J07n28J18J96l24K18K47n32M94J99n43J6N05k76o8
$$ y = [253, -130, -431, 285, 542, -222, 154, 60, -88, 360, -179, -287, 388, -121, -258, 436, 29, -280, 314, 89, -47, -5, -187, -153, 178, 94, -383, 215, 116, -457, 72, 205, -332, 271, -362, -377, 153, 191, -388, -234, -12, 53, -36, 165, 247, -179, -104, -140, 129, 175, -302, -169, 166, -152, 24, 97, -154, 150, 149, -366, 95, 265, -438, 6, 47, -159, 31, -132, -228, 123, 47, 10, -33, 487, -183, -171, 372, 2, -127, 526, 117, -37, 121, -355, 256, 281, -154, -88, 308, 292, -55, 484, -140, 14, 256, -42, -35, 542, -223, -170, 361, 41, -253, 194, -91, -62, 114, -367, -13, 380, -245, -22, 63, 129, -177, -74, -31, -37, -164, -357, -218, -21, -53, -555, 156, -193, -345, -170, -70, -177, 150, -147, -276, 73, 0, -328, -112, 143, -194, -204, -40, -161, -179, -41, -539, -120, 97, -599, 127, -35, 57, 115, 88, -75, 104, -396, 16, 63, 53, -198, 231, 338, -190, -72, 124, -200, 18, 265, -267, 227, 426, -117, -101, 404, 128, 60]
3403F0M2k69M33l98k6R2L61l95q3M77m96N3N60k93j68J72l77K34J70j92N8J96
3425B11k63K26k35r2M91m27j12J87O5K4k93L51k02K13N2n95L84P7m54M94L28m11
3447A9k72N42k95n3r2p1J31J09j71k44M67n6j49J61q2j49M04k53J42N6k63l08
3469d27O68o7l55R4J91j79L42l03m4L36l71k07L75j12j00L17j34p8J40k80m0L91
3491A57j14j40M13jk23K27j18P7l8k54O2J33J3j72k8L19k97K35j06j98L56k21
3513H2k48K88j34R4j74J03Q5q2J47k66J06K62n53J58K83m39M37k58O4J52j01m00
3535c94L65J33m47L14J23j85J20K3j74J62j61r0R9k2K7l5N26n87j4L22l73L87
3557A19k4k39J67k4m7k4J23l91N87j04k28O1O4j51R0j09J36k80N96m38k71N09
$$ y = [60, 102, -167, 266, -132, -158, -66, 295, -100, -183, 294, -202, -149, 411, 118, -50, 122, -255, -21, 149, -43, 15, 211, -52, 174, -61, -153, 338, -89, -201, -14, 51, 75, -218, 133, -69, 144, 196, -399, -15, 62, -392, 102, 430, 19, -253, 289, -6, -59, -151, -222, -91, 18, -153, -397, 70, 14, -135, 26, -56, -205, 199, -54, 88, 144, -119, -427, 241, 174, -181, -87, 104, -75, 267, -36, -80, 256, -115, -322, 53, -59, -159, 158, 24, -54, 86, -194, -234, 157, 43, -97, 316, 315, 92, 319, 201, 278, 240, -14, 48, 181, 194, 22, -6, 313, 16, 251, 145, -53, 303, 82, -166, 122, -12, 82, -92, 11, 96, 14, 161, -105, 1, 263, -290, -132, 151, -288, 149, -109, -45, 107, 6, -394, -29, 104, -343, -29, 94, -91, 29, 52, -122, 40, -121, -211, -112, -134, -107, -142, 384, -203, -217, 105, -268, 119, 95, -144, 23, -1, -48, -72, 51, -340, 247, 143, -85, -24, 40, -111, -21, -130, 6, -274, 322, -116, -387, 122]
3579A22l06K48K53m69K53j1j55K25K4q6k16L41q0j06J56j56J36l2q8j58J39l17
3601b83L60P6n13Q0N09k14l46K97j39J24P0j03J41K54n63J53K45j19l22J73K00
3622H0j75K57k28j33M86j0o54O99l87L9J24k58K67k51K9j28L15q4l19L53Q3n05
3644d00M10j3k88K07R0l65N79m1l90P4J59j63J84k15K32K51j81k58j2J63k25J87
3666a5K45l60m2Q5j44M16j28l07J43M09n78J4K49k25M04l40K13q6M04l98R7Q0
3688A36k0k64L27K21m09J46m87M56r2k39K27K57m73K92l0k2m4k12L67k06K99m68
3710b38O9J43l77l8N98m05K00R6M4J65j02j86k39N37j75k63J32K1O0N4m53N53
3732A96p6j66j88L90J14l30R7j76J65j08k41J66L08l51n9N42l90J50K11m63K32
$$ y = [122, -184, 64, 317, -152, 101, 90, -65, 160, 184, 98, -118, 223, 143, 37, 193, 37, 173, 141, 53, -105, 34, -283, 77, 153, -360, -280, 229, 15, -331, -34, -173, -49, 21, -82, 59, 313, -250, -97, 148, 29, -293, -120, 80, -95, 162, -66, -199, 287, 277, -377, 322, -65, -26, 98, -160, 107, -144, -115, -243, 72, -12, -331, 22, 105, -400, 10, -3, -291, -84, 6, -359, 220, 179, -211, -137, 22, -141, 43, -172, 60, 311, 130, -128, -140, 23, -202, -15, 230, -130, -172, -87, -231, 185, 57, -250, -107, 302, -276, -262, -13, -238, 166, -174, 39, -47, 357, -41, 56, 136, 116, -148, 179, 400, -9, 137, -350, 106, 14, -225, 2, 259, -214, 78, 48, 26, -18, -230, 137, -69, 230, -238, -169, -26, -403, -441, 157, -248, -48, 48, 92, 257, 155, -31, -270, 267, 92, -171, -39, -18, 42, 96, -357, 196, 120, -46, -234, 156, 270, -60, 37, -139, 26, -82, -323, -157, 151, -200, -259, 283, -107, 43, 254, -209, 23]
3753B3L87l43j48K65P2l87K61R4m55M69m51Q0K93k81K12L92p53J66J07J24j01
3774B6J60k04J20r6L2k23L52j87l46M10J99k88J24k1k03M39j54k54l2K1j06K90
3796E9N2j50p3R6n02M97J53n39O23J05r08O63r5j70J97K04m25K84o5m25Q06k47
3818A40l64L42l71K14J77k75j74J32K28j74P1K36k51K19J53n63L63j89O1n8M38
3839C55k76J1j52jO9O7j97K27k55J61j16L63l51P2K00l04K77j19j27R7L9k2J63
3862A81Q7j96j23J87j89P3J31k20P7J9j39j21M82j82N0M5k26j14L53q8L8K44p01
3885c32M24K24k88p7k7Q6k52M0K35l48L91j28k42O59o68o5O43m31j40J85L7J2
3907f2jl45K93N1j12J04j2j23O5L44k02lj24K56j89R0J1j46K60j46P6q7P9l1M2
$$ y = [23, 410, 67, -81, 184, 256, -131, 130, 224, -231, 238, -213, -133, 160, -121, 91, 483, -270, -104, 3, 127, 26, 186, -18, 102, 6, 38, -185, 167, -20, -366, 44, 243, -45, 79, 58, -145, 294, 140, -114, -146, -125, -231, 59, 111, -39, -112, -16, -518, -21, 132, -407, 216, 321, -587, 76, -19, -189, 8, 212, -213, 71, 6, -419, 387, 140, -224, 118, -253, -39, 138, -137, -311, -179, 49, -125, -54, 182, -69, 150, 303, -260, 103, -86, -25, -83, 355, 79, 90, -62, -63, 6, 73, -124, 103, -152, 9, -107, 256, -95, -23, 177, -127, 150, 31, -96, 1, 40, 18, 181, 268, 72, -51, 136, -53, 20, 151, -69, 8, 27, -112, -233, 249, 67, 117, 162, -64, -178, 175, 87, 125, 369, -332, 92, 316, 28, -49, -76, 10, -242, -202, 33, -315, 76, -52, -294, 365, -303, -368, 275, -156, -296, -111, -74, -62, -63, -408, -115, -64, -176, -72, -84, -207, -142, 202, 0, -3, -127, 129, -60, 30, 41, -105, 155, 9, 85, -2, 77, 46, 88]
3932H8j97J68J24l57O8M6K75m34j8M95J25m74L54j77M0m6j76J55Oj95O6K87o88
3955d65O05Q7m00K87j0rk90K32l04K04J21P8j75K29m90K20J26l62K02K56l58L01
3977H5M2k02K35Q6l04j0K19k01j5J16p0r4K72l40K42R6m59L19K0k10J81l27L21
4000BN6J04P0J5k47r0RP7J45l84O09q3m23L7K18j92M91o00K26oj2k92M47n4l12
4025a89K52k32M36j81j54j93K75J04l50L34J53j89J78k36lk8K83m12K11K88l03
4046D4q5J73j75p3j2J99j21Q3m4L67j34j29l07J98k12K64M5o4K07l25O7M77m66
4069b3Q1k1J67n71J61K85k67J08L89l52k71M36l04nM55m06k78M81m7P9Rj30j57
4092a81N06m91K26r8j62K22M9k69L53J54n57R4L27l91L55p8j37J1r0J36R3K11
$$ y = [88, -109, 59, 183, -174, -106, -60, 215, -219, -237, 258, 383, -91, 263, 86, 126, 80, -96, 59, 65, -130, -64, 223, -465, 140, 227, -173, 114, 104, 95, -195, 37, -267, -63, 58, 136, -39, 190, -300, -80, 46, -316, -114, 142, -216, 85, 127, -75, 160, 246, -58, -68, 151, -50, -65, 51, -19, -113, 159, -181, 61, 157, -302, 17, 37, -173, 8, -319, 2, 58, 162, 232, 247, 0, -90, -81, -4, 141, -243, 366, 283, -140, -103, 115, -77, 414, -186, 40, 34, 22, -270, 177, 123, -189, 63, -169, 267, 86, -68, -261, 14, 118, -232, 102, 255, 66, 244, 8, 5, -23, 260, -152, 59, 347, 44, -41, 132, -43, -116, -128, 71, -50, 33, -11, 356, 222, 93, -214, -16, -228, 36, 81, 17, 224, -101, -34, 443, -23, 58, 37, 204, -367, -206, 79, -188, -80, 309, -43, -314, 122, -182, -187, 268, -138, -416, 65, 18, 97, 106, -24, -181, 325, -166, 60, -38, -200, 22, 71, -198, 155, 309, -248, -154, 173, -218, 137, 59, -78, -67, -157, -21, 72, 283]
4114B83l62J63j7J8k25L30J46m19L38r7o6K12l88j07N17n97M34l27Q4P7J35k56
4136a24k38N90n08L9M82l29J98p2j77K3qK44l60O91m26N5K5j37M8J73k42k50K43
4159f0J77K9l45L94k54p7J38j1k6J54k97Q6K17l94K28j7J23j29q2J03o7K5j66
4182b51K92k27J52k6K62J2l73M22l82K73J2m90N14k02j62M1o2M13j93r2J77j32
4204b2N2k46R1N53k75l09M65j10k63L46l27Q0R3l44K12J66j51K89k55rJ88q6k94
4227a56l9L65N2m42K70j0j03J20j56K2m2J61Q3R6l12OM6j85J99M6l27M77j6n12
4251c57L79l9K3o5R5L8k45N00p29L71L03l88J56J4k37N23m48K19j33oj60K1J95
4274C0k67J2N82m56k9J61mk07J05J47l79N05k51j41K31p1J61L0k04J16p3J55Q6
$$ y = [283, -79, 84, 67, 85, -140, 190, 336, -83, 255, 158, 92, 304, -84, -191, 326, -271, 163, -164, -80, -3, 132, -124, -362, 228, -280, -241, 241, -88, 110, 38, -139, -116, -124, 120, -240, 451, 25, 80, 105, -32, 16, 189, -53, -303, -60, 117, 146, -199, 195, -59, -136, 2, -9, -35, 119, -178, -92, 125, -269, -41, -58, 65, -64, -146, -43, -110, -85, -251, 41, -186, -34, -60, 202, 214, -159, 263, -119, 154, 166, -324, 190, -12, -174, -133, -195, 218, 25, -67, 110, -22, 30, -216, -125, 428, 153, -156, 309, 199, -64, 282, -45, 35, 128, -216, -4, 162, 11, 300, 45, 36, 224, 138, -156, -195, 170, 222, -220, 50, 40, -63, 57, -99, -77, -119, 42, 125, 221, -91, -85, -39, -224, -25, 21, -306, 171, 155, -357, 22, -17, 6, -59, 36, 74, -171, 329, -400, -29, 274, -114, 42, 56, -181, 342, -106, 113, -20, -26, -186, -165, 30, -237, -225, 357, -99, -128, 33, 29, -178, -73, 74, -305, 200, -51, -192, 39, -32, 129, 159, -45, 71, -2, 153, 239]
4297B39o3k52J07J70O4m47J16J69n1J7m4L8K4J18m79K76M24p9k13l12Q5Q3P3k78
4321b15J30O2J3K82n6m20M32k84q2Q9R0j13l9K37l09J14N6K49l0j50k31J31J56
4344A12k06J34k52J67o8l9J50k5n4k08L36k41O4O2J53n84M66L79m47Lj15K64K
4367E3k04n1P2K69p2k2K28l84K7L2K3N8m3j12L9J5K59o3j80k5K84j13K35j37l
4392A85k96J9M96l91j31J80O3j88M41n52K49OM2j45p4K79j97O8R8j83j79K39M1
4415G0q5J64l31J13j45K14J57j6J3Rk33J00L34j40p3k09J40J86l40j9J16j04j07
4438a86L24l10K9k59N05P6m57K22P3L9j09j00j13L75k5j32J04l50J79R7N1k55
4460b22j4K25n5l8L08k62Q8K07n00L96p0j15J94o01M52L58m58J98k75K65j6n8
$$ y = [239, 176, -76, 31, 201, 265, -182, -66, 103, 52, 69, 25, 63, 87, 205, -274, 2, 426, 347, 134, -178, -93, -10, 63, -215, -85, -23, -10, 272, 216, -204, 228, -56, -138, -49, 41, -72, -111, 126, -183, -69, -13, 236, 206, 56, -175, -44, 112, -94, 40, -212, -45, -113, -152, -2, -27, -81, -289, 47, -194, -130, -68, 85, -499, -33, 346, -101, -98, -213, 51, 53, -151, -202, -130, 139, 67, 45, 273, -111, -84, -52, -29, 29, -14, -126, -87, -72, 187, 124, -56, -81, 203, 90, 325, 188, 185, -111, -92, 404, 13, -118, 62, 125, -63, 378, -174, 75, 81, 123, -22, -96, 183, -14, 54, 152, -31, -210, 29, 70, -15, 149, -182, -69, -214, 0, 157, 141, 154, 163, -70, 30, 364, 224, 151, -58, 82, 268, -72, -91, 25, -79, -186, 138, -172, -143, -402, 103, 179, -278, -56, 17, 56, -53, -153, -266, 109, 84, -48, 56, -294, -115, -18, 33, -222, -236, -11, -66, -104, 204, -58, 30, 237, -263, 133, 63, -52, 142, -459, -7, 351, -107, 91, -184, 81, 65, 7]
4482Gj14Q0j19O1J33J95L3l09k90M06l25M3M91m68K69k34k25K80j22K9k9L00O
4505I8l11L29n1k39M10l34n7R8k42J46J74k91J78K72j41K08j73m14K82M22m92
4526a28j52K56l6k36J63J56k65J72p1J81k85L00j72K29j63k53L12j96k13L57J03
4547E9j28k7PJ07k87M32l79J31J04J72j31j67K5K17l0k22k7J62J12P8m04R1L66
4570B61j86R7J39l22K9m4L08m16K20j51q4J51m4m4K25j73R9j64K29k04r6L61O1
4593B52j97o0K35m22J88K33j12j3j6k03J90l67M79m47L68p6K9k74J41J44L0p7
4615B5j57k0Q9J70j12j49L22o4l31K37n2Q3n5q2J53J34m18P0J59OJ24l71J83J82
4639A26k96m5K81K67l31k08L19K91m76J99l82N0M75m03M82l89m6R6L03l75O5L5
$$ y = [7, -107, -27, -146, -85, 48, 243, 276, -33, -323, 83, -242, -199, 292, -176, 93, -141, -366, -86, -208, -179, -208, 92, 98, -213, 116, 65, -174, 236, -98, -155, -57, -299, -153, 21, -270, -92, 180, 39, 247, 74, -340, -58, 364, -128, -280, -24, -60, -296, -133, 23, -242, -70, -141, 40, -245, 55, -117, 112, -51, -304, 8, -188, -401, -44, 59, -69, -96, -89, 18, -269, 163, -216, -85, 19, 191, 60, -107, -82, 135, 105, -117, -144, 18, 130, 208, -196, -105, 261, 75, 172, 311, -11, 18, -26, 282, -134, 86, -65, -149, 2, -42, -86, 139, -34, 65, -99, 130, -74, -170, 191, 252, 55, -5, 230, -192, -4, 229, 117, 104, 88, -115, 75, -292, 187, -260, 108, 32, 61, -213, -72, 72, 102, 25, -132, -152, -63, 107, -5, -154, 168, 104, -227, 10, -42, 41, -14, -96, 57, 191, -227, -157, 2, 8, 132, -239, -56, 126, -170, -215, 66, 333, 2, -206, 113, 404, -72, 127, -255, -205, 270, -133, 349, -40, -86, 10, 313, -62, 3, 38]
4661C8K78k29q4o8j32K48K37l00J5n2j70N13m54K55OJ46j85j95R7J98k03r4J06
4684b9J50k57R9L77l20l6mrj77K55j25j5J52R7k34J62j90K67k75K71j26l66J33
4707b00P7R6JJ55k73M76m46L09j71k16K19J73n42M13K81k03m9k56j69L48J98m27
4729b06P6K70j90l5q2P2K36k24J80j89L33j84p5K16l16K58P9k13o4J08j77J14
4751a3k06J35L83j78n7j28K05k49R1K87m35N44n07J38j19K45j71O9K83m05J8J16
4773D6J5J08j42J1k28J35k09L45p3j81J58J51K0j51K1n9Q4j77j0L0J69o6K2P1
4797I0j59Q5j16n7K60n6l0k63N35m20J49r2K40P4P9n35J17N4N4l3K1j97L26j65
4821c9L7j81R8J80k73k25K79J7L21j60J80p7k32L08k60J05k46L87r5k45L62k99
$$ y = [38, 316, 87, 3, -65, -197, 51, 288, -12, 3, -49, -219, 294, -160, 95, 101, 247, 62, -133, -36, 162, -41, -135, -29, 121, -136, -37, 340, 20, -16, -20, -29, -206, 49, -76, -91, 61, 158, -76, 86, -104, 163, -112, 159, 33, -333, -200, -123, -27, -26, 129, -144, 332, -114, 195, 24, -192, 27, 200, -342, 71, 352, 149, 100, -156, -325, 23, 221, -206, -130, 140, -50, -85, -167, -95, 141, -83, 97, -92, 241, 57, -18, 198, -118, 140, 219, 6, -58, 50, -127, -13, -219, -84, 299, 121, 64, -64, 141, -108, -17, 270, -165, 379, -128, 10, -109, 136, -35, 34, 317, -88, -70, 46, 61, 169, 27, 38, -190, -55, -264, 81, 8, -173, -15, 136, 156, 5, 26, -33, 51, -126, -136, -106, 63, -3, 19, 90, -69, 16, -100, -157, 103, 47, 17, -246, 289, -131, 18, -74, 166, 240, 319, -216, -99, -45, 9, -24, -3, -200, 126, -39, -2, -183, -85, 95, -178, -403, -124, -107, 214, 54, 234, 157, -75, 233, -27, 78, -168, 219, 124, -121, 241, -58]
4843e8J25J19J60j78L3j27o9j49J79K3N8k10J18j24k76K44L13j93P4p8K06j24
4865F6M2n2j57R4p4J40K0j35j15K52k26P4j6J21R8M2k23J42J06j09l8J98j01m2
4889A07j89r6Q8j83K84j33J41J56k84j16M00l42J05Q1j24J21J8k54J19K49j09
4910C9k2q8n3j44J43K3K45l2k23L79J56n42k89N65j70k61L03J74k39kq9NK58j44
4934hj14P7K26k09j40J29QL73k69J14k82R3o6J48j32P7K07j75p8q8K51K7j34k83
4958b48K55m4o3n1K02k28J05k5M36l65R1O1j39k5j4QJ24O9j55J99kpj10j19j14
4983a59M22l31J56Lk57J32P3j72J3K69k66j0M35m16j10P8O3nJ70R1j45M1Mj44
5007f5l65N31k04J69n1M4j16m7j44N26pk84j52M09m22J8K81k13M83n71J80Rl5
$$ y = [-58, 67, 186, 346, 168, 201, 74, 5, -144, 35, 58, 116, -94, 24, -100, -376, -132, 181, -12, 62, -16, 190, 66, 108, 56, -101, -7, -81, 59, 79, -56, -171, 81, -145, -71, -87, 34, 132, 174, -49, 93, 199, 90, 52, 250, 149, 107, -82, -178, -90, -273, 11, -122, 19, 175, -109, -225, 175, -167, -62, 19, -105, 16, 34, -220, -101, 148, 39, 17, -71, -124, -268, -125, -102, 143, 111, -112, 267, 423, -119, -408, 157, -13, -274, 29, 203, -36, -38, -127, -122, 136, -8, -122, -45, 181, -28, -168, -39, -31, 342, 73, 187, -95, -2, -68, 80, -52, 25, 232, 57, -21, -109, 142, 169, 35, -248, 7, -37, -100, -151, 51, -177, -72, -97, 339, -26, 65, 126, -13, -38, -52, -44, 80, 149, -6, 193, 191, 184, 74, -45, -159, 263, -68, 88, 91, -166, -34, 39, -133, -120, 149, -117, -127, 308, -108, -218, -140, -77, -82, 88, 179, 34, 75, 79, -65, -430, 101, -103, 66, 15, 59, -57, -104, -248, 278, 271, -13, -165, 244, -178, -160, 121, -92, 391, -180, 0, 9, -26]
5030b6q2n8J82J03j84J97k52K03k44j2J83J42j00l04L36J8m2j54M8K77l80M9j12
5053b12p7N25m88P00m84p8P3j10L0K02k40K31r9j4K59k4m54J21l1J42j49R8M2
5076c7j18K14j6J8k03N5R6O8M9l06J78pq7L19o62K85O4jj2N7P5l4J8P0j29L00
5102B54k27j68L8j71Q0M81k09R3l27K89k08K47k62K3j26M3J68j7M68n17M0K60
5124B52o74M71M7k02K24k16K9j01K95o5J70k07j43J50j07K05K04k19j37K42j37
5145H1NRJ5k33L0J89k03J46M7L4O1l07Pl16M02R2J47j13J7jo8oM7j62K58Q0l34
5172g6K22j77J24j85J65k13J07K39j08qk39L73k03j91J02o6J23j06J46N6J70r4
5194A61j82n5k6k14M39q6m2l6j39K96p8J04k84K87k32K76r9Jj48K03O0l13K52
$$ y = [-26, -108, -166, 16, 119, -65, 132, -120, 83, -161, -173, 10, 152, 52, -252, 84, 102, 60, -94, -46, 231, -149, -100, -212, -289, 236, -252, 448, -36, -114, -41, -151, -121, 81, -159, 72, -27, -41, 218, 194, -260, -139, -170, -28, -177, -79, -37, -155, 59, 43, 61, -142, -87, 9, 77, 126, -180, -2, -9, -96, 223, -439, -154, -90, -91, -103, -46, 29, -5, 13, 83, -46, 254, 27, -141, -103, -274, -194, 287, 78, 171, -156, 133, -75, 172, -90, -67, -193, -150, 18, 1, 469, -48, -8, 252, -422, 49, 96, -106, 118, -98, -69, -170, 125, 60, 230, 23, -120, 30, -77, 128, 332, 113, -24, 218, 81, 86, 95, 110, -123, -93, 96, -107, 39, 86, 120, 181, -126, -119, -435, -33, 59, 206, 93, 110, 109, 41, 35, 82, -80, 178, 258, -76, 146, -31, 93, -92, 73, -140, -33, 206, 98, 90, -149, 224, 21, -170, -68, -134, -11, -117, 29, 85, 255, 161, -21, -76, -102, -316, 123, 37, -5, -41, -180, 116, 38, 142, -142, 145, -87, 189, 90, 91, -57, 146, 206, -107, 145]
5217A45l17J31P0lj23J66j55K79k2j01k23K70j52N5K37j92j40K69j26l76L84r0
5239a4j60P6K61m9j33J57m81K17J56m2J13k17J21q6k42J82P2J44k04K07oj49L3
5262d4J18j2J8j09j57L34k33K02j46j42J85l1L79l80q4k1K94k73K54l27N5L87
5284B67l09j46J74j3o6J53ql8J25j70j4l2O0J77j70K18j71k3j8K01j2k68j4M9
5308d8m3M7L49Ql89R3j46R5J27j55P7K14k57n3o3J97J18L2j03k25J49p3j55K48
5332D4j82K30j40m4n9k65M52K84l62l7k15K26o7J50k72J75m6P7L1N2M5k09rK58
5356A17j3p3O3n7J30k64M5K0n4Q8j65K19k6J42k98J57M2N5j7j67J9K19k38K9j11
5381a38JK08j92K9N3K4R6O5r2j1j32M15k88r4J47k53J3o3K12o7J03M0j14Q7j33
$$ y = [145, -172, -41, 29, 26, -97, 69, -86, 193, 171, 70, -153, 117, -35, 20, 257, 65, -75, 194, 68, -308, 76, -14, -174, -98, 163, 114, -19, 138, -343, -126, 30, -12, 101, -116, 5, -81, -323, -141, -69, 75, -129, 78, 72, -77, -44, 74, 62, 80, -29, -186, 148, -85, 117, -29, -171, 14, -17, 362, -18, -102, -123, 171, -102, 152, -175, -120, 267, -42, -188, -14, -27, -93, 60, 52, 14, 139, -31, -45, -77, -17, 160, -10, 208, 37, 14, -4, 197, 185, -83, -97, -48, -91, -44, 305, 313, -76, 17, -129, -34, 93, -62, 15, 229, -28, -81, -144, 53, 171, 203, 100, -125, 24, -49, -204, 44, -138, 92, -48, -92, -151, -416, 36, 320, -42, -79, -294, -68, -135, 15, -257, -82, -128, -51, -20, 32, 77, -132, -141, 117, 104, 31, 94, 37, 167, -97, -52, -32, -86, 2, -163, 56, 30, 172, -126, 31, 73, 128, 111, -56, -37, 182, -56, -27, -138, -137, 71, -121, -92, -39, -15, 81, 146, 54, 43, -89, 326, 38, -56, 91, -162, -149, -212, 0, -67, 36, 76, -38, 49, -84]
5406h4J40J15k88J54K6o8J94l71L26k57LL8J40P3k09n4K01P5j86K05k30K66k74
5429f5r6J83j50R6P8r9k94M93m3k61K63j66J82k38P5k29J75L74k41j7m0%m0j08
5453a68J05J37O4r0j21L94l14n7rj37K19J78R3o19L79O4l8L5j61K55q2r2P7j08
5477Dk02K51j67j3K64o6l6j45L44m03oK06R2j06M7j60L71q2m59M17j93j67K72
5500F3j00O2j11Q7q3j94K59k4J76j59LO0J16K56o25J67j26j38K78j26q1M78j66
5523G2L3j08j32o6L34j00k6k80K42K22k31J54j16j27K71m21K13j30KP1R0mj41
5546a78J51k49K07M0J35L63m79K51q0r0oj17R3mk7PK25l47J80Q3J16l85k58L74
5570EL4J00j69j29M31j97L8J07n11L49r8p7L06l01Q7k27K50j31J37q7K17n8m5
$$ y = [-84, 56, 171, -117, 37, 63, -5, 189, -182, 144, -113, -110, -72, 68, 141, -68, -122, 79, 154, -32, 173, -57, 209, -65, -161, 22, -128, -32, 46, -53, -347, 146, 103, -158, 105, -61, 121, -117, -42, -271, -96, 278, 37, 20, -20, -20, -60, -168, -63, 74, 138, 48, -73, 321, 7, -50, -59, -196, 23, 201, 294, -325, 54, 118, 80, 115, -46, 209, 127, 35, 112, 4, -198, 53, -114, -127, 137, 71, 35, -110, 234, -169, -175, 31, 123, 17, 64, -96, 275, 193, -266, 151, -42, -209, 63, -37, 25, -86, 1, -82, -276, -17, -41, 135, -24, -21, 39, 155, 411, -214, -47, -173, -311, -33, -159, -240, 238, 72, 105, -3, -135, -201, 133, 33, 7, -273, -31, 191, -40, 114, -2, -129, 142, -279, -66, -196, -194, -123, -33, -37, -178, -27, -276, -69, -29, 106, 469, -10, 241, 161, 71, 65, -52, 41, 37, 10, 17, 242, -105, 75, 158, 274, -111, -369, 5, 39, 139, -30, -159, 272, 75, 113, 220, -291, 58, -40, -117, 189, -112, -25, -252, -2, -133, 4, -83, 134, 76, 31]
5593C1P4J05j78J90k16k03M6q4J88J62n0j80j17L01r7j51K76j11n9R6m9Pqk29
5617b56J71J73p1j63L0K77k16J65j05k3M6o8K39k45l31O8L07k83M00R5k82n5P3
5640e4J95Oo8pj63K98k18L1k2J57j3p5l29R2K18j0l7oK52m53J55J03j05l8J72
5665H1j0n1Q1j1j12J43k64K38O0o8j60MN3m2K0J04k67K25NJ75j87k6K31r5j53
5690b6K4K03j36l50R2L01L23n29j4k0J72K5j98J62Q5K1j45j74Q8J35K58j76j38
5713a7p0k6O0J89L2k52J78M8k33J52q7L9P9j89M54j91k72J60O8J40j90n9j2k21
5737b20K80J27l71L20rj44q7K33J8nj14J9m7L5k73L50j60J52j65P2j52Q4oJ33
5761G0k50J63Q7j22j58J18K80j13p8l4r5J93j5k1r9K58k98J36On5j35K11l2K9
$$ y = [31, 105, 210, 32, 222, 6, -197, -151, -235, -47, 115, 65, -115, -232, 69, -28, -179, 97, -14, -73, 23, -26, -19, -27, -256, -85, 88, 17, -146, -116, 161, -55, 110, 5, -18, 28, -40, 199, -46, -377, -309, -2, -285, 115, 210, -72, -127, -54, 141, 147, 79, 72, -91, 207, -11, 20, -2, 155, 142, 67, -262, -170, 48, 38, 1, -5, 247, -206, -51, 52, -53, -91, 81, 71, 20, 101, 90, -22, 121, -143, 95, 155, 87, -73, -69, -16, -58, -38, 66, -201, 24, 29, 204, 17, -9, 222, 127, -26, -2, 201, 65, -285, -193, 108, 431, -98, -112, -132, 40, 65, -133, 29, 114, 135, -10, -184, -96, 39, 297, 121, -17, -87, -113, -53, 136, 168, -84, 94, 142, -91, 61, -26, 13, 92, -97, 357, 166, -106, 54, 122, 262, 72, 13, 1, -220, 60, 187, -184, 136, 127, -17, -104, 129, 147, 142, 28, 47, 0, 35, -238, 112, -48, 104, -61, 11, -141, -57, -63, 70, -180, -17, 70, -52, -210, -92, 188, 75, -3, -37, -132, 61, 46, 25, -74, 184, -114, 22, 28, -27, -162, 49, 17, 46]
5785D6j83O8K10n9pm6N9m4n4K3r8r8n1k3J24J27K18k63K02k85Q6K40l2k21J12
5810E1O7ok90N4jK36j41P5J36k76L22j33l7N6j09J43k0m06M85l06J36j13J84j08
5834aQ2M9l74L89m12J92j07N25l52M5j38L17P2j17j46l61M51q9J4j48O7p5m6L04
5858A41j71N5j6j37P6J78n0o3K12m62J53K07k29J07J06r0K37q3j15j45M8J90n34
5881c85K69J13j14N9j32K01j56J46L14l25R6j01R4n6%J9p4k02O29m30k0J12J9
5904G6k91J28K22P4k05j01k11N55j52j49l3P0P4J00o8kj81K14P2j68J85k82J62
5927H9k57K38Ojm6j33N1J13J50k64K4jP1O3j54J24k13J67J9m5J00k1k6j71J94
5952G7J8j10J38j80K69m63J57K82q4p6k8J33Pj82K62j08o6k20J83L01l13r9J01
$$ y = [46, -137, -69, 141, 82, 75, 29, 88, 44, -10, 13, -85, -183, -234, -257, -133, -6, 212, -51, 151, -134, -48, 192, 160, -61, 51, 118, 112, -178, -124, -125, 111, -30, 45, 181, -95, 227, 94, 57, 113, 4, 147, 127, -279, 206, -100, 36, -77, 107, -1, 81, 130, -244, 145, -267, -75, -182, 343, -9, 36, -102, 215, 287, 170, 24, -337, 114, 25, 39, -109, -42, -117, -163, 141, -30, 25, 9, -128, -52, 126, 76, 13, 225, -237, -84, 123, -106, 1, 107, 17, 254, 171, 56, -89, -41, 149, -385, -116, -3, -117, -58, -190, 11, -145, 1, 315, -10, 86, -15, 79, 23, 23, 42, -32, -234, 395, -35, -55, 57, 76, -215, -87, 135, 209, 4, -97, -308, 247, 95, -54, -87, -17, 57, 157, 89, 87, -94, 120, 192, 24, 209, -73, 89, -168, 70, 76, 75, 29, -104, -53, 60, 210, -54, -30, -31, 40, 103, -51, 73, -140, 27, 46, 1, 101, 80, 54, -117, 77, 95, -15, 123, -57, 212, -251, -94, 188, 104, 28, 0, 133, 140, -42, 220, 112, 46, -174, 9, 310, -3, -102, -1]
5975aJ99k23N3m7N9j44L8M9J4j30J01p4Jq3J37M9k91L52l11K12K19n28M05P6K
6000A34l27L48j18j8J2r8K43m5r5K8M1m31M46l48R9L59l01j2J71r7J45l6j00O8
6024F8q5K19m3K05k01j49j24P2K67n4j99j19K17J09k48J35J2M6k0j62L5q0K80
6047A81l00J2k03K13Q6j1r7J47j06N9J24P8l95J90j6l8M00k40j55K2l4J44q7l77
6071d03J75K46j86J77q2J01J42k69j11J74J21m37K20K7J47j12J24Nm2K69m01R3
6093b2j33J85k11K97l5n8L27k80l0J21k03L16k7m02L09j44j34O6K09l50K20k38
6115b17L94q0M5K4j76J87j24J35k74q5NK59l2j64K23N6j60NO1Q2n4k35L48m94
6139b71L02k91K38j47K81Q1j65J28k86J76j04L4j68P8J95N5l39J10J24K18om23
$$ y = [-1, 198, -25, 28, -19, 40, -104, -66, -17, -3, -133, -32, -106, -105, -188, -51, -2, -293, 59, -252, -40, 179, -349, 56, 132, 134, -193, 155, 37, 19, 31, -67, 176, 131, 36, 64, 105, -326, 120, -228, -129, 230, -71, -83, 88, -9, 136, 100, 0, 68, -17, 202, 159, 364, 163, 14, -110, -38, 229, 175, -24, -143, 74, 183, -65, 70, 82, 128, 108, -54, -19, -99, 181, -119, -107, -310, -97, -11, -22, -119, 28, -78, -19, 105, 183, -212, -22, -38, -76, 324, 84, -71, -49, -83, 61, -26, -403, -228, 18, -168, 9, -73, 28, 170, -99, -210, -36, 85, -352, -132, -105, 42, -70, 54, 59, 17, 286, -115, -22, -155, 30, -181, 116, 81, 23, 350, 70, 40, 161, -42, 274, 247, -155, 154, 10, -124, -58, 151, -199, 21, -217, 177, 97, 142, 166, -10, 177, 53, 188, -86, -171, -166, 93, 61, -103, 120, 176, 16, 21, 82, 164, 110, -125, 223, -271, 31, -260, -22, -169, 112, 193, 28, 156, -130, 46, -58, -24, -192, -114, 81, 136, -203, -93, 31, 249, 243, -180]
6161a80K70N4L9o4Q1jj36j25K24nj31j70N9J31Q0M1m0J3k99J46j31K26J33j99
6185A6Q4r0J14l48L96j99J35j10K3j84R3J0j01J39j0l5L33k98J30j88N8J83j53
6208bL22k86J17j80n9K34Q4k61n7J80Q8k50N6J4j46J71Q9k60J62N7J14k4m17L44
6232I0m1j85j5K35j64j35K24p1r5J16P0k30M87J7k17J21k8k11p6M4J75k10j07
6255b06J28J0L22j09k19J56r1K3n6nK10j21M2o6o0O0L07j66j08r1K04l53K29p
6279C3J3l02J04K06N3j61J14o2R7N2j6k90J89P5r4l1R3kl70M54j21K3n1L0K27
6304B63j82j35J14r2R0K4j16K45m04M97l65j54L97k21J26k63J36p6KK9n3L03k42
6327g7J67l15R5K42l74K91J8m0n3j00P1l7J15j54m9O8J46j62J24r0l1K89j17N
$$ y = [-180, 90, 144, 183, 119, 200, 199, 63, -62, 162, 157, 26, -144, -85, 46, 126, 167, 127, 140, -159, -13, -144, 82, 215, 16, 100, 10, 124, -224, 172, -27, 108, -2, 21, -163, -70, -60, -161, -22, -32, -67, 266, -32, 98, -90, -32, 151, -2, 320, 34, 151, -29, -88, 146, 230, -31, -88, 92, 180, -70, -14, 0, -146, 25, 114, -146, 16, 73, 187, 163, -254, 90, 49, -136, -151, 84, -80, -215, 9, -62, -157, -41, 29, -201, 286, 303, 86, 207, 179, -32, -108, -64, 111, -99, -206, -78, -68, 254, 145, -74, 82, -9, 14, -42, -47, 163, 42, 84, 18, -42, 18, 325, 159, 51, -40, 164, -189, 40, 33, 46, -256, -152, 54, 107, -54, 60, -2, 95, 147, 131, -159, 30, 105, 11, -20, 73, 71, -299, 155, 34, 57, 6, 36, 263, 81, -54, 60, -32, 58, 82, -34, 211, -193, 304, -61, -215, 182, -39, 87, -176, -40, -116, -114, -85, -138, 165, -77, 90, -225, -130, 112, -262, 29, 47, 7, -46, -146, -75, -112, 3, -151, -200, -132, 14, -148, -24, -114, -145, 144, 27, 32]
6351C2K9k3j68k5R0J93K36l72k09J30J71m48L51M71n06O6O4k12p8J62k05J37J84
6374G0l7j18K6J94Kq8O2k01K34l0r5N8L8K34m47J6l4J23q0k41M70k24j69L49M6
6399A58l2j01j6Q6P7N1m22K95j14K36k45L09l19K28j54p5J35k81K16M7k90L44
6421A33j22k01M11j15l12K67K18j50k0J54l70p1L14j42p9j28L29j08P8j46N4K95
6443B89m29J22Q2k05L81l03M3K11k10k16J18R4K08k41J70j52K8n5j62K97r1m9
6465g0K23o5l6k86J68n2J50P0k36J87j38r0L93n3o5j18RJ30k29m2L9J47K71j61
6489A46j24K0K0r6L79k66J0Jj98L24j1q1J79l14N8M3Qm67J5L36J22r5r4J56P1
6514A42p9k50J99kO6r8O8J12l98M01k76L69r3j47K28k53m1P7K4K59m58l2J87k2
$$ y = [32, 61, 38, -130, -155, -65, 128, 364, -8, -217, -87, 84, -364, -13, 458, -48, 18, 82, -130, -208, -46, -251, -114, 70, 33, -85, -59, 135, 137, 49, 111, -90, 144, 114, 19, 77, 115, 349, -98, -82, -116, 7, -73, -314, 156, -68, -237, 112, 158, 126, 25, 9, 95, 172, 223, -199, 96, -18, 218, -27, 282, -37, 191, 37, -38, 97, -184, 32, 79, -211, 133, 11, -190, 221, 106, -206, 61, 279, 129, 109, 263, -107, -178, 136, -6, -85, -213, 116, 8, 86, -60, -6, 289, -140, -18, 64, -141, 240, -63, -20, 191, -19, -235, -117, -23, 185, -56, 114, -38, -10, -65, -227, 70, -21, -70, 153, 88, 52, -234, -66, -118, 32, 102, -134, 53, -85, -175, 218, 165, 100, -18, -9, 121, -108, -150, -111, 36, 307, 146, 22, 42, 62, -34, 345, 79, 89, 90, -108, 216, 205, 124, 303, -11, 47, 90, 98, -369, -354, -18, 104, 9, -85, 71, 142, 63, -187, 12, 10, 76, -22, 46, 158, -240, 161, -115, 254, 161, 14, 242, -11, -52, 25, 49, 308, -150, -182, 5, -17]
6538a7p9P3q2M71n42q6J84o3J54l4P0r2r9J85M6k51K35k8R8k29o4P1P0R4k33j78
6564c26J15J85k7J19p9r8N2j65N29m32O9Q5p2j39M02l69L44K4l52L12k58j54K04
6587c1k10K47r0K11J5l80J94oJ83j39j05J13m9j40K96k11l4J05Q8k41J41k11J29
6610a25j30L94k87J0l2N2R6j11L34k96J20j1l2K4l01L38k31N3K84l89J74J7k19
6633b68L84K4j94l0j3j9j58L53Q5m19J67R8j39O6J96k5l56J09J37M7R3j47M40
6656D31k84k21J11j08j13J58KkJ44K18m64J86l7O1m00L87k21J11J37m0J30l56
6678a70J30K31K4j50R6k34J13k09K54k07j28L56J19l05O8o9K09J2J39k85J37m38
6700c07K99j07J55l9k70K99J11k85p9k5J35K87j7k03q4j45L36k42k21L21j7K59
$$ y = [-17, -96, -23, -105, 366, -176, -262, -78, -141, 13, -21, 49, -43, -142, 43, 89, -162, 73, 45, 143, -86, -150, -79, -9, 85, -148, -326, -211, -26, -53, 66, -13, -111, -59, -224, 305, -127, -58, 27, -45, -184, 218, -151, 193, 217, -135, 177, -81, -235, -31, -241, 6, -84, 127, 142, -238, -44, -50, 133, -6, -111, 2, -47, -187, 109, -102, -136, -31, 57, -184, -43, -254, -125, -255, 139, -148, -138, -170, -118, -22, -133, 201, -95, 25, 14, -18, 6, -295, 43, -188, -135, 149, -240, -66, -49, -268, 116, 140, -54, -84, -97, -116, -274, 79, 164, -255, -88, 10, -129, -63, 133, 108, -248, -139, -2, 45, 138, -9, 431, 147, -74, 37, -71, -184, -26, -24, -26, 118, 336, -128, 58, 21, 82, -318, 69, -152, -41, 96, 56, 186, -170, -40, 191, 215, 65, 161, -73, 40, -169, 85, -122, -250, 106, 225, -80, -12, -81, 128, 140, 279, -6, 131, -307, -8, -115, 40, 1, -269, 30, 141, -144, -223, -248, -113, 174, 157, -46, -130, -275, 61, -181, -402, -81, -98, 161]
6722A61k90R4K29k85j40K01J36m1J06k24R9R1k56J26J68j23kK3J3k12j0J22K51
6745B37m86J17J45J50JO7j4m01J14J92m9K56m37N1L01k85M7j43K93%j30j50L17
6768A93m3j56J5J75k30L43k97M7J5j88K48k47K20o5p2K01J49k19l01N9K53l7M3
6791A06K8j57Qk9o3J93J54n49KL51q1N6p4R2J2k87k27J29N67k56j54J26J53j94
6815i4O5k63J42K32k8J07j34q8j7j77J87j06n3Q5J30p4j04j55K63K80m34K63J14
6838A41k20L01j29j4m4J16l2QJ4j16j92J13N9J25l06J75l25M88m7k43L62k88J72
6861A18J15l2l78J00J49j91P1k5J32k72K91k34l0K29m1J86j67N3j95j5J47L0r5
6884e4P0j11J67K84l32j89m1p9K44JM7k22PJ41L11k24r0L8K10r4m1l6p1j67L79
$$ y = [161, -129, -35, 194, -91, -231, -30, 106, 65, 171, -53, 46, 137, -119, 7, 175, 52, 50, 73, 86, -126, -136, -14, 237, -249, -132, 13, 163, 164, 231, 217, -184, -70, 122, 73, 329, -108, -57, 244, -41, 6, -137, 156, 156, 26, -124, 193, 150, -6, 9, 184, -46, 297, 0, 47, 62, -126, 122, -125, 95, 30, -42, 159, 308, 89, -212, -153, 100, 63, 106, 134, -23, -15, -44, -107, 86, 240, -309, -307, 44, -37, 19, -55, 37, 49, -238, -465, -336, 231, -25, -179, -53, 100, -94, -29, -292, -150, 82, 54, 161, 27, -61, -78, -255, -68, -174, -227, -142, -12, -86, -190, -345, -82, 198, -236, 27, 141, -79, 222, 93, 79, 35, 151, 119, 127, 141, 25, -167, -54, 5, 130, -176, -1, -326, 162, 115, -128, 234, -54, 118, 233, 201, -177, -77, 72, -119, -48, -73, 59, -213, 78, -156, -186, 43, 2, 188, 21, 74, -121, -136, 11, 41, -54, 16, -95, 72, 356, 24, -165, -206, -285, -41, -40, 7, -215, -208, -67, 244, 20, -70, -32, 178, 84, 43, 7, -64, -231, 148]
6909A48l0k8M3l25J49K81k97J78j00n8l2K45p3k21J53P1K1n5P2j69j15R3J7K66
6933B34k13k83M73l06L35J8k37j10M42n37M03m09K57J37m10M08j52k6j43Q8j86
6954b17N04l61L6P4kp4J60q5k54L21k23k5J42j12k1K28l22K08O8j02j35K59j73
6977a06j36L01j42r1J37J27q6K32k65j70J86qJ23k10R7L16j51j41k71K18O8M8
6999G6M2P7j58l06L53k27J28j64K87j11k56L67k23m2J90l9oj58mK94k25J86R8
7022A79m20K35J3O4J55j11k03L09m7j60n0Q5l61J49Q1j36J37Q1P8J11j03K0o9
7045C7K8J69l07J81k1k80J94k67M09R3j78j2j39M43l70K0J68k4j96M69m71K21
7067A67r7j45j53L28kk32P5K27M2m55R8Q3K17m25J79J19r7J22J20j21k77L70j94
$$ y = [148, 118, 90, 133, -192, -43, 238, -59, 119, 19, -39, -71, 174, 101, -120, 33, 104, 125, 70, 142, -27, -142, -49, -32, 234, 21, -262, 211, -95, 240, 258, 21, -89, 353, -184, 219, -190, 67, 204, -206, 202, 50, 24, -119, -31, -217, 287, -74, -38, 36, 34, -40, 120, 35, -219, 102, -121, -146, -4, -116, -137, 91, -231, -23, 45, -57, -192, 67, -106, -242, 59, -83, -174, -37, 90, 4, 236, -29, -199, -13, -21, 102, -108, -11, 305, 154, 13, -258, -40, 28, 76, 118, 195, 37, -269, 84, -143, -15, -179, 108, -3, -259, 108, -115, -157, 33, -6, -12, -170, -174, 120, -105, 81, 179, -241, -6, 7, 71, 226, 115, -88, 221, 174, 14, -36, 49, -312, -163, -82, -218, -81, 0, 78, 189, 86, 106, 37, 65, 234, -73, 108, 87, -193, 1, -266, 143, 236, 58, 46, -93, 350, -20, 0, 168, 144, -52, 417, -54, 167, 70, -75, -228, 100, 98, -134, -59, 168, 210, -245, -147, -64, 153, -272, -93, 26, -71, 51, 171, 50, -227, 143, -51]
7090e1L16j51l01L0K64L3k01j55L59Lj39J01q0o8P1rk5L28m87K21J2l21J68R0
7114Hk8o6J16J56k93K64k49O3N1l5j09K30k66K7K34r8k13M09j42Q3O3k14J95k10
7138b4J81j49K60m55L07l3J12k31j79J40J30%j6k54j47J33K51J4J84k4j71M8q1
7161dJ0l8K26p4j30q3N7J5P4j38J51k09k01M57k8k18N0J23j45k66J35J99R9k1
7185D1j50J19l31L08J36l9j16J92l44M10l24n0J49K28k45K00k8k9k39Q3n8j72
7207b59K97O6k10J86%j51J92o8r3K69l76L09l03K81n5k6P3k02j48K67Q8k37J31
7230C1K46j83J79n9l68j08K46J06O3Pk29J94k6P5j42J00k49N0Q2J10jj34J26J26
7254B42l52K62l02L8%L00k04j78L91j13l71M61j61m9k5K4l8j54M4K98j08Rl6L8
$$ y = [-51, 265, 114, -187, -157, 107, 140, -61, -216, 143, 146, 7, 108, 28, -40, 31, 22, -3, 325, -162, 59, 71, -250, -82, 8, -20, -86, 30, 186, -107, 157, -92, -29, 22, -13, -122, 108, -158, -131, 103, 5, -208, 201, 59, 142, 205, -9, 186, -24, 157, 8, 268, -187, 120, 87, 199, -32, -211, -71, 59, 59, 43, -211, -358, -225, 26, 40, 224, 200, 29, 77, -4, 6, -32, 194, 120, -10, -93, -36, -21, 53, -85, 66, -143, -344, 113, 85, -133, -83, 40, -105, -371, -236, -37, 62, 41, -109, 10, -321, -13, 123, 84, -32, 160, -184, 226, -98, -148, 1, 229, -16, 184, 156, 127, -112, -29, -87, -259, 38, 104, -106, 80, 80, -71, 121, 53, -40, 229, -147, 162, -141, 140, 85, 59, 132, -70, -218, 49, 137, -100, 31, 277, 94, 273, 214, -154, -262, -16, 90, 153, 160, -69, 125, 99, 174, 32, 132, -117, -67, 15, 125, 124, -10, 116, 242, -110, 152, -150, -112, -112, 188, -16, -194, 197, 84, -287, 174, 13, -36, -61, -37, -75, -229, -185, 113, 5, 14, -22, 16]
7278A6j44p1L0K72j10M4m3J4Kn2j45O7J93j45J68Kk38j2pK37j79J94k19qR3J26
7304H5J2R7p0k07R7j28J57pk43J25J66k52K93k55M19m00J93pj89j1j10L30M7q2
7328F0Qj00M1k28J53K05j8q3n2k14L33O4J7k73J33r4J6Q2j86K62l34M36l27L0
7352f9lk3K46j93l1K08n6r6J10L5j21J63r2l50M18q9k24J66J3j67M20j21p0O5
7376A39k61Q9K24P7l78K04K02l16N2j24L32l27M6Q5r9k24K12l85M47K09m12M40
7398B32k71o7K44L7j42N5j91J42K40l73j6K22M9p6j03q8J2q2M45l89K51k27J15
7421A9J42j35n9k53L82q8J22l07K37j86K45j49L6J24q5J05r9J99l58Q1j30J74
7443A7p8J16q6J79J57l3m48Q8Q1k88J60J04j36O2J33k96J8J56O2qj27L2J82N2
$$ y = [16, -128, -199, -169, 103, -7, 37, -6, 8, 10, -42, -187, -120, 73, -72, 96, 98, -140, -152, -159, 78, -101, 93, -126, -134, -41, 85, 97, 194, 124, -83, 14, -114, 43, 36, -207, -82, 84, -168, 125, -130, 289, -111, 82, 75, -114, -125, -235, 95, 142, 60, 68, -32, 9, -219, -66, 139, 121, 38, -14, -228, 105, 169, 186, -87, 46, -48, -32, 50, -136, 126, -208, 228, -99, -69, -72, -95, 151, -42, -73, 135, 79, -17, 93, 128, 7, 170, 78, -272, 146, 57, -167, -1, 12, -155, 265, 144, 74, 139, -122, -33, 191, 268, -110, 94, 296, -20, 32, -92, 240, -87, -41, 44, -55, -279, -67, -452, -5, 204, -208, 232, -39, -106, 138, 175, 33, 88, -103, 39, 279, -94, -110, 112, 161, 85, -18, -106, -94, -176, 269, -120, 131, -96, 19, 161, 26, -33, -286, 96, 8, 130, -177, 60, -126, 119, -30, 6, 130, 45, 150, 51, 250, -108, -27, -157, 17, -61, 55, -31, 148, 305, 272, -176, -88, -7, -295, -135, -31, -167, -105, 28, -268, -250, -94, -32, -40, -167, -135, 47, 99]
7467I9m0Q7k04r7K42n7J7j11K5jK56k13J51j49O2L2L4n51M67k35L44J21l79K45
7491A45O5jk23O5k35l6L64K18j48k06P2j81J91j63L11j09k18K58j25j01J57r2
7513HL9Q8r8j23l8L85j68l5k18L28j77k69K09J01l6K03r1l31O11j19k47l26K41
7536f3K03j8r3L3p6j97J63l6j61J06J19n3L4O1J21j99J59l6j68j45R7K28r3K40
7560B26j87N4j49J26o6J61mn0l71J31J50J56j91J09k02K44l37K03J11O6j91m4
7582e5Q5j43K43q3J78m69K16j24J00M0L22k15n2J74j53K68j46m85M01j58J32q4
7604hJ47rl73J56K70m10L21j16j06K71k18J73J32k32k14J55j02K66m0l18L94q3
7626E6j18n8M3P4k43M9J18K03k84M06k85O3J0j69N1kN3o1k37N20p8k68O8k98L17
$$ y = [99, 59, 146, -58, -155, 87, 30, 47, -64, -39, -40, 216, 3, 154, 5, 67, 99, 133, -418, 49, -186, 158, 279, -100, 145, 210, 209, -14, 51, -184, -220, 144, 362, 214, 8, 80, -101, 90, -73, 238, 129, -89, 169, 44, -57, 100, 8, 47, 135, 37, -86, -124, 261, 93, 58, -160, 168, -9, -278, -69, 32, -4, 199, 108, -223, 388, 269, 22, -304, -63, 140, 122, 29, 62, -14, -211, -48, -84, -245, -139, -20, -73, -39, 22, 143, -56, 103, 67, -101, -246, -149, 79, -14, 226, 39, 93, -56, 70, 4, 165, 161, 111, -260, -129, 21, 177, -14, 95, -107, 137, -200, 3, 114, 180, -11, -55, 30, -113, 130, 47, 225, -244, -28, -152, -52, -12, 310, 95, 43, 217, 64, 332, 186, -299, 102, -56, 76, -8, 139, 130, -243, -87, 183, -227, 94, -22, -128, 143, -75, 98, 230, -2, -216, -61, -163, 103, 63, -255, 139, 56, -62, -120, -77, -3, -246, -197, -79, 124, -160, 246, -39, 24, 34, -135, -84, -86, -33, -94, -331, 189, 111, -157, -89, -387, -70]
7651g0J75m05O1M66o6k77J01K8K07k96K2L7L0j33o3M26k28l44L17k25N7L24l86
7674b42M06j53q0QJ41j07K56m25J7M7J0N38n09J87j91K21O4k47M6J03p8O9jk48
7698a68n8O12l01j66M2P3n2l21J60K19j26j3L09k30R7l5Ok10K86l56L00nL10n96
7722b23L2K15l9L01l37k5j67L52k56N5K75l42O3q8J38j58M12j02k26O9J34j34
7744e1k4P2o7J32M2L1l2j75L60l34M4j47J39p1J39j12J22R5J21k39q1J66l34K08
7768Dm9L46m40NK65K1j86K38j87O2j2j73K63j29j41L00k24k17J69J27l16Q8N30
7791C44q3k07p2j00J65K50k04n9k43L53j37n4j88K14K8p7R8k07P9J19Nj61K32
7814I5j59Q8k47N04j2m82K55m7o5M3k23M60j89j04M1k30K9K16P9o6n7J13K8p7
$$ y = [-70, 105, -300, -239, 227, 161, -116, -15, 13, 220, -76, -54, -17, 13, -120, -183, 243, 15, -329, -12, -237, -180, 144, -242, 164, 11, -69, -61, 80, -27, 229, -196, -179, -132, -122, 416, -93, 94, -97, 124, 188, -59, -13, 90, 12, 81, 80, -168, -226, 386, 85, -81, -39, 34, -18, -339, -179, 40, -86, -99, 210, -20, 77, 42, 48, -162, 124, -232, 68, 63, 373, -223, -191, 24, -15, 286, -51, -76, -243, 109, -147, -92, 183, -159, -96, -184, -46, -204, 208, 106, -120, -51, 83, -51, -75, -3, -70, 62, 104, 135, 103, -72, 288, -46, -2, -149, -10, -81, 58, -54, 68, 163, 284, 45, -36, 130, -204, 4, -45, 301, -139, -134, 131, 152, -34, 204, 17, 79, 67, -106, 157, 28, -113, 187, -37, -254, -85, 42, -274, -186, 344, 261, 54, -18, -118, 47, 297, 93, 34, -209, 144, 7, -47, -235, -21, 7, -70, 28, -179, -100, 19, 24, -137, 95, -64, 24, -223, 281, 269, -213, 42, -5, -70, -27, -250, 210, 21, -83, -42, -272, -243, -27, 52, -14, -71, 42, 70, -7]
7838gQj65K41j74J49J5Rp1K09k61K00J74l77r3K23k69K13J52kl35K15L9P2j13
7862E2j61K02l77K99r1q6J54J24Q1j91j32r3K52Lj46J04J84r6L8l7N9j04j53K44
7886A29m44L16j80J06j54l7M03Kk84Q7J37k66K24k03Q1J40k84N31k36J44j52k58
7908a98J66j2K49m5k05J42J49l55K51j70l0L4L11l29K7L3m0J61k47K09j60K5K73
7931B39l60m2J88j52K04o4j13J71l09M22k19R9L1l02L99r8M2k01j26K1J79N0j09
7954e0j12K82j11k69J01J22o0j5N5j76J89L53l92J23j92J02O8l8j56K00J34m77
7976c19K32J38k8j91LMJ46O7l22L29K92l47j21j09J29J88Q7L4m08L9P8L57m20
7999a42MJ26lk15K39O3Q8J29p58O42l24M59n82L80j06r8J81M1J96k19j20j7O5
$$ y = [-7, 1, -164, 77, -97, 52, 67, 76, 5, 214, -47, 153, 327, -50, -143, 80, -189, 24, 176, 174, -161, 54, 93, 165, 52, -109, 93, -284, 15, -76, -162, -8, 116, 197, 6, -126, -219, 33, 36, -110, -6, 178, 82, 120, 83, 142, 38, -115, 129, -315, 1, -179, -73, -227, -264, 139, 141, -143, -56, 81, -185, 39, -164, -83, 57, -227, 304, 68, 212, 60, -198, -32, -44, 205, 160, -45, 97, 246, -109, 142, -28, -58, -24, 287, -42, -15, 18, -22, 139, -108, 101, -59, -34, 239, -121, -163, 25, -127, 77, 13, -100, 71, -238, 184, -35, 64, 95, -207, 192, 94, 136, -65, -191, -170, 9, 59, -50, -162, 120, 9, -260, -159, -37, -97, -112, -57, -233, -44, 309, -83, 40, -152, -50, 18, -20, -176, 24, 158, -319, -87, 51, 23, -168, -165, -161, -15, 52, -270, 59, 351, 4, -117, -226, -97, 91, 178, 212, -196, -157, -79, 278, -142, -138, -12, -15, -230, 9, 72, 160, 289, -469, 173, -151, 308, -274, 106, 0, -98, 83, 124, 320, 101, -19, -36, 29]
8022B9q3L4k23L31j43K61l16K8K66j48j6o0J22nl53L10o9J25K9k3j40J16o4j68
8046a60q2K35j16J50k41K96J32k21N6p6J28j22Q8k6k1K6k18K8P8N1K03k67JO5
8070a3m5L39n05L92q3j13l0J77p5k76L1J26L47o1k88rJ02l7R2k1l7j32N9j45J31
8095g4q6LJ36j5k0j02m0Q8L08l07J31j62J84PK19o2j63q6N8K09l08n7j11Q3J26
8120d1R1J45j76j37K36p2q1k1J20j99K69l5p4k5q1K08j34J20r0j23P4k71K83o4
8144g8Q1KJ09k65J82j74L43J85l11j85L67l00J90n5l82K2M02Mj40K10q3k24J38
8167C8j76Lj5L2K82Kl96K96k02R5o8P0R0J19l37L72j00r3j3L9J0L2r1J35
$$ y = [29, -54, -20, -243, 88, -55, 206, -110, -82, 184, 36, 20, -40, 82, 77, -276, 34, -35, 90, 119, 96, -44, 72, 8, -160, -242, -7, -123, 27, -214, 82, 214, -7, 49, -27, 101, -21, 67, 41, 20, 46, -172, -144, -66, -15, 188, -79, -78, -13, -58, 281, -224, 168, 85, -28, -58, 119, 44, -232, -201, -75, 272, 211, -77, -86, 16, -21, 71, 50, 13, -119, -60, -205, -74, -160, -157, -21, -36, -56, -158, -198, -110, 198, -109, 22, -140, 44, 51, 270, 208, 45, -41, 17, 226, -82, -139, -250, -167, -41, 50, 195, 19, -118, 118, 46, -35, -56, 64, -135, 134, 99, 25, 0, -81, 127, -7, 113, 23, -100, -26, -297, -14, -78, 3, 5, 114, -151, 31, -143, 200, 385, 74, -111, 256, -44, 146, 91, -291, -269, 133, 137, -3, 207, 124, -100, 38, -138, -135, -150, -118, 164, 166, -230, 66, -136, -41, -109, -39, 51, 170, -167, 205, 105, 12, -1, 38, 48, 80, -11, 124]
8191A24
$$ Imaginary data points
##PAGE= N=2
##DATA TABLE= (X++(I..I)), XYDATA
0@%%%%%%Qj6Q%Qj9K7l2L2m0N6p2Q8j04J20j44J76k06K36k74L20l69M24m85N49
31B91o23P10q05R05j012J133j270J419j578J750j940K151k382K629k896L191l519
48a846L878m270M702n178N709o308O982p742Q609r614J0797j2211J3927j6057
62h622J8786k2414K7468l4977M7204p0160J26360m80008m25950J738329p89795
73A26221j014292J393560j27129j133367J046338J69451j162160P82475N92810
82F73907j257912K86660J036144r02069m12879J022533k31789o86188N69221J90582
92B88210n79310K65311L30129n51257P0263O09484n26087l62673Q36961j22800
102B58231q08772O25144L88887q31459K20935N74677o66302N1712O36244o79927
$$ y = [0, 0, 0, 0, 0, 0, 0, 8, -8, 0, 0, 8, -11, 16, -16, 16, -24, 32, -40, 48, -56, 64, -80, 96, -110, 126, -148, 172, -197, 227, -258, 291, -332, 378, -427, 478, -534, 599, -671, 748, -830, 920, -1020, 1131, -1251, 1378, -1518, 1673, -1846, 2032, -2238, 2464, -2714, 2995, -3313, 3669, -4073, 4536, -5078, 5719, -6492, 7435, -8622, 10164, -12250, 15218, -19759, 27445, -42715, 83645, -396363, -822313, 916016, 126221, -888071, 505489, 378360, -755007, 291331, 460782, -701378, 81097, 673907, -584005, -297345, 738799, -163270, -576149, 446384, 214595, -471593, 97628, 288210, -291100, -25789, 304340, -246917, -176654, 432830, -93257, -455930, 381031, 258231, -550541, 74603, 463490, -367969, -147034, 427643, -238659, -186947, 449297, -230630]
112b30630r5305Q85905o26468m91221J025451k41885q06428P90999J30719p71336
122d30199N16169K28128p04956M44409L52634q03899K65014O54461p29087j43753
132c51079P60518l60940l95885N47764p7032l70847L70351J5097l89510L02401
142E0838K11909m77586M9958M88499l13726l37398M91253N8389m95881K49335
152b4410K85029m40541Q2468L83379m45542m7788N82392m25153l53800P45555
162C41589j51948o69144O17101K07235p19285L45599L78473o28023J79751M69487
172C70835o00720R146O36409m97017k91158O94683j93459n03803N02001Q8164
182B15081m70475K67918J81394l76324J47729K47213l45018p305L64353k16234
$$ y = [-230630, -325935, 559970, -66498, -557719, 467732, 225847, -580581, 210418, 341137, -430199, 85970, 314098, -390858, 53551, 406185, -397714, -132700, 521761, -207326, -351079, 409439, 48499, -347386, 200378, 123346, -247501, 122850, 137947, -251563, 50838, 262747, -214839, -164881, 323618, 9892, -327506, 163747, 222136, -273745, -24410, 260619, -179922, -97454, 285925, -159617, -207405, 374987, -50166, -403966, 341589, 189641, -479503, 137598, 344833, -374452, -28853, 349620, -278403, -98652, 370835, -229885, -220739, 415670, -81347, -372505, 322178, 128719, -375084, 126917, 215081, -255394, 12524, 193918, -182406, -34677, 212536, -132482, -139787, 224566, 8332]
192H332k40390L44917M2399l41297J49988K14033k59850j3283K43537j85005r1299
203a27918K92547j49200k29061L62646q636l99043K94522K00178m29936J21487
213g2414L04574l47417N657L25999k96772p3624L85294k45594k18725M28112r3116
224A01974l56204L42912Q1905l64282J99813J61027l06635J09332J99438k75650
234a06370J8605K67063k10253j24283K84623o1025k25728J93646P7172k17587
244a04137P9414J34072j71716K420J72760j35164r2329K19072m9549k10993J98329
255D2179Q8781k67571R9302J91594k39245j029K33247j89577q0014K64172j32742
266I097j75164K78556k8958k66520K28683R4033k92434J31482J74456k58650M1832
$$ y = [8332, -232058, 112859, 155258, -186039, -36051, 177982, -81868, -95151, 148386, -36619, -127918, 164629, 15429, -213632, 149014, 140378, -258665, 35857, 236035, -193901, -72414, 232160, -115257, -109600, 216399, -80373, -153997, 231297, -14297, -233022, 195090, 101974, -254230, 88682, 170587, -193695, 6118, 167145, -139490, -30158, 169280, -106370, -87765, 179298, -30955, -155238, 129385, 68360, -157368, 36278, 113450, -104137, -24723, 109349, -62367, -59947, 112813, -22351, -114680, 104392, 54843, -156150, 42179, 130960, -136611, -37309, 154285, -84960, -85989, 147258, -42319, -122333, 141839, 9097, -166067, 112489, 83531, -182989, 45694, 139727, -152707, -21225, 153231, -105419, -63587]
277f3587K11492k09775l8387K35585j40813j27329K30400l9335j93514J73170
287C7907N9864k03450R1855J21201j73683J6024J52184j25866n7255J63649n4894
298B7536j26696J41760L2483j66295Q4088J07723j63664J4695J53040j30714n4703
309h0747J73747p5434j20713J67371o70j71147J29007P7316j91369P0648J37476
320A15485j80138M392J76125j42578o3692J88006p9679j23006J67818n465j58632
331a01364J23394O1745j69068O9330J12674j55352Q037J44209j14315n4418J45807
342G0679n1529j00673J17033J3582j21580P3424O6601j23352K4829J06867j05083
353b9202l0138J26563o0814q1391J15913p94j12785P9899N4594j20047L5199R7081
$$ y = [-63587, 147905, -61870, -100257, 135328, -5485, -132814, 97586, 58251, -135263, 37907, 97771, -105679, -13824, 107377, -66306, -50282, 101902, -23964, -81219, 82430, 27536, -99160, 42600, 75083, -91212, -7124, 100599, -63065, -48370, 104670, -26044, -80747, 93000, 17566, -103147, 64224, 63554, -107593, 21414, 98730, -92639, -21991, 115485, -64653, -60261, 115864, -26714, -90406, 97600, 17921, -105085, 62733, 57268, -101364, 22030, 83775, -85293, -15963, 96711, -58641, -50604, 93605, -20710, -75128, 70679, 19150, -81523, 35510, 49092, -72488, 936, 67537, -55815, -30986, 75881, -29202, -59340, 67223, 6409, -74982, 40931, 40137, -72648, 7251, 61845, -58202, -23003, 74078]
365G4078j13334j0968J26929q8590o1181J36867m1550j03807J17146J5941j25234
376g3703P7099O4670j24580L2771R9120j11678j0814J21685q4675n4372J23719
387E9242l8986q8777J00206J2595j01772N9347N4010r4930J7535P9599p7735j9323
399c8989R2543n0337n4701Q8706q466q0483O1714L7798q4778J8944P0972o9346
411a6423k0280Q6291m8634m9651R0619k2022p7180Q3189J6316r7284N2881N9676
423E7498r4526Q258Q5695p2618k6030R0575n0281m7821R1814k9202p0483Q4300
435B7179P787q7856N1615M7780p7381O757O3322m9503j9338O0102l2462l1800
447c3798O0990j6321n2707N3766K0361o6135J6235N6178m5742k7799O0221j4702
$$ y = [74078, -39256, -50224, 76705, -11885, -73066, 63801, 22251, -81556, 35590, 51531, -73703, 3396, 68066, -56514, -23743, 75377, -36301, -47115, 74570, -10105, -64477, 59242, 20256, -68521, 31685, 44280, -57492, 1855, 55865, -39065, -21530, 58069, -19666, -38989, 53554, 3217, -51484, 37222, 28756, -51727, 9987, 47785, -36993, -18049, 52923, -16423, -36703, 49588, 954, -48697, 41922, 19900, -57280, 25909, 42225, -55059, -2178, 57498, -37028, -28770, 56925, -15693, -41723, 48852, -1429, -49250, 42564, 13362, -57121, 27179, 34966, -52890, -1275, 46505, -30876, -24119, 39203, -10300, -29638, 30464, -1998, -33798, 27192, 10871, -41836, 11930, 32291, -33844, -17609, 38569, -7173, -34972, 25249, 10547]
459A0547m4313N1174l315n1381N4475J1058p4089M4458N1963q1747j266Q1818
471D9382n0387m1193P3090k0239m6096O2951j7209n2539P1475j204p8412N6131
483E750M2403p6903N159O1252l6600k3627L9447j3760j6143L3205k0757k4066
495b4640M6819j559n0232K2723M1644l5834k8635M2598J0629m1684J2998K0640
507A5467k5384J4907R200m1018K9647L6301o4722n017P5071l6484n2949O1712
519A6731O976n0695L3473K624l5612M9322q155o2897O1012L0572q2952J7920O1693
532D0012m3909k1761L6663j0267o000J7693k8635J470M5522l1065l6938M8530
544A1315J5712m4532l842L3683M480k9812l031K7026l669j2427J687o854J8717
$$ y = [10547, -33766, 17408, 14093, -37288, 17187, 28245, -45844, -1386, 50577, -31170, -32436, 49382, -1005, -42198, 30892, 10653, -35443, 27508, 10299, -42240, 29235, 28031, -50381, 5750, 48153, -28750, -23591, 37661, 1061, -22566, 16881, 3121, -13022, 20183, -574, -24640, 22179, 20620, -29612, -6889, 34755, -1079, -29714, 12884, 23513, -18171, -5173, 15467, -9917, 4990, 14190, -26828, 2819, 39120, -25602, -30619, 44452, 7968, -44981, 16731, 23707, -26988, 6485, 9109, -26503, 22819, 14664, -48233, 12779, 43351, -39601, -21681, 40012, -3897, -25658, 11005, 738, -5262, 12431, -16204, -14734, 30788, -277, -37215, 11315, 27027, -17505, -21347, 12336, 16816, -12996, -16027, 10999, 7330, -5097, -3410, -10264, 8453]
557H453J3021m6780L887O3191l4820n4288O1501K2181o3559J7832L0653l3896
569a2624K0985O150n0829M8848L2854q6027J6694P7357n4694l6659N6501l168
581A5388k5977J6344j2517Q35L4759l3799k7877N6303K277n1906J4632L1427q561
594A1328k1110o108K8056Q311l5094M87K7751l659j2975r465P780K7952j8464
607D790l9289L9736L1424n5930o881N0400j7963j9033J5695j5639J9489J8695
619B5494n7896J3599O4866n1681l6105O2152k516l7693J8845m19l920K6270l1848
632a0852k1656O2325r980o2064M0283L2999m1927k769J5628m12J0070j8583j3293
645b0231L4919K281l5373O317K5943j811k1520p803K7007J3513l8842n751M5480
$$ y = [8453, 21474, -25306, -21419, 41772, 6952, -47336, 14165, 36346, -27213, -9381, 21272, -12624, 8361, 14511, -36318, 12530, 45384, -40643, -23949, 53408, -1286, -37945, 18556, 15388, -10589, 5755, -6762, -5927, 28832, -4967, -32844, 23459, 25736, -26170, -11538, 19889, 11328, -9782, -15890, 12166, 20477, -14617, -14130, 13621, 9962, -3013, -12478, -4698, 23254, 4790, -34499, 5237, 36661, -19269, -26150, 24250, 6287, -12746, 2949, -12690, 6799, 25494, -32402, -18803, 46063, -5618, -41723, 20429, 17913, -19780, -935, -1354, -5274, 20996, -10852, -32508, 29817, 19837, -42227, -1944, 31055, -10872, -13641, 1987, 1575, 11645, -6938, -20231, 14688, 16969, -18404, -12087, 13856, 12045, -9475, -17278, 9729, 23242, -15600, -21351, 24129]
658B4129j2866l1920K3187L317o036J3645k9214J802N1784l8784l9415O3252M739
671B7620n5693K3722K3070k4077R825k406k0595L7099J830n4327L1978L8431m9721
684a3244o282L5442j1036n911m49j0239K4533J663l5528J4229K8413k1526j4646
697a4581J4728O845n79j2563q859K7880J598l6446J5859K5051k3346l152P638
710G3m919J7159j1477k5907L5785R804m3547J3543K8530k3462m138J2544j1631
723g643J2903N432l3423J9758L0919m3111m837M1075j9948j4255J9607j1361M219
736f65J3738k7249M783L1120k3740j7294K8905K96j8717Q038J713l82Q274j6433
750g613j109K5117j4731j4764J8988n46o353K877q484J0106Q834k2981M338K2347
$$ y = [24129, 11263, -20657, 2530, 5847, -189, 13456, -15758, -13956, 37828, -956, -40371, 22881, 27620, -28073, -4351, 18719, -5358, 4467, 2061, -18534, 18565, 20395, -33932, -1954, 36477, -13244, -19526, 15916, 4880, -1031, -1480, -11719, 12814, 14477, -21051, -6822, 21591, 65, -14581, 147, 6992, 6413, -6150, -15009, 12871, 14469, -21977, -6118, 18933, -4413, -7565, 73, -4846, 12313, 836, -25071, 10714, 20518, -23029, -9486, 19044, -4418, -8556, 3988, -7643, 5260, 10692, -22731, -2973, 27946, -15165, -20002, 21073, 1125, -13130, 6477, -4884, -665, 13073, -14176, -9393, 21727, -2013, -19307, 9598, 9894, -8823, -785, 928, 546, 8820, -7613, -8722, 16395, 1664, -13100, 5888, 5342, -1011, 1866, -6618, 3488, 12322, -10659, -6321, 16026]
764A6026j6735r288J7520n150m966R474j2778J619K1179k1969r706L1961j3102
777D085j8830K3597n307j1483J6686j1092o958K2825j2485j6642K4333k6k1802
790a3099J3999O719j5225R550J923j3848J5713K29j9193J5414O016j7304P950
803a156N313q642N459r68n473Q551j401q440P312K711p914M399J482n825P633
818C041k126r149J3463k231j3084J5063j114j3469J4471j167j3460J4776J01j4922
832i807J3567L526j6483J0209Q088j7504P455J1453j8169N065J3875j7312K798
845c239J3721j5273K028J2032j3135P69J1469j0171k321J0121m327n213O928k045
859A344k866M574l406j193O100m985j922N787m078J250J472o356P544P38j1038
$$ y = [16026, -709, -9997, 7523, 2373, -2593, 6881, -5897, -4278, 16901, -5068, -14774, 17187, 4085, -14745, 8852, 3545, -7938, 8748, -2344, -9302, 13523, 1038, -15604, 8729, 8703, -13099, 900, 7619, -7606, 1944, 3867, -9981, 5732, 5961, -13232, 2182, 8198, -9106, -1156, 4157, -4485, 974, 6, -5467, 3084, 1683, -6757, 555, 3266, -4648, -249, 1233, -4592, 3041, 915, -8234, 5229, 2998, -10086, 4977, 3863, -9606, 4865, 3698, -9762, 5014, 5115, -9807, 3760, 7286, -9197, 1012, 9100, -8404, -949, 10504, -7665, -2600, 11275, -6037, -3239, 10482, -4791, -2763, 9269, -3866, -3097, 8372, -1799, -4120, 6001, 1674, -3539, 3389, 1344, -1522, 3052, -354, -1547, 4553, -432, -2354, 3433, -645, 605, 2077, -4279, 3265, 4003, -7035]
874g035Q454N034j1738L874O359q410K357N781j0227L588J0992j4979j330J8011
888A0731j2957p823J7946p920p618J3512p448n061J3594p615q741J4163l1j3384
902h652P520O919j0392K369M929o237M255J579p885N999L375p251J249L285L15
917A377j570l785M986L457q254J394O210l874j856L843k717M0N690p025k675J3466
933H707p212j0960J6282j478j3327J1345P30r189R354j013j0119J1255K547j4271
947g349O661J0226j2683j238J1442p552k344P971p052K1P964q432r28Q512m649
962E70l789L913J594k109k219J792K208k474j262K361J41j787J181k02k251M712
978B379j703o808R074J156j2376Q769N359j2513N452O174j0308M334N900j0297
$$ y = [-7035, 1419, 6453, -5285, -1411, 4948, -3462, -1105, 4676, -5551, -1963, 9029, -5950, -7280, 10731, -2226, -10049, 7897, -23, -7641, 5871, -1577, -6638, 6956, -659, -9400, 4763, 4732, -8652, -1132, 5787, -4605, -2236, 2693, -3544, 711, 2290, -5595, 404, 3779, -3472, -2223, 1062, 1377, -193, -3978, 1008, 4465, -3789, -2395, 3815, -59, -1915, 1928, -789, -749, 4941, -2084, -4759, 8707, 1495, -9465, 6817, 5339, -7988, 3357, 4087, -5102, 4252, 3239, -6880, 4375, 6922, -7349, -688, 9538, -3145, -4383, 7059, -493, -2837, 5134, -1918, -1897, 6067, -2365, -3293, 5219, 570, -3219, 694, 2288, 179, -2040, -248, 1960, -514, -1776, 585, 726, -1061, 120, -82, -2333, 2379, 676, -6132, 2942, 4098, -8278, 491, 5850, -6663, -1211, 4963, -5345, -1011, 4889, -5408]
992e408K984Q982j0781j662J3280p984p486J3491l786q251J0046k510n852Q986
1006D049l762n674Q765r69p039M578L654m437j234L443j85j142p22L48K662j754
1022E81k096K907p21l4J605n414M330M981j1304L337J0161j0505k109R646m703
1037F62l250P002n191k562J0421o849q465J5344j552j5032J1921M839j2799N812
1051C01K687o658O765n31r050Q358M572j1177P11R362m104n538L922J536p3j537
1067d54l730N291K499p366J330L257k48L99n537K036R510r188n882J2847j111
1082C653r864N011L264m045L599k748n045J1646n29j6311J1628J0605j7770J737
1096e169J1643p767L51K577o792P569M033j3455K952J3543q877q658J0418K800
$$ y = [-5408, -2424, 6558, -4223, -5885, 7395, -589, -8075, 5416, 1630, -6621, 3425, 915, -4937, 4049, 287, -5387, 3378, 2409, -4630, -52, 3602, -835, -2069, 1374, 1189, 47, -675, -327, 2335, 581, -1515, 1392, 671, 637, 2242, -3172, 1158, 6139, -5165, -1828, 8333, -2172, -4281, 5365, 662, -2588, 4414, -777, -3339, 7082, 233, -8232, 7112, 5560, -9472, 2449, 7288, -5511, 301, 2988, -3670, 3095, 2564, -6486, 1872, 6444, -4733, -4022, 5340, 1236, -4302, -380, 1156, 1083, -454, -4184, 1107, 3606, -3760, -2430, 827, 579, 978, -4559, -2523, 6987, -2201, -8083, 4764, 3653, -6211, -1200, 2064, -1981, 1618, -1130, -6175, 5471, 4942, -11369, 259, 10864, -6906, -5169, 6474, -1293, -942, 1635, -5157, 2412, 6445, -7010, -4058, 9485, 608, -8050, 2368, 5168]
1110E168o408j23k36L668L450r875P56J0847n407n758K845L481K745p376m032
1125f255J2190K00j2996M866R173o546l337L337j230M404m02j2176R084J2376
1139A2688j9171k124J8994q902p954Q604k728P97M357j1043K615J3857j0464j0771
1153a1245J5447K891j2988K152O233j628Q72o044qJ1618o561r901J0068L791n605
1168i08k879M93P700p64j1528M610J1367q172p686Q733K283m209O44m109M268
1183a57Q626j3742l937J9602p104j4216J2993K647p468L881l455k2J0377q356
1197c31r679J5657K940j6849M770J1083p665j531J714k167P912l353j1161J1795
1211C135N145j2352J86P274l70k491m380K960P927o358p790R304M207r178K54
$$ y = [5168, -1240, -1363, -1599, 2069, 5519, -4356, -3600, 7247, 1840, -3918, -1073, 2408, 5153, -2223, -6255, 5935, 6135, -6861, -1995, 7178, 632, -2705, 632, -598, 3806, 3404, -8772, 312, 12688, -6483, -8607, 10387, 1485, -6469, 2135, -593, 204, 4561, -6482, -3867, 9990, -474, -11245, 4202, 7093, -5895, -3743, 2490, 862, 1734, -4310, -4318, 7300, 739, -9162, 906, 4697, -908, -3787, -3294, 4406, 3642, -7886, -3276, 8091, -81, -7767, 966, 3249, -960, -316, -4425, -157, 8469, -5273, -9210, 10392, 3288, -10928, 2065, 4712, -2756, 1125, -2330, -2352, 8025, -331, -10010, 5647, 8587, -8262, -3492, 7591, -74, -1605, 109, -2058, 5854, 2501, -8660, 3135, 8280, -4072, -3886, 3388, 3018, 527, -3853, -893, 7034, 676, -7114, 2190, 6397, -2781, -2527]
1226b527M080o58K564n795m002J4247l775j5061J2774O201j3398L304M753m758
1240b051N176k726p593J0925L614j5864M627J3166j1069m447R063k962l45K129
1254A643p775O468O757j2523N27J0342m638m902K705J756J622k589m580O036M106
1269D955q604o62Q246l402k505J745k177N106O89j0745P522Q223j3386J117R226
1284E348n921q82L762n350M182M326j0527J867J1306q800o185J1927k529o255
1298c731O923l796j263P729p384l070J1044n099o404P240O50m234J687m07k54
1313c69L510l625k829O782j643n468M634L39k522L237l979L73O731p718j382Q705
1329D776m969l342O151k754k136M906l966k317P653l768o353R060k95q481P156
$$ y = [-2527, 1553, 895, 3459, -2336, -6338, 7909, 4134, -10927, 1847, 8048, -5350, -2046, 2707, -2051, 3125, 399, -7194, 3731, 7345, -8519, -3892, 9274, -1795, -6242, 2821, -141, -486, 1643, -6132, 336, 7093, -5430, -4903, 5439, 801, -4101, -1396, 360, 1982, -607, -5187, 849, 4955, -3649, -4311, 3935, 533, -1972, -227, -2404, 2702, 3391, -7354, 168, 8391, -4995, -3878, 5348, -573, -1455, 2307, -3043, 1139, 5465, -5062, -3195, 8111, -689, -6874, 5053, 2524, -3731, 3192, -604, -1867, 5862, -1522, -4592, 6452, 1353, -5051, 2189, 2839, -1395, 292, -115, -369, 3141, -484, -3313, 3469, 1826, -3642, 992, 1331, -1191, 2046, -1933, -1560, 5171, -2547, -3929, 4776, -193, -3535, 2616, -138, -2274, 2632, -1334, -3651, 4002, 234, -6119, 2941, 2646, -5835, 1321]
1344A321J161p244O335k66o481P834o32p146O186J738o481L252K413m267J791
1359d86J853l724K299K157m490K267K301m659K591J488m074L728l34l805M915
1374B027m67m683N162q08l993M459M24m922M046J606n566L240K557o233L753L770
1390D372q146L737M504p570K653M730o486J475L817m746J365L458m613K17M786
1405C553m042j799N232k421k345L479k473K27K986m472Q62M258m441J30K975k578
1421h69Q18O66k882K701J677m759J063M560m436j018M329k289j186L759m365L92
1437a839N674o492p09O966m133l017N381k098j333K701k369p56M581k777l504
1452c724N747J68n829L904J475l321K405j163j637M734k983k832N045m80l162
$$ y = [1321, 2482, -4762, 1573, 1307, -5174, 2660, 2028, -5118, 1068, 2806, -3675, -423, 1990, -2277, -486, 1367, -2357, -58, 2099, -2391, -124, 2177, -2482, 109, 1597, -2477, 1251, 917, -2888, 2027, 1560, -3123, 2039, 1231, -2762, 1697, 2121, -2801, 1245, 2851, -2715, 525, 3082, -3151, 602, 4372, -3774, -37, 4467, -3103, -450, 4280, -2206, -731, 3086, -1660, -295, 3163, -1450, -1233, 3553, -489, -2288, 2944, 523, -1822, 1657, -816, -589, 2397, -2075, -1213, 3045, -1396, -1266, 1709, -869, -51, 615, -2267, 434, 2111, -2648, -1585, 2975, -1461, -2479, 1850, -439, -1625, 2134, -2231, -1839, 3835, -2657, -3366, 3600, -533, -3550, 1831, -267, -1600, 1101, -1268, -2024, 2557, -220, -3724, 2023, 2191, -3638, 266, 1741, -1580, 825, -338, -1975, 2759, -224, -3056, 1989, 1509, -1653]
1467a653J854L66m75J027j918k9L662k309l325M315P45m289K774K14k106L240
1483B093k184k346N864j666n603N572N34m157J952J253j941K354j128k946L939
1498A590J204n781K498M010n044N44K465k457J387O13l760L697J069m397J958
1513d04K047k140o42J051j47K59N6k263K283K030m084L79L782l432J04K090k606
1530a637K027N94l853L283J466m607J841K782k732l05J729j676Q19J815l284O88
1546a050L988l999j639N674l313j650L491k019M0K493l373N89L262k936j178L381
1562A761r86j906J689J98r34J589j572q58L440k644j859M262j510j778K606j123
1578C75m85J862k712K16L176k625j737L852q17k492K185K39j935K010j194j777
$$ y = [-1653, 201, 567, 92, 1119, -799, -828, 2834, 525, -2800, 1515, 2260, -2029, 745, 959, -1147, 2093, -91, -2437, 3427, 1761, -3842, 1730, 2264, -1893, 59, 1312, -629, 1725, 597, -2349, 1590, 2794, -2987, -489, 3521, -1523, -979, 1486, -971, 416, 1029, -2731, 966, 2035, -2362, -404, 1643, -497, -1139, -88, -235, 24, 80, -2183, 100, 2130, -1954, -1575, 2207, -1225, -1121, 969, -1637, 390, 984, -2869, 414, 1880, -2727, -886, 1896, -836, -1141, 588, -1088, -269, 1546, -1738, -1050, 2938, -1061, -2700, 2974, -339, -1989, 1502, -517, -477, 2016, -1357, -768, 2494, -442, -1620, 1761, 775, -1131, 558, 756, -178, 1411, -161, -1019, 2421, -223, -2082, 2180, 670, -1108, 1498, 375, -110, 1752, -960, -744, 2432, -193, -1930, 1922, 1105, -1387, 798, 1037, -898, 1112, -82, -1859]
1594a859M404j728l886M712k75l570K787J47j789J783j576n55K843j010l185L181
1610D24J153l678J242J911k100J198j48k280L956p52m347M175R40l663J609R45
1626E85j556J806j258j161L299p89l466K482K377l920M07K296j514Q46l4k909
1642b509M010Q07n690K993L562m121O2K005o92P46p78k022K513J556m616O46M600
1659C072k975j687K789j158N72O00l424L100K464n513J047L941k130j608J196
1674B86l38J184j08l202K116L273m672r64N355k129k504K007q08J128R52m784
1690c208K423M523n235j417M829r34k319N83L80J142O14l734M36N187l211l741
1706c682M614O67l269J365n75P61K378m818J88N754l463l242L449J294j880j51
$$ y = [-1859, 2545, 817, -3069, 1643, 1368, -2202, 585, 732, -1057, 726, -850, -1405, 1438, 428, -2757, 424, 1577, -2101, -859, 1052, -1048, 150, 2, -2278, 1678, 926, -3421, 754, 1694, -1969, -360, 585, -971, 835, -423, -1584, 1715, 926, -2540, -58, 2319, -1601, -1194, 1102, -412, 434, 400, -2509, 1501, 2308, -3382, -389, 3173, -948, -886, 1119, 427, 1173, 395, -1627, 886, 2442, -2174, -1528, 3072, 97, -1590, 1199, 41, 613, 1213, -2211, 889, 3353, -2160, -1113, 2828, 698, -910, 286, -52, 1132, 1024, -2178, -62, 3211, -1461, -2425, 2930, 801, -1703, 304, -504, 624, 1576, -3208, -785, 3738, -1497, -2914, 1915, 981, -1338, -755, -375, 767, 1381, -2353, -1917, 3270, 59, -3682, 932, 1599, -1670, -305, -880, -119, 2259, -2559, -2371, 3383, -80, -3322, 127, 1421, -459, -610]
1722f10m39J170K195l803j697O069j026n418L726J739k566J011j312M12L912l900
1738e37k541N672m88m697K010K160j057k60j109J50L380k107l921M579K182n502
1754b086J170K772j542M00j577n06M302j942m329M373J794l945Q8J701%K09j492
1771f10j216L988l49n606L569L428m712J38K387j364J507j223k739M358M51n092
1787c085K044L552l029j408J973k77O40k3k949K888K143n075P20M446k999j049
1803a488J751j329J946k85l494L086K490m664L11L327j597j083J078n55R48Q02
1819A244l477J607L966m446p83M027j669j554J635j646J347J880m078J035L985
1834C073l273j711L158l37j600J110p18j9K598k814j137M488k267k911L846o57
$$ y = [-610, -1049, 121, 2316, -1487, -3184, 2885, 1859, -3559, 167, 1906, -660, 351, -961, -549, 3363, -537, -3078, 2594, 2106, -2591, -581, 1579, 522, 262, -847, -697, 2683, 576, -3345, 1234, 3416, -2086, -916, 1856, 314, 714, -863, -1369, 2933, 991, -3338, 1035, 2829, -1116, -1028, 673, 673, 882, -610, -1826, 2162, 1813, -3793, -224, 3204, -1508, -1370, 1017, -347, 1160, -63, -2802, 1556, 2007, -3085, -1041, 2511, -518, -1926, 47, -230, 410, 387, -2562, 326, 2469, -2606, -1886, 2560, -439, -1488, 263, -1066, 880, 595, -2899, 187, 2677, -1987, -1676, 1651, 54, -1029, 49, -506, 442, 1244, -2233, -626, 3340, -1106, -1889, 2138, 469, -1085, 550, -1096, 251, 2131, -1947, -912, 3073, -200, -1911, 1247, 910, -690, 420, -298, -317, 2281, -533, -1670, 2818, 551, -2360, 1486, 829]
1850H29j521J903j933N74K234k837o97L550j636k030K227L0j363J245o13j112
1866a150K907j674k464M015q25k791K850o16j416J955j166j035K968j364k404
1881b210L033k11k187J592N72j896J328K94j917K639l80k936K931M38k786J828
1897A32L44j796J626j32j611K077J24k250J422P40j853J054R80k198J441J008
1913A108k357J429J025k788K155O86k786K076O14k513J776P72k285J120J085j945
1929h28P73J311k356J041J879k943M57K507k546L20K195k720J094J206k701J216
1945i5K029k780N12J501j470K01P69j194N07J228j725k40K610k352n61K395j503
1962a68n52J431j682N85J762k602L54K096j450p94J678p95n01J160j362M4J974
$$ y = [829, -692, 1211, -722, -148, 2086, -751, -1448, 2102, 466, -1564, 663, 693, -670, 575, -38, -1150, 1757, 83, -2381, 1634, 809, -1982, 868, 252, -1164, 791, -375, -1410, 1558, 194, -2210, 823, 612, -1575, 17, 589, -1307, 21, 315, -1602, 1037, 657, -2279, 652, 1090, -1696, 132, 476, -1320, 306, 174, -1437, 640, 764, -1486, -64, 676, -1177, -123, 857, -1341, 100, 1108, -1249, 180, 1205, -1583, 572, 1258, -1528, 548, 1162, -1351, 425, 1197, -1088, 32, 1117, -828, -55, 1256, -1100, -59, 1820, -1123, -666, 1841, -705, -385, 1810, -910, 184, 1390, -1311, -95, 1934, -846, -334, 1167, -303, -102, 667, -527, -20, 1208, -517, -757, 1853, -499, -1060, 1335, -168, -720, 711, -971, -386, 1376, -1226, -872, 1224, -226, -1020, 658, -137, -638, 522, -840, -796, 1178]
1979A178j597j370L138j113k325K923p43q98J747j937J52K231j957j091K795n87
1995E46j797J368J51o94O03n90n88K320r77k449L212j13k148J332J57q03J451
2012I81j437l13K587j374j476J813M17j827O25P71q83O98k09j391K527l35l140
2029a966K560J244k791J095M14p56Q47n64r96K122m5k408J227J491j737l18J095
2046E14q14N18L55j680J353J248l248J324J823j767j63M30o58J197m39j598J526
2063g9J376k516L14J549p31o74P77p14L76J053k393J032K289k835q3K540j725
2080d44l92R59m97N65M74j619N83J642j600p51K083p93q98R89o44J24J388k421
2098a252P32J903j807r08K211m49o85R21r94M84N23j305j05J874j073j028J625
$$ y = [1178, -419, -1789, 1349, 236, -2089, 834, 91, -807, 940, -997, -845, 1386, -571, -1662, 1133, 546, -1251, 117, 268, -426, 177, -413, -1001, 1319, 342, -2107, 1105, 992, -1156, 176, 333, -470, 981, -456, -769, 1818, 444, -1032, 781, 1198, -629, -4, 767, -116, 582, 373, -1018, 1509, 1174, -1966, 594, 1838, -953, 142, 556, -200, 647, 83, -913, 1209, 1164, -1244, -17, 1474, -263, -581, 514, -300, 218, 573, -1107, 246, 1494, -1754, -430, 1393, -374, -537, -107, -765, 432, -7, -1605, -79, 1297, -1219, -905, 644, -87, -761, 16, -698, -322, 731, -1662, -630, 1659, -1176, -1259, 1281, -444, -836, 123, -374, 191, 665, -954, -371, 1271, -329, -1080, 1003, 210, -688, 301, -343, -219, 1169, -1252, -520, 1383, -424, -1332, 879, 430, -255, 666, -328, 156, 679, -626, -731, 1143, 70, -958, 667]
2115F67M7j173Q66k76n59J551j430o99K428j034j286J206m6m58L56l23R9O83o98
2134g9q77J768k55j760J499N32j859J255j43r26J722r10j241J962k01j689J541
2151C39k7r75L84J3k95O09k79p05J151M88j752M83J214j408M82M14p67J016l28
2170E7j368J625K77j510Q79R84j086k52P47m57L40n1j171J066J027k239R58J513
2188A339j798J12Q44r76J091j14j612J332Q28j469K9J288p90m49Q54n20K00M44
2206F33j210M42J781j884l94J766j123l22P45o79N91M78j786P10J532j481p64
2223i65J561k83m31J8p1L3Q83j479j64K381j498j167J640j97o68N55q23R27M87
$$ y = [667, 714, -459, 407, 131, -428, 1123, -307, -1006, 1422, 388, -898, 308, 262, -196, 160, -163, -64, 619, -79, -956, 812, 557, -1203, 296, 828, -1031, 224, 81, -845, 877, -33, -1274, 688, 487, -1202, 339, 312, -663, -279, -266, -561, 48, -231, -936, 215, 703, -1049, -566, 648, -760, -278, 136, -631, 385, 57, -1311, 314, 591, -919, -40, 944, -142, -394, 353, -104, 236, 185, -986, 80, 1107, -1132, -174, 1339, -459, -347, 497, -479, 612, 498, -1114, 218, 1046, -423, -394, 894, 104, -345, 509, -11, 189, 633, -577, -135, 1646, -238, -632, 1134, 11, -311, 434, -245, 346, 824, -962, -252, 1280, -201, -965, 596, 313, -118, -100, -171, -138, 745, -734, -898, 1483, -15, -1182, 458, 261, -407, 148, -675, 252, 739]
$$ [...]
8191D14
##END NTUPLES=NMR FID
##END=
