##TITLE=1H_Pr C8
 CDCl3,8 sc, 
 21.9.2021
##JCAMPDX= 6.0         $$ Bruker NMR JCAMP-DX V2.0
##DATA TYPE= NMR FID
##DATA CLASS= NTUPLES
##ORIGIN= UXNMR, Bruker Analytische Messtechnik GmbH
##OWNER= root
$$ XWIN-NMR		Version 3.5
$$ Tue Sep 21 12:09:59 2021 Russian Standard Time (UT+4h)  she@DPX200
##.OBSERVE FREQUENCY= 200.1314
##.OBSERVE NUCLEUS= ^1H
##.DELAY= (6, 6)
##.ACQUISITION MODE= SIMULTANEOUS
##.ACQUISITION SCHEME= undefined
##.AVERAGES= 8
##.DIGITISER RES= 18
##SPECTROMETER/DATA SYSTEM= spect
##.PULSE SEQUENCE= zg30
##.SOLVENT NAME= D2O
##.SHIFT REFERENCE= (INTERNAL, D2O, 0, 15.7039)
##AUDIT TRAIL= $$ (NUMBER, WHEN, WHO, WHERE, WHAT)
$$ ##TITLE= Audit trail, XWIN-NMR		Version 3.5
$$ ##JCAMPDX= 5.01
$$ ##ORIGIN= Bruker BioSpin GmbH
$$ ##OWNER= she
$$ F:/spectra/data/she/nmr/H-F/1/audita.txt
$$ ##AUDIT TRAIL=  $$ (NUMBER, WHEN, WHO, WHERE, WHAT)
(   1,<2021-09-21 12:08:38.25 +0400>,<she>,<DPX200>,
      <created by zg, POWCHK disabled, PULCHK disabled
       configuration hash MD5:
       00 E9 B6 7A A2 85 ED C7 34 08 36 98 17 FE 4E 26
       data hash MD5: 16K
       10 45 0A A0 2D 7F 2E 41 01 2E F3 F8 74 87 BF 04>)
$$ ##END=
$$ 
$$ hash MD5
$$ A6 D8 55 89 00 9D 97 C4 20 13 5A 3C BF 52 8C 55
##$RELAX= 
##$RELAX= 
##$RELAX= 
##$RELAX= 
##$RELAX= 
##$RELAX= 
$$ Bruker specific parameters
$$ --------------------------
##$DU= <F:/spectra>
##$EXPNO= 1
##$NAME= <H-F>
##$PROCNO= 1
##$TYPE= <nmr>
##$USER= <she>
##$AMP= (0..31)
100 100 100 100 100 100 100 100 100 100 100 100 100 100 100 100 100 100 
100 100 100 100 100 100 100 100 100 100 100 100 100 100 
##$AQSEQ= 0
##$AQ_mod= 1
##$AUNM= <au_zg>
##$AUTOPOS= <>
##$BF1= 200.13
##$BF2= 200.13
##$BF3= 200.13
##$BF4= 200.13
##$BF5= 200.13
##$BF6= 200.13
##$BF7= 200.13
##$BF8= 200.13
##$BYTORDA= 1
##$CFDGTYP= 0
##$CFRGTYP= 5
##$CHEMSTR= <none>
##$CNST= (0..31)
1 1 145 1 1 1 1 1 1 1 1 1 1 1 1 1 1 1 1 1 1 1 1 1 1 1 1 1 1 1 1 1 
##$CPDPRG= <>
##$CPDPRG1= <>
##$CPDPRG2= <>
##$CPDPRG3= <>
##$CPDPRG4= <mlev>
##$CPDPRG5= <mlev>
##$CPDPRG6= <mlev>
##$CPDPRG7= <mlev>
##$CPDPRG8= <mlev>
##$CPDPRGB= <>
##$CPDPRGT= <>
##$D= (0..31)
0 1.2 0 0 0 0 0 0 0 0.06 0 0.03 0 0 0 0 0.0002 0 0 0 0 0 0 0 0 0 0 0 0 
0 0 0 
##$DATE= 1632211717
##$DBL= (0..7)
120 120 120 120 120 120 120 120 
##$DBP= (0..7)
150 150 150 150 150 150 150 150 
##$DBP07= 0
##$DBPNAM0= <>
##$DBPNAM1= <>
##$DBPNAM2= <>
##$DBPNAM3= <>
##$DBPNAM4= <>
##$DBPNAM5= <>
##$DBPNAM6= <>
##$DBPNAM7= <>
##$DBPOAL= (0..7)
0.5 0.5 0.5 0.5 0.5 0.5 0.5 0.5 
##$DBPOFFS= (0..7)
0 0 0 0 0 0 0 0 
##$DE= 6
##$DECBNUC= <off>
##$DECIM= 32
##$DECNUC= <off>
##$DECSTAT= 4
##$DIGMOD= 1
##$DIGTYP= 9
##$DL= (0..7)
0 120 120 120 120 120 120 120 
##$DP= (0..7)
150 150 150 150 150 150 150 150 
##$DP07= 0
##$DPNAME0= <>
##$DPNAME1= <>
##$DPNAME2= <>
##$DPNAME3= <>
##$DPNAME4= <>
##$DPNAME5= <>
##$DPNAME6= <>
##$DPNAME7= <>
##$DPOAL= (0..7)
0.5 0.5 0.5 0.5 0.5 0.5 0.5 0.5 
##$DPOFFS= (0..7)
0 0 0 0 0 0 0 0 
##$DQDMODE= 0
##$DR= 18
##$DS= 0
##$DSLIST= <SSSSSSSSSSSSSSS>
##$DSPFIRM= 0
$$ [...]
##$SUBNAM2= <"">
##$SUBNAM3= <"">
##$SUBNAM4= <"">
##$SUBNAM5= <"">
##$SUBNAM6= <"">
##$SUBNAM7= <"">
##$SUBNAM8= <"">
##$SUBNAM9= <"">
##$SW= 20.0188988654967
##$SWIBOX= (0..15)
0 0 2 0 0 0 0 0 0 0 0 0 0 0 0 0 
##$SW_h= 4006.41025641026
##$TD= 16384
##$TD0= 1
##$TE= 0
##$TE2= 300
##$TE3= 300
##$TEG= 300
##$TL= (0..7)
0 120 120 120 120 120 120 120 
##$TP= (0..7)
150 150 150 150 150 150 150 150 
##$TP07= 0
##$TPNAME0= <>
##$TPNAME1= <>
##$TPNAME2= <>
##$TPNAME3= <>
##$TPNAME4= <>
##$TPNAME5= <>
##$TPNAME6= <>
##$TPNAME7= <>
##$TPOAL= (0..7)
0.5 0.5 0.5 0.5 0.5 0.5 0.5 0.5 
##$TPOFFS= (0..7)
0 0 0 0 0 0 0 0 
##$TUNHIN= 0
##$TUNHOUT= 0
##$TUNXOUT= 0
##$USERA1= <user>
##$USERA2= <user>
##$USERA3= <user>
##$USERA4= <user>
##$USERA5= <user>
##$V9= 5
##$VALIST= <valist>
##$VCLIST= <CCCCCCCCCCCCCCC>
##$VD= 0
##$VDLIST= <DDDDDDDDDDDDDDD>
##$VPLIST= <PPPPPPPPPPPPPPP>
##$VTLIST= <TTTTTTTTTTTTTTT>
##$WBST= 1024
##$WBSW= 4
##$XGAIN= (0..3)
0 0 0 0 
##$XL= 0
##$YL= 0
##$YMAX_a= 745744
##$YMIN_a= -812275
##$ZGOPTNS= <>
##$ZL1= 120
##$ZL2= 120
##$ZL3= 120
##$ZL4= 120
##$ABSF1= 10
##$ABSF2= 0
##$ABSG= 5
##$ABSL= 3
##$ALPHA= 0
##$AQORDER= 0
##$ASSFAC= 0
##$ASSFACI= 0
##$ASSFACX= 0
##$ASSWID= 0
##$AUNMP= <proc_1d>
##$AZFE= 0.1
##$AZFW= 0.1
##$BCFW= 1
##$BC_mod= 2
##$BYTORDP= 1
##$COROFFS= 0
##$CY= 11.3945322036743
##$DATMOD= 1
##$DC= 2
##$DFILT= <>
##$DTYPP= 0
##$F1P= 2.36226072786647
##$F2P= -0.459571619588291
##$FCOR= 0.5
##$FTSIZE= 0
##$FT_mod= 4
##$GAMMA= 1
##$GB= 0.15
##$INTBC= 1
##$INTSCL= 1
##$ISEN= 128
##$LB= 0.24
##$LEV0= 0
##$LPBIN= 0
##$MAXI= 10000
##$MC2= 0
##$MEAN= 0
##$ME_mod= 0
##$MI= 1.114404
##$NCOEF= 0
##$NC_proc= 0
##$NLEV= 6
##$NOISF1= 3.799351
##$NOISF2= 2.8
##$NSP= 1
##$NTH_PI= 0
##$NZP= 0
##$OFFSET= 15.70392
##$PC= 1
##$PHC0= -14080.11
##$PHC1= 18.0009
##$PH_mod= 1
##$PKNL= yes
##$PPARMOD= 0
##$PSCAL= 0
##$PSIGN= 0
##$REVERSE= no
##$SF= 200.130013532006
##$SI= 16384
##$SIGF1= 3
##$SIGF2= 2
##$SINO= 400
##$SIOLD= 16384
##$SREGLST= <1H.CDCl3>
##$SSB= 0
##$STSI= 0
##$STSR= 0
##$SW_p= 3612.71676300578
##$SYMM= 0
##$S_DEV= 0
##$TDeff= 0
##$TDoff= 0
##$TI= <>
##$TILT= no
##$TM1= 0
##$TM2= 0
##$TOPLEV= 0
##$USERP1= <user>
##$USERP2= <user>
##$USERP3= <user>
##$USERP4= <user>
##$USERP5= <user>
##$WDW= 1
##$XDIM= 8192
##$YMAX_p= 0
##$YMIN_p= 0
$$ End of Bruker specific parameters
$$ ---------------------------------
##NTUPLES= NMR FID
##VAR_NAME=  TIME,          FID/REAL,        FID/IMAG
##SYMBOL=    X,             R,               I
##VAR_TYPE=  INDEPENDENT,   DEPENDENT,       DEPENDENT
##VAR_FORM=  AFFN,          ASDF,            ASDF
##VAR_DIM=   8192,          8192,            8192
##UNITS=     SECONDS,       ARBITRARY UNITS, ARBITRARY UNITS
##FACTOR=    0.0002496,     1,               1
##FIRST=     0,             0,               0
##LAST=      2.0444736,     0,               0
##MIN=       0,             -812275,         0
##MAX=       2.0444736,     745744,          0
$$ Real data points
##PAGE= N=1
##DATA TABLE= (X++(R..R)), XYDATA
0@%%%%%%%Qj6J6j6K4l3M1n6O8q4J06j30J53j85K30k71L14l70M38n13N96o88P90
$$ 0 0 0 0 0 0 0 0 8 -8 8 -8 16 -17 24 -32 36 -48 58 -72 81 -104 126 -145 169 -201 237 -276 320 -368 422
30D22r07J038j181J338j514J712j927K160k416K699l009L346l716M121m563N046
$$ 422 -485 553 -628 710 -804 908 -1019 1141 -1275 1424 -1585 1761 -1955 2166 -2397 2649
46B649n572O145o773P465q225R059r983J1007j2149J3433j4884J6539j8446K0673
$$ 2649 -2923 3222 -3551 3914 -4311 4748 -5235 5772 -6377 7056 -7828 8711 -9735 10938
60A0938k3314K6503l0444L5463m2105N1355o5209Q8468j37032M05095o67949l90949
$$ 10938 -12376 14127 -16317 19146 -22959 28396 -36813 51655 -85377 319718 -348231 -739180
72g39180J386144l12295r14336N68938N17289q67061J04410Q53966n73145p68628
$$ -739180 646964 334669 -579667 -10729 506560 -360501 -256091 597875 24730 -743898
82g43898R98170M57285j140072j32592J086986k23413p74402M32185L82029n44547
$$ -743898 254272 711557 -428515 -561107 525879 302466 -471936 -39751 342278 -202269
92b02269N1640N15730l97648m32963O56582K77027p62126j13023P29277m6219
$$ -202269 -150629 365101 -32547 -465510 191072 468099 -294027 -407050 322227 276008
102B76008n56210J38698L22105j77684p9565J77287j19096j82243K79341J87562
$$ 276008 -280202 -141504 180601 2917 -76648 100639 -18457 -200700 78641 266203
112B66203l92244j83090M50429J55832m35640j14545L61413O5445k50047j6J23334
$$ 266203 -126041 -309131 141298 297130 -138510 -253055 108358 173803 -76244 -76260 47074
123D7074q9881K2201J90103j83473k58442L36515K62661m33449k01413M44573
$$ 47074 -42807 -20606 169497 -13976 -272418 64097 326758 -106691 -308104 136469
133A36469J00996l68713J3927K29167j27834m4167K21645j65861k61231L61457
$$ 136469 237465 -131248 -117321 111846 -15988 -60155 161490 -4371 -265602 95855
143I5855K20193m85801j08310M92317l0403l79546J45465J83541k11732M4842
$$ 95855 316048 -169753 -278063 214254 183851 -195695 -50230 133311 -78421 -33579
153c3579K21114k65391j72728M36951O3308n13814Q0728M62868k12303k92603
$$ -33579 187535 -77856 -250584 186367 249675 -264139 -183411 279457 67154 -225449
163b25449K77644N3814k56192J82938J62859l67212k8715M67629j17814m68780
$$ -225449 52195 106009 -150183 32755 195614 -171598 -200313 267316 149502 -319278
173c19278K49775L62858l31510j67690L28324o3701k30683K63333P2496l82814
$$ -319278 -69503 293355 -38155 -205845 122479 58778 -171905 91428 163924 -218890
183b18890R5456M12448k31833l59618L17047K42039l39097p6433K88515r8719
$$ -218890 -123434 289014 57181 -302437 14610 256649 -82448 -158881 129634 30915
193C0915j67249K36483R446l01914J36817K95549k32751k39270K69782J56681
$$ 30915 -136334 100149 109595 -192319 -55502 240047 7296 -231974 37808 194489
203A94489k57106n8858K03804m3268j15541J28333P999j74380Q7115J78643j44199
$$ 194489 -62617 -121475 82329 39061 -76480 51853 59852 -114528 -27413 151230 7031
214G031j61185J60648J36498j53896j05309J36831N6914j10121O076O6384o9221
$$ 7031 -154154 6494 142992 -10904 -116213 20618 77532 -32589 -26513 39871 -29350
225b9350j4024J16229l1731j49189O5137J69391r4620j71692J27191J38534j52084
$$ -29350 -43374 72855 41124 -108065 -42928 126463 31843 -139849 -12658 125876 -26208
236b6208o5331J49234l0194j10407J20294M4968j83021K8539K13191r9520k07179
$$ -26208 -91539 57695 27501 -82906 37388 82356 -100665 -72126 141065 41545 -165634
247a65634J64261J57553k07442o3221K09545n4738j55605J59427N9634k19067
$$ -165634 -1373 156180 -51262 -114483 95062 40324 -115281 44146 103780 -115287
257a15287M9955K25479j42431j87022K07579J11995k34985r052K14679j01779
$$ -115287 -65332 160147 17716 -169306 38273 150268 -84717 -93769 120910 19131
267A9131j40151J88528K5767k20329R2097J93457j79649j25131K19637L8210k14352
$$ 19131 -121020 67508 93275 -127054 -34957 158500 -21149 -146280 73357 111567 -102785
278a02785N0043J68460j28444q6729J77791j8602j79796J16729J31973j78121
$$ -102785 -52742 115718 -12726 -99455 78336 59734 -120062 -3333 128640 -49481
288d9481n6567J88118j9075j57826P7026J02527j14498l5543J30298l7697j17480
$$ -49481 -106048 82070 62995 -94831 -17805 84722 -29776 -65319 64979 27282 -90198
299i0198J00981P4878j34928j7210J30429l2780r6699O1406N3994p1090j5043
$$ -90198 10783 85661 -49267 -66477 63952 31172 -65527 -4121 49873 -21217 -36260
310c6260P2998k0523o6733N3333M8810p4794j9853P6590o342o1077K1639M2653
$$ -36260 36738 16215 -50518 2815 51625 -23169 -43022 33568 27226 -33851 -12212 30441
322C0441k7620k9197L5619J8188m8937J274N9006k8125n3836N1345L5727o2269
$$ 30441 2821 -26376 9243 27431 -21506 -20232 38774 10649 -43187 8158 43885 -18384
334a8384j3437O3045q019o0598L3457N1092o3583k6530Q7368j5132q9699N9299
$$ -18384 -31821 31224 23205 -37393 -3936 47156 -16427 -42957 44411 29279 -60420 -1121
346a121O4611q8457k3624R4154j9364q2646N7253N8026r0391j9519J09337l2077
$$ -1121 63490 -24967 -48591 45563 26199 -56447 806 58832 -31559 -51078 58259 26182
358B6182j03150Q3029O5405j13598q486J11188m6856q1478Q5703L7746j05515
$$ 26182 -76968 6061 71466 -42132 -50618 60570 13714 -67764 17939 55685 -49830
369d9830J0273J07509n9238q7127J00762M2377j18457J6805J03324o8732n9767
$$ -49830 -39557 67952 8714 -78413 22349 64726 -53731 -36926 66398 -2334 -62101
380f2101R6861O764r7944M0157Q1401p4408n2435R6493J2703r9344L3254P7088
$$ -62101 34760 41524 -56420 -16263 65138 -9270 -61705 34788 47491 -51853 -18599 58489
392E8489o9551l3498Q3483j5239p1498N1103M6483o8662k0009P2924m791o7672
$$ 58489 -11062 -44560 38923 23684 -47814 3289 49772 -18890 -38899 34025 29234 -38438
404c8438K9077N0228m9160j9936N4805j4675m2845L8143K1637m5974n433M4340
$$ -38438 -9361 40867 -8293 -28229 26576 11901 -30944 7199 28836 -17138 -22571 21769
416B1769l955m1713J0969L7278k1092k5969K8200O951k6909J1203J7586k1039
$$ 21769 17814 -23899 -12930 24348 3256 -22713 5487 12438 -14471 -3268 14318 -6721
428f721j0737K5712R032l2511p331M1741j856m4652J7062L4622k8280j5000L0751
$$ -6721 -17458 8254 17286 -15225 -22556 19185 17329 -27323 -10261 24361 -3919 -18919 11832
441A1832n858k5861K3145K0766l8832j3128N4354j077o2196K3773N2804m2908
$$ 11832 5974 -19887 3258 24024 -14808 -27936 26418 25341 -36855 -13082 39722 -3186
453c186k6191M8086n242l8427L2323K1626n0591k915O2545j7151o5855L9713N3035
$$ -3186 -29377 18709 13467 -24960 7363 28989 -21602 -24517 38028 20877 -44978 -5265 47770
466D7770n6824k3682N7724j3163l8508M1159R685n5841J7856N8475l9390n3355
$$ 47770 -9054 -32736 24988 11825 -26683 14476 24161 -31680 -13824 44651 5261 -48094
478d8094N4122L8839o2014j3156N4507j7871k9680M0991o291m7894L6831M2228
$$ -48094 6028 44867 -17147 -30303 24204 6333 -23347 17644 11353 -36541 290 42518
490D2518n4820l1998O0488J9700n7593m125M4702j4632j9169K8748j3909l0913
$$ 42518 -12302 -44300 16188 35888 -21705 -25830 18872 4240 -14929 13819 -90 -31003
502c1003M2973K2739n7393j2477N7700O758m9455k477L6311l363j7149J1153q640
$$ -31003 11970 34709 -22684 -35161 22539 29297 -20158 -22635 13676 10313 -6836 4317 -4323
515d323j3191L4235R283m9177l631N1226L730m5015q358L7409J0146k6272n549
$$ -4323 -17514 16721 26004 -23173 -26804 24422 28152 -16863 -25221 12188 22334 -3938 -9487
528i487Q470j543J5223M694l5919n052M6743P677m9374j3877M8055J7665m3538
$$ -9487 -1017 -2560 12663 17357 -18562 -23614 23129 30806 -18568 -32445 15610 33275 -10263
541a0263j3815L0328K355n454O307k3642r908M6253J0551n8536j3313O2217J4901
$$ -10263 -24078 6250 8605 3151 9458 -14184 -24092 22161 32712 -25824 -39137 23080 37981
554C7981n9513j0682M6589j80k0352J0095j4627j2584M6332Q792o5667m456P1412
$$ 37981 -21532 -32214 14375 14195 -6157 3938 -10689 -23273 23059 31851 -33816 -38272 33140
567C3140K968o6793r72N2895l833k7011R077q456p628M3094m66o4832R422P0782
$$ 33140 36108 -30685 -31657 21238 17405 -9606 -529 -8985 -16613 26481 26015 -38817 -29395 41387
581D1387j1284o4582Q083N0714m182k8518J463j293M438L2499j4156n4559K3272
$$ 41387 30103 -34479 -26396 24318 20136 -8382 -6919 -8212 -3774 28725 14569 -39990 -16718
594a6718O1480k4077n5985J4802M4939k217k9912q939R297J6944J5831k5708l7191
$$ -16718 44762 20685 -35300 -20498 24441 22224 -7688 -16627 -7330 9614 25445 -263 -37454
607c7454L2441M7352l2138m6265J9851L9983j881l2796j3385K0532K2601j836
$$ -37454 -5013 42339 10201 -36064 -16213 23770 21889 -10907 -24292 -3760 18841 17005
619A7005k9770j8792L4572L4134l4796l9985K5310L9213q435l5826q433K9110
$$ 17005 -12765 -31557 3015 37149 2353 -37632 -12322 26891 18456 -17370 -25803 3307
631C307J9939j5190k6323n443L1811K5181l4640l7396L2089M0579k0077l8167
$$ 3307 23246 8056 -18267 -23710 8101 33282 -1358 -38754 -6665 33914 13837 -24330
643b4330L721L3174R934k1341j9075J940K7734K0190l6039l5950M0671M1296l5179
$$ -24330 -20609 12565 22499 1158 -17917 -15977 11757 31947 -4092 -40042 629 41925 6746
656F746l8639K0711L2315l778k1970j1067N249K4473J4981l7870l1357M7831L7297
$$ 6746 -31893 -11182 21133 17355 -4615 -15682 -10433 14040 29021 -8849 -40206 7625 44922
669D4922m7955l4938L6035K7727j6505j9386l651P280K1231P976l7197k2782M9996
$$ 44922 -3033 -37971 -1936 25791 9286 -10100 -13751 -6471 14760 22736 -14461 -37243 12753
682A2753K9653n4298k7913M5217K1269k5114j5898K333J0071J6849J1l3065j1511
$$ 12753 42406 -11892 -39805 5412 26681 1567 -14331 -11998 -1927 14922 14933 -18132 -29643
695b9643M6040J9484n2498k0362M7059J7737l0658j4179Q704J2915J0901q963
$$ -29643 16397 35881 -16617 -36979 10080 27817 -2841 -17020 -8316 4599 15500 6537
707F537k5458L93L7456R516m5334j4687M5275J5552l4193j5234J6240J6106K197
$$ 6537 -18921 -18528 18928 28444 -16890 -31577 13698 29250 -4943 -20177 -3937 12169 14366
720A4366j5227j6293R252K7133R64l6215r871M1013J3502l6727j4945K4357J5470
$$ 14366 -861 -17154 -7902 19231 20195 -16020 -25891 15122 28624 -8103 -23048 1309 16779
733A6779p979j6189o346J2699J7218m160k7769n736L6146J0839l8208j1548K9958
$$ 16779 8800 -7389 -13735 -1036 16182 12022 -15747 -21483 14663 25502 -12706 -24254 5704
746E704J1801j6136j1879O09J1449J1170o603k2234m57L1595N927l7438o172L3433
$$ 5704 17505 1369 -10510 -9901 1548 12718 6115 -16119 -16576 15019 20946 -16492 -22664 10769
760A0769N414k0961n949N287Q455Q107q557j8290M794K7732p65l3624O8L2630
$$ 10769 16183 -4778 -10727 -5440 3015 11122 2565 -15725 -10931 16801 16036 -17588 -17520 15110
774A5110r18k2453K3P746M721N915r277j5482R983K2696p711k7437N660K8590
$$ 15110 14192 -8261 -8238 -492 4229 10144 867 -14615 -4632 18064 10353 -17084 -11424 17166
788A7166n343k2223M118R323J440L303q541j1758J2378J6504j1927j9927Q571
$$ 17166 11823 -10400 -6282 3041 4481 7784 -757 -12515 -137 16367 4440 -15487 -6916
801f916K2179p308j9380N772J0506j352k09n901p554J1358J1214j2399j3802R617
$$ -6916 15263 7955 -11425 -5653 4853 3501 3292 -2609 -10163 1195 12409 10 -13792 -4175
815d175J6110p000j6718O267J1642l779l331j847l888Q088P492j0517r187Q908
$$ -4175 11935 4935 -11783 -5516 6126 2347 -984 -2831 -6719 1369 8861 -1656 -10843 -1935
829a935J1959o787j3649O020J2530o341n619K771r80L026O076p895p548Q519R423
$$ -1935 10024 3237 -10412 -4392 8138 1797 -3822 -1051 -2031 995 7071 -824 -8372 147 9570
844I570p610j1101P271J1212p827o819O687l71j772O130m568p499P834P729q084
$$ 9570 1960 -9141 -1870 9342 1515 -5304 1383 1012 -760 5370 802 -6697 1137 8866 782
859G82q599P858Q810q940n472Q382r08m698O535k410p965P141O974r124n288Q001
$$ 782 -7817 41 8851 -89 -5561 2821 1913 -2785 3750 1340 -6625 516 7490 -1634 -6922 1079
875A079M908q103l173Q321j957n731O800l98q343O679N604q749k779Q089O22o137
$$ 1079 5987 -2116 -5289 3032 1075 -4656 2144 1746 -6597 82 5686 -3063 -5842 2247 2869 -3268
891c268M8N960k673m233N668R29p490M624N549p395j595P149j415m469J898L676
$$ -3268 -3220 2740 67 -4166 1502 2431 -5059 -435 5114 -2281 -3876 3273 1858 -2611 -713 2963
907B963k376l355M893J203o713K774N984o152k066O318j983k960K266J875k776
$$ 2963 587 -2768 2125 3328 -3385 -611 5373 -779 -2845 3473 1490 -1470 796 2671 -105
922a05j430L909Q89n779N59O669l883m238N498o32l382K470J053k811p65L354
$$ -105 -1535 2374 3263 -2516 -1957 4712 829 -3409 2089 1457 -1925 545 1598 -1213 -1978 1376
938A376J140n151q85P275k667n922N047J500m308K202J500l316J15L742J7n132
$$ 1376 2516 -2635 -3520 3755 1088 -4834 213 1713 -2595 -393 1107 -2209 -2094 1648 1665 -3467
954c467l30P451j736p577N497L357n535J570K654l534j80M260j092m850J250O890
$$ -3467 -3797 3654 1918 -5659 -162 3195 -2340 -770 1884 -1650 -1830 2430 1338 -3512 -2262 4628
970D628k768p106N439M139n641M53L773l993J22N071k994m480L403M971l565n937
$$ 4628 1860 -5246 193 4332 -1309 -856 2917 -1076 -954 4117 1123 -3357 46 5017 1452 -4485
986d485N498L910o246r3M004l525m8M602l263l855M390L175m344l633M567L396
$$ -4485 1013 4923 -1323 -1416 2588 -937 -985 3617 354 -3501 889 4064 -280 -3913 654 4050
1002D050n759q06M443k050j753L943k728k989M757J216m397j588M301K563n424
$$ 4050 -1709 -2515 1928 -122 -1875 2068 -660 -3649 1108 2324 -2073 -3661 640 3203 -2221
1017b221j586N331n91l138K748r00k711M463M92m387j52M252J058m440j470N238
$$ -2221 -3807 1524 933 -2205 543 -357 -3068 1395 1887 -2500 -2652 1600 2658 -1782 -3252 1986
1033A986L04m708K349J500k540K346R10m023Q25L938n68m319k44N483L3o011K022
$$ 1986 2290 -2418 -69 1431 -1109 1237 2147 -1876 -1051 2887 2319 -2000 -2244 3239 3272 -2739 -717
1050g17L396k805O87J188l278J043L839j969m051J241N065q21o270J914N065l550
$$ -717 2679 -126 561 1749 -1529 -486 3353 1384 -2667 -1426 3639 2818 -3452 -1538 3527 -23
1066b3j305J673j897J023L653l216l669K871M351k572n722K909N386l724k815
$$ -23 -1328 345 -1552 -529 3124 -92 -3761 -890 3461 889 -4833 -1924 3462 -262 -3077
1081c077K853n09K90K579l636k907N058L125m836l942M204N092l902m237L558
$$ -3077 -224 -733 -443 2136 -1500 -4407 651 3776 -1060 -5002 -798 4294 392 -3845 -287
1096b87J297n67J311l239k083O083J804o269j761N223L363m221m448L557L326
$$ -287 1010 443 1754 -1485 -3568 2515 4319 -1950 -3711 1512 4875 654 -3794 -237 3089
1111C089j805n30k278k17N867j83p018k13N876K106m900l939L982M263k873k632
$$ 3089 1284 754 -1524 -1741 4126 3943 -3075 -3288 2588 4694 -206 -4145 -163 4100 1227 -1405
1127a405k95J006M282j288o878J253O919J41o145k515N063M213m376l938J963
$$ -1405 -1700 -694 3588 2300 -4578 -3325 3594 3735 -2410 -4925 138 4351 -25 -3963 -2000
1142b000K305K774k356o234K363P633j659o913o70O222L049n658m005L922L342
$$ -2000 305 3079 723 -5511 -3148 4485 2826 -4087 -4757 1465 4514 -1144 -5149 -1227 2115
1157B115N83k678n325L289P959l537p762J907P143J164o522k936M982L545j811
$$ 2115 2698 20 -5305 -2016 5943 2406 -5356 -3449 3694 4858 -1664 -4600 382 3927 2116
1172B116k942l459L916P280m591q558M344P883j772o980j418O017K690l517l012
$$ 2116 -826 -4285 -369 6911 2320 -6238 -1894 5989 4217 -2763 -4181 1836 4526 1009 -2003
1187b003j100M018N390n404q006N716Q094l927p329P71O316J945n013l137J354
$$ -2003 -3103 915 6305 901 -7105 -1389 6705 2778 -4551 -3780 2536 4481 -532 -3669 -2315
1202b315M300K885o090n906O767P206o055p145K952O821N37n990k937M239L995
$$ -2315 1985 4870 -1220 -7126 -359 6847 792 -6353 -3401 3420 3957 -2033 -4970 -731 3264
1217C264l82n381l928P152O051o934o295M669O395j024o297j790N483L157k233
$$ 3264 2882 -2499 -6427 725 6776 -158 -6453 -1784 4611 3587 -2710 -4500 983 4140 1907
1232A907m908j182O555M514p997n559O708N798l142o108l11O162K365m461l968
$$ 1907 -3001 -4183 2372 6886 -1111 -6670 38 5836 2694 -3414 -3725 2437 4802 341 -3627
1247c627J178N972J980p377m199P497N041n373n554J789N967J112n619k980L089
$$ -3627 -2449 3523 5503 -1874 -6073 1424 6465 1092 -4462 -2673 3294 4406 -1213 -4193 -1104
1262a104M847L00p236k728Q433L559p385m437L983N382j037n199k129M572L769
$$ -1104 3743 4043 -3193 -5921 2512 6071 -1314 -5751 -1768 3614 2577 -2622 -4751 -179 3590
1277C590j450o423q93Q250K202q254k542N558L789k140m688p66N061K425k772
$$ 3590 2140 -4283 -5176 3074 5276 -2978 -5520 38 3827 1687 -3001 -3767 1294 3719 947
1292I47m842P88P056P53p963j148O464K225l750l313M72M770J482l890l828K235
$$ 947 -3895 -3107 3949 4702 -3261 -4409 2055 4280 530 -2783 -2311 2459 3941 51 -3777 -1542
1308a542N776m36p252l91P010J272n280j971J948L573N32m465k220L590L938j886
$$ -1542 4234 3798 -3454 -3845 3165 4437 -843 -2814 -866 2707 3239 -1226 -3446 144 4082 2196
1324B196n924K63P075J39o070p72K709K714k40m450q73L853K592k714m740J301
$$ 2196 -3728 -3465 3610 3749 -2321 -3093 -384 2330 2090 -2360 -3233 620 3212 498 -4242 -2941
1340b941O274r80n821M65L735J314j483l118j11L751J526l301l078K185N149j611
$$ -2941 3333 2353 -3468 -3003 732 2046 563 -2555 -2666 1085 2611 -690 -3768 -1583 3566 1955
1356A955n579J564M448j67k066j842M44L379L92l436j653K484L474j667m950K020
$$ 1955 -3624 -2060 2388 2221 155 -1687 -1243 2136 2528 -908 -2561 -77 3397 1730 -3220 -1200
1372a200M452j427k672k21R28K044N9k887j131K863K206k349l681K240M010j986
$$ -1200 3252 1825 -847 -1068 -140 1904 1963 -924 -2055 808 3014 665 -3016 -776 3234 1248
1388A248l035J033Q81R57j18k769M6K954O51k480j897J799L227k386k914K307
$$ 1248 -1787 -754 127 1084 966 -1803 -1757 1197 1848 -632 -2529 -730 2497 111 -2803 -496
1404d96R87n0k66j538q6K274M13k356j148J918K420k127k129K189R35j083o2m35
$$ -496 491 441 175 -1363 -1449 825 1238 -1118 -2266 -348 2072 -55 -2184 5 940 -143 -205 -640
1422f40m0J773Kk173%J925Q89k020j515K466J207k076L18L66r16J545j52j580
$$ -640 -680 1093 1095 -1078 -1078 847 1736 -284 -1799 667 1874 -202 116 482 -434 1111 959 -621
1440f21M17J301L42j482q42J520J111j942Q7O68o00O08J74j227J9J603q77p36
$$ -621 -204 1097 1439 -43 -885 635 1746 -196 -109 559 -41 567 741 -486 -467 1136 259 -477
1458d77l58J183O02k119N26J154q25k12R73r43n13J300k47r39L68N19J89j236
$$ -477 -835 348 950 -1169 -643 511 -314 -526 447 -496 -1009 291 44 -895 -527 -8 181 -1055
1476a055M38J423j151n58J304o03o05Q32J15o48J49P35k01n51K12J479j520n34
$$ -1055 -617 806 -345 -903 401 -202 -807 25 140 -508 -359 376 175 -376 -164 1315 -205 -739
1494g39J768o58j111J400J95j005L90L24o39J21M98M85j035o97J705j52j697J085
$$ -739 1029 371 -740 660 855 -150 240 564 -75 46 544 1029 -6 -703 1002 850 -847 238
1512B38P67j083J51L58o49J39N51j10q12l98J682n8k023P66J327j272L06L88q06
$$ 238 1005 -78 73 431 -218 -79 472 362 -450 -848 834 776 -1247 -481 846 -426 -120 268 -538
1531e38M06M25n58n40J37J176m33j499R86J098p67q09P37j74M63M11r24k44M96
$$ -538 -132 293 -265 -805 -668 508 75 -1424 -438 660 -107 -916 -179 -353 110 521 -403 -647 -151
1550a51Q88n08j457O88J923j357j040J309j35n1K85n37l21R33M49j011k74M11
$$ -151 737 229 -1228 -540 1383 26 -1014 295 160 109 394 -143 -464 469 918 -93 -367 44
1568D4J482j166j082J266M26q97K62k58l44J138j89q11l14Q54Q22j265j087J774
$$ 44 1526 360 -722 544 970 73 335 77 -267 871 682 -129 -443 411 1233 -32 -1119 655
1586F55P2j198K38K33l61Q49J84j509L91O49N23j507p67J510R15j855J11Q67k36
$$ 655 727 -471 -233 0 -361 488 672 -837 -446 203 726 -781 -1548 -38 877 -978 -867 0 -236
1605b36M97p1j143O90O10k39q40l7J100M01j461j84J420m67L1J55o97M56R14o72
$$ -236 261 190 -953 -263 347 108 -732 -769 331 732 -729 -913 507 40 71 226 -471 -15 899 227
1625B27o54K91R94p8j357k0J585k97o66M48j74r6O48r52l47Q84N36m30j387L50
$$ 227 -427 -136 858 780 -577 -597 988 691 25 473 299 203 851 -101 -448 436 972 542 -845 -495
1645d95J825j094r55J179M0m89N01m77o86J158J79r95o44Q44J004j232r60J351
$$ -495 1330 236 -719 460 500 11 512 35 -651 507 686 -309 -953 -109 895 -337 -1297 54
1663E4M55j137K30N5m15J152j50j377J38J192P92j356j245J837Q04j343l16M70
$$ 54 509 -628 -398 -343 -758 394 244 -1133 -995 197 989 -367 -1612 225 1029 -314 -630 -160
1681a60L5Q83n3j780M00J175L41j298o78J725Q66j684m14J006K81M9k73j227R38
$$ -160 -125 758 705 -1075 -675 500 841 -457 -1135 590 1456 -228 -642 364 645 694 421 -806 132
1700A32J363n51j442m75K022N24k211k26J680J64p34l66l63N04J327j230j325
$$ 132 1495 944 -498 -973 1049 1573 -638 -864 816 980 246 -120 -483 21 1348 118 -1207
1717a207M43J980j57k186n42K407K73j567m03N1J336P68j509j547J341J753q53
$$ -1207 -764 1216 1059 -1127 -1669 738 1011 -556 -959 -908 428 1196 -313 -1860 -519 1234 381
1734C81k106R7K522O17k546n06J048Q81M94j708r77K373R74j576j817Q30K165
$$ 381 -1725 -1628 894 1511 -1035 -1541 -493 388 882 -826 -1803 570 1544 -32 -1849 -1019 1146
1751A146O85k472p26J738J073p33j417o69K584P76k372j212J565J849j80k706
$$ 1146 1831 -641 -1367 371 1444 711 -706 -1375 1209 1985 -387 -1599 -34 1815 1635 -1071
1767a071J7K167L21j036j225K7K197N25k811q37K155J260j233j965K04K899l89
$$ -1071 -1054 1113 1434 398 -827 -800 1397 1922 -889 -1726 429 1689 456 -1509 -1305 1594 1205
1784A205j617r09M91K024L88l352m22K936Q65j860k091J294K485n38k308j36J093
$$ 1205 -412 -1321 -830 1194 1582 -1770 -2192 744 1609 -251 -2342 -1048 1437 899 -1409 -1545 -452
1801d52J780k56k939m5L283N41k864j017J731K257j155k726P71J683J056p66k514
$$ -452 1328 1072 -1867 -1912 1371 1912 -952 -1969 -238 2019 864 -1862 -1091 592 1648 882 -1632
1818a632J10L498k22l114l95K259J836j771k173P20K498J9j401j633N88K994k97
$$ -1632 -1522 1976 1754 -1360 -1755 504 2340 569 -1604 -884 1614 1633 232 -1401 -813 2181 1884
1835A884l583O0K770J001k043j972J267K330k59k374o57J240K268p94l244L64
$$ 1884 -1699 -1639 1131 2132 89 -1883 -616 1714 1455 -919 -1576 -336 1932 1138 -2106 -1742
1851a742L284J87k503j192J459K370j183k340L5J873J420j274k696P64L378o78
$$ -1742 1542 1729 -774 -1966 -507 1863 680 -1660 -1625 248 1668 394 -2302 -1538 1840 1162
1867A162k812l80K410J282j653j990J040J754L09j459j826J261L192r28l042M58
$$ 1162 -1650 -2030 380 1662 9 -1981 -941 813 1122 -337 -2163 -902 2290 1362 -1680 -1222
1883a222K180P61j281k302J293K237j37j863j037J269K510j269l099J279K542
$$ -1222 958 1719 438 -1864 -571 1666 1529 -334 -1371 -102 2408 1139 -1960 -681 1861
1898A861m13j420j662J674J920o98k241j90J412J904j711k515J388K420o42k081
$$ 1861 1448 28 -1634 40 1960 1262 -979 -1169 243 2147 436 -2079 -691 1729 1087 -994
1914i94m20J501J287j316j628M01J701J044j641k168J702K248j611j469L89J237
$$ -994 -1414 87 1374 58 -1570 -1169 532 1576 -65 -2233 -531 1717 106 -1363 -974 263
1930B63P02p75j929R16J731k37j026j502J911J511j322j762J085J291M0j089q99
$$ 263 965 190 -1739 -823 908 671 -355 -1857 54 1565 243 -1519 -434 857 897 -192 -1091
1947a091J050J234o09j043n59J217J624j825j420J798Q11n89p06q25J170J235
$$ -1091 -41 1193 584 -459 -1018 199 1823 -2 -1422 376 1187 598 -108 -933 237 1472
1963A472j107r48J42J040R05j563j260J711P79j081m84k22P42R71j043q10N55
$$ 1472 365 -583 -441 599 1504 -59 -1319 392 1171 90 -394 -616 126 1097 54 -756 -201
1980b01M45N14q67j139J449N00j082m22M98N04K58o78o02O06L53j74n59p00J515
$$ -201 244 758 -109 -1248 201 701 -381 -803 -305 199 457 -221 -823 -217 136 -38 -597 -1297 218
1999B18L57j046m01R81o5k67J11m89N58M33l88k92K4Q33J37j343J59J190k48n75
$$ 218 575 -471 -872 109 44 -223 -112 -601 -43 390 2 -290 -266 567 704 -639 -480 710 462 -113
2019a13L28l76O51Kl37l10L81K60k1n85K8J186q73l73N61j65l07M57m29MK48j01
$$ -113 215 -161 490 492 155 -155 226 486 465 -120 -92 1094 221 -152 409 244 -63 394 -35 -31 217 116
2041A16O5n02R7R83p23q21P93K09n71R0k6J3L88l77n6j21j9J010p99o91J035L13
$$ 116 181 -321 -224 759 36 -785 8 217 -354 -264 -290 -277 111 -266 -322 -443 -462 548 -251 -942 93 406
2063D06r97L60K27k29M84m10j06N49q2Ql17k95P17L40j222K29Q06o36K09K26n92
$$ 406 -591 -231 -4 -233 251 -159 -265 284 202 210 -107 -402 315 655 -567 -338 468 -168 41 267 -325
2084c25P01J58o10L85j99L55K52j312L57J157k84j063L60p6N49J18q63J03L44
$$ -325 376 534 -76 309 110 465 717 -595 -238 919 635 -428 -68 -144 405 523 -340 -237 107
2103A07K23N1r13P3J073l75q68M01N63m28M55p70l8P26j41l11m30K36J158r88
$$ 107 330 381 -532 -459 614 239 -629 -228 335 -93 362 -408 -446 280 139 -172 -602 -366 792 -196
2123a96o14K12J053o80l6j05l27J051l79k77j49O01M84m34j012O86O72n08k49
$$ -196 -810 -598 455 -225 -261 -366 -693 358 -21 -298 -447 154 638 204 -808 -122 550 42 -207
2142b07L4p3Q99l43o32L3Q04K59m82j135J033R33p45n57N25k43K33J76j036M35
$$ -207 -173 -246 653 310 -322 -289 515 774 292 -843 190 1123 378 -179 346 103 336 512 -524 -89
2162h9O26Pn20p23O64R44p70o90N73L29k77j05p73P54N94m18l55l46N36O23r57
$$ -89 537 544 24 -699 -35 909 139 -551 22 351 74 -31 -804 -50 544 126 -229 -575 -39 584 -373
2183c73n81J059L36p89J68r0M5N15n57n93N68K70L56o97m90J092o5m94J38P6j65
$$ -373 -954 105 441 -348 -180 -270 -225 290 -267 -860 -292 -22 334 -363 -853 239 174 -320 -182 -106 -271
2204b71Q53q80l9N28k0O0l29l39Q11J49r39K50O05j81j41J8l06N29K12o43k33
$$ -271 582 -298 -337 191 171 231 -98 -437 374 523 -416 -166 439 258 117 135 -171 358 570 -73 -306
2225c06L55O23n6j165O30M13n26K9J3n7L60j05p89M55R2J18R9n79L0R78o34m71
$$ -306 49 672 616 -549 81 494 -32 -3 10 -47 313 208 -581 -126 -34 84 183 -396 -366 612 -22 -493
2247d93L45J9J08J80j017M95O82j81l67k19O40L01o53r04J144K02m28J19m91L19
$$ -493 -148 -129 -21 159 -858 -363 319 138 -229 -448 192 493 -160 -1064 80 282 -146 -27 -518 -199
2267a99P55m03n95J95N26N45j192l77J189L00p26M7p8L52O26o53q87P41N90n5
$$ -199 556 153 -442 -247 279 824 -368 -745 444 744 18 65 -13 339 965 312 -575 166 756 701
2287G01j082k92J395L87j519n6M10O46J56r26o81J218L00n61o57OP89M76j313
$$ 701 -381 -673 722 1109 -410 -466 -56 590 746 -180 -861 357 657 96 -561 -555 234 710 -603
2306f03j91Q92J86r3n49o97J326L62q14m97K34R70J65j557J73R51R0m30m80m9
$$ -603 -794 98 284 191 -358 -1055 271 633 -181 -678 -444 526 691 -866 -693 258 348 -82 -562 -611
2326f11Q74Q42j820j5R57O43l56j405J3J628J08j416j36M12R00J47j392k56J442
$$ -611 263 1105 -715 -730 227 870 514 -891 -878 750 858 -558 -694 -282 618 765 -627 -883 559
2345E59L94q11j000J92J894j96j672l8J051M51k57j359p6J856j13j166m51M70
$$ 559 953 142 -858 -666 1228 1032 -640 -678 373 824 567 -792 -868 988 875 -291 -742 -272
2363b72J544j55k228L73J369o7k29j293J68J718q0j775j16R31J093o12j661O53
$$ -272 1272 1117 -1111 -738 631 564 335 -958 -790 928 848 -927 -1043 -112 981 369 -1292 -639
2381f39J439q4r19j095R18J575o12j873o9J494Q59q26j334N74J594k48j459r9
$$ -639 800 716 -203 -1298 -380 1195 583 -1290 -1359 135 994 168 -1166 -592 1002 754 -705 -804
2399h04O90Q31j07j857L63K118k94j042j028Q76J526m66j539K52Q45M17l50j416
$$ -804 -114 717 610 -1247 -884 1234 940 -102 -1130 -254 1272 806 -733 -481 364 781 431 -985
2417i85M03J908m13j316n42J187J041p39j717O70J442J0r09j114O38J823o10j850
$$ -985 -582 1326 913 -403 -945 242 1283 544 -1173 -503 939 949 40 -1074 -436 1387 777 -1073
2435a073K34J451J42p83j352O61J808m22j250k55K45J795r38j538N43J389J95
$$ -1073 -839 612 754 -29 -1381 -720 1088 666 -584 -839 -594 1201 263 -1275 -732 657 852
2452H52j134j083J007J520j002r84L11M68J217p93j530N82J392n8j466l33J155
$$ 852 -282 -1365 -358 1162 160 -824 -513 -45 1172 379 -1151 -569 823 765 -701 -1034 121
2469A21R78q33j266P66R13J05m21j498Q41J623q09j075J73P31Q75j101j002R89
$$ 121 1099 266 -1000 -234 679 784 363 -1135 -294 1329 520 -555 -382 349 1224 123 -879 110
2487A10O26N3q35q61Q51J212j047j079O26P46K65p93r55R24Q78o79m85m01O76
$$ 110 736 789 -46 -907 -56 1156 109 -970 -344 402 667 -126 -1081 -157 721 42 -443 -844 -168
2506a68J078j030j011Q33P10j01p60m10P95Q97r85o63M46L75P19p72r65J015P82
$$ -168 910 -120 -1131 -298 412 311 -449 -859 -64 833 -152 -815 -369 6 725 -47 -1012 3 785
2525G85q18k34m68P22N14m65o31O63M18J85n08j013Q69R50r70m73L09M60M52n01
$$ 785 -33 -267 -735 -13 501 36 -595 68 486 671 163 -850 19 969 -1 -474 -165 295 747 246
2545B46q73Q50K25j75l26o33R45P01p15n11M24k5L00l25q00R75J91n18l36K01
$$ 246 -627 223 448 273 -53 -686 259 960 245 -266 158 133 433 108 -692 283 474 -44 -380 -179
2565a79J34O13o56k02N79j3n20j24O7L88J71m08j41L68j38J81l99m64J132l58
$$ -179 -45 568 -88 -290 289 276 -244 -368 -301 87 258 -150 -291 77 -61 120 -279 -743 389 31
2585C1m29J90m8M43K36q10L37J91j4p3j57l7N48j44o61N80Mj85K7j29M05K40m10
$$ 31 -398 -208 -256 187 423 -387 -50 141 127 54 -103 -140 408 264 -397 183 187 2 29 -100 305 545 135
2608A35j96N8k3K98j83k93L57N88q46J61J78m31M62o8n51N89%k55J39l78J1Q99
$$ 135 -61 -3 -26 272 89 -204 153 741 -105 56 234 -197 265 197 -354 235 235 -20 119 -259 -248 651
2630F51p12m50M47mn5J8m55N17J93k89J14q1K16L13p69j79P13n6n68K56k71M85
$$ 651 -61 -511 -64 -68 -123 -105 -560 -43 150 -139 -25 -106 110 423 -346 -525 188 132 -436 -180 -451 34
2652C4j16L8P5Q6QR0k53o96J085j02l17P0K05l45N14m56p8M12L7K8n58J52N01
$$ 34 -82 -44 31 117 125 215 -38 -734 351 249 -68 2 207 -138 376 -80 -158 254 291 319 -239 -87 414
2675D14l38n44L39M55kj79k13q6N24q4l92R1J60K69q3j075O81N64p48M4J73j24
$$ 414 76 -468 -129 326 324 145 -68 -154 370 286 -106 -15 145 414 331 -744 -63 501 -247 -203 -30 -154
2697a54L03m3m77O2K24J36o9o88L39Q67m44k33r1j41R05m58m54J65M96k27P7o05
$$ -154 149 106 -371 -309 -85 51 -18 -706 -367 500 56 -177 -268 -409 496 38 -416 -251 245 18 95 -510
2719e10M3Q19j80o46M02K8M46j56l97J38M47k75k43j07J11P26n00q24Q20N19m87
$$ -510 -467 352 172 -474 -72 -44 402 246 -151 -13 434 159 -84 -191 -80 646 146 -678 142 661 174
2740A74N4l89K60L30l57l55L72l42P06k65n96N25L23m52j16L0N3L05l24m16M59
$$ 174 228 -161 99 429 72 -283 89 -253 453 188 -408 117 440 -12 -128 -98 -45 260 -64 -480 -21
2761b1Q9N2k47l68O67R0l81l10L65Q7J18j14m31L65J69k62J78k70j93P75n64K2
$$ -21 68 120 -127 -495 172 262 -119 -429 -64 23 141 27 -404 -39 130 -132 46 -224 -417 358 -206 -184
2783a84K37k29K13J19n51K97N64o56R9j31K57K98m06l25P15j78m33M83k61K60
$$ -184 53 -176 37 156 -395 -98 466 -190 -91 -222 35 333 -73 -398 317 139 -294 189 -72 188
2803A88N1k20j15L00J61j89l56O3L96N1o23K89J28j55N52m04o8J68m30K63k3j71
$$ 188 239 19 -96 204 365 176 -180 -117 279 330 -293 -4 124 -31 521 117 49 217 -213 50 27 -144
2825a44J35K38n39L51K66m19M5l18k0O01j41m11K10j30L4K34l37K33N47m26j82
$$ -144 -9 229 -310 41 307 -112 -67 -385 -405 196 55 -356 -146 -276 -242 -8 -345 -112 435 9 -173
2846a73j2j83L10J76n91M19K45j80m92K38Q5L16j67m93P10j71p8J33k89M78J1
$$ -173 -185 -368 -58 118 -473 -54 191 11 -481 -243 -158 158 -9 -502 208 37 -41 92 -197 281 292
2867B92l28J47j58J56L95n42n99R70p6m16L42k38L10K64m71n64O36k96M90n49
$$ 292 -36 111 -47 109 504 -38 -637 333 257 -159 183 -55 255 519 48 -516 120 -176 314 -235
2887b35j60M51K63o63K99Q5N7L48n13m17M60N89o10k02k1N64k79j16m15M52J02
$$ -235 -395 56 319 -344 -45 40 97 445 -68 -485 -25 564 -46 -248 -269 295 16 -100 -515 -63 39
2908C9L4m33l64Q60K32l75q2k85P80K12r18o0O33j93J56n50J08M79K31m82n52
$$ 39 73 -360 -724 136 368 -7 -89 -374 406 618 -300 -360 273 80 236 -314 -206 273 504 22 -530
2929e30P22N1L64r96J02P99q8o48K04J21L01J60p12j65N85J12j98l55O2O90j19
$$ -530 192 243 607 -389 -287 512 424 -224 -20 101 402 562 -150 -315 270 382 184 -171 -109 581 462
2950D62q26j0K26L58K0n47l07J007j73k68l61K62O10l21p14K93K85K59N5p05J99
$$ 462 -364 -374 -148 210 230 -317 -624 383 210 -58 -419 -157 453 132 -582 -289 -4 255 310 -395 -196
2971a96P67j78r15J04L72L89L48j196K77K07L36l79k73p2P34K45j020J81O3N95
$$ -196 571 393 -522 -418 -46 343 691 -505 -228 -21 315 -64 -337 -409 325 570 -450 -269 -206 389
2991C89j70r83N84P89j32n43P7L2K26J00j021M04N16P7j48j03m38R89m06o96M21
$$ 389 219 -764 -180 609 477 -66 11 43 269 369 -652 -248 268 345 197 94 -344 645 239 -457 -36
3012c6n7N72l56o83L09M45O7o62k7K31N16O6r89J38N98J82k6o49K10N64l3p17
$$ -36 -93 479 123 -560 -251 194 261 -401 -428 -197 319 385 -604 -466 132 314 288 -361 -151 413 380 -337
3034c37p3M44M75m91m70L18M52k53L5m69K31O90l51n72J42M27M7j80m69K44P26
$$ -337 -410 34 509 18 -452 -134 318 65 100 -369 -138 552 201 -371 -229 198 245 65 -404 -160 566
3055E66l58k81L9jL22o0j083Q41M66l02K6l17l2P28l50k28L2m2M07l97l46J15
$$ 566 208 -73 -34 -35 287 227 -856 -15 451 149 175 -142 -174 554 204 -24 8 -34 373 -24 -370 -255
3077b55R35m63m64m2J65K58N7m96L05m5m2qk0n9P02p06j97L56j62M50k54m52K94
$$ -255 680 217 -247 -289 -124 134 191 -305 0 -45 -87 -95 -115 -174 528 -178 -375 -19 -181 269 15 -437 -143
3100a43L27l28M01n02ON78j66m74N86l12L28m9k40j76M67n53K60k29J04M70j46
$$ -143 184 -144 257 -245 -239 339 173 -301 285 -27 301 252 12 -164 303 -250 10 -219 -115 355 209
3121B09q15O21K67l12J95m15J25M76k32k23L30k73Q7m7k24K78P1j51k71L26j05
$$ 209 -606 15 282 -30 165 -250 -125 351 119 -104 226 -47 40 -7 -231 47 118 -33 -304 22 -83
3142h3K04Q7j96J31M4k27J78k69k7O46p84R9J02j66N12j11j52R2l8j37m4o7J78
$$ -83 121 208 12 143 187 -40 138 -131 -158 488 -296 -197 -95 -261 251 140 -12 80 42 -95 -139 -206 -28
3165b8L39n70J99K29ml11J04Q8j35M77n50R8j83J65N0K2o8J97k37O6J4n7M37j37
$$ -28 311 -259 -60 169 165 -146 -42 46 -89 388 -162 -64 -247 -82 -32 -10 -78 119 -118 -52 -38 -95 342 205
3189B05k33J72J34l90J28k25J27L44k73k20K56J99j20Q5j96l50N17j96k8k9r6
$$ 205 -28 144 278 -112 16 -209 -82 262 -11 -231 25 224 104 189 -7 -357 160 -36 -64 -93 -189
3210a89K08J21l50L87kl89M2j5O4L50k72o1M94o78K70J83k15JK10m98K31J51j16
$$ -189 19 140 -210 177 175 -214 -172 -187 -123 227 -45 -106 388 -290 -20 163 -52 -51 159 -339 -108 43 -73
3233g3PJ45m02L89lj53M0k3J11q7N2k91O41l53j11K05j75K49pk32J96k24K54j29
$$ -73 -66 79 -323 66 63 -90 -50 -73 38 -49 3 -288 353 0 -111 94 -81 168 161 -71 125 -99 155 26
3257B6Q8p1M5M7q7J15Pj2L5j86J37j09j46K90j54l40M75K1n21K65M25m21M10n46
$$ 26 114 43 88 135 48 163 170 158 193 7 144 35 -111 179 25 -315 160 181 -340 -75 350 -71 339 -207
3281b07j56O81m61q2r3o9P09j39p87L70M46j79j51L23m82M41k02j10k5L19j49
$$ -207 -363 318 -143 -225 -318 -387 322 183 -604 -234 212 33 -118 205 -277 164 -38 -148 -173 146 -3
3302cQ1m96K37K96k22p5l1Q2J4K25k95P0J84P9j68N9q5J64lQ%J72j6K42p25J72
$$ -3 78 -418 -181 115 -107 -182 -213 -131 -117 108 -187 -117 67 146 -22 37 -48 116 113 121 121 293 277 519 -206 -34
3328c4J62j33j7k76K04L12j33k74O8P3J54q9j72M45k59l1j49o5K55J81k47l22
$$ -34 128 -5 -22 -298 -94 218 85 -189 -121 -48 106 17 -155 290 31 0 -149 -214 41 222 -25 -347
3350c47L74J84l76J34j2R7N7j42m0Q0k4k6j04Q2J45J91n72J42N7L56q4l63J54
$$ -347 27 211 -165 -31 -43 54 111 -31 -71 9 -15 -41 -145 -63 82 273 -299 -157 -100 256 172 -191 -37
3373c7K07K4l97K95J49j58M69p09L00j64j12K98m02J6K80r5J19k31p0L62Kj59
$$ -37 170 194 -203 92 241 83 552 -157 143 -21 -133 165 -237 -221 59 -36 83 -148 -218 144 146 -13
3395a3j19K87j98K79r9l71M26O3l46K65L0q8k18L02m94L42q6n2J73r7J25Ql35
$$ -13 -132 155 -43 236 137 -234 192 255 -91 174 204 116 -102 200 -294 48 -38 -90 83 -14 111 119 -216
3418b16J85L46m49N3j6k68O04k4m65J65k2j4k1K38m0J22k41l77P10l40J43N6k63
$$ -216 -31 315 -134 -81 -97 -365 239 215 -250 -85 -107 -121 -142 96 56 178 -63 -440 270 -70 73 129 -134
3441a34M07R0m79J56j33J55M6Ro27P43j87j2M8q4K52J12m07J93K3N2j75q8l92
$$ -134 273 363 -116 40 -93 62 108 117 -510 233 46 34 82 -2 250 362 -45 148 171 223 48 -40 -432
3464d32M69N4k36J69k7n5L32j51k45L04j65Ok81m4M36r3j38k07M49m5k62P1j45
$$ -432 37 91 -145 24 -3 -58 274 123 -122 182 17 23 -258 -302 134 41 -97 -304 145 100 -162 -91 -236
3487b36Q6J15k37j64K02J42K09Q7l76K28Kj19m4k92N91Q8n11J07oL03j74j26K08
$$ -236 -150 -35 -272 -436 -234 -92 117 204 -172 56 58 -61 -105 -397 194 282 -229 -122 -128 175 1 -125 83
3510H3R8j30j13oQ1K27j30j08p4K36r5j81J57j53K90J62m38J05j28L08o4k29k38
$$ 83 181 51 -62 -68 13 240 110 2 -72 164 69 -112 45 -108 182 344 -94 11 -117 191 127 -102 -340
3533c40M22N2l49K6o1Q6K29k09J23j04J74j70J09k09L41J30m68O8nj35L35j91
$$ -340 82 134 -215 -189 -250 -164 65 -144 -21 -125 49 -121 -12 -221 120 250 -218 -150 -155 -290 45 -146
3555a46k99M92j53j62J88r0K50L3k47k12N87p9k67j89R1N58j91j32J87n4L5k10
$$ -146 -445 47 -106 -268 -80 -170 80 113 -134 -346 241 162 -105 -294 -203 355 164 32 219 165 200 -10
3577a0j67M37r7n3j34Pj41L33n4j50J02p9J45P0o82M81K05j62o8j6K75l48K83
$$ -10 -177 260 163 110 -24 -17 -158 175 121 -29 73 -6 139 209 -473 8 213 51 -17 -33 242 -106 177
3600A77k81j19L52J02j63k89K04J31q2J04j88k2J90m7j23k44L09l58L04ok42O06
$$ 177 -104 -223 129 231 68 -221 -17 114 32 136 -52 -74 116 69 -54 -298 11 -347 -43 -49 -291 315
3622C15j10l55l8J82j06L33j71j13L22k14m7k96L08Oj40o4k5M01O0j70k34J05
$$ 315 205 -150 -188 -6 -112 221 50 -63 259 45 -2 -298 10 16 -124 -188 -213 188 248 78 -156 -51
3644e1K12j07k14K7K55M6j22j3k6O1J8j09K15l98L85l8l13K34J13lp8k08k33M69
$$ -51 161 54 -160 -133 122 168 46 33 7 68 86 -23 192 -206 179 141 -172 62 175 172 94 -114 -347 122
3668A22k78j0J86j80J29N5p2K86l32L0J07j53K90R7n04J51L32l80P3j89J45KJ84
$$ 122 -156 -166 20 -160 -31 24 -48 238 -94 -64 43 -110 180 277 -227 -76 256 -124 -51 -240 -95 -93 91
3691I1j39N5M2K4J84k31L4j31J36m8Q1q3j35L51j38J14l10J96j22J88k87L41j79
$$ 91 -48 7 49 73 257 26 60 -71 65 17 98 15 -120 231 93 207 -103 93 -29 159 -128 213 34
3714C4q1J98j65R9j50J61mJ04m34L16ml37N69q5l49M2M4j76L52k22r0K46n1J8
$$ 34 -47 151 -14 85 -65 96 92 196 -238 78 74 -263 306 221 -128 -86 -42 -218 134 -88 -178 68 17 35
3738C5Mp6j38J81J01R1Lq2j36R2J2l4j62J88k6k24J91J49k57K38P4l02k3L8q4
$$ 35 39 -37 -175 6 107 198 201 119 -17 75 87 53 -109 79 53 -171 20 169 -88 150 224 -78 -101 -63 -147
3763a47N5K89j39o6L49n4j47l24J39M57l92K99m20k3J02K39l16O2N5J82j44jj48
$$ -147 -92 197 58 -8 341 287 140 -184 -45 412 20 319 -101 -124 -22 217 -99 -37 18 200 56 55 -93
3786i3K58k47J28j4j70K60k01k00K54O2J20k71pJ52j36m6P1R7j94K03n7JK7k47
$$ -93 165 -82 46 32 -138 122 -79 -279 -25 37 157 -114 -121 31 -105 -151 -80 17 -177 26 -31 -30 -3 -250
3810b50J18J09K1L17l06j85K88l10J54J10k56J40l6L66o9o78L96L24j92k23L24
$$ -250 -132 -23 -2 315 9 -176 112 -198 -44 66 -190 -50 -86 280 211 -467 -71 253 61 -162 162
3831A62J0j76K46l93K10j48K76j62j8j03J12n8J54l11K29K22q5k38J12j31O7N18
$$ 162 172 -4 242 -151 59 -89 187 25 7 -96 16 -42 112 -199 30 252 167 -71 41 -90 -23 495
3853D95m05m16L72j80n0J56k38K56j43J73j4N5j67J7L96k68k61K96j98J42O7l62
$$ 495 90 -326 46 -134 -184 -28 -266 -10 -153 20 6 61 -106 -89 307 39 -222 74 -124 18 85 -277
3875b77L19J3R5l7k91M2Q5K04o7k91K75K4p5j46L8J93J4k1k6R2j49k38J18L43
$$ -277 42 55 150 113 -178 -136 -51 153 86 -205 70 94 19 -127 -89 104 118 97 71 163 14 -224 -106 237
3899B37k24M7m4J44j95k7K6L4O2jJ41k19j51M38k12J83l9k45j56K74M8N3l0j56
$$ 237 13 60 16 160 -35 -62 -36 -2 60 59 200 -19 -170 268 56 239 200 -45 -201 73 121 174 144 -12
3923a2J68j29l36M58l44K30j17k93N4K23j04p5M48l03J35j85J86R4q2o3J32ok76
$$ -12 156 27 -309 149 -195 35 -82 -375 -321 -98 -202 -277 171 -132 3 -182 4 98 16 -47 85 79 -197
3946a97J51n0K45l01p2K63J57j40m4Nj35o0K74O4O2l9m99M80P7m50J83K8k09J33
$$ -197 -46 -96 149 -152 -224 39 196 56 12 17 -118 -178 96 160 222 183 -316 164 241 -209 -26 2 -207 -74
3970g4P1KL00k28j27q0J65j08J6P3j00J82K15M3n38M8J41nK69k63P2J8J40k86
$$ -74 -3 -1 299 71 -56 -136 29 -79 -63 10 -90 92 307 350 -188 -140 1 -4 265 2 74 92 232 -54
3994e4K9J03k72J57o7N5PJ84l76J64L6k12J69m6J06K33k61P8k32R2K88j90o8m2
$$ -54 -25 78 -194 -37 -104 -49 -42 142 -234 -70 -34 -246 -77 -123 -17 216 -45 33 -199 -107 181 -9 -77 -119
4018a19K15l37J94k69K22K79L0k99K06Pm7j71J20p3K12k24J06n1q1jJ0k03K91
$$ -119 96 -241 -47 -316 -94 185 215 -84 122 129 82 -89 31 -42 170 -54 52 1 -80 -81 -71 -274 17
4041A7j13j36L08j56O4p6M6K17l44L34j83j0O4R3n3j08P6Nr3K07r6k14K64O5k74
$$ 17 -96 -232 76 -80 -16 -92 -46 171 -173 161 -22 -32 32 125 72 -36 40 45 -48 159 63 -151 113 178 -96
4066i6L69k54k51K4O6Q0K30p2k45K72ll86M26k86J41J8j38J61l51L81j81K69k23
$$ -96 273 19 -232 -208 -142 -62 168 96 -149 123 120 -266 160 -126 15 33 -105 56 -295 86 -95 174 -49
4089d9L00l92J77M4m74L97%J67P5j34k39L10k0k64j19M5J79J29j29N0Q4L1m11
$$ -49 251 -141 36 80 -394 3 3 170 245 111 -128 182 162 -102 -221 -176 3 132 3 53 137 168 -243
4112b43j1L67n3j43J26k76k3k0L50l01L69j89Mp0j26J36J16j4l43N12j1j02j95
$$ -243 -254 113 60 -83 43 -233 -256 -276 74 -227 142 -47 -43 -113 -239 -103 13 -1 -344 168 157 55 -140
4135a40%J38j0J60l07L5J70l69K10l1J15N0J81n1L3Q2J0m78J53J93J4q3k42J41
$$ -140 -140 -2 -12 148 -159 -124 46 -323 -113 -144 -29 21 202 151 184 266 276 -202 -49 144 158 75 -167 -26
4159b6q5lL21j95J30k35Q9Q9q8o7L60j87o4L8k51L81k59O2j68K5N8K4K42k28R7
$$ -26 -111 -114 207 12 142 -93 -4 85 -3 -70 290 103 39 77 -174 207 -52 10 -158 -133 -75 -51 191 -37 60
4184F0N4R2m47J01N8P9k6J34k1J1j67M8J94k23p1P3K28j69M5n27N92j81K00k48
$$ 60 114 206 -241 -140 -82 -3 -29 105 84 95 -72 -24 170 -53 -124 -51 177 8 53 -474 118 -63 137 -111
4208a11K52j31p4J50q0J57j97K25p3l3k26J91J96l13m2J93N2k30N7J55o3K50K4
$$ -111 141 10 -64 86 6 163 -34 191 118 85 -141 50 246 -67 -109 84 136 -94 -37 118 55 305 329
4231C29l17N3J2J67l67K74j02J07K1j56j40l9K52k18O5K21r7j6l6j06kK54j47
$$ 329 12 65 77 244 -123 151 49 156 177 21 -119 -158 94 -124 -59 162 65 49 13 -93 -95 159 12
4254A2n4N1j65J54n8L7l3o3p4J39L27k37k49K44l0r1NK11l66M8L18k07O4PR6K00
$$ 12 -42 9 -156 -2 -60 -23 -56 -119 -193 -54 273 36 -213 31 1 -90 -85 126 -240 -192 126 -81 -17 -10 86 286
4280B86k55n9L59l14Mj79K75Kl5m34L96O3m7o7rK24j35j94K20k31K75j92J43j11
$$ 286 31 -28 331 17 21 -158 117 119 84 -350 46 109 62 -5 -14 210 75 -119 101 -130 145 -47 96 -15
4304a5j78J72k17L58m6J66j99J62k81p0J8k2K8P6J16P4k73J36j49J55j63K00j97
$$ -15 -193 -21 -238 120 74 240 41 203 -78 -148 -130 -152 -124 -48 68 142 -131 5 -144 11 -152 48 -149
4327a49M75l37k15J93j42K21O1r9m44N33o3j32L09m1l8j15L9j4j85K17k34M11
$$ -149 326 -11 -226 -33 -175 46 107 8 -436 97 34 -98 211 170 132 17 56 42 -143 74 -160 251
4349B51l04o6K10J05j47k29K05K3j63q5J95r3J07P5m2J16n5j54L8Q2j2j0K0L2
$$ 251 -53 -119 91 196 49 -180 25 48 -115 -200 -5 -98 9 84 42 158 103 -51 -13 69 57 47 67 99
4373I9j90l3l9R1j5O8Nj17L09l04J61j90o8L43k8K9r1j85o2L12r7N4Pj29L83k82
$$ 99 -91 -124 -163 -72 -87 -19 -14 -131 178 -126 35 -155 -223 120 92 121 30 -155 -217 95 -2 52 59 -70 313 31
4399C1O5j88J93k80K21k8j77K73j55P4j74K41j0k83K45j28K05K22o08L31JN1N6
$$ 31 96 -92 101 -179 42 14 -163 110 -45 29 -145 96 86 -197 48 -80 125 347 -261 70 71 122 178
4422A78l02J93l01L47j25j20J93k66M32n04J94k51N24j38k04N4l3L62k36j05q
$$ 178 -124 69 -232 115 -10 -130 63 -203 229 -275 -81 -332 192 54 -150 -96 -129 233 -3 -108 -116
4443a16J89j33l5n5JK6J38o6j27n3m4P6O3K88k01j62J33J51j32R5j33l9K5M0j88
$$ -116 73 -60 -95 -150 -149 -123 15 -51 -178 -231 -275 -199 -136 152 -49 -211 -78 73 -59 36 -97 -136 -111 -71 -259
4468b59K91J45j66L4m8m1L87k70J1k90J64J3K77l88N5j81L58Q9n9j72L49j27p7
$$ -259 32 177 11 45 -3 -44 343 73 84 -206 -42 -29 248 -140 -85 -266 92 181 122 -50 299 172 95
4491I5nj23K00j48j44N3R0j23J07k31L68J41l0l0n75J28J32J02k48r9J15K14j1
$$ 95 90 -33 167 19 -125 -72 18 -105 2 -229 139 280 250 220 -355 -227 -95 7 -241 -340 -225 -11 -22
4514b2j66K77m7j15L8k1j15J86J10J08j16O7n34L03m2j6o6L36L2l02N6j15p2K77
$$ -22 -188 89 42 -73 -35 -56 -171 15 125 233 117 184 -350 -47 -89 -105 -171 165 197 -105 -49 -164 -236 41
4538D1j2K7L2k39L85l22J60j31p8J72o6K47p2j31r4J02Q8j13J43k61o5J73M8j46
$$ 41 29 56 88 -151 234 -88 72 -59 -137 35 -31 216 144 13 -81 21 109 -4 139 -122 -187 -14 34 -112
4562a12M79l09J12l9j32K71l05m18N28l37K25J94j88L3J69K4j40P8k81J60J45
$$ -112 367 58 170 131 -1 270 -35 -453 75 -262 -37 157 -31 2 171 195 55 133 -148 12 157
4583A57l61L58r5l89J12L19j25l1K9j55K29p5o1P4L7r0J99k52L16m99K30J06o4
$$ 157 -204 154 59 -330 -218 101 -24 -55 -26 -181 48 -27 -88 -14 23 -67 132 -120 196 -303 -73 33 -31
4606c1r0Q7q7K60m6J7J49j20j63j39L09k51K03K53m00n4L17j55R4j38J2R7M6m08
$$ -31 -121 -34 -121 139 93 110 259 139 -24 -163 146 -105 98 351 -49 -103 214 59 153 15 27 124 170 -238
4630b38K69J60m5J61m66K87l6l89P30m73L06n93L06o4o9j89K27R2R9j40q3J76
$$ -238 31 191 146 307 -159 128 92 -297 433 -40 266 -327 -21 -85 -154 -343 -116 -24 75 -65 -148 28
4652B8j93J76j92M3j23J24n4J88J42K39k94q5K17m05K51j49l0K9K5L56l28l1J65
$$ 28 -165 11 -181 -138 -261 -137 -191 -3 139 378 84 -1 216 -189 62 -87 -117 -88 -63 293 -35 -66 99
4675I9k2Q1mj62M2N9P9m7j41n9K49j41J90j27j55K46j96J45k37L1J88m2l6q4r
$$ 99 77 158 154 -8 34 93 172 125 -16 -75 174 33 223 96 -59 187 -9 136 -101 -70 118 76 40 -44 -53
4700e3M5%l4N9j10o4K02j10l0N5j41K74k47J31j32K7K6Q6j02K11j7J6k00j27K63
$$ -53 -8 -8 -42 17 -93 -157 45 -65 -95 -40 -181 93 -154 -23 -155 -128 -102 -16 -118 93 76 92 -108 -235 28
4725B8j08Q2n5K23L8k67l11K76PP7J21q5j31K76P2k25k36k47O91j11q8m4O1M6
$$ 28 -80 2 -53 170 208 -59 -370 -94 -87 -10 111 26 -105 171 243 18 -218 -465 226 115 27 -17 44 90
4749I0L9ML1j23k55L64k4j80m5M2Q4o9K78k2m33K81j31J62m9k02J23p5M4J58J53
$$ 90 129 133 164 41 -214 150 126 -54 -99 -57 27 -42 236 214 -219 62 -69 93 44 -158 -35 -110 -66 92 245
4774B45j2l71K45l34M1j6J47L9J2j11l9L00l0k69O9J32j41K9m3j65M02J82Nk74
$$ 245 233 -138 107 -227 -186 -202 -55 -16 -4 -115 -154 146 116 -153 -84 48 -93 -64 -107 -272 130 312 317 43
4798D3N8J7j88K43k98K87j30m4j67JR2qK39j41K38j07j86R4k20M86k27r3k36K81
$$ 43 101 118 -70 173 -125 162 32 -12 -179 -178 -86 -94 145 4 242 135 -51 43 -177 309 82 -11 -247 34
4822C4k03n9K20l9L18m07J74j58J33q3J64j93J20Lj33J71m0n5R0j6k96L96k81
$$ 34 -169 -228 -8 -47 271 -136 38 -120 13 -70 94 -99 21 24 -109 62 22 -33 57 41 -255 141 -140
4845a40L54n28J37R3R6K39l30L20j21k62K12k20L43j11q5%K1K08p6j99j36J69
$$ -140 214 -314 -177 -84 12 251 -79 241 120 -142 70 -150 193 82 -3 -3 18 226 150 -49 -185 -16
4867a6J35k72n8N35n49L18q5J11l6P2j15J51l42P4j95N50j66j00O9L9j05N1k8
$$ -16 119 -153 -211 324 -225 93 8 119 83 155 40 191 -151 -77 -272 278 112 12 81 120 15 66 38
4890C8l10J68N22j23l35L2l1L37k25J40o2j19q8R3j51N1n5rO6J12Q3o9l82N75
$$ 38 -272 -104 418 295 -40 -8 -39 298 73 213 151 32 -56 37 -114 -63 -118 -127 -61 51 134 65 -317 258
4914B58r4j72j40J52L9Q5j33k35L24l46K49m0N1k01K53J25q7j36K68j46j72k24
$$ 258 164 -8 -148 4 43 128 -5 -240 84 -262 -13 -53 -2 -203 50 175 88 -48 220 74 -98 -322
4936c22K39J29j96J54L05LN3n27r0J55K20o4k08k8J64M6n0Rj13L34q0k81JK2M3
$$ -322 -83 46 -150 4 309 312 365 -162 -252 -97 123 59 -149 -177 -13 33 -17 -8 -121 213 133 -148 -147 -125 -82
4961h2K43j23o1j5J66k71J76j5J53j07k64J56rJ07j55j2J54j15K2J81j98j12J61
$$ -82 161 38 -23 -38 128 -143 33 18 171 64 -200 -44 -53 54 -101 -113 41 -74 -52 129 -69 -181 -20
4984b0k1J05j11N5l71K51J47j48K46m7j98R2o2K91j52o2P9k61J94k06L13j42R9
$$ -20 -41 64 -47 8 -363 -112 35 -113 133 86 -112 -20 -82 209 57 -5 74 -187 7 -199 114 -28 71
5007G1j29J36j74NK48j47K28n6n7l1j52K21m06L50j68j0R6j43N2K63k00k59L57
$$ 71 -58 78 -96 -91 157 10 238 182 125 94 -58 163 -243 107 -61 -71 25 -118 -66 197 -3 -262 95
5030I5o8k9K81k88J53j51K6m1k91L11j31K05J17m28K55N2Jmj0MJ75k03m2N4Mj41
$$ 95 27 -2 279 -9 144 -7 19 -22 -313 -2 -133 72 189 -239 16 68 69 65 55 59 234 31 -11 43 47 -94
5056i4Q2j09J84j03M3n7m8J39J34k93K07j94r6J54J09P6k53K48m5K37k44J23j92
$$ -94 -12 -121 63 -40 3 -54 -102 37 171 -122 85 -109 -205 -51 58 134 -119 129 84 321 77 200 8
5079HJ56j55p7Q3l0K06r0k8M6k08J24prn9O2p9M5O3j31j57M52m46L31m0p5K1K8
$$ 8 164 9 -68 15 -15 191 101 73 119 -89 35 28 19 -40 22 -57 -12 51 -80 -237 215 -231 100 60 -15 6 34
5106C4j9k47K92n1O4j40k2j97K82r7J89k36J65j92k8p6L64j46RN5J63k03o5M19
$$ 34 15 -232 60 9 73 -67 -89 -286 -4 -101 88 -148 17 -175 -203 -279 85 -61 -52 3 166 -37 -102 317
5130C17l84L7M1K10j61r1L8KM8k62J67O5p2R5j69L66j74k5P5o8j0rK54l26K84
$$ 317 -67 -30 11 221 60 -31 7 9 57 -205 -38 27 -45 50 -119 247 73 48 123 55 45 36 290 -36 248
5155B48l38O9p6%o1M7LR8o7K51k55J48J13p6Qj14M1n3q0J32rQ1J0m71L35J3o6
$$ 248 -90 -21 -97 -97 -158 -111 -108 -10 -77 174 -81 67 180 104 112 -2 39 -14 -94 38 29 110 120 -351 -16 -3 -69
5182f9r6K07Jj8L8j08n7J40m7J20M3j06l1J51k50M10k80k18K05J3j88j12K49k8
$$ -69 -165 42 43 25 63 -45 -102 38 -9 111 154 48 17 168 -82 328 48 -170 35 48 -140 -252 -3 -31
5206c1k9r5L5Q4J43j29r0L72n36M52j16j82J29k9K12l83J69qP2j5k9MJ64L2k15
$$ -31 -60 -155 -120 -36 107 -22 -112 260 -276 176 60 -122 7 -22 190 -193 -24 -32 40 25 -4 0 164 196 -19
5231a9m5O8J51J0k02J08L55l99j6J39j36Q3j47p2J68m5r9j75K89q8P3m6j07J94
$$ -19 -64 4 155 165 -37 71 426 27 11 150 14 97 -50 -122 46 1 -98 -273 16 -72 1 -45 -152 42
5255D2p3r4M27o14M03%k38M8L2K86k37J89k81O1L48j51k9r1j11QJ29m8l1o6J71
$$ 42 -31 -125 302 -312 91 91 -147 -99 -67 219 -18 171 -110 -49 299 148 119 28 -83 -75 54 6 -25 -91 80
5280H0j20RJ86l47J17k9Q1l3J36l90J56K74j0K23l06k5J07N9k91L7l0K31q8j51
$$ 80 -40 -31 155 -192 -75 -104 -23 -56 80 -310 -154 120 110 333 27 2 109 168 -123 -86 -116 115 27 -124
5304a24J1K97q4k43K41m10L85l0J43mj37j0P0Rq8L4k61M08j86j86J52j65J0J73
$$ -124 -113 184 100 -143 98 -312 73 43 186 182 45 35 105 114 26 60 -201 207 21 -165 -13 -178 -168 5
5328Ej31L75j34l27L66j66j4J17K7j0k2K47n00J10J83J69m5j06p7k19L23j3m35
$$ 5 -126 249 115 -212 154 -12 -26 91 118 108 86 333 -167 -57 126 295 250 144 67 -152 171 158 -277
5351b77M95k84J77l96L67QJ40k50j15J18j6K78l24n4J01J23OJ42m13L20k15Q6
$$ -277 218 -66 111 -285 82 90 230 -20 -135 -17 -33 245 -79 -133 -32 91 97 239 -174 146 -69 17
5373A7j51r5K61M6J21l51k25L5L58j63l4L84j76k50JK18j33j18L00k2J7m3j08
$$ 17 -134 -229 32 78 199 -152 -377 -342 16 -147 -181 203 27 -223 -222 -4 -137 -255 45 23 40 -3 -111
5396a11J44J5N6J35k05l02K89K98k86j36K09j49RJ05O5j56Q7j58J32m1K23j57
$$ -111 33 48 104 239 34 -268 21 319 33 -103 106 -43 -34 71 136 -20 67 -91 41 0 223 66
5418F6k69L21o1J21l28J38p3J94J5k1m3j87Q4Q5j4j90rM9K86k96J31m7k09N3J2
$$ 66 -203 118 57 178 -150 -12 -85 109 124 103 60 -127 -43 42 28 -162 -171 -122 164 -132 -1 -48 -257 -204 -192
5443a92J90k9J68j02o1O2MM7k45K64j34K12k71K20j48L5q9K9K2J71J7j81O8QJ2
$$ -192 -2 -31 137 35 -26 36 40 87 -158 106 -28 184 -87 133 -15 20 -69 -40 -18 153 170 -11 57 65 77
5468G7j00j46J68lO8k59J08J60j25j26K16LK08p1j72J66k92kQ8O9L8p4K15k37
$$ 77 -23 -169 -1 -4 64 -195 -87 73 -52 -178 38 41 249 178 6 172 -120 -122 -34 35 73 -1 214 -23
5492b3j97L30m2m28L83O6l09J85n9kN3M2O4J15K5k64J14m3k78M61m51L90Rj88
$$ -23 -220 110 68 -360 23 89 -220 -35 -94 -96 -43 -1 63 178 203 -61 53 10 -268 193 -258 132 141 -47
5516d7K54l03J77Q3k86K74K7r7l33k5L43r2k2l0M1J17J36k31Oj69J22J80m6R3
$$ -47 207 -96 81 164 -122 152 179 82 -251 -276 67 -25 -47 -77 -36 81 217 -14 -8 -177 -55 125 79 172
5540A72K03j03q7k23l0n6K71m33L19k7O5j77J94JJ08j72j62J51K5n0P8Mj32K8
$$ 172 375 272 185 -38 -68 -124 147 -286 33 6 71 -106 88 89 197 25 -137 14 39 -11 67 71 -61 -33
5564c3J31Q2m08L92j12M7k83O7R0N9oj36K08Kr7o2L65n24J89P5j37J00k06M1J74
$$ -33 98 180 -228 164 52 99 -184 -117 -27 32 26 -110 98 100 3 -59 306 -218 -29 46 -91 9 -197 -156 18
5589A8nP7r3L07k98r2p2J2J89j22m0l2P0K91o4k12n0m8K46J59j58l12Q7K35k25
$$ 18 13 90 -3 304 6 -86 -158 -146 43 -79 -119 -151 -81 210 146 -66 -116 -164 82 241 83 -229 -142 93 -132
5614a32R8P5M7k03k13L60Q5k35J60j66K09l56J48J77j43J64J29J7k78m1j56K63
$$ -132 -34 41 88 -115 -328 32 117 -118 42 -124 85 -271 -123 54 -89 75 204 221 -57 -98 -254 9
5636IJ35M2k05j16M7J48k4r4O0J0l30M11J0q8Q3j35J35j46m1Q6O2Q2m1J45k42
$$ 9 144 186 -19 -135 -88 60 36 -58 2 12 -318 93 103 15 98 -37 98 -48 -89 -3 59 141 100 245 3
5661CP6Jj66j86L69j78RJ88k53J5J69q9O9p2JO4K61n4J43m95O9K70q9k56J24K69
$$ 3 79 80 -86 -272 97 -81 -72 116 -137 -122 47 -42 27 -45 -44 20 281 227 370 -125 -56 214 125 -131 -7 262
5687B62j46j3j86J04j98J43l5J08k66J03q3K00J07KJ29l02L2O8n8p7J78J1l80
$$ 262 116 103 -83 21 -177 -34 -69 39 -227 -124 -207 -7 100 102 231 -71 -39 29 -29 -106 72 83 -297
5710b97N33n26J35J71J44k16J36K2p5J5j56p0K20Q3p9j80K58J07j50J78j42l47
$$ -297 236 -290 -155 16 160 -56 80 102 27 42 -114 -184 36 119 40 -140 118 225 75 253 111 -236
5732b36Q7J02N3o5J20l06Q8N2J57j29q6L05m8k91K22K48l19oK23O6k53K40j97
$$ -236 -149 -47 6 -59 61 -245 -157 -105 52 -77 -163 142 94 -197 25 273 -46 -52 171 237 -16 224 27
5755B7n4r1P9j42J25K05k54J3m7J66L59n61L68M0l18K64m5j96k1J8j82R8n6J01
$$ 27 -27 -118 -39 -181 -56 149 -105 -92 -139 27 386 -175 193 233 -85 179 134 -62 -83 -65 -247 -149 -205 -104
5779a04q7M49l66M91l24Jo0J83j20k17L64j66l36M47k44n4K61j79l2r0J83j24
$$ -104 -191 258 -108 383 59 60 0 183 63 -154 210 44 -292 155 -89 -143 118 -61 -93 -183 0 -124
5801a24L08o7j77k29J79m2P6JQm1M41n57J89J36j74j12J97M0J52m70L40k05k6
$$ -124 184 117 -60 -289 -110 -152 -76 -75 -67 -108 333 -224 -35 101 -73 -185 12 52 204 -266 74 -131 -157
5824a57J59j12K45k4J27k75J64N8k10o1J17m0L5j82K39M3k71J10j3l8j9M29k29
$$ -157 2 -110 135 111 238 -37 127 185 -25 -86 31 -9 26 -156 83 126 -145 -35 -48 -86 -105 324 95
5847I5p3r5L39l16p7QL70j32q5K31l4k60m39M78O1j5r9J99k85K55K02k53j67N9
$$ 95 22 -73 266 -50 -127 -119 251 119 34 265 231 -29 -468 10 71 56 -43 156 -129 126 328 75 -92 -33
5871c3K68m28J62O0n1K5L06j5n0l48N6O3o4N2o2N8k3NJ53k81K96l4o6j92J9M74
$$ -33 235 -193 -31 29 -22 3 309 294 244 -104 -48 15 -49 3 -59 -1 -24 -19 134 -147 149 115 49 -143 -124 350
5897C50m92J26J41m2k56Q9j02K97j14L03l37Q5j74L00j2k38J23j13J4Q6j87r1
$$ 350 -142 -16 125 83 -173 -84 -186 111 -3 300 -37 48 -126 174 162 -76 47 -66 -52 34 -153 -244
5919b44J29J82m0q8J11J11Qj57J2j68L26j69oP8k55J04j3K12q2Q1k6k96J97j75
$$ -244 -115 67 27 -61 50 161 169 12 24 -144 182 13 7 85 -170 -66 -79 133 51 132 106 -190 7 -168
5943a68J60j17K31j49P5q5J02J5j46J97q8m3J22J25l58N3P7l09K94J0o7J41k67
$$ -168 -8 -125 106 -43 32 -53 49 64 -82 115 27 -16 106 231 -127 -74 3 -306 -12 -2 -69 72 -195
5966a95NK18L9J56p5k30L25r5l22K55j35J25j35K62lj18j10%L1KoJ27j30n1J70
$$ -195 -190 28 67 223 148 -82 243 148 -174 81 -54 71 -64 198 195 77 -33 -33 -2 0 -6 121 -9 -60 110
5991A10n9r6R4j93J71n7N0j26J04J12j57J86k01M8j06q3k3L23J01m54R0Q9O0k22
$$ 110 51 -45 49 -144 27 -30 20 -106 -2 110 -47 139 -62 -14 -120 -203 -226 97 198 -256 -166 -77 -17 -239
6015b39J08L32n52P7L27m2K15l76K4J77j54K37q5j3l73L37k7q6rJ90l68J16J26
$$ -239 -131 201 -351 -274 53 11 226 -150 -126 51 -103 134 49 36 -337 0 -27 -113 -122 68 -300 -184 -58
6038e8l8J64J15p8j65j01R5P7K1q7j21L3L47j31M4k20M2J54m9J17j73J77k31J76
$$ -58 -96 68 183 105 -60 -161 -66 11 32 -55 -176 -143 204 73 117 -103 -61 93 44 161 -12 165 -66 110
6062A10N6k03J97k40k56J92R9P2pR3M5l46Q9J56p6k2J2K24k02J03p1J97k04j90
$$ 110 166 -37 160 -80 -336 -144 -45 27 20 113 158 -188 -99 57 -19 -41 -29 195 -7 96 25 222 18 -172
6086a72n6K16L7J7O2n7p3M30p16J01J17M5k08L34j78K09k13P5j84K55k8J47j02
$$ -172 -228 -12 25 42 104 47 -26 404 -312 -211 -94 -49 -257 77 -101 108 -105 -30 -214 41 13 160 58
6109E8J29N1k94mL26q9j95k0J41k67K9q8K63k5Q4j92j34M45J55n24L78J5k94K63
$$ 58 187 238 -56 -60 266 177 -18 -38 103 -164 -135 -223 40 15 99 -93 -227 218 373 -151 227 242 -52 211
6133B11k70J22k44K18j18j21K34k34J45j04J00K29k24mK73j08j16n5J8l5J44r8
$$ 211 -59 63 -181 37 -81 -202 32 -202 -57 -161 -61 168 -56 -60 213 105 -11 -66 -48 -83 61 -37
6155c7J69k61K63j8k93K64j18L15k60k8Q6j44l9J83K02k79k03J18N9k52M2J02
$$ -37 132 -129 134 116 -177 87 -31 284 24 -4 82 -62 -101 82 284 5 -198 -80 -21 -273 -231 -129
6177a29J3j7K36m51N27j91r1n9P1J52K0k63M01rk27J01k35K14p9j9J44MQ2k3n4
$$ -129 -116 -133 103 -348 179 -12 -103 -162 -91 61 81 -182 219 210 -17 84 -151 63 -16 -35 109 113 195 172 118
6202A18k98J03J01k12K24j28J38R4l53o7J46j41L70l3R4r0j70p4k8J91j38L1j10
$$ 118 -180 -77 24 -188 36 -92 46 140 -213 -280 -134 -275 95 62 156 66 -104 -178 -206 -15 -153 -122 -232
6225b32K6K24J51j42k33J78K44j50q3O1K1j30k1Nj04J21M03m66L46k21l6P8j40
$$ -232 -206 18 169 27 -206 -28 216 66 -17 44 65 -65 -86 -81 -185 -64 339 -127 219 -2 -38 40 -100
6248a00r2K16L3k2R6m09L1K79k15J82O4n5j9L05l78J77J31k31j38J79j30L08j62
$$ -100 -192 24 57 35 131 -278 -247 32 -183 -1 63 8 -11 294 -84 93 224 -7 -145 34 -96 212 50
6271E0J8K53l6k58R5p8l48K78K53k57L4K11l67K55k20J80m8l4K97l67J65m3k64
$$ 50 68 321 285 27 122 44 -304 -26 227 -30 4 215 -152 103 -117 63 15 -19 278 -89 76 33 -231
6294b31K97J39l32K01j8kK4J58k93N1Q3N5j82J49J14m00q2J71J55j9j70L39l10
$$ -231 66 205 -127 74 56 54 78 236 -57 -6 77 132 -50 99 213 -187 -269 -98 57 38 -132 207 -103
6317a03l9K33j35J59k28l6K29K81m56N1j61L04K3j57J08k9O4j59L9k7J4J45m5
$$ -103 -142 91 -44 115 -113 -149 80 361 -95 -44 -205 99 122 -35 73 44 108 -51 -12 -39 -25 120 75
6340G5k3j12j07K27R0l49K80j52R6p6R5j65nJ84j49K35L3k54K71k06J48q0q9k5
$$ 75 52 -60 -167 60 150 -199 81 -71 25 -51 44 -121 -126 58 -91 144 177 -77 194 -12 136 56 -33 -58
6364e8K50k44L27k82L20l94J0j26J14K60m49N03k74K08o4j01R5o0M0j70J38k63
$$ -58 192 -52 275 -7 313 -81 -71 -197 -83 177 -272 231 -43 165 101 0 95 35 75 -95 43 -220
6386b20L56q5r8P9k74K91j34j74K75M9r9j33M2J11J17q5J36j52j15K07l9k82J33
$$ -220 136 51 -47 32 -242 49 -85 -259 16 65 -34 -167 -125 -14 103 18 154 2 -113 94 55 -227 -94
6409i4J60j48o5O0O2n1J23j19k14K89J1m5j32L64n40L34P7m30N68m10M05n3k69
$$ -94 66 -82 -147 -87 -25 -76 47 -72 -286 3 14 -31 -163 201 -339 -5 72 -358 210 -200 205 152 -117
6432a17J8j03J11l6J8l3L6k1Q5J30k8j75l7M7L24n5j97J95l09j31J18L95l09J64
$$ -117 -99 -202 -91 -127 -109 -142 -106 -127 -42 88 60 -115 -152 -105 219 164 -33 162 -147 -278 -160 235 -74 90
6456I0k39p3K44k56L88r5j72K40j21o3k8J45J70k78L18k42n8J4l3J84j17Q8J53
$$ 90 -149 -222 22 -234 154 59 -113 127 6 -57 -85 60 230 -48 270 28 -30 -16 -49 135 18 106 259
6479B59l56m1M10m32%K72r8J06j00j23O2O0J56k76J51j07K37l54L12j92J01o8
$$ 259 -97 -138 272 -160 -160 112 14 120 20 -103 -41 19 175 -101 50 -57 180 -174 138 -54 47 -21
6501b1j5L1k18RL4K36K6q2rk2q1kJm4N9J23M5L03m04L5J42J35k40M3n7n1J54L5
$$ -21 -36 -5 -223 -214 -180 56 82 0 -9 -31 -112 -114 -113 -157 -98 25 70 373 -31 4 146 281 41 84 27 -24 130 165
6529A65j88m0k20J02M1N4m0K37n7m3j91J07J23j9P2O7n07N77J16o19M41k22J42
$$ 165 -23 -63 -283 -181 -140 -86 -126 111 54 11 -180 -73 50 31 103 170 -337 240 356 -263 178 -44 98
6552I8j62r2J0N70l04J1Qj89J74J78k57qn6J44j26J68j2l08K53k10K53j10j05
$$ 98 -64 -156 -146 424 120 131 139 -50 124 302 45 37 -19 125 -1 167 155 -153 100 -110 143 33 -72
6575g2N1J44O2N6j05Q1j96J10j80O8j46K67o8K0k01jJ04O1m8q9M0L04k33r2J91
$$ -72 -21 123 185 241 136 217 21 131 -49 19 -127 140 72 92 -109 -110 -6 55 7 -82 -42 262 29 -63 128
6600A28j50l12L86O8r1O4K06j65j77J99l81K64K3k06j2J42Q2Q4J08k14Mml22M37
$$ 128 -22 -334 52 120 29 93 299 134 -43 156 -225 39 62 -144 -156 -14 68 152 260 46 50 46 -276 161
6624A61j5r6j56m1R9J19rp6m5o6J82m3P8J4j73p4K18j24r3J54K02l30J62l3j06
$$ 161 146 50 -106 -147 -48 71 62 -14 -59 -125 57 14 92 106 -67 -141 77 -47 -140 14 216 -114 48 15 -91
6649i1P6RJ46j12J34Q4k46l5L9j3J63Q5k87K45l82K3R2j07Q0nK3k39L89N1q7J52
$$ -91 -15 -6 140 28 162 246 0 -35 4 -9 154 239 -48 197 -185 -162 -70 -177 -97 -102 -79 -318 71 122 35 187
6675A87k25J97j13J26j00o7K08l01J78J36l71J2L38n8l6R7j48k27P2M04k85o1
$$ 187 -38 159 46 172 72 5 213 -88 90 226 -145 -133 205 147 111 208 60 -167 -95 309 24 -37
6697c7M8k04L46k25Lj91K39J74l16J10j53J01qn0J60M4j00J35L8j36l06N41m66
$$ -37 11 -193 153 -72 -69 -260 -21 153 -163 -53 -206 -105 -113 -163 -3 41 -59 76 114 -22 -328 213 -253
6720b53K16K00l14L13k39oM47m05k43M85l84K24j98J62k06O3J64j90R9J11j59
$$ -253 -37 163 -151 162 -77 -83 364 -41 -284 201 -183 41 -157 5 -201 -138 26 -164 -65 46 -113
6741a13j88J25L10j48%P6k7K13k79k40M84l76J47n4K14j69J9J97j90J89l82R9
$$ -113 -301 -176 134 -14 -14 62 35 248 -31 -271 213 -163 -16 -70 144 -25 -6 191 1 190 -192 -93
6763i3K54Q4j80NM6P5O5l48n6M22l11K58j96J24k50K04J39l62r5J47No6P3r4L43
$$ -93 161 245 65 70 116 191 256 -92 -148 274 -37 221 25 149 -101 103 242 -120 -215 -68 -63 -129 -56 -150 193
6788A93N4k94j88N75l00n4K0J20oq6P1j94J75j65l0K20j02J63k71M6P9L7r3K59
$$ 193 247 -47 -235 340 40 -14 6 126 120 34 105 -89 86 -79 -109 111 9 172 -99 -53 26 63 -30 229
6812B29p7k19m1J19J25n2l19J86l7J03j82L16q3L7Jj21K45l18K86k07o3J29j0
$$ 229 152 -67 -108 11 136 84 -235 -49 -86 17 -165 151 68 105 106 -15 230 -88 198 -9 -72 57 47
6835D7j80M0J31j17J13q0M4J77j54J16l56J10p1o7M53Q2j04j54q3J66j3k71J45
$$ 47 -133 -93 38 -79 34 -46 -2 175 21 137 -219 -109 -180 -247 206 288 184 30 -53 113 100 -171 -26
6858b6J89j34K10l97O7J37o7n9l10M28K39m02J60k5j44M5pL27k2q3k32j55N11
$$ -26 163 29 239 -158 -91 46 -21 -80 -390 38 277 -125 35 10 -134 -89 -96 231 209 126 -106 -261 250
6881B50K8k93JOJ56j75J18l6m7P2p4k00o5K17P1M6l85L73L4K7j96J7j38M8K33
$$ 250 278 -15 -14 -8 148 -27 91 55 8 80 6 -194 -259 -42 29 75 -310 63 97 124 -72 -55 -193 -145 88
6906H8r8K59l23K49l80P3J66J68k67q4PJ18O8j33J15P3l5j69M0M31m70Q1L3j55
$$ 88 -10 249 -74 175 -205 -132 34 202 -65 -149 -142 -24 44 -89 26 99 64 -105 -65 366 -104 -23 10 -145
6930a45J7K45k61J18J17j12R5p6Mk7J48k99O9K1J00k6j13J69J5J06l2oo7n5J1
$$ -145 -128 117 -144 -26 91 -21 74 -2 2 -25 123 -176 -107 -86 14 -12 -125 44 59 165 133 127 60 5 16
6955A6kj9J12l17K08K48J9l83J98r2K0K62j47Q2k09J72Qj74K10P9l19J04j57J22
$$ 16 14 -5 107 -210 -2 246 265 -118 80 -12 8 270 123 205 -4 168 176 2 212 291 -28 76 -81 41
6979D1k28J05J47j99K15j94J52O5m08K54j10K12j36J11k83L88K5l56L36j8k40
$$ 41 -187 -82 65 -134 81 -113 39 104 -304 -50 -160 52 -84 27 -256 132 157 -199 137 119 -121
7000a21k6K16J44j18j32j84L07n9Q3jr5n6k7j8K90J2j17J8J52j66j37L8J14j64
$$ -121 -147 69 213 95 -37 -221 86 27 110 109 14 -42 -69 -87 203 215 98 116 268 102 -35 3 117 -47
7024d7p0J02j4J33k06k7O9m5o4J13M55l75M2J04j84L5N7l02R5J68j14J40k05L72
$$ -47 -117 -15 -29 104 -102 -129 -60 -105 -169 -56 399 24 66 170 -14 21 78 -224 -129 39 -75 65 -140 232
7048B32l45J11k29M38k53k42M62l65L78k76j67J81l2J53kl02L09J71k40m8j04
$$ 232 -113 -2 -231 207 -46 -288 174 -191 187 -89 -256 -75 -107 46 44 -258 51 222 -18 -66 -170
7069a70M35l50K68r2k49K77p8r6O0j58K22m2q9N5j44J54m0J17l25O1K05k7j04
$$ -170 265 -85 183 91 -158 119 41 -55 5 -153 69 27 -62 -7 -151 3 -37 80 -245 -184 21 -6 -110
7092a10J59j32j17J2J69o0K45k22j63L43l3J81j70J25k64L71k3k49l8j39J25m0
$$ -110 49 -83 -200 -188 -19 -79 166 -56 -219 124 91 272 102 227 -37 334 311 62 24 -115 10 -30
7114c0O1l3J07j6l9j71k37J71Q4j01J24J50N3j08j56J15L13k09%j88K36o6p1j24
$$ -30 31 -2 105 89 50 -121 -358 -187 -103 -204 -80 70 123 15 -141 -26 287 78 78 -110 126 60 -11 -135
7138a35j03K59O4J09l39K01n8r1n9k25M39k83o8Q6K27Q3n9M5jJ65l44pj47M25
$$ -135 -238 21 85 194 -145 56 -2 -93 -152 -377 62 -221 -289 -203 24 107 48 93 92 257 -87 -94 -241 184
7162A84j40k45M2J70k5%l5Np9K11r9k14K99Q7j21o6q8l5J39j40l4L21j21r6j93
$$ 184 44 -201 -159 11 -14 -14 -49 -44 -123 88 -11 -225 74 161 40 -26 -114 -149 -10 -150 -184 137 16 -80 -273
7187b73K84J8j22J02J21j44m1J19N3k44n4J88O2j8j32K89k70k52L26R5m36K12
$$ -273 11 29 -93 9 130 -14 -55 64 117 -127 -181 7 69 51 -81 208 -62 -314 12 107 -329 -117
7209a17K3K13k59L06k50K29k06J14K41n51L90j00k9j38n1K63l46J88jN8L0J24
$$ -117 -94 119 -140 166 -84 145 -61 53 294 -257 133 33 4 -134 -185 78 -268 -80 -81 -23 7 131
7231A31l12J25j7k09J83L55k34j62Q0L9j96J71j90J02J71l37L43Q9O4k13K72l58
$$ 131 -181 -56 -73 -282 -99 256 22 -140 -60 -21 -217 -46 -236 -134 37 -300 43 132 196 -17 255 -103
7253a03K45j72j66O1J35R0q9l57L05j83K67p3kJ34j79L20l21r6J79M5r4o8ML12
$$ -103 142 -30 -196 -135 0 90 1 -356 -51 -234 33 -40 -42 92 -87 233 -88 -184 -5 40 -54 -122 -118 194
7277A94k6l04J51k13L34lj16J98p1o2j13j39K18k84K15P9J24j88k40L87P6l20
$$ 194 168 -136 15 -198 136 133 17 215 144 82 -31 -170 48 -236 -21 58 182 -6 -246 141 217 -103
7299a03K19o6J09k52J78j72K29k88K44n3q3rr2P9J37l68J27N1K90n63K99K33K7
$$ -103 116 50 159 -93 85 -87 142 -146 98 45 -38 -47 -139 -60 77 -291 -164 -113 177 -386 -87 146 173
7322A73j44j42J1k05M24K7j65J27k36J46l2p4L30p5j90l8K5N4J28k9r2M3qq6k93
$$ 173 29 -113 -102 -307 117 144 -21 106 -130 16 -16 -90 240 165 -25 -63 -38 16 144 115 23 66 58 -28 -321
7347c21K82Q1n2k61L30J5j4p4k04M57n09J39J57L8p5P4k6k28p0K94n6R4q3pk3
$$ -321 -39 42 -10 -271 59 74 60 -14 -218 239 -270 -131 26 64 -11 63 37 -191 -261 33 -23 71 -12 -19 -42
7372d2K38l82j4O2K42j53L14L8j15j56j7P0o2j21J57o0qq3m8J47P3J03j63j32
$$ -42 196 -186 -200 -138 104 -49 265 303 188 32 15 85 23 -98 59 -1 -9 -92 -140 7 80 183 20 -112
7396a12J23j53K12n1o3J10k45J55J84q4J8l81J39K20J3k3J3J5J35m48K51j40Q9
$$ -112 11 -142 70 19 -44 66 -179 -24 160 76 94 -287 -148 72 85 62 75 90 225 -223 28 -112 -23
7419b3j7Q5j98J41k7k6J65k75J31J0M9r0K78j40j44L01j23j54P2l0j17J84j99
$$ -23 -40 45 -153 -12 -39 -65 100 -175 -44 -34 15 -75 203 63 -81 220 97 -57 15 -15 -132 52 -147
7442a47l1J87j88J53R7M2n6j85n2K52j64L30j8p6j56q6j73L26k3P8k26J45j38
$$ -147 -178 9 -179 -26 71 113 57 -128 -180 72 -92 238 220 144 -12 -98 -271 55 32 110 -116 29 -109
7465a09J27r6J3n8j21M39l10J22m7J1J76q3J9j6k48J02R9J36k35K80k46k17K19
$$ -109 18 -78 -65 -123 -244 195 -115 7 -40 -29 147 64 83 67 -181 -79 20 156 -79 201 -45 -262 -43
7488d3j83J40j09K24r7j02J49k7P6l13L19J90k26N7J42l78J23N8k99K01K7O7j77
$$ -43 -226 -86 -195 29 -68 -170 -21 -48 28 -285 34 224 -2 55 197 -181 -58 0 -299 -98 -71 -4 -181
7511a81N6O8L35l88r0J53P9j32J49Mk70J51K06MM2k27J64l79K53j22K45Q8o0j50
$$ -181 -125 -57 278 -110 -200 -47 32 -100 49 53 -217 -66 140 144 186 -41 123 -256 -3 -125 120 208 148 -2
7535bk8k1J74j09K40l81K65k22J68l9K72l51J21K5r6L5j87J49L96k89m36L54j31
$$ -2 -30 -51 123 14 254 -127 138 -84 84 45 317 -34 87 112 16 51 -136 13 409 120 -316 38 -93
7558i3J5M7J41j31k24M07j53k42L64l44J76M3k22J05J91j96J25Pj8J31l01K97
$$ -93 -78 -31 110 -21 -245 162 9 -233 131 -213 -37 6 -216 -111 80 -116 9 16 -2 129 -172 125
7580A25k95Q8K75k52J53k03n1K89k83PM60n17J78N3J63n9j71N9J6O2R8k79K79
$$ 125 -170 -82 193 -59 94 -109 -160 129 -154 -147 313 -204 -26 27 190 131 -40 19 35 97 195 -84 195
7603A95n13K85o9M2K68j15k35J58L6p6m0K14j0k83L10l34L54j10mq0Q6m31L30
$$ 195 -318 -33 -102 -60 208 93 -142 16 52 -24 -64 150 140 -143 167 -167 187 77 73 -7 79 -352 -22
7626b2j03j18M98o10J87l5J05K00K8k73P5J21r0J70n1j16JK1j0r8P5n8J97J88
$$ -22 -125 -243 255 -355 -168 -203 -98 102 130 -143 -68 53 -37 133 82 -34 -33 -12 -22 -120 -45 -103 94 282
7650B82k75p6J50m30L06k17LL76j54K17j16K59n56J05L66l30K41k9n17L48j35
$$ 282 7 -69 81 -349 -43 -260 -257 119 -35 182 66 325 -231 -126 240 -90 151 122 -395 -47 -182
7671a82J78M4j81J90J3J95k03k6k02K14k38R6R2M7k50L36k32m4l3K46Jo3j95J83
$$ -182 -4 40 -141 49 62 257 54 28 -174 40 -198 -102 -10 37 -213 123 -109 -153 -186 60 61 -2 -197 -14
7695a4k36K43k2q2L62m82L03j62N4N6RK2q6Jq7K29j74m9R2o3k50L68J23j40OL7
$$ -14 -250 -7 -29 -111 251 -231 72 -90 -36 20 29 51 -35 -34 -121 108 -66 -115 -23 -86 -336 32 155 15 21 58
7721E8j29L20p9j33k00K24r8J65p5p9l7N5o2R1M9J8q6J95q9j79R5J47l02N7K34
$$ 58 -71 249 170 37 -163 61 -37 128 53 -26 -63 -8 -70 21 70 88 2 197 108 -71 24 171 -131 -74 160
7746A60k4L5l00Q2K8J35q0j85N7q4l2K64k44L5J86o1J25p2n1j71J95N7j69J34
$$ 160 136 171 -129 -47 -19 116 36 -149 -92 -176 -208 56 -188 -153 33 -28 97 25 -26 -197 -2 55 -114 20
7770B0J26j20j36j34L73k47L45R0k93k73j22M72r7qQ3Lm08K60Q7r5L82k71j33
$$ 20 146 26 -110 -244 129 -118 227 317 24 -249 -371 101 4 -4 79 82 -326 -66 21 -74 308 37 -96
7793i6J68K97L5l50q2k12J29J38j96J35L72k13J76m27J75j3k21L10m5K26l80o0
$$ -96 72 369 404 54 -28 -240 -111 27 -169 -34 338 125 301 -126 49 36 -185 125 80 306 -74 -134
7815a34K2R0r8R9j01J03j29O7o2P6K8p8L50k29l36K52L01Jl35O3m5j95L19M7n8
$$ -134 -112 -22 -120 -21 -122 -19 -148 -81 -143 -67 -39 -117 233 4 -332 -80 221 222 -113 -50 -95 -290 29 76 18
7840A8j61K37o5l39m2L61j44J10J85j57j43L4j01K74j84K7K91j23k11J53N6k13
$$ 18 -143 94 29 -310 -352 9 -135 -25 160 3 -140 -106 -207 67 -117 -90 201 78 -133 20 76 -137
7862a37K9j51J40L28l8j92o6J79L5k37qJ54J6N2j40L5n9l6p0K3J76k49r7L72j60
$$ -137 -108 -259 -119 209 171 -21 -87 92 127 -110 -118 36 52 104 -36 -1 -60 -96 -166 -143 33 -216 -313 59 -101
7887a01K49KK98l96k0O4j47R5l5K20p5j37j32JK49L1j3k78J10M3q8N3Q4k27K07
$$ -101 148 150 448 52 32 96 -51 44 9 229 154 17 -115 -114 135 166 153 -125 -15 28 -60 -7 77 -150 57
7912E7o6Q6O7j18q2J41r3j5J36j49O8J04k23q1N0J99l0l3J71j91K76j89j09j43
$$ 57 -9 77 144 26 -56 85 -8 -23 113 -36 32 136 -87 -168 -118 81 51 18 189 -2 274 85 -24 -167
7936a67O1j28J02kL98m07J04N2k48M89l63K2j93K09J55j06n9l7K80R0n12N75j85
$$ -167 -106 -234 -132 -134 264 -143 -39 13 -235 254 -109 -87 -280 -71 84 -22 -81 -118 162 252 -260 315 130
7959A30NKk2m03K48lJ77k81J00J06p6jj3J84k01J67j29LL7Jo6K11k93K14j84K79
$$ 130 135 137 115 -288 -40 -43 134 -147 -47 59 -17 -18 -31 153 -48 119 -10 -7 30 31 -35 176 -117 97 -87 192
7985A92k0lk33j52m0K49o3L0J12m5R6nl13L55k73j4N2l2J1P4k24J88n1J06q1L49
$$ 192 172 169 -64 -216 -256 -7 -70 -40 72 27 123 118 -195 160 -113 -127 -75 -107 -96 -22 -246 -58 -109 -3 -84 265
8011B65l87L12k06j46K64M9k54N8r6P0j4K40j54k4j67K47j22N9N0k2l87O07k23
$$ 265 -122 190 -16 -162 102 151 -103 -45 -141 -71 -85 155 1 -23 -190 57 -65 -6 44 22 -365 242 19
8034A9j9j39L62m7j05pk5l7K03j65n9r6J76K19k53r2J38Pj20J23m19K82L07l68
$$ 19 0 -139 223 176 71 64 39 2 205 40 -19 -115 61 280 27 -65 73 80 -40 83 -336 -54 253 -115
8058a15L60m6k11k83K38J15j06J0N4J10l23J45N2J2k27L85j49J4M2J52j74M1k11
$$ -115 245 199 -12 -295 -57 58 -48 -38 16 126 -197 -52 0 12 -215 170 21 35 77 229 55 96 -115
8081a15K64j39K62k47j37j10L31Q8q8j0j35K90l1k27q7K53R1k32K28j6P5k90Q3
$$ -115 149 10 272 25 -112 -222 109 197 109 99 -36 254 223 -4 -91 162 253 21 249 233 308 18 101
8104A01j26j33J83J6j33N0M29m51n4j21K45n6L39q0l14L75o4k75M0j41M61m11
$$ 101 -25 -158 25 41 -92 -42 387 -64 -118 -239 6 -50 289 209 -105 270 206 -69 -29 -170 291 -120
8126a20O5R8K5m99L37L61j31j87P7Q6j89K82k50K3M2k02L17J34j40k43j16K95
$$ -120 -55 43 68 -431 -94 267 136 -51 26 112 -77 205 -45 -22 20 -182 135 269 129 -114 -230 65
8148F5m3M5J10o42N86l96P0j06L44J21k88J14PP2q8K17l50J09J97j78j00J46r4
$$ 65 22 67 177 -465 121 -275 -205 -311 33 154 -134 -20 -13 59 -29 188 -162 -53 144 -34 -134 12 -82
8171h2R1j94K86k00L60j97j54j77K93O7p6K06l54J11r5N2J65l98K35M69
$$ -82 9 -185 101 -99 261 64 -90 -267 26 93 17 223 -131 -20 -115 -63 102 -296 -61 408
8191D08
$$ Imaginary data points
##PAGE= N=2
##DATA TABLE= (X++(I..I)), XYDATA
0@%%%%%%Qq%%Qj6J6j8K6m0M8n6O4p7J01j20J36j58J89k22K55k93L37l85M42n03
$$ 0 0 0 0 0 0 0 8 0 0 0 8 -8 8 -10 16 -24 24 -32 32 -45 56 -64 72 -86 103 -119 136 -157 180 -205 237 -266
32b66N67o42P25q15R12j020J141j271J412j567J735j920K123k342K583k847L138
$$ -266 301 -341 384 -431 481 -539 602 -669 743 -824 911 -1009 1114 -1228 1355 -1492 1646
49A646l456L804m194M626n106N645o257O957p765Q711r832J1192j2880J5028j7868
$$ 1646 -1810 1994 -2200 2426 -2680 2965 -3292 3665 -4100 4611 -5221 5971 -6909 8119 -9749
64i749K1813k7654L7142n4997R9221l89710m88341J369458l4552j136886M28191
$$ -9749 12064 -15590 21552 -33445 65776 -323934 -812275 557183 522631 -614255 -186064
75a86064P53636p57710j91687Q70289l38243q41528Q16452O20599j092114l04769
$$ -186064 567572 -190138 -381825 488464 150221 -691307 125145 745744 -346370 -651139
85f51139J150023n9362r47737L39898N89821n07633j57992N38825k33490m84310
$$ -651139 498884 439522 -508215 -168317 421504 -86129 -244121 294704 61214 -423096
95d23096N44217L57727p26055j97502P65810K6430o54751R9461M43669j65876
$$ -423096 121121 478848 -247207 -444709 321101 347531 -307220 -207759 235910 70034
105G0034j97184J78073k4850j79333K04293J84392l41740j88685M29769J71677
$$ 70034 -127150 50923 26073 -153260 51033 235425 -106315 -295000 134769 306446
115C06446m52220j36164M04805R0476l08229l5905J88697m1916n3452J41112j01675
$$ 306446 -145774 -281938 122867 213343 -94886 -130791 57906 15990 -37462 103650 1975
126A975k30759K64569K68987l94212k38354M50277J54776m16045m3785L05859
$$ 1975 -228784 35785 304772 -89440 -327794 122483 277259 -138786 -182571 123288
136A23288p1583j41451J79841n9404k49898K68984K51272m35855j70514N05431
$$ 123288 51705 -89746 90095 30691 -219207 49777 301049 -134806 -305320 200111
146B00111L9088m49319R3584K88791j85317p0836K23489j58705k03928L59926
$$ 200111 239199 -210120 -116536 172255 -13062 -83898 139591 -19114 -223042 136884
156A36884J24543m89614O492N04570j51987l89908K55092J77260k77884O8475
$$ 136884 261427 -228187 -221695 282875 130888 -259020 -3928 173332 -104552 -36077
166c6077K16289k84233r8871M28259m4531m81580J87372M28421l00127k73479
$$ -36077 180212 -104021 -202892 225367 180836 -300744 -113372 315049 14922 -258557
176b58557L41538N2135k89807J70862J55845l34805J3074M08707j69132l95399
$$ -258557 82981 135116 -154691 16171 172016 -162789 -149715 258992 89860 -305539
186c05539K81570L08003l36180j63748L23071j2418k34878J74970R0294k79127
$$ -305539 -23969 284034 -52146 -215894 107177 94759 -140119 34851 125145 -153982
196a53982O8420L06800j92224k71439K58265K00905k68799j09252K36002P070
$$ -153982 -85562 221238 29014 -242425 15840 216745 -52054 -161306 74696 81766
206H1766j63349R0227O2253j56728M3205J81329j21067j71774J57105J49231j58984
$$ 81766 -81583 8644 70897 -85831 -42626 138703 17636 -154138 2967 152198 -6786
217f786j22444J46675Q3619j25409k6656R0342l9338m0658R5184j0197j34501
$$ -6786 -129230 17445 101064 -24345 -51001 39341 3 -40655 54529 44332 -90169
228i0169M9535J60608q0232j73870J10496J60360j41848j06788J54969J8168j34359
$$ -90169 -40634 119974 39742 -134128 -23632 136728 -5120 -111908 43061 61229 -73130
239g3130P7739P9556j55651q534K01984o4741k15179J33056J88205j89744j15424
$$ -73130 4609 84165 -71486 -80020 121964 57223 -157956 -24900 163305 -26439 -141863
250a41863K15279M723j89152J10997J11261j95616m557K28599r8709k11352J78976
$$ -141863 73416 78139 -111013 -16 111245 -84371 -88928 139671 40962 -170390 8586
261H586J53993k26472o2924K31774m7275j83717J50783Q6061k11866L5466K13843
$$ 8586 162579 -63893 -126817 104957 57682 -126035 24748 110809 -101057 -65591 148252
272A48252j41260j62591K05850Q2733k22257O526J96488r1811j31535J58367L5852
$$ 148252 6992 -155599 50251 132984 -89273 -82747 113741 21930 -109605 48762 84614
283H4614j85658P0346J61294j53612r5569J89169J7244j77010N0296J32022r8303
$$ 84614 -101044 -30698 130596 -23016 -118585 70584 87828 -89182 -38886 93136 -5167
294e167p0346J25498j063j28617P1716R9539j23266m6686J37232j0160j15624
$$ -5167 -75513 49985 48922 -79695 -7979 91560 -31706 -78392 58840 48680 -66944
305f6944M9548P5270o8104l4177P2768l155p1257L7462N9506o5923l5528P8332
$$ -66944 -17396 57874 -10230 -44407 28361 25206 -46051 -8589 50917 -15006 -50534 27798
317B7798N649o9750J5588N1416k5543l4717L0653K4459m2016r413N5420j4108
$$ 27798 33447 -36303 -20715 30701 5158 -29559 1094 25553 -16463 -25876 29544 15436
329A5436n8477M1298M5887n8208k4354O3438L102o1761K0061N7015m7997m1280
$$ 15436 -43041 -1743 44144 -14064 -38418 25020 28122 -33639 -13578 43437 -4560 -45840
341d5840P7766P012r1829L8345P9898p6012m5069R3663J764q9946L8779P1796
$$ -45840 31926 38938 -52891 -14546 65352 -10660 -55729 37934 39698 -50248 -11469 60327
353F0327p4760m0546J02147n560j10007N8875Q7696j02257l8159J16295k1084
$$ 60327 -14433 -54979 47168 41608 -68399 -9524 78172 -24085 -62244 54051 32967
364C2967r8677O8515O0483r8165j4229J08823l5009j00464Q1289O7229j13324
$$ 32967 -65710 2805 63288 -34877 -49106 59717 24708 -75756 5533 72762 -40562
375d0562j3052J14820m5289q3591Q6054L2811r9897J8056R1557n9091o8002Q7247
$$ -40562 -53614 61206 15917 -67674 18380 51191 -48706 -30650 60907 1816 -66186 21061
387B1061L3851j00552J0188R1835n3703n6993Q0301Q313q0141L5463O0299o1788
$$ 21061 54912 -45640 -35452 56383 2680 -54313 25988 34301 -45840 -10377 49922 -11866
399a1866l2991P2104P822p1730J7249O1098m0409l6218N4542K285n0639K8032
$$ -11866 -44857 27247 35069 -36661 -19412 41686 1277 -34941 19601 21886 -28753 -721
411g21L2690m3513j2596M5746k3m3152P536M0011j5920l2985K5267J6729k8546
$$ -721 31969 -11544 -24140 21606 21583 -21569 -14033 25978 10058 -22927 2340 19069 -9477
424i477K568K2599j7131j3538K3156R227k8587r153L6941L967m4878R405M0922
$$ -9477 -6909 15690 -1441 -14979 8177 17404 -11183 -20336 16605 20572 -24306 -14901 26021
437B6021k3960k5272L0998L627k8736J4733K3387l0497j8233M6812P548o0073
$$ 26021 2061 -23211 7787 11414 -17322 -2589 20798 -9699 -27932 18880 26428 -33645
449c3645J1725N9980l4313m1053M7779J0116m4414K0119L0181m2274j1842N7273
$$ -33645 -21920 38060 3747 -37306 10473 20589 -23825 -3706 26475 -15799 -27641 29632
461B9632o556o5620K8711O1850m9412m0488O0084N207m9785K9121K4305n0042
$$ 29632 23076 -42544 -13833 48017 -1395 -41883 18201 23408 -26377 2744 27049 -22993
473b2993M963N8025k9262n6712M7745M7389n9604k7266O0559k569m4414L1635
$$ -22993 -18030 39995 10733 -45979 1766 49155 -10449 -37715 22844 20275 -24139 7496
485G496J2040m6771K2459M6342m7504l7619N9002K6059o0433j2582N2793n756
$$ 7496 19536 -27235 -4776 41566 -5938 -43557 15445 41504 -18929 -31511 21282 15526
497A5526l3545K2754L039l1744K9743K8005n2873j7376N8951Q920n4098m847M3542
$$ 15526 -18019 4735 7774 -23970 5773 33778 -19095 -36471 22480 31400 -22698 -27545 15997
510A5997l39k7600P341M452j2506K2122J1951m3550n464N1291K953m8501n768
$$ 15997 15658 -11942 -4601 -149 -12655 9467 21418 -22132 -27596 23695 26648 -21853 -27621
523b7621M1729J0112l2887q046J8262J777L738L556k6498m854M3167N596m8499
$$ -27621 14108 24220 -8667 -16713 1549 3326 7064 10620 -15878 -20732 22435 28031 -20468
536b0468j0645M9117J6788m6484j6567L8336P901j8744K751r203r291L6482J0300
$$ -20468 -31113 18004 34792 -11692 -28259 10077 17978 -766 1985 -7218 -16509 19973 30273
549C0273n3576j2096O1098J4635o2201j3551N4555N576l5247N600L430j2588L1239
$$ 30273 -23303 -35399 25699 40334 -21867 -35418 19137 24713 -10534 -4934 -1504 -14092 17147
562A7147J1084n7762o427O9821L461p0522k366O1181r70m1518O756J0158r548
$$ 17147 28231 -29531 -35958 33863 37324 -33198 -35564 25617 24647 -16871 -10115 43 -9505
575i505K6381M011n5585M996P0001j1165o8969J0168N8695n810m0928K854J4813
$$ -9505 16876 20887 -34698 -29702 40299 29134 -39835 -29667 29028 23218 -17710 -14856 -43
588d3J004J7020q297m5113J9140N9978k5051n9621K0885N1010q390l8470l351
$$ -43 961 17981 9684 -35429 -16289 43689 18638 -40983 -20098 30912 22522 -15948 -19299
601a9299K0257J3004L192k0930k7448K9465M3888l3417m8162K7420M3857j1760
$$ -19299 958 13962 17154 -3776 -31224 -1759 42129 8712 -39450 -12030 31827 20067
613B0067l6610o159K7293J8646j1730k7025q383L2382K7219l5476l8141L1037
$$ 20067 -16543 -22702 4591 23237 11507 -15518 -23901 8481 35700 224 -37917 -6880
625f880L9867j7587l7777p65L3223J4948k3213k3637N505K8677J5844l3830l2564
$$ -6880 32987 15400 -22377 -23142 10081 25029 1816 -21821 -16316 12361 28205 -5625 -38189
638c8189L4805L9616k6821m0319J2057L6635L452k8381j4721J2520K3613R443
$$ -38189 -3384 36232 9411 -30908 -18851 17784 21236 -7145 -21866 -9346 14267 23710
650B3710l2047k9333L9399L9612l9148m0194K8657L5847j1767k7638m223J4531
$$ 23710 -8337 -37670 1729 41341 2193 -38001 -9344 26503 14736 -12902 -17125 -2594
662b594J8329M550l1033k3941M3258L6372m9633l7135M3959L1216k6797k3518
$$ -2594 15735 20285 -10748 -34689 8569 44941 -4692 -41827 2132 33348 6551 -16967
674a6967N937J3753J2900J08k9389j6180M4098K7429n3649k9808N1643K4802l6257
$$ -16967 -11030 2723 15623 15731 -13658 -29838 14260 41689 -11960 -41768 9875 34677 -1580
687a580j8879J3815J2903P735n601k5755n349L9975J5863n0247k1136N1892J9003
$$ -1580 -20459 -6644 6259 13994 8393 -17362 -22711 17264 33127 -17120 -38256 13636 32639
700C2639m0678j5552J9777J3712J735j1467j8809N003L1751M921m2140j2586M6597
$$ 32639 -8039 -23591 -3814 9898 11633 166 -18643 -13640 18111 23032 -19108 -31694 14903
713A4903J5523m1021j5214K5624J5731o566j6118r229J2914K1901m337l1969n854
$$ 14903 30426 -10595 -25809 -185 15546 8980 -7138 -16367 -3453 18448 14111 -17858 -23712
726b3712L9696J2514l9992j4744L1423J5505j5909j6248L31J5327J2234q963k2885
$$ -23712 15984 28498 -11494 -26238 5185 20690 4781 -11467 -11136 4191 16425 7462 -15423
739a5423r96L2679Q948l8438j1752L5401J1733k3778j1968Q220J2809M960r717
$$ -15423 -16419 16260 25208 -13230 -24982 10419 22152 -1626 -13594 -5374 7435 12395 2678
752B678j6892K895K7212L897l5790o591L6530N657k7953n468J2626P646J475q791
$$ 2678 -14214 -11319 15893 19790 -16000 -22591 13939 19596 -8357 -13825 -1199 6447 7922 -869
766h69j3609O802K3247k823l1286N21L4115o97k8547J045J5309K335m01p454j0853
$$ -869 -14478 -7676 15571 12748 -18538 -18017 16098 15401 -13146 -12101 3208 5543 5142 -2312 -13165
781a3165R865J9061q507k5524O584K8973n519k5827M895J6032j629k092n431q067
$$ -13165 -3300 15761 7254 -18270 -11686 17287 11768 -14059 -9164 6868 5239 3147 -2284 -10351
795a0351J1218J4650j2526j8547J0535K1468p989k1339O753J5358l976n238k071
$$ -10351 867 15517 2991 -15556 -5021 16447 8458 -12881 -6128 9230 5254 16 -2055
808b055m388R198R570j2446j2259J0860J5280q493j7028O614J4810n390p716R66
$$ -2055 -6443 2755 12325 -121 -12380 -1520 13760 5267 -11761 -5147 9663 4273 -3443 -2477
822b477o02M911O222r863q431J0050J0208p761j3609O446J3661o089r530M576
$$ -2477 -3079 1832 8054 -1809 -10240 -190 10018 2257 -11352 -4906 8755 2666 -6864 -2288
836b288K348j95M279n719o540Q117Q243p916j0438O878J2092p336r508P634L290
$$ -2288 60 -135 4144 -1575 -8115 2 8245 329 -10109 -3231 8861 1525 -7983 -349 2941
851B941m335L894j662p389O921P377p763q161Q399Q643q193p577Q923K584o865
$$ 2941 -1394 2500 838 -6551 370 7747 -16 -8177 222 8865 672 -6905 2018 4602 -2263
866b263M069J373q069N052P859q365o341R131M515q090l734Q007Q04p278M391
$$ -2263 1806 3179 -4890 162 8021 -344 -6685 2446 6961 -1129 -4863 3144 3948 -3330 1061
881A061K821q747M151P103q218l941Q420J544o938m58N786q60n709M027L039o875
$$ 1061 3882 -4865 -714 6389 -1829 -5770 2650 4194 -2744 -3202 2584 1724 -3985 42 3081 -3794
897c794J533P026o913l270Q031o35n729J838L672j598l342L016K791n951P19O989
$$ -3794 -2261 4765 -2148 -5418 2613 1978 -3751 -1913 1759 161 -3181 -165 2626 -3325 -2606 4383
913D383m878l775N696P16n047K545K167k340j287K919J984m962p80O623k039n493
$$ 4383 -495 -4270 1426 2142 -2905 -360 1807 -533 -1820 1099 3083 -1879 -2659 3964 1925 -3568
929c568M784J689m199J647K056k930n20L079Q05m301j332O685o62p111L874L843
$$ -3568 1216 2905 -1294 353 2409 -521 -1041 2038 2843 -1458 -2790 3895 3233 -3878 -4 3839
945C839m828J87L032l126q81L901l19m523k3O249p93q044M048N530n739r29M062
$$ 3839 -989 -802 2230 -896 -1777 2124 1805 -2718 -2741 3508 2715 -5329 -1281 4249 -1490 -2419 1643
962A643k943j106M290p70n022J385N989k192o862M161N831o063j909N537k757
$$ 1643 -1300 -2406 1884 1114 -3908 -2523 3466 1274 -5588 -1427 4404 -1659 -3568 1969 -788
977g88j648M871j795m448L074M809l265n811M463N592o017k392O065j949k617
$$ -788 -2436 2435 640 -3808 -734 4075 810 -5001 -538 5054 -963 -3355 2710 761 -1856
992a856M575j643m100M151K951m034l376M555L670n442k669N793n57l437L319
$$ -1856 2719 1076 -3024 1127 4078 44 -3332 1223 4893 -549 -3218 2575 2018 -1419 1900
1007A900j017l733M417J870m990j433M387J965m471k470N302M75m757K344R49
$$ 1900 883 -2850 1567 3437 -1553 -2986 1401 3366 -1105 -3575 1727 2202 -2555 -211 738
1022G38k967K705J638m453l36M309J96m047j564N229P34n139P14L522k557R69
$$ 738 -2229 476 2114 -2339 -2675 1634 1830 -2217 -3781 1448 2182 -2957 -2243 1279 -1278 -309
1038c09J480l567N11M108r28l818l02N208L57n784O55N327k760j175K224k349
$$ -309 1171 -2396 -1885 2223 1295 -2523 -2825 2383 2740 -3044 -2389 2938 178 -997 1227 -1122
1054a122K61M077j837m243J727M631n81n789J408N685k750l468K964m67o18K912
$$ -1122 -861 3216 1379 -2864 -1137 3494 2913 -2876 -1468 4217 1467 -2001 963 496 -122 2790
1070B790j946l959L411L713k879m995K967N266l421m484L696Q60j411K248k489
$$ 2790 844 -3115 296 4009 1130 -3865 -898 4368 947 -3537 159 1019 -392 1856 -633
1085f33l160N058K430n238l127M418M384l992m854L594L146k186K11j533j749
$$ -633 -3793 1265 3695 -1543 -4670 -252 4132 140 -4714 -1120 2026 -160 51 -1482 -3231
1100c231M972J573o418j392N549K665m248m209L978M267l169j754Q1R5M199K66
$$ -3231 1741 3314 -3104 -4496 1053 3718 -530 -4739 -761 3506 337 -1417 -1336 -1241 2958 3224
1116C224o785n2O883P22m996l011M506M449l703l587J348J648K670q11o308J430
$$ 3224 -3561 -3613 3270 3992 -1004 -4015 491 4940 1237 -2350 -1002 646 3316 2505 -3803 -2373
1132b373P152o97o474j378N500L506m987m222L230K971M30k144m874K358P505
$$ -2373 4779 4082 -2392 -3770 1730 5236 249 -3973 -743 2228 2658 514 -4360 -2002 5503
1147E503k374p862J034O526J695o117l505M681L454j734k646k902K487P255l539
$$ 5503 3129 -4733 -3699 2827 4522 -1595 -5100 -419 3035 1301 -1345 -4247 -1760 5495 1956
1162A956q287K799P913q62o975j689N789L123l336l284n25L340N586m510p987
$$ 1956 -6331 -3532 4381 3519 -3456 -5145 644 3767 431 -2853 -3378 -38 5548 1038 -6949
1177f949M615Q250k573p663J68O367K684n032k978J247L749L336m881o853N821
$$ -6949 -2334 5916 3343 -4320 -4152 2215 4899 -133 -3111 -1864 1885 5221 340 -6513 -692
1192f92Q275n338p586K652O728J185o521k543L730L610J91m896m487O352P209
$$ -692 7583 2245 -5341 -2689 4039 5224 -1297 -3840 -110 3500 3691 -1205 -5692 660 7869
1207G869p120p345M863O506r58o814j840N516L197k259m668j898O173N311p436
$$ 7869 749 -6596 -1733 4773 3815 -2999 -4839 677 3874 1615 -3053 -4951 1222 6533 -903
1222i03o563O465O387l084o526n24O324K528m240m038N03N934L019p158n075P255
$$ -903 -7466 -1001 5386 2302 -4224 -4748 1576 4104 -136 -4174 -3671 2263 5282 -1876 -6951 304
1238C04N677m839o242J555O497J531n174l701L167M653J015o629l781Q006M832
$$ 304 5981 1142 -5100 -3545 2952 4483 -691 -4392 -1225 3428 4443 -2186 -5967 2039 6871
1253F871o604n483L905N677n36n554k391M759L672j451n488k158Q016L261q042
$$ 6871 267 -5216 -1311 4366 3830 -1724 -4115 644 4316 2865 -2623 -4781 3235 6496 -1546
1268a546m035N696M847k637n197o69M911K933l106n117J40P193K067q543k464
$$ -1546 -5581 115 4962 2325 -2872 -3541 1370 4303 1197 -3920 -3780 3413 5480 -3063 -5527
1283e527O879K931l605m383L63N001J950m479l740J816O321N31q030j321P685
$$ -5527 1352 4283 678 -3705 -3342 1659 3609 -870 -4610 -2794 3527 4058 -3972 -5293 2392
1298B392J557n076k722J826M314O42m696k472L505M440r60o608n07Q062Q20o518
$$ 2392 3949 -1127 -3849 -2023 2291 2933 -1763 -4235 -730 3710 2750 -3858 -4365 3697 4517 -2001
1314b001j738L849L348r02m450j268M249L013k641n090J312O767j78p049q3M299
$$ -2001 -3739 110 3458 2556 -1894 -3162 1087 4100 1459 -3631 -2319 4448 4270 -2779 -2862 1437
1330A437J969j820l732m63M613J606l434l592J676N710j093o416N43N273J46k738
$$ 1437 3406 1586 -2146 -2609 2004 3610 176 -3416 -1740 3970 2877 -3539 -2996 2277 2423 -315
1346c15k175R09L229O32l677k210K708M134k050n193J316N084n93l375n24Q68
$$ -315 -2490 -1581 1648 2280 -1397 -3607 -899 3235 1185 -4008 -2692 2392 1799 -1576 -2100 -1232
1362a232K796j11l105j063K536K999k261m267K030M841j720l883Q67J970R67j03
$$ -1232 1564 1453 -1652 -2715 -179 2820 559 -3708 -1678 3163 1443 -2440 -1573 397 1364 1261
1378A261k708k04L049J521k705l053K395L860k185l430J884J555J34j25k325P6
$$ 1261 -1447 -1651 1398 2919 214 -2839 -444 3416 1231 -2199 -315 1240 1374 1249 -1076 -1000
1394a000K702L71k667j579K374K926k621k869K450J505r99n40q56k60K482K1k715
$$ -1000 1702 2073 -594 -2173 201 3127 506 -2363 87 1592 593 53 -803 -1063 1419 1440 -1275
1411a275n07K030J634k043k537K382J778j799m63K19k58J462k02j741J21J378
$$ -1275 -1782 248 1882 -161 -2698 -316 1462 -337 -800 -581 -839 623 421 -1320 -1199 179
1427A79R13j693j357J986J426k228m40J311n53O61M19j531J8J865j83j150r56
$$ 179 1092 -601 -1958 28 1454 -774 -1214 97 -456 205 624 -907 -889 976 793 -357 -1313
1444a313J772R83k040j17J609m96m33R64j155L0J452l60j357J87R13O70j469m21
$$ -1313 459 1442 -598 -715 894 398 -35 929 -226 -196 1256 896 -461 -274 639 1309 -160 -581
1462e81J841m07j278J104n12p70J241k0j151J49R27N3j140o7J732j158j164J648
$$ -581 1260 853 -425 679 167 -603 638 618 -533 -384 543 596 -544 -611 1121 -37 -1201 447
1480D47mj658J174K02j154M91Q03o11n61N60P76r31j082J573M33j600Q02Q03j063
$$ 447 443 -1215 -41 161 -993 -502 301 -310 -871 -311 465 -466 -1548 25 458 -1142 -340 463 -600
1499f00L10M08o06J1Q12Q7m56n73J564R3j873M45J390j034k38Q85o55L28M52l70
$$ -600 -290 118 -488 -477 335 422 -34 -607 957 1050 -823 -378 1012 -22 -260 625 -30 298 750 380
1519C80p02R0J183J63j768M23J744r68q33R31k16o07Q06m42p33N74O25l3j601
$$ 380 -322 -232 951 1114 -654 -231 1513 545 -288 643 427 -180 626 184 -549 25 650 617 -984
1538i84K12J729q32r54Q46J26l37O48r52M9M15L92n12j051N13J608p94j694J405
$$ -984 -772 957 125 -829 17 143 -194 454 -498 -449 -34 358 -154 -1205 -692 916 122 -1572 -167
1557a67L85n65J3K7p18J336k9p04m77M92J364q83j131J017R49j190K6L91m43Q13
$$ -167 218 -347 -334 -307 -1025 311 282 -422 -899 -407 957 74 -1057 -40 909 -281 -255 136 -307 506
1577E06K04j062P9P95O94j025r29R00J312j754L9R22o44M88K48j304N19P34K47
$$ 506 710 -352 -273 522 1216 191 -738 162 1474 -280 -241 681 37 525 773 -531 -12 722 969
1596I69j071n21J201O67j700j16J107n21j5K40r18K67R16m18q74J15Q82L84j304
$$ 969 -102 -623 578 1245 -455 -571 536 15 0 240 -678 -411 505 87 -787 -672 210 594 -710
1615g10k70J535o15o78N54k89N0R63j014l59O07O85k7j066r2J459l94j108N35
$$ -710 -980 555 -60 -738 -184 -473 -423 540 -474 -833 -226 459 432 -634 -726 733 339 -769 -234
1634b34K20j01M37m47l48Q57L69o61n25M08R43m76j238P32Q21m14j58m5m11Q87
$$ -234 -14 -115 322 -125 -473 384 753 92 -433 -25 918 442 -796 -64 757 343 185 140 -271 616
1654F16K39o36q04R85Q12q94j142J020J039j258j02K8Q8N72n4j050Q7R55K75j209
$$ 616 855 219 -585 400 1212 318 -824 196 1235 -23 -125 -97 -9 563 509 -541 -454 501 776 -433
1674d33j126J668R01j472p18J371k84K53j42j036O4J637m50j157n07J710R66j877
$$ -433 -1559 109 1010 -462 -1180 191 -93 160 18 -1018 -954 683 233 -924 -1431 279 1245 -632
1692f32p28J693J68n73n4q66O93J269n69j452J94J672M35j858n54J971O91j425
$$ -632 -1360 333 501 -72 -126 -992 -299 970 401 -1051 -857 815 1250 -608 -1162 809 1500 75
1710G5n70J19P92R48j050j627J185J395N4k195k83K063Q52k062n54O99J067L48
$$ 75 -495 -376 416 1364 314 -1313 -128 1267 1321 -874 -1157 906 1758 -304 -858 -159 908 1256
1728A256j556r86J495J531j199j814j31K647K53k740m7J326R16n01j397p05J943
$$ 1256 -300 -1286 209 1740 541 -1273 -1404 1243 1496 -1244 -1291 35 951 450 -947 -1652 291
1745B91J278k144j221J022K096j32k762j51K440K93j345j121l2K345P62k573r45
$$ 291 1569 -575 -1796 -774 1322 1190 -1572 -1723 717 1010 -335 -1456 -1488 857 1619 -954 -1899
1762a899J814J430m81k286q2K714N7j503q37P06J846L77k890n67K428J460j857
$$ -1899 -85 1345 864 -1422 -1504 1210 1267 -236 -1073 -367 1479 1856 -1034 -1601 827 2287 430
1779D30k112R31K885p37k229j45J161J545j77k718o19L284N38k486j411J789J811
$$ 430 -1682 -751 2134 1397 -832 -977 184 1729 1552 -1166 -1785 1499 2037 -449 -1860 -71 1740
1796A740o12k578Q3K030R27j137k163RL199K31l162o88K252J712j437k635Q74
$$ 1740 1128 -1450 -1367 663 1590 453 -1710 -1701 1498 1729 -1433 -2121 131 1843 406 -2229 -1355
1813a355K385J97j335j909P64L194n42l349l71L024J009j943j586J079K413m90
$$ -1355 1030 1227 -108 -2017 -1253 1941 1399 -1950 -2321 703 1712 -231 -1817 -738 1675 1185
1829A185k090q03J274K368p72l285M52L548J20k346j648J760K735j621j892M3
$$ 1185 -905 -1708 -434 1934 1162 -2123 -1671 1877 1997 -349 -1997 -237 2498 877 -1015 -972
1845i72J490J587j040k860N83L409l78k665q39K009J681j439k178O71J621N99
$$ -972 518 2105 1065 -1795 -1212 2197 1819 -846 -1685 324 2005 566 -1612 -941 680 1279
1861A279j144k220R65L204o00l365l09K854J416j997k068J327K129l96j531j506
$$ 1279 135 -2085 -1120 2084 1484 -1881 -2190 664 2080 83 -1985 -658 1471 1075 -456 -1962
1877a962J387K639j263l110J018K479K20k067j592J810J710o61j870l16J436J932
$$ -1962 -575 2064 801 -2309 -1291 1188 1408 -659 -2251 -441 1269 608 -1262 -1578 -142 1790
1893A790j031l186J752K489n82j913j024J917J671j210j764L55J575Q49j454k029
$$ 1790 759 -2427 -675 1814 1232 -681 -1705 212 1883 673 -1091 -736 839 1688 234 -1795
1909a795J466K616j223k308K49J596J233j624j641R83J850j42j791j183J766K257
$$ -1795 -329 2287 1064 -1244 -995 601 1834 210 -1431 -448 1402 1260 -531 -1714 52 2309
1925B309k030j732Q61J484L75j474j308J108J368l88j518n78J330J787j887j711
$$ 2309 279 -1453 -592 892 1267 -207 -1515 -407 961 573 -945 -1523 -193 1594 -293 -2004
1941b004J606J399m31j147n00Q30J271r10j217K40J251Q29j602j594J787J521
$$ -2004 -398 1001 570 -577 -1077 -247 1024 114 -1103 -863 388 1217 -385 -1979 -192 1329
1957A329j144p46m2Q44J025j245j056P99J266Q6j319r10J430J040j335o11M58
$$ 1329 185 -561 -603 241 1266 21 -1035 -236 1030 1116 -203 -1113 317 1357 22 -589 -131
1974a31O71L70n57r87P51P27p2j063n54J582M68j379n70R69L97k81l77q28R88
$$ -131 540 910 353 -634 117 844 772 -291 -845 737 1205 -174 -744 225 622 341 -36 -864 124
1993A24M22l53n46m21R40P22j490m91J397pn95k9k22N16M44r52K0J00N68J09r50
$$ 124 546 193 -353 -774 166 888 -602 -1093 304 297 -298 -327 -549 -33 411 -541 -521 -421 147 256 -694
2014f94j31J352j09r89M59K2J08J93n18M5M21k2J40p78J30J187l20j128Q90L40
$$ -694 -825 527 418 -571 -112 -90 18 211 -307 -262 159 137 277 -501 -371 816 496 -632 258 598
2034E98o27K80j2l52P55o13K11k75L4P36n29n08O32M16o97J0M01p58O89l46k25
$$ 598 -29 251 239 -113 642 29 240 -35 -1 735 206 -302 330 746 49 59 460 -298 391 45 -180
2055a80K39N9L6j70o29O92P86j207j64Q14n53K70R9n76N51p8K0k01j64O22J59
$$ -180 59 118 154 -16 -645 47 833 -374 -538 276 -277 -7 92 -484 67 -11 9 -192 -356 266 425
2076D25j260M2J432n61n33K08k00K32Q4j05j76L10L25L19j153j51J437m87r08
$$ 425 -835 -793 639 78 -455 -247 -447 -215 -131 -236 -412 -102 223 542 -611 -762 675 188 -720
2095g20N77K42k6O04p67j38N64K53k04q96J19J465m96j189P34O27q50L70m06J28
$$ -720 -143 99 73 677 -90 -228 336 589 385 -511 -392 1073 577 -612 122 749 -101 269 -137 -9
2115iM91O3o83l93N68P97n81j338R22P85o14j36K0j92M82j59n88L27l0M95J02
$$ -9 482 545 -138 -531 37 834 253 -1085 -163 622 8 -128 -108 -300 182 23 -565 -238 -268 227 329
2136C29j464Q74J133r25m92L82j32M08j27n98M24M94J13o73m21N29R45q08o68
$$ 329 -1135 -261 872 -53 -545 -163 -295 113 -14 -612 -188 306 419 -254 -675 -146 799 -9 -677
2155f77P39Q4J20q5p41M00O36l59l09qM31O49q41o42P71L82m39Jj73K30P06p10
$$ -677 62 146 266 181 -560 -160 476 117 -192 -200 231 880 39 -603 168 550 111 112 -61 169 875 165
2177A65l35J14L97K42q15n35J191K72q53L64l54R0N60k76r18M80N86l20l59k67
$$ 165 -170 -56 341 583 -232 -767 424 696 -157 207 -147 -57 503 227 -691 -211 375 55 -304 -571
2197e71P06M19j297K64O63m09L1o3l97L78M82k37j49m16O06L41r77J96P63n89
$$ -571 135 554 -743 -479 184 -225 -194 -257 -654 -276 206 -31 -180 -596 10 351 -626 -430 333 -256
2217b56k9j15j5O93J77m97q8K25N7L08j033M02J090o19p80N81KK73J52p51J36
$$ -256 -285 -400 -415 278 455 -42 -130 95 152 460 -573 -171 919 300 -480 101 103 376 528 -223 -87
2238h7L93n2p1m04J39Q18l92r60Q52o4j03J49l62J64O65l80o70K45L89L47o26
$$ -87 306 254 183 -221 -82 736 344 -616 236 172 69 218 -144 20 685 305 -365 -120 269 616 -10
2259a0p77Q98L25p16L0j68L35N32o24n50Q79K9j61k30q06J161L92r46k47M26J10
$$ -10 -787 111 436 -280 -250 -418 -83 449 -175 -725 154 183 22 -208 -1014 147 539 -407 -654 -228 -118
2280a18P06q25o21J066L97n42m11l57J461K23j440j78J054K33l76m17n90J061
$$ -118 588 -237 -858 208 605 63 -348 -705 756 979 -461 -639 415 648 272 -145 -735 326
2298C26O21q37n48K59J017P2j445p6J435l13k25n75N9N13O68j174o60R94O92m29
$$ 326 947 110 -438 -179 838 910 -535 -611 824 511 286 -289 -230 283 951 -223 -883 111 803 374
2318C74j101R0J399O5j572N2K44O59Q18j545n89J355O43o57j218L2J753j2j871
$$ 374 -727 -637 762 827 -745 -693 -449 210 1028 -517 -1106 249 892 235 -983 -951 802 790 -1081
2337a081M35Q59o0K17j235j63J704K98j243n89L24J406O9j938J29J224K03m72
$$ -1081 -646 213 153 370 -865 -1028 676 974 -269 -858 -534 872 941 -997 -868 356 559 87
2355H7p10o4J491N6j435k61P90J123p58j121L5K178p97r69m55M78J351j17j547
$$ 87 -623 -687 804 860 -575 -836 -46 1077 319 -802 -767 1411 614 -355 -810 -332 1019 902 -645
2374f45m21J513O12r08j296L97J745j56j392o9P13P25J1j963J39J593N70j400
$$ -645 -1066 447 1059 151 -1145 -748 997 841 -551 -620 93 818 829 -1134 -995 598 1168 -232
2392b32r47Q08J366m41j596L36P51Q02m70j648K49J957K75j929k39O08J674r88
$$ -232 -1179 -371 995 554 -1042 -706 45 847 377 -1271 -1022 935 1210 -719 -958 -350 1324 336
2410C36j465M61J291K85o70j348N46J955n59j677j16J422N96p04j340L35J564
$$ 336 -1129 -668 623 908 238 -1110 -564 1391 832 -845 -961 461 1057 353 -987 -652 912
2427I12p9j038m16K72J619o26j662K56J511L5m50j335Q40J406p95j287L49M92
$$ 912 833 -205 -621 -349 1270 644 -1018 -762 749 784 334 -1001 -161 1245 450 -837 -488 4
2445DQ94l28j889O00J676r4j085p61P18J488p95j808P21J133J83p50j129M19J929
$$ 4 898 570 -1319 -719 957 863 -222 -983 -265 1223 428 -1380 -659 474 657 -93 -1222 -803 1126
2464A126o36j387K18O99P81l41j607Q27P13R4l89j089P80J367p55j540O93J113
$$ 1126 490 -897 -679 20 801 460 -1147 -320 393 487 98 -991 -211 1156 401 -1139 -446 667
2482F67J38r55p34P98J203o53q17k56Q65R35j061j401Q30J385k71q51m55Q21J029
$$ 667 805 -150 -884 -86 1117 464 -353 -609 256 1191 130 -1271 -441 944 673 -178 -633 188 1217
$$ [...]
8191H0
##END NTUPLES=NMR FID
##END=
