##TITLE=1H_Pr C8-H2O
 CDCl3
 8 sc, 
 18.11.2022
##JCAMPDX= 6.0         $$ Bruker NMR JCAMP-DX V2.0
##DATA TYPE= NMR FID
##DATA CLASS= NTUPLES
##ORIGIN= UXNMR, Bruker Analytische Messtechnik GmbH
##OWNER= root
$$ XWIN-NMR		Version 3.5
$$ Fri Nov 18 16:36:23 2022 Russian Standard Time (UT+4h)  she@DPX200
##.OBSERVE FREQUENCY= 200.1313499994
##.OBSERVE NUCLEUS= ^1H
##.DELAY= (6, 6)
##.ACQUISITION MODE= SIMULTANEOUS
##.ACQUISITION SCHEME= undefined
##.AVERAGES= 8
##.DIGITISER RES= 18
##SPECTROMETER/DATA SYSTEM= spect
##.PULSE SEQUENCE= zg30
##.SOLVENT NAME= CDCl3
##.SHIFT REFERENCE= (INTERNAL, CDCl3, 0, 15.7039)
##AUDIT TRAIL= $$ (NUMBER, WHEN, WHO, WHERE, WHAT)
$$ ##TITLE= Audit trail, XWIN-NMR		Version 3.5
$$ ##JCAMPDX= 5.01
$$ ##ORIGIN= Bruker BioSpin GmbH
$$ ##OWNER= she
$$ F:/spectra/data/she/nmr/H-F/1/audita.txt
$$ ##AUDIT TRAIL=  $$ (NUMBER, WHEN, WHO, WHERE, WHAT)
(   1,<2022-11-18 16:34:40.79 +0400>,<she>,<DPX200>,
      <created by zg, POWCHK disabled, PULCHK disabled
       configuration hash MD5:
       00 E9 B6 7A A2 85 ED C7 34 08 36 98 17 FE 4E 26
       data hash MD5: 16K
       9D 7D B9 D3 CE 9A 57 DD 46 91 89 64 07 C1 8E 07>)
$$ ##END=
$$ 
$$ hash MD5
$$ 34 F4 5F 07 94 26 9F 7B A4 87 BE DE BB AE C2 C6
##$RELAX= 
##$RELAX= 
##$RELAX= 
##$RELAX= 
##$RELAX= 
##$RELAX= 
$$ Bruker specific parameters
$$ --------------------------
##$DU= <F:/spectra>
##$EXPNO= 1
##$NAME= <H-F>
##$PROCNO= 1
##$TYPE= <nmr>
##$USER= <she>
##$AMP= (0..31)
100 100 100 100 100 100 100 100 100 100 100 100 100 100 100 100 100 100 
100 100 100 100 100 100 100 100 100 100 100 100 100 100 
##$AQSEQ= 0
##$AQ_mod= 1
##$AUNM= <au_zg>
##$AUTOPOS= <>
##$BF1= 200.13
##$BF2= 200.13
##$BF3= 200.13
##$BF4= 200.13
##$BF5= 200.13
##$BF6= 200.13
##$BF7= 200.13
##$BF8= 200.13
##$BYTORDA= 1
##$CFDGTYP= 0
##$CFRGTYP= 5
##$CHEMSTR= <none>
##$CNST= (0..31)
1 1 145 1 1 1 1 1 1 1 1 1 1 1 1 1 1 1 1 1 1 1 1 1 1 1 1 1 1 1 1 1 
##$CPDPRG= <>
##$CPDPRG1= <>
##$CPDPRG2= <>
##$CPDPRG3= <>
##$CPDPRG4= <mlev>
##$CPDPRG5= <mlev>
##$CPDPRG6= <mlev>
##$CPDPRG7= <mlev>
##$CPDPRG8= <mlev>
##$CPDPRGB= <>
##$CPDPRGT= <>
##$D= (0..31)
0 1.2 0 0 0 0 0 0 0 0.06 0 0.03 0 0 0 0 0.0002 0 0 0 0 0 0 0 0 0 0 0 0 
0 0 0 
##$DATE= 1668774880
##$DBL= (0..7)
120 120 120 120 120 120 120 120 
##$DBP= (0..7)
150 150 150 150 150 150 150 150 
##$DBP07= 0
##$DBPNAM0= <>
##$DBPNAM1= <>
##$DBPNAM2= <>
##$DBPNAM3= <>
##$DBPNAM4= <>
##$DBPNAM5= <>
##$DBPNAM6= <>
##$DBPNAM7= <>
##$DBPOAL= (0..7)
0.5 0.5 0.5 0.5 0.5 0.5 0.5 0.5 
##$DBPOFFS= (0..7)
0 0 0 0 0 0 0 0 
##$DE= 6
##$DECBNUC= <off>
##$DECIM= 32
##$DECNUC= <off>
##$DECSTAT= 4
##$DIGMOD= 1
##$DIGTYP= 9
##$DL= (0..7)
0 120 120 120 120 120 120 120 
##$DP= (0..7)
150 150 150 150 150 150 150 150 
##$DP07= 0
##$DPNAME0= <>
##$DPNAME1= <>
##$DPNAME2= <>
##$DPNAME3= <>
##$DPNAME4= <>
##$DPNAME5= <>
##$DPNAME6= <>
##$DPNAME7= <>
##$DPOAL= (0..7)
0.5 0.5 0.5 0.5 0.5 0.5 0.5 0.5 
##$DPOFFS= (0..7)
0 0 0 0 0 0 0 0 
##$DQDMODE= 0
##$DR= 18
##$DS= 0
##$DSLIST= <SSSSSSSSSSSSSSS>
$$ [...]
##$SUBNAM2= <"">
##$SUBNAM3= <"">
##$SUBNAM4= <"">
##$SUBNAM5= <"">
##$SUBNAM6= <"">
##$SUBNAM7= <"">
##$SUBNAM8= <"">
##$SUBNAM9= <"">
##$SW= 18.0517283424941
##$SWIBOX= (0..15)
0 0 2 0 0 0 0 0 0 0 0 0 0 0 0 0 
##$SW_h= 3612.71676300578
##$TD= 16384
##$TD0= 1
##$TE= 0
##$TE2= 300
##$TE3= 300
##$TEG= 300
##$TL= (0..7)
0 120 120 120 120 120 120 120 
##$TP= (0..7)
150 150 150 150 150 150 150 150 
##$TP07= 0
##$TPNAME0= <>
##$TPNAME1= <>
##$TPNAME2= <>
##$TPNAME3= <>
##$TPNAME4= <>
##$TPNAME5= <>
##$TPNAME6= <>
##$TPNAME7= <>
##$TPOAL= (0..7)
0.5 0.5 0.5 0.5 0.5 0.5 0.5 0.5 
##$TPOFFS= (0..7)
0 0 0 0 0 0 0 0 
##$TUNHIN= 0
##$TUNHOUT= 0
##$TUNXOUT= 0
##$USERA1= <user>
##$USERA2= <user>
##$USERA3= <user>
##$USERA4= <user>
##$USERA5= <user>
##$V9= 5
##$VALIST= <valist>
##$VCLIST= <CCCCCCCCCCCCCCC>
##$VD= 0
##$VDLIST= <DDDDDDDDDDDDDDD>
##$VPLIST= <PPPPPPPPPPPPPPP>
##$VTLIST= <TTTTTTTTTTTTTTT>
##$WBST= 1024
##$WBSW= 4
##$XGAIN= (0..3)
0 0 0 0 
##$XL= 0
##$YL= 0
##$YMAX_a= 248037
##$YMIN_a= -471282
##$ZGOPTNS= <>
##$ZL1= 120
##$ZL2= 120
##$ZL3= 120
##$ZL4= 120
##$ABSF1= 10
##$ABSF2= 0
##$ABSG= 5
##$ABSL= 3
##$ALPHA= 0
##$AQORDER= 0
##$ASSFAC= 0
##$ASSFACI= 0
##$ASSFACX= 0
##$ASSWID= 0
##$AUNMP= <proc_1d>
##$AZFE= 0.1
##$AZFW= 0.1
##$BCFW= 1
##$BC_mod= 2
##$BYTORDP= 1
##$COROFFS= 0
##$CY= 11.3945322036743
##$DATMOD= 1
##$DC= 2
##$DFILT= <>
##$DTYPP= 0
##$F1P= 2.36226072786647
##$F2P= -0.459571619588291
##$FCOR= 0.5
##$FTSIZE= 0
##$FT_mod= 4
##$GAMMA= 1
##$GB= 0.15
##$INTBC= 1
##$INTSCL= 1
##$ISEN= 128
##$LB= 0.24
##$LEV0= 0
##$LPBIN= 0
##$MAXI= 10000
##$MC2= 0
##$MEAN= 0
##$ME_mod= 0
##$MI= 1.114404
##$NCOEF= 0
##$NC_proc= 0
##$NLEV= 6
##$NOISF1= 3.799351
##$NOISF2= 2.8
##$NSP= 1
##$NTH_PI= 0
##$NZP= 0
##$OFFSET= 15.70392
##$PC= 1
##$PHC0= -18030.89
##$PHC1= 12.2007
##$PH_mod= 1
##$PKNL= yes
##$PPARMOD= 0
##$PSCAL= 0
##$PSIGN= 0
##$REVERSE= no
##$SF= 200.130013532006
##$SI= 16384
##$SIGF1= 3
##$SIGF2= 2
##$SINO= 400
##$SIOLD= 16384
##$SREGLST= <1H.CDCl3>
##$SSB= 0
##$STSI= 0
##$STSR= 0
##$SW_p= 3612.71676300578
##$SYMM= 0
##$S_DEV= 0
##$TDeff= 0
##$TDoff= 0
##$TI= <>
##$TILT= no
##$TM1= 0
##$TM2= 0
##$TOPLEV= 0
##$USERP1= <user>
##$USERP2= <user>
##$USERP3= <user>
##$USERP4= <user>
##$USERP5= <user>
##$WDW= 1
##$XDIM= 8192
##$YMAX_p= 0
##$YMIN_p= 0
$$ End of Bruker specific parameters
$$ ---------------------------------
##NTUPLES= NMR FID
##VAR_NAME=  TIME,          FID/REAL,        FID/IMAG
##SYMBOL=    X,             R,               I
##VAR_TYPE=  INDEPENDENT,   DEPENDENT,       DEPENDENT
##VAR_FORM=  AFFN,          ASDF,            ASDF
##VAR_DIM=   8192,          8192,            8192
##UNITS=     SECONDS,       ARBITRARY UNITS, ARBITRARY UNITS
##FACTOR=    0.0002768,     1,               1
##FIRST=     0,             0,               0
##LAST=      2.2672688,     0,               0
##MIN=       0,             -471282,         0
##MAX=       2.2672688,     248037,          0
$$ Real data points
##PAGE= N=1
##DATA TABLE= (X++(R..R)), XYDATA
0 0 0 0 0 0 0 0 0 0 0 0 -8 8 -8 16 -16 24 -24 32 -40 48 -57 72 -88 101 -120 136 -160 184 -216 247 -280 320
32 320 -364 412 -465 524 -588 660 -738 823 -916 1019 -1131 1252 -1385 1529 -1688 1861 -2051
49 -2051 2259 -2489 2743 -3022 3335 -3685 4078 -4524 5039 -5633 6334 -7173 8197 -9485
63 -9485 11154 -13416 16672 -21784 31017 -52924 218104 -3286 -337618 201508 178595 -110026
75 -110026 -29275 54762 -157844 -6808 152460 -89758 -179544 113861 83103 -129827 -63163
86 -63163 47965 56 38076 -4466 -130965 -7834 167169 -12598 -145717 22926 70987
97 70987 -38912 31993 56522 -71116 -5968 122310 -542 -54964 75971 27504 -86910
108 -86910 30758 72877 -79842 -49476 72732 -27956 -87103 36590 37228 -44519 -5831
119 -5831 1293 -33928 34553 46713 -55551 -35776 41510 -6762 -8463 52388 -36324 -71625
131 -71625 93626 81461 -99921 -20756 127384 -5255 -91218 54034 56840 -72707 -19393
142 -19393 40211 -51823 -31609 61279 -19362 -75340 30708 46181 -27461 4216 28512 -25041
154 -25041 2576 45557 -20126 -29659 36348 -10189 -55149 28519 35274 -49191 -17190 35941
166 35941 -10091 -3097 44178 -12719 -36848 47507 32587 -49265 4479 48946 -32471 -33976
178 -33976 41068 5863 -35393 16627 11706 -37954 8361 37897 -29784 -31861 24720 -3724
190 -3724 -27406 14773 -3760 -36227 15369 25320 -28922 -2411 40867 -7836 -18069 42887
202 42887 20612 -29346 15739 31150 -23363 -6766 30912 -12530 -26727 16569 2045 -27643
214 -27643 8148 13908 -28147 -9821 20451 -13195 -19158 12732 -6638 -23238 10165 7157 -20741
227 -20741 4106 19679 -9632 -277 29972 3643 -9630 25657 17763 -11022 11396 15060 -17626
240 -17626 -1576 19899 -15589 -25219 12372 1854 -29010 -3549 10041 -16635 -8165 7913
252 7913 -15324 -9633 20339 -525 -22224 7459 16732 -7284 1779 15135 -2931 3842 23547
265 23547 -1378 -10800 21953 14170 -16454 1102 14323 -9958 -9036 8129 -9824 -16904 9245
278 9245 -148 -24510 -1299 11741 -13407 -9275 9758 -4616 -9372 9565 2593 -10338 7667
291 7667 11085 -8868 1701 16976 -1866 -3420 16047 3654 -7193 11206 8510 -10117 2279
304 2279 10582 -10306 -9215 10160 -4431 -17401 3673 2845 -15625 -3559 5661 -10389 -6424
317 -6424 7795 -3790 -9608 8073 5523 -8838 3615 11231 -3543 1352 12448 -924 -2078
330 -2078 12989 4488 -6559 7129 9164 -7276 -1590 9076 -5227 -8231 6290 -3004 -14083
343 -14083 805 1970 -12772 -5404 4027 -7758 -8173 5655 -94 -8381 4995 6753 -5408 2831
357 2831 10224 -485 1707 11011 1779 -2750 8649 6250 -4399 2664 6575 -5266 -3105 5722
371 5722 -4430 -7786 3629 -1139 -11243 -2611 456 -8511 -4741 2973 -5371 -7987 4619 2306
385 2306 -5558 3882 6540 -1098 3615 8353 1 950 10180 3609 -4482 3104 6257 -2443 488
400 488 3880 -5463 -3291 5963 -3011 -9635 519 2158 -6642 -5573 -1420 -5339 -2901 3176 -4288
415 -4288 -6716 4740 4589 -3897 1033 5829 1314 3354 6337 401 -1020 7935 6088 -4030 -609
430 -609 4734 -435 -874 1445 -2654 -1844 2848 -1472 -6353 -1074 1866 -4395 -4119 -479 -5473 -4226
446 -4226 3151 -1197 -6426 602 4497 -152 286 3664 2131 2778 5306 939 -537 5711 4314 -2023
462 -2023 2153 3982 -2000 -223 4189 -1231 -5122 1490 2558 -5347 -5446 -243 -2900 -4466 -2020 -3486
478 -3486 -3951 -1247 -2069 -974 2399 250 -2543 3177 7313 1208 -786 6504 5677 125 2881 3943
494 3943 417 2056 3578 -1568 -3088 1258 2171 -2563 -4599 -4761 -1747 2640 -2151 -12305 -5421
509 -5421 6070 180 -8896 -4893 2996 2970 732 -281 -46 4902 8520 1780 -2658 4112 8058 4914
525 4914 483 -3447 -433 8067 5267 -8544 -7942 6133 5816 -8384 -8864 -6 1046 -2713 -5055
540 -5055 -5587 -2495 848 -429 -3644 -2154 2378 3003 1642 -79 -59 6589 8278 -467 -2502 5399
556 5399 6833 437 -689 1635 519 -712 582 -1190 -2686 -1168 -2704 -2741 266 -2875 -6283 -138
572 -138 2481 -4170 -5588 1421 1693 -3371 -101 3097 137 1566 3976 833 511 5332 4717 870
588 870 515 1357 2523 4287 889 -4886 -1568 4836 -1812 -7052 409 2152 -4906 -4901 737 -918 -3708
605 -3708 -1216 -873 -3307 657 1718 -2907 -1130 3122 1260 361 3008 1891 1143 3493 2933 38
621 38 3074 4601 -1843 -2317 4338 2857 -3083 -2990 -1007 -750 292 -2594 -5403 -1757 1825 -2692 -6042
638 -6042 146 1718 -2967 -1617 975 -1058 827 3478 -765 -1854 4594 5812 -238 -520 4220
653 4220 3080 1920 2303 -545 295 2977 -951 -3840 848 1171 -4340 -3776 303 -2506 -3878 -131
669 -131 -1868 -4467 320 985 -3442 -1087 2766 194 -1281 2514 2589 211 2113 3741 629 2596
685 2596 4429 -210 -567 3625 1891 -1804 186 496 -2369 -1342 51 -3723 -3554 251 -2195 -4600
701 -4600 -211 -44 -3260 -683 1271 -1986 -644 3082 1031 -1408 2317 3320 -199 1868 3620
716 3620 875 1333 3769 962 -644 1858 2240 -1016 -541 293 -2460 -1969 61 -2936 -3849 151 -1086
733 -1086 -3994 -1581 369 -1942 -1121 944 -556 -1123 2406 1706 -995 2106 3554 62 990 3114
749 3114 1233 1156 2942 1161 -806 1450 1699 -1504 -640 679 -2208 -2935 -157 -2105 -3418 -1104
765 -1104 -1370 -3429 -1843 29 -1573 -1282 1454 322 -817 1937 2001 96 1672 2802 935 1331
781 1331 2433 1027 482 2580 2044 -858 260 1266 -1406 -1358 215 -2395 -2728 -959 -2240 -3587
797 -3587 -1677 -728 -2493 -2383 -17 -577 -599 1234 708 415 2228 2019 692 1953 2850 1247 1515 2200
815 2200 1352 394 1621 846 -851 459 604 -1818 -1221 -770 -2143 -2441 -1592 -1765 -2939 -1529 -972 -1820
833 -1820 -922 769 -174 211 1583 881 950 2155 2205 1005 1808 1862 710 1076 2107 956 -51 1098
851 1098 230 -536 214 -95 -1848 -1521 -940 -1569 -2222 -1355 -1105 -2378 -1283 -412 -1568 -382 779 -96
869 -96 523 1555 1087 948 1581 1887 1086 1484 1920 287 365 1875 735 -318 1022 8 -630 48 89
888 89 -1347 -1334 -170 -1580 -2216 -994 -1074 -1774 -955 -951 -1605 -272 683 -179 -135 1416 1209 692 1628 1696 900
909 900 1274 2118 478 382 1398 780 81 294 -32 -547 -337 -259 -1144 -1214 -664 -1645 -1975 -931 -1533 -2066
929 -2066 -517 -363 -1493 -559 593 638 245 1243 1547 610 1198 2005 1048 1431 1643 727 1027 1092 208 -255
949 -255 634 186 -1183 -1301 -117 -1437 -1698 -893 -1760 -2149 -975 -975 -1461 -1028 -31 -218 -223 565 505 779 1447
970 1447 1301 237 1934 2527 676 203 1666 1616 343 229 -8 -595 -205 19 -851 -1184 -988 -1226 -1032
989 -1032 -847 -1870 -1185 -151 -793 -1718 -771 886 -249 -782 591 1357 472 754 1121 915 993 1661 1358
1008 1358 1235 495 648 868 794 10 -704 -190 -350 -1423 -1358 -460 -1233 -1316 -1102 -1235 -1193 -893 -154 -545 -785
1029 -785 -276 192 315 826 172 686 1755 1071 736 1418 2153 1480 595 935 1291 555 531 -60 -250 -406
1049 -406 -1085 -1212 -1043 -1658 -1213 -869 -1183 -1409 -1250 -525 -361 -1189 -460 824 59 -18 661 1284 1265 958
1069 958 1027 1529 1208 1319 1299 1536 1180 498 150 199 -494 -526 -649 -1829 -1875 -1251 -1047 -1628 -1575 -1187 -607 -1036
1091 -1036 -561 -674 84 922 276 -89 1024 1253 1178 1209 1434 1515 1519 1116 860 677 946 1019 -235 -464 -444
1112 -444 -590 -857 -1144 -1586 -1675 -932 -1303 -1685 -1042 -210 -769 -490 503 503 168 518 816 513 913 644 748
1133 748 873 1035 1037 540 958 757 294 581 330 -288 6 -187 -1133 -1251 -653 -452 -1330 -1398 -545 -616 -1015
1154 -1015 -106 -111 30 627 256 -70 419 641 419 142 541 349 277 1151 574 245 1129 1128 55 367 750
1175 750 31 -459 -248 -290 -880 -748 -580 -1606 -782 -500 -680 -1094 -326 -386 -269 -209 401 296 152 367 110
1196 110 154 930 713 457 919 914 716 957 1032 551 643 571 167 -505 -233 -304 -1409 -1382 -755 -1309 -1664 -708
1218 -708 -781 -1053 -644 36 -601 -70 272 426 -42 511 637 408 1042 737 991 1046 1316 1139 855 854 918 139
1240 139 255 -88 -870 -822 -754 -1402 -1513 -1288 -1311 -1446 -1065 -690 -654 -855 169 215 -173 632 559 233 1188 1008
1262 1008 877 858 1090 956 908 1000 910 719 700 372 -144 -265 -355 -1137 -1488 -1270 -1353 -1389 -1091 -970 -1172 -818
1284 -818 -457 -197 -256 230 190 187 739 659 893 718 795 839 449 735 513 385 745 431 98 -137 220 -345
1306 -345 -604 -776 -659 -1092 -1107 -854 -1133 -959 -676 -518 -472 -117 280 108 253 601 579 238 622 824 459
1327 459 492 765 303 435 652 330 219 480 55 199 189 -95 -420 -582 -116 -494 -833 -718 -769 -916 -387
1348 -387 -254 -737 -197 -76 100 -128 432 414 274 669 920 505 412 424 659 454 404 663 557 401 260
1369 260 -32 -104 -272 -634 -673 -326 -813 -1111 -663 -735 -833 -667 -385 -300 -487 92 -127 -40 377 580 534 550 955
1392 955 579 472 723 855 600 708 805 200 260 387 -165 -494 -276 -778 -699 -784 -685 -939 -540 -627 -670 -462
1414 -462 -194 -145 -273 304 222 61 504 611 401 871 899 930 435 851 782 444 624 514 37 79 61 -230
1436 -230 -358 -499 -791 -749 -830 -826 -816 -766 -772 -708 -810 -189 -293 -213 370 335 405 403 567 514 752 550 589 581 596 509 405
1463 405 238 296 -202 -39 -209 -524 -776 -667 -372 -792 -774 -777 -578 -315 -609 -427 -72 -29 -236 56 325 -18
1485 -18 546 474 255 517 746 943 463 632 649 341 283 74 -115 312 0 -425 -475 -478 -540 -701 -583 -884 -539
1508 -539 -721 -378 -497 -745 -62 -48 -272 131 2 352 453 597 617 536 819 697 507 542 418 318 181
1529 181 90 -252 -108 -398 -395 -494 -691 -653 -651 -803 -390 -798 -523 -349 -249 -452 2 129 -38 232 339 244 398
1552 398 687 843 839 687 763 592 469 444 255 208 213 -187 -411 -281 -389 -364 -464 -465 -681 -754 -342 -679 -307 -300
1576 -300 -276 -138 -233 163 25 426 413 298 270 563 556 458 701 506 280 393 516 92 90 -91 53 -456 -521
1599 -521 -285 -611 -374 -132 -805 -658 -176 -340 -75 -112 47 -227 -66 21 -41 168 677 305 295 767 341
1620 341 570 290 424 492 238 98 2 -11 -21 -245 -421 -312 -601 -470 -347 -597 -496 -568 -263 -240 -202 -315
1642 -315 -21 55 -65 79 202 519 298 208 661 616 564 539 257 303 373 410 357 212 -173 6 -312 -320 -378 -685
1666 -685 -496 -751 -553 -452 -367 -423 -234 -146 30 -454 -239 230 434 333 356 454 595 777 849 520 397 553
1688 553 315 63 309 255 53 -210 -234 -506 -777 -407 -428 -651 -518 -542 -516 -290 -294 -443 -151 -153 80 106 184 54
1712 54 434 674 520 552 334 801 316 368 677 255 -232 128 15 -368 -173 6 -566 -560 -627 -677 -594 -573 -320
1735 -320 -797 -101 -78 -378 -328 464 86 297 410 223 336 685 772 516 443 678 433 60 604 212 -219
1756 -219 228 239 -285 -259 -72 -429 -587 -324 -523 -534 -603 -364 -434 -568 115 -68 -99 -26 331 361 379 562 194
1779 194 244 703 436 256 403 283 133 267 124 -172 -80 -161 -149 -771 -423 -403 -782 -473 -339 -701 -417 -143
1801 -143 -295 -379 -43 -43 -316 163 415 277 314 591 239 330 562 420 132 507 432 124 62 396 -14 -161
1823 -161 -19 -363 -276 -684 -494 -518 -475 -148 -737 -443 -163 -706 15 199 5 -204 175 89 -9 374 440 528
1845 528 380 832 489 223 282 418 67 221 211 30 -308 -311 -69 -460 -311 -224 -719 -508 -693 -368 -392 -66
1867 -66 -226 -375 38 264 -111 155 260 226 261 569 492 392 402 395 130 127 178 85 143 -4 -543 -230 -101 -206
1891 -206 -569 -372 -366 -531 -571 -377 -166 -357 -96 194 -99 -7 345 66 316 247 215 407 649 325 265 400
1913 400 515 473 105 73 -50 33 -119 -176 -169 -189 -189 -320 -187 -289 -216 -278 -296 -165 -79 85 -343 -38 134 138 404
1938 404 229 223 417 378 437 278 347 140 493 131 323 244 -100 -124 -360 -134 -257 -170 -367 -263 -234 -354 -86
1961 -86 -333 -205 -78 -219 68 101 289 177 286 193 303 355 606 477 474 421 169 300 272 377 -27 70 -143
1984 -143 -286 -407 -427 -201 -182 -350 -291 -341 -356 -539 -186 -307 -123 -140 143 -270 276 67 223 399 227 385
2006 385 291 337 650 550 263 272 93 68 -96 -40 -37 -98 -191 -527 -602 -286 -516 -438 -338 -377 -342 -232 -122 -160 48
2031 48 214 12 238 146 163 195 353 288 356 300 103 322 146 206 6 304 -7 -33 -211 -388 -57 -313 -455
2054 -455 -411 -361 -330 -183 -304 -521 -162 -142 -124 55 91 -78 159 162 237 327 261 291 323 254 337 334 129 70 214 -2
2080 -2 -183 -161 -69 -264 -171 -323 -259 -429 -106 -255 -337 -366 -54 -103 79 70 104 59 177 308 261 190 487 530 137
2105 137 359 466 128 161 143 -132 4 136 -206 -142 -246 -302 -371 -5 -251 -278 0 -335 -232 -470 -109 -134
2127 -134 -202 -29 -58 404 384 282 228 140 488 325 208 495 346 99 233 110 -63 76 -48 -251 -88 -271
2149 -271 -112 -350 -509 -344 -373 -398 -121 -85 -367 -10 70 4 23 173 134 438 218 267 209 403 434 514 265 265
2173 265 282 281 -38 -227 -113 -254 30 -198 -336 -123 -698 -421 -316 -347 -237 -328 -257 -95 -268 17 91 -25
2195 -25 222 190 310 218 202 337 298 238 105 231 19 -121 352 -9 121 25 -128 -86 -426 -354 -384 -206 -288 -163
2219 -163 -306 -584 -88 -239 -249 -134 185 308 138 360 288 389 264 316 283 367 443 82 184 126 -202 109
2241 109 314 -143 -158 -111 89 -251 -336 -206 -206 -107 -319 -301 -409 -6 -37 -206 -100 122 -43 95 145 268 204
2264 204 -7 166 585 237 247 120 229 240 -188 -4 166 -134 -151 -232 -47 -393 -473 -377 -335 -215 -487 -95
2286 -95 -173 -7 -155 35 126 438 344 448 53 242 390 588 399 40 171 220 76 177 336 -53 27 -145
2308 -145 -324 -138 -233 -334 -61 -342 -148 -141 -200 -156 -37 60 -189 18 16 269 198 233 462 175 162 -86 251 136
2332 136 340 265 74 165 106 65 78 -94 -207 22 -256 -135 -346 -263 -215 -413 -207 -26 -195 -77 -231 -208 253
2355 253 -68 275 -23 269 71 229 258 121 352 80 98 189 193 142 253 -97 71 -60 40 -122 -176 -196 -94
2378 -94 -403 -89 -446 -325 -186 -602 -279 -261 -62 -103 57 -3 -37 66 371 348 54 34 278 133 138 275 248
2401 248 -54 -94 -78 -7 -97 -129 22 -120 -183 -388 -266 -316 -220 -385 -258 -31 -139 -110 257 18 196 347 251
2424 251 75 368 515 419 188 277 -98 6 -91 202 -63 35 -73 -174 -70 -247 -209 -139 -357 -295 -302 -152 -156 -20
2448 -20 81 88 -145 -174 -58 63 242 232 391 263 279 443 335 118 284 332 150 78 235 -101 -154 -32 -127
2471 -127 -294 -299 -222 -298 -55 -7 -433 -378 -313 -117 -147 127 203 25 75 47 62 -2 119 323 158 123 194 351 -29
2496 -29 27 -147 -85 -45 -233 -300 47 -251 -208 -276 -484 -248 -221 -111 -212 -130 -74 -29 -224 -109 -17 30 260 134
2520 134 187 238 51 112 233 211 377 44 274 116 133 -71 -231 64 27 117 40 -192 90 -30 -391 -73 110
2543 110 -189 -228 -77 -102 -178 153 267 -77 168 155 228 199 134 249 238 7 36 -13 157 -43 -40 300 78 94
2567 94 -49 -35 -279 -260 -94 44 143 -165 -27 -39 -353 -69 121 -160 375 -50 180 37 66 49 321 271 340
2590 340 105 209 308 106 -52 189 -89 -113 -142 -276 -319 -180 -115 -230 -83 -215 -94 -58 -160 -1 -16 -42 86
2613 86 138 223 -19 177 -12 339 131 316 112 -79 287 244 496 194 220 118 -166 -83 -176 -308 -206 -200 30
2636 30 -380 -215 -113 -178 -27 -21 -148 13 -292 6 156 128 347 127 370 76 242 106 172 438 185 16
2658 16 289 168 95 247 -65 -233 -37 -130 -217 -238 45 -330 -154 -200 51 -341 -49 -53 -137 145 -61 32 161
2681 161 153 15 176 -54 84 172 186 3 -170 199 -135 19 -64 114 -399 -228 -179 -247 -173 -266 -357 15 -159
2704 -159 -340 -44 -388 -268 -6 28 72 278 -13 617 318 307 316 198 341 262 174 78 0 -59 406 50 -107
2727 -107 -8 13 -2 -262 -302 -176 -291 -222 78 -141 -328 -50 -130 -184 -217 -19 72 -49 99 357 217 -22 183
2750 183 181 129 280 153 -82 -10 61 261 256 140 101 -58 -381 116 -159 -437 -188 -344 -217 -354 -264 69 1
2773 1 10 -440 -108 -40 37 183 -6 -56 115 -203 142 277 -114 78 20 455 60 269 206 370 -168 -273 -163
2796 -163 -377 -88 -146 35 -239 -7 -132 -4 160 -173 83 -188 33 106 108 -40 -151 196 379 316 339 -92
2818 -92 385 163 -107 120 215 -49 -107 12 22 -84 -64 -145 -118 -165 -281 -246 18 -27 -340 -280 -370 -130 -211 24
2842 24 -51 218 224 184 167 251 199 178 217 13 143 -23 312 -123 -252 77 -190 -224 -87 -211 -150 -146 -80 -139 -338
2867 -338 -132 -10 44 1 -48 -216 183 58 10 1 323 85 129 339 83 -1 98 466 156 1 129 39 74 23
2891 23 -243 -201 -420 -10 -70 -40 -128 -80 -195 4 -32 -220 82 -245 -195 84 63 126 120 309 206 -3 389 -41
2915 -41 22 50 240 -15 -91 128 4 104 176 -65 -154 0 -315 -181 -221 -483 -200 -207 -131 -199 69 -9 277 -69
2939 -69 -57 403 188 133 106 445 136 186 146 125 105 174 -23 106 -80 -64 -72 -418 -213 -34 -178 -272 -198 -82 -171
2964 -171 -247 119 89 -48 -73 206 -14 -5 185 115 80 59 123 61 -146 218 -36 159 199 92 57 -70 146 -42
2988 -42 -285 -168 -234 -91 53 -489 -1 -323 -209 -122 -96 95 -216 -74 90 -341 132 338 52 -107 81
3009 81 102 17 112 120 65 180 -119 -190 -36 147 228 -183 54 -307 120 -320 15 -239 -132 -233 -193 -116 -192 190
3033 190 -88 126 35 159 240 210 217 282 220 289 26 293 328 145 303 98 15 -263 -60 -73 -51 168 -77 -361
3057 -361 -301 -253 -195 -403 -60 -367 44 -266 67 22 79 -9 -176 -166 40 47 256 -80 150 8 242 167 116 50
3081 50 -145 248 -361 -17 61 -156 -26 -45 -315 -133 -105 -96 -78 -49 -386 -49 -164 -123 -18 37 120 -51 57 155
3105 155 -13 -29 158 331 117 -120 -66 322 -224 -22 40 105 -181 -122 84 -433 37 -197 -268 -128 -230 -59
3127 -59 -186 -107 -147 -73 -22 -179 -112 -73 16 124 -153 70 329 33 76 -69 314 -36 -16 64 42 55 66 -130 186
3152 186 -213 -633 -241 -240 -265 -192 -85 -247 -31 -4 32 218 194 -11 26 40 42 192 30 107 -4 271 93 -17
3176 -17 48 52 -66 231 23 -143 41 -15 -158 156 -214 -210 -252 -418 -72 -294 -59 1 -88 -25 254 168 -124 107
3200 107 -10 43 76 233 292 224 -46 -10 -14 -185 315 201 -349 37 102 -89 -232 -247 -27 -4 -269 -33 -25 -216
3224 -216 -151 -15 -180 -25 -5 102 14 -46 115 62 233 238 -185 32 222 305 -159 168 -182 -43 -4 -35 -124 -309
3248 -309 3 -221 -146 -78 -65 -110 -347 -34 -303 9 252 78 42 -87 -319 407 67 -35 122 227 370 132
3270 132 263 -8 276 9 -24 -24 175 -117 -36 35 -161 -139 -139 91 -103 -136 124 -152 213 63 -17 66 92 31
3294 31 -86 -131 9 36 224 133 74 383 75 96 185 -44 -8 -196 225 86 -112 -31 -207 -212 -118 -88 64 241
3318 241 -64 -71 -412 -204 53 218 -188 -26 226 -31 302 109 100 447 156 71 442 169 130 318 108 -164
3340 -164 95 200 8 -186 -227 -168 32 -61 -167 -284 -41 -136 -40 -122 -258 -1 37 -67 -62 132 12 -126 235
3363 235 297 109 159 348 92 135 74 -169 163 405 -282 -142 51 14 -97 -137 -220 -69 -277 9 -221 -333
3385 -333 -273 35 14 -79 -74 -40 -95 282 21 171 101 -16 189 222 175 -99 196 -73 79 185 -22 -48 -188 -40
3409 -40 -278 -30 -66 -349 -225 -254 -86 -344 48 -78 119 -36 -214 66 227 16 11 44 151 30 83 116 219
3432 219 363 -54 -78 -21 141 201 -152 -133 -47 -464 -244 -224 -313 -83 225 -285 -43 -37 -230 -103 66 -144 47
3455 47 174 160 47 -64 214 266 87 -17 75 -19 -144 318 220 -212 -52 -208 -118 108 87 -182 -357 -148 -64
3478 -64 -189 -185 45 -1 -61 140 -17 189 -73 -66 106 79 30 101 214 157 315 200 242 112 122 199 -44 54 17
3503 17 140 -105 -14 -192 -244 -50 -218 45 13 -13 89 6 -256 -29 -67 8 -3 109 175 -129 -49 23 148 56
3527 56 -305 174 203 164 290 100 -32 63 119 -22 -163 -358 -136 -134 -100 -147 -82 -196 -176 -197 24 -80 74 64
3551 64 -92 7 -18 -187 289 69 11 275 166 -55 112 297 290 -37 -97 -153 28 -148 -114 -130 -35 -32 -251 -264 -280
3576 -280 -106 -105 -190 24 -159 -58 -214 -17 216 5 178 206 34 150 254 145 169 -33 81 3 -20 37 178
3599 178 -180 240 -253 -58 12 -92 -49 -118 -278 -109 -33 -222 -181 -72 -72 -80 -113 -285 -44 157 165 142 175 -50 -4
3624 -4 -17 271 185 116 140 141 107 150 153 -89 -34 22 -76 -168 -330 -156 -201 -27 13 31 -96 -209 -199 20 -297 134 -88
3651 -88 32 127 109 -13 308 193 45 139 -21 120 69 202 215 -34 -336 64 -150 -249 -86 -149 -54 -31 -357
3674 -357 -230 -155 -48 185 -55 175 224 35 -84 247 18 174 29 92 243 130 121 60 34 -53 -9 134 -93
3697 -93 14 -167 -102 8 -245 -103 -97 -97 -288 -9 65 23 -211 -156 79 -152 -50 251 -40 252 81 162 136 31
3721 31 144 305 -35 140 238 30 24 70 95 -64 -18 15 -337 -187 14 -29 176 102 -223 -164 -133 -145 -111 80 -68
3746 -68 7 -36 183 -10 240 192 403 348 375 -31 107 249 -22 54 -100 11 58 60 59 -5 35 -66 -88 -328 -155
3771 -155 -40 -140 -39 -334 -74 82 -99 237 283 -67 213 86 33 127 150 92 184 78 32 76 65 -71 206
3794 206 31 240 137 -221 6 -119 -90 -6 -30 -273 -45 -227 84 -162 38 55 159 -109 -48 148 34 -53
3816 -53 -62 311 204 131 38 -84 -11 199 -240 226 5 35 57 -40 43 -37 -127 187 -84 10 -108 48 205 -46
3840 -46 -36 -132 -167 133 65 -125 87 224 146 9 -30 96 -31 246 49 -99 -166 -22 -51 -133 -58 -142 -102 -351
3864 -351 -122 -136 19 -111 -70 -154 144 24 -283 168 -28 22 97 204 112 231 172 84 224 -98 150 68 -174
3887 -174 -168 74 -118 18 -113 83 -43 -17 -393 -234 -269 -204 -122 -13 49 -169 -87 -224 -176 104 -27 -17 8 198
3911 198 92 135 316 262 379 214 302 182 261 160 327 80 155 -230 -268 9 -118 -212 -146 -151 218 -212 -181 -154
3935 -154 51 -139 194 159 55 26 -21 -146 195 261 326 159 415 180 -117 101 127 93 80 201 13 30 -78
3958 -78 229 162 155 -60 41 -68 -12 -196 -38 -12 -185 288 21 -57 92 317 26 -56 1 88 13 226 -137 253
3982 253 170 161 185 152 11 86 290 -47 16 -53 -113 -285 39 -203 -141 -35 -112 160 -255 -53 -160 -81 -9 -48 173
4007 173 152 63 -236 399 55 -112 130 -128 165 -63 81 -40 -93 -273 -206 155 88 -6 -398 -165 -58 -183
4029 -183 -61 109 145 42 -76 84 162 85 287 22 -50 -11 57 93 126 -66 170 25 300 260 272 -48 -20 216
4053 216 135 -95 -202 -203 211 176 -306 54 115 -367 -138 259 41 120 -55 250 24 -124 -43 -167 135 152 285
4076 285 -44 408 -81 -5 120 284 53 -86 116 -128 -75 -25 5 -80 34 -123 -65 44 8 -133 -53 52 -228
4099 -228 -170 20 -64 -6 -11 107 -4 164 368 -86 157 111 -50 45 88 60 -47 -56 -30 -102 82 201 21 -2 -145
4124 -145 22 -155 -125 57 -101 -29 123 -136 20 265 14 173 -12 294 -26 87 -57 121 -103 119 43
4145 43 172 164 259 124 -4 254 -146 218 11 -17 49 77 -72 12 -104 206 50 -39 -230 -59 140 75 215
4168 215 143 193 377 413 -70 332 100 140 146 40 235 45 -56 32 -27 80 -111 267 39 51 8 -48 -44 -182
4192 -182 112 -82 30 89 141 38 29 149 -52 -147 0 341 196 -16 160 69 52 -99 -30 134 64 13 73 -27
4216 -27 -42 -111 -55 47 -263 268 17 35 40 -240 -33 -88 241 -24 74 151 209 -86 -49 113 48 157 25 -134
4240 -134 -109 89 143 3 -102 -1 -1 -239 112 -136 -177 109 -127 -60 108 133 -215 16 -78 -39 161 49 -97
4263 -97 119 -144 89 -213 195 23 14 325 -169 91 -71 14 137 -75 -222 -139 -183 34 72 80 -26 -244 -45
4286 -45 -110 -16 -396 -78 -109 -215 -61 232 130 -64 58 293 106 -71 174 -310 92 295 23 169 -58
4307 -58 -117 -80 -13 -17 -24 -245 -206 10 19 55 -36 -107 8 -78 -58 14 -123 -33 -89 65 113 300 -71 392 56 306 83
4334 83 29 149 6 -126 -88 231 -27 -101 34 -171 -153 170 149 -117 205 -24 -24 -203 -103 -62 -128 103 -141
4357 -141 -19 -102 -39 52 -254 -98 -48 42 106 212 165 -48 41 34 109 165 -77 -16 -179 -219 266 107 -21 -66 23
4382 23 35 -187 113 31 -110 12 -59 -89 1 -84 -193 150 92 285 69 39 141 13 252 100 -71 30 47
4405 47 -41 -42 12 127 25 182 -66 57 148 212 -85 4 163 3 -57 -280 -24 -50 -222 90 36 66 96 72 -118
4430 -118 36 9 192 358 248 22 -53 -54 -27 136 -141 -64 -68 -190 25 23 -71 157 28 -20 -162 -50 52 -96
4454 -96 18 -33 143 30 209 116 -49 270 317 62 20 183 114 105 273 14 102 -54 -187 -98 -310 -31 -170
4477 -170 -277 -325 -64 -60 -12 -62 45 -139 -21 47 -67 51 128 156 -50 63 20 48 7 240 19 125 -87 64
4501 64 8 33 257 76 -63 -91 -51 -126 34 44 -44 -42 -6 -255 -131 -63 -51 -118 -87 -32 189 115 96 37 43 -53 90
4528 90 -150 51 295 190 -84 85 122 8 6 39 -74 -39 83 -68 -8 -141 -176 -150 -168 -161 -16 -135 61 -62
4552 -62 100 -131 102 88 -36 264 36 112 193 -125 74 138 -110 72 221 -218 -152 -96 -36 -104 -149 117 -242
4575 -242 -127 -83 -201 30 51 171 -78 -25 61 63 -97 188 -165 -152 81 -121 -28 -105 -138 88 -56 72 170 -70
4599 -70 410 73 73 31 63 -174 -136 -179 -95 -91 23 -335 -169 15 -85 -135 -31 222 -12 197 39 277 -119 -11
4623 -11 262 -66 99 -9 124 -47 25 143 -231 70 10 -21 -79 -62 -231 -96 -228 -126 -164 -130 7 22 -31
4646 -31 109 -144 -103 -65 -25 -122 53 177 -5 86 -288 -15 -194 11 -245 184 -16 131 -75 156 -82 -6
4668 -6 90 -92 87 128 380 0 76 -201 -11 -126 24 -121 -14 -180 -25 98 12 28 -318 -12 -38 -70 -24
4691 -24 -21 216 -208 11 262 57 -17 -58 186 -114 -353 -37 82 -96 32 -176 -35 -55 -301 123 82 -37
4713 -37 -33 197 73 153 -61 214 37 -129 -30 282 25 5 75 -16 88 -43 171 -150 131 -71 -211 -91 50
4736 50 -42 -104 -140 -25 136 140 117 -179 -172 -336 -46 272 122 -38 40 243 129 238 269 -16 24 -110 -61 166
4760 166 -163 158 -63 -86 220 104 46 -96 255 15 30 155 73 49 -260 -7 -127 -114 165 -95 -125 247
4782 247 71 111 180 99 45 183 -76 48 64 -105 -63 103 -324 -324 146 15 -158 -169 -185 72 180 -138 -87 -121
4806 -121 189 146 -27 -11 -85 -199 -34 78 -27 -69 -90 115 208 124 180 60 321 62 313 96 -179 -234 15
4829 15 -56 -59 41 -46 -111 -9 -264 -181 3 185 218 59 118 -28 -160 -305 9 -31 -165 -143 -122 269 147 93
4853 93 -56 225 -2 -150 75 -224 28 84 72 -55 -135 91 27 164 -59 -257 -239 -98 -252 -212 -55 192
4875 192 7 -41 -253 50 102 -36 105 177 20 -137 208 171 122 44 121 -85 56 -208 -105 238 -292 -351 -63
4898 -63 -47 -228 -118 -208 244 -238 -21 201 1 92 120 66 279 80 -99 84 134 11 -139 -98 86 -31 39
4921 39 -39 -109 77 39 55 39 -84 45 -193 71 -48 11 -79 140 -73 -66 -247 -126 -17 220 41 -206 -50
4944 -50 -199 -82 12 96 54 212 47 118 -188 -170 -143 21 -24 76 71 -34 47 -310 -118 60 -226 46 -82 -6
4968 -6 74 -18 37 -63 -190 -4 -16 84 122 90 -104 -113 202 132 -111 -50 55 167 181 158 74 -189 -59 -109 317
4993 317 -14 72 -199 -89 71 -222 47 -118 -117 102 6 -172 -182 60 175 -73 -55 -81 109 140 134 -356 202
5016 202 66 -27 239 -279 186 109 31 135 79 -38 -57 49 -89 -213 -274 18 -216 -12 206 174 -45 73
5038 73 -29 17 14 95 41 23 89 -201 324 -223 140 155 115 194 -75 71 164 210 82 126 -157 -9 7 340 -138
5063 -138 58 -355 -36 32 -82 26 -97 -11 -221 -90 36 217 -133 -27 -137 126 167 -59 115 -177 -50
5084 -50 70 -252 -73 -301 -78 57 -2 -66 0 -10 -141 -262 32 -63 -28 11 125 81 84 318 59 -40 53 -143
5108 -143 -147 -70 63 26 -85 -18 -202 -21 149 1 -56 110 106 -109 154 28 76 154 -51 84 -30 -47 -77 -218
5132 -218 125 138 -113 69 -10 -20 -102 221 164 3 12 -124 81 -93 337 -127 114 313 66 -42 41 150 73
5155 73 -128 -158 68 80 -116 -154 88 106 -50 -21 -82 131 -101 -30 7 121 67 -2 59 -97 232 -128 1 51
5179 51 179 -180 -79 -209 16 61 53 -127 -104 116 -216 -147 -97 -54 20 -157 92 -185 146 40 -192 -222 -64
5202 -64 239 -57 203 19 61 -102 10 104 110 172 -134 109 -56 -179 68 157 32 -343 64 77 -153 -65 -85
5225 -85 -156 -43 -164 46 232 -93 118 -267 168 99 253 -59 33 -87 43 119 70 71 -146 137 115 140 431
5248 431 -72 -43 -180 -149 97 -342 -118 -137 40 114 -4 -185 -165 -48 -136 -221 -170 -31 -286 -170 -370 -101 170
5271 170 78 -15 150 83 103 108 71 -8 14 -189 148 236 8 122 -286 99 -156 -4 -213 7 -143 49 -147
5294 -147 -209 68 -173 118 78 301 95 -144 68 264 198 138 28 -17 150 29 -91 -8 -8 20 -91 -84 -77 85
5318 85 -79 -34 4 -43 47 -167 37 -226 -103 -166 -45 -160 -7 -141 -78 -42 6 263 -159 -50 384 282 262
5341 262 -35 -157 140 13 -94 13 -6 136 -5 -133 -139 -18 33 -110 82 -2 -147 -131 -49 8 -35 -71 83
5364 83 54 -71 -169 123 215 104 -98 41 57 40 -10 120 77 -84 -47 24 266 215 195 -56 -75 -84 153 -66 144
5389 144 9 131 223 -173 -66 -61 2 -62 -150 51 103 213 -8 -84 107 349 291 271 -148 -142 38 40 80 -100 338
5414 338 33 48 -68 -7 147 -55 89 -13 -116 -62 -4 -70 220 227 -18 -131 160 55 112 -26 105 30 60
5437 60 -42 -111 199 168 18 73 -41 -19 46 -134 -48 -37 70 209 -126 -38 -118 -14 -36 -150 72 321 8 134
5461 134 -18 -97 -302 -266 73 -94 257 -161 -79 -6 194 -192 -29 129 35 195 -155 81 -195 -171 286 97
5483 97 -179 160 -82 -48 -129 0 31 -8 35 158 -89 -95 32 402 -174 91 247 -5 24 -32 17 134 -246 -171
5507 -171 65 -102 -164 -144 -442 -155 -126 -45 -295 -294 -82 -29 -116 -230 47 177 59 -176 -126 81 -108 -153 219
5530 219 -202 214 -30 128 101 201 -14 166 7 -150 -72 -165 146 -293 93 126 251 10 -144 91 294
5551 294 -34 96 55 -3 -72 14 186 64 -27 110 13 -153 16 -6 82 48 -193 167 52 48 42 -107 158 -106
5575 -106 -106 -50 -123 -164 -5 98 -16 114 -45 -155 -148 20 -58 57 156 -183 -117 207 7 235 -41 -7 62 -137
5599 -137 -72 -81 66 -122 201 74 -25 -147 -37 175 -280 -64 -27 -63 133 134 23 23 199 120 17 -132 -44 26
5623 26 72 -125 83 18 40 -25 183 80 -157 -77 69 59 -18 158 -153 -163 -214 16 23 -199 -40 -111 -24 19 -171
5648 -171 -106 93 20 83 106 5 -169 69 121 112 -182 120 94 128 -99 44 55 -32 68 -62 -18 15 -307 169
5672 169 -76 -124 231 -31 -227 -156 58 19 -303 -177 -169 -54 209 -40 115 -4 -44 77 113 -204 30 77 68
5695 68 -88 -60 -41 9 -16 15 -7 187 -264 -210 -56 -27 0 -2 -51 -57 7 407 6 9 -162 -222 95 -171 87 -27
5721 -27 20 141 50 193 -242 215 -58 -228 -65 107 99 178 110 -162 1 -13 -218 -154 -354 -202 35 -211 -245
5744 -245 32 -154 -230 130 -1 170 -121 -55 -73 91 -93 7 -64 181 -166 -188 176 -72 -155 -213 -4 -115
5766 -115 -196 -70 -28 -152 35 -67 46 -145 95 -115 -154 59 -23 -277 100 207 81 -22 -186 -26 -275
5787 -275 142 64 93 -181 92 -49 -3 -167 -54 -178 32 222 187 116 -194 53 -67 -163 -76 -36 -75 67 -44
5810 -44 169 -317 -44 40 32 115 -156 191 -41 -20 54 45 -68 80 29 122 -9 -166 202 -16 3 216 170 35
5834 35 -342 -34 137 189 88 -37 110 -110 5 -244 -79 147 -171 11 122 35 139 48 2 -37 -202 144
5856 144 25 -154 189 -124 -107 -62 -167 204 1 -6 -44 -225 -195 17 -56 -135 -131 -104 -74 26 -42 38 89 -61 -109
5881 -109 -13 -150 -28 106 279 207 78 8 -61 107 166 -72 -152 93 188 -92 -10 -94 64 232 83 -31 109
5904 109 -161 -137 31 -110 137 -256 40 134 -233 372 -88 226 115 -125 65 -74 -75 -30 183 33 16 72
5926 72 -182 -63 112 55 -21 -128 -117 77 19 -61 -167 -150 -121 90 -325 -194 -51 -17 -284 -205 212 7 382
5949 382 -75 -41 -89 216 166 -83 -97 -111 -114 206 230 152 -1 -35 -177 31 33 96 -22 -1 -124 -272 48 -96 65
5974 65 18 -66 -36 122 89 -132 -35 23 53 46 -124 318 -107 -131 -116 -164 -72 174 -55 -233 -77 -232 -23 27 -226
5999 -226 -154 139 32 -114 -12 -46 -128 5 -95 -83 -2 199 65 237 -139 -19 157 -33 -129 79 159 -374
6021 -374 -237 -135 280 -194 32 -197 116 -51 129 191 -100 -103 -184 -236 -128 34 155 -168 182 10 -39 -1
6043 -1 -26 113 -19 -276 151 188 -134 -42 -93 -78 -68 37 50 -183 25 40 -171 -99 -3 81 -206 -95 -62 66 -41
6068 -41 23 -176 -115 79 -146 -31 9 14 66 113 -58 -139 72 182 172 -64 88 28 98 112 158 7 -59 -7 -258
6093 -258 241 21 -78 81 32 -76 285 174 48 -40 -16 -60 -359 -41 -61 -145 115 21 -67 200 -16 -78 -198
6116 -198 -108 -101 -152 265 12 74 -41 299 -39 -235 46 -5 56 33 -184 -7 93 113 117 -271 -54 134 -317 181
6140 181 -81 6 95 -18 114 -230 90 16 -101 122 168 110 -143 -67 315 -230 -146 26 -49 27 -5 -164 88
6163 88 97 -9 189 -135 215 -352 125 205 -32 80 54 86 9 57 -16 -46 -6 23 -11 -149 -66 158 49 16 -17
6188 -17 -116 153 -16 -41 289 -54 -196 -85 -9 -68 56 -92 -45 -2 232 -56 -128 150 -22 -60 48 123 -18
6211 -18 24 -79 -121 182 165 21 128 -66 -46 51 238 9 30 -48 -62 340 134 -7 -186 -143 148 -153 -15
6234 -15 225 -78 153 16 166 101 62 148 -107 -268 -131 22 80 19 191 -9 14 22 161 71 -48 -13 -167 -86
6258 -86 169 26 22 233 -96 35 71 24 84 -354 97 -37 -18 53 -24 -100 41 17 -195 222 73 -42 -83 159
6282 159 290 -69 -19 -1 20 139 107 66 -20 -25 125 114 -135 -131 -16 56 -226 -54 37 224 -3 284 -183 173
6306 173 87 171 -173 401 193 227 -43 -48 -32 97 34 16 126 -88 -23 -301 -51 -104 -231 231 -147 -81 -49 -118
6330 -118 44 -199 -20 -24 57 -45 13 -122 37 -175 245 165 192 -169 244 -59 -92 -121 -49 114 -263 -56 3
6353 3 96 -79 49 107 39 -57 269 -61 -19 -262 -87 -41 182 273 81 213 -100 -38 -89 79 -98 -8 -38 -119 -316
6378 -316 -32 13 -35 -78 1 -228 -190 -3 54 -12 -146 98 98 89 91 -32 19 29 -310 2 -110 27 -153 -281 -93
6403 -93 -140 200 192 140 -90 45 153 -36 105 30 -134 -60 -32 -231 -2 -29 -49 45 2 -113 -48 36 -101 -246 116
6428 116 147 31 40 241 153 157 202 -29 -145 -47 359 -146 -272 -255 0 72 -225 -133 91 157 269 56 -181 274
6452 274 -87 -65 -97 37 19 24 104 -15 84 -39 38 -66 -168 -1 50 95 29 -42 212 -7 168 99 -277 -167
6476 -167 -79 124 158 115 -73 313 -20 260 38 36 -347 62 118 17 70 -83 -64 105 -31 30 -295 112 183
6499 183 -244 -43 -98 148 -36 90 -61 116 16 -201 -129 -64 -86 -111 -54 15 -159 167 57 48 58 209 -11
6522 -11 -18 94 -298 73 136 100 67 270 -76 121 151 6 210 36 -112 115 -64 -75 -62 62 -190 68 122
6545 122 53 -134 1 -21 -22 191 -31 -56 -129 0 109 -16 -6 2 276 72 -89 12 -95 100 184 -38 -157
6568 -157 253 -37 268 -77 -122 -265 -100 46 11 -148 -52 -20 -59 -70 34 76 286 -144 17 -299 -147 -23
6590 -23 215 197 103 159 -77 -123 -100 8 -73 26 -66 -20 -147 242 118 -27 -11 -80 175 -130 -64 -131 -52 -35 -90 -81
6616 -81 -16 -154 1 58 -85 -96 -129 112 -64 -62 156 -7 -16 42 186 -47 -10 -17 171 41 57 -5 120 151 -391
6641 -391 18 104 119 91 -211 -31 42 59 -398 257 -90 -90 -38 11 43 185 -104 34 162 -132 136 -29 52 210
6665 210 -150 -61 -286 -100 -11 -73 79 -290 -90 144 25 -50 -14 122 -332 61 105 115 16 -85 12 -177 161
6688 161 255 -59 6 73 -104 58 68 270 171 -206 69 -119 -91 -37 -63 45 169 -144 34 -227 20 -55 96
6711 96 -89 12 -21 63 -31 -123 -41 -35 -42 82 -26 -18 130 82 42 -44 99 -244 63 71 113 86 -97 285 -37 348
6737 348 74 -44 89 201 -37 16 191 -154 -30 30 74 62 67 -376 -226 27 128 -74 -183 110 187 74
6759 74 156 -86 -92 -213 -29 -244 16 -94 -8 -194 -249 104 -203 137 -250 -43 18 -200 -66 263 -31 106
6781 106 2 102 -80 128 -160 9 -48 6 -15 52 140 79 42 120 -93 5 31 -147 58 23 14 -232 225 -76
6805 -76 81 -126 73 -113 -196 -35 -85 -186 158 -173 -25 162 -327 -44 -47 136 -89 99 -46 175 148 171
6827 171 18 145 17 -87 28 15 -215 123 131 -170 -189 11 -92 157 -94 105 90 -44 -73 -170 27 -81
6849 -81 -40 86 175 -111 -235 215 181 -154 15 -35 48 125 -310 -80 -107 -134 -33 -3 193 -63 -133 -187 -61 -201
6873 -201 -103 -64 -72 -54 -137 30 -144 4 -237 39 6 -159 -167 24 -134 65 -53 13 -7 -67 -262 -195 13 56 106
6898 106 -113 -123 -146 -97 -148 -9 -84 -184 -237 -152 -173 -29 97 -64 -145 12 92 76 -244 19 -48 53 -234 234
6922 234 -115 29 126 -51 42 -128 -85 108 -6 -24 172 -97 212 78 164 0 111 -268 80 -134 -155 10
6944 10 88 -51 -59 -168 163 58 35 -104 -151 119 -75 62 49 98 -147 -24 -32 -106 123 -43 16 -118 82 -49
6968 -49 75 -84 -138 -267 -115 -137 -29 -104 -293 386 -71 -80 -75 213 -6 -40 -47 62 9 -330 3 -270 115 83
6992 83 81 -103 -104 127 -155 141 137 22 61 -98 -56 133 -31 -106 -117 -48 -15 -265 103 -19 -12 225 291 -18 -133
7017 -133 -68 115 -98 146 77 220 44 -2 -103 -98 174 52 302 337 46 1 -242 -2 -94 72 297 -146 -90
7040 -90 6 -186 -32 -115 53 69 -38 106 -91 217 165 102 -153 -8 37 -122 -54 48 66 81 188 77 2 74
7064 74 -13 -221 -33 -270 -68 14 2 6 -355 -124 -88 83 -107 120 73 -94 79 -23 215 4 293 97 -26
7087 -26 79 -162 65 -117 -69 -123 -259 137 118 -110 -175 -279 -10 56 -104 80 -111 -137 -183 -39 -47 -4 159 -151
7111 -151 91 177 -163 -118 75 410 -108 391 10 -17 47 46 -63 121 -68 -111 -27 59 48 -6 -361 -323 42 -81
7135 -81 130 -91 55 -264 84 -9 -154 55 47 62 58 -149 -78 -13 -48 -104 -11 155 -17 24 94 27 29 294 -141 -171
7161 -171 -164 -139 133 211 139 150 361 -30 -82 -122 -33 108 -138 -23 99 -65 -214 -37 10 -146 -210 43 -136 168
7185 168 -18 -175 -2 67 -220 -60 3 -99 4 -111 -24 32 -195 57 41 10 -55 -105 51 112 215 169 -155
7208 -155 -33 208 196 -237 -150 9 -254 -72 85 95 -140 -67 -214 36 -93 -8 36 -52 -12 -66 -78 -167 -170 -57
7232 -57 -4 -57 -113 156 123 226 158 73 175 11 -89 131 -227 142 -169 -195 5 226 -208 -56 -161 19 -1
7255 -1 -47 76 9 25 -304 99 -17 113 -46 -213 64 125 -242 214 218 -141 -51 -42 127 55 83 -132 -42 68 -51
7280 -51 32 -75 21 112 -80 -131 -174 103 176 -23 188 -109 -23 0 101 50 -12 -75 88 200 -36 70 -410 -21
7304 -21 218 -79 -15 175 240 -40 -36 -9 -182 -56 -143 -91 -90 191 -235 -5 44 83 -108 9 -234 -37 143 -63
7328 -63 55 -10 -233 39 110 -84 147 10 262 -109 103 107 181 -4 80 90 72 21 136 -27 -52 -46 -123 -59 -207
7353 -207 159 -187 181 2 108 -251 195 109 -186 14 -21 129 196 -110 187 -53 210 26 -138 58 -127
7374 -127 -17 -161 33 93 97 -54 -220 -169 -179 -191 167 -11 98 33 -152 -33 -5 175 250 -211 -344 -142 -111
7397 -111 129 142 -16 187 88 -150 -17 -58 89 48 61 -91 10 -129 -40 -19 116 93 75 83 106 82 -168 -13
7421 -13 106 75 44 -56 65 103 -236 -110 31 -79 -293 92 -46 -82 -191 -157 40 -147 -27 6 94 135 207
7444 207 59 -231 169 143 29 -141 -21 -204 20 177 -27 31 84 -145 93 134 -83 -175 -125 50 -98 79
7466 79 -33 20 10 -127 -103 9 8 193 46 -71 37 -6 210 -79 -81 179 -30 -1 -92 -94 -58 -50 -157 -281 -62
7491 -62 291 76 -25 97 172 -41 83 47 -60 66 -86 97 -37 -90 59 -176 -39 193 -16 211 -226
7512 -226 62 44 228 -150 89 74 -113 -45 66 -31 -103 0 -92 -54 -43 78 -30 -144 83 270 -68 133 -114
7535 -114 -24 -18 155 2 2 -230 -98 23 -42 -120 -64 182 -228 25 180 -148 151 -10 -51 -178 -140 64 -62
7558 -62 42 -106 276 47 -54 161 173 -48 -7 -6 95 -196 48 180 -23 212 151 26 -196 60 -290 88
7580 88 78 -247 -116 31 72 -115 -69 66 -97 -186 -46 33 126 -21 66 -28 -54 277 61 -174 38 57 142 107
7604 107 71 75 -62 36 198 -13 -135 -153 -126 124 11 -219 -217 -87 26 12 97 8 156 -48 -15 110 -221 147
7628 147 59 -35 -309 20 -218 -21 48 26 140 10 87 -162 -107 -90 59 69 -49 86 106 323 -72 207 -203
7651 -203 -21 78 -159 -26 -5 -25 22 290 230 116 -6 285 54 -51 -6 -69 94 14 -181 105 -153 36 18
7674 18 128 141 269 17 -232 -233 -180 35 202 -177 -42 87 -27 79 -325 -186 -247 104 -10 84 -103 40
7696 40 114 3 55 108 -124 -122 -85 345 132 135 25 17 -82 -141 -95 104 54 72 44 29 82 -99 44 51 -173 -189 64
7723 64 150 46 -169 25 7 -72 270 60 204 120 20 -43 -30 -42 -16 23 173 -211 -8 -294 141 25 29 -144
7747 -144 287 -40 -163 80 4 -12 214 76 66 -34 -49 -188 105 364 -181 -223 -21 -45 115 216 129 118 164
7770 164 51 261 71 -211 126 -239 -55 -64 202 78 -19 -229 -117 -176 146 98 102 0 -112 -80 -8 -32 103
7793 103 44 217 16 -133 163 2 11 -6 -63 107 -136 88 25 -142 -186 190 175 -14 -278 -168 121 -120 120
7816 120 222 -41 1 -94 -308 90 246 167 6 96 84 1 -275 -93 -90 3 -34 178 100 -153 -7 22 -138 52
7840 52 -17 -4 120 277 -41 -147 -277 -30 95 163 270 0 195 -3 -35 35 -196 153 136 51 62 -140 179
7863 179 -9 15 -78 94 -7 44 -117 -127 -278 -41 36 -129 -33 -138 125 -55 333 -21 -289 -74 -36 -230
7885 -230 -49 -220 211 -12 27 245 -125 182 130 159 123 -58 -52 80 8 -10 -159 118 102 -75 -50 64 0 158
7909 158 -45 8 140 44 -119 15 -167 -51 21 -179 -50 -164 -132 -63 138 69 -103 -184 -189 147 72 -111 -54 -125
7933 -125 -78 196 -228 130 100 -261 98 237 -92 33 80 147 -149 119 186 186 91 -133 64 109 90 -44 -60 -145
7957 -145 -92 10 -151 66 164 -13 -27 -92 -21 -43 -50 -34 -208 10 -126 -62 -82 56 -50 -30 104 -289 77 213
7981 213 59 21 -79 -32 38 118 100 97 -46 -51 -14 89 57 -62 -248 -110 205 -195 2 -101 -123 -86 -184 -58 -81
8006 -81 -83 -135 -77 78 -85 -84 -18 39 -31 -37 -11 -183 62 145 244 157 -67 -65 -250 -129 -47 88 -137 -7 -84 289 -63
8033 -63 -200 205 -183 -71 -76 108 187 -75 -212 181 309 -59 -139 -113 85 109 59 -127 -170 143 159 83 137 33
8057 33 67 211 363 186 -131 -49 -174 36 24 -12 159 75 -196 56 -197 -13 -403 96 61 -53 -142 -263 -122
8080 -122 63 253 61 -125 -263 53 -17 25 145 -78 -192 13 -28 16 -99 -83 4 178 -26 82 16 242
8102 242 123 -165 -86 61 67 -113 26 246 94 -120 178 32 95 -227 -47 -77 -75 29 -23 111 -185 14 -316
8125 -316 -224 -225 225 -111 -151 -189 103 51 245 -200 -182 6 -95 120 27 -273 17 -125 -49 32 -153 72 -110
8148 -110 -139 64 119 89 -173 -63 71 145 72 -147 -2 -140 33 -194 67 -53 247 21 15 -141 -248 -103
8170 -103 133 -82 -89 -40 -307 -88 -162 129 -22 -119 -409 56 -217 22 -258 -203 -104 3 150 -41 -25
8191b5
$$ Imaginary data points
##PAGE= N=2
##DATA TABLE= (X++(I..I)), XYDATA
0 0 0 0 0 0 0 0 0 0 0 0 0 -4 8 -8 8 -8 13 -16 16 -21 24 -32 32 -40 48 -56 64 -72 84 -96 109 -124 140 -157
34 -157 179 -200 224 -250 279 -311 345 -382 424 -469 518 -572 630 -694 763 -842 926 -1022
52 -1022 1125 -1245 1378 -1529 1703 -1905 2142 -2427 2776 -3211 3778 -4539 5621 -7273 10083
67 10083 -15733 31320 -158857 -471282 114282 248037 -139386 -82484 124167 -39335 10011
78 10011 196725 -13127 -156382 119649 135127 -128998 -76372 92601 24116 -7713 -3077
89 -3077 -90975 -9898 147139 -16868 -183637 -7571 86493 -60358 -45101 27607 -73459
100 -73459 -43700 102863 12028 -76367 62896 71478 -52898 35365 114837 -32160 -45560
111 -45560 90161 12030 -88356 25170 49116 -62824 -38817 9798 -28036 8930 38864
122 38864 -49984 -44374 54315 18531 -27357 28391 -17363 -72082 58193 72555 -106825 -59444
134 -59444 115134 10580 -105733 41518 88225 -53404 -25769 71472 -8370 -31850 61657
145 61657 2963 -77648 20009 55762 -38456 -27205 25461 -17403 -11753 42453 -6076 -35725
157 -35725 32828 12764 -48207 18026 42209 -49257 -35921 36515 -4045 -26349 25295 -5904
169 -5904 -41439 35735 43494 -43014 -7830 57175 -15359 -40115 40525 19975 -41659 4587
181 4587 23371 -28528 217 43355 -15671 -31085 35139 19622 -24122 12277 11113 -32166
193 -32166 2562 22769 -35012 -27664 23595 -13942 -39645 20754 17696 -37217 1317 38685
205 38685 -11817 -9097 39863 6851 -20569 23752 21649 -18065 6731 23571 -18301 -12045 26028
218 26028 -2129 -22197 11982 3141 -23933 3131 7955 -25701 -11943 10647 -16983 -19499 13427
231 13427 -2592 -22885 12599 18956 -12577 5870 24570 -3965 2639 30322 1972 -16095
243 -16095 19960 17070 -19699 -2272 19619 -9669 -13053 9686 -8069 -14166 13783 -1371 -28575
256 -28575 -1776 13425 -14692 -14326 6125 -7385 -9804 12109 -2307 -16072 16211 18836 -13186
269 -13186 993 24384 2775 -3785 16944 5658 -8636 12587 10247 -17870 -1926 16811
281 16811 -9748 -15101 7647 -2554 -15258 2629 1608 -15439 -2210 7150 -12717 -8490 11140
294 11140 -3592 -11680 9773 5038 -10019 7206 12439 -6137 2356 16458 -1030 -4890 15747
307 15747 6635 -11008 6421 11919 -9718 -3360 9830 -6277 -9143 6380 -2573 -13642 1278
320 1278 3335 -13522 -5590 6527 -7208 -8033 6327 -2364 -8123 7918 5019 -8042 4280 12068
334 12068 -3041 -868 13589 3176 -4335 11018 7178 -7216 4785 10043 -6423 -4523 7051
347 7051 -4140 -9956 2806 -669 -12706 -2776 2652 -10319 -6662 4597 -4562 -6470 5465 -29
361 -29 -6386 5711 7573 -3364 2105 10125 270 -560 10453 3786 -3291 8021 6684 -5571 791
376 791 6534 -3439 -4054 3436 -3739 -10105 350 367 -10508 -4680 1439 -7014 -4836 2937 -3203 -3844
392 -3844 5870 3030 -5496 2560 8777 795 778 7251 155 -183 9081 2723 -5059 4430 8232 -2460
408 -2460 -3181 2507 -818 -2936 1707 -4199 -9363 471 1213 -8923 -5748 1719 -2552 -3630 1345
423 1345 -1742 -3085 5501 5878 -3780 -1021 7398 2819 -253 3682 1325 312 5481 2489 -3101
438 -3101 1729 5867 -264 -2433 1853 -1147 -2962 2671 -1238 -8427 -2782 1297 -4655 -5728 -1307
453 -1307 -1611 -1763 500 -1216 -2893 3076 4047 -2271 872 5467 314 329 5901 2100 -2020 4308
469 4308 6787 -784 -1486 4467 2308 -1830 279 -990 -3086 -1412 -2392 -3972 -1922 -3725 -6992 -2463
485 -2463 1772 -3806 -6346 1536 2898 -2812 -275 3894 1158 2123 4829 1490 -239 5235 6274
500 6274 1397 -517 1887 3785 5437 1018 -7329 -1906 8319 839 -10503 -6201 1602 -853 -5812
515 -5812 -6193 -4564 -1260 1640 -3608 -6657 1275 6488 1877 -1370 -1309 3107 9552 6308 -4798 -2958
531 -2958 11077 10037 -4788 -5305 5839 6058 -569 -2932 -2558 -325 1295 -2094 -5647 -4614 -1028
546 -1028 -1568 -4501 -5293 -3916 1062 2827 -3914 -5048 4330 6889 4 -871 3557 3805 1784 3149
562 3149 2777 468 1996 2270 705 2419 811 -3525 1000 3852 -3166 -5764 741 1166 -5118 -3990
578 -3990 -41 -3480 -3879 -718 -2560 -3273 1860 1994 -1609 -953 2119 3497 3909 1972 -1618 1765
594 1765 7414 2043 -4256 2556 6251 -1866 -2865 3277 1891 -2518 -910 223 -2982 -929 273
609 273 -4533 -4567 328 -1647 -4241 -1495 -1153 -2036 215 815 -1149 1353 4150 -510 -1252 5799 5243
626 5243 -1287 -266 3358 3442 2460 1089 -1509 701 4067 -618 -5141 183 2407 -3666 -4103 -422
642 -422 -2488 -2918 -359 -3188 -4952 849 2439 -3647 -3577 2592 2525 28 1436 937 1332 4643 2379
659 2379 -517 3272 4423 -528 -500 3823 1724 -1671 1340 481 -3816 -517 985 -4483 -3837 659
675 659 -1913 -4704 -1448 30 -3115 -1377 1185 -1309 -524 2847 55 -1046 4105 3450 -664 1743
691 1743 3682 1306 1414 3713 633 -560 3141 1003 -2830 530 982 -3546 -2369 44 -3423 -3289
707 -3289 338 -1261 -4096 -813 1394 -2520 -1525 1850 -319 -1060 2286 712 -725 2766 3444 388
723 388 932 3280 1645 963 3498 1089 -999 2216 1118 -3042 -1066 957 -1757 -2922 -1049 -2166
739 -2166 -3271 -628 -381 -3486 -1283 1140 -1935 -1875 1491 451 -514 1431 1086 -286 2154 3561
755 3561 887 1002 3585 1500 340 2990 1934 -490 782 1019 -2173 -1729 -340 -2057 -3006 -897
771 -897 -1803 -3748 -1336 -240 -2547 -1251 529 -889 -913 1006 275 -351 2175 2174 -346 1310 3494
788 3494 1582 1394 3221 1735 525 2561 1001 -1336 -106 667 -1777 -2623 -762 -1675 -3274 -1766
804 -1766 -1794 -2602 -1081 -679 -2058 -537 659 -126 -480 1028 1039 228 1752 2418 768 1675 2825 1007
822 1007 1133 2700 1514 438 1055 326 -985 -748 -49 -1975 -2162 -990 -2222 -2896 -1145 -1438 -2120
839 -2120 -1086 -311 -984 -166 649 169 325 1634 1125 52 1713 2015 861 1529 2053 492 1071 2011
857 2011 882 -103 537 334 -1148 -1346 -599 -2030 -1826 -602 -1871 -2730 -1123 -801 -1489 -386 -161 -386
875 -386 -180 839 -215 -73 1684 1194 -139 1313 1414 748 1344 1854 818 721 1817 751 -365 520
893 520 681 -783 -933 -573 -1767 -1382 -647 -1680 -2059 -1013 -1008 -1534 -708 229 -877 -238 1012 43 -204
912 -204 1364 1515 595 1090 1332 793 1149 1911 1339 867 1443 904 -632 488 119 -1029 -389 -253 -1921
931 -1921 -1969 -693 -1292 -1936 -1135 -864 -1635 -897 198 -509 -343 943 379 754 1208 1189 1029 1963 2059 733
951 733 864 2300 1004 96 786 309 -425 -28 -174 -1489 -1042 -782 -1297 -1729 -1248 -1399 -1336 -494 -962 -1831
971 -1831 -617 722 -575 -682 1091 1643 725 740 1213 1302 1564 1842 1024 556 1104 897 334 424 -299 -310
991 -310 -48 -557 -1769 -1318 43 -1027 -2243 -1111 -460 -1457 -1189 -610 -700 -509 -116 292 318 184 1048
1010 1048 1185 1404 1002 797 1500 1684 502 662 1486 700 -65 -36 91 -685 -701 -402 -921 -1596 -1085 -723
1030 -723 -1044 -870 -1253 -1324 -484 -661 -1277 -585 612 439 -276 790 1554 1169 1362 1493 1188 1373 1227 1278
1050 1278 1216 526 181 436 -25 -655 -908 -478 -691 -1574 -1488 -508 -1269 -1817 -821 -775 -1204 -1259 -1043 -206 -192
1071 -192 9 376 821 979 980 1585 1828 1652 1476 1673 1134 570 827 628 -218 -808 -530 -249 -1354 -1433 -1221
1092 -1221 -1114 -729 -1312 -1626 -813 -360 -995 -952 -407 -215 35 674 355 820 1289 1505 1051 815 1757 1788
1112 1788 1249 1177 748 482 315 -477 -923 -770 -484 -1120 -1680 -811 -674 -1674 -1059 -628 -978 -701 -260 -640
1132 -640 -437 354 385 -280 326 839 449 988 1341 718 889 1133 835 419 779 957 -244 -710 74 -523
1152 -523 -1354 -512 -553 -977 -559 -480 -968 -463 -208 -411 -343 -146 -268 -483 -392 85 -117 253 438 7 376
1173 376 1006 844 734 1092 1384 706 586 914 285 -381 402 -296 -924 -316 -363 -916 -524 -439 -759 -892 -463
1194 -463 -484 -903 -35 -181 -1101 -502 217 -369 122 670 485 601 1054 1172 1019 1404 1586 456 438 1328
1214 1328 382 -271 350 -42 -675 -518 -570 -736 -1324 -435 -800 -1437 -816 -474 -1032 -723 -369 -281 -191 170 93
1235 93 405 1088 1128 787 1035 1596 971 1033 1448 749 493 537 99 -558 -562 -303 -920 -1297 -813 -1308 -1212 -975
1257 -975 -721 -1131 -686 -315 -805 -82 7 151 285 494 678 864 958 1285 925 1052 1217 838 915 948 900 318
1279 318 -222 44 -636 -833 -724 -1201 -1342 -1011 -1087 -1327 -1030 -674 -545 -469 -139 -146 -181 421 319 332 736 892
1301 892 346 966 1094 986 847 816 783 541 499 292 -273 -379 -253 -499 -1139 -552 -779 -1238 -1029 -827 -606
1322 -606 -1000 -497 -295 -397 -355 346 201 218 257 154 543 902 363 599 682 907 478 232 1018 350 96
1343 96 496 46 -384 -285 -98 -573 -883 -463 -902 -825 -535 -606 -599 -653 -52 -373 -238 -65 27 -128 467 380 200
1366 200 537 765 638 698 920 625 490 872 493 299 144 44 -247 -334 -299 -517 -608 -473 -796 -1186 -556
1387 -556 -614 -585 -436 -559 -81 -59 -107 184 427 173 445 182 601 745 949 752 872 711 404 584 144
1408 144 32 146 -11 -455 -335 -569 -404 -792 -806 -608 -1091 -642 -603 -734 -367 -389 -287 -112 106 497 459
1429 459 484 925 424 482 1012 870 710 764 471 539 347 15 147 -393 -227 -479 -557 -462 -617 -846 -525 -851
1451 -851 -689 -648 -726 -267 -308 -36 24 8 314 199 357 421 895 705 692 741 540 711 432 431 258 21 74 12
1475 12 -270 -300 -339 -237 -343 -739 -759 -568 -550 -571 -314 -530 -555 -417 14 298 217 558 256 398 415 510 688
1498 688 760 979 562 568 594 269 212 398 -290 -224 -160 -173 -808 -368 -238 -807 -546 -706 -554 -872 -506 -230 -330
1521 -330 28 -41 93 174 495 404 533 735 399 642 819 849 573 449 264 -106 329 339 -136 -231 -59 -438
1543 -438 -897 -791 -674 -678 -467 -640 -844 -498 -147 -371 -310 -174 143 120 332 499 646 631 681 638 440 571
1565 571 595 -54 179 340 -74 -185 -109 -149 -446 -316 -662 -758 -528 -505 -592 -516 -159 -283 -395 -251 -142 -50 -17
1588 -17 39 398 559 587 363 548 613 656 543 541 472 385 429 177 -42 -107 -462 -328 -381 -255 -336 -849 -601 -581 -685
1613 -685 -614 -350 -275 -638 -173 -19 -174 -69 215 418 428 436 332 436 345 635 406 239 196 101 -87 50 -216
1636 -216 -231 -155 -330 -561 -481 -68 -393 -725 -584 -524 -620 -269 -505 -308 100 -293 -65 124 194 583 588 744 276
1659 276 653 623 457 771 649 342 291 165 -214 -64 -292 -159 -203 -465 -411 -565 -541 -407 -429 -707 -338 -717
1681 -717 -510 -128 -222 -132 201 685 350 215 451 584 722 709 672 348 599 549 391 -20 -210 -12 -440 -451
1703 -451 -191 -329 -614 -418 -490 -639 -390 -195 -438 -385 -442 -361 -374 -12 217 -79 511 596 312 397 660 584 521
1726 521 868 470 494 258 138 67 -98 -78 -390 -632 -358 -689 -136 -242 -757 -802 -248 -428 -404 -377 55 -139
1748 -139 -276 240 411 203 817 986 314 370 573 196 351 561 521 -255 290 229 -254 -75 84 -413 -380
1769 -380 -196 -320 -650 -351 -209 -537 11 -124 -458 -64 135 105 -46 314 273 38 389 782 362 257 572
1790 572 410 526 391 414 187 300 111 -110 -241 -36 -456 -643 -352 -312 -478 -467 -404 -420 -206 105 -339 -289
1812 -289 36 -128 121 173 481 212 243 409 383 597 398 542 327 326 271 152 117 68 -259 -469 -307 -283 -316
1835 -316 -325 -299 -802 -715 -258 -400 -525 181 19 -75 34 66 -38 234 307 286 380 542 187 355 525 633 370
1858 370 -2 303 113 -256 -79 -151 -275 -197 -392 -269 -544 -539 -345 -537 -478 -236 -329 230 -87 37 42 640 177
1881 177 356 263 265 384 444 440 418 324 448 299 337 -132 -40 -42 -151 56 -274 -390 -123 -530 -278 -361 -423 -314 -250
1906 -250 -95 -226 103 37 144 306 270 147 1 588 236 349 534 420 151 347 199 211 276 -29 242
1927 242 -70 -162 -261 -310 -362 -284 -518 -283 -533 -456 -171 -374 -283 -246 -197 56 189 375 282 240 377 272 305 389
1951 389 548 319 193 416 281 49 276 35 97 -211 -153 -248 -374 -484 -418 -465 -310 -403 -216 -318 -555 -107
1973 -107 25 97 -221 257 99 462 306 451 503 509 438 354 505 344 485 424 166 -199 -94 -159 -169 -197 -283 -531
1997 -531 -191 -586 -294 -93 -240 -281 -76 -82 -219 149 117 230 312 341 377 241 471 668 406 506 181 55
2019 55 21 238 265 -91 -11 -95 -320 -129 -90 -377 -313 -336 -370 -139 -482 -5 -129 -271 -273 24 47 150 -91 315
2043 315 545 479 280 186 426 339 456 236 371 -141 34 145 49 130 -49 -350 -182 -434 -501 -400 -236 -319
2065 -319 -9 -556 -393 -125 41 -86 48 41 143 257 103 368 291 340 217 526 346 525 186 369 151
2086 151 -59 244 46 -16 -263 -14 -370 -387 -563 -426 -559 -741 -231 -109 -159 -136 -10 60 -167 25 315 149
2108 149 87 433 233 511 456 384 511 344 290 307 169 -107 -79 178 -257 -89 -168 -142 -322 -316 -384 -232 -5 -5
2132 -5 -338 -102 -252 55 23 185 221 218 298 329 370 -31 648 61 260 82 367 81 3 266 -51 -165 -88 -113
2156 -113 -204 -160 -132 -356 -215 -147 -194 -298 -157 15 -122 58 -183 130 -21 205 163 336 206 78 177 239 32
2179 32 599 125 222 100 -87 78 107 -96 -46 -290 -359 -230 -244 -393 -403 -115 -153 -202 -212 57 -355 -11 126
2202 126 198 268 260 147 2 248 312 191 132 489 308 392 148 183 24 -26 -57 -337 -196 -11 -292 -168 -72 -118
2226 -118 -370 -225 -55 -210 -109 -150 -11 232 92 462 204 311 91 50 375 234 294 -41 140 273 -62
2247 -62 339 253 73 15 -56 -289 -374 -150 -355 -219 -319 -182 -305 -248 -296 -109 -71 239 59 -29 133 219 239 165
2271 165 272 306 184 445 67 441 186 37 -60 111 24 72 -199 -204 -104 -161 -492 -322 -83 -51 -465 -523 -294
2294 -294 -148 -31 -30 34 -103 -119 12 74 232 89 250 246 50 368 240 242 294 -51 40 -214 -356 -70 -176 53
2318 53 -434 155 -204 -260 -67 -558 -415 -440 66 -169 -156 40 103 263 393 108 -64 210 351 145 333 299
2340 299 328 -11 220 231 199 -182 -115 -155 -137 44 -324 -315 -81 -192 -328 -129 -289 -169 -111 -181 -7 -108 74
2363 74 87 101 129 181 78 219 224 3 314 375 35 179 127 267 150 33 77 -118 -109 104 -147 -140 -330 -269 -421
2388 -421 -95 -113 -263 -57 -106 43 -99 388 -103 97 193 -90 391 257 104 207 358 133 296 212 128 211
2410 211 -36 -246 -83 -87 -328 -141 -72 -117 -6 -401 -359 -8 -42 -68 -279 -116 178 -167 72 218 -75 36
2432 36 -45 41 -148 453 386 14 192 228 56 -358 281 172 -35 -179 -193 -126 -279 -280 -322 -444 -296 -281 -362 -297
2456 -297 111 -347 -133 73 -85 249 198 153 174 362 500 224 365 460 130 258 45 108 225 70 -216 59
2478 59 -213 -200 -258 -346 -224 -230 -404 -331 -79 -336 -76 -119 -212 215 -18 -124 193 303 4 235 444 280 -49
2501 -49 374 76 69 285 207 -357 -263 -40 -189 -301 -49 -218 -368 52 -259 -40 -234 -188 -142 -344 442 118
2523 118 46 59 137 18 34 331 185 212 -86 -22 33 380 137 9 90 -9 71 -87 -151 320 41 -63 -44 -29
2547 -29 -343 -133 -169 -242 -372 -26 -132 36 105 -191 326 185 45 146 62 -138 228 43 231 456 53 -59
2569 -59 47 102 272 59 -72 -15 93 -59 -361 -46 -187 -370 -270 -206 -69 40 -221 38 -176 59 265
2590 265 -137 34 157 184 367 166 67 295 232 132 93 27 -105 112 -39 -146 -13 -60 -419 -226 -172 -471
2612 -471 -554 21 -277 -20 -106 -252 -100 -241 106 54 -66 180 196 109 330 181 198 156 281 261 270 59 223
2635 223 146 95 -19 -111 -222 -200 31 -266 -315 -187 -397 -523 -259 -27 -243 -210 -197 41 242 -64 185 242 254
2658 254 -32 146 262 40 42 -68 310 205 10 96 113 -91 -67 35 -227 -92 -284 -61 -140 -235 33 -225
2680 -225 -55 -229 -186 12 -86 -170 -175 7 -20 206 333 245 243 158 190 363 136 18 216 296 173 220 -126 239
2704 239 -119 -194 -83 22 -55 -305 -231 -338 -216 -160 -192 87 -112 -213 -43 47 258 113 22 181 144 -55 277
2727 277 302 161 100 39 -54 14 210 122 -116 -190 -237 -285 -267 -293 -404 -412 -161 -235 -391 -293 -52 -123 -72 20 95 -149
2753 -149 203 162 119 56 284 400 211 99 75 272 170 76 -48 -91 -127 -153 -88 -14 -165 -158 66 -275 -123 -201
2777 -201 -187 -282 -150 -29 -50 -370 70 195 285 306 -77 113 -101 -114 470 163 314 371 155 152 112 261 30
2800 30 -115 -411 -142 -352 93 -316 -197 -26 -118 -172 -146 -159 -122 -250 14 -34 103 36 -99 97 79 221 158
2823 158 172 217 136 -126 130 -42 215 -153 -192 -204 -236 -28 -348 16 142 -210 135 -128 -88 70 -124 63
2845 63 249 -59 79 60 285 181 -255 -21 322 124 237 311 360 -59 154 171 125 -133 -139 -19 72 8 -45 -439
2869 -439 -311 -261 127 -19 -137 -129 -326 -43 -183 -242 -55 11 -42 87 7 36 56 400 296 16 135 135 196 -5
2893 -5 32 -151 237 -101 -108 -117 -25 -115 31 -143 -247 -126 -67 -229 -153 -36 -23 177 -137 170 88 39 -141 15 153
2918 153 309 44 376 313 150 105 114 -3 89 242 -1 194 83 146 -119 25 -242 -41 -322 20 -128 -211
2940 -211 -362 -226 -7 128 -60 -148 90 161 159 108 2 97 209 288 466 214 182 392 -35 29 107 73 -164 -112
2964 -112 79 -174 -122 -383 142 -230 -196 -366 -62 111 -178 -117 -163 28 78 66 74 90 179 173 187 319 352 78 29
2989 29 289 69 41 5 -247 89 92 -44 -5 106 -159 -100 -252 -171 -169 -201 77 -59 146 -130 61 -48 285 -70
3013 -70 196 143 -28 208 286 44 116 26 331 107 56 -142 -7 93 162 -338 -186 -334 -321 -69 83 -218 -116
3036 -116 152 -200 -89 -229 -252 44 -46 62 69 -49 11 135 -66 235 -11 140 78 144 262 -91 -7 -104 -28
3059 -28 -230 119 -222 -186 -238 83 2 -345 -283 35 -32 106 -101 -147 -115 -49 389 19 39 -2 233 73 78 303
3083 303 -151 183 128 -121 53 98 58 -129 32 46 91 -77 -302 -140 77 -86 -25 -135 193 199 -134 22 -287
3106 -287 -241 -57 204 -93 181 278 -188 263 296 199 85 364 48 239 50 258 291 -19 -143 53 -73 -87
3128 -87 110 -141 -43 -126 -283 -111 -226 -93 -49 -208 -218 77 242 24 -302 101 -89 139 83 103 45 260 368
3151 368 206 72 -265 -120 -39 0 -51 145 -384 -66 -270 -105 -235 -312 -94 65 -171 79 -96 121 152 101
3173 101 -99 145 246 39 293 -127 321 148 52 232 300 -5 25 -10 -6 76 1 -9 -116 49 -79 -96 -149 -29
3197 -29 -199 63 -131 320 -150 132 90 -161 -114 -133 121 22 251 -46 141 352 378 176 51 141 148 190 -45
3220 -45 -2 102 -37 -111 -81 -221 -270 -298 -15 48 -170 -162 55 -51 -13 59 -76 119 182 112 -40 -85 143 181 -11
3245 -11 328 197 18 202 79 -368 -115 -50 47 -131 -93 -243 -265 -251 -65 -264 52 -119 -374 18 36 -200
3267 -200 114 153 -187 -92 113 335 -38 225 21 -316 361 208 17 271 -44 169 115 -50 -91 -254 -340 -310
3289 -310 -116 127 -174 -90 -6 -49 -246 -9 -342 -25 228 14 -91 87 321 41 203 11 -36 139 134 124
3311 124 3 -58 276 209 111 78 186 -2 -21 88 -94 -22 77 -166 -184 -168 -234 -197 20 -200 -5 81 -52 -29
3335 -29 96 176 -187 215 41 243 348 152 124 244 64 -62 284 -22 59 150 -101 -30 -82 -334 -255 -32 -111
3358 -111 -97 -143 22 -123 -185 -87 5 -207 0 204 2 105 251 134 -43 210 106 82 17 -73 317 226 -86
3381 -86 -36 141 -179 345 -262 -225 -195 -343 184 -98 -53 -216 -21 39 203 125 -125 107 30 9 331 121 136
3404 136 66 254 84 -100 -97 199 54 -235 125 134 157 -112 -198 -119 -197 -123 121 -251 -395 -187 -100 56 172 -120
3428 -120 -103 253 -175 13 33 153 271 -67 111 242 182 178 268 -113 60 -151 -118 4 245 -88 7 48 -81
3451 -81 -116 -253 68 -132 -11 18 -50 -118 118 218 34 -122 36 -56 123 -7 -122 140 176 308 453 238
3473 238 76 14 193 49 60 -80 -95 -149 -96 -14 -185 -58 -262 -85 159 -245 55 47 -2 -433 35 -11 186
3496 186 -140 256 65 340 281 50 236 99 191 134 166 10 -50 -43 -37 -241 42 -3 -98 -108 -157 -171 -200 -161 118
3521 118 -74 -89 40 -492 45 159 -131 20 161 37 -200 136 -73 -14 -65 228 330 -9 84 312 -183
3542 -183 -156 -133 172 -266 -16 -354 -243 88 -211 -57 -226 209 56 -165 80 15 -268 112 -99 130 236
3563 236 498 -16 -88 -20 60 131 -88 102 -147 275 72 -29 -4 129 -209 -160 -26 53 -199 -3 -127 -72 -172
3586 -172 93 -13 -149 15 -69 241 9 117 62 434 153 -10 120 153 -226 -38 217 139 122 141 28 -107
3608 -107 -172 46 -49 -108 132 -128 -231 279 -327 -221 -374 -73 10 83 -115 -143 54 -37 108 -24 200 101 61
3631 61 -35 91 -12 -163 244 -59 -51 32 -87 -100 -273 109 -255 27 -52 -145 -279 -31 -251 -111 -237 -27 -100
3654 -100 -16 156 -22 15 171 193 251 183 -27 288 -49 19 12 11 58 -47 111 -138 -92 -46 -274 -21 -318 -274 90
3679 90 -339 -22 -85 -325 34 -185 -107 12 -184 156 -130 20 -157 100 224 15 -142 -31 307 154 198
3700 198 -63 -114 35 -158 322 30 -61 -131 -257 -24 -210 -40 -13 -71 -97 6 -18 -92 -47 -45 -16 -276 -184 -23
3724 -23 146 67 148 227 325 -9 101 -24 0 89 75 252 -32 -157 78 -79 -64 -68 -211 -17 -245 -109 -32 -84
3748 -84 145 -191 169 125 141 -105 55 -34 250 207 -47 290 128 270 -10 -25 314 207 136 261 -28 -70 13
3771 13 115 -153 -242 -183 -137 -114 -126 -191 -284 -34 -352 -133 36 -9 177 -172 204 -96 247 157 -53 -4 345 -62
3795 -62 176 137 -234 -90 68 51 -152 73 -52 -117 -60 -146 -229 -185 -175 47 37 -79 -268 -262 -90 -34 -22 47 -80
3820 -80 284 205 -21 66 72 94 -1 170 112 -112 128 140 -142 -253 -193 124 -118 -135 -26 -85 -82 -188 30 -85 102
3845 102 -55 70 282 90 -5 310 53 -43 269 -104 139 29 -22 212 94 311 215 -66 -48 -286 76 -33
3867 -33 185 -372 -39 136 -53 -162 -45 85 -142 -111 -85 -96 180 -73 210 4 152 -97 289 172 83 127
3889 127 7 81 65 257 -38 102 113 -123 -41 249 113 -201 52 -44 -322 -158 -608 -124 -213 19 -33 42 50
3912 50 -16 -290 -74 359 277 214 210 172 209 15 40 209 -37 0 -189 22 235 -175 -84 75 -135 104 97 102 -321
3937 -321 -178 -148 -21 32 58 111 343 -100 65 75 147 -50 124 39 -113 -111 157 72 -36 136 110 69 126 14
3961 14 -161 -220 134 180 -18 -147 -223 -163 -166 -78 -165 -176 -64 -20 35 -19 -147 -142 -174 293 10 37 41 87 -56 153 66
3988 66 219 243 247 142 181 138 -61 38 -17 58 -50 -93 -117 29 -12 -150 -39 -146 -186 50 -185 -40 161 23
4012 23 66 -66 161 143 26 209 -59 -73 -148 145 124 87 66 102 -136 -279 -124 -143 54 59 -77 -115 -181 -146 -20
4037 -20 -196 -181 -130 -112 -383 -43 8 -2 315 -142 31 -76 163 131 202 207 236 71 185 -47 -21 -113 -22 -117 8
4062 8 15 -1 -104 -31 -333 27 315 -52 -48 -118 -102 -154 -244 2 -28 197 135 199 154 346 253 4 86 -17 82 57 122
4089 122 132 108 -108 -198 -104 -13 -17 -61 -11 -132 -148 -239 -297 -186 -164 -198 -104 33 -222 6 -32 -187 -86 19 98 30
4115 30 269 283 68 102 50 -153 275 65 32 -63 168 -16 -175 -64 -78 -80 -199 -1 -198 -99 -32 24 -104 -31
4139 -31 -18 -206 119 77 88 115 197 -13 35 147 27 223 287 28 -7 114 137 -52 -32 325 -5 -190 -59 -10
4163 -10 -213 13 101 163 -80 285 88 23 -56 13 325 44 120 -152 25 -36 -12 314 63 182 -57 -163 60
4186 60 23 78 -10 2 182 -39 65 -152 -63 -373 -5 48 -153 -314 131 25 -6 -232 -5 146 100 -27 -19 119
4210 119 128 140 105 -17 42 109 24 -13 -80 155 -211 -116 208 -130 -81 46 -87 -154 123 -252 -189 -22 -251 45
4234 45 -70 15 58 19 92 -50 252 111 288 200 -87 200 25 279 -103 -10 80 53 274 -123 -49 -219 -107
4257 -107 -117 81 -167 15 -140 -14 70 102 -122 -156 206 -104 125 7 20 114 89 368 157 14 76 8 -173
4280 -173 -13 301 -142 -241 -39 17 29 -55 -129 153 -174 -286 -96 -137 -10 -122 -73 70 -154 85 7 138 6
4303 6 104 109 -134 -164 -211 362 90 162 47 172 -24 215 251 365 176 -107 39 -155 -113 -301 -51 -144 -107 -250
4327 -250 12 -70 -166 119 180 49 -28 -29 240 105 55 -77 421 62 127 -79 280 -76 136 55 109 75 56 39
4351 39 -56 70 -117 -134 97 6 -99 -18 53 -160 -134 -288 -128 -132 -41 107 -132 -43 31 149 30 -9 236 250 51
4376 51 154 -74 -111 245 -13 96 58 -207 29 -428 111 -117 52 -274 115 22 32 -93 74 -63 -216 -32
4398 -32 311 35 -66 146 -190 184 112 122 11 45 -67 135 127 -24 112 1 3 300 146 -63 42 -123 -313
4421 -313 -144 -190 -53 -201 -42 -72 -90 108 -181 116 165 104 60 -72 -245 90 274 -33 28 -16 -49 -185 -178 218
4445 218 -46 37 -186 -170 9 -275 -132 -79 -18 -371 -234 -61 -362 19 53 -271 26 153 -207 30 87 -50
4467 -50 6 98 -102 -105 143 -133 59 12 34 -244 48 75 124 -123 154 268 -38 -173 -153 -79 110 -103 -224 -58
4491 -58 -252 -249 -33 -76 -96 55 280 13 -21 -76 25 21 379 236 -148 66 43 285 227 143 64 -364 149 276
4515 276 49 11 150 -132 -14 -134 -342 -184 166 187 44 235 35 -51 15 -43 -110 -20 215 133 154 282 -165
4538 -165 67 129 146 67 -12 101 -83 64 -60 -73 188 -128 -95 -171 -165 -271 -8 -169 27 96 13 -311 -179 -145
4562 -145 213 -211 136 67 -22 -17 -157 112 -39 -31 -112 -126 65 16 -106 -74 -102 -110 91 -130 65 -65 -66 124 -149
4587 -149 101 -222 179 -10 51 27 25 222 152 -19 -49 193 30 236 -79 -102 -65 127 51 267 155 -69 62
4610 62 38 76 -98 116 -197 5 -267 -147 28 119 -83 197 -139 17 -78 152 -16 183 163 -45 -147 -26
4632 -26 150 47 251 49 149 57 80 172 120 -70 -32 -120 57 -82 -83 34 -288 70 84 -227 121 -23 -159
4655 -159 -138 -51 -29 -8 199 -38 -46 195 84 -223 92 -125 -40 204 -79 -127 14 -172 158 -152 165 259 68
4678 68 31 -139 -122 -411 32 81 86 294 -42 60 189 -4 109 263 8 -167 203 159 104 -1 193 158 -35
4701 -35 196 27 147 99 -78 33 39 -122 -339 -63 -64 -161 -37 -160 175 -54 -56 -50 -170 -303 33 306 -39 79
4725 79 24 37 212 216 -98 87 203 45 -5 147 -54 -117 -38 -74 77 -92 -15 87 -10 12 -50 116 -110 -107 -110 44
4751 44 177 -227 50 36 -11 37 -87 152 37 126 115 5 50 328 23 -18 33 86 0 140 256 -144 -61 248
4775 248 -40 18 -23 -231 161 -4 -50 135 -90 203 -140 -188 -22 96 44 208 -103 -131 47 -130 176 367
4797 367 -1 -158 -15 -16 100 -248 -117 106 10 -95 -162 -134 -77 -471 -181 -130 -47 52 94 224 -49 -81 148 24
4821 24 247 -25 14 280 -145 188 153 -64 16 125 109 321 36 11 32 -43 123 -145 51 -215 -40 -55 -100
4844 -100 -153 -1 -50 32 -88 -210 -11 -95 137 -59 -36 -171 -179 -134 115 103 86 0 24 393 -183 -70 -70 -62 82
4869 82 -29 250 -52 0 76 290 -86 -82 -109 62 7 -114 -111 136 -191 -189 36 128 -120 47 60 -87 -113 77 -156
4894 -156 -110 -65 73 506 188 -135 -321 101 -247 -17 -3 24 323 41 93 68 -2 -52 226 -23 8 111 172
4917 172 -158 -167 -204 2 -88 120 128 179 57 -49 -28 79 136 48 -115 -73 -77 -246 36 26 -14 -102 40 -193 -21
4942 -21 -8 78 -29 -217 51 91 -290 92 111 186 357 57 -4 -104 -124 135 20 275 17 -137 -46 0 23 26
4966 26 -154 214 82 -168 89 -254 -129 79 -11 208 149 -145 85 69 -100 77 32 -158 107 -40 3 8 -9
4989 -9 -184 109 83 75 -134 79 -99 209 162 -61 -176 117 64 -128 -162 148 -16 -220 107 -77 -119 -50 10 -332
5013 -332 -73 -73 -68 88 75 76 0 278 130 62 45 169 -305 -4 110 51 94 202 140 41 -179 -167 39 36 174 -273
5039 -273 31 195 114 110 -76 -77 -7 -56 -17 -6 13 15 187 125 4 138 -45 -57 100 73 -8 -117 23 -82 -33 -367
5065 -367 31 31 -153 15 -262 136 21 -81 180 -235 -142 36 121 -151 -102 -6 101 213 186 -33 266 23
5087 23 166 94 -80 -59 -71 -117 -20 -12 -75 61 -65 -105 -39 173 131 2 -259 -95 -159 -3 264 190 -17 -186 -195
5112 -195 -268 220 165 37 150 -70 -115 430 8 111 92 33 -66 -140 180 78 -187 -17 76 -287 143 29 -59
5135 -59 -215 -46 -167 0 -148 2 -26 78 -52 70 80 -86 89 54 -228 119 -33 -17 69 240 155 74 134
5158 134 -69 39 -46 72 -277 -132 221 -190 -9 -194 -203 130 43 -92 -7 -160 -58 -55 174 36 -3 -27 -158
5181 -158 67 -174 82 -225 -46 188 247 -152 -31 58 -154 150 136 131 -111 -15 -43 -116 -94 -184 41 -163 53
5204 53 -9 5 48 -7 184 -96 1 -50 79 44 -15 144 325 154 20 120 256 163 -141 -201 44 119 27 -201
5228 -201 -11 -107 -85 98 -153 32 131 -40 71 -91 80 51 83 21 -31 35 128 -100 -26 178 1 -74 -201 190
5252 190 159 -173 -68 -173 -10 -78 -93 -332 25 -108 166 173 68 101 -124 -169 -102 -158 99 -27 324 105 -36
5275 -36 -10 -93 -149 -8 2 122 64 43 7 64 -4 -61 -119 39 -78 -112 -34 -53 54 -319 75 26 -271 -39 -120 106
5301 106 111 -73 145 -30 28 251 -12 37 260 192 -88 142 119 -5 328 -71 54 66 -63 16 27 72 -250
5324 -250 306 -121 57 -400 -117 481 -246 -258 -135 -98 -63 56 -36 66 -82 -215 139 213 191 -112 25 -109
5346 -109 60 -45 38 352 -36 -19 25 179 -232 -76 69 30 -122 12 -73 -297 -188 122 227 -92 32 250
5368 250 187 52 11 -50 -162 57 57 171 -23 -151 -85 308 64 184 40 72 57 128 -20 -62 -164 -183 -175 -102 115
5393 115 -18 -256 -1 136 42 -59 -73 41 0 -37 9 -58 -80 -172 218 -19 190 20 -183 23 102 133 -139
5416 -139 157 209 -161 -8 -130 37 96 33 94 99 -130 -63 -156 -125 235 205 20 7 98 -14 85 107 -22 113 159
5441 159 112 354 -96 -103 -38 -18 342 -94 9 19 -122 -18 83 38 29 -78 -232 -99 -101 62 125 -364 -197 -62
5465 -62 -20 119 283 -109 -89 194 91 47 -34 56 168 -59 -81 -71 155 -137 71 14 -2 37 22 -114 -116 -135 -96
5490 -96 -30 -118 -120 81 97 -134 -32 -19 -47 42 4 -219 -138 126 15 -45 260 -69 -107 -174 50 77 198 65 26
5515 26 -66 249 130 -216 184 -132 -317 78 -112 0 -187 -189 165 4 -22 122 96 60 75 -9 225 199 47
5538 47 -7 161 -4 -90 -120 -18 37 211 0 58 -282 -254 57 3 238 -74 -233 104 -95 44 -18 33 40 -101
5562 -101 108 176 70 129 -224 27 38 30 97 194 89 -61 -26 379 53 175 121 63 5 86 -42 44 110 -216 -1
5587 -1 -90 -78 131 147 -143 -30 10 -104 155 -111 -109 -216 11 109 -26 98 177 61 14 246 59 134 96 -166
5611 -166 30 152 -85 -14 10 -103 -67 18 64 127 8 18 124 183 -144 -141 6 -165 93 35 59 157 -115 271
5635 271 187 -161 178 73 37 49 20 65 -40 -21 102 -146 -134 -51 99 92 6 -159 237 -58 -328 191 191 -70
5659 -70 28 -165 74 3 -6 201 67 -158 85 -64 54 107 214 277 -147 -64 234 124 -80 -114 46 136 -11
5682 -11 203 68 -201 -292 -84 -77 -30 158 80 262 100 -266 210 -141 81 -230 118 -214 22 -154 -43 0
5704 0 23 44 159 -197 48 115 181 -60 -195 -153 162 108 180 143 -19 -90 241 -254 -162 -352 -21 188 87 64
5728 64 -127 48 58 -185 -52 -287 138 -11 99 -124 -316 30 -29 -145 142 150 -78 -28 175 104 -48 61
5750 61 173 10 94 139 79 -22 61 81 58 124 150 42 -77 -45 -41 25 70 -87 113 53 -27 133 75 138 19 32
5776 32 8 -151 173 -67 -83 179 -229 -40 40 -62 -14 -177 -126 132 69 -41 18 -5 -201 87 135 -134 -34
5799 -34 101 9 -65 46 23 -112 -394 -166 29 -11 -273 -85 -156 -250 -43 -149 -149 243 166 -174 -105 -55 -136 200
5823 200 70 -31 195 -151 68 -136 -32 3 -130 17 -29 -56 -147 0 236 -6 12 -156 -124 14 50 -138
5845 -138 -117 99 96 -133 -4 126 23 241 19 140 -17 210 68 -42 -27 125 -149 76 148 -47 77 -108
5867 -108 -40 -61 48 -138 -280 -27 -141 -120 -165 -74 -54 0 147 -63 -77 29 91 224 99 -52 34 68 -35 109
5891 109 -90 -53 -43 50 -79 71 -202 14 120 80 41 -30 31 17 54 -30 -114 138 63 -188 -79 22 111 -164
5915 -164 -65 19 -85 -7 -141 -65 -150 113 -60 -180 113 1 -80 -87 28 104 -62 -77 272 -96 -74 -12 -37 -152
5939 -152 -73 -5 -101 80 45 60 -119 46 73 -66 -38 -13 142 -2 134 29 114 -73 -143 35 164 40 -31 -19
5963 -19 -49 25 383 0 128 20 -256 -14 -170 252 99 -30 -74 -132 194 -70 -140 94 -15 55 88 -77 -142
5986 -142 165 -212 -46 54 155 8 166 47 108 8 -218 287 -23 275 -103 -172 -73 192 -133 94 65
6007 65 -122 -11 4 -219 142 -13 -161 -96 -71 -209 -151 -141 -61 -8 -36 197 55 -17 -200 109 -104 -175 157 -204
6031 -204 184 106 125 -145 -174 -80 41 -16 -144 230 189 -11 -94 135 33 107 -44 218 -146 2 74 105 -160
6054 -160 -16 -85 17 124 -98 -59 50 78 109 -108 112 282 -72 -52 30 -187 -83 -223 238 -156 96 -36
6076 -36 -40 -93 -182 33 -179 -208 27 146 110 59 -10 46 -209 113 -26 156 29 -70 -56 409 174 92 -136 128
6100 128 -67 -217 -85 136 -110 196 -107 22 158 -96 -226 -114 -306 104 -26 15 -174 17 -78 -186 -113
6121 -113 -26 15 139 -58 123 -14 150 156 -40 37 -199 -30 75 14 209 -26 -54 86 5 -43 20 24 -107 72
6145 72 -11 -76 155 141 -27 -37 181 2 96 72 191 -33 106 121 -42 123 128 -102 -66 325 -176 74 -178 0
6169 0 -195 -28 -94 -237 150 -36 56 -77 -151 -75 -172 -26 -58 -93 -40 183 12 -32 180 103 98 -36 -99 -85 129
6194 129 26 -160 8 14 -30 -50 -206 -127 -241 -177 -256 -28 252 87 34 -115 124 -161 -74 165 -134 -6 -14 -134
6218 -134 111 212 -121 77 -193 97 -6 158 -60 -189 46 -23 153 -172 138 -164 -24 79 -10 -51 83
6239 83 -75 -116 52 192 -89 130 -47 -129 -210 -127 135 25 -37 -70 -126 -250 319 161 96 -69 -157 -303 295
6262 295 4 -302 -123 137 -240 -18 188 -274 -78 83 239 151 -21 71 -84 -36 -201 3 249 103 58
6283 58 264 20 -85 103 45 187 50 -57 -137 84 -8 99 66 121 -207 -198 -55 61 -223 52 -29 -198 -26
6306 -26 51 144 -3 -49 -185 -59 -20 17 237 -1 119 77 -110 14 97 -19 -119 73 -25 54 -273 -63 -46 176
6330 176 -72 39 -356 -35 -242 -128 -54 -22 -304 -8 -56 59 112 -88 287 -1 80 -148 -12 -203 252 -107
6352 -107 -121 52 130 76 76 70 115 -122 -74 -140 36 -142 -224 167 -246 35 -26 -6 10 -27 27 -175 1 0 -40 -97 -208
6379 -208 -141 -139 -31 87 -154 -10 -61 -54 239 36 117 61 -22 89 133 -20 -105 -131 -133 32 136 -14 160 -165 -137
6404 -137 -13 4 173 57 -17 -74 17 98 201 -140 130 189 249 -102 400 395 62 86 -8 175 170 -104 202 -36
6428 -36 -104 -84 -88 270 -196 -65 -88 136 67 -103 20 -122 9 232 142 40 23 -64 193 173 55 -170 158 158
6452 158 -30 -97 96 -162 -95 -3 -210 -245 -220 98 48 -146 -192 101 -81 39 66 -57 -90 141 44 98 -26 142
6476 142 69 -170 24 -27 -50 -80 67 84 107 -197 193 -70 -180 120 -20 -127 -218 -206 -19 119 43 57 -28 -206
6500 -206 -32 -132 173 0 93 -71 66 -110 56 -2 -25 138 59 127 -12 35 -85 47 34 -182 -51 -107 40
6523 40 -193 -72 178 140 -249 179 113 74 -192 15 -62 50 132 48 132 132 142 -240 137 -241 -43 -216 -30 2
6547 2 65 60 -130 195 -49 15 -172 60 -265 61 -249 -103 -138 -106 -179 97 247 -237 -128 207 -250 15 326
6570 326 -66 178 -3 199 -58 -80 133 34 131 -34 164 17 -114 -216 18 -267 97 91 172 -354 -20 -414
6592 -414 -48 57 -286 -72 -142 -35 -177 -81 191 -35 69 -163 -16 -157 171 -38 -154 295 186 22 -140
6613 -140 420 207 -40 -63 -195 -151 -150 -118 14 -61 -244 -56 -221 -106 -10 30 -370 59 303 -60 -190 87 202
6636 202 14 -208 -138 16 -4 80 -219 -98 147 -362 138 -252 -150 -240 -56 -127 23 25 -11 131 -36 -9 61
6659 61 -222 -93 -289 149 -108 116 159 -146 -105 114 297 140 153 228 -110 21 -25 -118 280 58 -109 -165 189
6682 189 122 -53 -128 35 -80 -47 148 -295 32 142 47 -250 -222 -17 -300 -105 99 159 -25 93 -102 50
6704 50 77 163 126 -94 67 -182 -129 57 -52 -278 -122 -136 -34 -35 -1 -140 96 -88 97 110 -358 -131 -122 56
6728 56 49 14 36 -272 136 133 60 18 186 -58 269 49 52 75 239 129 71 51 -29 -118 -175 5 -72 -92 178 146 -78
6755 -78 91 -113 74 -49 -32 -69 367 169 197 -79 -316 -28 73 198 -55 42 -87 135 64 -423 86 44
6777 44 69 68 -26 315 32 -146 103 -20 -73 98 -129 69 -31 100 77 55 -4 44 349 119 -178 156 -61
6800 -61 96 -22 -88 -21 260 36 36 30 -136 -72 -93 -142 111 9 -109 -35 0 -93 -149 -29 -180 -108 -168 29 -102
6825 -102 46 -26 36 26 77 37 -42 159 12 42 -145 63 227 -248 42 29 131 134 167 158 -129 -89 -119 2 -182
6850 -182 41 -2 -51 -20 36 -32 -20 -144 -86 120 78 -2 -136 85 150 149 -120 19 -62 89 93 -51 -108 -13 -290 -17
6876 -17 92 24 -230 19 3 69 -6 53 -267 -166 17 -123 -83 -26 -65 -125 -216 -64 -68 10 84 -182 100 -146 -140 75
6902 75 60 168 98 70 -69 -175 118 139 -102 81 -116 -81 66 -4 242 -68 202 -146 -113 314 -278 7 -63
6925 -63 188 193 -224 310 51 106 12 80 -2 110 195 60 -72 297 137 -146 93 27 -151 6 -66 162 -205
6948 -205 88 72 35 115 24 -121 3 160 160 -14 150 143 -107 163 100 257 111 -86 -195 85 -75 73 -58
6971 -58 171 -108 204 25 138 74 -79 -141 -145 205 -127 -178 -26 96 235 50 103 59 50 316 -57 -92 134 26
6995 26 -43 -46 88 -106 27 121 44 50 433 143 108 -108 106 -117 -197 -170 161 219 162 -106 -113 113 -105 -66 -75 -14
7021 -14 86 111 -132 -27 -149 -250 32 102 8 -90 -48 109 153 1 151 220 -22 187 127 -367 -2 114 142
7044 142 91 -22 -195 -62 20 -162 -54 -64 215 118 26 0 179 81 -10 70 -35 293 66 43 -168 44 -118
7067 -118 -57 40 -226 143 -51 -97 -295 239 -130 -43 -226 -101 -43 165 -3 107 58 80 -21 -120 182 75 122
7090 122 -28 -101 27 164 -192 -77 41 28 28 4 12 298 48 14 -151 -60 -88 5 -27 -200 -68 -128 2 78 -40
7115 -40 255 -23 62 -69 -288 114 -5 90 -85 -33 -140 96 -34 51 -83 -107 36 -128 -49 -113 -333 47 102
7138 102 46 118 -2 -25 -339 -121 -141 144 -43 -153 -59 34 -91 -90 -111 183 -81 -43 166 -122 227 -6 379
7161 379 -140 -20 117 -267 66 -112 -133 80 99 -89 40 -145 -125 65 -68 108 -141 114 -245 3 -210
7182 -210 35 48 0 -64 -98 147 -183 -71 188 50 29 -104 45 110 33 -38 65 -11 -275 -12 -64 18 107 200
7206 200 30 264 -161 -51 -154 284 -72 190 -53 288 133 59 162 111 149 -93 55 85 167 2 8 73 -76
7229 -76 148 -52 44 -238 202 -169 -378 132 -235 111 -6 -38 104 183 -164 239 -272 -41 -33 -115 -44 197 -163
7252 -163 164 183 120 -76 -223 153 138 50 1 -94 -63 143 -301 67 51 156 -190 44 47 -296 104 -123 -98 -24
7276 -24 -5 34 101 -119 -23 100 -19 277 -124 -99 -308 -72 -62 -157 100 -148 42 -152 185 -205 -29 -6 -45
7299 -45 -55 -52 -18 44 -40 133 7 52 0 42 112 -44 212 49 -65 -138 93 -200 127 -23 149 69 -190 -110 142
7324 142 140 330 1 -21 252 -316 31 -8 -114 -120 213 36 143 -37 -228 128 29 0 -113 104 -65 0 130
7347 130 -115 214 -105 -61 284 210 -99 35 1 172 -93 -67 -60 -159 -310 -191 32 -57 108 -36 -53 22 -126
7370 -126 -138 92 93 -46 -2 72 57 -161 69 -25 82 55 176 9 -40 288 -200 108 -98 -221 128 -263 -24
7393 -24 -85 171 44 -175 81 -11 73 -116 -17 -189 44 -121 60 192 7 -154 244 -89 117 124 -12 -203
7415 -203 11 -50 -209 66 274 43 215 120 -131 -149 143 -155 -95 -30 37 128 -11 86 -175 -34 -9 -53 69
7438 69 -92 -119 -109 3 0 -182 85 59 -60 -44 -57 115 -193 -119 89 148 -79 160 7 70 184 -42 -251 89
7462 89 -105 -39 216 68 110 -81 55 -21 -266 182 -182 154 33 -7 63 38 135 171 -1 -6 -293 -150 -112 -37
7486 -37 -123 -4 -18 -99 -150 98 -220 -256 -229 -131 126 -149 255 55 -4 -143 107 165 95 -91 57 -237 165 29
7510 29 -63 6 -118 -262 32 -104 6 -27 -97 -168 -169 -17 -339 -179 -11 -122 180 213 -141 -36 37 -285 -144
7533 -144 -85 -46 -296 135 97 6 -26 38 172 9 -112 235 4 -33 -111 -34 -247 -2 147 261 77 -187 130
7556 130 -254 235 5 44 185 12 99 71 -152 -228 -27 -143 98 -278 -15 198 109 101 10 -64 -275 12 -143
7579 -143 -79 -138 72 -151 26 -329 104 7 175 6 -118 -63 -8 137 215 24 -68 377 81 345 -13 -105 248
7602 248 144 5 186 -246 30 103 9 -29 236 -54 25 16 -59 -128 -133 -175 145 -114 35 125 -9 -180 -104 -421
7626 -421 -371 -47 -120 55 -20 -50 -104 -72 155 -38 -24 -81 -234 39 -115 67 7 -54 391 -81 114 54 -126 -231
7650 -231 -30 -37 74 -53 -212 -149 44 155 74 -108 15 108 -107 -333 55 242 -153 63 205 146 -291 -145
7672 -145 209 -131 -95 -261 -4 -105 -214 129 30 240 -138 108 31 -472 107 -106 89 -181 87 -20 -302
7693 -302 -37 260 -22 69 -220 -93 176 83 47 -60 -155 -69 269 58 69 231 126 144 -110 -57 205 -86 34
7716 34 -56 -217 -301 -110 -44 -299 232 -95 158 -66 38 -194 -33 79 -112 190 145 64 -63 17 51 203 -66
7739 -66 -107 -84 -146 50 -56 73 6 38 -37 37 -167 -61 14 241 -106 -20 -137 44 -73 -58 298 109 262 -22
7763 -22 2 -32 112 -214 92 -158 -5 127 -66 -51 97 -38 174 94 -12 93 70 69 -207 -83 43 9 -220
7786 -220 78 168 90 25 -203 -7 45 -3 -4 72 -99 -133 141 137 21 -257 6 63 112 151 50 -33 62 -170 133
7811 133 -11 -71 -271 96 52 -19 240 -86 -206 -70 -95 19 207 -1 -25 -70 87 77 -285 80 -170 37
7833 37 53 -122 -52 -38 17 218 -401 160 -27 49 129 -100 -105 -90 -56 68 33 -28 -55 -93 -194 128 123 -94 26 -125
7859 -125 -72 61 -22 -114 74 -34 23 -201 -166 -53 -2 111 83 -57 17 -127 -280 14 144 -280 39 -47 257
7882 257 77 140 -14 135 -81 52 -261 -147 -64 -21 -91 -74 -31 97 24 186 -233 72 141 97 86 1 -88 -135
7906 -135 -22 -25 -8 -65 73 -134 59 -183 -122 149 187 8 64 -123 60 -207 -319 -317 -137 126 84 18 -225 26
7930 26 134 -194 -247 108 -87 -92 154 -104 36 -114 283 -233 24 -54 -157 -127 187 139 -46 62 63 -53 -137
7953 -137 -84 -210 44 -162 166 171 178 253 -28 45 -87 165 -52 -195 200 125 -141 -38 354 31 -22 -261 55
7976 55 29 -50 -155 -2 67 -100 -101 88 -62 -42 258 54 -133 165 69 -152 43 53 123 -4 -4 -97 -43 182 135
8001 135 -78 56 8 -66 -278 -22 29 14 72 93 276 -58 45 -131 48 254 15 276 80 -270 -60 112
8023 112 -82 62 1 286 240 -164 -55 106 -231 -70 -284 88 274 134 158 -34 53 89 17 67 -29 66 1
8046 1 -170 56 41 -105 -113 -140 -73 -267 -195 9 88 20 -137 63 -157 281 -88 256 -109 -152 6 204 126 18
8070 18 100 -69 -67 -72 75 -44 189 130 49 -59 36 18 153 -154 -54 -82 -122 -103 58 -39 -9 91 43 224 -15
8095 -15 33 -186 -183 -110 -61 4 23 -7 275 -216 129 -29 -380 -280 196 -233 -78 104 10 4 -71 252 236 37 42
8120 42 31 -297 -232 -318 -219 119 -170 74 13 126 -176 103 131 -103 109 -17 -88 -33 -29 170 55 -146 -38 -140
8144 -140 -8 48 -91 -183 -45 111 52 11 83 53 307 -24 54 323 201 72 108 99 -77 280 -36 -43 287 -55
8168 -55 -282 -174 -178 18 -16 124 -113 -15 -41 -252 172 -23 91 227 14 -151 -150 27 -299 101 -174 174 -76
8191g6
##END NTUPLES=NMR FID
##END=
