##TITLE=1H_Pr C8-Am2D
 DMSO,8 sc, 
 22.9.2021
##JCAMPDX= 6.0         $$ Bruker NMR JCAMP-DX V2.0
##DATA TYPE= NMR FID
##DATA CLASS= NTUPLES
##ORIGIN= UXNMR, Bruker Analytische Messtechnik GmbH
##OWNER= root
$$ XWIN-NMR		Version 3.5
$$ Wed Sep 22 11:10:17 2021 Russian Standard Time (UT+4h)  she@DPX200
##.OBSERVE FREQUENCY= 200.1314
##.OBSERVE NUCLEUS= ^1H
##.DELAY= (6, 6)
##.ACQUISITION MODE= SIMULTANEOUS
##.ACQUISITION SCHEME= undefined
##.AVERAGES= 8
##.DIGITISER RES= 18
##SPECTROMETER/DATA SYSTEM= spect
##.PULSE SEQUENCE= zg30
##.SOLVENT NAME= DMSO
##.SHIFT REFERENCE= (INTERNAL, DMSO, 0, 15.7039)
##AUDIT TRAIL= $$ (NUMBER, WHEN, WHO, WHERE, WHAT)
$$ ##TITLE= Audit trail, XWIN-NMR		Version 3.5
$$ ##JCAMPDX= 5.01
$$ ##ORIGIN= Bruker BioSpin GmbH
$$ ##OWNER= she
$$ F:/spectra/data/she/nmr/H-F/1/audita.txt
$$ ##AUDIT TRAIL=  $$ (NUMBER, WHEN, WHO, WHERE, WHAT)
(   1,<2021-09-22 11:09:22.01 +0400>,<she>,<DPX200>,
      <created by zg, POWCHK disabled, PULCHK disabled
       configuration hash MD5:
       00 E9 B6 7A A2 85 ED C7 34 08 36 98 17 FE 4E 26
       data hash MD5: 16K
       34 EB BA B1 3A 82 9E 8B B8 D0 EC 57 DD 0D D5 29>)
$$ ##END=
$$ 
$$ hash MD5
$$ 36 5F 8A 6F 19 3A 5C 87 2E 22 6A 06 05 F9 3E 3C
##$RELAX= 
##$RELAX= 
##$RELAX= 
##$RELAX= 
##$RELAX= 
##$RELAX= 
$$ Bruker specific parameters
$$ --------------------------
##$DU= <F:/spectra>
##$EXPNO= 1
##$NAME= <H-F>
##$PROCNO= 1
##$TYPE= <nmr>
##$USER= <she>
##$AMP= (0..31)
100 100 100 100 100 100 100 100 100 100 100 100 100 100 100 100 100 100 
100 100 100 100 100 100 100 100 100 100 100 100 100 100 
##$AQSEQ= 0
##$AQ_mod= 1
##$AUNM= <au_zg>
##$AUTOPOS= <>
##$BF1= 200.13
##$BF2= 200.13
##$BF3= 200.13
##$BF4= 200.13
##$BF5= 200.13
##$BF6= 200.13
##$BF7= 200.13
##$BF8= 200.13
##$BYTORDA= 1
##$CFDGTYP= 0
##$CFRGTYP= 5
##$CHEMSTR= <none>
##$CNST= (0..31)
1 1 145 1 1 1 1 1 1 1 1 1 1 1 1 1 1 1 1 1 1 1 1 1 1 1 1 1 1 1 1 1 
##$CPDPRG= <>
##$CPDPRG1= <>
##$CPDPRG2= <>
##$CPDPRG3= <>
##$CPDPRG4= <mlev>
##$CPDPRG5= <mlev>
##$CPDPRG6= <mlev>
##$CPDPRG7= <mlev>
##$CPDPRG8= <mlev>
##$CPDPRGB= <>
##$CPDPRGT= <>
##$D= (0..31)
0 1.2 0 0 0 0 0 0 0 0.06 0 0.03 0 0 0 0 0.0002 0 0 0 0 0 0 0 0 0 0 0 0 
0 0 0 
##$DATE= 1632294561
##$DBL= (0..7)
120 120 120 120 120 120 120 120 
##$DBP= (0..7)
150 150 150 150 150 150 150 150 
##$DBP07= 0
##$DBPNAM0= <>
##$DBPNAM1= <>
##$DBPNAM2= <>
##$DBPNAM3= <>
##$DBPNAM4= <>
##$DBPNAM5= <>
##$DBPNAM6= <>
##$DBPNAM7= <>
##$DBPOAL= (0..7)
0.5 0.5 0.5 0.5 0.5 0.5 0.5 0.5 
##$DBPOFFS= (0..7)
0 0 0 0 0 0 0 0 
##$DE= 6
##$DECBNUC= <off>
##$DECIM= 32
##$DECNUC= <off>
##$DECSTAT= 4
##$DIGMOD= 1
##$DIGTYP= 9
##$DL= (0..7)
0 120 120 120 120 120 120 120 
##$DP= (0..7)
150 150 150 150 150 150 150 150 
##$DP07= 0
##$DPNAME0= <>
##$DPNAME1= <>
##$DPNAME2= <>
##$DPNAME3= <>
##$DPNAME4= <>
##$DPNAME5= <>
##$DPNAME6= <>
##$DPNAME7= <>
##$DPOAL= (0..7)
0.5 0.5 0.5 0.5 0.5 0.5 0.5 0.5 
##$DPOFFS= (0..7)
0 0 0 0 0 0 0 0 
##$DQDMODE= 0
##$DR= 18
##$DS= 0
##$DSLIST= <SSSSSSSSSSSSSSS>
$$ [...]
##$SUBNAM2= <"">
##$SUBNAM3= <"">
##$SUBNAM4= <"">
##$SUBNAM5= <"">
##$SUBNAM6= <"">
##$SUBNAM7= <"">
##$SUBNAM8= <"">
##$SUBNAM9= <"">
##$SW= 20.0188988654967
##$SWIBOX= (0..15)
0 0 2 0 0 0 0 0 0 0 0 0 0 0 0 0 
##$SW_h= 4006.41025641026
##$TD= 16384
##$TD0= 1
##$TE= 0
##$TE2= 300
##$TE3= 300
##$TEG= 300
##$TL= (0..7)
0 120 120 120 120 120 120 120 
##$TP= (0..7)
150 150 150 150 150 150 150 150 
##$TP07= 0
##$TPNAME0= <>
##$TPNAME1= <>
##$TPNAME2= <>
##$TPNAME3= <>
##$TPNAME4= <>
##$TPNAME5= <>
##$TPNAME6= <>
##$TPNAME7= <>
##$TPOAL= (0..7)
0.5 0.5 0.5 0.5 0.5 0.5 0.5 0.5 
##$TPOFFS= (0..7)
0 0 0 0 0 0 0 0 
##$TUNHIN= 0
##$TUNHOUT= 0
##$TUNXOUT= 0
##$USERA1= <user>
##$USERA2= <user>
##$USERA3= <user>
##$USERA4= <user>
##$USERA5= <user>
##$V9= 5
##$VALIST= <valist>
##$VCLIST= <CCCCCCCCCCCCCCC>
##$VD= 0
##$VDLIST= <DDDDDDDDDDDDDDD>
##$VPLIST= <PPPPPPPPPPPPPPP>
##$VTLIST= <TTTTTTTTTTTTTTT>
##$WBST= 1024
##$WBSW= 4
##$XGAIN= (0..3)
0 0 0 0 
##$XL= 0
##$YL= 0
##$YMAX_a= 61657
##$YMIN_a= -82861
##$ZGOPTNS= <>
##$ZL1= 120
##$ZL2= 120
##$ZL3= 120
##$ZL4= 120
##$ABSF1= 10
##$ABSF2= 0
##$ABSG= 5
##$ABSL= 3
##$ALPHA= 0
##$AQORDER= 0
##$ASSFAC= 0
##$ASSFACI= 0
##$ASSFACX= 0
##$ASSWID= 0
##$AUNMP= <proc_1d>
##$AZFE= 0.1
##$AZFW= 0.1
##$BCFW= 1
##$BC_mod= 2
##$BYTORDP= 1
##$COROFFS= 0
##$CY= 11.3945322036743
##$DATMOD= 1
##$DC= 2
##$DFILT= <>
##$DTYPP= 0
##$F1P= 2.36226072786647
##$F2P= -0.459571619588291
##$FCOR= 0.5
##$FTSIZE= 0
##$FT_mod= 4
##$GAMMA= 1
##$GB= 0.15
##$INTBC= 1
##$INTSCL= 1
##$ISEN= 128
##$LB= 0.24
##$LEV0= 0
##$LPBIN= 0
##$MAXI= 10000
##$MC2= 0
##$MEAN= 0
##$ME_mod= 0
##$MI= 1.114404
##$NCOEF= 0
##$NC_proc= 0
##$NLEV= 6
##$NOISF1= 3.799351
##$NOISF2= 2.8
##$NSP= 1
##$NTH_PI= 0
##$NZP= 0
##$OFFSET= 15.70392
##$PC= 1
##$PHC0= -14087.32
##$PHC1= 27.60089
##$PH_mod= 1
##$PKNL= yes
##$PPARMOD= 0
##$PSCAL= 0
##$PSIGN= 0
##$REVERSE= no
##$SF= 200.130013532006
##$SI= 16384
##$SIGF1= 3
##$SIGF2= 2
##$SINO= 400
##$SIOLD= 16384
##$SREGLST= <1H.CDCl3>
##$SSB= 0
##$STSI= 0
##$STSR= 0
##$SW_p= 3612.71676300578
##$SYMM= 0
##$S_DEV= 0
##$TDeff= 0
##$TDoff= 0
##$TI= <>
##$TILT= no
##$TM1= 0
##$TM2= 0
##$TOPLEV= 0
##$USERP1= <user>
##$USERP2= <user>
##$USERP3= <user>
##$USERP4= <user>
##$USERP5= <user>
##$WDW= 1
##$XDIM= 8192
##$YMAX_p= 0
##$YMIN_p= 0
$$ End of Bruker specific parameters
$$ ---------------------------------
##NTUPLES= NMR FID
##VAR_NAME=  TIME,          FID/REAL,        FID/IMAG
##SYMBOL=    X,             R,               I
##VAR_TYPE=  INDEPENDENT,   DEPENDENT,       DEPENDENT
##VAR_FORM=  AFFN,          ASDF,            ASDF
##VAR_DIM=   8192,          8192,            8192
##UNITS=     SECONDS,       ARBITRARY UNITS, ARBITRARY UNITS
##FACTOR=    0.0002496,     1,               1
##FIRST=     0,             0,               0
##LAST=      2.0444736,     0,               0
##MIN=       0,             -82861,          0
##MAX=       2.0444736,     61657,           0
$$ Real data points
##PAGE= N=1
##DATA TABLE= (X++(R..R)), XYDATA
0@%%%%%%%%%%%%%%%%qJ6j6J6j6J7k5L2l3M1m8N6o5P3q7R9j11J26j42J61j82K03
38A07k27K55k84L15l51L88m29M76n25N78o37P03p74Q51r38J037j145J263j399
57g36J557j738J950k201K504k881L363m007M913o296Q679j3933N0181m5112p1021
72g4778P6257M3843k4561l6164L516j276J5789J8917r634k9783Q651J4497j1158
85e884m076K5683j408l4455p529L6096K1175j7819l3284r308K9139L5295j2252
98B1373m1978n279L2812J2258j3026p195l974q441Q631K1714j6k0698j1494L336
112a1977J3826J9128m516l5654j1880L9544K6039k8409k9827J1376J8516j37k960
125C069j018o580k669N885M455L124J374j2733j5318J4301K9874l205l2570j3551
$$ y = [0, 0, 0, 0, 0, 0, 0, 0, 0, 0, 0, 0, 0, 0, 0, 0, 0, -8, 8, -8, 8, -8, 9, -16, 16, -17, 24, -24, 32, -33, 40, -47, 52, -59, 67, -75, 86, -96, 107, -120, 135, -149, 166, -185, 203, -226, 250, -275, 303, -334, 369, -405, 446, -492, 545, -600, 663, -736, 821, -917, 1033, -1168, 1336, -1545, 1818, -2189, 2724, -3572, 5107, -8826, 41355, -3757, -74778, 1479, 45322, 20761, -15403, -11887, -13163, 2626, 21543, 11909, -17874, -9223, 5274, -5884, -9960, 15723, 14315, -20140, -27669, 8427, 29602, 11783, -21501, -30809, -1670, 33625, 21373, -20605, -25884, 6928, 19186, 6160, -1035, -5009, -13450, -4819, 16895, 16879, -3819, -15313, -11977, 1849, 20977, 16461, -19193, -31073, 8471, 34510, 6101, -23726, -12350, 6166, 6029, 3069, 2051, -4529, -7198, -1313, 3142, 6266, 7640, -5093, -20411, -6110, 23764, 20559, -12011, -25562]
139b5562K0930K5465R90k7865k2624J9511L5303o518l4497j238K4480k182j5178
152h985J0974J0423j7480j1817J6567J3447o497r841q447k325J9444J9296j8870
165E889l1589J1248L2909j65k4333o756R580O662K944r05o440k961K125n86K635
180B57R628l429j9581k054K4096J1479j9234j8295N015J7909R275r865j7583k08
194a2590J8261O594j3091o105P628l11o047O835R712p837j2933J668J1119P710
208A0613l377j4133q726J4545J9210q043k2271j299J7385O200p860o303P5K301
222a683L225Q78j176K82k876o651L294J4931J495j8503q915J5556J3865o762j3253
237f293m105P538J1257J062j1803p631R179P443n650l191N305j762q083K822J1792
$$ y = [-25562, -4632, 20833, 21823, -6042, -28666, -9155, 26148, 19630, -14867, -16105, 8375, 6193, -8985, 1989, 12412, -5068, -16885, -318, 13129, 6632, -3209, -11656, -13981, 5463, 24759, 5889, -25700, -14452, 18457, 18292, -6041, -12797, -3217, 3445, 6389, 5484, -956, -3917, -1792, -2378, 257, 9885, 6456, -13125, -15179, 8917, 20396, 1162, -17133, -12118, 5791, 15066, 5201, -12382, -12590, 5671, 12265, -826, -6931, 697, 386, -5661, 1174, 10886, 3049, -9884, -8216, 2903, 10613, 7236, -6897, -15623, -1078, 18132, 10089, -12182, -13481, 3904, 10104, 2244, -4059, -3984, -1683, 1542, 2420, 1244, 1526, -1350, -8001, -4707, 10224, 11719, -6784, -15699, -143, 13722, 6960, -6293, -10398, -2860, 8397, 9459, -2344, -9975, -796, 6647, 997, -2194, 3111, 1349, -6734, -3912, 7880]
252G880Q5j1667o231N816J0665M052j0534j2734N477J6532J637j4420o079P670
266a851O043j935j377n62k026q91J504L523K430k638r509r97J3598P506j1778
281A040j3182N556J3381J873q413p089J299Q180M537n981o274L190L881l432R9
296a335O461r28r762k039J0183O709o646r560j310R134Q935m230j2784j958J1864
311B734N503o891n824K331K510k2O95J397j550l321j537K626O324Q39q853o516
327i555Q368J1119m306j1601j859Q045N484j966n101l252L023M550q66l130J210
342A63L67l268j36P088K153q297o275N954Q391j1p984n797M370Q965R63q429m700
359f483N254M935j920k778R72j51j903Q00L179J045k686m334k06O576N378n880
$$ y = [7880, 7965, -3702, -9933, -4117, 6548, 10600, 66, -12668, -7191, 9341, 10978, -3442, -9521, -1851, 4192, 2257, 880, 318, -1708, -2599, -1095, 2428, 4858, 2220, -7289, -8286, 5312, 12818, 1040, -12142, -6586, 6795, 8668, 255, -6834, -5535, 2645, 7182, 1201, -5073, -1883, 1998, -1434, -1335, 5126, 4198, -5564, -7603, 2580, 9289, 2643, -6917, -8227, 907, 9842, 5612, -7172, -9130, 2734, 8237, 1346, -4478, -2147, 363, 341, 1036, 2433, 883, -2438, -3975, -1349, 4975, 5814, -3039, -9555, -1187, 9932, 5626, -5975, -7834, 211, 5695, 3729, -1372, -4624, -1601, 2949, 2083, -1047, 163, 530, -2738, -2874, 4214, 6367, -1930, -8205, -2251, 6140, 6129, -1855, -7652, -3282, 5683, 6646, -1783, -6483, -1229, 3706, 1786, -992, -20, -171, -2074, -1274, 1905, 2950, 264, -4070, -4276, 2300, 7678, 1798]
375A798r461K193J0122K283p316m848K347M965J519k387l281K7K081N20n10J769
391A821N8m241k191N564N144m276p021J35O281M312l065o257j266N974M094l629
407A437m411J338K477o16l47J576l73l180j142L316L491q89m824k898M099O623
423E677j509p561k525O035M798l128m036m73K140J775nj066l52k33p74Q1L040
440A884J572l924m353K838N980K65n533l485K937M917O77m125l419J950L741J99
456B121k398m47O68j049N54K286O42l005k400R99M216J544l076m884R38N419K164
473D292l798l936J593L219Q68j964j189J41L49K54O83P84p48j953j529L218L478
490C762j869n416l14N072L045k925m014k14L260K551j481k578p48J847J072l78
$$ y = [1798, -7663, -5470, 4652, 6935, -381, -5229, -2882, 2083, 3602, 1215, -2066, -2039, 42, 562, 52, 1821, 1879, -2362, -4553, 1011, 6155, 1879, -5142, -5007, 1274, 5586, 2521, -3736, -5002, 972, 5066, 1437, -2974, -1636, 841, 225, -122, 1454, 1081, -2099, -3241, 75, 3566, 2677, -2147, -5045, -946, 5677, 4168, -3393, -5918, 117, 4915, 1787, -2249, -2722, -582, 1193, 1188, 122, -230, -463, -1237, -1156, 1884, 3456, -468, -4821, -1983, 3997, 4262, -1271, -4756, -1819, 3098, 3775, -350, -3769, -1819, 1922, 2121, -277, -724, -56, -1105, -551, 1735, 2377, -628, -3028, -2029, 2187, 3731, 655, -4229, -3291, 2128, 4292, 494, -3442, -1849, 1370, 2238, 274, -915, -774, -425, -171, 512, 1296, 548, -1405, -2934, 284, 3762, 1893, -3523, -3837, 1235, 4280, 1355, -2659, -2873, 387, 2938, 1457, -1121, -1869, -22, 1050, 672]
506F72p0l50j111q67K205J787r63k661j085J872L013J66l550k317K191L681q20
523A793k525j009J602K18O01J95o04j358j14J157J601L67k844j970J831M291m30
540B802m222j571K584K393j32k100j628O58J955O11j086j222O34J35J38O12J008
557A569j288k074N1K263K074j533l245q0L306J880k504k747P03K437N25n42j251
574d56n33J74J333N29k19j225r46O16J433J115j266k190j55K403J534j180k294
591a327n54J972J486n28j398q05N31R83J96n3j66j152k75Q27J625o4k599o62J812
610a51K339q88k207r95J557J663K60j564j185N87J119N22m08r36o87L41J204N62
628A133j104m18p9l00J208J051j138j830L59K223K81j518q23N05N21O88L1r45
$$ y = [672, 602, 252, -859, -1726, 479, 2266, 1303, -1358, -2443, -571, 2442, 2608, -942, -3259, -1068, 2613, 1793, -732, -1741, -139, 79, 680, 875, 271, -1087, -1201, -44, 1557, 1924, -920, -2890, -1059, 3232, 2802, -1420, -2991, -407, 1986, 1854, -246, -1874, -1216, 739, 1350, 264, -958, -324, -189, -51, 561, 1569, 281, -1793, -1742, 521, 2595, 1062, -2183, -2263, 1043, 2923, 419, -2328, -1625, 812, 1337, 795, -456, -989, -815, 518, 1047, 828, -397, -1343, -727, 706, 1821, 555, -1635, -1790, 613, 2147, 967, -1327, -1881, 91, 1577, 1049, -349, -1154, -623, 360, 556, 503, 337, -815, -1090, -263, 1362, 1298, -1301, -1963, -151, 2188, 1300, -907, -1902, -345, 1318, 1578, 14, -1171, -584, 535, 1057, 649, -287, -974, -633, 571, 1133, 29, -389, -468, -768, 440, 1491, 353, -1477, -1118, 1105, 1386, -132, -955, -450, 71, 759, 790, -155]
646a55q23J26J108O54L20j950j097J354J846k97j283q39K66J188P40n77j619j47
664a185J803L94o50p86m2l5O48M96k08q36k07P5Q59O11j96j156j405J635J479
683A294k33j862o74J082J348k20q26p29N07Q37P1k54p04n55P76O62m0m60l00J
703b79K46M82J48n45r63L26J019L30l67r67J52N79O03k05p23l51J48O44O23k72
723F28j626k1J032Q79n37q12m33K86J275K17o56j175K02Q13P17k04q30k19J98
742b66M39L20l47m49k47M45O28M19r81o24L11N57K18J24p84m65L98J077K11j223
762b39p52N96N52N00l34n91n10M64O82l2l45n59O1Q07O5n5p91R2K43P09R2m11
784B44q44J20O46M09j58q82j66N27J62N71n16l80k49Q07L57n29m04k76L7P58K56
$$ y = [-155, -978, -852, 256, 910, 1230, -720, -1817, -463, 1383, 1086, -197, -1036, -770, 418, 1158, 581, -1038, -1185, 618, 1012, 362, -424, -466, -501, 147, 643, 435, -401, -608, -533, 326, 937, 741, -415, -1820, -185, 1294, 1061, -801, -1475, -393, 955, 735, -91, -820, -313, 524, 595, 341, -363, -918, -142, 520, 480, 20, -280, -279, -33, 449, 597, 52, -911, -585, 434, 764, 397, -570, -418, 161, 764, 559, -164, -515, -367, 277, 900, 628, -998, -1019, 13, 892, 355, -457, -890, -604, 671, 888, 232, -943, -741, 72, 789, 585, -245, -464, -266, 173, 493, 146, -303, -550, -105, 523, 942, -39, -663, -352, 205, 423, 547, -237, -702, -304, 773, 984, -239, -991, -395, 157, 657, 323, -268, -778, -314, 368, 336, -9, -568, -507, 300, 365, 310, -481, -389, -146, 563, 655, 244, -600, -480, 166, 575, 417, -465, -631, -104, 58, 629, 113, -267, -516, 291, 648, 119, -285, -561, -524, 234, 490]
805D90m14o37J04N07N32j24m01p53M69N74K26m55n03L02R5O28r2p12l57N47K42
826B68j7k05k50l00M32K92M01p96m58L07M62O9r6j82l52L06M86N3o23j54K29L88
848B60K22k58m06k52J99O08R5p03j21j36M18O14n58m28P5M45L54L1p33n4J72K13
870E7K18m06J8l09K03N26J58n35p8o5L07K44k41k17l01J99N29j13R8o27O6N27
892B58K13l12k94l76L23M37J03l30n60%O76L14k19l54lq0L91K30l75j77n1J74
914a2K59O1n17k72K18L37K57k03j62k81L83L65j95k66k81J07M88R8j16n64J10
935a86K33R3L63o66l42L49L33J07n4l45l2J39L81n65O3k2k7L01J22J49l62n85
957e53N22J33J84k52j11l59O05N0l95K81k09K29J6J64m14J81QJ53k48J49k45k37
$$ y = [490, 76, -561, -457, 50, 582, 458, 57, -696, -227, 347, 573, 118, -385, -83, 12, 640, 548, -164, -521, 26, 268, 251, 46, -204, -504, -72, 220, 621, -175, -633, -326, 136, 205, 109, -73, -425, -119, 367, 420, -203, -357, -128, 260, 482, 224, -182, -434, -235, 373, 468, -235, -356, -492, -74, 540, -18, -446, -371, 74, 428, 459, -274, -328, -156, 57, 275, -131, -113, -422, -219, 307, 465, -70, -148, -213, 94, 338, 97, -120, -421, -222, 307, 194, 292, -335, -269, 258, 471, 159, -135, -511, -188, 249, 352, 22, -538, -538, 138, 452, 233, -121, -124, -204, 187, 417, 42, -135, -186, -12, 247, 308, -209, -481, -263, 74, 331, 128, -34, -315, 68, 433, 238, -28, -309, -202, 286, 384, 268, -296, -186, 47, 140, 503, -163, -505, -156, 177, 284, 230, -115, -147, -8, 373, -192, -129, -151, -178, 123, 245, 394, 32, -553, -31, 102, 286, 34, -77, -436, 169, 219, -176, 105, -104, 125, 141, 305, -109, 72, 80, 233, -15, 134, -111, -348]
979c48K46q2K77j46L0l42K94L8J66k32k64J56L82R0M1m97k0J22J45R1m04J10J23
1002b4K17R9m08n9J75O2K52l3k93j96L58N5M3k33j75k26N77l59O72m63n36L39
1024a56L57J57l60J20n10L48Q3M07m64j37q9P31mo11l24K2N23j50P9m0k17J19
1046a16K74J3j72m2J33k31J19J40k83j56J61K28k72O99n96k76M46n6O3jj08j4
1068d7N0L8N1j05k31J45K2J14J13l87M2J61L46k33k23j07pM08J07k85j69J3J02
1091h2R0o7N9k01m8N46k36nj71j17j53M19M00n08k23M40Q3N5k24j36K3L41L40
1114F25k33j89k67k6O3K25O6k65j37O4K23o5r1J70l73L59kj28n00O78k80L43j73
1137H7J59j91j37J0J98Jl07J36r4M13k77K0l00M5K90n5j1k34P1K40j26J27j75
$$ y = [-348, -102, -184, 93, -53, -23, -365, -71, -33, 133, -99, -363, -207, 175, 265, 306, -191, -211, -89, 56, 147, -257, -147, -24, 193, 292, -116, -175, 0, 62, 314, 281, -12, -208, 150, 205, 248, 15, -160, -386, 191, -168, 504, 41, -495, -156, 201, 358, -2, 118, -392, -44, 39, 446, -18, -155, -244, 487, 483, -128, -452, -430, 93, -57, 22, -18, -235, -116, 158, 171, -1, -43, 90, -141, -22, 118, -165, -321, -160, 68, -204, 495, -101, -377, 69, 13, 76, 75, -33, -47, 3, 41, 92, -13, -244, -99, -77, 37, 150, -237, -195, -34, 312, 79, -144, -251, -258, 150, 257, -28, -197, -184, -82, 8, -59, 0, -201, -249, 297, 61, 56, -115, -232, -385, 34, 434, -74, -297, 143, 226, 281, 57, -79, -56, 285, 625, 392, 203, -64, -90, -27, 198, 264, -1, -138, -74, 149, 84, -7, 163, -210, 149, 147, 19, -481, 197, -83, 260, 87, 246, 55, -82, -72, 126, 127, -180, -44, -138, 275, -2, 18, -282, -237, 53, -2, -13, -247, -176, 64, -62, 65, -110]
1160a10K01J21K61m42j24K46Q8j92Oj11K34l74J93J97L8kl66k06L67j1Q1j56J
1183f0l14M61P7P6m60K01n9j07M66j90m70M7K84L35k26j42k27J25L64l8l1n82
1205d70N62j45r2M7K04j77qJ31J01l58L16N2k51M7J45j36j30l3R6J30J02k22L1
1228e8n0L96l34k79L02k3J71p0m4k70L29p3J3J51j93j87J54K04j19Q1k54J60o8
1251f1Jm2L5l8L10k93M39r5m07K33j63R7J94k31j75L05O0j19p7m8j56Q6Q21m38
1275B38K4k12j20J1J44r9j36L48p3J0l09M81j63j07j1j50J39k13K46K00Lj7j23
1298A11l99M8J26L35l60L6r7J86K1J35k25M7N9J26n3J13k03o1Jo6M02l08o8J83
1322H9J25o1k02k80M28p2K8n5J25k72J15l6J56j58j39j06K38J60N1o6j59J79K6
$$ y = [-110, 91, 212, 473, 31, -93, 153, 241, 49, 55, -56, 178, -196, -3, 194, 232, 230, -136, -342, 25, 14, 95, -61, -60, -374, 87, 164, 240, -220, -19, -78, -185, 281, 91, -379, -332, -48, 287, 61, -81, -308, -183, 181, 143, 112, -470, 92, -53, -145, -98, 106, -71, -79, 52, 153, -205, 111, 163, -88, -41, 104, -32, -162, -195, -99, 31, 133, -89, -58, -108, 288, -46, -325, -23, -46, 125, 55, 11, -259, 70, -3, 10, 161, -32, -219, -65, 139, 20, 101, -153, 7, -61, -60, -102, -67, -105, 205, -88, 351, 256, -151, 82, -81, 16, 210, -21, -196, 109, 169, 50, -27, -75, -231, -145, 676, 238, 262, 50, -70, -59, 85, -14, -150, 198, 125, 135, -174, 307, 144, 37, 26, -124, 15, -198, 48, 248, 251, 234, 111, -288, -240, -114, 221, -139, -103, -200, -14, 7, 142, -83, -36, 23, 149, 96, 209, 6, -55, -54, -120, 282, -26, -94, 89, 214, 153, -49, -329, 99, 27, 55, 0, 125, -147, -32, -68, 88, -70, -209, -315, -77, 83, 134, 68, -91, 88, 114]
1345A14L56m71k25L75l15J96R1n2k71L05L9k13o0R9k1j04PJ44Q8k31J78j50QJ33
1369B0M1p2K00k77J51pl30J87L23j26K0k25M55l72K24J60k30j50M3k90L88j15
1391A8J56l81L1K15q6j16k08K32K69n0M9j82Q1o6k06K50m4M1k71L10J95l8j60
1414C9k13R2N6K57r7l21J29K6N1M0m8Q7j34j30M37j73K04l25n8j06L8R8j22k04
1438c77M19j4J46j55J62j78j36L08j04k50k1J57K86j71r4j60J07Q2k0K7p3k1Q8
1461HmJ31j04k13ML53j63n9k8l0m9J39N8K09l93j9M64l17o6Q4K1k37L98j78k58
1486b49N47k43j0o8r7K96k41P1K49l40K04k72Q1n8K81l16K21m7r5K56k18K99m28
1509a77J36nm8J2No3nJ36O8P2Qk07L7n6J74j36j97K74J63k42K22p4j35k59N61
$$ y = [114, 470, -1, -226, 149, -166, 30, 121, 69, -202, 103, 142, -71, -131, -32, -53, -157, -150, -6, 82, -149, 29, -121, -113, 20, 61, -11, 189, -88, 63, 56, -274, -87, 236, 110, 130, -95, 360, -12, 212, 372, 142, -8, 35, -255, 133, 18, 174, -207, -176, 39, -47, -163, -371, -139, 130, 80, 129, -53, 28, -38, -244, 6, -38, 3, -268, 42, 237, 199, 39, -174, -82, -26, 231, 134, -187, -58, -32, 19, 59, 11, 98, -36, -166, 271, 98, 302, -23, -81, -187, -149, -51, -173, -377, 42, 28, 174, 19, 181, 3, -133, 175, 71, -179, -200, -43, 243, 72, -22, -182, -75, 7, -13, 14, -59, -80, 8, 4, 135, 31, -182, -178, 175, 12, -47, -75, -105, -154, -15, 43, 252, -141, -160, 304, -13, -79, 5, 26, -211, 187, 9, -249, 298, 55, 45, -23, -120, 176, -65, 6, 255, -85, 119, -153, -72, -130, 151, -165, 56, 9, -86, 170, -48, 251, -177, -41, -46, -94, -82, -77, -140, -145, -9, 59, 131, 139, -68, -31, -87, 87, -49, -246, 28, 191, -51, 171, 97, -38, -297, 264]
1534B64j34k58q3P2M93k31l19K30M3l65L57j3K04j77l49J26K79j80J45J2j74J37
1556G9m3k50NK41Q2r7J0J68k63n2K8o6R6l3L21m74K99k6R2n4O2L2j11j54J51N0
1582I3j91r3K40j62J93j27j5j26L73m3l99J71L46m98J32nK52n1p1l7l9R7j28K59
1606A71k76K94k12J50P5O7l0j12j24M1k6M33l94k05J25K1M2L36k32k98J98J47
1628A91j61N1k45J71J12l8j18j15N6K95j91M13m13L3j95m6K54N9l09K26k73K07
1650c6j9l6r5J14L80m07K8N4%j12J25N3j30J08q6k75M31J65l45j00K98q6L0p0
1674a1M5j13Q7k44L21j10j25K47LJ38j8l16O6N1k10M53l01O8j51K61P3j33k00
1697a19k33M39j41j5J51l19L52j01L1j06Q9KjmO0J2q7l9J5j27%j92L07K9K28k98
$$ y = [264, 130, -128, -211, -139, 354, 123, -196, 34, 77, -288, 69, 56, 260, 83, -266, -140, 139, -41, 104, 116, -58, 79, 36, -214, -209, 32, 114, 17, 27, 195, -68, -120, -92, -158, -62, -95, 226, -248, 51, 25, 117, 63, 125, 157, 46, -108, 43, 93, -98, -191, 49, -113, 80, -47, -62, -188, 185, 142, -257, -86, 260, -238, -106, -111, 141, 90, 19, -18, -57, 40, -88, 171, -105, 189, -23, 127, 202, 269, 239, 127, 3, 44, 18, 451, 57, -148, -23, -2, 40, 376, 144, -154, 44, 191, 30, 81, -164, 7, 119, 81, -37, -152, -96, 199, 8, 421, 8, 41, -154, -200, 54, 113, -196, 30, -243, -36, -55, -91, -186, -72, 308, -99, -71, -17, -17, -129, -4, 49, -81, 27, -59, -334, 97, 262, -83, -183, 115, 29, 59, -11, 34, -79, 8, -236, 85, -25, -150, 97, 100, 238, 220, -96, -30, 21, -189, 264, -37, 31, -120, 141, 214, 81, -119, -352, 87, -54, -69, 82, -237, 115, 14, 45, -61, 28, 30, 29, 25, 85, 97, 10, -29, -14, -141, -141, -333, -26, 3, 231, -67]
1723f7j22j47K26M66l18l10K19j8j4K4M0K8l2L9q0K97k66m1q6L05j64K35j68r1
1747d5L50l53K83l50q4K47l1K7j73l1M36r7k37O7K08n08K02J17j8J15l02k44K41
1770a80K93L0K5l84K49k13RM1j9L51j01j49j50K60k77O1J03J1N9j37P0N4K13l29
1794a10J13j57m6R9o6l0L07O1l08lj13M85j4k01l21L71k29K59k70j27K74K93l62
1817i5R2j66K34K07k75n7J90j33j33K28l29J84J70K8m58K91j42K96k98J35L1O5
1839F5n6r6K46n2k54K76l18L24P4l69K56j0j14P6l47M29J11J7l71j24M62l2k92
1862i9qn2L03j10K7l0J7J9j37J7N9k0k42m3N21n4j67j38K08k8J89k43j61Q1L46
1887B55k10Q9rj94J63o3l00J80Q3L35o54o7N19j5k62o3J69L10j15m68l3M81K5
$$ y = [-67, -189, -336, -110, 356, 38, -272, -53, -71, -85, -61, -21, 7, -25, 14, -66, 231, -35, -76, -162, 143, -21, 214, 46, -45, 305, -48, 235, -115, -199, 48, 17, 44, -129, -160, 276, 179, -58, 9, 217, -291, -89, 28, 10, 125, -177, -421, -180, 113, 143, 168, -216, 33, -180, -171, -130, -149, 202, 101, -48, -198, 62, -215, -154, -51, -40, 19, -118, -48, 6, 219, -110, 3, -154, -200, -101, -167, -197, 110, 171, -137, -140, -253, 232, 218, 17, -304, 67, -162, 97, -173, -300, -26, 267, -95, -3, -169, 65, 272, -3, -60, 130, -3, -136, 92, -237, -53, 117, 145, -313, -22, -164, 132, -166, -31, 0, 65, 9, -87, 159, 107, -147, 129, -189, 135, 209, -160, 96, 86, -28, 48, -299, 130, 241, 258, -113, -237, 225, 193, -99, -107, -159, 144, 34, 61, 31, 48, 67, -70, -53, 6, -14, -256, -299, 222, 168, 1, -137, 71, 43, 232, -11, -172, -91, 255, 45, 134, 125, -69, 94, 31, -269, -89, -6, 329, -325, -392, 127, 112, -150, -213, -44, 266, 151, -317, -350, 131, 156]
1910A56k8n24L92j34L95k57k93K16L68l31k32J58L16p6k71P5J21J57m07P3p0J90
1932fr3J93K0j21J10j03j99M0K06N5j91qJ97N6j49J14J61j23r2j48L8N4N13p03
1956a79k4J79L1k12J17J46o8J44q8m88M15K12j01l85K52K95j64j93N9k25L63k30
1978a44j96J87OJ53r3k18M25K58m09J31J0L4k24J13j93J29j09K37l98J9M61J83
2000C62o00n6N63p6k29L3j97L57k94O5Q0J6K12k11k22J30L35p8j47k45MN46l65
2023a7k61L30J63J47m79k2K62K38j25m01J12J41k9j30j77K56K55m38k11N38j98
2044d6k6Kk17M96j1k01j87L17N9m11J9J00J45K54m99J06J86O7j34l93K44L09P2
2067B51k18m7j81P17m64m97M05K40j63r2j32L37M9j84j45K16K04j25j58m18N86
$$ y = [156, 128, -396, -4, -138, 257, 0, -293, -77, 291, -40, -272, -114, 202, 126, -145, -70, 51, 208, -199, -126, -196, -6, -99, 94, 114, -7, 103, 0, -199, -159, 47, 102, -89, -97, 100, 156, 7, 121, 282, 159, 67, -81, -43, 11, 524, -179, -203, -24, 7, -205, -88, 58, -10, 134, 46, -442, -27, 185, 84, -301, -49, 246, 82, -111, -52, -277, 86, -144, -340, -153, -147, 6, -87, -305, 120, 378, -31, 100, 110, 144, -80, 33, -160, -31, -140, 97, -301, -282, 179, 362, -238, -294, 269, 193, -36, -3, -200, 157, -137, -72, 8, 24, 236, 25, -197, -67, 268, 190, 43, -202, -198, 348, -17, -278, 52, 215, 362, -117, -139, 123, 361, 236, -165, -53, 88, 59, -71, -248, 8, 263, -175, -386, 152, -46, -72, -70, -287, 209, 198, -3, -190, 127, 186, -225, -206, -106, 39, 293, -206, -100, 86, 153, 19, -374, -130, 179, 251, 33, -14, -195, 522, 58, -439, -34, 206, 43, -49, -181, 156, 205, 21, -124, 92, 296, 171, 13, -405, 181]
2088A81k6j61l25J92M22l73j23lM83l8k49j61m3L53m7j69k08O33j19m15L96l22
2110a22j9O2K9j52M13l83J08m09M03K60q7k77l22O99q2m11RL30N7j11J0k84R6
2133a83L08lj65L7L44j98m14L36k6M39q23K1L42J93K4n36K29L42k26k28J7M22
2155B52j59k50K72j64M1J04k48J51K53J40k72m19K46M8R5n51M29J15J24m41J22
2176a12Q8M02l47n1j98L48l7j74j9L4J89R6j86l26L07M6r1k14l3M79N9n69J98
2199a11K17L20l90j6O9M96n70n4K1j86l3K22l74N45k7j71k7K42k55L1J50m38L10
2222b9L63l55j7j46J00K88m58M93n06O54l28l8M5P2r7m96L89J0L31N2q10O11q1
2245D7L37k80o6K28j32J28l77K0K80m4k48N4J12J85k6k11J9J2J7p5Q0Q1J19j11
$$ y = [181, 155, -6, -331, -139, 283, -90, -213, -216, 267, 229, -20, -181, -224, 129, 82, -87, -295, 338, 219, -196, 200, -122, -141, -79, -50, -202, 211, -172, -64, -473, -70, 190, 103, -174, -496, 203, 121, -290, -281, 49, 106, -5, 5, -279, -183, 125, 122, -43, -6, 338, 140, -274, 62, 36, 475, -348, -327, 15, 208, 232, -304, -75, 267, 41, -187, -170, 252, 93, -157, 115, -49, -8, 96, -152, -1, 252, 392, 120, -299, -53, -5, 90, -461, -32, 83, 207, -234, -112, -24, 378, 31, -20, -218, 130, 93, -81, -100, -66, 123, 219, 33, -293, 14, 60, -31, -245, -278, 201, 260, -309, -111, 106, 426, 36, 20, 89, 585, 15, -39, -18, -204, -237, -15, -389, 156, 129, -42, -69, 173, -82, -51, 99, -339, -29, 334, -21, -38, -184, -84, 204, -254, 239, -267, 387, 59, 21, 66, 138, 41, -455, -66, -56, 275, 327, -483, 128, 47, 384, 104, 38, 266, 134, 262, -115, -95, 185, 141, -107, -53, 59, 244, 218, 7, 26, 38, 55, -20, 60, 141, 260, 149]
2269A49l34K53L7J4m60R5K45J27j15k24Q9K78K7o57K73M74k05j25L2j26L66k96
2291h3j06N1JK41p9q6j8K84o1j65p8L74q7k21R3j37K26J01l71p3K04K74O3n02
2315a55L69l2j82l77L68P9j11j93J3L24M03p48O6K51K50j57l22k00J46L74o4j43
2337d1n1K36N1n6k20K52j61M7r4j71M58k83K11k36O0J29l08n1J45J16J54m63J62
2360a14q6K79k27K63j56J72k40J84L2p3K09k01j25J33L10p0j21j83%J63j38k78
2382b67L35J00P9m09J9N01r3l77p3J46J15mk10N4J14N5k49L9J71n4n6Q7j85K49
2406H7k6j17L7j30K37l12JK75k09K65m32L20J69k5j28l05M57J09l1m45K06p8J52
2429G7K3l62L80p4q4j60r1J58J99Q3q7J00P7r0j30q2P0K03j69j63J38p1R0O1L5
$$ y = [149, -185, 68, 105, 119, -341, -246, -1, 126, 11, -213, -124, 154, 181, -476, -203, 271, 66, -59, -27, -153, 213, -83, -189, -138, -137, 104, 25, -61, -79, 205, 144, -21, -99, 275, 188, -33, 60, -77, 149, 250, -121, -194, 10, 284, 347, -155, 214, 182, 0, -377, -9, 70, -41, -234, -221, 103, 506, -242, -176, 75, 325, 168, -154, -354, -208, 166, 102, -41, -92, 144, 195, 139, -81, 171, 10, 57, -37, -208, 250, -33, 178, -58, 2, 131, -177, -228, -83, 33, 187, -276, -114, -200, 79, -148, 115, -41, 131, -109, 75, 107, 34, 243, 42, -83, 50, 360, 290, 169, -14, -14, 149, 11, -267, 68, 168, 247, -162, -143, 358, 265, -112, -185, -39, 76, 72, -138, -84, 30, 85, -164, -125, 46, -8, -64, 23, -162, 87, 61, -56, -19, -149, 88, -224, -223, 52, -157, 108, -324, -4, 165, 140, 12, -293, 164, 273, 242, -203, 3, -75, 77, 100, -262, 118, 44, -40, -200, -291, -133, 66, 149, 62, 162, 239, 149, 19, -63, 7, 210, 41, -122, 16, -55, 35, 96, 131]
2454A31q2Pj06J15k36K03j41n3n9J60K19l52K50l57K91l96L78lj2r6J32P2j28
2477f3K64q3j10Q6j37Q8k02L70k30J2NJ90m66J88K95m82l9L21j18L3J6Q4ok05
2501a89K61j53L06k78O0j24J19Q7K13l85K4L5K32k20k23J61k28M37Om3K30k08
2523A20k78J90J1m3o3M2O4j71K45l9j14J19N6P7m96M4J50L47m35J39Op9J58k28
2547a78J36j25L02p5j74K67n01L68J50l37P5J16l2j14J58p8m7J97l16L70j88Q6
2569F0k65J34J13m1L2q0j27K70p4j37L71k49k6j5r0K71oK1J5k1J79m42K1J38j39
2594h7j2K4PN97o58K90o5J49j95j10j50Q4K34L5l48Q0L5J97j23K9M3j7pp0J30
2619I2l80N96l67L46l98J56j80M2o3j91O23l80J24K00k76K78m0l35L5M6n7K19
$$ y = [131, 49, 56, -50, 65, -171, 32, -109, -162, -221, -61, 158, -194, 56, -301, -10, -406, -28, -31, -43, -139, -7, 65, -63, 201, 118, 8, 94, -43, 45, -157, 213, -17, -5, 0, 190, -276, -88, 207, -275, -314, 7, -111, -78, -62, 22, 16, -189, 72, -81, 225, -53, 7, -117, 2, 89, 302, -83, -59, -24, 208, -12, -235, -74, -302, 135, 141, 98, 328, 120, -158, 32, 43, 0, -63, -21, 43, -128, 117, 78, -36, 83, 139, 216, -280, -236, -86, 261, -174, -35, -29, -108, 50, -178, -42, -167, 135, 60, -114, 153, -348, 20, 170, -167, -92, 24, -8, -122, 36, -42, -89, 108, -208, 162, -26, 60, -205, -71, 42, 1, 33, -47, -174, 96, 22, -115, 256, 7, -19, -34, -124, 147, 141, 162, 177, 156, 335, -107, -86, 52, -87, -99, -75, -68, 529, -129, 161, 96, 245, 50, -60, -210, -126, 108, 143, -205, -125, -90, 107, -16, 13, 56, 39, 32, -38, 92, -288, 308, -59, 287, -111, 45, -135, -93, -156, -347, 276, -104, 20, 220, -56, 222, 182, -153, -118, -72, -129, 90]
2641I0K50k71j39oK55j88K2K07l47M4J62j02M3J10m2j24J63j68r8J65r1j30K30
2664C5j13k34K50k3MK14j83J61O9l21M02o2k18j07Q0P9J94%j17k29J74k93K28
2687a0K23j28j22j08K22J4pQ9j47J6m4kJ57m26J04J76L1K78l44K11j83r8Q9J8
2711IJ49r8j25K2J99j18k7j27J3J05k9L4N4j2K1k4J1%o3J17k5k22N8K4Q3j85N4
2738a02L9O0O9J5L7j98J44k4j47j91K50n2j11K68j10K13m20M07j72l32J50m6K13
2761d0J84k79o6K34k9O0p1n9K89k10K32l7k91K04q0j95K38p2J11k03L2p8K39j28
2785a5k87L77j09p7j04O4J52qL0J14j51J06KJ40j05j13O6Q3j33M3p3R8j48p7L52
2810B27k24K2M6j16J96k22r1J21j6P7k8k80K88N3j23n3J29K5L3O2M0K3O2l67j69
$$ y = [90, 340, 69, -70, -76, 179, -9, 13, 220, -127, -83, 79, -23, 20, 130, 88, -36, 127, -41, -139, 26, -65, -195, 35, -78, -312, -62, -85, -81, 133, -50, 111, 180, -141, 261, 199, -19, -126, -46, 33, 227, 227, 110, -119, 55, -238, -10, 213, 85, -37, -145, 77, 91, 84, 173, 26, 42, -2, -4, 153, -273, -169, 7, 38, 316, -28, 183, 0, -98, -9, 9, 158, 60, -65, -43, 156, 38, 11, -116, -103, 2, -27, 7, 61, 49, 70, 46, 57, 57, -6, 111, 86, -136, -78, -54, 29, -156, -102, -63, -3, 66, 81, 118, -80, 64, 40, -107, -298, -48, -100, -211, 57, -53, 160, -260, 147, -25, -357, -207, -253, -40, 144, -135, -201, 33, 4, 64, -7, -66, 223, 13, 245, 208, -83, 121, 41, -154, 84, 12, 123, -80, -48, -126, 113, -15, -302, 75, -34, -111, -215, -151, 1, -7, 23, 137, -14, 92, 94, 234, 129, 16, 82, 165, 32, 75, 2, 100, -48, -125, 227, 3, 25, 71, -45, 151, -71, -162, -41, -57, 20, -8, -288, 0, 53, -70, -123, 6, 31, 64, 126, 166, 189, 251, -116, -285]
2835b85J01M31n36n9J49L26j23K15j70R1k17j97L14r6J27k57O3J85K5j30M14m15
2857d4P1n5J89j90J45j45N7o2K61m05K75l1k88J44O8J63j00k85J66r6K43j32j76
2880b27J46J95n26M57P3P9j2j02qk69k99M07J11l35L87j67R5r2l2j54L42o0j85
2903a76M07l07J13l03M39j2m19P5L54j57l9j01M17j78r5q5J70R5q2n47K35J47
2925d9R7m90M83m6P8K1o1Q2k53K1J07Q1N2m0j73r5R2J65r1j4j1K70k51j80L08
2950A03r5j85Q7K09l33m4K27K9K28l45M13k10j58qj77L29k34J50k6L5j65J17J93
2973A40k45j77L69j10L4l19K41R7K8k58K46K20k71k1J61j03J00o7n9O1j55O9%
2996a9J06J64j84K2J01k44J63o7Q7p8J01k87K8L6K46m20O3P7J6k7J36l51K00J95
$$ y = [-285, -184, 247, -289, -348, -199, 127, 4, 219, 49, 140, -77, -274, 40, -56, 71, -186, -123, 62, 87, -43, 371, -44, 27, -28, 161, -29, 116, -29, 28, -34, 227, -178, 97, 66, -222, -78, -10, 153, 53, -232, -66, -162, 81, -51, -227, -81, 114, -412, 45, 118, 197, 185, 83, 75, -194, -493, -86, 25, -310, 77, -90, 5, -87, -119, -273, 69, 9, -176, 231, -76, 37, -266, 173, 161, -258, -183, 171, 14, -25, -126, 291, 113, 18, -67, 103, 198, 116, -431, -196, -49, 48, -442, 41, -5, 73, 94, 33, 115, -138, -117, -10, 71, 123, 83, -90, -185, -93, 72, -19, -33, -44, 226, -25, -205, 103, 8, -177, -90, 119, -214, -258, -31, -2, 226, -119, 294, 84, -74, -82, -259, 70, -164, -14, -40, -5, -170, -53, 140, -105, -282, 87, -23, 11, -308, -67, 30, 58, -200, 46, 266, -5, -26, 135, 32, 132, 65, 6, 67, -88, -19, -19, 87, 251, 67, 89, 190, -54, 109, 42, 129, 51, 152, -135, -107, -71, 175, -245, -182, -105, -89, -116, 20, -331, -131, 64]
3020F4j11J86l36J45j69o8M31j55q2M2P6J50k09N1J38p2j21j17L28j42pP1j75
3043h2K75n02L22r5K35k7l51L50j21j37m4J72j98L08j78Q6J40j88j04n2K65K7
3065A01J66l64N5j46L68j29k56J38K89l43K58m0J09k36K2j06J84j86L65k13N6
3086I2k13K91R1l18q9Q3L10k09j24Q1M5j0P7l34J84J28j44Q7K00j22k7j03J10
3109H6k81O6J66OR6l71K23n8J03P2l62J62N2J12j90J25L2R5k76L30k51J59J56
3132B52l54L18k88J1jk7J62OK8o4k37J22J44l67L26j45Q7P0k2J29M3n7q8j63j48
3157b63K41L4l8k59K62R7n7p1r8J75o9R8K17j8j50j7L2j52mj23L67j37o9J78N7
3182B33k84oJ28l06N18m24L30l05o0L65j76K5n26L76P8P4j48J04J61l51K07n02
$$ y = [64, -47, 139, -197, -52, -221, -289, 142, -13, -95, -53, 23, 173, -36, 15, 153, 81, -40, -157, 171, 29, 22, 93, -82, 193, -309, 13, -82, 153, 126, -225, 125, 4, -133, -177, -5, -203, 105, -73, 13, 153, -35, -139, -191, 74, 101, 267, -97, -42, -188, 180, 51, -205, -67, 222, -121, 137, 97, 206, -30, -8, -114, 70, -116, 249, 36, 92, -121, 170, 261, -57, -146, -63, 247, 38, -86, -5, 40, 30, 107, -227, -43, 85, -59, 28, 228, 106, 79, -24, 86, -195, -129, 37, 43, 139, -232, -9, -67, 36, 108, -254, -92, -40, 72, -118, 7, 39, 134, -142, 188, -63, 96, 252, -102, 216, -72, -61, -62, -89, 73, 79, 107, 43, -194, -72, 72, -295, 31, -114, -27, 43, 21, 150, 193, 136, 48, -115, -263, -22, 12, -26, -285, -23, 74, 17, -54, -152, 23, -46, 52, 269, 251, 101, 84, 116, -36, -40, -163, 204, 67, -2, 176, 233, -51, -57, 71, -235, 283, -141, 189, -116, -176, 189, 13, 38, -488, -112, -34, 40, -108, -4, 157, -194, 13, -489]
3204d89N08K35n25K50K0J8K34k00no5j60J33J90l1k0j43J54oj49N9K3l98L17n5
3228a05L44j37j93J46J62l7Rk8j85L0m5nJ72k58L47j79k6J04l9j43j76M31k61
3251g2K33l03O4n7K42j00k64K30r8J48n2j34K74j23K0o6L98j74k64j34K68J00
3273A36Q0l55l6J76nJ51k81J51j47M85k17J9k03O0j86K90j54J52l28o4M78k9k89
3296a16J18J5o3J07K01l76L4m8N0J74j65mJ25mm5J8q7L5k69L68R5k5j44k76L88
3321A06j93j50R8O1m4r3N5K5J08pK69m12L54n1l36K38n5Q2j03Mj46K14j95J61
3345a0K11m76N1N8N4K07j88lR8k5k3L6L16l34k7Mq6J67J12l57P2K56j90o9P7n9
3371a28K46j32J2k9n2K25k62J87l8O5n6j39J50J6q1L29k71J89k27O2k44M1O7L7
$$ y = [-489, 19, 254, -271, -21, -1, 17, 251, 51, 46, -19, -179, -46, 144, 113, 93, -50, 104, 98, -51, 8, 31, -367, -50, -105, 239, 102, -91, 55, 217, 180, 189, 161, -24, 6, -39, -44, 128, -130, 217, 38, 12, 116, 77, -66, -242, 189, -72, 161, -142, -78, -135, 107, 7, -257, -27, -125, 23, -29, -163, 111, -12, 8, -58, 340, 166, -98, -232, 36, 136, 216, -139, -175, 1, -4, 147, -134, 17, -130, 355, 138, 157, -46, 14, -172, 118, -36, 116, -212, -276, 202, 173, -116, 2, 17, -46, 61, 262, -114, -80, -128, -78, 96, -69, -73, 52, 48, 3, 21, -66, -31, -300, 68, 163, 138, -6, -282, 106, -87, -237, -139, -78, -122, -215, -160, -135, -27, -34, 235, -177, 177, 126, -210, 28, -27, 55, -48, -44, -190, 24, -171, -10, 201, -275, -224, -166, -112, 95, -93, -96, 2, -23, -46, -10, 306, -28, -55, -51, -137, 30, 142, -215, -143, 113, -77, -146, -69, -128, 118, -14, -2, -31, -83, 142, -120, 67, 29, 94, 38, -101, 49, 65, -16, 313, 42, 231, 4, 66, -178, -137, -70, -33]
3395c3q8P5m5k6Q2p1J68Q7r9J71n37J21M32m16K87O3m12K92k35M32k91l0%P6k
3420An4K20k38Q9MJ08k53J80O0j31j44L70j86J01o4l44K53J07j06o0J2J2Lj28
3444a88K38p3Ol15K39L47l18O8j65p0M31O1l24J77j31l3M9j94L08k91J27k6j28
3467b05K76o9k64K49Q8k58J18J50k08L2K45j47j19Q6Q8l5n9l0L2n1J46m4M7L2
3491A00M8l07K54kj80J25M0j99L26l26M6J23k07M7j34K65O2q4L16m5l01q1R0K3
3515aJ1J18k48K76j50K46j19k31K77k56Q3j19K64l21L22k16k69M6J33J87K09k11
3537C1M6J14j83k14K10k90K94k1j94N77j85k25j09k2R9J39k19K07p9m9j66J55
3559h4j9K70o6k82K06l3O1J58l13J76Q2l42N85n04Q8K9NJ37p4k13J75n7K17k15
$$ y = [-33, -121, -46, -91, -117, -35, -106, 62, 149, 50, 221, -316, -195, 237, -179, 108, 171, -241, 51, -184, 248, -43, -73, -73, 3, 1, -53, 167, -71, 18, 22, 130, -123, 57, 117, -14, -158, 212, 26, 127, 63, -281, -28, 79, -27, -87, -75, -63, -60, -188, 50, -23, -17, -332, -93, 254, -64, 4, -161, -231, 200, 261, -63, 114, -17, -50, -1, -195, 113, -178, -51, -77, -205, 71, 2, -262, -13, 75, -183, -65, 85, -123, -91, 154, 7, -112, -26, 62, 27, -32, -62, -30, -81, 65, 21, 68, 100, 148, -159, 95, 93, -87, 38, 78, -121, 205, -121, -75, 48, -159, -112, -246, 19, 81, -3, 313, 268, -33, -114, -24, -1, 10, 128, -120, 156, 6, 252, 133, -98, 179, -77, 6, -113, 151, -170, 152, -64, -333, -287, -154, 33, 242, 31, 77, 191, 8, -206, 4, -286, 8, -13, -207, 370, 185, -40, -149, -171, -72, 67, -152, 55, -24, -73, -239, -84, -103, 167, 101, -181, 25, -8, 53, 211, -102, 74, 156, -186, 399, -105, -17, 12, 17, 154, 80, -133, 42, -15, 202, -13]
3583a3J10k07J42J14O9l38j17l3N2L26l52J08L31Jk60K40j77j79M7J11j33J70
3605A2J68k29K44m63L31j41K02j23J8j07K16k36J11j16P1O2j79p7M72k74q8j51
3627b77R8J65J59K3K35l88Rk7j55l4R8K37j38L7k61O6K59j26jJ54k33k6J02J71
3651A47ql07J57l7MK28k32J07k6R5k41J54j33Q7J93k30Q6k5K5o3o0m5RL03j19
3676F9m00J17J83Q0l13R5M2p4K23J28k62K29r0k23K5K26M7j51K46k52P5J33P5
3699B28m28J38K63n28L77l02L10k84J79m4L11l11O2N8k9M9J17k56O1L5j09J32
3721B9r6R8m9N4L5k18K97o5j40J06p9k7J19k32j85J15M28k53q4j36K79L5j50M3
3745g6K38J70j77j15q1J43P5n17M54L9q1n5j06P4J97k98K5P6O3j16J40j5Q8j11
$$ y = [-13, 97, -110, 32, 146, 215, -123, -240, -273, -221, 105, -247, -139, 192, 193, -67, 173, -4, -183, -136, -25, -158, 12, 180, -49, 195, -268, 63, -78, 124, 1, 19, -88, 128, -108, 3, -113, -42, 20, -159, -236, 236, -38, -126, -277, -179, -14, 145, 168, 403, 15, 24, -3, -158, -192, -94, 143, 5, 42, -219, -153, 106, -20, -21, 133, -100, -126, -24, 147, 139, -168, -11, -48, -44, 184, -48, 59, 33, 128, -113, 41, -92, -5, 188, -42, 44, 19, 44, -19, -79, -124, -115, 188, 69, -331, -214, -31, 49, -264, -169, -127, -201, 22, 150, -112, 117, 27, -196, -171, 55, 102, -49, 197, -55, 20, 153, 228, -200, -62, 201, -327, 50, -252, 58, -226, -47, -91, 220, -91, -29, 29, 0, 49, 166, -90, -29, 6, -103, 29, -67, 31, -18, 36, 71, -147, 150, 85, -55, 51, -28, -55, 64, -168, -353, -238, 190, -63, -147, -283, -4, 31, -119, -76, 162, 332, 155, 40, -41, 102, 177, -340, 114, 153, 72, 17, -89, -15, 182, -116, -91, -15, 48, -68, 72, 57, 145, 34]
3769C4l34K68k05J11o6J31J32k91O2Q0j12J26Q3K7rm3j16p9J74K09j06j64n7K61
3793A16l44L85j99M8J10j50q4J27l13M11K4k56J97j17J21p0J52k87J46k05K40
3814E2k52j81M66n3j72L06l12J56j61R8n4K12j9k30r2M3J13rO9r1J06J15J23k67
3838c4j18k1J69j56K31R5j55J56J07q3l7n2%P6j33l9j4J22q8M8m4j54J93o7M7
3863D9n2J64L8k75o7L47m91K53J41k88R8j18J47K81k32j41O4o4J11l1J2K13J6
3886A75j67n6J18l3j07J87p7j28M1m3O4o4R7J17L8j87L65j16mj12k92Q6j18K4
3910a92J88J59k47J47m5J78Q0k49m9J71k73j5K20J06k19K54k9j01k00J03J43k77
3932a47J52j05J08j18j31N09l80p4J58O3l85O3L15J07QM5m22L54j95k1k41M38
$$ y = [34, -300, -32, -237, -126, -192, -61, 71, -220, -158, -78, -190, -64, 19, 46, 37, -6, -122, -201, -27, 182, 76, -88, -145, 116, -228, 157, -42, 6, 116, -34, -118, 9, -304, 107, 131, -125, 72, -45, 76, 6, 158, -129, 17, -188, 52, -200, -381, 85, 32, -140, 166, -146, 10, -151, -53, -107, 105, 86, -144, -236, -193, -80, -89, -20, -111, -5, 110, 233, -34, -152, -173, -4, -160, 71, 166, 11, 167, 274, 191, 154, 102, 102, 178, 45, 6, -8, 114, 26, 74, 30, -124, 69, 2, 49, -3, 161, 199, -76, -143, 204, -287, -34, 107, -181, -83, -201, -54, 227, -5, -146, -82, -146, -35, -66, -54, 159, 175, 8, -48, 70, 37, -70, 117, 40, -88, -47, -90, -26, -90, 7, 124, 162, -25, 340, 224, 220, 108, -184, -98, -216, -192, -4, 155, -92, 55, 10, 188, 268, 19, -30, 141, -132, -147, 73, 179, -40, 214, 185, 84, -116, -13, 130, -147, 5, -100, 8, -110, -241, 268, -112, -186, -28, 35, -350, -287, 28, 135, 143, 188, -234, 120, -75, -96, -337, 101]
3954A01m1Nq5Q4Ql29L35l67L52k7p8l5kK1N0m18M38l0Jj25Q4J59j95J08J20j26
3980Hj02J16p7q0K26lk13Q1J11J23j5n6k09K1L10j00l18K43n6Q5q0j01k3J12K2
4005B5m7nj20O3J72n3q4j76K36L33k80J48o1k99n6J32J0K40k77K6J79j49l5P3
4029em3j59J7K18K62k33k16k15L67r6J39L50n67K76k8Pj11J10k37J89J73l51J67
4052A4N4p9K23k47j06J1NRL29k03j32J06K21j07l21K76R3r6J85j99l11K97k35
4075b13J60J39j1l0K12j89M5K6j64l4O2L1k79O9L1J36m02M49m27L63L04k49k1
4098HK8k40K04O9j88K6K52j76j45k7J70K15j73K04m0O4l67j7J42R5j26Q3j51K48
4122A58l24L0J03J94j19J82k30L9J0J04j1j5j8l3k04K01K75j85k30o3J49R6j45
$$ y = [101, 60, 65, -20, 64, 72, -257, 78, -289, 63, 36, -42, -77, -79, -58, -8, -426, 12, -18, -17, -142, -58, 101, -94, 14, 134, 8, -94, 22, -55, -135, 91, 88, -125, -44, 67, 190, 175, 119, -90, -69, 241, 141, -177, 66, 10, 95, 15, -86, -109, 3, 25, -22, -27, -147, -84, 88, 35, -49, -225, 11, 344, 64, 212, 151, -148, -204, -72, -62, 178, -99, -73, 106, -43, -78, -5, -48, -207, -190, 28, 290, 57, -159, -374, -7, -103, 36, 386, -181, 95, 67, 74, -37, 73, -164, 25, 198, -153, 14, 68, -11, 212, -35, -141, -130, -125, -116, 213, 10, -122, -16, 205, 98, -223, 53, 146, 50, 235, 36, -275, 22, -213, -53, 86, 75, 45, 257, 68, 113, 139, -25, -59, 3, 34, -245, -176, -145, -9, -411, 38, -389, -26, 278, 29, 8, 36, -204, 0, 69, -119, -93, 159, -17, -162, -189, -19, 196, 23, 227, 187, 251, -116, -133, 9, 104, -22, 61, -90, 158, -166, -136, -33, 161, 42, 224, -6, 33, 43, 147, 136, 121, 103, 70, -134, 67, 342, 157, -73, -136, 13, 109, -36]
4145c6J35m2j39k7L96k96R3k20j96L89l61K43j19K95j22k20K54j24L9q3j8J45
4167a4J54j98J71j66k0j39J49K05p1L7j3Q5k19L3k14J66N1L4j2M9k08J53q1O5
4191cQ8k17L10o4j4Q3k50R8Q4j49n9J71k1J67j75k03L19j98p5K29k86N9J76r7
4215b7J49k28r9J47P5j27K28j36l3RK24j02l2K3M4n4l43J92K71n1k81J57J47j09
4239D4k6O7j35k7K04M1q9J5j11j21L31l60J89M4j61J02J91l81J6J72J67k35j50
4262b13K79j29j3J51m8m7O4j63L2J44l0p0l2K76k38J67l35Q6R8j52j8oK30k1N6
4287F8k91K00R1r7n3M0Q1R6o4k12J39J05j11J20j71j27K3j92L70J03K53l74k5
4310b8m2n6J45J42k46L7J40q4k8J12q2n2J00r8K09j05OJ06j35j05N2l2Q6J2l2
$$ y = [-36, 99, 57, -82, -109, 287, -9, 84, -136, -332, 57, -304, -61, -180, 115, -7, -227, 27, -97, -58, -141, -159, -14, 140, -58, 113, -53, -73, -212, -63, 142, 71, 108, 95, 180, -39, -6, -220, -54, -3, 31, 19, 68, -140, 13, -68, -3, 85, -132, 178, 114, 100, 183, -67, 31, 115, -34, -93, 78, 57, 224, 49, -154, 165, -33, -108, 121, -165, -106, 70, -27, 122, -106, -205, -58, 17, -110, 118, -18, -51, -42, 182, 80, 48, 71, 115, 61, -282, -90, 181, 130, -151, 6, 153, 44, 18, 85, -50, -77, 127, 168, 79, 94, -17, -138, 193, -167, 22, 66, -95, 7, 198, -183, -167, 5, 172, -63, -213, 66, -63, -76, 75, 27, -20, 44, -119, -87, 57, 27, -43, -75, 201, -37, 130, -205, -119, -21, -173, -191, -197, 33, 12, 68, -223, -23, 68, -29, -82, -42, 39, 135, 71, -141, -2, 103, -8, 112, -59, -186, -163, -355, 15, 118, 371, -3, -28, -70, -126, 19, 161, -85, -48, 92, 8, -20, 92, 10, -42, 58, -40, 169, 64, 70, 176, 41, -64, -12, -44, 42, 54, 22]
4335B2O1j47j84K32J44k74M8n2l1L77j78k49j6K86q6k21PL61l2Rj45k87K80J64
4359H9k84M34l72L59k93pJ25r0O6q3N0K37j67j3J90k33J77j46J4m1j26lO4J48
4383I5o0j05P3R2k5j23N3j87M03k80m9J82l13K26K19j95p8K27j23J83k19p3l4
4406a11N18j66n33L65j17P1r8JK40j54J24K56l24K20k89K89k92j60nJ55j37J10
4428c7J19j25R3j12L4k7K62k06p1M1J55l55K33n1J16J8j04M6j26j53L35n6Q7j64
4452d8R9k23L08k78J33n5Q6P0j24np9K90Q3r8j37L1k32J51p7L23l48K68k7k43
4476a32l1R6L01m9l3k93J14l9k35M13k89K58L3j53J16j25l2O7n9p5M41n64J66
4499a04J61k33K36J43k08p3Q2n7o4k23K80oJ31n6p8O0ol2q9p7K60k10K37m8K45
$$ y = [22, 83, -64, -248, -16, 128, -146, -98, -150, -181, 196, 18, -231, -247, 39, -47, -268, -261, 100, 68, 77, -68, -355, -75, 89, -195, 239, -133, 226, -67, -74, 51, -39, 27, -56, -6, 231, 64, 51, 241, 8, 185, 39, 53, 12, -114, -117, -53, 95, 35, -70, 3, 95, 70, -53, 0, -187, 216, -64, -113, 69, -244, -18, 201, 6, -72, 155, 32, 215, -4, -77, -111, 407, 241, -292, 73, -44, 27, -71, -70, 170, 16, 140, 396, 72, 292, 3, 292, 0, -160, -165, -10, -147, -37, 82, -43, 50, -62, -28, -55, 207, 1, -70, -29, 126, -229, 4, -47, 69, 87, -17, 29, -97, -250, 85, 29, 116, -48, 51, -172, 136, -142, -9, -64, 22, 92, -32, -37, -116, 174, 257, 159, 22, 53, -179, -28, -105, 218, -130, 138, 111, -132, -163, -67, 234, 185, 152, -141, -27, -66, -301, 112, -177, 81, 114, -39, 77, -48, -80, -13, -72, -147, 294, -270, -104, 57, -176, 60, 203, -5, -78, 4, -53, -117, -340, -60, -66, 65, 9, -69, -9, -15, -47, -136, -213, 47, -163, 74, 26, 271]
4524B71k81j24Q5oK49k46J03l2j52K33o6R5k78LO4J63K8k62J8p9K69k1K5K3L6
4549A18k57j43L36J19l50K58j08P1p8J23o2j07L34j66k14LJ36j22m5J32K08m45
4571b59K43o4J67L2k78K96j23j65K72J7l43J94J24l43K15r3K74j57m7j9k0J15
4593C8K00l85k9j08K94L9j48N0R7Ok48J77J11j78o4J06j23Q7N0J69J31j86J23
4616B09k66q1N5K40K19m50k72L62K73k59l7qM2l66L00P4k63K19P7j40m8K91j31
4639D0m5Mo9M9j7K0J43M7j22K07m16J08K27k40k78L75o6j3J55l82K55j63L34m76
4663c23P17l76l9kK8J48k03K7J22J09j51o8L5q2J96l39M35j17m2m0n1j93L32o2
4687F1K0j61jK1J53j50J36k81P5J23J14j83K76k95J81l74J46K8M50m26J01J83
$$ y = [271, -10, -134, -49, -55, 194, -52, 51, 19, -133, 100, 34, 129, -149, -146, -82, 81, 109, -153, -135, -214, 55, 34, 59, 82, 118, -139, -282, 54, 173, -177, 81, -27, 44, -34, 89, 27, -80, 254, 88, -126, -123, 13, -109, -154, -22, 186, -259, -16, -80, 87, 119, -159, 137, 14, -151, 121, 138, -205, -11, 113, -230, -15, -108, 166, 9, -38, -57, -77, 38, 238, -147, -176, -284, 10, 49, -99, -49, 48, 54, -194, -17, 94, -84, -148, -42, -165, -78, -28, 141, 272, 86, 209, -57, -138, -83, 157, 376, -74, -346, 16, 289, 30, -7, -15, 27, -339, -39, 35, -228, -9, 68, -72, -120, 171, 40, -5, -1, -70, -21, -38, -18, 125, 172, 50, 257, -159, -51, 176, -64, -342, 33, -33, -46, 109, -273, -18, -181, 153, -323, 394, 18, -21, -23, 5, 153, -50, -23, 99, 208, 57, -11, 24, -58, 138, -201, 234, 117, 75, 35, -16, -209, 123, 61, 81, -80, -81, -60, 93, -57, 79, -202, -127, -4, 110, -73, 203, -92, 89, -285, -139, -111, 339, -87, 14, 197]
4709A97k38L8j42K62l89J70K10n0l47J27O9J4K8k5j78J66j58K86j62K72j09J23
4731A64j44K09m88M43K1l63L60j77J13k08K9J7K37P5k99K15q3p8R0J84l40J16
4753I3j77j46J76L4k40K20N6j37J07l3rn1L1L56m74M85l11j64L37L3l13L58q2
4776A49l13L90r0l6j56r9J82K2j15o0N8K53m7K8o1k62N96k71l5k45r1K16l7M9
4800B5J48JQ4m89L61O9l10N2R5j92J16l1l01L01N2k43J15J50k54K40N4j79L11
4823A75l68Q4K58j37Q3k75M09R1m99K29l30J67Mk69N06k15J6J80j03j41P6K25
4845A66j99k7jL9k18M70l98J27K5p9K75j44o4l4K96j51j29j5M6j88M14m69K18
4868d0PO6k8n8Q7k05J62Q2J15m67M57k60O5l7M6N1r6p3K68q9j48L17q0J12l66
$$ y = [197, -41, -3, -145, 117, -272, -102, 108, 58, -289, -162, -93, -79, -51, -76, -254, -88, -246, 40, -122, 150, 41, 164, 20, 229, -259, 184, 205, -158, 202, 25, 138, -70, -41, -24, 213, 288, -11, 204, 121, 43, 133, 317, -23, 93, -84, -230, -54, -20, -260, -40, 16, -121, -14, -47, -56, -107, -76, 280, -194, 291, -20, -184, 153, 186, -127, 231, 149, -164, 226, 136, 100, -56, -155, 27, 49, -66, -126, -68, 185, 138, 166, 105, -157, 439, 168, 133, -112, -203, 13, -24, 25, 173, 174, 258, -231, 130, 199, -111, -59, 36, -156, -40, -71, -372, -71, -19, -262, -147, 3, -251, -11, 43, -136, 175, -193, -109, 149, 12, 95, -180, 229, 320, -179, 50, -280, -113, -109, -378, 128, -87, -71, 109, 6, -135, -59, 166, -33, -60, -61, -22, -240, 230, -168, -41, -16, -95, 180, 36, -28, -62, 234, 83, -46, -61, -15, -203, 211, -258, -40, -33, 33, 5, -53, 34, -171, -9, 73, 188, -279, 178, -82, -17, -54, -8, 43, -53, -126, 142, 53, -95, 222, 142, 254, -112]
4893a12M01k91j90K11j32Q8J60k05K28l17J40o8J3J93j21J44Pk36L41o21L83J02
4915A18k22J15k7mr0K48r4l42J52L11k55k2J32J29Nm38J76j8J4K76o14L90K1q3
4939a22L13k20J76M5l88j20L26j35j52K67J04q5j75J00j82K64j35K63k34L29k85
4960d6j30K07j46J57j12J70k31J79J63J55j57p0j7j91k04J51K1o6k3K53q8o3N7
4983c1l7j38K73J05l33P8j83J58K99k11j00p3K2K46j09q4L0Q4k28M1J17J26Jj3
5007D0L46l02O4l86M01M2k60k3K03j42J1l1J16L8l30L02l45J35J21l5L11j29j46
5030AP9m7r8K6L41l20m03J94R7R8N0L3j17J56k39L42K31n44J86Lk60M54j23l00
5054a60K49n7l2J16j18j94m7J80K71m7l98L92k36q2L35j61J47j52J31o2j77J44
$$ y = [-112, 289, -2, -192, 19, -113, -25, 135, -70, 158, -159, -19, -87, -74, 119, -2, 142, 149, -87, 254, -367, 16, 118, -104, 11, -16, -20, -110, 138, 44, -298, -146, 165, -90, -112, 20, 149, 154, -284, -108, -126, -112, 164, -450, -60, -39, -122, 191, -29, 147, 192, -196, -316, 10, -125, -277, -10, 94, 9, -166, -66, -248, 16, -119, 144, -90, 239, -46, -176, 31, -115, 42, -70, 100, -131, 48, 211, 366, 209, 139, 122, -69, -273, -122, -101, -167, -190, 63, -25, -88, -31, -68, -206, 67, 172, -161, -83, -266, -108, 191, -20, -120, -193, -171, 75, -34, -118, -88, -4, -232, -191, -74, 52, 53, 40, 386, 84, 148, -238, 163, 205, -55, -78, 125, -17, -6, -37, 79, 117, -213, 89, -256, -121, 0, -35, 276, 147, 1, 80, 33, -65, -39, 302, -18, -421, -227, -130, -32, 18, 51, -66, 90, -149, 193, 424, -120, 66, 69, -191, 263, 140, -160, 89, 32, 0, 116, -2, -196, -243, -63, 208, 161, -237, 155, -81, -163, 172, 11, 158, 6, 137, 75, -102, 42]
5076D2m8j51K24j33J42Q2l50J65J16k39N14l27q2J7Q3r5l8k2L9J18j21J58L6k33
5100a03K8l18L41k7K16m9j2k09q4RK21k19L00J0J95m07J28K67m2l10P0J61J1j11
5124F6m3j64l6r0k0Q7K05QK3j46L74k60j7J72m26J02J88L17n12L55j99j0m03P16
5148B87k13q1j0M2p7K18k63K45k33M34k10k59J22j60K98l91K76l79N94k68j27
5169a55J37K8q9K2j20K01J76J02j95m8k66J97J17k41k1K24l19K69j23o9j51K93
5191c1J49q9rJ0K2l12K16m7R8j59J73j59K42m8o3O0KJ38N3p4j10J33k37Lr7P5
5217f1J54j56L12k39j80K53J35k35L5j91R2m8K55j35j09j19N28m15P6L6l0J52
5239A10O2j28J2p5p3j70L17N7k12O1J99O0j02k41n3K96k02P9n2J79m2o4R6k91
$$ y = [42, -6, -157, 67, -66, 76, 158, -192, -27, 89, -150, 364, 37, -45, -28, 55, -40, -78, -100, -61, 57, -64, 94, 130, -103, -75, -393, -52, -79, 137, 88, 76, -133, -217, -208, 13, -206, 94, 104, 299, -108, 20, 287, 245, -65, 5, 166, 177, 66, 23, -141, -177, -267, -287, -200, 5, 13, 36, -110, 264, 4, -13, 159, -267, -165, 23, 340, -172, 183, -16, -26, -429, 287, 74, -7, -17, 25, -52, 166, -97, 148, -85, 349, 139, -120, 2, -158, 140, -251, 25, -354, 240, -28, -155, -18, 10, -79, -57, -177, 24, 200, 302, 107, 59, -207, -10, 107, -134, -155, 69, -250, 19, -104, -173, -324, -31, 118, 29, 20, 30, 52, -260, -44, -91, 7, -152, 21, -138, 104, 56, -7, 53, 55, 193, 246, 172, 62, 195, -42, -39, -136, -61, 93, -63, 249, 10, -170, 83, 218, -17, 18, -173, -81, -129, 126, -9, -118, -237, 291, -124, -48, -12, -42, 110, 172, 44, 56, -19, -92, -262, 55, 112, -100, -39, 160, 220, 118, -123, -176, 120, -82, -3, -55, 124, 82, 18, 114, -177]
5263a77L61p6j64l6J38j47L13pj15k81P9M9L22k89P9K36j58Ok32m1K71j95J90
5286A26l74K65L05N4n67J55MJ22J26k13k5P1P0q2o7%J03M7K2k2j58J20k44R3K38
5311A69Q5j31j75j04K23k00k1K10J09p6J8n0R2l46L36j41R2M2j7j6K8m25K36l15
5335c77K82J43P5j85r3r9L39r2O2j2p9N0K67k12Oj20K55j57j18M8L00j90k01J55
5359D7k11J72N3l38Q8K27l6K63j21MKj57j39J31J30j26qj02j51K85K4J7p5l0k62
5384c13M21p8K79k59K12l53J14j88J30p3K46k45j69L58j02l7J91j6o2l3P3L9j2
5407A23J40j74J33o5j09k14K55k4J23l18p2J07j98L57j18j24N5K17j38j92J99
5428c7J02O0J78j0j38k0N9r8j79r8K40Mj09m2L77l03j40K9J4L12j56j45j78K14
$$ y = [-177, 184, 108, -56, -92, 46, -101, 212, 205, 90, -191, -112, -63, 259, -30, 49, 285, 127, 133, -99, -140, 131, -64, 126, -248, 17, 322, 376, -191, -36, -32, 90, 216, 3, -22, 49, 119, 37, -30, -30, 73, 120, 142, 120, -38, 82, -162, -69, 169, 254, 123, -52, -156, 67, -133, -154, 56, 165, 89, 107, 57, 149, -197, 139, -2, 90, 132, 115, 99, 127, -298, -62, -377, -95, 48, 123, -62, -155, -254, 85, -7, 55, 43, -36, 14, 281, 69, 75, -45, 210, 53, -65, -17, 283, 93, -108, 47, -164, 8, 61, -277, -189, 38, 2, 265, 144, 148, 150, -7, -146, -15, 115, -11, -19, -121, -272, 13, 37, 54, -21, -51, -313, 108, 30, 309, 50, 262, -91, 23, -165, -35, -108, 138, -107, -276, 82, -20, -57, 134, 118, 56, 23, 96, 135, 123, 263, 89, 222, 157, 48, -166, 89, 65, 188, -130, -202, -95, -293, 64, -54, -178, -123, 94, -44, -236, -37, 65, 125, 303, 293, 155, 135, 194, 96, -83, -181, 59, 63, -46, -88, 289, -14, -154, -125, -111, 201, 45, -100, -278, -64]
5452f4J54l23K19j6K19j24k35J70K09m48J41k27L42J44p2j6R5k43L24l80k12K55
5474h8K0k28M26j10k48N95k88j3j43K4N8j65L35k36j05L39k31J84L0j93k06K81
5496C8n9o9j01J59P2k24L26j91kJ05k8L0K51l52L72l64J04J2ok68R2J39J53l91
5520b02K18j16J58j14P9L9j17R5k20L89j91%j47M12k26J04n7J30l58L38k35k33
5542b54L24O9L5n7k27J43j42n9J63k6p3M28k19Ro5p0J25n2j99R2J46J0p1K52m51
5567a69M22m84K90J57k73j31R0J66j40K43j32m5j09m6K69j51L21Qp0k20J18j54
5589d0r6J88q7j5l0K32k60J62p7J60k16L4J07q1J63L4j83K62l85l7K85o5J66k21
5613@K12k25n6k19K48J51k26K93k14K30r7r7N4l4k94J20J89j5K84j00k60J02J03
$$ y = [-64, 90, -233, -14, -30, 189, 65, -170, 0, 209, -239, -98, -325, 17, 161, 89, 73, 168, -75, 249, -131, -343, -88, -68, -296, 130, 20, -228, 367, 79, 66, -77, -53, 5, -160, 175, -61, -166, 173, -58, 126, 156, -37, -243, 38, -21, -90, -191, -32, 40, -184, 142, -49, -51, 54, 26, 56, 307, -45, 327, -37, 67, 79, 73, -195, -103, 36, 189, -202, 16, -100, 58, -56, 23, 62, -55, 40, -180, 209, 18, 18, -129, 283, 57, 161, 104, 234, -124, 214, -21, -254, 70, 139, 174, 117, -110, 33, -109, -168, -5, -31, -104, 324, 105, 114, 49, -21, 104, 52, -147, -55, 91, 101, 30, 282, -169, 253, -231, 59, 216, -57, -188, -98, 68, -72, 171, 39, -6, -115, -161, 108, -43, 278, 286, 216, -4, 114, -40, -136, 52, -35, -50, -80, 152, -108, 54, -23, 137, -79, -45, 62, -19, 144, 178, -5, 257, -128, -165, 120, 55, 221, 0, 212, -13, -69, -288, -40, 111, -115, 178, -36, 194, 97, 0, 54, 20, -274, -154, 35, 20, 304, 204, -56, 46, 149]
5636A49k9j79L7j03K44r6j37J21P3o2m9R6j86J79J45k01K57l09K84J26k63k32
5658a35J88k48M09l86J75k39K44R3pl42J39j7J32J29k92K98l48K34j1j69R5k61
5680c19J14J14j25J13L05j64j82N8%L52l15J42J9q3R6MQ7l04K14l6r9o4O2L5N2
5705G6m7j39M27k83k0k59Q3Q5j40O3R0O1J1p4K77k77K70l55l2K25k28K55q2Jj2
5730b4N9r8P5j22p4L39k09R0m5J9Q8J9J7q7K0j01j35R9J74J02j3r7q3p1K18k20
5756f0M3K43n56L85k90K98N6j31Ql42K23J01J02Ok79M32k63R3j02j79K43J33k84
5779a20J79M9J52k13k09K24k0Lj57j18J18L02j89k50L72k02R9k7J43M7r2j13r9
5802a21M47m73K18j4j93J61n9l7o5O3k30M25j34l2J12J37l35J45k4N8J21k75J71
$$ y = [149, 120, -59, -22, -125, 119, 23, -114, 7, 80, 18, -31, 65, -121, 58, 203, 2, 259, -50, 234, 360, 97, -135, 53, -195, 214, -172, 3, -236, 8, 101, 94, -248, -109, -126, 6, 135, -157, 141, -207, 27, 16, -153, -58, -319, -205, -91, -216, -103, 202, 38, -144, -86, -86, 266, -49, 93, 112, 29, 125, 129, 216, -88, 126, 90, -9, -73, -11, 24, 76, 29, -110, 317, 34, 14, -245, -162, -77, -217, -154, -64, -3, 8, -66, 211, -66, 204, -151, -183, 42, -186, 69, -13, -12, -24, 35, -63, 12, -110, -184, 155, -54, 36, -9, 10, 98, 117, 134, 47, 67, -34, -169, -70, 104, 206, 193, 96, 13, -58, 160, -60, -17, 226, -330, 55, -235, 63, 119, -12, -4, -346, -123, -22, 80, 86, -193, 239, -24, 69, -33, -212, 31, 164, -120, 59, 108, 260, 47, -162, 62, 42, 45, -112, -230, -112, 190, 1, -249, 123, -79, 20, -7, 136, 183, 91, -22, -121, 326, -147, 71, 57, -136, 25, -34, -71, -136, -73, -303, 122, -12, -44, 68, 205, -130, 15, -9, 49, 170, -105, 66]
5825F6k04K13%l0r5J2k2J57p0o7J88n49L44j47K05k6Q5L1l0k1j10n3j2p1J43r0
5851a53K62k09p1L5O1n2l2j54K67K06j17J49j12k42L90j05K9j06J89n27L76J43
5873B27r1J84m56J31P9k8n1O3k90R0J66M7j13r3J16L0n8J30k08J27J05o5mk10
5897a72Q7qq2K93n9m1j89j6J96J54p4j14K50l68L60k42L0j76J34N8N0L2j78M1
5921c4K85l45j9N5K80J41o11N71m20L57k24K15l14ORK53l41q0K23L9j27J71j39
5944d9J70K06n10n5L64k56J51k60L31J83k71K0j85N2K87M3n2k26J42l7J61j22
5966H7q1Q9j72K26j14k7o7K19p2r9p7K27j00j75K28M6J9j32N9J48k02j06o9o3
5990b08J70m2l5N4J82k05k07K59Q4k05LR2K42jp2j57J38m01K37j01R9J05K0p0
$$ y = [66, -138, 75, 75, 45, -50, -38, -60, 97, 27, -40, 148, -401, -57, -204, 1, -25, 60, 91, 61, 40, -70, -123, -135, -206, -63, -153, 109, -100, -171, -136, -75, -127, -159, -313, -46, 160, 43, 192, 80, -162, 228, 123, 152, 46, 235, -292, 84, 227, 136, 320, -136, -5, 74, 46, -5, 58, -232, -142, 24, 71, -42, -135, -19, 11, -47, 83, -125, 2, 107, 42, 38, -172, -85, -93, -175, 118, 59, 18, -171, -187, 9, 163, 89, -25, 225, -143, 217, -25, 5, -171, -37, 21, 71, 103, -75, -34, 251, -94, -113, -58, 222, 363, -248, 323, -97, 260, 36, 251, -63, -57, -48, 205, -136, -216, 7, 46, -81, 90, -49, 121, 327, -183, -238, 126, -130, 21, -239, 92, 275, 4, 24, -161, -109, 178, 221, 169, -57, 85, 48, 209, 87, 6, 95, -77, 149, 35, 8, -59, 160, 88, -11, -88, 139, 39, -136, 92, 138, 157, 25, 84, 232, 30, -76, -145, -208, -38, -80, -115, -61, 121, -84, -291, -32, 52, -153, -150, -58, 184, 183, 111, -46, 92, -309, -72, -173, -74, 31, 51, -19]
6014a9l4K29k39j14M45m44L89k17l5K65k67K88k40K77j81J3l94L84pn9k50o9J75
6037a04J91k9l15M1Q9j37M08j79O8k15j12O88l32O1k69K04r3J70j31q0K48m3j90
6060f1J64j94K63r6o7r1o5J42p0om0J29j26P0J53q6k18K72q7P2j27O0jk77Q0L80
6086A73k05m5L54k76m3L8R1j5k7k62J76N6nn3o6O6R2j40P5m0J17M3j16o1J22K91
6112C40k23j84R8K5j77J73R5j22P6r3m2j37K46k35K03K1N2k93K89j17pm6j06J07
6136e7J56K43n14M14l38k1R7l99K45K87j83J11K2q2l03K72J45k33K20o1O8J68
6158B57k08l57L49j67N5J34l40L31j58n1J58K29m25L19O2j91m1o7L03k56L94j05
6180B25k77L51m69J65q1q1K95o5p8Q4q1J20qj51j51Q3K8k3J13Q1j96rN3Q8J27
$$ y = [-19, -53, 176, -63, -177, 268, -176, 213, -4, -39, 226, -41, 247, 7, 284, 103, 116, -278, 106, 99, 40, -210, -279, -104, 87, 58, -257, -216, -127, -264, 144, -35, 33, -182, -294, 394, 62, 123, -146, 58, -35, 135, 4, -76, 172, 129, -61, 103, -91, 172, 76, 9, -82, -147, -5, -75, -81, -121, 8, -118, -48, 105, 19, -199, 73, -14, 58, -69, -9, -10, -287, -207, 173, -32, -77, 277, 1, -42, -4, 87, 72, 45, -217, -41, 15, 10, -43, -109, -43, 49, -91, -16, -56, 61, 104, -12, -73, 49, 340, 117, -67, 31, 56, -121, 52, 147, 25, 101, 8, -34, -171, 75, -160, 43, 64, 116, -177, 112, -5, -12, -58, -164, -57, 99, 342, -172, 242, -96, -117, -20, -419, -174, 113, -70, 41, 63, -19, -322, -50, 95, -138, 82, 21, 89, 257, 49, -308, 41, -126, -71, 63, -277, 54, -104, -155, 3, 232, -193, 126, 188, -3, -44, -111, 192, -64, 330, 225, -52, 299, -170, -5, -86, -167, 128, 63, -15, 69, -12, 108, 100, -51, -202, -119, -91, -114, -1, 80, -116, -125, -72, 16, 143]
6205A43m64K36J08j06k9J60k52J34P8Q1l85L46%q1K25l70J99k8j87KJ02r0K08
6228C0l8j6P7k59R2qj15J52K63l59K06j7j40K84j21j46K4J67j51o4K40jkK6p2
6253E2N1l9k28O2L6M3Q5q4p0j18J82K09m98J31L96j84n5j00L19k95j50L86j7l46
6277b32M51o5J7j84q3K15k91M32j65j15M6j24K26n9mOj37m09N75k09J88R7j25
6300E1L5Q9j38j58J53N9%L1k44O0L76k14J9j39R7J3l43M75k12j02K04ko3j19J83
6325A11Lk56J93j96R3l08K43J07O2jL8k54J75M6j18J11k54J01L3K8J4l2J5P3k3
6350DJ12k52K48j58J6J5J54j15m6M3n0n5J7K08k05J24o1j56M1J82J9k66n0K82
6374E1k6Q5j70Q0%k95K24j10K19J7J80k78J9j65L03n6n4L22l63j51oJ6L93k90
$$ y = [143, -321, -85, 23, -83, -112, 48, -204, -70, 8, 89, -296, 50, 50, -31, 194, -176, 23, -5, -192, -190, -88, -178, 30, -8, -24, 53, -206, -114, -122, -237, -85, 178, -181, 25, 8, -132, 152, 31, -115, -91, 76, -75, -139, 101, 100, 98, 124, 52, 103, 64, -164, -102, -66, -23, 62, -22, -92, -210, -28, 181, -317, -186, 210, 26, -29, -129, 190, -105, -255, 131, 114, -232, 219, 154, 171, -13, -96, 119, -172, 260, 95, -20, 26, -98, 128, 69, 65, 71, -66, -475, 100, -109, 79, 176, 51, 86, 175, 37, -121, 32, 91, 91, 122, -122, -62, 314, 100, 119, -20, 77, 90, -253, 222, 10, -92, 112, 110, 47, -72, 111, 114, -142, 51, -145, -52, -360, -117, -10, 52, 51, 89, -165, 10, 56, -62, 49, -205, -104, -71, -43, -29, -61, -46, 27, 4, 116, -136, 112, -46, -30, -15, 139, 24, -22, 21, -29, -84, -67, 141, -64, 60, -1, -157, -116, 66, 85, -181, -231, 51, 25, 110, -60, 20, 20, -275, -51, -161, 58, 75, 255, -23, -4, -169, 134, 78, 24, 346, -17, -168, -174, -158, 235, -55]
6398e5R7N6j49RL84k94O9l21j3R4J28j21J82j50N9k85O2K52j14Q0k17J43K44k23
6422h3j47M33k55lo6K8M3J17j59M9Q2o9M1j58J73J42Lk21J93m1Lk05k1M29j03
6447B05R6m34N8N4j52L29M8j58j72L05k20J3J01Q9J60k73J09N2k44m5L4K6l3k7
6471g9O6K17j09K87n84K75K4k37O6mK11k47K32l67L07N5k40l5K75r6n2q4K77j03
6495E5m8J16j32j26K12l9O6k22L7N4j02K61o4j27K67k93L21j49j19j12J28j4L73
6518C43j23k49N3k04J14L13m48J47j7k3L05j98L81l38m8j1K58m6j04J5l54L82
6540A48k30j62J13l0J18J50Q9j13K21m73J56p7J21m4J05Nj77Q4K17j88K32J36
6562D01m97O5k42K10j12K25j1K08j8m5k76K0J28K6K1n7j12M5M1K39j61j4j24J88
$$ y = [-55, 42, 98, -51, -42, 342, 48, 117, -204, -217, -123, 5, -116, 66, -84, -25, -310, -248, 4, -110, -30, -247, -104, 140, -83, -230, 203, -52, -55, -121, -93, -50, 67, -92, -43, 39, -30, 11, -147, 26, 168, 171, -50, 143, 102, 105, -100, -121, 308, 205, 301, -133, -75, -21, -173, 156, 204, 46, -126, 179, -41, -28, 73, 162, 322, 49, 158, 210, -34, -79, -45, -19, -52, -79, -13, 204, 95, 382, -202, 73, 97, -140, -74, -78, 133, -114, 118, -249, 58, 113, -127, -162, 113, 17, -35, -119, 158, 55, 7, 123, -9, -135, 77, 38, 104, -118, -81, -27, -129, 132, 68, -59, 208, -85, 236, 87, -32, -144, -16, -30, 343, 220, -29, 24, -180, -66, 247, -201, -54, -71, -94, 211, 13, 394, 56, 8, -3, 255, 209, 105, 120, -234, 148, -82, -244, -131, -161, -43, 107, 196, 83, 304, -169, -13, -90, 31, -13, 92, 97, -80, 4, 221, 33, 265, 401, -96, -31, -273, -63, -175, 50, 39, 247, 229, 184, -92, -72, 56, 82, 103, 46, -66, -21, 20, 259, 98, 84, -40, 148]
6586A48k17j8j5L0j35L99j92k13M92n48K07O8P1j58j09L27l05J71J10k19j16J34
6608h8K0N5O9p3J07k70K51r0R7r2K14k59k07M51l36L00l70K89j15J81r9q3j33
6631a81L16O1l53o3L54o8J2K5J91k07l3L9j69N0J43Kj4j00r4n4J23J4k22J29J92
6656I3o6m2nJ12k64M14o1j89J43q3k01J46k07K6K56j87J5J35j71JP5J50j95n5
6680a60L53Jo8j48k9oJ94J32l45J9K76j28k17L03k24p1nm4J53l63O78l13J41k40
6704a11K42m1k06K6O5k66O09l30J36l50K12q8m5K23N3l52J54K86m99K45J49j04
6726Hj24M25k63j49J64l5K12k71K9o1J91Kj60J00O7O3o5j63J42j28q0J35J63j47
6750E5j23K04O9j32k19K03l40L42J3k80K35N8j73J80N6l25K07n8p9J53o2J18j70
$$ y = [148, -69, -87, -102, -72, -207, 192, 0, -213, 279, -269, -62, 6, 77, -81, -190, 137, -168, 3, 113, -106, -222, -88, -68, -13, 56, -17, 90, -180, 71, -19, 78, -14, 200, -59, -266, 185, -151, 149, -221, 68, -47, 134, 35, -48, -181, 135, 196, -157, -220, 134, 66, 78, 103, 294, 87, 54, 93, -76, -26, 117, 119, 105, 5, -89, -143, -20, -6, -228, -99, 93, 27, -15, -20, 92, -172, 242, 181, -8, 135, 52, -149, -3, -210, -184, 72, -115, -100, 35, -136, -135, -60, 90, -105, -160, 193, 194, 126, -22, -51, -57, 137, 269, -76, -57, 219, 91, -126, 177, -47, -118, -123, -167, -14, -377, 301, -12, 129, -111, 131, 90, -116, -90, -25, -291, 318, -12, 124, -226, -14, -102, -147, 76, 129, -223, -69, 217, -282, -37, 112, 8, -116, 309, 46, -103, 61, 26, 238, -33, -4, -65, 126, 128, -32, 68, 135, 198, 133, -30, 112, -16, -96, 39, 202, 55, -68, 136, 205, 73, -146, 57, -283, 59, 72, -208, 27, 85, -88, 92, 148, -177, 30, -28, -107, 46, -16, 102, -68]
6773f8m1J30K7j79o8J81p1K29j07j80j6K04j54n4J32J31k04L36k04O9J83k24j05
6796e3j29j02M22jl83J01J46j49M68k77j45K12K4P6k02P4j73J41k83L22l03M3
6818a71J2K2J22k02J07K40l18M10l37J31k45PM51k36K88k23j60R0n8j16L1m9J0
6841a94K12r0q8K17J27j1n04J85M0l3P4K47k77l23M32J70j68jmr6J53m6j2K13
6865B23k44J45k88L39k96M6j25r7K58J40n3lr7j53%J21O7K65l73L0J07l8M5Ro1
6890c3K19l44J02J94m9J5k2r8R3j04P8k22J77J13j45%k16K38J34m57K43K46j36
6913B6j24K43M6j38k1J48q9j77p5L04j55m1J45m14L11P5kj70N3M1j5l2o8K48q8
6938C1m9P0j35l7R4q4k18J82R0n7R4l3K22j65J89J09r9p0j13Q6k79J38k2j39K10
$$ y = [-68, -109, 21, 48, -131, -199, -18, -89, 140, 33, -147, -163, 41, -113, -167, -35, 96, -108, 228, 24, 93, 276, 52, -53, -182, -284, 138, 137, -246, -145, 1, -148, 320, 43, -102, 110, 134, 210, 8, 82, -91, 50, -233, 89, -214, -171, -159, -137, -15, -217, -110, 130, -188, 222, -115, 16, -229, -222, 229, -7, 281, 58, -102, -12, -70, -186, -155, -204, -194, 18, -72, -160, 57, 184, 173, -331, -146, -106, -139, -65, 182, -95, -418, 14, 184, 16, 15, 11, -85, 68, 22, 10, 223, -21, 124, -164, 175, -121, -75, -200, -297, -39, 101, 48, 45, -52, -205, -205, -84, -17, 248, -125, -95, 12, -26, 19, 28, -33, 186, -158, -56, 138, 89, 104, 82, -16, 77, -27, 51, -171, 6, 119, -26, -26, -242, -4, 130, -327, -84, 162, 26, -98, 145, 191, 53, 32, 180, 91, -86, -161, 143, -12, -53, 92, -322, -11, 64, 62, -108, -55, -14, -29, -61, -129, 119, 31, -18, 52, -83, -120, -26, -110, -328, -146, -56, -113, -19, -52, 170, 5, 194, 303, 204, 134, 21, 107, -172, -34, -56, -195, 15]
6963A5mp6K92m38L39j74K21k01k09J72K57l61K54l13J47J84q6j1l4n8K29k88K48
6986A05j25K40k90J03j47j77K62j31P9L15j28%k34J84j73K26j97n1o7L60l88P3
7008a61L42k71K87j04m2R5j07k46N9n9K72j44J36k78J52K3P1k31p5J64rj8l9K29
7032D6l4K80j30n8j75j01K05l1J90k87nq7N6k8J44j48J03J68L5k95K13j92L68
7055B37k56J44o3k84J30ql0K09L9j18Q1k24J47M3k04K03q9j96K01k22M80k39J11
7078I2m7J8K93n22J00k12J40R4j48K4K29k08q5J34Q0K19l86M55m50J27L1L8j77
7101a61K95j80j09J32j07mJ74J99l07K79k70%J68j9k39p3K25j18p8J08Q5n7J25
7124F8o7R5j11l18K29n2J80p7J5O1Q0J62m30K03jj48J94k0M3j44R7j5k05N2J36
$$ y = [15, 11, -65, 227, -211, 128, -46, 175, -26, -235, -63, 194, -167, 87, -226, -79, 105, 19, 8, -26, -84, 145, -143, 105, -20, 220, -70, 33, -114, -291, -29, -160, -81, 234, 106, 106, -128, 56, -117, 109, -88, -139, -206, 154, -234, -161, 181, -90, 197, 93, 51, 146, 39, -207, -148, -207, 65, -79, 57, -221, -69, -46, 25, -206, -281, -117, -126, -144, -183, 46, 12, 292, 162, 104, -71, -172, 33, 2, 192, -95, -100, -187, -131, -159, -15, -163, -60, 108, 143, -152, 61, -131, 237, -19, 125, 62, -222, -92, -100, -130, 79, 118, 0, 81, -143, 4, 47, -157, 46, -43, -239, -38, -260, 220, -19, 92, 45, 63, 356, -166, -66, -278, -138, -44, -192, -168, 61, -147, -232, -98, -18, 201, -185, 270, -180, -53, -22, 16, -161, 134, -46, -155, -23, -130, -134, 40, 239, -68, 211, -59, -59, 109, 90, -149, -222, 3, -115, -193, -85, 0, -57, 68, 1, 96, -15, -333, -104, -156, 24, -53, -38, 23, 103, 265, -165, 38, 37, -111, 83, 63, 106, -38, 59, 44, -161, -109, 27]
7149B7m9L2r9J33L0l7j98K27j71Q0J21j80N9J07K28j88k34J92J06m25J48J79j02
7172a4J02q3J94l77J09qo1N9L17m5q5p7M8r1j38J40j96K88j44K16k86K74j06k49
7196b13L75L1k18j21J28O3J18q6j18P5K15j97l5K9k01K25p4l9j70L96l30J29J52
7219A34l09J16O2K3k79J12jk7K91m9j54j02L29j2M7j19J0m6r3J14J87j43Orr3
7244eO0j44o7m9R2J13l93K30J91m7M8o6J66j04k00j78M33J14k55J11M1L7p7J56
7268B07l17J25K84m11L73m54K34j27J48O8k49r2J43K67p7l0k57L77l22J46r9K11
7290A48o2j47K4K62m74J54J70j16K44R4m68N6P4m0k6Kj5J86j94K36K0m5l25oK20
7315b8k31K68j88K16j00N3j67K71J17m90J32J65K0o7k3K60k23l3m8Q4K55l42Q5
$$ y = [27, -22, 10, -89, 44, 74, 37, -161, 66, -105, -25, 96, -84, -25, 82, 310, 122, -112, 80, 186, -239, -91, 88, -14, 88, 5, 199, -178, -69, -77, -138, -79, 238, 193, 108, 31, 79, -12, -150, -10, -206, 82, -62, 154, -132, 142, 36, -213, 162, 193, -25, -146, -18, 45, 163, 77, -41, 34, 249, 52, 17, 46, -155, 70, -4, -43, -213, 183, -147, -18, 134, -175, -59, 3, 26, -253, -141, -142, -169, 122, 73, -81, -183, 146, 134, 181, 62, 72, 26, -67, 47, 234, 91, 97, 88, -5, 55, -89, -156, -205, -113, 0, -393, -163, 28, -19, 29, -37, 129, 25, -175, -353, 80, 194, -61, 50, 91, 128, 51, 207, -110, 15, 299, -112, 261, -193, 41, -86, 62, 130, -119, -211, -68, 199, 122, 92, -165, 212, -110, 36, -63, 148, 86, -61, -37, 225, -249, -95, 75, -41, 203, 297, -171, -115, -41, -81, -107, -105, -120, 66, -128, 108, 128, 83, -242, -248, -28, -259, 9, -179, 37, -63, -10, -177, 94, 211, -279, -147, 18, 38, -29, -52, 208, -15, -48, -96, -12, 243, -99, -14]
7338a4p5J36m4J02J55j66j46J1Q4k2j03M10j95m42K47M11m38MJ17J66l83L81j12
7361H4j02P5r8K11m26L68j81k00M44j56p5R2j43M9k3j3rK79l19J04L01j96k61
7384a95J3K49J4Oj80mN2J26l3K67l80J03m6q2K44P3k74j73J99J61j24j9J86%J05
7409B88Ok21n1j47J83L3J64l42N3O2J39k07J21m8l3K2O3N9j29K19l46L59j93m06
7433c52M88k79K28r9l8K55J21l17m3j50L08j72m3J99J1m2l7L6m9j00P1J04j29
7456b9J33m3k43K41m87O27k48K58j42p4Q6P6nk77J35J50k13J58j4k07K24n8k90
7479b42Q6K10m1j53N2O9j00q4J08k7p3L00j76O4N1j07q9K37J98k37R1j90m5J76
7503G8J3L5J0m41K79P7j30m15L29J45R3J99j73j59k9K50o1k8j55K52K0k20J91
$$ y = [-14, -89, 47, 3, 105, 260, 94, -52, -41, 43, 21, -82, 328, 133, -309, -62, 349, -89, -85, 32, 198, -185, 196, 84, -18, 57, -41, 170, -256, 112, -69, -269, 175, 19, -56, 36, -107, -58, -81, -94, -103, 176, -143, -39, 262, 66, -195, -182, 67, 81, 87, -93, -97, -45, 81, 48, 315, -65, 38, -8, -90, 154, 227, -47, -220, -21, 140, 16, -3, 183, 183, 288, 294, 73, 22, -125, 58, 91, 255, -87, -34, 28, 167, -40, 81, 33, 0, 22, 85, 144, 15, 234, -112, 247, 54, -352, 136, -143, 85, -14, -52, 203, 324, 7, -36, -186, 122, -50, -93, 106, 117, 75, 38, 74, 25, -75, -4, 100, -29, 104, 61, -182, 59, -428, 199, -49, 209, 67, -7, 79, 155, 150, -127, 8, 158, -55, 103, 89, -118, 106, 48, -242, -156, 54, 13, -140, -88, -19, -119, -203, -95, -122, -195, 105, -71, -7, 44, -63, -152, 85, 283, 46, 137, -53, -98, 78, 91, 126, 136, -305, -26, 51, -79, -494, -165, -20, 73, 272, 99, -60, -89, 161, 100, 72, -83, 169, 189, -31, 160]
7526A60j61J93k60j6J6Q2j66K66J08j31l91J20p3M22l3j88r2l2J30Q8k01p5J73
7549f1J30q9J03k89J90mK56k43R9J25k82q5j19J59J39J05j71p7j80J16K99m56
7571c35K21K67J3j55K53l49j3K70p3j4j29j8l1L6J37J9O7j17J7j69p9J52N3J70
7595A93l37O6J32Q5r1p6k60K19p8L35m00K39J63k89K32j99O9jk05J61k1J61o7
7618C1k8N2k77K30J1P8k18J23M0n5K24k13k12M41o7l23M25j46P6j45rq7K0O8m3
7643dq0J0R7K1mJ67n9j90j67J35L91m66J7K91p1j20R1j47K82j14J21j70Jo1l2
7668f1R3%r8nJ41j66J20l1P8l6J61p3J05mm59K82P3o4J27j07k02p0N1RJ89k25
7694a72Q5J54Q0l72L38j85K73o4k93K46j18L30l86k4l7j58P0J86r3L36o3l33J37
$$ y = [160, -1, 192, -68, -84, -68, 14, -152, 114, 222, 91, -300, -180, -253, 169, 136, -52, -144, -176, -46, 42, -159, -234, -61, 69, -20, 83, -206, -16, -20, 236, -7, 92, 217, -65, -150, -269, -110, 29, 134, -37, -114, -294, -178, 121, -335, -114, 153, 166, 11, 264, -85, -98, 172, 99, 85, -44, -62, -93, -57, 80, 99, 166, 49, 66, -103, -182, -30, 23, 193, -144, -78, 54, 139, 48, -28, -288, -69, -147, 188, -212, 27, 190, -99, 133, -66, 3, 2, -203, -42, -63, 98, 31, 3, 55, -222, 8, 19, 97, -121, 2, 42, -13, 211, -2, -214, 227, 160, -163, 262, 116, 192, 47, 38, -49, -29, 39, -4, -84, -74, 23, 44, 40, 207, 148, -42, -209, -74, 317, -149, -132, 159, 88, -32, 59, -88, 194, 80, 201, 31, 32, -29, -61, 32, 32, -66, -71, 70, -96, 24, -7, 71, 35, 196, 123, 228, 224, -235, 47, 120, 56, 183, 76, -126, -196, -145, -136, 53, -172, -87, 67, 147, -225, 113, -72, 201, 137, -156, 90, -28, 302, -84, -108, -145, -303, -233, -47, -140, 196, 133, -200, -63]
7717f3M9J91j71P0k39k5K06p7j07J68j93N5q5L60J08j61k38L16J62m25J64l57
7739b92M85rj69J33k14k4k9J34J00k33J68j13O5%p8N0J04l0J8k47J76M3J50m12
7763b24J87J84j37R1n9mJ2P8j71J95k28Q4O7j14O3j16P7P9l4k01K86l30K65L7
7787H7j29N4P9L8l57J14J24K49J9j42j75L9r3J24J20j15J35j30K4k83K52p2N2
7810A4j14L2L98l25q9J17k47K40K5K8l70N60k73L9j57J09J9j95J09rK39k83J31
7833bN7Q7k86k3K56k7K51l86P7q4J17l4K29k17Po5J45J95l90N0M4rO8k45N31l60
7859a4j65M24l34rL7J35j07K54k46j7J34jk07J33J19j57l2O8j88M3q0K36J27K3
7883A76O9j14k80n8K58l3l9P4k4q9J69l6m1K42l18j2r2K59j05K24l4m0q6K10N4
$$ y = [-63, -14, 177, 6, 76, -163, -188, 18, -59, -166, 2, -191, -136, -221, 139, 247, 86, -152, 164, 326, -99, 65, -292, 193, 184, 15, 148, -66, -90, -119, 15, 115, -118, 50, -63, 2, 2, -76, -26, 78, 48, 66, -181, -5, 38, 188, -224, -37, 147, 10, 101, 42, 38, 50, 128, -43, 152, -76, 8, 75, -39, 24, -92, -15, 64, 30, -171, 115, -215, 50, 87, -42, 12, 91, 129, -228, -114, 10, 259, 278, 136, -39, 0, -93, 31, 151, 36, 171, 41, 65, -218, 34, -38, 14, -100, -68, 330, 5, -84, 33, -214, 26, 51, 79, -291, 269, -4, 35, -122, -13, 6, -189, -80, -89, 150, -133, -2, 55, 142, -144, -167, 89, 62, 313, -73, 4, -80, 37, 3, 232, 15, 22, -43, 102, 297, -93, -43, 1, -8, 60, -185, 346, -14, -179, 245, -89, -98, -61, 74, -33, 221, -25, -42, 92, 91, -116, 17, 136, -21, -53, 15, -173, -130, -210, 26, 153, 176, 245, 131, -149, -207, 51, 18, -21, 53, 29, -60, 109, 73, 32, 274, -44, -56, -148, 111, 6, 230, 196, 156, 70, 280, 334]
7908C34m63K84j49j18L01j87j53K98o8M9j1l56M88m69J64N4J41j46j39m8L55j37
7930B4l4j58L4K93j73j09l7N9L54l57j7K04k42L70l83M20l21O3N1J39k09J17R0
7953A78k28l42K42J07j89L50j46jj23L1J73J70l07J2q4J32J79j83J3J18j19P6
7975E9k08j56J17jr0K47j08O2OOK0k16K82J06q1J58m06L30o7J4j97J43K27n56
7999c09J62j4J24j01K21L9l52N5K14r7K21j86J11k23n2P7j12L63l54K92k60j47
8021c28M10N4lj91k14Q9R1J91J30m7m74R5O8J78p7M6j43K42j91J27k28L61k03
8044a7Q4K0OJ32j99p6J79J82m26j90N01l7j14j1q2O5j04j36L46p1N8j79J84j9
8068I6l94N16m38L26j91J35j10M6Q4j12r8k0O6N4r7J03K32m10Q7K07j41J64R4
$$ y = [334, -129, 155, 6, -112, 189, 2, -151, 147, 79, 128, 117, -239, 249, -220, -56, -2, 139, -7, -146, -194, 161, 24, -10, -168, -134, 159, -14, -123, -160, -101, 253, -104, -121, 83, -159, 211, -172, 248, -73, -10, 41, 180, -29, 88, 178, -50, -392, -150, -43, -232, 118, -28, -29, -152, -121, 52, 222, -85, -73, -157, -25, 154, -29, -16, 102, -17, 59, -149, -305, -188, -189, -279, -32, -140, -78, -72, -66, -46, -262, 20, 126, 45, 203, -203, 127, 60, 74, -123, 20, 247, -309, -147, -161, -37, -138, 83, 122, -230, -175, 39, -58, 163, -23, 88, -135, -187, -110, -222, 141, -213, 79, -181, -328, 82, 136, 133, -58, -272, -183, -92, 99, 229, 182, -292, -197, -129, 49, -28, 18, -125, 117, -74, 53, -175, 186, -17, 67, 87, 93, 225, 26, -50, 129, 311, -115, -305, 196, 159, 45, 34, -48, 17, -87, -223, 123, 52, 110, -69, 115, 96, -298, 218, -220, 106, -85, 50, -60, -14, 70, -42, -140, -160, -94, -40, -137, -34, 198, -212, -125, 82, -59, 105, 199]
8091A99M1l46P7K5qJ03j76L44k69K8k5m9L67k20m4K31l22j5J16J10k12L4Q3Nq3
8116fL4m5K09j72r5K21k76K60N1l16L4j8J2J58k89K73l46J11L19o0k29L64n6j2
8140A26k39J65k33K67k44J89j98N3K71n9j04O0J32j23m0J23k31O3J16J59r3k30
8162g0L3j55K28J4m8%k6k00L62k05J46p6j27K13K64n84K80J91l16j27M90m38K23
8185G2j51P2j93J02K59J00
$$ y = [199, 240, -106, -29, -4, -12, 91, -85, 259, -10, 18, -7, -56, 311, 91, 47, 278, -44, -59, 57, 167, -45, -11, 72, 77, -6, 28, -17, 192, 20, -75, 146, -130, 130, 181, -135, -101, -119, -107, 51, -238, 35, -311, -200, 119, 59, -170, 194, 138, 126, -113, 52, -181, 86, -158, 31, -167, -114, 157, 98, -6, 54, 186, 63, 23, 146, -85, -22, 94, 253, 160, -70, -37, -192, 36, 50, 2, 2, -24, -224, 138, -67, 79, 3, -124, 89, 353, -231, 49, 240, -76, -203, 287, -151, 72, -79, -7, -200, -98, 161, 261]
8191B61
$$ Imaginary data points
##PAGE= N=2
##DATA TABLE= (X++(I..I)), XYDATA
0@%%%%%%%%%%%%%%%%%%%qJ6j6J6j6J6k2L0l2L4m2M8n2O0o7P5q7R8j09J23j37J53
41H1j70J88k07K29k54K79l08L40l73M10m52M99n51O07o73P49q32R31j049J190
61F34j364J583j871K265k839L758n465R666l9993m9235R1961N2557m4777m6261
75b9381J3634J4842J0019J0531j1148k6681J0594K1980q997j1259J7263k194l1231
88b2028j207L8592J4458k7934k8929M214L1501K3237k2129m0625M202M0472J1589
101B5413k3119j1908K389j038P712J6571m961k2166m716J3414J4087P122j1646
114G154k9933l016L9973K0564l4429k9111J9715K4999n560j1312k087l019j1Q143
128B070N237j883l337r180q609J4455K2954r805l1856m462K9002K0703j1119k8465
$$ y = [0, 0, 0, 0, 0, 0, 0, 0, 0, 0, 0, 0, 0, 0, 0, 0, 0, 0, 0, 0, -8, 8, -8, 8, -8, 8, -14, 16, -16, 18, -24, 24, -28, 32, -35, 40, -47, 51, -58, 65, -72, 81, -89, 99, -108, 121, -133, 146, -162, 178, -195, 215, -237, 262, -289, 318, -355, 394, -438, 493, -556, 634, -730, 853, -1018, 1247, -1592, 2166, -3299, 6367, -33626, -82861, 9100, 61657, 16880, -29381, -15747, -905, 9114, 19645, 8497, -18184, -7590, 14390, 5393, -5866, 11397, 9203, -22028, -23235, 15357, 29815, 1881, -27048, -22834, 8667, 31904, 9775, -30850, -26648, 13824, 25413, 2294, -9614, -7225, -8263, -551, 16020, 11059, -11107, -15823, -2409, 11678, 18800, 7154, -22779, -25795, 14178, 34742, 313, -28798, -9083, 15916, 10356, -956, -3043, -6062, -6073, 2070, 7307, 5424, 2087, -7093, -15702, -1247, 21707, 11902, -19954, -24416, 4586, 25289, 14170, -14295]
142a4295j3004K4364L1111j2278l5942K381L0383M64j9425M572J1412j4743j0550
155a5550J8915J3236j1972j2926j376L842J4063J0933k0391k6341J6282L4475
167B3190n446k9983m495J6931P086k669l247n156j389N222K756l3L914m211j5084
182a2614J230K3356P102k2684j5477J2557J8809J791j4452j4484M593J9280M886
195A3893j6446p308R849L142o512L657P453p579j1219N548J3021K790q215j1729
209i655l134J5847J4862j1714k1466L166K1144M007j3326p024L067M902K447j72
223B951k262j319q62l543L787J0487j575j7418m706J8198J1922j1425j5017J174
237i608J0923Q273l094j2254m300J0875P893o882n742M475N76o521L047J0760
$$ y = [-14295, -27299, -2935, 28176, 15898, -20044, -17663, 12720, 13184, -6241, -1669, 9743, -5000, -15550, 3365, 16601, 4629, -8297, -9673, -5831, 8232, 19165, -1226, -27567, -11285, 23190, 17744, -12239, -16734, 197, 7283, 4614, 1367, -3789, -5178, 44, 2800, 2767, 6681, 2470, -12614, -11384, 11972, 19074, -3610, -19087, -6530, 12279, 14070, -382, -14866, -10273, 9007, 13893, -2553, -9861, -12, 3130, -3382, 275, 7728, 149, -11070, -5522, 7499, 10289, 2074, -9655, -12789, 3058, 17920, 6206, -15260, -12094, 9050, 13057, -269, -7293, -4226, 676, 3123, 2951, 689, -630, -1492, -5035, -1248, 9239, 7664, -9754, -14460, 3738, 15660, 4235, -10782, -9608, 1315, 9588, 6494, -5760, -10060, 815, 8708, 1826, -3916, 559, 1135, -5386, -2339, 8421]
251H421k088j2284l711R919Q776j206j1797q473Q375J5591j624j6250m514J1481
265F16O096n064l507l8J17qK635K161K70m055o236J643J2034M494j3291j0854
281a2987R304J3884j919j1865m737M792Q436J939o924n835M175M803k916j575
295a425M284j73q542j59J0547M539q827q940K619J0190N143p017j1083R03J3011
310E070L948r197o438M607M012p48m92K60j207k083k4L093L955j486q082l258
326h070R118R210o523j1726R00J0116L916n176n793p27M647M269j812m004K76
341a379J783k032L2N573P33p980m005P496P396l182q934k687O450P436j221r085
357c606l309O926N437l588m327J262J081q96M57K696K09l571k938J842N793K558
$$ y = [8421, 6333, -5951, -9662, 257, 9033, 7827, -3970, -12443, -4068, 11523, 9899, -6351, -10865, 616, 6712, 1648, -1859, -1897, -1780, -1788, 847, 3008, 3278, -777, -7013, -5370, 6664, 11158, -2133, -12987, -3683, 10201, 8282, -3583, -8320, -3528, 4908, 6847, -77, -5912, -1737, 3066, 150, -1425, 2859, 2686, -5856, -6015, 4532, 9071, 244, -8696, -6077, 4113, 9256, 2239, -8844, -7941, 5070, 9018, -179, -6617, -2010, 2002, 1254, 762, 1022, -185, -2268, -2292, 801, 4756, 3270, -4812, -8070, 1048, 10258, 3735, -7991, -7091, 3025, 6941, 1765, -4028, -4755, -108, 4161, 2349, -1655, -1379, 404, -1628, -1596, 3977, 4710, -3270, -7275, 221, 7617, 4435, -4499, -7186, -736, 6700, 5479, -3606, -6915, 11, 5448, 1860, -2467, -1205, -124, -1020, -563, 2133, 2342, -1229, -4167, -2325, 3468, 6026]
373F026o690p102M120R888N54r337m081M908N534m74l288k735Q35K835M71j186
389B78J18M93l249q25N361L580n424o145K121P217K024n076n806J278O420L052
405E417m660m869J904L780k78j500J170j51k829j05L265K550k594m485j061N285
421H39M966l259p362k08P128L480m683m334R84L019J409q03j765l10L94J25L9
438c41K069P26l844l012L792N129j479n869j673M221M577j093m874k382K994M205
454C146j007l339l33J133j21N71J827j67k891j677K283L446j40l490l353K152
470a960N243P57m861l464K824M081l95k805q45L57J357M41L9K7q34j410n02L014
488A064K400k880m376Q24N142J942m012l682J426L768J663k518k653r7K565J207
$$ y = [6026, -664, -7766, -3646, 6242, 6796, -2541, -6622, -1714, 3820, 3346, 58, -2677, -1842, 993, 1464, 278, 396, 889, -2360, -3185, 2176, 5756, 332, -5813, -3692, 3525, 5549, 473, -5333, -4055, 2365, 5417, 757, -4112, -2208, 1572, 1294, -206, 964, 813, -2016, -2121, 1144, 3694, 1100, -3385, -4446, 839, 5805, 2546, -4816, -5024, 2104, 5584, 901, -3433, -2449, 570, 1979, 1176, -589, -899, -505, -380, -341, 1728, 2454, -1390, -4402, -610, 4519, 3040, -2829, -4502, -281, 4296, 3203, -1671, -4053, -1059, 3146, 2139, -1200, -1533, -400, -521, 50, 1877, 1710, -1181, -2858, -575, 2871, 2731, -759, -4112, -1960, 3283, 4040, -821, -4285, -1461, 2620, 2225, -580, -1425, -1068, 289, 730, 769, 796, -38, -1448, -1950, 1064, 3464, 584, -3792, -2968, 2174, 4116, 104, -3578, -2152, 1616, 3279, 761, -1892, -1989, 576, 1783]
504A783j327o76j58p97J64J704J639j968k343j7K728J730q10l438j242L382K778
521C132j635l260j80J980Q75Mk27j055j075N30J319J247q12k175j203K550L156
538C171j158l948j161L736J797j053k445r01J202K158K0j915o75Q53L25N1M27
555D84M78j129j620Q43K394O81k102k680Q27L980P42l509j711J160K392J54j228
572A56j077j89Q00J301L66j267j200r9J301R24M44j618j414N10K028Q52j441k065
590a688O1K114J269j310j479l5J085Q45k34m95l16l04k36J101J292r52k144m98
608a924K276J899j482k239p4J467J749o66j915n18J246J033J10p74p35k82L86
625d43J240J10j086m55L22M51O61K64j153j601R94J832L82k093p79J038J116J42
$$ y = [1783, 456, -220, -378, -1175, -1011, 693, 2332, 364, -1979, -1996, 732, 2462, 1652, -1786, -3028, 354, 3132, 1497, -1763, -1943, 37, 912, 916, 689, -366, -1441, -911, 408, 1655, 843, -1332, -2535, 15, 3171, 2013, -1935, -3096, 640, 2437, 1384, -1061, -1962, -760, 1398, 1418, -497, -1172, -319, 6, 57, 484, 962, -167, -1787, -944, 1450, 2131, 29, -2651, -1824, 2156, 2898, -611, -2322, -1162, 1230, 1384, 156, -921, -1110, -310, 991, 1357, 90, -1110, -1209, 92, 1016, 1460, -158, -1572, -1062, 966, 1818, 377, -1688, -1627, 487, 1756, 446, -1033, -1068, 17, 862, 628, 133, -183, -487, -723, 378, 1670, 718, -1426, -1924, 352, 2251, 769, -1470, -1544, -77, 1672, 1006, -909, -1427, -181, 852, 962, 188, -547, -829, -443, 797, 907, -179, -634, -312, 139, 800, 1064, -89, -1690, -696, 1136, 1518, -575, -1354, -316, 800, 942]
643I42q56m19n42M59N75N83k45j465m13J710J290n96j966l23J020J071M20j369
661a24j323O85J588N80j173q96L02M86K38j70N3n41l47L26P82L48k82j317l58
680a143J331J740j607j266l93J304J345o16j347k54N81R62J88p20n70k69Q06P61
698H33o24o43k19M01N02L14l47o77r3M77O97O3p02o16K71R52J66m25p96l9K12
719b93O09P58q91r45j65J214P28o98j148J26N57O91j40m05r68M56J016J11m80
738A33m92j46L55N91M7j93p04p9N20N30j04n69m40J79O98M08p82o45R1O08O69
759F75L3j343l6P13L66K88m44p59j76P94P89o30j030M83J84M29L50m53p07Q5M68
780G9M78N5q17l12J64R56J7p43j79k64O83K74J33o84n67K01O55O44o04p26K23
$$ y = [942, 86, -333, -875, -416, 159, 742, 497, -968, -1381, 329, 1619, 1023, -943, -1266, -246, 825, 1245, -124, -1447, -762, 826, 1406, 233, -663, -361, 125, 363, 193, 246, -295, -642, -316, 466, 814, 532, -785, -1143, 188, 1928, 321, -945, -1338, -34, 1311, 695, -652, -906, -325, 637, 825, 105, -465, -734, 72, 833, 209, -434, -653, -252, 250, 564, 217, -460, -553, -76, 621, 684, -18, -634, -363, 589, 755, 330, -466, -505, -293, 316, 1074, 183, -762, -927, 287, 1015, 317, -831, -705, -148, 543, 403, -2, -970, -514, 502, 613, 133, -359, -505, -150, 441, 488, 295, -409, -488, 32, 562, 458, -111, -551, -372, 326, 734, -48, -693, -602, 6, 675, 708, -635, -671, 42, 408, 696, 252, -507, -683, 111, 900, 270, -760, -277, -93, 336, 686, 233, -474, -389, 79, 557, 612, -205, -517, -353, 603, 620, -123, -302, -566, 117, 391, 524, -160, -727, -526, 129, 773, 169, -557, -334]
801c34L22K84O4j80o61L83K60J90k15k95l99L21N70j9l12o05K34M60N27l70n12
822b87m34O73L80J16l82o54L2R30L08o82m63j63P00K78n4n79j30o8M59M30k96
843A14m78j60J99M45J59k22m15j30P77K24J8q18j93J21R36k23k85n07K07N25J37
864D31j69l59k21J39M85j81l56l20L06M37K83k49m18N1J29J75K33l86k5k10J57
885f8M81k44j67m71L36J23L33j17m41j79L25L53k20j11l72K44K68L13m63k78L03
906e2KL56J49l19o68J32N83J50l7k94l02N59Q6n6l06l86Q5L90K50j40n80R5J07
929a96L99K4l53Qj11J93K73k61k15L3R9M68N1l59l47L5M95K92k89k51m39M03K46
952A98J31m66K6j88K97O2N4k51k13O0N79N8J9q43Q7N86M5J0k08l45J90K67j16
$$ y = [-334, -12, 272, 336, 156, -505, -122, 138, 328, 113, -182, -581, -260, 310, 291, -21, -626, -392, 68, 595, 225, -287, -721, -48, 332, 448, 66, -588, -556, 374, 682, 0, -463, -626, 74, 352, 298, -281, -411, -479, -20, 410, 114, -364, -524, -325, 120, 279, 57, -358, -488, 289, 513, 531, -287, -480, -359, 577, 354, 69, -438, -231, 294, 431, 262, -97, -318, -179, 306, 125, -231, -551, -245, 192, 475, 226, -192, -141, -12, 163, 396, 10, -15, -225, -68, 413, 169, 2, -469, -133, -10, 323, 206, -235, -414, -89, 264, 44, -67, -439, -195, 73, 386, -77, -355, -52, -50, 306, 455, 136, -532, -400, 183, 333, 296, 2, -300, 259, 345, 289, -17, -403, -318, 72, 322, 182, -398, -303, -196, 203, 227, -126, -118, -229, -36, 237, -24, -239, -206, -107, 361, 412, 53, -294, -259, 236, 528, 239, -12, -451, -48, 198, 329, -137, -111, -299, -2, 60, 114, -137, -350, -290, 289, 347, 366, -477, -390, 196, 241, 251, 43, -302, -112, 155, 39]
975C9l24N1p7J67M08j30j18j37r7L13K34o0l85j67J18N00J31n81j13Q2M77k33
997I8K7l60J27J55K54j71k49l24M38L5Q5N8l80NM8L94M6m25j79J44J54L38l92
1020g4m6O3L98l18J59k19oM1J98Q7O9m76j48N8N60k36j8j6l3n0J47Nj11l84L11
1045c9K71k31K5j74p0l0P00m46L4k51pK93J77k42k12k4L18K65j93m53R4L19P7
1068B01r2l57L12j74J64K47j53J7r7j42L36j06q3n01K21K79K23k56r5n10M38K48
1090A20o4M8l65K58o4Q5p6l5K66m48J60L85j55ol95L28K48j32m23L62j20L3K85
1113B95m73q2J50M40k11j9J04l59j25N13j74K7j63rN7O3K63m35L1j81N09k83j55
1136b17N4J17M4n6l8K1J15k31K00J04R6q5k81M3L61J01l07j21l0J46J44j76j60
$$ y = [39, -285, -234, -311, -144, 264, 134, 16, -121, -218, 95, 329, 269, -116, -283, -165, 335, 466, -115, -228, -146, 331, 98, 125, -235, -108, 47, 301, 130, -119, -443, -5, 30, 115, 173, -207, -202, -154, 240, 286, -139, -318, -174, -20, 318, -74, -120, -57, 341, 23, 182, -37, -43, -2, 196, 283, 352, -124, -272, -214, 346, 110, 92, 76, 43, -7, 140, 145, 34, -350, -39, 232, 1, 26, -148, -218, -248, 452, 6, 40, -211, -218, 75, 252, 10, -202, -226, 92, 357, 164, -289, -195, 124, 201, 109, -248, 64, -110, 54, 301, 148, 165, 68, -74, 262, 156, 73, -428, -207, 72, 295, 39, -56, -566, -128, 120, 56, 104, -261, -3, -67, 18, -58, -93, 173, -275, -115, 270, 115, 109, -286, 42, 290, 158, -265, 97, -23, 10, 295, -178, -260, -110, 330, 119, 100, 204, -155, -280, 233, 59, 86, -77, -86, -29, 34, 297, -138, -107, -288, 221, -62, -217, -163, -46, -2, -58, -96, -75, 40, -191, 9, 113, 209, 124, -157, -114, 247, 348, 41, -80, -110, 36, 180, 4, -156]
1159a56Q4O8J09j67O0Mo6J91k56J4J3O4j58J26K89J3l90k31M25M9j95k3j38J92
1183g9N4P1J25k94L6N2N7l6J17l76O7N84j00m62j05M12k01j1K28l19l2K39mo6
1207d3j47J44L8M9J05k60k3K11o4l55N29r5k20KnK88P0j77n4j85K48K71k58j34
1231f5k9L33l42j38J25J08n4J61q3k17K19r4j72N21m0m5m33K67Q2Oj47n6R9R7
1255A03q1r7j17K03L06m61P1n0K51l12K88L60m24l8k17PL57l4j2k56L7P7lL13
1279B71o8k01K0K0L7m27L34j19m5J45L2r5O9j04J50n0K1k78J98j69O61l82o6L3
1303a3l2Q5r9J24p0r3O3K57k18J66j01k24K32k33M79j86J2M4l10L34k35J47l31
1326b02K09J23o0J78j10n5j76J58J48k96m6k80M56k4L6q6Qk5L76m99J20J81j86
$$ y = [-156, -72, -4, 105, -62, -2, 2, -64, 127, -129, -115, -102, -38, -196, -70, 219, 232, -158, -389, 36, 85, -110, -133, -271, -79, -25, 46, 171, -123, -87, -35, 22, -14, 103, -273, -206, 378, 278, -184, -289, 123, -78, -89, 139, -180, -212, 27, 23, -43, -190, -46, -8, 41, 146, -114, -137, 74, 10, -345, 184, 89, -131, -129, -134, 154, 224, 47, -7, -192, 56, 327, 69, -65, -94, 239, -103, -241, -116, -8, -62, 99, 16, -201, 18, -76, -248, 273, 233, 188, -245, 22, 104, 110, -37, -93, 6, 103, 22, -75, -192, 11, 317, -144, -73, -123, 128, -184, 104, 464, 40, 2, -215, -208, 149, 115, 103, -153, -116, -39, -42, 271, 203, 2, 22, 42, 79, -348, -14, -133, -178, -33, -1, -96, -27, -131, 19, -31, -10, -288, -90, -259, 402, 20, -46, -13, -45, 40, -59, 65, -5, -98, -35, 222, 4, 170, 69, -155, 77, -156, 323, 137, 149, 193, -117, 217, -18, 129, -202, 7, 130, 70, 248, 138, 83, -93, 65, 213, -83, -129, -409, 47, 23, 59, -27, -19, -44, 332, -167, -47, 134, -52]
1349e2N9K00m15k86M40J51J0k28L28l63j33N12j31j00N8l91M11O0j7l5m16K27
1371a11J12j56J67j51R3J91j91J34J25j30p4j5l6j48J98RL6kl2P6n00O67k21N8
1395I9r1j35K29j37j88L81n3R9m35J02l9L28l93K17J48N2j98j13j0L0J04J65j56
1418FP1k6p6j96K17O4k77K50O8p8L54k28l69L68k17J81k26J11l47K43K36M8j22
1441E5J4P1j67q9jJ65J68l22m8L90r3l06N7K28q2j31k85L12K44j66R6j87R0k31
1465b18L20r0j3k32J10K13J7l9n7m9j06K63j49j8jK25q2R8j97N1J23j33j76K96
1489A56o0j34m2l32L54J94n01J47QK99P8l02J05K35m54K53K97l62j8N5m8j80J59
1512i3J22M3k84N5l9J80rJ68k23O1k21K91j5r7r3L45k28K47j53k59K51R5M1L5
$$ y = [-52, 7, 207, -208, -494, -54, 97, 107, -121, 207, -156, -289, 223, 92, -8, 50, -341, 70, 130, 113, 78, -338, -111, 1, -155, 12, -139, -46, 145, -46, 88, 213, 83, 9, -6, -42, -190, 8, 17, 53, 51, 19, 95, -405, 262, 41, 99, 8, -127, 102, -35, -223, 158, 105, 204, -231, -129, -168, 160, -233, -16, 132, 184, -14, -127, -137, -107, -3, 162, 6, 77, 51, -25, -221, -4, 60, -217, 33, 101, 23, 377, 149, -220, 148, -69, 112, -114, -3, -350, -107, 129, 177, 55, 69, 140, -27, -116, -117, 48, 216, -106, -154, 236, 143, -163, -106, 122, 40, -91, -376, -64, 180, 14, 110, -77, 13, -218, 102, 12, -1, -233, -123, 90, 107, 68, 11, -38, -144, 119, -30, -48, -49, 176, 94, 192, -5, 46, 169, 36, -140, 156, 96, -38, -80, -412, -58, 136, -365, -218, -210, 89, 167, -135, -30, 205, -249, 4, 301, -61, -79, -24, -72, -252, -93, 29, 72, -212, -157, -196, -16, -25, 143, -80, -19, -240, 51, 36, -61, -154, 191, -37, 210, 57, -202, 49, 144, 185, 220]
1536B20o6j49N5N0j32j27M11j98j89J83l0l22M14r8J08k18M7k55K52K25k0m61
1558c00L39K59j47k52P5j23J78k19M47j24k08R7K21j28r6k03R1L52m23N3J59j08
1580f0J01k52K98l0j66K89J78k82J75j1n09M23l5q7R2r7k12K54Nm24L38j61K76
1603A03k11K05r7j06O8Q3J21k66K91j01j85J92k71N96m83k7r8L93q2M1m0j65K72
1626B33k44J19k64J05J82k49j08K56J57J12j25k6j51K54m43J6L86k1l70l6J17
1647a00N64l82l25K80k54L58L1l32L02O5M9l37K08m21M64K37n17L46k95P7p6J73
1669A15q7L4j49R4M2n3M22l66l37J98k7M70l57K39k8j68J66k59k54M40j50P9j3
1692E1J91j12r6o7j64M61l80j28K46L9q3J81j98j28K13K5R3k19K15M5P2k79J6
$$ y = [220, 154, 5, 60, 110, -22, -149, 262, 64, -125, 58, 28, -294, 120, 22, 130, -88, -41, -296, -44, 181, 161, -300, 39, 298, 151, -101, -26, -149, 29, -190, 257, 133, -75, 22, 243, 115, 19, -184, -93, 259, -164, -111, 48, -60, 41, -211, 87, 57, -109, 180, 358, 76, 251, 240, -269, 154, 119, 32, 124, 27, -185, 69, 74, -350, -12, -173, 103, -108, 97, 0, -106, -38, 45, 166, -100, 191, 90, -95, 97, -174, 422, -61, -88, -186, 207, 125, 166, 126, -39, 233, -11, 108, -156, -51, 131, -118, -226, 30, 187, 299, 174, 148, -3, 251, -192, -176, 210, 189, -181, -217, -100, 464, 82, -243, 37, -217, 141, 172, -160, 142, 207, 256, -81, 127, -294, 170, 407, -110, 236, -59, 18, -58, 115, 28, 62, -87, 7, 49, -4, 418, 52, -285, -87, -114, 356, -1, 238, 210, 42, 208, -51, -305, 135, -15, 64, 51, 242, 130, 34, -33, -197, 264, -116, -244, 2, 41, -42, 139, -59, -187, 26, 51, 144, -75, 140, 185, 257, -22, -6]
1715fL35o14L13j22J66j40k56K85j67L01k87L78j70J0K01l70J64J39k25K79l27
1736a13Q7L1K8rP4P1r9n9k25L0J80J76k53K12l78L51k4l24K17P6j00n7K02m2K8
1761H0K3k95M0K80j65j43J06o1M26k17k77K62r5O6j65K30K16m27L2j70M51k10
1783a3j19J63L4K25l94J50j37nK65L2l02j18K57j77J15k22K97R8k15R7j52K46
1805A25q0P1l38L79k17o4N1k41J64L37m3j56K89m23Jn6M12j31j1Q6J5j82k5K6
1829a1j70k2K01L10l93O8K8L47n79mj15L98o8n6L4k1K72k96j18K11M43m84o7r7
1853a89J81M1J82n09N47j02l6m6j95K09K0j45k4l86N82O9k02k85N17j13M6l38
1875a76L9K61j78q6j08K34Q9n0k37K81J28p2j49j29L31L83n23r4k41K66K06o70
$$ y = [-6, 329, -285, 28, -94, 72, -68, -324, -39, -206, 95, -192, 186, 16, 26, 227, -143, 21, 160, -65, 214, -113, -26, 5, 33, 24, 98, 169, 70, 11, -214, -184, -4, 172, -81, 131, -247, 104, 80, -244, -27, 49, -51, -108, 94, 52, 80, 103, -192, -152, 128, -37, -180, -74, -135, 291, 74, -203, 59, -36, 30, -135, 95, 311, -116, -84, -254, 197, -13, -132, 31, 65, 290, -104, 46, -91, -96, 169, 201, -101, -219, 38, -139, -24, -246, 51, 149, -66, 31, -121, 125, 45, 116, -222, 157, -60, -124, -73, -314, -150, 187, 144, -12, 277, -146, -145, -201, 211, 80, 69, 155, 170, -12, -37, -11, -181, -203, -2, 308, -85, -17, 11, 358, -221, -225, -340, 58, -10, -66, -32, -53, 219, -77, -195, 16, 459, -25, -92, -189, -8, 33, 215, -294, 253, 151, 115, 69, -126, 83, 103, -42, -66, -452, 130, 199, -3, -288, 229, 116, 162, -176, -137, 124, -54, -140, -248, -14, 75, 25, -212, 69, 197, 125, -24, -153, 178, 561, 38, -56, -297, -31, 175, -495]
1897d95K14J39K81r1q3j21M45j74l98n8L25M18k94l93L52Q6n1l01M9L43j53j15
1919g5O0K1K59l90p6j98O40n1k74Q1j83M03k58k82m9L06J65j95k35K88L89l81
1941c5l80M33R1K17l44j7K06k58j14k19N85J21k21q9l81L69K49o3r9m67M44J90
1963B18m85J02J22J81j82m57K22L96K3m96K46K61m9N3k95K27J2O7k49j40K87k9
1985C5j25m1J08J19k39J10J05J09j7k95N3J54k43J09L2j83K60j54M8j72M37k5
2007A85k11J3p0M11L4l83L9k69N41j33j22j62K76k44m9J8J32L39l22k53K67j79
2029a42K65j43j50L4J21j44p1J4L67J06k88J89j08J90j37n4k40J96r1R3j47J75
2051C5k5k65J16P4L54k63k26J5M15m2l30o7K09J86l10j14J06R9M8J47l26K72r
$$ y = [-495, -281, -142, 139, 48, -35, -156, 289, 115, -283, -341, -16, 402, 108, -285, 67, 153, 102, -199, -150, 193, 40, -75, -15, 6, 265, -125, -201, -399, 241, 190, -84, -3, -186, 217, -41, -323, -372, -66, 99, -96, -331, -43, 346, -35, -415, 18, 109, 326, -18, -35, 171, -87, -201, -420, 165, 286, 65, -24, -405, -36, 213, 150, 51, -416, 28, 218, -267, -165, -43, 138, -44, -501, -279, 117, 140, -356, -110, 151, 102, 155, -140, 87, 99, 166, -83, -223, 64, 35, -90, -131, -23, 96, -143, -33, 72, 181, 164, -131, -78, 76, -167, -58, -26, -209, 51, -103, -55, -227, 210, 185, -26, -13, -83, 328, 362, -21, 18, -251, 290, 157, 35, -127, 149, -95, -144, -126, 6, 345, 23, -230, 37, -142, 123, -20, -170, -136, -15, -159, -230, -216, 151, 257, -31, 158, 50, 240, 103, 49, -191, 5, -86, 7, -140, 35, 10, -255, -139, -65, 289, 26, -200, -185, 230, 188, -142, -209, 0, 186, -124, -238, -132, -33, 15, 162, -164, 108, 99]
2074I9kl64Q2L61Qk23K04l7lJ97m44j00N56j60m48j10L56M03m36n9j04N95k79
2097I2m32o3K45M91l95K9k88N64O0m42O1L80l8l86R3j60L14q2o1J9Q5L38m77M2
2121a1j49M98kk54k57P4M10l29k95L43K03O1m67L4L8N66k73j94m3O23n98p7MK87
2145A92O2j91m81L03K17p7j36k2J02J78k59k12J83M82m60l35J99L33J07mj37m8
2167dM05n48P2p4O23l14N1k20r8K75n3m09K7N96J48l04k27K27j79Q1mN7l3M56
2191E51q09K11J26k8Q2n5j2r1L96m73j99L59K89n3m46r1K33L2J06l63J41L32p
2214B31m74j9N30j98o3j52J01L29k4l24p5j19J98m44M13J6L50m56pO9K08J9m6
2237F3p4Q7K40j20n55J2O45q4j60j82K04o3J04m17M03j90L31l38k7M2K47j41j78
$$ y = [99, 97, -267, -185, 176, 184, -39, 165, 128, 125, 322, -122, -222, 334, 174, -274, -384, -28, 375, -61, -120, -224, 371, 92, -340, -403, -158, 333, -62, -33, -321, 243, 303, -139, -78, 302, 264, -122, -29, -189, 125, 43, -18, 1, 86, 424, -53, -11, -160, 338, 336, 82, -175, -101, 309, -20, -315, 28, 231, 292, -175, -141, -103, 463, 190, -4, -47, 576, -22, -99, -95, 192, 254, 63, -418, -115, 102, 25, -111, -133, -31, 147, -112, -324, -141, 341, -119, -454, -255, 78, 185, 181, 44, -4, 401, -147, -75, -149, 474, 160, 211, -9, -107, 168, 115, -294, -267, 329, 477, 173, -54, 173, -6, 75, 71, 128, 95, 551, -258, -47, 79, 51, 133, 78, 66, -25, 371, -102, -301, 58, 347, 294, -152, -243, -10, 22, 128, -235, -94, 238, 231, -243, -262, 268, 70, 7, -145, -44, 285, 261, -63, -138, -257, -59, -503, -90, -74, 276, -180, -187, -118, 90, 109, 63, -11, 76, 316, 196, -359, -347, 298, 214, 54, -128, 76, 13, 117, -300, 103, -87, 244, -94, -121, -79, 168, 27, -151]
2260a51N0j06L53l26J29R5K33n24L02J16J60k89q6j03L2N88m13l85K65L03j23
2281A20n50K42J84J21Q0l56N3K63j00l61r5O41j37l06K06J15N4l09K04k30K4M30
2303B93m58J64M7J33j23l52L17J81l09k5K47o5r8j8o1j02N05k34l50nN19K86k99
2326A93k56K11K9l34K31j40l7L15m98K04L7M15l94M8j71J36nq8R7J28l06K51j74
2349a08j4J31j69L8j74K57K16k06l92K50K31j36J22m14L89J03k89K99k49L79j94
2370G0k57L50k27K22l5l16K90j41J38k01n1N2N1P2j49J06R1Q1j40j04kK42o4m37
2394c59K05M34j18J0k51O1K07j62J9P1J30l19K76n76L12j33K13k40K04L06o3k17
2416A0p6K01J19k11l15K01K27m40K89j16o9K25k80J84J4Q7j06P4J71l29K75q6
$$ y = [-151, -101, -207, 146, -180, -51, 44, 277, -247, 55, 171, 331, 42, -44, -147, -115, 473, 60, -325, -60, 243, 120, -430, -188, -4, 117, 197, -159, -106, 157, 57, -304, -399, 242, 105, -201, 5, 120, 174, -135, 69, -161, -137, 293, -165, -1, 46, 179, 56, -296, 21, 202, -107, -132, 115, 50, -48, -66, -127, -229, 276, 42, -308, -313, 206, 492, 193, -63, 148, 177, -157, 74, -66, -103, 212, -286, -82, -45, 370, -24, 24, -147, -11, -16, -104, -7, 121, -185, 66, -108, -122, 9, -160, -122, -296, -39, 177, -29, -421, -171, 60, -76, 46, -368, 21, 124, -165, 134, -115, 264, 70, -187, 163, -64, 158, 123, -193, 97, -44, 94, -107, -158, -106, -55, 17, -132, -26, 65, 146, 6, -98, -100, 142, 78, -359, -154, 280, 162, 172, -79, -18, 189, 27, 46, 117, 247, -72, 204, -372, -60, -193, 20, -220, -16, 290, 227, 10, -66, 135, 254, 43, -272, -71, 156, -284, 5, -111, -180, 45, -235, -51, -37, 50, -56, 18, 189, -140, 135, 49]
2438D9k07m0L34j16j70J75L7K6j4J4j77l2L02l01o5K12J1k10K49P6r2Q1r7K75
2462C20j01k41j87K8Q3J13o3L5j23R3Q8k46K09L1N2o1j44JO8j48K94k49J56Q5
2486I3q4j10K5P7p7J85l02K26J60J1k85L5j32K03k26J99J10N9k47R7n0K27j87
2509Gl6M4l8J42j37l1n6K47k2l1j75j31J26k9J6J52k9L2J48m04J80J01k25J8m8
2534a79J67L24k79k0L0J66k60R1j03K60j3m47M09o6j87k16l0M80K7j97p1q1J52
2557d3L63l39P7l86M17j55N3J20J14k37q5p7J90j46K88j04m4K9j13j96r4L34j03
2580a37K55R0j26J11r5l10J46K34Q8r1k09O1J8j29J69P7l4j4l7j99P2K13J8m69
2604b98M1L12k36K1P5J99J96j72j50l3R4M5k27J87j3K65m1l76N2%J02J9k30L07
$$ y = [49, -158, -198, 136, 20, -150, 25, 62, 88, 74, 88, -89, -121, 181, -120, -185, 27, 38, -172, 77, 153, 61, 142, 45, 320, 219, -22, -209, -181, -98, 15, -48, -13, -136, -43, 45, -201, 8, 39, 91, 30, -114, -113, -45, -193, 101, -148, 8, 93, 9, -101, -76, 1, -76, 109, -193, 33, 193, 204, -81, -46, -178, 25, -201, -2, 108, 167, -80, 17, -33, 194, 7, -29, 15, -23, 119, -18, -49, -105, 142, 120, 89, -86, -217, -91, -120, -104, 48, 19, 51, 199, -205, -25, 76, -149, -131, -179, -12, 312, 33, 13, 43, 209, -51, 40, -63, 197, 184, -263, 146, 80, -107, -323, -353, 127, 154, -43, -114, -195, -43, 320, -19, 58, -328, 89, -66, -13, 107, 221, -16, -101, -178, 12, -134, 154, 50, 6, 35, -78, -274, -368, -34, -137, 118, 208, 82, 193, 98, -212, -66, 168, 256, 165, -44, 17, 35, -94, 75, 152, 118, 104, 67, -132, -60, 153, 171, -298, -257, 55, -181, -160, -85, 114, 310, 138, -12, -45, 49, 94, -133, 54, 41, 306, 265, -111, -59, -59, 43, 62, -168, 139]
2628A39J43k80J22j83J13j5K9k19L05j77J62k80L5j69K10l7j6J02J06j24j51K52
2650F7O0N0k18k7M3l4K01J40m41N1L28j92K0k3K00l29J77k46K96l8k39L52L7j20
2674A15k13rK42K3p1Q3k32rK56l09L4J3P8J72k82J28j01L93m24O3p6L31J37l42
2698@J85q5k28L15j34l32K86n8K9l69M84m15L55k21N8K11p9j70J01J84r5k15R7
2721i6o2N1p5M68l74lK63k17N45l54m9n1J0l00L64m03L99k14R1j48J11j82M22
2744A96m09L46k68L2J78L1j83J76j15k64K06j99R8M1q0O7M23l44J73k78L79j56
2766E0K4k7J35Q0j17Qk67O5k24M26l5j67q7q1M79k52J51j65L2J5o2J67jO9l35
2791a19J57j41J57q9K98l11O2J73l4P3l46Q9j32mJ89M1K5k3N4L3q1j96N9Q5m0
$$ y = [139, 282, 2, 124, -59, 54, 39, 68, -151, 154, -23, 139, -141, -106, -275, -65, -102, -118, -16, 90, -34, -185, 67, 127, 177, -41, -68, -25, -59, 142, 282, -159, -108, 220, 28, 48, 25, 225, -104, 73, -173, 123, 85, -154, 198, 235, 115, -98, -107, 135, 158, 87, 170, -62, -71, 185, -124, -90, -77, 1, 173, -109, 19, -82, 311, -113, -50, -126, 205, 342, 0, 185, 100, -128, 187, 53, -279, 7, -51, -22, -391, 93, -322, 33, -188, -130, 81, 2, -168, -67, 117, 22, -193, -96, -158, -107, -182, 286, -88, -91, 172, -45, 500, 146, 97, 46, 56, -244, 120, -283, 116, -98, -7, -155, -44, -226, 196, -213, 133, -135, -103, 75, 106, -77, 99, -16, -280, -74, -273, -175, -134, -214, -147, 276, -68, 105, -173, 206, 50, 74, 47, 182, 262, 145, 153, -114, -49, -273, 153, 118, -49, -136, -217, 262, 10, 161, -4, 28, 43, -19, 148, 147, 216, -119, 38, -103, 54, -35, 263, -48, 14, 187, 153, 226, -120, -31, -163, -167, 22, 63, 88, 65, 119, 152, 71, -125, -66, 19, -21]
2816b1M8K3r7k27K85k9P2r7k0N5O4l79K29Q4j40J57j06J04l9j00J16l6J28j92
2840a18J18r4J35j23J92o7k68M61m16oJ3r5M04m0r6k58J79P5M1k40K38k40J04
2863a01K01K3k41K11l04L51n2r3k32K67j36K09J0O2k37L0J48j66k0O6L12m40r5
2886b27K92K5j5j35J40J3j50J26r6j16K54j86J15O9j71J71j31J60j34L12m43M60
2908C33k77m9R2l53M13l54M51k17L6j72M8K74m64J60J81j52Q6j77l5OM2J86l3
2931B5o7J08J48j49L2j62M02k90M3j33J65k24J03n4KJ98k60l0m8J73q4j54R5Q9
2955g2J77N5p8n9P4k17K0j0O6J29k28P3j22n0J68O7K93l63J29j66L02j60k15K23
2979C6p6L27k64j4K39p0n1j03j32nK64o9J57j89j24J77Q5l80PL08n48K20J09K0
$$ y = [-21, 27, 50, -47, -274, 11, -18, 54, -43, -63, -8, 56, -323, -94, -10, -150, 7, -99, 5, -34, -134, -18, -54, 74, -118, 0, -94, 41, -82, 110, 43, -225, 236, -180, -186, -173, -268, 136, 96, 0, -258, -79, -4, 37, -203, 35, -205, -101, 100, 123, -118, 93, -211, 140, 88, -5, -237, 30, -106, 103, 113, 175, -62, -32, 116, -50, -70, -4, 308, -132, -227, 65, 90, 75, -60, 80, 93, -57, 69, -27, -143, 111, -75, 40, 109, -62, 109, -22, 138, 4, 316, -127, 333, 56, 7, 99, -254, 159, -195, 256, 39, 75, -97, -49, 225, -239, -79, 102, -50, 36, -141, -176, -170, -128, 58, 25, -42, 66, 214, 65, 97, -65, 337, 47, 90, -43, 122, -102, 1, -53, -51, 147, -113, -143, -191, -18, -102, -256, -161, -72, 105, 160, 82, 23, 97, -120, -100, -110, -44, 85, -143, -70, -192, -242, -74, -7, 286, -77, 52, -114, 188, 28, -187, 36, -40, 287, 23, 9, 248, 178, 127, 24, -108, -113, 151, 82, 239, 50, -74, 103, 188, -192, -185, 123, -425, -205, -96, -76]
3003g6J12O6j77o7J37j13K3J8Q3K53k88j43N2l9N2O0Q1j88Q1K0M3m01L97J30q2
3028C4J12rk39q9K50M9j27J12O0j68M3j77J75N2k83K79m7Q8j25j10K10N9k06K7
3052c0j66j15L86k9j59r8J51O4k24L33j38J26J10k40J05J36m59N6J79j51J64k2
3074b1K95o9k77J66l00J73j96R3P1r1J76K97l29l00J81K36j18J11j48r5j1J78
3096B2J4J9k3j27J59J32l07K71j33K58O0k18Qj10j59j39K55R0k54K09M8k32K00
3119D3k17J90K61l77K08k79K31q2M6J45j81N3j75JJ04J3jl11K04K03L43m78j05
3142a61P3K31j05Q3m04M48j26N9K03k83j8R0m12N62k00m1j1n8oJ05P4k13J49J1
3166E0j80J26J60j73J26m91N00Nk31J99k07j02L93k62k07M66k39J89j09j16j69
$$ y = [-76, 36, 102, -75, -142, -5, -118, -95, -77, 6, 259, -29, -172, -120, -159, -107, -47, 34, -154, -73, -53, -10, -411, -14, 116, 34, 146, 137, -102, -191, 59, 108, -19, 93, 153, -15, 28, -149, 26, 78, -205, 74, 27, 115, -10, -120, 90, 149, -57, -30, -196, -311, 75, 46, -113, -211, -60, 4, -220, 113, -25, 101, 211, -29, 76, 212, -247, -191, -12, -163, 1, -21, 274, 205, -72, 94, -206, -33, -229, -136, -65, -156, 20, 317, -12, -312, -131, 105, -13, 98, -50, -145, -156, 22, 36, 55, 32, -95, 64, 196, -111, 160, 27, 285, 345, 127, 135, 25, -134, -273, -18, 72, -182, 27, 75, -157, 43, -174, 16, 277, -100, 108, -171, 60, -22, 24, 169, -12, 41, -134, -133, -29, -16, -17, -328, -124, 79, 422, -56, -161, -88, 143, 38, 121, -283, 165, 39, 98, 301, 18, 0, 90, -322, 240, 40, -1, -12, -70, -76, 29, 103, -110, 39, 50, -130, -4, 156, -17, 109, -382, 118, 123, -108, 91, -116, -218, 175, -87, -294, 172, -67, 122, 13, -103, -272]
3187b72L43J26j85k38K32Nj14L70j77k24K98l0m4K1j93K26m7L2n8k33J4J04J25
3210H1O3k71J94j45J45j80K43j12q5k06K02k7J40l2k32M4J76j07O7M28k58k74
3232a46O4P8j45J13K10k49j69L00k96K20J13r0jR7k1J21j69N2l41J35K74j50O1
3255F1q5RJ39k54K6j13J16Rl2j1K28r2m1j55J40K9J10j27j39K17R8j68j58L67
3279A74l68M76k23J11l12J95J00k29%N0m2L3J40n7j15K87l99K36j43JK02k9J62
3302B50j09q4j43L69m17K46j99p7M99m98J45K49m65J96oQ8k99L10J11O4j24M1
3324A47j07J06p2m69M01j60K12k1r3M4j91j94N29kl25L15j41k6J72l37J92p9K5
3347g4L7o7P2J38l00K50j48m2L15l16j28O2M37n60J62j80M79p0jQ0j46P5J07k30
$$ y = [-272, 71, 197, 12, -226, 6, 11, -103, 267, 90, -134, 164, 134, 90, 111, -82, 144, 97, 129, 71, -162, -148, -44, 81, 144, -127, 67, -78, 67, -113, 130, 18, -67, -273, -71, -98, 42, 10, -222, -178, -2, -109, -42, 386, 128, -146, -82, -4, -149, -36, 174, -75, -244, 56, -240, -20, 93, 3, 2, 99, 78, 199, 30, 82, -259, -124, 150, 0, 61, -24, -15, 124, -130, -104, -217, -101, -92, -124, -135, 93, 1, -40, -195, -55, -26, 84, -43, -182, 35, 133, -35, -193, 174, -194, 282, 59, 170, -142, 53, 153, -76, -76, -26, -68, -35, 105, 48, -67, 220, -179, 57, -86, -85, 117, 88, 250, 141, 57, -86, 283, -134, 112, -87, -164, 335, -163, -18, 231, -234, -38, -44, 44, -255, 55, 166, 230, 106, 147, 40, 146, 74, -395, 6, -154, 58, 37, -56, -12, -203, -397, 132, 130, -195, 120, -21, -47, 125, -212, -20, -99, -74, -37, -104, -32, 106, -194, 56, -92, -134, 181, -135, -263, -201, 236, -324, -162, -342, 137, 67, 66, 146, 0, 75, 182, -48]
3371d8l2J05k32K35k6J37k28R9J66j19j11Pj35O4J30j05L38m55R2J74J5R7l38
3394a70M39k45j43j93M81j73r4M79m27M34o84M02k47q9L05R8J04m04K56k20k63
3415c54N55n1j97n8J47j90K30r3J76J73k65K07o07L89q7P6Mk7J30k03r4l7K26
3438E0j00K93j54k44L0%P8Jj07J25K36k07k60N28l72O5j10k41M56N2p9j42j39
3461b41J79R4J00J11l43J47Lj79OP7o4K35J4q4J23l03Q4Q6j64J74L5j6j51K79
3485B02j23k52l1L07k27O1m0N50k86k10K90j75j7k27J55j12K91R6j73j41l8j32
3507b32K67K6l02J70L2M8k6j77q6K39mM5J3J18l33J40K02l4o6J16k45M5j32K31
3531E5k06J2M0j50K86m8J47rm54M1L39p0k29M4K12j0o1K73k80jK4J01q9k13M5
$$ y = [-48, -80, 25, -207, 28, 2, 139, -89, 10, 176, 57, -54, -47, -182, -118, 12, -93, 245, -210, -118, 56, 71, 168, -170, 269, 24, -119, -312, 169, -4, -98, 381, -46, 388, -296, 106, -141, -230, 75, 173, 277, -127, 129, -91, -354, 201, 150, -47, -105, 42, -148, 82, -11, 165, 338, 73, 280, -327, 62, -25, 51, 55, 28, 158, -45, -139, -176, 50, -50, 243, 89, -155, -125, -125, -47, -46, -153, -28, 208, 1, -259, 269, -103, -38, -148, -389, 67, 119, 40, -102, -241, -62, 32, 132, 243, -100, 47, 50, -129, -123, -46, -110, 125, 139, 55, 178, -125, -41, 45, -119, 55, 90, 74, -77, 202, 79, -173, -204, 103, -124, -63, -103, 447, 161, -49, 241, 66, 49, -178, -23, -135, 156, 252, 79, -62, -100, -232, 35, 61, -241, -71, -39, 9, -17, -194, -280, -41, -45, 0, 13, 131, -202, -62, 140, 106, 40, 156, -89, -44, -176, 55, -151, -139, -99, -249, 37, -11, 136, 127, -327, -286, 53, -17, -246, -202, 10, 0, -61, 212, -68, -69, -45, 56, -33, -246, -201]
3556b01L46k00R7qj41J21r3l0R7q7K80l98J89J62K06j56l78K03n0M71m95P1j38
3579a32L10m8l4Lk3j47K08l73L97j91L3K02m07N5L0K76k09K4K48k47J53l2k14
3602a18P7Lo2K6J60M3k68M28l76L2O0M6J26k53on9L77j03j96K2Pj64Q4%L20j86
3628B0J83p7j11j06M0M3k0J56n6J12k49N4M7k43Q7K11j78L10j09J28k34j95J35
3651e2j05Mn0J36J18P3j38J99k25l7L31l02J14J54k74R9n5j7j6J8J73o7J7j38
3675d0k34L89j69MJ4J46OQ8j94k00K79P8j10OLLj89J33k10k9j9K94q5j31L0L89
3701B52k24K8j49Q4J96j83r1p4K48k10lJ22j06J85j5o2N1P0j49J47j21R2j47p0
3725a29K50j47K40k40J08q6k78N39Kr2j03qQ9k02M09k52j32L19n41P5J20K58k60
$$ y = [-201, 145, -55, 42, 34, -107, 14, -79, -109, -12, -99, 181, -217, -28, 134, 340, 184, -194, 9, -41, 430, -65, 6, -132, 178, 130, 96, 99, 76, -71, 137, -236, 161, -30, 3, 205, -202, -147, -117, 159, -50, -26, 222, -25, 128, 96, -118, -41, -38, -100, -74, 86, 129, -139, 289, -87, -55, 5, 51, 177, -76, -82, -141, 236, 133, -63, -41, -34, -198, -114, -114, 206, 20, 203, 126, 15, -91, -51, -8, -28, 128, 72, 184, -65, -11, 36, -207, -120, 91, -87, 223, 114, 242, 8, -187, -52, -157, -153, -203, -67, 51, 124, -14, 185, -40, -77, 254, -48, 66, 220, -54, 45, -10, -27, -43, -25, 148, 81, 98, -40, -274, 115, -54, -50, -36, 110, 116, 204, 10, -190, 89, 167, 57, 63, 66, 69, -120, 13, -197, -226, -245, 49, -36, -167, -137, 252, 28, 56, -93, -9, 187, 4, -87, -161, 87, -123, -126, -4, -110, 75, 60, -2, 49, 119, -30, 117, -4, 88, -59, -129, 121, -26, 214, -26, 82, -4, -282, 257, 259, 167, 64, 56, 145, -57, 352, 100, -32, 287, -254, -179, -59, 199, -61]
3748f1J00k72K38J40j41j28J66K46l06P6n9l9L0J75J0l35K58L25l72k61N08m54
3770a56L42N0j62j53l4j7L13j89J64m9j56R4J07L7k60J76M9k14J60j39kJ69J84
3793C14k43j22r0j55L36l47J62J22M6R2o0k48L04j2n6K22m41K66l51L21J13j8
3815A55k15J66j80R2q6j12J30MJ07j31K26j11q4J66j41N8J13%j87N8J74m80L87
3838A09k62K64J61m38J13K09j92K13k15j49M08k42K75l35P4j9J94q6L4j95k59
3859c38J93n5J34J14J79k81J78k01P4J6k25J05n4K01L3O7k72J26K63l18J95l71
3881b37P6Q4J01K50k20l1p8j27l9K71qn5K05l51K10j98p7m4J16J43j81L77l35
3904a48L06j78k7J13j83O5r7R1L5Mn2o2J26j07K3L12j50j2l20K30k61M64J23L1
$$ y = [-61, 39, -233, 5, 145, 4, -124, 42, 288, -18, 58, -1, -40, -10, 165, 175, -160, 98, 423, 51, -210, 298, -156, 186, 236, 74, -79, -113, -130, 183, -6, 158, 109, -47, 47, 154, 191, -69, 107, 156, -58, 102, -37, -39, 130, 314, 71, -51, -141, -296, 40, -307, -145, -23, 23, 115, 55, -193, 111, 99, 43, 265, -176, 90, -261, 60, 173, 155, -60, 106, -74, 18, -68, -180, -50, -46, 61, -70, 156, 45, -39, 127, -14, 44, 157, 157, -30, 28, 202, -278, 109, -153, 111, 272, -166, -53, 156, -36, 177, -38, -187, 221, -21, 254, -81, -7, -26, 168, 82, 116, -79, -338, -145, -200, -66, 48, 227, -54, 124, -77, -3, 13, -212, -107, -161, 40, 73, 140, -132, -6, 257, -61, 134, -237, -161, -77, 24, 274, 54, 23, -55, -182, -221, 50, 42, -13, 192, -159, 51, -147, -224, -268, -152, -9, -190, 187, -148, 158, -20, -47, 66, -117, -52, -149, -58, -23, -19, -71, -133, -7, -114, -91, 221, 71, 59, -261, -31, -292, 172, 295, 326]
3928C26n82K59j38K83k33K44n2k77J98R4P2j58n7J32l8r2k11K51q4P1l8Nj57j56
3952c38O13n6j44j53J47r6n6J95k55J64k09J97rM6j08R6j08k05J40K66j88n9P2
3975d8J31L0k65J45l20M65k20K58J14j19k90K36n11L84K9p8K56l26L19k12J22
3996A00k71K08k51L94j72J16K46j50l93J28M5J47p4j85K36j99q4K88P5k05M0M2
4018H1lj94J26n4J43j46K88j00j23J0l50M06j51J20j24K20k06J21pj05L14k75
4040iKO5J14k74L21j99j50L51l46K2P6J34k99L8J0K69j92J78l4N4K9k25J7J59
4064A11k29K99j62J97j91k91J97K29l21J03J25q1j4RJ4p3m7j0J5K81m27L39q3
4087a0k67L41k8L2P4l06L40k01Qj19o6J64j1J43k11j10M61q0m9L9k33k2J93r1
$$ y = [326, -256, 3, -135, 148, -85, 159, 107, -170, 28, 122, 194, 36, -21, 111, 73, -19, -230, 21, -63, 8, -30, -25, -182, -338, 275, 219, 75, -78, 69, -27, -83, 112, -143, 21, -188, 9, 0, 46, -62, 34, -74, -279, -139, 127, -61, -120, -48, 83, 113, -152, -7, -327, 138, -82, 176, 290, 171, -119, 117, -394, -10, 19, -59, 197, -129, 190, -22, 100, -171, 37, -214, 180, 8, 124, 370, 220, -173, -45, 0, 147, 73, -112, 124, -75, -159, 129, 204, -1, 39, 81, 78, -116, 10, -44, 99, -47, 241, 141, 18, 28, -322, 84, -67, 53, -71, 149, -57, 64, 57, -48, 266, -9, -7, 58, 172, -102, 219, 20, -130, 221, -125, -103, -27, 107, -192, -154, -144, 125, -67, 111, 77, 131, 160, -65, -48, 111, -118, 181, 19, 216, 25, -266, -69, 160, -161, -58, 67, -14, -28, -19, -5, -78, -125, -135, -120, 161, -266, 73, -10, -277, 64, 36, 68, 142, -164, 176, -25, -17, -136, -202, -38, -49, 94, -117, -227, 234, 154, 105, 144, -89, -111, 82, -9]
4111iO4k97L59KJ44n21Q6J91J06l12K73M9k58K58k96J71L5J92m25L61k08J16j76
4134i5M6J15K63m05J5J67j38k57L98n4j46J84oK0m18J05J97k47K16J44m1j5J60
4157B08l22P7K68l17j37J55q1K10R4j17L1K1J61j62r1r8PJ31r2K73k67L43j82
$$ y = [-9, 55, -242, 117, 119, 263, -258, -172, 19, 125, -187, 86, 135, -123, 135, -161, 10, 45, 237, -188, 173, -35, 81, -95, -49, 66, 329, -76, -61, 106, -32, -289, 109, 55, -91, 93, 87, 107, -311, -206, -9, -256, -40, 104, 63, 48, 208, -114, -37, 231, -86, -223, -68, -149, 61, 155, 38, 69, 90, 251, 89, -2, -100, -93, 38, -54, 219, -48, 295, 113]
$$ [...]
8191b76
##END NTUPLES=NMR FID
##END=
