##TITLE=1H_Pr C8-Am2
 CDCl3,8 sc, 
 22.9.2021
##JCAMPDX= 6.0         $$ Bruker NMR JCAMP-DX V2.0
##DATA TYPE= NMR FID
##DATA CLASS= NTUPLES
##ORIGIN= UXNMR, Bruker Analytische Messtechnik GmbH
##OWNER= root
$$ XWIN-NMR		Version 3.5
$$ Wed Sep 22 11:04:12 2021 Russian Standard Time (UT+4h)  she@DPX200
##.OBSERVE FREQUENCY= 200.1314
##.OBSERVE NUCLEUS= ^1H
##.DELAY= (6, 6)
##.ACQUISITION MODE= SIMULTANEOUS
##.ACQUISITION SCHEME= undefined
##.AVERAGES= 8
##.DIGITISER RES= 18
##SPECTROMETER/DATA SYSTEM= spect
##.PULSE SEQUENCE= zg30
##.SOLVENT NAME= CDCl3
##.SHIFT REFERENCE= (INTERNAL, CDCl3, 0, 15.7039)
##AUDIT TRAIL= $$ (NUMBER, WHEN, WHO, WHERE, WHAT)
$$ ##TITLE= Audit trail, XWIN-NMR		Version 3.5
$$ ##JCAMPDX= 5.01
$$ ##ORIGIN= Bruker BioSpin GmbH
$$ ##OWNER= she
$$ F:/spectra/data/she/nmr/H-F/1/audita.txt
$$ ##AUDIT TRAIL=  $$ (NUMBER, WHEN, WHO, WHERE, WHAT)
(   1,<2021-09-22 11:03:04.92 +0400>,<she>,<DPX200>,
      <created by zg, POWCHK disabled, PULCHK disabled
       configuration hash MD5:
       00 E9 B6 7A A2 85 ED C7 34 08 36 98 17 FE 4E 26
       data hash MD5: 16K
       F6 93 35 FB 27 C0 68 41 BC 5D 30 CF 26 B6 BB B2>)
$$ ##END=
$$ 
$$ hash MD5
$$ F7 22 44 8A 3C B3 05 0E 32 26 21 7E 15 17 0E B1
##$RELAX= 
##$RELAX= 
##$RELAX= 
##$RELAX= 
##$RELAX= 
##$RELAX= 
$$ Bruker specific parameters
$$ --------------------------
##$DU= <F:/spectra>
##$EXPNO= 1
##$NAME= <H-F>
##$PROCNO= 1
##$TYPE= <nmr>
##$USER= <she>
##$AMP= (0..31)
100 100 100 100 100 100 100 100 100 100 100 100 100 100 100 100 100 100 
100 100 100 100 100 100 100 100 100 100 100 100 100 100 
##$AQSEQ= 0
##$AQ_mod= 1
##$AUNM= <au_zg>
##$AUTOPOS= <>
##$BF1= 200.13
##$BF2= 200.13
##$BF3= 200.13
##$BF4= 200.13
##$BF5= 200.13
##$BF6= 200.13
##$BF7= 200.13
##$BF8= 200.13
##$BYTORDA= 1
##$CFDGTYP= 0
##$CFRGTYP= 5
##$CHEMSTR= <none>
##$CNST= (0..31)
1 1 145 1 1 1 1 1 1 1 1 1 1 1 1 1 1 1 1 1 1 1 1 1 1 1 1 1 1 1 1 1 
##$CPDPRG= <>
##$CPDPRG1= <>
##$CPDPRG2= <>
##$CPDPRG3= <>
##$CPDPRG4= <mlev>
##$CPDPRG5= <mlev>
##$CPDPRG6= <mlev>
##$CPDPRG7= <mlev>
##$CPDPRG8= <mlev>
##$CPDPRGB= <>
##$CPDPRGT= <>
##$D= (0..31)
0 1.2 0 0 0 0 0 0 0 0.06 0 0.03 0 0 0 0 0.0002 0 0 0 0 0 0 0 0 0 0 0 0 
0 0 0 
##$DATE= 1632294184
##$DBL= (0..7)
120 120 120 120 120 120 120 120 
##$DBP= (0..7)
150 150 150 150 150 150 150 150 
##$DBP07= 0
##$DBPNAM0= <>
##$DBPNAM1= <>
##$DBPNAM2= <>
##$DBPNAM3= <>
##$DBPNAM4= <>
##$DBPNAM5= <>
##$DBPNAM6= <>
##$DBPNAM7= <>
##$DBPOAL= (0..7)
0.5 0.5 0.5 0.5 0.5 0.5 0.5 0.5 
##$DBPOFFS= (0..7)
0 0 0 0 0 0 0 0 
##$DE= 6
##$DECBNUC= <off>
##$DECIM= 32
##$DECNUC= <off>
##$DECSTAT= 4
##$DIGMOD= 1
##$DIGTYP= 9
##$DL= (0..7)
0 120 120 120 120 120 120 120 
##$DP= (0..7)
150 150 150 150 150 150 150 150 
##$DP07= 0
##$DPNAME0= <>
##$DPNAME1= <>
##$DPNAME2= <>
##$DPNAME3= <>
##$DPNAME4= <>
##$DPNAME5= <>
##$DPNAME6= <>
##$DPNAME7= <>
##$DPOAL= (0..7)
0.5 0.5 0.5 0.5 0.5 0.5 0.5 0.5 
##$DPOFFS= (0..7)
0 0 0 0 0 0 0 0 
##$DQDMODE= 0
##$DR= 18
##$DS= 0
##$DSLIST= <SSSSSSSSSSSSSSS>
$$ [...]
##$SUBNAM2= <"">
##$SUBNAM3= <"">
##$SUBNAM4= <"">
##$SUBNAM5= <"">
##$SUBNAM6= <"">
##$SUBNAM7= <"">
##$SUBNAM8= <"">
##$SUBNAM9= <"">
##$SW= 20.0188988654967
##$SWIBOX= (0..15)
0 0 2 0 0 0 0 0 0 0 0 0 0 0 0 0 
##$SW_h= 4006.41025641026
##$TD= 16384
##$TD0= 1
##$TE= 0
##$TE2= 300
##$TE3= 300
##$TEG= 300
##$TL= (0..7)
0 120 120 120 120 120 120 120 
##$TP= (0..7)
150 150 150 150 150 150 150 150 
##$TP07= 0
##$TPNAME0= <>
##$TPNAME1= <>
##$TPNAME2= <>
##$TPNAME3= <>
##$TPNAME4= <>
##$TPNAME5= <>
##$TPNAME6= <>
##$TPNAME7= <>
##$TPOAL= (0..7)
0.5 0.5 0.5 0.5 0.5 0.5 0.5 0.5 
##$TPOFFS= (0..7)
0 0 0 0 0 0 0 0 
##$TUNHIN= 0
##$TUNHOUT= 0
##$TUNXOUT= 0
##$USERA1= <user>
##$USERA2= <user>
##$USERA3= <user>
##$USERA4= <user>
##$USERA5= <user>
##$V9= 5
##$VALIST= <valist>
##$VCLIST= <CCCCCCCCCCCCCCC>
##$VD= 0
##$VDLIST= <DDDDDDDDDDDDDDD>
##$VPLIST= <PPPPPPPPPPPPPPP>
##$VTLIST= <TTTTTTTTTTTTTTT>
##$WBST= 1024
##$WBSW= 4
##$XGAIN= (0..3)
0 0 0 0 
##$XL= 0
##$YL= 0
##$YMAX_a= 121008
##$YMIN_a= -184317
##$ZGOPTNS= <>
##$ZL1= 120
##$ZL2= 120
##$ZL3= 120
##$ZL4= 120
##$ABSF1= 10
##$ABSF2= 0
##$ABSG= 5
##$ABSL= 3
##$ALPHA= 0
##$AQORDER= 0
##$ASSFAC= 0
##$ASSFACI= 0
##$ASSFACX= 0
##$ASSWID= 0
##$AUNMP= <proc_1d>
##$AZFE= 0.1
##$AZFW= 0.1
##$BCFW= 1
##$BC_mod= 2
##$BYTORDP= 1
##$COROFFS= 0
##$CY= 11.3945322036743
##$DATMOD= 1
##$DC= 2
##$DFILT= <>
##$DTYPP= 0
##$F1P= 2.36226072786647
##$F2P= -0.459571619588291
##$FCOR= 0.5
##$FTSIZE= 0
##$FT_mod= 4
##$GAMMA= 1
##$GB= 0.15
##$INTBC= 1
##$INTSCL= 1
##$ISEN= 128
##$LB= 0.24
##$LEV0= 0
##$LPBIN= 0
##$MAXI= 10000
##$MC2= 0
##$MEAN= 0
##$ME_mod= 0
##$MI= 1.114404
##$NCOEF= 0
##$NC_proc= 0
##$NLEV= 6
##$NOISF1= 3.799351
##$NOISF2= 2.8
##$NSP= 1
##$NTH_PI= 0
##$NZP= 0
##$OFFSET= 15.70392
##$PC= 1
##$PHC0= -14080.01
##$PHC1= 17.80089
##$PH_mod= 1
##$PKNL= yes
##$PPARMOD= 0
##$PSCAL= 0
##$PSIGN= 0
##$REVERSE= no
##$SF= 200.130013532006
##$SI= 16384
##$SIGF1= 3
##$SIGF2= 2
##$SINO= 400
##$SIOLD= 16384
##$SREGLST= <1H.CDCl3>
##$SSB= 0
##$STSI= 0
##$STSR= 0
##$SW_p= 3612.71676300578
##$SYMM= 0
##$S_DEV= 0
##$TDeff= 0
##$TDoff= 0
##$TI= <>
##$TILT= no
##$TM1= 0
##$TM2= 0
##$TOPLEV= 0
##$USERP1= <user>
##$USERP2= <user>
##$USERP3= <user>
##$USERP4= <user>
##$USERP5= <user>
##$WDW= 1
##$XDIM= 8192
##$YMAX_p= 0
##$YMIN_p= 0
$$ End of Bruker specific parameters
$$ ---------------------------------
##NTUPLES= NMR FID
##VAR_NAME=  TIME,          FID/REAL,        FID/IMAG
##SYMBOL=    X,             R,               I
##VAR_TYPE=  INDEPENDENT,   DEPENDENT,       DEPENDENT
##VAR_FORM=  AFFN,          ASDF,            ASDF
##VAR_DIM=   8192,          8192,            8192
##UNITS=     SECONDS,       ARBITRARY UNITS, ARBITRARY UNITS
##FACTOR=    0.0002496,     1,               1
##FIRST=     0,             0,               0
##LAST=      2.0444736,     0,               0
##MIN=       0,             -184317,         0
##MAX=       2.0444736,     121008,          0
$$ Real data points
##PAGE= N=1
##DATA TABLE= (X++(R..R)), XYDATA
$$ [...]
1835b02K61J121j251j19R55j159O74N46j240L79O99p41K96J06n41M23k84j41Q54
$$ -202 59 1180 -71 -190 765 -394 280 826 -414 -35 664 -77 219 325 -216 207 -77 -218 636
1854F36p30r76J731o01m90P34o47J06M56q40M44N61j035L60J20n10R25k79q43
$$ 636 -94 -1070 661 60 -430 304 -343 -237 219 -621 -177 384 -651 -291 -171 -681 244 -35 -878
1873h78R17K36r53N41K17n31O04n95J79O75p42O4O16o32M26L80j267Q61P29j148
$$ -878 39 275 -678 -137 80 -451 153 -442 -263 412 -330 -266 350 -282 144 524 -743 118 847 -301
1893c01O22J93q70P16k78M0L86l91k20R61p93J2M55q91M02O75q94J78O90p67P2
$$ -301 321 514 -356 360 82 122 508 117 -103 858 65 77 532 -359 43 718 -176 2 692 -75 -3
1914cO13o34L85n04o24J105j00j055J085n36l32R24n14j9N59p33m32P78n13J54
$$ -3 610 -24 361 -143 -767 338 238 -817 268 -268 -600 324 -190 -209 350 -383 -815 -37 -550 -396
1934c96L41p17R50k6j052J081p2j000R78P4n89R71q58j63J318q10j35L69l97J07
$$ -396 -55 -772 178 152 -900 181 109 -891 87 161 -428 543 -315 -478 840 30 -105 264 -133 -26
1954b6Q16r25K36P05o94M0K04n20O89j10p89P49o4n32P13m68k1Q77j054Q0Q59
$$ -26 790 -135 101 806 112 152 356 -164 525 415 -374 375 311 -221 492 24 3 880 -174 -94 765
1975G65j148K28O87n09N7J20o00P01j91p55O93p9p19J053l96k77P13q14q9P74
$$ 765 -383 -155 532 23 80 200 -400 301 110 -645 48 -31 -750 303 -93 -370 343 -471 -560 214
1995B14n53K3M61o18K71L29j038M95O62p17K90J99o71Q97k45o37P36l13l23Q15
$$ 214 -339 -316 145 -473 -202 127 -911 -416 246 -471 -181 18 -653 244 -1 -638 98 -215 -538 277
2015B77l37Q8J77n04J14P93r08L32M54p94P58J77r86N26L39q77O06P1m03N72l51
$$ 277 -60 28 205 -299 -185 608 -300 32 486 -308 450 627 -359 167 506 -371 235 306 -97 475 124
2036A24n13R76o19J6O47o82j2N75q04L22N09j002M27P7j78K25J01m48O33o20j77
$$ 124 -389 587 -32 -16 631 -51 -63 512 -292 30 539 -463 -36 41 -137 88 189 -259 374 -246 -423
2057d23Q02m43m69M98k40j61M38o23J51P66j054L96L88n66M67K74n99O08q1p08
$$ -423 379 -64 -533 -35 -275 -436 2 -621 -470 296 -758 -362 26 -540 -73 201 -398 210 129 -579
2077e79P97J7n98N13j29j96P86p16k76R78p49K22K98o07M77K94r65N63M11p46
$$ -579 218 235 -363 150 21 -175 611 -105 -381 597 -152 70 368 -239 238 532 -433 130 541 -205
2097b05L91J29j74L40l85n71J133n23n89Q52k48l98O67n06m2N66p29J08N56p13
$$ -205 186 315 141 481 96 -475 658 135 -454 398 150 -248 419 -87 -129 437 -292 -184 372 -341
2117c41L00p3n45P32l7p52M69K59m78M85n14J77M50o90J84O18o41J73K85n28N02
$$ -341 -41 -114 -659 73 36 -716 -247 12 -466 19 -495 -318 132 -558 -374 244 -397 -224 61 -467 35
2138C5K66o69L20J84q79P47p5m13Q13k99m08Q67l85o84J008l50j30N48o14j06
$$ 35 301 -368 -48 136 -743 4 -71 -484 329 30 -378 489 104 -580 428 78 -52 496 -118 -224
2158b24R92j169N08P16q38J44Q9n07O88j68o19O48k18k68N78m05o9O01l93k26
$$ -224 768 -401 107 823 -15 129 218 -289 399 231 -388 260 42 -226 352 -53 -122 479 86 -140
2178a40P02o86N2L46p52O47J2r89Q37L67j063P15j10l80N72k00m25J062q33k9
$$ -140 562 -124 -72 274 -478 169 181 -808 29 396 -667 48 -62 -442 130 -70 -495 567 -266 -295
2198b95K71l48J90J88n66L45M91p13PO39o23M46J05l04O36m52m05M37p4l34N46
$$ -295 -24 -372 -182 6 -560 -215 276 -437 -430 209 -414 32 137 -167 469 17 -388 49 -25 -359 187
2219A87Q7q1L93o68P1P20p86j17M06j41L87l6q24N91K59n13N57n35k21O51l02
$$ 187 274 193 586 -82 -11 709 -77 -194 212 71 458 422 -402 189 448 -65 492 -43 -264 387 85
2240H5k14M43j21m42L05r3K26K53r37K12O33q41N09K12p98M16J61m67O59k25l87
$$ 85 -129 314 193 -249 56 -37 189 442 -495 -283 350 -491 18 230 -568 -152 9 -458 201 -24 -411
2261d11P14l61LJ28m94l8P28q31K99O18p40J48O39q66N47k1m81O09j42j59L25
$$ -411 303 -58 -55 73 -421 -459 269 -562 -263 355 -385 -237 402 -464 83 62 -419 190 48 -111 214
2282B14j24m19P65l44j68L25j85l77P28l16J00J23n99M69M68j118O16K13n89O18
$$ 214 90 -329 436 92 -76 249 64 -313 415 99 199 322 -277 192 660 -458 158 371 -218 400
2302D00j57m63M57kr59J084j55m00M42l72N3K44o18M26K01o39L45L52o76O15q1
$$ 400 243 -220 237 235 -724 360 205 -195 247 -125 -72 172 -446 -20 181 -458 -113 239 -437 178 97
2323I7n22J15M13l44K93k66o9K70k42J42L20p36j2R66p96K28L32k66L4O43o85
$$ 97 -425 -310 103 -241 52 -214 -283 -13 -255 -113 207 -529 -541 425 -371 -143 189 -77 -43 600 -85
2344h5Q8K19k59K15M7n27P42m16o36R85r3k06L80j46l97N65n10J89N2l71M33Q9
$$ -85 3 222 -37 178 225 -302 440 24 -612 373 280 74 454 308 -89 476 -34 155 207 -164 269 358
2366C58k68M17Kq64P22P6o68J85J43l79L31k34j06P15o30m2K18o8J39K47q20L92
$$ 358 90 507 509 -355 367 443 -225 -40 103 -276 55 -179 -285 430 -200 -242 -24 -92 47 294 -526 -134
2388a34K6k02L8M85l17n1K0k29O24n36L3L66p8r3K15l79J25K61m99J08M23k51
$$ -134 -108 -310 -272 213 -104 -155 -135 -364 260 -276 -243 123 45 -48 167 -212 -87 174 -325 -217 206 -45
2410d5J31%l00N30k37n06R28j29o07N41k12j90J35L8j31M08m70J88L67m18K09
$$ -45 86 86 -214 316 79 -427 501 372 -235 306 94 -96 39 77 -54 354 -116 72 439 21 230
2431B30J55n54K11M63q07M81J65o30L58j74K4K43m65Q9L89j54K15r3k53q6N02
$$ 230 385 -169 42 505 -302 179 344 -286 72 -102 -78 165 -300 -211 178 24 239 146 -107 -193 309
2452C09n38K33N07p17L3L20m16L41j40p49O78M9j19K74j80j50N44o82K82O22p08
$$ 309 -229 4 511 -206 -173 147 -269 72 -68 -817 -139 -90 -209 65 -115 -265 279 -403 -121 501 -207
2473b07J19J28j14L14k15l5K50j76l4P4L5k48O12k30m97P94q37R5O71l29K4L65
$$ -207 -88 40 -74 240 25 -10 240 64 30 104 139 -109 503 273 -224 570 -267 -172 499 170 194 559
2495E59o09K56K55n71J61K71l83j01N72n28K00n5m01L66J11l14L05l00j06N07
$$ 559 -50 206 461 -110 51 322 -61 -162 410 -118 82 27 -374 -8 103 -211 94 -206 -312 195
2515A95k17m12Q91q95J15M13k03j8K84o37M84J22m83L77J43n93N69M6m11N62p18
$$ 195 -22 -434 457 -438 -323 90 -113 -131 153 -484 0 122 -361 16 159 -434 135 181 -230 332 -386
2536c86K46M32l14p0J22k14J38L86m88Q5N94n97K52p3n77Q06J53o59N38l37l04
$$ -386 -140 292 -22 -92 30 -184 -46 340 -148 -63 531 -66 186 113 -464 342 495 -164 374 37 -267
2557b67M15k32K51J07l72J06M58l25l63M75k90K28M7m69L61P4m89L04o3j0Q5j46
$$ -267 148 -84 167 274 -98 8 466 141 -222 253 -37 191 238 -231 130 204 -285 19 -44 -54 31 -115
2579a15J27j7j58j71N60l97K5L11m29J30l1l44L00M78l57J97j68r8L07r3m69P00
$$ -115 12 -5 -163 -334 226 -171 -146 165 -264 -134 -165 -509 -209 269 -88 109 -59 -157 150 57 -412 288
2601B88k42m95N73k45K5M64p23L58J83k46Q3K37m56RN34l35mL32r8j03L14p67
$$ 288 46 -449 124 -121 -96 368 -355 3 186 -60 23 260 -196 -187 347 12 8 340 242 139 453 -314
2623c14L81J04j50J86k21l2K83k88M2M23n56K77K15l98K15J75m94K37P4m46L31
$$ -314 67 171 21 207 -14 -46 237 -51 -9 414 -142 135 350 -48 167 342 -152 85 159 -287 44
2644D4pl48N37n07j08M57j49r6N65p86J38P54m72L88k49j57K28j60l51M52k47
$$ 44 37 -311 226 -281 -389 68 -81 -177 388 -398 -260 494 22 410 161 4 232 72 -279 173 -74
2665g4k18L98L2k66J10R6k05L88l22l1M47o47L70p8j97L24J2l00M9L90l26J16
$$ -74 -292 106 138 -128 -18 78 -127 261 -61 -92 355 -292 78 0 -197 127 139 -161 -112 278 -48 68
2687F8J2q5J63P2l95N18l55j45L51j66K3p6J52j43N06n91j8M41o94K35J71k47
$$ 68 80 -5 158 230 -165 353 -2 -147 204 38 61 -15 137 -6 500 -91 -109 332 -362 -127 44 -203
2709b03J23K99n06J16M31n36K33j79k60N00m50K91M03j18l33K86j08M0m1k84M91
$$ -203 -80 219 -287 -171 260 -276 -43 -222 -482 18 -432 -141 262 144 -189 97 -11 29 -12 -296 195
2730A95Kj65LK39m96K19J71m85P49m09m36P12n21M3L52n75L38M34m64J66K81k04
$$ 195 197 32 35 274 -222 -3 168 -317 432 23 -413 299 -222 -179 173 -402 -64 370 -94 72 353 149
2752A49K80j80k59L2K01l44L7J54m26L70j64qM58l38j4L37l89j52M87o47L65J39
$$ 149 429 249 -10 22 223 -121 -84 70 -356 14 -150 -158 300 -38 -52 285 -104 -256 231 -416 -51 88
2774H8j56K39q9l60j0J41m84Q38n06P4J52J8l24L71Kk73K47j93K06M03p02N64
$$ 88 -68 171 82 -278 -288 -147 -631 207 -299 -225 -73 -55 -379 -8 -6 -279 -32 -225 -19 384 -318 246
2796B46o3p6k7r7J7J14o3k87N77j26j1j35M3j78L10m69K33K44l56j74N72k82K64
$$ 246 183 107 80 -17 0 114 51 -236 341 215 204 69 112 -66 244 -225 8 252 -104 -278 294 12 276
2819B76k61l28L32M19l59R0J09k05K64l51q0L53k68P7K43l81M98l02k85K08L52
$$ 276 15 -313 19 438 79 169 278 73 337 -14 -94 259 -9 68 311 -70 428 126 -159 49 401
2840D01m55l7O6j08L18l17k36L95K2l66M22j92l26K32j19N5J53J80j36l4l85K38
$$ 401 -54 -91 -25 -133 185 -132 -368 27 49 -317 105 -87 -413 -181 -300 -245 -92 88 -48 -82 -467 -229
2862b29L56n19O53n7l16pj46r9J45L24l5J45O2m72M09l46j3L28N5j89K9m13K94
$$ -229 127 -392 261 204 -112 -119 -265 -364 -219 105 70 215 277 -195 214 -132 -145 183 238 49 78 -335 -41
2885d1N19n79J72L61l55j29J51r4J62p5k17K81J11j30j30j00l07P94n39K22Q9
$$ -41 478 -101 71 432 77 -52 99 5 167 92 -125 156 267 137 7 -93 -400 394 -145 77 166
2906A66j99QJ38p5n28N19j47K42j36n9L12j22n16N01k7l4KL8k85M12m09mN37n41
$$ 166 -33 -25 113 38 -490 29 -118 124 -12 -71 241 119 -397 104 77 43 45 83 -202 210 -199 -203 334 -207
2930b07J05J48n1q2N9k80M77j6O6r2J19l15N8J24j41K04j95K38N0m32n4M63k24
$$ -207 -102 46 -5 -87 -28 -308 169 153 219 127 246 -69 -11 113 -28 176 -19 219 269 -163 -217 246 22
2953B2K65j07k79j4J1p3J92K68n72L95k07l05M05r9qJ12k6J20k30J83j34J44l03
$$ 22 287 180 -99 -113 -102 -175 17 285 -287 108 -99 -404 1 -98 -106 6 -20 100 -130 53 -81 63 -240
2976b40J37J33l24K30Q8j13K67k72l07K57o6NM20o6l85L80l75J4M12p4l6N5j97
$$ -240 -103 30 -294 -64 24 -89 178 -94 -401 -144 -210 -205 215 149 -236 144 -231 -217 195 121 85 140 -57
2999e7m4J55p9K23j47j86J45K45m92K75q3J83O5O7j58L4Mk11M42k88j11J58l04
$$ -57 -101 54 -25 198 51 -135 10 255 -237 38 -45 138 203 270 112 146 150 -61 381 93 -18 140 -164
3022a64K85l7j08P4P0k75M40k34j96J96M8k77J47j62M6K41p7j46M70o15J40J24
$$ -164 121 84 -24 50 120 -155 285 51 -145 51 99 -178 -31 -193 -147 94 17 -129 341 -274 -134 -10
3044a0j44R2N8j82N1J44l95N41j07k18K17j57J37K02o45N07m7r5J33K01m74J64
$$ -10 -154 -62 -4 -186 -135 9 -386 155 48 -170 47 -110 27 229 -416 91 44 -51 82 283 -191 -27
3066b7R2M9n0K47l40K36l07K97j84o4R0K33j50m82Q69l54j91J10o7l6K51j02j67
$$ -27 65 114 64 311 -29 207 -100 197 13 -51 39 272 122 -360 509 155 -36 74 7 -29 222 120 -47
3089d7K33k16l6K82l39L41k78j13J20Q9j07O9j87R2J37l01K32L51m41J4J59m2
$$ -47 186 -30 -66 216 -123 218 -60 -173 -53 36 -71 -2 -189 -97 40 -261 -29 322 -119 -105 54 12
3111A2J0O8j50j95P4j85M20R3k77K05R2l27N46m37k47O51o32K4K99k69J85J44
$$ 12 22 90 -60 -255 -181 -366 54 147 -130 75 167 -160 386 -51 -298 353 -279 -255 44 -225 -40 104
3133A04n9%J6o8K16l56k8K59M9q6J34N0k46L09k74O7J39j30q4L63o48M00j4l94
$$ 104 45 45 61 -7 209 -147 -175 84 133 47 181 231 -15 294 20 87 226 96 12 375 -273 127 113 -281
3157b81M35k17k32J52K38j34K07j36m4j23R3r6L39l00l18L91oKr6k7J49O4j73
$$ -281 154 -63 -295 -143 95 -39 168 32 -12 -135 -42 -138 201 -99 -417 -26 -32 -30 -126 -153 -4 60 -113
3180a13N3J65m0j25J32m12K68Mk26K89M7j89J42J71l06J24k71K39L37m81j12L27
$$ -113 -60 105 65 -60 72 -340 -72 -68 -294 -5 42 -147 -5 166 -140 -16 -287 -48 289 -192 -304 23
3202B3l76N41j81J09K24j48l43J73P8R6Pl90K25kj55Q7j85J45J7L09m86J31pk51
$$ 23 -353 188 7 116 340 192 -151 22 100 196 203 -187 38 36 -119 -32 -217 -72 -55 254 -232 -101 -108 -359
3226c59N48K47o75L31q5m7K71m89K31j8K28l41J76K01l27l0J26j70K61k09O5J12
$$ -359 189 436 -239 92 7 -40 231 -258 -27 -45 183 -158 18 219 -108 -138 -12 -182 79 -130 -65 47
3248D7M2l45K74j20N51k74k19r7L30l7j84l1j1K37R1m63K03J19k13L42k25J81
$$ 47 89 -256 18 -102 449 175 -44 -141 189 152 -32 -63 -74 163 254 -209 -6 113 -100 242 17 198
3270A98N2m46L04p7j55M91k23j23J00K05k44K43m08j73M66j07L2l88L96k99L05
$$ 198 250 -196 108 31 -124 367 144 21 121 326 82 325 -83 -256 210 103 135 -253 143 -156 149
3291A49m38K75P3k46K24j66J57p1k93p5M70k16p4L10k68J15J96l14P8Q0J30Q2
$$ 149 -289 -14 59 -187 37 -129 28 -43 -336 -411 59 -157 -231 79 -189 -74 122 -192 -114 -34 96 178
3313A78J55l77j19K34Q9k11O0l6m5JJ1P5M3pj25mq9L47j04K24k08J57k61K32j78
$$ 178 333 -44 -163 71 160 -51 9 -27 -72 -71 -60 15 58 51 -74 -78 -167 180 76 300 92 249 -12 220 42
3338D2q5L28l35J39L4j54K17j10j71J84N5j27j33PL2L82j85j26p5N4O9K9j26o3
$$ 42 -43 285 -50 89 123 -31 186 76 -95 89 144 17 -116 -109 -77 305 120 -6 -81 -27 42 71 -55 -118
3362a18p3l5M93j75k56J0M38o04M69k36k16K50q9J36j44K75p2P9n07K39K74k27
$$ -118 -191 -226 267 92 -164 -154 284 -320 149 -87 -303 -53 -142 -6 -150 125 53 132 -375 -136 138 -89
3384h9l78L96j4L9k1n2N8J71k80P4K42j78J33J08k86K25j68L10j64j37J58m0j99
$$ -89 -467 -71 -85 -46 -67 -119 -61 110 -170 -96 146 -32 101 209 -77 148 -20 290 126 -11 147 107 -92
3407i2O15o85J62K02j71J85m9M0q5J05m69L68j21K1P1l3l02K12P5k25J03R4m09
$$ -92 523 -162 0 202 31 216 167 207 122 227 -242 126 5 26 97 64 -238 -26 49 -176 -73 21 -388
3430c88J70J98l0J2J05j22K78l25m1K32k86j2L20p9j48L11m89K33K55l18pJ31
$$ -388 -218 -20 -50 -38 67 -55 223 -102 -143 89 -197 -209 111 32 -116 195 -294 -61 194 -124 -131 0
3452@n9J24l66q8L80M9m21N09k13K4M70m54K8K05p3k87J19j1L3P9j3P9j38k54
$$ 0 -59 65 -301 -389 -9 40 -381 128 -85 -61 409 -45 -17 188 115 -172 -53 -64 -31 48 35 114 -24 -278
3476b78M23L0m27L14J24j86L71o10M0K88r7j02K57j78J61j41p0n2K68k53k7M11
$$ -278 145 175 -252 62 186 0 371 -239 -199 89 -8 -110 147 -31 130 -11 -81 -133 135 -118 -145 266
3498B66m32K68j43q7K12j08k47K30o4L50n7m32J91j21J12j94L89L8J09l27q6q
$$ 266 -166 102 -41 -128 84 -24 -271 -41 -105 245 188 -244 -53 -174 -62 -256 133 171 280 -47 -133 -141
3520a41J22O5r2K27j60j12K66l62L15j75J5J10l71K98l1J9k85K14K47j7j14P1
$$ -141 -19 46 -46 181 21 -91 175 -187 128 -47 -32 78 -293 5 -26 -7 -292 -78 169 152 38 109
3542A09O9k34l1K63P4l99K0K69l67K05K01l19M2j24L14J95l99J79K3l32J96L07
$$ 109 178 -56 -87 176 250 -149 -129 140 -227 -22 179 -140 -98 -222 92 287 -112 67 90 -242 -46 261
3564B61k53k8N6J87l18N1l06M68M9l51K83r1k43L11Qk74J41j1K14l94N5L17J42
$$ 261 8 -20 36 223 -95 -44 -350 118 167 -184 99 8 -235 76 84 -190 -49 -60 154 -240 -185 132 274
3587B74n06J32L01m9k25K94l30K04j58j63N53j46l28J9Q5k6J84k12o1O22n06L04
$$ 274 -232 -100 201 152 -73 221 -109 95 -63 -226 327 181 -147 -128 -43 -69 115 -97 -158 464 -42 262
3609B62j74j40j0J75j78J25j36k40M36j35mK2r2J12Q8k5l95L41N6k23K88l58L
$$ 262 88 -52 -62 113 -65 60 -76 -316 120 -15 -19 3 -89 23 111 86 -309 32 88 -135 153 -205 -202
3632b02J35J43k66L35j46K11k20j54K90J11j32J51l17K27l3k14K76J90o65K89
$$ -202 -67 76 -190 145 -1 210 -10 -164 126 237 105 256 -61 166 133 -81 195 385 -280 9
3652IM1m8pN4k63M03O4o1j30J11k49J56j6lK03p1m86J66rQL16k41QR0nq8qj07
$$ 9 50 2 -5 49 -214 189 253 192 62 173 -76 80 64 61 264 193 -293 -127 -136 -128 188 -53 -45 45 40 -48 -56 -163
3680a63K23j23l3K72j72r1K20j23J22j10M8J3k58j17K72q9N5J4P6j74K20j09J25
$$ -163 60 -63 -96 176 4 -87 133 10 132 22 70 83 -175 -292 -20 -109 -54 -40 36 -138 82 -27 98
3703I8n6l51L7L03k8J9p5Rk23N94k53k60K19j76J15p9K15k43K60J6n2l57J26q7
$$ 98 42 -309 -272 31 3 22 -53 -44 -267 327 74 -186 33 -143 -28 -107 108 -135 125 141 89 -268 -142 -229
3727b29K96j74K33J13q4R1r4m5J32k09M8J96k89k30K21%J50O8k74J45J50l38J24
$$ -229 67 -107 126 239 155 246 152 107 239 30 78 274 -15 -245 -24 -24 126 194 -80 65 215 -123 1
3750AJ94j14r1J67j86J25j95j07L20j84k54N06k53k06J60P5O9k87K02J70J46j29
$$ 1 195 81 -10 157 -29 96 -99 -206 114 -70 -324 182 -71 -277 -117 -42 27 -260 -58 112 258 129
3772A29j33k04K00N6q2r6K65k45O0Q6m1L87m56k25M61q7j87%J8O4J82rj47L08
$$ 129 -4 -208 -8 48 -34 -130 135 -110 -50 36 -5 382 -74 -299 162 75 -112 -112 -94 -30 152 143 -4 304
3796C04k80m4NK14q5k45NO3J10j56K3N4Kj24K62k82K64l1j17J09J96p5k86J67
$$ 304 24 -20 -15 199 114 -131 -126 -63 47 -109 -86 -32 -30 -154 108 -174 90 59 -58 51 247 172 -114 53
3820E3k57M5L14l16Q1Q2j87K52J6l42K43o5K2K04k58L43j37K81k80l24J47J99
$$ 53 -204 -159 155 -161 -80 2 -185 67 83 -259 -16 -81 -59 145 -113 230 93 374 94 -230 -83 116
3842A16j30M1k73L65k0K1j76j00Q9J39J14L9p1K9k51J27r3J31J21k36ln2P8J39
$$ 116 -14 27 -246 119 99 120 -56 -156 -67 72 186 225 154 183 -68 59 -34 97 218 -18 -21 -73 5 144
3866A44n3j96jL74k76J29l36L31p2k49L44J4k79K32m50N0L49j74J20l1J99m8k4
$$ 144 91 -105 -106 268 -8 121 -215 116 44 -205 139 153 -126 106 -344 -294 55 -119 1 -30 169 121 97
3889I7j77K77k38j03n7J12J52l7Q5l07N8J6L4J38k08J58N0ok24J85n6J84j06j19
$$ 97 -80 197 -41 -144 -201 -89 63 26 111 -196 -138 -122 -88 50 -158 0 50 44 -180 5 -51 133 27 -92
3913i2l23L47K49j49J5j79L86o6M5k91j29L12j16L2k88L79n1KN4j74J79j67K14
$$ -92 -415 -68 181 32 47 -132 254 188 233 -58 -187 125 9 41 -247 132 81 83 137 -37 142 -25 189
3936A89k89J13J35r9j19k6j41J94k92M97Jj42J93k26J25j64p9M17j92j07n3J03
$$ 189 -100 13 148 49 -70 -96 -237 -43 -335 162 163 21 214 -12 113 -51 -130 287 95 -12 -65 38
3958C8k4r2L24l71J99oj08j18J18K5J4J22j67L5k32K49J05N0j09k50J23K71l7
$$ 38 14 -78 246 -125 74 68 -40 -158 -40 -15 -1 121 -46 -11 -243 6 111 161 52 -198 -75 196 159
3981A59m84L03Q2k1Nl44K06j28J64L05k76K3J44ML0k21K88j77M12l72j3l27L79
$$ 159 -325 -22 60 39 44 -300 -94 -222 -58 247 -29 -6 138 142 172 -49 239 62 474 102 89 -238 141
4004A41j82Q6o3j02P6N0L3K09r8p7p6j68R9l0K35l39J82r4K64p1j77J52k9j77
$$ 141 -41 45 -18 -120 -44 6 39 248 150 73 -3 -171 -72 -102 133 -206 -24 -118 146 75 -102 50 21 -156
4028a56J02j5R9N7j31N9k36K65l12K3L68j63k36K10J3JK0l2R1j93J33j66K68j90
$$ -156 -54 -69 30 87 -44 15 -221 44 -268 -245 123 -40 -276 -66 -53 -52 -32 -64 27 -166 -33 -199 69 -121
4052a21k4J31L35l19Q0R1r8l7o1J79j18j36J26L7k24M84m43o7p6M02p2r9j29K02
$$ -121 -145 -14 321 2 82 173 75 38 -23 156 38 -98 28 65 -159 325 -118 -185 -261 141 69 -30 -159 43
4076D3n7K58j43j59O7k68M06j4l22L64n00J99K8k61J71K04J6K21j20j78r1J09
$$ 43 -14 244 101 -58 9 -259 147 133 -189 175 -325 -126 -98 -359 -188 16 32 253 133 -45 -136 -27
4098b7J06o9N7j94J43q6J08L2m8j82K8K01k22J09k01M06j77J8J17q1J80j19r2
$$ -27 79 10 67 -127 16 -70 38 70 22 -160 -132 69 -153 -44 -245 161 -16 2 119 38 218 99 7
4121GlO5M0Q9k33J58q7o0J61j95K60k98N8L6o7J37J2P8j36l9J77k22J20Q2j14
$$ 7 4 69 109 198 -35 123 36 -24 137 -58 202 -96 -38 -2 -69 68 80 158 22 -17 160 -62 58 140 26
4146B6K2NJ50k74o3K61K0N1j85j84j87L19J43l3J46j8j68J87k64k2N9o6J80l55
$$ 26 48 53 203 -71 -134 127 147 198 13 -171 -358 -39 104 71 217 199 31 218 -46 -68 -9 -75 105 -250
4170b50J35L67k52l21R8L98m39K8J51K2M43k99R2k01j80K31j04J06m6Q9j00j28
$$ -250 -115 252 0 -321 -223 175 -264 -236 -85 -63 380 81 173 -28 -208 23 -81 25 -21 68 -32 -160
4192a60J13Q0l11K53J17L8k8P8n3O5m38J00K43j03k10J42J00o6j37J96M4Q1k04
$$ -160 -47 33 -278 -25 92 130 102 180 127 192 -246 -146 97 -6 -216 -74 26 -40 -177 19 63 144 -60
4215f0J31k13J10R1j65o6K92k29o0K35l38L00R3m63M25q5K7q0K19j15q3K8J32
$$ -60 71 -142 -32 59 -106 -172 120 -109 -169 66 -272 28 121 -342 83 -2 25 -55 164 49 -34 -6 126
4238A26L2j87J81j83pL5j6j33K67Q8l11K33j65J27J29r6j27l4J18J94k28j70J11
$$ 126 158 -29 152 -31 -38 -3 -19 -152 115 203 -108 125 -40 87 216 120 -7 -41 77 271 43 -127 -16
4261a6J01o6l2j97K39Rj30Q3j16J12j99K83j89K77k71p1J60Q9k85J06L6K81l22
$$ -16 85 19 -13 -210 29 38 -92 -9 -125 -13 -212 71 -118 159 -112 -183 -23 66 -219 -113 -77 204 -118
4284a18L15k98J30M9j80j93K47j90j1K30n9p3J2K33j7o8j20K5K18k14l40L21J52
$$ -118 197 -101 29 78 -102 -295 -48 -238 -249 -19 -78 -151 -139 94 77 9 -111 -86 132 -82 -422 -101 51
4307E1J80k80J5R5l30M15j36L1k05J39J40Lk62J20J50l6N2k19nK05Rj54R4j03
$$ 51 231 -49 -34 61 -269 146 10 41 -164 -25 115 118 -144 -24 126 90 142 -77 -82 123 132 -22 72 -31
4331c1n4L9K80j65n9N9k34J56nJ02M9j23J7J20k28n5L38k31l2O5Kr5k44L39j63
$$ -31 -85 -46 234 69 10 69 -165 -9 -14 88 137 14 31 151 -77 -132 206 -25 -57 8 10 -85 -329 10 -153
4356a53K67k88J71j74K81l94L32oK90ml33j5p3Lj00K73O3o2Lj09P0k20K05k42
$$ -153 114 -174 -3 -177 104 -290 42 36 326 322 -11 -26 -99 -96 -196 77 140 78 81 -28 42 -178 27 -215
4380b15j5L68j38J41j06j52N0j12Q8K53r2l0q0R3l5J70k19j42L42l24q1J68j79
$$ -215 -230 138 0 141 35 -117 -67 -179 -91 162 70 40 -40 53 18 188 -31 -173 169 -155 -236 -68 -247
4403b47J85J95j13R4P4j13pk26P3o7j3J21K62l25J0P2j0J66j17K09l14j1J16k11
$$ -247 -62 133 20 114 188 75 68 -158 -85 -152 -165 -44 218 -107 -97 -25 -35 131 14 223 -91 -102 14 -197
4427a97K37j30k39M34J20l77Q2J38n4P1j42j5J98l24O4O3J47j84J59m8p3J19P8
$$ -197 40 -90 -329 105 225 -152 -70 68 14 85 -57 -72 126 -198 -134 -71 76 -108 51 3 -70 49 127
4450A27J63m88P0M12k7l70K26k23r1K14J35q1L1j24P3Q4j15K01r8j95Kl5P3J64
$$ 127 290 -198 -128 284 257 -113 113 -110 -201 13 148 67 98 -26 47 131 16 217 119 -76 -74 -109 -36 128
4474A28q1M8q0mJ53l86J43J33l4K56k65p5q4L58k82l1P3J61k84L2K37j9Q9k23
$$ 128 47 95 15 11 164 -222 -79 54 20 276 11 -64 -148 210 -72 -103 -30 131 -153 -121 116 97 186 -37
4498c7J06k32J46J05j1%r1k4J97l21pL80j96R6k40N2J64j43j00k4j09N74l08k51
$$ -37 69 -163 -17 88 77 77 -14 -38 159 -162 -169 211 15 111 -129 -77 87 -56 -156 -180 -289 285 -23 -274
4522b74J98N7kJ6J50P0k44J84j02j60K44k58K75k36M87l94K2qJ55l88L30k32j36
$$ -274 -76 -19 -21 -5 145 215 -29 155 53 -107 137 -121 154 -82 405 11 33 25 180 -208 122 -110 -246
4545b46K95QJ22k62J63kk65J20n3j4K01p9K4p5l2p5K49K5j10R4N1l6k49J19RK55
$$ -246 49 57 179 -83 80 78 -187 -67 -120 -134 67 -12 12 -63 -95 -170 79 104 -6 88 139 103 -146 -27 -18 237
4571B37k53j24K3K45o9LR9q5l3j24L9J87J18k22J37k20N5j16K92q7j53Q4j93M83
$$ 237 -16 -140 -117 128 59 62 161 76 43 -81 -42 145 263 41 178 -42 13 -103 189 102 -51 33 -160 323
4595C23l94j3R9O2j47K41k3J3j62k52J66J63m8j73K26J1k02j73L71j51J32j1j96
$$ 323 -71 -84 15 77 -70 171 148 161 -1 -253 -87 76 28 -145 81 92 -110 -283 88 -63 69 58 -138
4618a38J76j50OR8J69j12NJ33J05m07J74j99qK09k5q9J13r3Rp5K96k12Q6j72R9
$$ -138 38 -112 -106 -8 161 49 54 187 292 -115 59 -140 -148 61 36 -53 60 -33 -24 -99 197 -15 71 -101 -2
4643bJ1j42L38l67K37RR3j52j97L13k17K26k46l7K03p8J36j42N4J07k84K96k06
$$ -2 9 -133 205 -162 75 84 177 25 -172 141 -76 150 -96 -133 70 -8 128 -14 40 147 -137 159 -47
4666d7j6j17O1J58R4l5j62r4J08M09k14l74L92m08K23R4K1j28rj14J5J06k07J47
$$ -47 -63 -180 -119 39 133 98 -64 -158 -50 359 145 -229 163 -245 -22 72 93 -35 -44 -158 -143 -37 -244 -97
4690i7j8K5J59p2R2k15K24J40l13K21o0j00p7J40l0j31p9L17j58N4q4m4J79j90
$$ -97 -115 -90 69 -3 89 -126 98 238 -75 146 86 -14 -91 49 19 -112 -191 126 -32 22 -62 -106 73 -117
4714a17J20M7j03j72J17L88n35L78O8J1k46J27j3k15K22k08Q6j57J31n4K34j59
$$ -117 3 50 -53 -225 -108 280 -255 123 191 202 -44 83 70 -145 77 -131 -45 -202 -71 -125 109 -50
4736e0K02j37j99L11l28J3K48k30l2L07n4L9j15j38J56j18J26mq8k0J91k98M9
$$ -50 152 15 -184 127 -201 -188 60 -170 -202 105 51 90 -25 -163 -7 -125 1 -3 -91 -111 80 -218 -169
4759a69J67k36P4L05l81K47J19j98n4J54K34m44L12Qq4m5K8M7r7J97j60L1r0J0
$$ -169 -2 -238 -164 141 -240 7 126 -72 -126 28 262 -182 130 138 54 9 37 84 -13 184 24 55 -35 -25
4783b5K77k86J17M3J08k18j23K75j36J33k55Q4J21k00K64m90J86O5L12l50J57
$$ -25 252 -34 83 126 234 16 -107 168 32 165 -90 -6 115 -85 179 -311 -125 -60 252 -98 59
4804E9r1J2O8p2Q6j00R7k09K05j56o1K66k68M75l88K9l2P6k76N26j70Q0J85m09
$$ 59 -32 -20 48 -24 62 -38 59 -150 55 -101 -162 104 -164 311 -77 -48 -80 -4 -280 246 76 156 341 -68
4828f8J48q5k23K70j37R0J11p0j3k34P6N3K39m24K00K49m52M24p2o3J82j43K30
$$ -68 80 -5 -228 42 -95 -5 106 36 23 -211 -135 -82 157 -267 -67 182 -270 154 82 19 201 58 288
4851B88l82J16j37L72k71N3j64J81k60J32O5R7j11K55l06J73j49K62o5k06M3k04
$$ 288 -94 22 -115 257 -14 39 -125 56 -204 -72 -7 90 -21 234 -72 101 -48 214 149 -57 -14 -218
4873b18J38jr0M98l65R8j32J16n3N6p1K29l78J71R2Pl0r3J36l11J49P1%Lj47L23
$$ -218 -80 -81 -171 327 -38 60 -72 44 -9 47 -24 205 -173 -2 90 97 67 -26 110 -201 -52 19 19 22 -125 198
4899A98j41p0L6r7J66Q4k82K01L7j86J02q1O0k6R1J67m11J22q0J30j21P5l01L95
$$ 198 57 -13 23 -74 92 176 -106 95 132 -54 48 -33 27 1 92 259 -152 -30 -110 20 -101 -26 -327 68
4923F8j28J87rr0J07k54QP5k26L57N3r7j23O8k53J38K88k11J51m03M43l51L85
$$ 68 -60 127 118 28 135 -119 -111 -36 -262 95 148 51 -72 -4 -257 -119 169 -42 109 -294 149 -202 183
4946A83L7j49n48P39j88l31L13j20N1o5K55k72J10N3l13J72K88k16P6j66L4j37
$$ 183 220 71 -477 262 74 -257 56 -64 -13 -78 177 -95 15 68 -245 -73 215 -1 75 -91 -57 -194
4968a94K45m6p3Rm0J49j93M55n79J93j29M0K52Jj13J77n8l01J88J07j15n6K36
$$ -194 51 5 -68 -59 -99 50 -143 312 -267 -74 -203 -163 89 90 -23 154 96 -205 -17 90 -25 -81 155
4991A55M5k97J65o3J20k93K05k1o5J89l82L04k51J45L46j63k06o7K66K69m22j71
$$ 155 200 -97 68 5 125 -168 37 16 -49 140 -242 62 -189 -44 302 139 -67 -134 132 401 -21 -192
5013a92J24Q1J06k5O2p2O2n2j19L9q9L58l36K38l73M9M2K41j47L3k8JJ68J18m39
$$ -192 -68 13 119 94 156 84 146 94 -25 14 -75 283 -53 185 -188 -139 -97 144 -3 30 2 3 171 289 -150
5038a50Q9om2L22l91oJ39J45j39L03k19p5j40M6K5p1J73P2j32l5n5J58R6l5r3
$$ -150 -61 -67 -109 213 -178 -184 -45 100 -39 264 45 -30 -170 -124 -99 -170 3 75 -57 -92 -147 11 107 72 -21
5063b1J65J25j62j40j60N21j80k11J62k48%J40l08L84n1m5l3Q0o2K41j82M4o2
$$ -21 144 269 107 -33 -193 328 148 -63 99 -149 -149 -9 -317 67 16 -29 -62 18 -44 197 15 59 -3
5086cj61J21k49J59K11J3n7o6K33k02R6P7k59l7j83L60km7Pk72K58r6J87j30l5
$$ -3 -164 -43 -292 -133 78 91 34 -32 201 -1 95 172 -87 -124 -307 53 51 4 11 -261 -3 -99 88 -42 -77
5111g7r5N3m6k5L47l23L18j72K23q6j5j84J65j03J15O1j33l30N58j37J1q8k09
$$ -77 -172 -119 -165 -190 157 -166 152 -20 203 117 102 -82 83 -20 95 156 23 -307 251 114 125 37 -172
5134a72L9K50p9j99K6P8qp6K91j18L4Rq3l4j9N0P6R9k56P5j29PK00J42k36J31
$$ -172 -133 117 38 -161 -135 -57 -65 -141 150 32 66 75 -8 -42 -61 -11 65 164 -92 -17 -146 -139 61 203 -33 98
5160I8j28p2K0M8r3J04K7J85l65K70k17J57j15J07l3K4R1l09J18J3M9J2k74K3
$$ 98 -30 -102 -82 -34 -127 -23 4 189 -176 94 -123 34 -81 26 -7 17 108 -201 -83 -70 -21 -9 -283 -260
5184b60K71qMj02l8M28j29p2j84JJ51m4K27k78r7L73on84K92K93j87N6j08R5J07
$$ -260 11 3 7 -95 -133 295 166 94 -90 -89 62 18 245 -33 -130 243 237 -347 -55 238 51 107 -1 94 201
5209B01j10j23p8N4R2j3J3R3p9L2q1k35K99%k48J84M3k6J54j85N5p0J80j92o0
$$ 201 91 -32 -110 -56 36 23 36 129 50 82 1 -234 65 65 -183 1 44 18 172 -13 42 -28 152 -40 -100
5234a00m9kL7N1M2L6K32j56O8k04O2k9P0J8n6K7M7n9r7j6J56p1j67L08qj27K53
$$ -100 -149 -151 -114 -63 -21 15 247 91 159 -45 17 -12 58 76 20 47 94 35 -62 -78 78 7 -160 148 140 13 266
5261B66j46K2N3k22j85K25k6l4O4r6r6K17Q7j71J0l4J47J36m57J32M0P0k43M08
$$ 266 120 142 195 -27 -212 13 -13 -47 17 -79 -175 42 129 -42 -32 -66 81 217 -240 -108 -68 2 -241 167
5285A67r2J11j26J34O6l21K28j75P2N2j22j42L16k37M3j25J24j54Q8P9j29K44
$$ 167 75 186 60 194 260 -61 167 -8 64 116 -6 -148 168 -69 -26 -151 -27 -181 -93 -14 -143 101
5307A01J40l82J64K0%j55P0K68j17k66K97P6l90J47K2o1l0K72m11J2K0K27j16
$$ 101 241 -141 23 43 43 -112 -42 226 109 -157 140 216 -174 -27 -5 -66 -96 176 -235 -223 -203 24 -92
5330i2q5K30K8j95P9L0J62k1l18J33K51k81R4J54p5J4j01p7J95L3%j26k59JJ2
$$ -92 -177 53 81 -114 -35 -5 157 136 -182 -49 202 -79 15 169 94 108 7 -70 125 158 158 32 -227 -226 -214
5355b14L74k66N7j98K90j39r9J3J52J66k02J86l8j14m3K14j89J00J12%n7j49m9
$$ -214 160 -106 -49 -247 43 -96 -195 -182 -30 136 -66 120 82 -32 -75 139 -50 50 162 162 105 -44 -93
5378i3k5L74j41l01L88j0k95j86M51k92L13J60m25Q3k83M53j78n2m7R4P8K04j57
$$ -93 -118 256 115 -186 202 192 -103 -289 162 -130 183 343 -82 1 -282 171 -7 -59 -106 -12 66 270 113
5401A13m9j13R0J50k71J57j45Q0L6o6p5j7K02N1j55J45j58l90J92J33j15L06J43
$$ 113 64 -49 41 191 -80 77 -68 12 48 -18 -93 -110 92 143 -12 133 -25 -415 -223 -90 -205 101 244
5424B44j39j87L24k5m42R1m5K09J35j21r0K54j98l38J96K8J57j78J05R1M9p1J60
$$ 244 105 -82 242 217 -225 -134 -179 30 165 44 -46 208 10 -328 -132 -104 53 -125 -20 71 120 49 209
5447B09p2j35J52L2p5M6k75M4P5k9J54j23J5Q1q3k39P8K06j70L17l4k74L9K45
$$ 209 137 2 154 186 111 157 -118 -74 1 -28 126 3 18 99 16 -223 -145 61 -109 208 174 -100 -61 184
5471A84k67P0j28k1M7L67k64r3J06q5M7N9j74mK81j33m2m9Q7O3j57j14K15J05
$$ 184 -83 -13 -141 -162 -115 252 -12 -105 1 -84 -37 22 -152 -156 125 -8 -50 -99 -12 51 -106 -220 -5 100
5495A00K0j77J31k49J94j00J02o1k8K12m04N3l1K21n8j40J09K40o6j23K6J46j88
$$ 100 120 -57 74 -175 19 -81 21 -40 -68 144 -260 -207 -238 -17 -75 -215 -106 134 68 -55 -29 117 -71
5518g1L09j0m58K77n8J00n4j71K36n0j13R5Q6j27j63K02r8J25K3o1n5K5J76j46
$$ -71 238 228 -230 47 -11 89 35 -136 100 50 -63 32 118 -9 -172 30 -68 57 80 19 -36 -11 165 19
5542A9K88k97k0p9J59k6J32j14Q5k36J65Q6l58J07J36j90K02n3J23j06r7J82j47
$$ 19 307 10 -10 -89 70 44 176 62 147 -89 76 162 -196 -89 47 -143 59 6 129 23 -74 108 -39
5565c9J49k22J09K14k40m2j71J08K89k28P5K33j22p5j67J44o9K24k58K39rj51
$$ -39 110 -112 -3 211 -29 -71 -242 -134 155 -73 2 235 113 38 -129 15 -54 170 -88 151 142 -9
5587iK6N5J49Kk13r7L78j25r8NN9k56L0k40L30o4k2QJ25K08l79L50J6l70p5J21
$$ -9 17 72 221 223 10 -87 291 166 68 73 132 -124 -94 -334 -4 -68 -90 -82 43 251 -128 222 238 -132 -207 -86
5613h6J76r2J05k1jj46n4P3j51J82L4M4O8j74j34k6Q9OL41Jl82L90k47k6k5j18
$$ -86 90 -2 103 82 81 -65 -119 -46 -197 -15 19 63 131 -43 -177 -203 -114 -108 233 234 -148 242 -5 -31 -56 -174
5639a74J21R3o7J48o6q1J31o6J01j37m5K06j6m57N01k29J10j30J05p4l5J45j41
$$ -174 -53 40 -27 121 55 -26 105 39 140 3 -42 164 148 -309 192 -37 73 -57 48 -26 -61 84 -57
5662e7K78k71K61j81k78J46L21k7k22O4k90M28k75J54k86K79n9J6q1R4o9J92j78
$$ -57 221 -50 211 30 -248 -102 219 192 -30 34 -256 172 -103 51 -235 44 -15 1 -80 14 -55 137 -41
5685d1l47K41J18k24R0J76k2j44O4J72l2j53J29l35L09R2n3P6k51J50Pj00j23
$$ -41 -388 -147 -29 -253 -163 13 -9 -153 -89 83 51 -102 27 -308 1 93 40 116 -135 15 22 -78 -201
5708b01P2J41p2J33o1q9K5J0J0J22O5k7l09k41K90R6rJ33K8k97o8K32q8K06m09
$$ -201 -129 12 -60 73 12 -77 -52 -42 -32 90 155 128 -181 -422 -132 -36 -45 88 116 -181 -249 -17 -105 101 -308
5733c08J11K50k73J98J41l27J61J89k51L7J71j17J29j46j83K76p3r2J67J53L6
$$ -308 -197 53 -220 -22 119 -208 -47 142 -109 -72 99 -18 111 -35 -218 58 -15 -107 60 213 249
5754B49l22m5R5M4j27J24L32l04k9K0j66L4J67k05J13Q3N9k77L73j59JO5J2N3
$$ 249 -73 -118 -23 21 -106 18 350 46 17 37 -129 -95 72 -133 -20 63 122 -155 218 59 60 125 137 190
5778A90k58kJ37j32j96L12n1j88j36L45l8J9l9J82n7Rk9K2k55M02p9K5j34l83
$$ 190 -68 -70 67 -65 -261 51 0 -188 -324 21 -17 2 -37 145 88 97 68 90 -165 237 158 183 49 -334
5802c34K20J71o1j36K52K9j64K08m02J1J97l8J46K27n38o9K96k2N2m0oL0k5P1
$$ -334 -114 57 -4 -140 112 141 -23 185 -217 -206 -9 -47 99 326 -212 -281 15 -7 45 5 -1 29 4 75
5826G5j79J68j0n4M5LO1Rk41K82n0l76P2J18K4N9lj55N20l57k61L76J17k98j19
$$ 75 -104 64 54 0 45 48 109 118 -123 159 109 -267 -195 -77 -53 6 3 -152 368 11 -250 126 243 -55 -174
5851a74L5K64N5j36R5p3j30K09k62Q8P0l06K11q5R8K09l66K61j52j76J61J56q8
$$ -174 -139 125 180 44 139 66 -64 145 -117 -29 41 -265 -54 -139 -41 168 -198 63 -89 -265 -104 52 -36
5874c6r4J71k59M26m0j55Q2l2k27J28K43l17K67Q2m23P2m1L49j57l42K23L02j59
$$ -36 -130 41 -218 208 168 13 95 63 -164 -36 207 -110 157 239 -184 -112 -153 196 39 -303 -80 222 63
5897F3j35J04P5O8j26j19N9j39K80k15K64k13K9N4k45N77j94ok18Q1j82L01j50
$$ 63 -72 32 107 175 49 -70 -11 -150 130 -85 179 -34 -5 49 -196 381 187 181 -37 44 -138 163 13
5920A3j52J82j32K15k3k1L1m9p7j35P4K37k58K93l53L4Q5M5l8L1n1J10k71K0K54
$$ 13 -139 43 -89 126 103 82 113 64 -13 -148 -74 163 -95 198 -155 -121 -36 9 -29 2 -49 61 -210 -190 64
5945F4j00J42l4n4J09l12N9J55m02M02J37j7j1j43K3o7j42J95Q6Nj23J67P1o0
$$ 64 -36 106 72 18 127 -185 -126 29 -373 29 166 149 138 -5 18 -49 -191 4 90 95 -28 139 210 150
5969A50L9L5k00J2qq9J09j92J99o6j06L25j93n1j5J97l09K12L23n07J49J8j10
$$ 150 189 224 24 36 28 -61 48 -144 55 -11 -117 208 15 -36 -51 146 -163 49 372 -135 14 32 -78
5992g8K21k35n3K99j60J47P5l19N7N6j54Q0N5j14M0J48k16J95J28l12K09n9l26
$$ -78 143 -92 -145 154 -6 141 216 -103 -46 10 -144 -64 -9 -123 -83 65 -151 44 172 -140 69 10 -316
6015c16K02J44j89J7K49n4j93K92l42P5Q1k35M74m99L74j34K19k8K7j50K7P7p6
$$ -316 -114 30 -159 -142 107 53 -140 152 -190 -115 -34 -269 205 -294 80 -54 165 137 164 14 41 118 42
6038D2j27K7n5K2K24l05J32j00j26O50l13j96K34j10Q7oj08J45j32k02J64J14
$$ 42 -85 -58 -113 -91 133 -172 -40 -140 -266 384 71 -125 109 -1 86 80 -28 117 -15 -217 -53 61
6060F1o1j00K8Q5p8J76l7j65j15J84j62K40j32j52O7K12l2j34j9L49q3N1Mk24
$$ 61 0 -100 -72 13 -65 111 74 -91 -206 -22 -184 56 -76 -228 -161 51 19 -115 -134 215 132 183 187 -37
6084c7P3k23Q6k9J71K2Q1N1j8j7j50r0K58J3l66J69kL3N3k44K96o6k8nq6J85o1
$$ -37 36 -187 -101 -130 41 63 144 195 177 160 10 -80 178 191 -175 -6 -8 25 78 -166 130 64 36 31 -55 130 69
6111F9n2J7j06L24k09J16P0j52j49k3K56j77k37K56o7l4j73K74J09m9J0NJ30j37
$$ 69 17 34 -72 252 43 159 229 77 -72 -95 161 -16 -253 3 -64 -98 -271 3 112 63 73 78 208 71
6135G1pm16K19K75m8j35J34r9L4J11j01q7Km3k12M22l27J18N1j37K37j22M5J55
$$ 71 64 -352 -133 142 94 -41 93 -6 28 139 38 -49 -47 -90 -302 120 -207 -89 -38 -175 62 -60 -15 140
6159A40j91j8r9R0M0N1J56k88j03M42k42k60K18k2K56m56L29L3n40M59l6J48n2
$$ 140 -51 -69 -168 -78 -38 13 169 -119 -222 220 -22 -282 -64 -86 170 -286 43 76 -464 -5 -41 107 55
6182E5K4k22M1O7K47j28j94j04J80J90k98K30l6N3m35L32j08mJ9MJ08j99J56M4
$$ 55 79 -143 -102 -35 212 84 -110 -214 -34 156 -142 88 52 105 -330 2 -106 -110 -91 -87 21 -178 -22 22
6206B2K1K60m37J5ko6M29m64L48l27L46r3lR3J16l13J34k85j79L54J44l91M30
$$ 22 43 303 -134 -119 -121 -187 242 -222 126 -201 145 52 49 142 258 -55 79 -206 -385 -31 113 -278 152
6229A52q4j82J26l1k7j50K93j07J65j63M9M1Qj01M25n67L9J42k49qn0J99k58K78
$$ 152 68 -114 12 -19 -46 -196 97 -10 155 -8 41 82 90 -11 414 -153 -114 28 -221 -229 -279 -80 -338 -60
6253f0M3r2J80O9l22N5oJ46J18P7k56K82q2k90L72l02J12l3O7j08l26M29j22K39
$$ -60 -17 -109 71 140 -182 -127 -133 13 131 208 -48 234 152 -138 234 -68 44 11 78 -30 -356 73 -49 190
6277A90j35j15K0J95k02J83q2j26m4m5K68LLj35P6P7m20L62p6k31M81j46k92K59
$$ 190 55 -60 -40 155 -47 136 54 -72 -116 -161 107 110 113 -22 54 131 -289 73 -3 -234 247 101 -191 68
6301F8J23jl06J2K42l0k5K99k83k19K71l09M4J56J0m5K2j02j16K40L5o2M3o7m6
$$ 68 191 190 -116 -104 138 108 83 382 99 -120 151 -158 -114 42 52 7 29 -73 -189 51 86 24 67 0 -46
6326d6l8Q6o5L46k55O6j92k3L18k43J52Mm8j43K01j91k34J42K88l52L5L79j29
$$ -46 -84 2 -63 283 28 94 -98 -121 197 -46 106 110 62 -81 120 -71 -305 -163 125 -227 -192 187 58
6349E8O4l4j22o3J63j08k40L99N1j40j71J4M22k82J46q0n6J18j73o8J5j48J92
$$ 58 122 88 -34 -97 66 -42 -282 117 168 28 -143 -129 293 11 157 77 21 139 -34 -102 -87 -235 -43
6372d3J53J07j98J23l40K2K74j43j15M19j41k66K05k03j00J99k6K21l93q2L78
$$ -43 110 217 19 142 -198 -176 98 -45 -160 259 118 -148 57 -146 -246 -47 -73 148 -245 -327 51
6393E1j2p9K32j69l37L11m1J58q3j10n8p7K2K26J83k01J71j97N6K02k18%l8k43
$$ 51 39 -40 192 23 -314 -3 -44 114 31 -79 -137 -214 -192 34 217 16 187 -10 46 248 30 30 -8 -251
6417b51J82j14m0J93K17p8k11P0N2l16n9M59Nq9J18j83Q2o1J4j14k1K8J30jj08
$$ -251 -69 -183 -223 -30 187 109 -102 -32 20 -296 -355 104 109 20 138 -45 37 -24 -10 -124 -145 -117 13 12 -96
6442i6J02K79o26L52J5KK5l62L25J27m8L73o86K43k21l5K70j27K03K7j67M0P1
$$ -96 6 285 -341 11 26 28 53 -309 16 143 95 468 -218 25 -196 -231 39 -88 115 142 -25 15 86
6465H6k02J85K25o57L77J92j80j90Q7M7l7R3l7K72k59j27J82J43l50J95j24J9
$$ 86 -116 69 294 -363 14 206 26 -164 -77 -30 -67 26 -11 261 2 -125 57 200 -150 45 -79 -60
6487f0N44o12j07K70j53K04J49j55N0r8k83K02r5J93L08j47l56k2R8m4J50J5k0
$$ -60 484 -128 -235 35 -118 86 235 80 130 32 -251 -49 -144 49 357 210 -146 -168 -70 -114 36 51 31
6510C1k61M6J93J11j87J00p4j25P2l8N7K24k64J41Q8k57J43KK01l20K37J32m48
$$ 31 -230 -184 9 120 -67 33 -41 -166 -94 -132 -75 149 -115 26 114 -143 0 2 203 -117 120 252 -196
6533a96J12l6J22J13l98L20k12L04m24L38r5L7N1j89J25j49K52P0k20K4J73j29
$$ -196 -84 -120 2 115 -283 37 -175 129 -295 43 -52 -15 36 -153 -28 -177 75 145 -75 -51 122 -7
6555gJ60j67j33M72m55J28N3j50N9p5J28Q6J3j3J00j11q9j24L24l82J05K99l88
$$ -7 153 -14 -147 325 -130 -2 51 -99 -40 -115 13 99 112 99 199 88 -1 -125 199 -183 -78 221 -167
6578a67K9L86p17L63J5J89L0m2j15J50j46K0j29K13k1k0o0K2P9L1r0p9k8o7K87
$$ -167 -138 248 -469 -106 -91 98 128 86 -29 121 -25 -5 -134 79 58 38 -22 0 79 110 20 -59 -87 -154 133
6603A33j51j89L12l29K28L3M7J85o8l01P8L2r1K18j46J91Rk78J14Q2j31j32J11
$$ 133 -18 -207 105 -224 4 37 84 269 201 -100 -22 10 -81 137 -9 182 191 -87 27 109 -22 -154 -43
6626d3L09l03J37l23J11J62Q0l52J82k9j63L94l81L16o3j68O2k13J55P0j61J06
$$ -43 266 -37 100 -223 -112 50 130 -222 -40 -69 -232 162 -219 97 34 -134 -72 -285 -130 -60 -221 -115
6648a15J11K14oj02P6o4j50J99m0k38K09k7j3n8J03j98m4J5L04j73N8l07J81J65
$$ -115 -4 210 204 102 178 114 -36 163 123 -115 94 67 54 -4 99 -99 -143 -128 176 3 61 -246 -65 100
6672A00k06J61Q1j86Q3J07k84L01k02j15P4K97l22J85l4m9P6k94J42N5j20J25
$$ 100 -106 55 136 -50 33 140 -144 157 -45 -160 -86 211 -111 74 40 -9 67 -227 -85 -30 -150 -25
6694b5oj22K81J26l43J24K99k40jq0p8L52j52k46L16k26Q6l06M67j50J05j82m5
$$ -25 -31 -153 128 254 -89 35 334 94 93 13 -65 287 135 -111 205 -21 65 -241 226 76 181 -1 -46
6717d6N7J23R9m8j36k52M63k26m85M96j36j27L65r9k57J64nJL83l71R1r0K0m8
$$ -46 11 134 233 185 49 -203 260 34 -451 45 -91 -218 147 48 -209 -45 -50 -49 334 -37 54 -36 -16 -64
6741f4j11o2N8K30m3M2J15q7k9j90K94k19K09l28O7R3L24k14q9j81N9K76k05J46
$$ -64 -175 -237 -179 51 8 50 165 78 49 -141 153 -66 143 -185 -118 -25 299 85 -4 -185 -126 150 -55 91
6765I1j90L16m32P0K55k63J8L43J73k89q7O0K25k79j02J29krj72N5J12p9k22Q5
$$ 91 -99 217 -215 -145 110 -153 -135 208 381 92 5 65 290 11 -91 38 36 27 -145 -90 22 -57 -279 -194
6789a94L14j67K82KJ00n24J42N0k0L03k98J9p3K40m2k82RK92J17l87Q5m8O2q2
$$ -194 120 -47 235 237 337 -187 -45 5 -15 288 -10 9 -64 176 134 -148 -139 153 270 -117 -32 -80 -18 -100
6813a00l9J92j64l0m4L25m01N24l62L83k80L5k05J08o2K25l36L67k63J50K56m95
$$ -100 -139 53 -111 -141 -185 140 -261 263 -99 284 4 39 -166 -58 -120 105 -231 136 -127 23 279 -216
6835b16J51J18L31k09k11o0j10O6m0K03j5K27j58q3N8k53J52l6J09j94L42k69
$$ -216 -65 53 384 175 -36 -96 -206 -140 -180 23 8 235 77 -6 52 -201 -49 -85 24 -170 172 -97
6857i7J02qL7j87J25J52j57J45k90K68k14L39n35N35k38r0j8J46j18q5M45k16
$$ -97 5 -3 34 -153 -28 124 -33 112 -178 90 -124 215 -320 215 -23 -113 -131 15 -103 -188 257 41
6879D1J18j46n6K16kj72k13O7r5Q3K40J44j65MM1m3r4M8k09L16j25j11J75j98
$$ 41 159 13 -43 173 171 -1 -214 -147 -242 -159 81 225 60 64 105 62 -32 16 -193 123 -2 -113 62 -136
6903a36L90m21K01J29j38n1r8J06q5K51k59J96Q8r0k47K00l0j08J20o6L59l49
$$ -136 254 -167 34 163 25 -26 -124 -18 -103 148 -111 85 173 83 -164 36 6 -102 18 -48 311 -38
6925c8j24J3O7o9L1O2o6J47J13l6K28j17m52K96j92L91j67j15K0j85K55jj74j98
$$ -38 -162 -149 -82 -151 -120 -58 -124 23 136 100 328 211 -241 55 -137 254 87 -28 -8 -193 62 61 -113 -311
6949c11L41l52J12K81O4j90J45r7m8J9J27l5Q1j43m2P8L7j14J36j6k18M00j03
$$ -311 30 -322 -210 71 135 -55 90 -7 -55 -36 91 56 137 -6 -48 30 67 -47 89 73 -145 255 152
6972A52k55M17j27j23k12J46n4K1K0k0K11k90J45j47L07lk67J13O6j58O5m4L6
$$ 152 -103 314 187 64 -148 -2 -56 -35 -15 -35 176 -114 31 -116 191 188 -79 34 100 -58 7 -37 -1
6995aj18j80N35l29K4j75PK31m1J38k09J66J53k43n6K57m04L47k08j77L55o6J3
$$ -1 -119 -299 236 -93 -69 -244 -237 -6 -47 91 -118 48 201 -42 -98 159 -245 102 -106 -283 72 6 19
7018A9N5j47j9p0J07n8J93lQM9n4O3j27k03J53K24k89J30j19j4L05n17K0N13l27
$$ 19 74 -73 -92 -162 -55 -113 80 77 85 134 80 143 16 -187 -34 190 -99 31 -88 -102 203 -314 -294 219 -108
7043a08k35N23j67J76k0j90K2Q7M4n22O45l06J8J21j0l55J78Q5K53k43m6N2j11
$$ -108 -343 180 13 189 169 -21 1 88 132 -390 255 -51 -33 88 78 -277 -99 -14 239 -4 -50 2 -109
7066a09K20k24K32k7q9j28K16M7r3Q9j35j74J07J45j79N1K01j81J96k82ML54l49
$$ -109 111 -113 119 92 3 -125 91 138 45 134 -1 -175 -68 77 -102 -51 150 -31 165 -117 -113 241 -108
7089a08J94M3o8o7j06J56P9q3k03J3J84k10J63K0Q9p8q2o3K43k01K42r0j72R6
$$ -108 86 129 61 -6 -112 44 123 40 -163 -150 34 -176 -13 7 96 18 -64 -127 116 -85 157 67 -105 -9
7113iJ62j95K58j25Mj21J34k23l5K36j7j95K09r4n6L7j8J45k50L31nj26j71J90
$$ -9 153 -42 216 91 95 -26 108 -115 -150 86 69 -126 83 -11 -67 -30 -48 97 -153 178 173 47 -124 66
7137F6lp1l8J34j52N9j02Q4K5m6j3J51j51J50k3l1L1j85J94Q1J02l72J55M8l23
$$ 66 63 -8 -46 88 -64 -5 -107 -23 2 -44 -57 94 -57 93 70 39 70 -115 79 160 262 -110 45 93 -230
7162b30J08O7K47o3k74jJ47j0J14M1k14M3M44n19J60j11J75j73J55L2j50J68m27
$$ -230 -122 -55 192 129 -145 -146 1 -9 105 146 -68 -25 419 -100 60 -51 124 -49 106 138 -12 156 -271
7185b71K67l31K85L9J06k08J54k26L00R3k51L18l7n05K33rK54l64L12mj7j10j45
$$ -271 -4 -335 -50 -11 95 -113 41 -185 115 208 -43 275 238 -267 -34 -43 211 -153 159 155 138 28 -117
7208a17L22k26K23l54J42j57Q0J22M1j15p7K73k81J30m5K37j85k30M45j98j39
$$ -117 205 -21 202 -152 -10 -167 -87 35 76 -39 -116 157 -124 6 -39 198 13 -217 228 30 -109
7229a09J12N9j77K44ll9o0o7P4n5O3p4J28J50k56k90L92k6k31N01k51Q0k93J75
$$ -109 3 62 -115 129 126 87 27 -40 34 -21 42 -32 96 246 -10 -300 92 66 -165 336 85 165 -128 47
7253D7R4l89L22K5N8j12J45m06K16N0j39J00k7L0k12K42Q0kJ39k45k7M9j83N4
$$ 47 141 -248 74 99 157 45 190 -216 0 50 -89 11 -16 14 -198 44 124 122 261 16 -11 38 -145 -91
7277i1J68j44K9L01l73K82j42j16J1M16l34Ok19N8J64k49L44j11j10K73k01j48
$$ -91 77 -67 -38 263 -110 172 30 -86 -75 341 7 13 -206 -148 16 -233 111 0 -110 163 -38 -186
7299a86L47r6k34J99j19Q4L6R4j03Q8k52L32k48J07Kpq4k4K04m54L55J46k56J51
$$ -186 161 65 -169 30 -89 -5 31 125 22 110 -142 190 -58 49 51 44 -40 -64 140 -314 41 187 -69 82
7323H2q5K27l26n1O6j92K17K9rj21J85P2m3j08n8L2J88o3J6J2K64j22j77j64P9
$$ 82 -3 224 -102 -153 -87 -279 -62 -33 -42 -163 22 94 51 -57 -115 -83 105 42 58 70 334 212 35 -129 -50
7348e0k0M0Kk44K13L0J39j83J56k40K55o9M0k0k54J57K1K2L0k9O0j87K37j28j6
$$ -50 -70 -30 -28 -272 -59 -29 110 -73 83 -157 98 29 69 49 -205 -48 -27 -5 25 -4 56 -131 106 -22 -38
7373c8j96K79O1k88J94k2m3J2J66m02K30k32L67k4j38k74K38K70j52j72L01r9
$$ -38 -234 45 106 -182 12 -10 -53 -41 125 -277 -47 -279 88 64 -74 -348 -110 160 8 -164 137 38
7395C8j54L9K17%r8K0L5p4J80l11L17l90N8K90j44q3k6M4q7K23k11j55L19N0J13
$$ 38 -116 -77 140 140 42 62 97 23 203 -108 209 -181 -123 167 23 -60 -86 -42 -129 94 -117 -272 47 97 210
7420B10k18J51k65K06J63l15J3K67m02J51J42j49j27J55r0L67k68J07k9j86j92
$$ 210 -8 143 -122 84 247 -68 -55 212 -190 -39 103 -46 -173 -18 -108 259 -9 98 69 -117 -309
7441c09J48K75mk42J34j44N3P5J47j97l06L49j89L06r0l5m2M12k50r2n3K4K9n9
$$ -309 -161 114 110 -132 2 -142 -89 -14 133 -64 -370 -21 -210 96 6 -29 -71 341 91 -1 -54 -30 -1 -60
7465f0P4n6K65l7k36J95k83R3P4J49l29K81j84J65k36L17l77J73Rr3J63P0Or5
$$ -60 14 -42 223 186 -50 145 -138 -45 29 178 -151 130 -54 111 -125 192 -185 -12 -3 -96 67 137 143 48
7489D8L8J15n15J26J76J48o5j04P8J44k42J34K30j76j96O1J85j04p2J16n4r6n0
$$ 48 86 201 -314 -188 -12 136 71 -33 45 189 -53 81 311 135 -61 0 185 81 9 125 71 -25 -75
7512g5J45l59L10Q3l22K76j66Q7j52k5K24m11L49j84L87k42O9r4j21kK90K33j99
$$ -75 70 -289 21 104 -218 58 -108 -21 -173 -198 26 -385 -36 -220 167 -75 -6 -100 -221 -223 67 300 101
7535A01k44J83k4l29M15K2r2j06J23L6Q7j3l88K89J68k22j8Q9j7j89L5K55j43
$$ 101 -143 40 16 -313 102 124 32 -74 49 85 172 159 -229 60 228 6 -12 77 60 -129 -94 161 18
7558A8j71R1k47J61P9J27k0j89n2J51K29m06K57J43k7j68K82k6k60J5J9K6L8L1
$$ 18 -153 -62 -309 -148 -69 58 38 -151 -203 -52 177 -229 28 171 144 -24 258 232 -28 -13 6 32 70 101
7582A01j72K55o0O5o4j57o6j05J23j14K32J36n3j20J08j9j1N2j49N0J7l1o8%K32
$$ 101 -71 184 124 189 125 -32 -98 -203 -80 -194 38 174 121 1 109 90 79 131 -18 32 49 18 -50 -50 182
7607A82m89J72Q7j29K71k07N7K00l69Q5k0P5N5j71M12j65l5J47l67K74j25Q3m7
$$ 182 -307 -135 -48 -177 94 -113 -56 144 -225 -140 -160 -85 -30 -201 211 46 11 158 -209 65 -60 23 -24
7630b4j22J67J31l66NJ16J49kJ50n0k28J2J84N8j93M8L07j82L2j56j90K88J4m09
$$ -24 -146 21 152 -214 -209 -93 56 54 204 154 -74 -62 122 180 -13 35 342 160 192 36 -154 134 148 -261
7654b61L66r5j98J37N7J72k92J14K0L5j63M8k9L9J18k18K39j88j9j36M57k33k81
$$ -261 105 10 -188 -51 6 178 -114 0 20 55 -108 -60 -89 -50 68 -150 89 -99 -118 -254 203 -30 -311
7677c11K97M6K3l0r3J00Q0j06M1K03l54J19P7l52K76L8P4k74J01j62L05m9J75
$$ -311 -14 32 55 25 -68 32 112 6 47 250 -104 15 92 -260 16 54 128 -146 -45 -207 98 49 224
7700B24k15R2j27k80L01j77K25l1O2j46K29k47L7q6J11J3M4J8L6j99M87j70k07
$$ 224 9 101 -26 -306 -5 -182 43 12 74 -72 157 -90 -53 -139 -28 -15 29 47 83 -116 371 201 -6
7723fj08Q8J38k34J69k36L90l02J01J97l85K26j08Q8n7q8K70q7q1J16j26r0M12
$$ -6 -114 -26 112 -122 47 -189 201 -101 0 197 -188 38 -70 18 -39 -127 143 56 -25 91 -35 -125 287
7746B87k36k40J61N5j54Q0j4j40J91l8jK27kj43j8k62K78r9M0L0j13P3m8K01O7
$$ 287 51 -189 -28 27 -127 -47 -61 -201 -10 -48 -49 178 176 33 15 -247 31 -68 -28 2 -111 -38 -86 115 182
7771A82j8q9j49mo2K89k05J51j25n1j08q0L79n0j30J80Q1k15J38j44nq7K92n3
$$ 182 164 75 -74 -78 -140 149 -56 95 -30 -81 -189 -269 110 60 -70 110 191 -24 114 -30 -35 -122 170 117
7795A17n1K66m61J52l16L81m38J01K96J29Lk9j37j7l19J3K18R3M7l8NK9k44K85
$$ 117 66 332 -129 23 -293 88 -350 -249 47 176 179 150 13 -4 -323 -310 -92 1 48 10 15 44 -200 85
7819H5j48J2L0m14M28M9r3r5n8j8L27k21P4P6J90j82k50J59o8J14r2J18J0n02
$$ 85 -63 -51 -21 -435 -7 42 -51 -146 -204 -222 105 -116 -42 34 224 42 -208 -49 -117 -3 -95 23 33 -469
7843d69M44J95k04M1O3j02l5JK3J78j31OJ15q0q9K81j32J3j90K14k27J11k3p0
$$ -469 -25 170 -34 7 70 -32 -67 -66 -43 135 4 10 125 45 -44 237 105 118 -72 142 -85 26 3 -67
7867f7q4J12J95l33J87J01j71q5K28k7o8K14k77j1J54m3J33j08n0k73J56O1m1
$$ -67 -151 -39 156 -177 10 111 -60 -145 83 56 -12 202 -75 -86 68 25 158 50 0 -273 -117 -56 -97
7890i7J77j25j06M04m38J24p7L5k16K65j00R4R1l12M21k83P5K43o5j58J25j92
$$ -97 80 -45 -151 253 -185 -61 -138 -103 -319 -54 -154 -60 31 -281 140 -143 -68 175 110 -48 77 -115
7912a15K12o7j80j0J89Jl8J69L9r2O0l48K97k39M39m5m62L34k92K51N7j95k05
$$ -115 97 30 -150 -160 29 30 -8 161 200 108 168 -180 117 -122 317 272 -190 144 -148 103 160 -35 -240
7935b40L35O5m07K81k67M54l63R6R1k01L42j84K10k16l01K57N8j62K83l45L79
$$ -240 95 160 -247 34 -233 221 -142 -46 45 -156 186 2 212 -4 -305 -48 10 -152 131 -214 165
7956A65j37J80Q2j73j29n5J14j1k5J05l84L40j84J01L7p0N2M2j90L3K17k31J79
$$ 165 28 208 290 117 -12 -67 47 36 11 116 -268 72 -112 -11 26 -44 8 50 -140 -107 110 -121 58
7979E8k80L56j13K7j77M20j75j68j85J42J30j51oj5J86r5o9J86J08k50n1j26K10
$$ 58 -222 134 21 48 -129 291 116 -52 -237 -95 35 -116 -122 -137 49 -46 -115 71 179 -71 -122 -248 -38
8002c8k23M56j4k07o7j22J70K09l63q3L21j2L3k30J76n1RK70k93Qm7J05j15K17
$$ -38 -261 195 181 -26 -93 -215 -45 164 -199 -282 39 27 60 -170 6 -45 -36 234 -59 -51 -98 7 -108 109
8026A09k66J88j53K0J91j14L1P3k32M37l07o9l0K44j67M8J56q8Kj00l4N4P9m01
$$ 109 -157 31 -122 -102 89 -25 6 79 -153 284 -23 -92 -122 122 -45 3 159 71 73 -27 -61 -7 72 -329
8050c29M2L59m8m9J06j51K37l01PP2l1N3k0j55M90l19Q9J0o5j81K62n4r7J77J
$$ -329 -287 72 24 -25 81 -70 167 -134 -127 -55 -86 -33 -53 -208 282 -37 52 62 -3 -184 78 24 -73 104 105
8075A05Qq8r4J46Q0k0k92J63j36J16N9j72M0K18k46j80n8M72l38L88M8j4k11J22
$$ 105 113 25 -69 77 157 137 -155 8 -128 -12 47 -125 -85 133 -113 -293 -351 121 -217 171 219 205 -6 116
8099A16J94l96L2o4R6K38l35Q4J46j25N2m79N99k60J33m1k1r5K85j32j37J38j25
$$ 116 310 -86 -54 -118 -22 216 -119 -35 111 -14 38 -441 158 -102 31 -10 -31 -126 159 27 -110 28 -97
8122i7L9K74O5l98J9J04j99K56q9L01r1Q6l90K70m63J94O4M5R2j68O6J12j16R7
$$ -97 -58 216 281 -117 -98 6 -193 63 -26 275 184 270 -120 150 -313 -119 -55 -10 82 -86 -20 92 -24 73
8146G3n9N8j77j18K20J5k35m7K50j38J94l5p5O2l2m2K20k03j4m6K06r5J47j17
$$ 73 14 72 -105 -223 -3 12 -223 -270 -20 -158 36 1 -74 -12 -44 -86 134 -69 -83 -129 77 -18 129 12
8170A2J60o3J3j48l6J81l61N62m73k9K56j00kK06j25lk97K32m46N51k2
$$ 12 172 109 122 -26 -62 119 -242 320 -153 -182 74 -26 -28 178 53 50 -247 -15 -461 90 68
8191F8
$$ Imaginary data points
##PAGE= N=2
##DATA TABLE= (X++(I..I)), XYDATA
0@%%%%%%%%%%%%%%%qJ6j6J6j6J6k4L2l2L9m7N3o1P1q0Q9j04J19j34J51j70J90
$$ 0 0 0 0 0 0 0 0 0 0 0 0 0 0 0 0 -8 8 -8 8 -8 8 -16 16 -16 23 -24 29 -32 39 -41 48 -56 63 -71 80 -90 100
37A00k12K38k66K95l27L63m02M45m91N40n96O58p26P99q79R70j070J182j311J458
$$ 100 -112 126 -140 155 -172 191 -211 234 -257 283 -313 345 -381 418 -461 509 -561 621 -690 768
57G68j625J820k051K331k676L115l691M484n653P538j1067J9809p8211j19208
$$ 768 -857 963 -1088 1243 -1433 1682 -2009 2475 -3178 4360 -6707 13102 -65109 -184317
71a84317K20317Q5008j33410o1568P6116K4045k5911J9151K4443o1196j1840P8233
$$ -184317 36000 121008 -12402 -73970 2146 26191 280 19431 43874 -17322 -29162 49071
83D9071r658p5473K3679L8017j6200j2266j5649j1375M1170L1014l5008n3452
$$ 49071 39413 -36060 -12381 25636 9436 -2830 -18479 -29854 11316 42330 7322 -46130
95d6130J8283P0187l903n7944O982R604j8439L9050K2308o3020j7793N1726J3889
$$ -46130 -27847 42340 38437 -19507 -12525 -2921 -21360 17690 39998 -23022 -40815 10911 24800
108B4800k7094l387K2070j2123k7926L7561K6791n7978j2956N1956j1898l7762
$$ 24800 -2294 -5681 16389 4266 -23660 13901 40692 -17286 -30242 21714 9816 -27946
120b7946J2467J9161L275j1903j9398P035K6242J2258j9482l3797J9061M0443
$$ -27946 -15479 3682 6957 -4946 -24344 -17309 8933 21191 1709 -32088 -13027 27416
132B7416k7215j7647L5998k1234l6509M9124L3348n2672l0227N0175L4280n3912
$$ 27416 201 -17446 18552 -2682 -39191 9933 43281 -9391 -39618 10557 44837 -9075
144i075k6011O5843O857o7969J0353M6495j7708j8374J1167l395p606R533J4928
$$ -9075 -35086 30757 37614 -30355 -20002 26493 8785 -9589 1578 -1817 -9423 110 15038
157A5038j0635k2903J9677J9547k5914p43K2584j5666q280J3274q914j730J6006
$$ 15038 4403 -18500 1177 20724 -5190 -5933 16651 985 -7295 5979 -2935 -4665 11341
170A1341m862j7765j467K1438J2292k6267r795K2907p070o857J8879j4431k0208
$$ 11341 6479 -11286 -12753 8685 20977 -5290 -15085 7822 752 -6105 12774 -1657 -21865
183b1865K2217J1266k0535p500J5109J3133j8261j4127K5663P706k0360M827K919
$$ -21865 352 11618 -8917 -16417 -1308 11825 -6436 -20563 5100 12806 -7554 -2727 192
196A92j0512J5209N838j9173J214J0899j795l777M5Q322l261j3819J4986R911
$$ 192 -10320 4889 10727 -8446 -7232 3667 1872 -1905 -1860 6462 3201 -10618 4368 14279
210A4279k1735O371J6350k1842n643K3824q45j8235k973J5254O945j7454J383
$$ 14279 -7456 -1085 15265 -6577 -12220 11604 10759 -7476 -10449 4805 11750 -5704 -4321
223d321J7680j4424p443K1674p610j4986J4726L880j2585j704P061O593q429q240
$$ -4321 13359 -1065 -8508 13166 5556 -9430 5296 9176 -3409 -5113 1948 8541 112 -8128
237h128J1308r9p920J1855m318j6038J4259P132j5099K202P116m993l942J672
$$ -8128 3180 3081 -4839 7016 2698 -13340 919 8051 -7048 -4846 2270 -2723 -6665 -4993
251d993R079k777j4031J0559J0135j5468M211J0904j3915K86J3221o638o953M308
$$ -4993 4086 1309 -12722 -2163 7972 -7496 -3285 7619 -6296 -6010 7211 573 -6380 -2072
265b072N577Q74j0825J765J3103q715m112J1480j0081l401J6480m868j2114N235
$$ -2072 3505 4379 -6446 -4681 8422 -293 -4405 7075 -3006 -6407 10073 5205 -6909 -1674
279a674M881J478l427m767N339n12j326R173q903r891J8712J581j8551N795R611
$$ -1674 3207 4685 1258 -3509 1830 1318 -8 9165 262 -9629 9083 10664 -7887 -2092 7519
294G519m542l754r39M426o6p187P442K002j3018O934R258j2820O77P767o527M5
$$ 7519 2977 -777 -1716 2710 2644 -4543 2899 4901 -8117 -1183 8075 -4745 -4068 3699 -2828 -2783
310b783L558k564m66j554K770M151r387J745J0917j0355l069J2545o019n557Q006
$$ -2783 775 -1789 -2255 -3809 -1039 3112 -6275 -4530 6387 -3968 -7037 5508 -511 -6068 1938
325A938j273k701J123n65L043l474j954R105n956p068J4362j952j2438Q661M528
$$ 1938 665 -2036 -913 -1478 1565 -1909 -3863 5242 -714 -7782 6580 4628 -7810 851 5379
340E379o099K81N40J892J129n366M192K345p849O405L513j0475N799M832q840
$$ 5379 -720 -439 101 1993 3122 -2244 1948 4293 -3556 2849 6362 -4113 1686 6518 -2322
355b322K405M908m894k52R58J269J112p184L360P490j0030j228J0199o800l217
$$ -2322 83 4991 97 -155 803 2072 3184 -4000 -640 6850 -3180 -4408 5791 -1009 -4226
370d226P045l376j951K633j690J156j330j447N850m770m329J0231l020q178Q423
$$ -4226 2819 -557 -2508 125 -1565 -409 -1739 -3186 2664 -2106 -6435 3796 776 -7402 1021
385A021Q11n765L173j25o56J684k683K580M54m583N691J064q087O254L811r184
$$ 1021 1832 -3933 -760 -885 -1541 143 -2540 40 494 -4089 1602 2666 -5421 833 4644 -4540
401d540M369M459n663M29K107R67O26n630K736O715p718J6O888o758j37O907n490
$$ -4540 -171 4288 -1375 -946 1161 2128 2754 -2876 -140 6575 -1143 -1127 5761 -997 -1134 5773 283
418B83j353L944k324J230k07k219K929k886r10P426o501n281R964q68o764L813
$$ 283 -1070 2874 550 1780 1573 -646 2283 -603 -1513 5913 -588 -5869 4095 3227 -3537 276
434B76o60p97K711k844m26J021k371M933j209p383O770K688p827M406K201o307
$$ 276 -384 -1181 1530 -1314 -1740 -719 -3090 1843 634 -6749 21 2709 -5118 -712 1489 -4818
450d818L682K425k483j47k249L602M083p843L76O494m771N90M109o387J535N206
$$ -4818 -1136 1289 -1194 -1341 -3590 12 4095 -3748 -3372 3122 -1649 -1059 3050 -3337 -1802 3404
466C404l875J58J367j622K947k476j134N934m923k912Q206l236m068N930k263
$$ 3404 -471 -313 1054 -568 2379 -97 -1231 4703 -220 -3132 5074 1838 -2230 3700 1437
481A437k075L087k043Q41J050l954L920Q71n717M154R19m871N254r19o228N336
$$ 1437 -638 2449 406 1247 2297 -1657 2263 3134 -2583 1571 2490 -2381 2873 1954 -4274 1062
497A062K009l576m9k393K510L671n365l05L140m430L517M336q110n70N294j095
$$ 1062 3071 -505 -554 -2947 -437 3234 -2131 -2436 704 -3726 -209 4127 -3983 -4553 741 -354
513c54J049k590l468N784J179l455J672l297O86P611n139m609N190m07j71L292
$$ -354 695 -1895 -5363 421 1600 -1855 -183 -3480 -2794 4817 -322 -4931 259 -148 -319 2973
529B973m822n96L124L20K953l869o384Q793M115p560J53P90l66N573k517n229
$$ 2973 -1849 -2445 679 999 3952 83 -6301 2492 6607 -953 -800 -10 -376 5197 2680 -2549
545b549K448J101K879L75p894J736O819l447k18L2n630M560O025n338l621k87
$$ -2549 -101 1000 3879 4254 -3640 -1904 4915 1468 1250 1282 -4348 212 6237 899 -2722 -3009
561c009K991N927n089o869N048K134k1R29o891J041Q624m627m910L803N12M1o8
$$ -3009 -18 5909 820 -6049 -1001 1133 1112 2041 -4850 -3809 4815 188 -4722 -919 -407 -366 -434
578d34j850K198j474j581O683k608q437O393M904m095p79j834O59N540k653k843
$$ -434 -2284 -86 -1560 -3141 3542 934 -7503 -1110 3794 -301 -1080 -2914 -2255 3285 632 -2211
594b211K729j002J081J46l110N524M59q941M473O994n256k642K562j0J173k312
$$ -2211 518 -484 597 743 -2367 3157 3616 -5325 -852 6142 886 -1756 806 796 1969 -343
610c43P04L744m858r78N432l097j045M130m586o46M761k820j086K232j121lk121
$$ -343 361 4105 -753 -1731 3701 604 -441 3689 -897 -1543 3218 398 -688 1544 423 420 -1701
627a701j5O658l752o761N427J867k703K435k831k157M518j426r14K700k548j621
$$ -1701 -1716 4942 1190 -5571 -144 1723 -980 1455 -1376 -3533 985 -441 -1355 1345 -1203 -2824
643b824J190M04M554l522p474P682N080q533LM837j232o88j537M22M289k197j850
$$ -2824 -1634 -1230 3324 -198 -7672 10 5090 -3443 -3440 1397 165 -523 -2060 -1638 2651 454 -1396
660a396K296k833J816M165n087m5K827l873K797M501n226k695K726K751J464m977
$$ -1396 900 -1933 -117 4048 -1039 -1084 1743 -2130 667 5168 -58 -2753 -27 2724 4188 -789
676g89k249O903j325m264M087j179j908L610k810j697M159r08j851k04p07L465
$$ -789 -3038 3865 2540 -1724 2363 1184 -724 2886 76 -1621 2538 1630 -221 -425 -1132 2333
692B333r88m730M458P40m905K927J977l424J213p19p76K894j916j048K489k120
$$ 2333 1345 -3385 1073 1813 -3092 -165 1812 -1612 -399 -1118 -1894 1000 -916 -1964 525 -1595
708a595l6J979k263K270O68n896L600N011n461j465L071M49Q30k701j259N192
$$ -1595 -1631 348 -1915 355 1023 -4873 -1273 3738 -1723 -3188 -117 332 1162 -1539 -2798 2394
724B394j598k780L317j796m50L663k600j643L334k042M87J885k408M45Q56j612
$$ 2394 796 -1984 1333 -463 -913 2750 150 -1493 1841 -201 286 2171 -237 208 1064 -548
740e48L166r06l978M261M32l184K334n46j999L358j410j755K218j540N94J263
$$ -548 2618 1712 -2266 1995 2427 -757 1577 1031 -968 2390 980 -775 1443 -97 497 1760
756A760l918J869K222l648J412K058m381J402K587j832M11j982j092N124j489
$$ 1760 -2158 -289 1933 -1715 -303 1755 -2626 -1224 1363 -469 -58 -2040 -3132 1992 503
771E03l543K380n79O84K188l867k38L962k180m15J203k076K027R03l115K138K33
$$ 503 -3040 -660 -1239 -555 1633 -2234 -2472 1490 -690 -1105 98 -1978 49 952 -2163 -25 208
788B08j987L381o63l535L328L70j319J876k413j99L438k019n72J403k242K100
$$ 208 -1779 1602 939 -2596 732 1102 -217 1659 -754 -953 2485 466 -106 1297 -945 1155
804A155J653m072J189K978k960P71L23j204K182j482j682L122j462j521K744j967
$$ 1155 2808 -1264 -75 2903 -57 714 1037 -167 2015 533 -1149 1973 511 -1010 1734 -233
820b33p33K831k934%L104k893k19J605j583J209p6k590K964L0l368L078k3k674
$$ -233 -966 1865 -1069 -1069 2035 -858 -1077 528 -1055 154 78 -2512 452 482 -2886 192 169 -2505
838b505L032r40j480K094j094m96K147j777j6J495j861J712J171m273K151K762
$$ -2505 527 -413 -1893 201 -893 -1389 758 -1019 -1035 460 -1401 311 1482 -2791 -640 2122
854B122l506R89J011j214J857j199j271K928j242j076K549k295L49K791l147K5
$$ 2122 -1384 -395 616 -598 1259 60 -1211 1717 475 -601 1948 -347 2 2793 -354 -329
870c29K839k750K42K002j851O03M07k034K945j105k257K725k63j991K014j065
$$ -329 2510 -240 2 2004 153 756 1163 -871 2074 969 -1288 1437 1174 -817 1197 132
886A32j265K633j880j049K645j664k17Q54j949J964R18l584K103J536l393J642
$$ 132 -1133 1500 -380 -1429 1216 -448 -665 189 -1760 204 1122 -2462 -359 1177 -2216 -574
902e74R82j896J865j003j595K742p85j136J760j564J45K406l189Q05K974l269
$$ -574 408 -1488 377 -626 -2221 521 -264 -1400 360 -1204 -1059 1347 -1842 -1037 1937 -1332
918a332L98K251k079J048L33j745K358o58j637K411n18j861K862j416j033K918
$$ -1332 -934 1317 -762 286 619 -1126 1232 574 -1063 1348 830 -1031 1831 415 -618 2300
934B300k108r73K686j434o8P93j530J591L44k900K089J131l077J540M79j720K062
$$ 2300 192 -781 1905 471 403 1196 -334 1257 1601 -1299 790 1921 -1156 384 863 -857 1205
951A205r85j445K130q59j091J826j555L81J813l309J299K216l348M06K093j946
$$ 1205 220 -1225 905 46 -1045 781 -774 -393 1420 -1889 -590 1626 -1722 -1316 777 -1169
967a169R55Q3j707K125m36j889K365p51j401K544j247q40K428k022m73K989j954
$$ -1169 -214 -131 -1838 287 -149 -2038 327 -424 -1825 719 -528 -1368 1060 -962 -1435 1554 -400
984d00l92J106j008J532J19k778K379J092k283J326k20j301K485p44j901K567
$$ -400 -792 314 -694 838 957 -1821 558 1650 -633 693 473 -828 1657 913 -988 1579
1000A579p28q72J783j606R2J073k162J474J765l692P29K478j989L47Kj333K442
$$ 1579 851 -21 1762 156 248 1321 -841 633 2398 -1294 -565 1913 -76 271 273 -1060 1382
1017A382l88k365K032o44o71J706k033l20K731k531j19K484k247k29J527q81L29
$$ 1382 994 -1371 661 17 -654 1052 -981 -1301 1430 -1101 -1220 1264 -983 -1212 315 -566 -237
1034b37Nj886K529K51k603J719K4j020K155j505r96K420q28j363J964q03k03J279
$$ -237 -232 -2118 411 662 -1941 -222 -198 -1218 937 -568 -1564 856 28 -1335 629 -174 -377 902
1052I02j864R22J410k606J530J331k427J113N28j107J891q69j684K560l09j646
$$ 902 -962 -40 1370 -1236 294 1625 -802 311 839 -268 1623 754 -930 1630 1321 -325
1068c25J427r29q2J848k398L90J829k185J8J852j884J277k63j899K057K90k553
$$ -325 1102 173 91 1939 -459 -69 1760 -425 -407 1445 -439 838 575 -1324 733 1023 -1530
1085a530J979j85j538J612j071j28J798k087k55K108j674J3J683k033K80J318
$$ -1530 449 264 -1274 338 -733 -861 937 -1150 -1405 703 -971 -958 725 -1308 -1028 290
1101B90k229J826J012k487J268L60j022J818r07j827K416o25o12J719j630o68
$$ 290 -1939 -113 899 -1588 -320 40 -982 836 -71 -1898 518 -107 -719 1000 -630 -1298
1117a298K717j125p40J431j918P90J480j574R17J20j635K303j29k500K174j92
$$ -1298 1419 294 -446 985 -933 -143 1337 -237 680 800 -835 1468 1339 -1161 1013 821
1133H21j345J702p14o23J683j326m42J317j621P70J272k686R43J309j700R64P55
$$ 821 -524 1178 464 -159 1524 198 -244 1073 -548 222 1494 -1192 -249 1060 -640 324 1079
1150A079k611J660O76j888J424p20r53J985j196k42J802k283j39K416j792p63
$$ 1079 -1532 128 804 -1084 340 -380 -1333 652 -544 -786 1016 -1267 -1406 1010 -782 -1545
1166a545K127j459J58R64j297J141n7j486J525J54j401K037j088j262K716j021
$$ -1545 582 -877 -719 245 -1052 89 32 -1454 71 225 -1176 861 -227 -1489 1227 206
1182B06j508K370q37p23R18n02O79L54j956J543J046k235J398O33k272J603N05
$$ 206 -1302 1068 231 -492 426 -76 603 957 -999 544 1590 -645 753 1386 -886 717 1222
1199A222j766J469m50j465J696k68j47O31j832R31J859k778M34K034k406L81J151
$$ 1222 -544 925 475 -990 706 438 291 922 -910 21 1880 -898 -464 1570 -836 -455 696
1216F96j433Q34N86j971J241K47r38J262j378k47K043j830p47K722j630j226J726
$$ 696 -737 97 683 -1288 -47 200 -738 524 -854 -1101 942 -888 -1635 1087 -543 -1769 -43
1233d3n60O03K20j685J407K55j421J591l79j102J871o45j603K571o04j613K018
$$ -43 -603 0 220 -1465 -58 197 -1224 367 -12 -1114 757 112 -1491 1080 476 -1137 881
1250H81j41o59M72j386J344R64k404J208J631k327N91J215j966J575J29k241J652
$$ 881 740 81 553 -833 511 1475 -929 279 1910 -417 174 1389 -577 998 1127 -1114 538
1267E38R30j587Q14o69j93J524j724q5K034j980o86K423j579l4M34p54N78P17
$$ 538 1468 -119 695 26 -167 1357 -367 -452 1582 -398 -1084 1339 -240 -274 160 -594 -16 701
1285G01j873J354p8j348J684r76o22J876j159j322K229o89q06J095j071K94J091
$$ 701 -1172 182 104 -1244 440 -536 -1158 718 -441 -1763 466 -223 -1029 66 -1005 -711 380
1302C80j533Q12O75j511J006N83j456J519K05j811J533P57j858Q46n8j84J066
$$ 380 -1153 -341 334 -1177 -171 412 -1044 475 680 -1131 402 1159 -699 147 89 -95 971
1319I71j190k7J651j660l31K061j317J58P60j867J400O38j819Q95N92j028J090
$$ 971 -219 -246 1405 -255 -586 1475 158 316 1076 -791 609 1247 -572 323 915 -113 977
1336I77q28n88J733j323r63K249j127n74J097j469M85J041j661O09R55j719R65
$$ 977 149 -439 1294 -29 -992 1257 130 -444 653 -816 -331 710 -951 -342 613 -1106 -141
1353a41N12j314J336n75j529J987j78j384J263l13p32J397j252O6J327j033j63
$$ -141 371 -943 393 -182 -1711 276 98 -1286 -23 -336 -1068 329 -923 -857 470 -563 -726
1370g26Q06j006Q94K6j136J308P04j943J451oq85R36l65o85J762r79n53J516r82
$$ -726 80 -926 -32 -6 -1142 166 870 -1073 378 372 -513 423 58 -627 1135 156 -397 1119 137
1389A37j80Q78j006P30P03k033J053J119j738P25N52j392J269l89j135J740l74
$$ 137 -43 835 -171 559 1262 -771 282 1401 -337 388 940 -452 817 428 -707 1033 659
1406F59j393J457r41j1J053j249O5J292j312p4R94j137M21M33j440J339J31j397
$$ 659 -734 723 -218 -229 824 -425 -360 932 -380 -454 540 -597 -176 257 -1183 156 287 -1110
1424a110Q31j54n03J288q36n94J878j256o06J731j154k45R41q98O36O49j405Q16
$$ -1110 -279 -433 -936 352 -484 -1078 800 -456 -1062 669 -485 -730 211 -687 -51 598 -807 9
1442IO65j544J073K63j218J464n45r69J704n41n07N51l17J93N82j103M39J124
$$ 9 674 -870 203 466 -752 712 167 -802 902 361 -146 405 88 281 863 -240 199 1323
1460A323j883M77J211j224M53K43j212J126M36j665R97o5p30J126r15j74J232
$$ 1323 -560 -83 1128 -96 357 600 -612 514 950 -715 282 217 -513 613 -302 -476 756
1477G56r85o65J578j098l43R48j072O25R13j706J074M4j435J512j55j029J464
$$ 756 -229 -894 684 -414 -757 191 -881 -256 657 -1049 25 69 -1366 146 -9 -1038 426
1494D26n43r82J266L7j124R56l92L10M68j222M67J254j656K31P49r58Q97J70j225
$$ 426 -117 -1099 167 204 -920 36 -356 -46 422 -800 -333 921 -735 -504 245 -713 184 354 -871
1513h71J402R9j307R79J00n50O13m67k84J525j232n40J541p08l97J003j176O14
$$ -871 531 630 -677 302 402 -148 465 -2 -286 1239 7 -533 1008 300 -97 906 -270 344
1531C44R75j791R40K61j206N99L54j212J283m76q74J540o64q31R68l62q8M77j031
$$ 344 1319 -472 468 729 -477 122 476 -736 547 71 -803 737 73 -758 210 -152 -240 237 -794
1550g94J84J295j411L46N00j067Q52qq82J019k83j160J637o0n64K59m43j70J320
$$ -794 -610 685 -726 -380 120 -947 -95 -103 -985 34 -249 -1409 228 168 -396 -137 -580 -750 570
1569E70j122j05J510j115m6Q88q66K25R51j863R72O11p49N90m3p91J281o70m71
$$ 570 -552 -657 853 -262 -308 580 -286 -61 890 -973 -1 610 -139 451 408 -383 898 228 -243
1588b43J451r59m30J163o18k66P74j071K82Q90j332K68O34q15P79L2j316J368
$$ -243 1208 249 -181 982 364 98 872 -199 83 973 -359 -91 543 -272 507 539 -777 591
1606E91l26j128J153K14j025R63p92j40J086j391O4R30q69L58M21o09N73K96j678
$$ 591 265 -863 290 504 -521 442 -350 -490 596 -795 -731 199 -670 -312 109 -500 73 369 -1309
1625a309J255O13j314N71p9l32O69n38j19J263j029m09J134m34K07K45q80L20
$$ -1309 -54 559 -755 -184 -263 -595 74 -464 -583 680 -349 -758 376 -58 149 394 -486 -166
1643a66J053j141o4R13n49J64Q2l12R79m69j140J463l32q56J254o31n44J262r91
$$ -166 887 -254 -318 595 46 210 292 -20 959 490 -650 813 481 -375 879 248 -296 966 -25
1662b5l10J208j054K48M69p01O06j75r27J117Lj103R31j52q07J333r01o11J080
$$ -25 -335 873 -181 67 536 -165 441 266 -661 456 459 -644 287 135 -672 661 -240 -851 229
1681B29o47m46R16m98J05N58j177R23O39j410M69O87j233O93M35j036J211o86
$$ 229 -418 -864 52 -446 -341 217 -960 -37 602 -808 -339 348 -885 -192 243 -793 418 -268
1699b68n96J086j77m25Q82q08J15Q56q24j40J191j167J45R87q05K15L02r66R98
$$ -268 -864 222 45 -380 502 -306 -191 665 -159 -299 892 -275 -130 857 52 267 569 -397 601
1718F01n7p54Q77o57j99J546j057n61J191q52o81J277o97J8L37q97Q46M34j091
$$ 601 544 -210 667 10 -189 1357 300 -261 930 78 -603 674 -23 -5 332 -565 281 715 -376
1737c76O32j4r42Q92K01j408J228q1j077R64j27k50K05l01J4R70j315M88O33j122
$$ -376 256 242 -700 192 393 -1015 213 132 -945 19 -108 -358 -153 -454 -440 530 -785 -297 336 -786
1757g86K46Q17r87N37M82q35L32N84p84O35o64RJ123j148K53J023j009l47J481
$$ -786 -540 277 -710 -173 309 -526 -194 390 -394 241 -423 -414 709 -439 -186 837 -172 -519 962
1776I62q48k56O55q22M89N80q27K68Q8n40J177p07n77J400m13j058J014k07o55
$$ 962 114 -142 513 -309 180 760 -67 201 289 -251 926 219 -358 1042 629 -429 585 378 -277
1795b77N91o46K23O23q65M30N67q88M79O7q14P39J23j298R09M11j038N68k47j18
$$ -277 314 -332 -109 514 -351 79 646 -242 237 304 -510 229 352 -946 -37 374 -664 -96 -343 -461
1815d61P20m39k39R17j255K5J267r36K20M10j238Q75M27m48j48K62j55N07n74
$$ -461 259 -180 -419 498 -757 -732 535 -401 -181 229 -1009 -134 293 -155 -303 -41 -196 311 -263
1834b63k38J154r17m93R82L21p66O82p49J25Q83q10J51M59o35L31R2n65R65m00
$$ -263 -501 653 -264 -757 225 546 -220 462 -287 -162 721 -89 62 521 -114 217 309 -256 709 309
1854C09o68Q21J46r25Q37k26o59R92m58j61O19r86J15M19n1J04l8j110J056L97
$$ 309 -359 462 608 -317 520 294 -365 627 169 8 627 -359 -244 175 124 228 190 -920 136 533
1874E33j296P46L28r13O24P2o59Q17l57p79R71k20m33P42j056P70O67j357K29
$$ 533 -763 -17 311 -602 22 94 -565 252 -105 -884 87 -133 -566 176 -880 -110 557 -800 -571
1893e71N29l01m1P33o39K21J25n55J125l57o33R52o93K07P26o98l23Q84q61R1
$$ -571 -42 -343 -384 349 -290 -69 56 -499 626 269 -364 588 -105 102 828 130 -193 691 -170 -79
1913g9O06o58L82J63q31R50J37j001K21Q83j067M62Kn31Q13n45m21J148p17j31
$$ -79 527 -131 251 414 -417 533 670 -331 -110 773 -294 168 170 -361 452 -93 -514 634 -83 -214
1933b14N48q80L33Q57j104K23N37q10L18J80q13J128k93q09J035m68l48L55j1
$$ -214 334 -546 -213 644 -460 -237 300 -510 -192 -12 -825 303 10 -799 236 -232 -580 -225 -236
1952b36k46O37n65r2Q28q30J3Q51o56K28L21p08P09j0p96O76J74o07Q00n22j70
$$ -236 -482 155 -410 -502 326 -504 -491 360 -296 -68 253 -455 254 244 -552 124 298 -309 491 -31 -201
1973b01O23k72k75N21r8m31N29n55N83K16q84M72M93p72J71L15p58P35k50l47
$$ -201 422 150 -125 396 298 -133 396 -159 424 640 -244 228 721 -51 120 435 -323 412 162 -185
1993a85M51K52r22O15l21M8N19q70j01R46o78j32P01o77m1M39n05M73K90r13P51
$$ -185 266 518 -404 211 -110 -62 457 -413 -514 432 -246 -378 323 -354 -395 44 -461 12 302 -611 140
2014A40r1n96P92n40j84R46p80q4M14j89m07J014q56L37L06p51M90M02p31L41
$$ 140 49 -547 245 -295 -479 467 -313 -397 17 -172 -579 435 -421 -84 222 -529 -39 363 -368 -27
2034b7L32p38J000o84l53Q06n6m08P97o01j69P00n95Q6O79p84k1M01l35K78K6
$$ -27 305 -433 567 -117 -470 336 280 -128 669 68 -101 599 4 90 769 -15 -36 365 30 308 334
2055C34n93P45o5r58N61j2l39O46n18j46R11o59l27Q83p23o3M93m75j6N37q49
$$ 334 -259 486 421 -537 24 12 -327 319 -199 -345 566 -93 -420 463 -260 -323 170 -305 -321 216 -633
2076f33N06O10j051L60J16l82P64m70k86O75j4p76N84m67r7Q26r79M88L46K7k81
$$ -633 -127 483 -568 -208 -92 -474 290 -180 -466 209 195 -581 3 -464 -561 265 -714 -226 120 147 -134
2097a34K5j47N83j35m85N06J56n75M10J90m02L72o29K04M01l74k75P80o01L17
$$ -134 -109 -256 327 192 -293 213 369 -206 204 394 -8 364 -265 -61 340 -34 -309 471 -130 187
2117A87M25r71O82L17j072L99M10n16K48J91n52O12j86o79R01l66m42Q86m70k42
$$ 187 612 -359 323 640 -432 -33 377 -139 109 300 -252 360 174 -505 396 30 -412 474 4 -238
2137b38N29r36M56P12j103K95M47n22L53J35o92N19q0k72N14j41l43M43l27l37
$$ -238 291 -645 -189 523 -580 -285 162 -360 -7 128 -564 -45 -125 -397 117 -24 -367 76 -251 -588
2157e88R61p51Q4Q39o55RL71q14N52K89r12Q74K50o44K48K52o43Q19m93m65J047
$$ -588 373 -378 -294 545 -110 -101 270 -544 8 297 -615 259 509 -135 113 365 -278 541 48 -417 630
2178F30n54j87M27j63k2R2m03L30N11p91J63N21p59L58N4n80L96L83r54N84L28
$$ 630 76 -111 316 153 131 223 -180 150 661 -130 33 554 -205 153 207 -373 23 406 -548 36 364
2199C64m99L39n48O5R95q48l2M69m69o7J32l37K24K87m46J68O5k76K24Q7m20P93
$$ 364 -135 204 -344 -279 716 -132 -164 305 -164 -231 -99 -436 -212 75 -371 -203 -138 -414 -190 -103 -523 270
2221B70m04m71Q42k39j81L03ql57L25l79J95P30j097O05J07n20R18k27p09O68
$$ 270 -134 -605 237 -2 -183 120 112 -245 80 -299 -104 626 -471 134 241 -279 639 412 -297 371
2241C71j11n29N83j03j05K93n67K63L94o89L23O25p33j46N48o40M30q0l58J13
$$ 371 260 -269 314 211 106 399 -168 95 489 -200 123 748 15 -131 417 -223 207 127 -231 -118
2261a18K56k20K94j59m60O90m09k42Q11p68k02P23l72k69N19l87K05P4l54J15
$$ -118 138 -82 212 53 -407 283 -126 -368 443 -325 -527 196 -176 -445 74 -313 -108 -34 -388 -273
2281b73L57o35N73N9n89Q01l12q22J135j62n61O12l38j57M38k07R1K96o40O84
$$ -273 84 -551 22 81 -508 293 -19 -841 294 132 -429 183 -155 -312 126 -81 10 306 -334 350
2301C50J04o02M23M2p25O43K51o13L42n3m9M45m11j53Q9Q1k37P21n03k15M38o46
$$ 350 454 -148 275 317 -408 235 486 -127 215 162 113 558 147 -6 83 164 -73 648 145 -70 368 -278
2323b78M05K82n23j69K7J12L29j86l34O29l38n62O36N9m44O48m46j10M03k05m29
$$ -278 127 409 -114 -283 -256 -144 185 -1 -335 294 -44 -606 30 89 -355 293 -153 -263 140 -65 -494
2344d94N79l21R3J04m39N45l98j43M12K72n71K49J30m11N96k63j12K53k30J28
$$ -494 85 -236 -143 -39 -478 67 -331 -474 -62 210 -361 -112 18 -393 203 -60 -172 81 -149 -21
2364b1L82p35L33N80p79L51J55k99L34j01m5M9J81m18Q5jk24L75m06Q1J99k30
$$ -21 361 -374 -41 539 -240 111 266 -33 301 200 155 204 385 -33 52 51 -173 202 -204 -123 76 -154
2386a54J61N25o48k43Q86n70J72P4m18Q8J39m35N01q6j98M68l05l74L35r5m45
$$ -154 7 532 -116 -359 527 -43 129 203 -215 -127 12 -423 78 -8 -206 262 -43 -417 -82 -177 -622
2407f22P16l16k51N93l95J19M47p43M30K38k38N6J39n82N32Q4m22N14k96m25Q11
$$ -622 94 -222 -473 120 -275 -156 291 -452 -22 216 -22 34 173 -409 123 207 -215 299 3 -422 389
2428C89k93k39L88m54J41O22p93K70M95n76J86lj85K27j09j02L27k54j26K89l74
$$ 389 96 -143 245 -209 -68 554 -239 31 526 -50 136 133 -52 175 66 -36 291 37 -89 200 -174
2449a74j38O56k40k71O43m05m40N03n76L23L63n92L36J45m59M69K1o34N50j83
$$ -174 -312 344 104 -167 476 71 -369 134 -442 -119 244 -348 -12 133 -326 143 164 -470 80 -103
2469a03n6L57l84o9M86k50k39Q5j12l5M33m38J87K17m82J24M62m27M10K17q95
$$ -103 -159 198 -186 -255 231 -19 -258 -173 -285 -320 113 -325 -138 79 -403 -279 183 -244 166 383 -512
2490e12O89P1m99N41k72k04O02n44P3P08q15K01L25l49n5K73l11J71J67l37M04
$$ -512 177 248 -251 290 18 -186 416 -128 -55 653 -162 39 364 15 -40 233 -78 93 260 -77 327
2511C27j68k18K34j19qL46m74N0M55l62l75Q07r57L69L22o89M89N8l19J63K55
$$ 327 159 -59 175 56 48 394 -80 -30 425 63 -312 495 -462 -93 229 -460 29 87 -232 -69 186
2532A86n98O30o1p30P51j34m03N66l00o6K49l85J72L61o06M07M3m00J99K53o00
$$ 186 -412 218 157 -573 178 44 -359 207 -93 -159 90 -295 -123 238 -368 39 82 -318 -119 134 -466
2553d66N41J39n79N22m4l18K15M9j15L53r7m24O96j42k55J87k71J21L69n35J54
$$ -466 75 214 -365 157 113 -205 10 59 -56 297 200 -224 472 330 75 262 -9 112 481 -54 100
2574A00K25m12Q3M17m87L50j52m42O10ml74K14k87M1L50o13Q9M96l26r9L59k84
$$ 100 325 -87 -4 413 -74 276 124 -318 292 288 -86 128 -159 -118 232 -381 -292 204 -122 -221 138 -146
2596a46K18K01p86O16P6n06M07j76J06K4k85o4L15j47k14O65l90jM12n80L66J89
$$ -146 72 273 -513 103 179 -327 80 -96 10 34 -251 -315 0 -147 -361 304 -86 -87 325 -255 111 300
2618C00l79m5N11p13M35J96n72Q57n15l75N25k72n9L64k06k2L42m95K82K43n16
$$ 300 -79 -124 387 -326 109 305 -267 590 75 -300 225 -47 -106 258 52 30 372 -123 159 402 -114
2639a14L0K82j15k9K13o10M11K99o62M85j2m08J72K94m12P13o13j70N42n18lM22
$$ -114 -84 198 83 54 267 -343 68 367 -295 190 178 -230 -58 236 -176 537 -76 -246 296 -222 -225 197
2661A97n25M64N0n94K39L25m61J76N01n08L88m04q4K80k6j69J03k54M99j94m38
$$ 197 -328 136 186 -408 -169 156 -305 -129 372 -136 252 -152 -236 44 18 -151 -48 -302 197 3 -435
2682d35K60J89r5%L40l95K05k4k44N01k94r7J77K25m03L70l55PM16j84l96L34
$$ -435 -175 14 -81 -81 259 -136 69 45 -199 302 8 -89 88 313 -90 280 -75 -68 348 164 -232 102
2704A02Nj95O78m83J21M5l26J48K07l29K56n9j35J70k43j92M42j71k52K22j91
$$ 102 107 -88 590 107 228 273 -53 95 302 -27 229 170 35 205 -38 -230 212 41 -211 11 -180
2725a80p3N04m05m29Q58q79M02N23n49Q6J6k12M52p9j95N2P5j10L30l21p3L42
$$ -180 -253 251 -154 -583 275 -604 -202 321 -228 -142 -126 -338 114 35 -160 -108 -33 -143 187 -134 -207 135
2747A35k54NL56k87J29J64n37K75J90k64M29l91N5J16mk6J14k53l21P21k70N0
$$ 135 -119 -114 242 -45 84 248 -289 -14 176 -88 341 -50 5 121 117 91 205 -48 -369 352 82 132
2769A32j50J19r7K35m29J09L47k34p6J61m18K67Q6n54K60M4J58J04n9o7J12j37
$$ 132 -18 101 4 239 -190 -81 266 32 -44 117 -301 -34 52 -502 -242 -198 -40 64 5 -62 50 -87
2791h7p3K91m58J06K33j12R7J38n04N68l5l15J90R5k50n63P43k55L54k19j45M11
$$ -87 -160 131 -327 -221 12 -100 -3 135 -369 199 164 -151 39 134 -116 -679 64 -191 163 -56 -201 210
2813B10l02J57K41n48K10L7k58N06Ok48O5J97n28K67K27j78K13k32o8N23m51J21
$$ 210 -92 65 306 -242 -32 5 -253 253 259 11 76 273 -255 12 239 61 274 42 -26 497 46 167
2835A67p5L3p1L66l95L1k8Q3j85J00J0K73j24m45K74J31m49J21K27j22J40n4j87
$$ 167 92 125 54 420 25 56 28 111 -74 26 36 309 185 -260 14 145 -304 -183 44 -78 62 8 -179
2858a79K97m8jJ38k91K14j86N9k13L51j90j75K14j06J00l7lJ64l10K41J27j67
$$ -179 118 70 69 207 -84 130 -56 3 -210 141 -49 -224 -10 -116 -16 -53 -56 108 -202 39 166 -1
2880ak11J10j19J88J75k55J30Q6j83L48P1k00%k40JL18J29l22R7J62n29N31k3
$$ -1 -212 -102 -221 -33 142 -113 17 103 -80 268 339 139 139 -101 -100 218 347 25 122 284 -245 286 263
2903B63l02L44l61l4K14J29j8j47j46j41M51k18j4J56n36M98j81j64K23j81P8
$$ 263 -39 305 -56 -90 124 253 235 88 -58 -199 252 34 20 176 -360 138 -43 -207 16 -165 -87
2924h7K59l7n9mj7k55M80m23n2M65l78J41J99k90PJ33n61M61o4k3J65J66m29M86
$$ -87 172 135 76 72 55 -200 280 -143 -195 270 -108 33 232 -58 -51 82 -479 -18 -82 -105 60 226 -203 283
2948B83o8n12O81l69k86L28K1Q6k59J68J83q9k66K60qn40O84k6m30K69J25k65
$$ 283 215 -297 384 15 -271 57 78 164 -95 73 256 167 -99 161 153 -387 297 271 -159 110 235 -30
2970c0Q3K5M4k2n65N20K51l85p9K13j85K41k2k76L75l07j68K91l8k13L87o6l29
$$ -30 53 78 122 100 -465 55 306 -79 -158 55 -130 111 89 -187 188 -119 -287 4 -34 -247 140 74 -255
2993b55L50k90L55m2j72k01M43m29L12j7k30K58Q7l38K27r3j14J47L8j69L49m67
$$ -255 95 -195 160 118 -54 -255 188 -241 71 54 -176 82 169 -169 58 -35 -149 -2 36 -133 216 -251
3015b51m5N29k6j16k3j85k43L33k05K38J62k09J36M39n66Q5r0j68J55J95k72L29
$$ -251 -296 233 207 91 68 -117 -360 -27 -232 6 168 -41 95 534 -32 53 -37 -205 -50 145 -127 202
3037B02j54q7K43l67q9M69j94p9L02m43J02J88o00N82k07j01K62JL2J36K6k56
$$ 202 48 -39 204 -163 -252 217 23 -56 246 -197 -95 93 -507 75 -132 -233 29 30 62 198 224 -32
3059c2L74k66k51M05m11J87r7l5j82L16m7k76L87j57j04J98j39L72j71P4j4R7
$$ -32 342 76 -175 230 -181 6 -91 -126 -308 8 -39 -315 72 -85 -189 9 -130 242 71 145 131 228
3081B28J8r5k41L7M33n81K01L08l80R7L19l56J04P6j56K01R4j17l01J28O7k85
$$ 228 246 151 -90 -53 380 -201 0 308 -72 25 344 -12 92 168 12 213 307 190 -111 17 84 -201
3103b01K23J06r3j42l68O80k59p6J31o6j90P97q28K08m6m9K45m1q0K12n7n28N12
$$ -201 22 128 35 -107 -475 205 -54 -130 1 -65 -255 542 -286 -78 -124 -173 72 31 -49 163 106 -422 90
3126I0j53LN1J54j0p8l42P8K03M7j15J45k87K35k7j35j5L95m77L81j79J8j9Q9
$$ 90 -63 -60 -9 145 135 57 -285 -207 -4 43 -72 73 -214 21 -6 -141 -156 239 -238 143 -36 -18 -37 52
3150E2K5J74j90j74J41R2m8l2J5j8j49p6K40k26P3L5Nj19K72p5rM1L3k17R0K50
$$ 52 77 251 61 -113 28 120 72 40 55 37 -112 -188 52 -174 -101 -66 -61 -180 92 17 8 49 82 -135 -45 205
3176B05k54L75o46K59J47j84P0O1N0l63J99p9o1L29m0j91J50l66L02L0K6J55l62
$$ 205 -49 326 -320 -61 86 -98 -28 33 83 -280 -81 -160 -221 108 68 -123 27 -339 -37 -7 19 174 -188
3199a88p4J74j35l5K64j73K34k8k80J48L00l0k60M24m19K06k7l22K37j16k6M57
$$ -188 -262 -88 -223 -258 6 -167 67 39 -241 -93 207 177 -83 341 -78 128 101 -221 16 -100 -126 331
3221C31l14p3J28N4k09J83PJ02k13q3J23O1k84L32j99j44N47l65K15l00J31k69
$$ 331 17 -56 72 126 -83 100 107 209 -4 -87 36 97 -187 145 -54 -198 349 -16 199 -101 30 -239
3243b39L36l4J15j12N7j56O0j0J30m17J49J15L5k67J2K93l7R2k15L4J26J35j70
$$ -239 97 63 178 66 123 -33 27 17 147 -270 -121 -6 29 -238 -226 67 30 122 -93 -59 67 202 32
3266C2o2l11K63L60o15K38L50j80j50L21m80K16M54n56K35J30n49N35l59n3L18
$$ 32 -30 -341 -78 282 -333 -95 255 75 -75 246 -234 -18 436 -120 115 245 -304 231 -128 -181 137
3287A37l44K22n2Q1P0n0j81L73j98m00N66k31j3J47q9l1J19R8m5Q1l40k35M97
$$ 137 -207 15 -37 44 114 64 -117 256 58 -342 224 -7 -20 127 38 7 126 224 179 260 -80 -315 182
3310A82j92k54M04j83l3L24m40k3M73m42PL96k19J7j60r7J91n1m9K08M2l55N80
$$ 182 -10 -264 140 -43 -76 248 -192 -215 258 -184 -177 219 0 17 -143 -240 -49 -100 -149 59 101 -254 326
3333C26n32K19j98J42K9O7R4k39J6j29J52J55n3j73M12j56o9o4M0Q7r5k40M64
$$ 326 -206 13 -185 -43 -14 53 147 -92 -76 -205 -53 102 49 -124 288 132 63 -1 39 126 31 -209 255
3356B55l79J9N71l43%j51j37L19R3m50L68P1k52J73j6k73J79j33J28j60n3L36
$$ 255 -124 -105 466 123 123 -28 -165 154 247 -203 165 236 -16 157 141 -132 47 -86 42 -118 -171 165
3378A65mk93Q1J68j32q7J18j71k9O0oK82q4n08K75J40k76L62Q4n26L80l4k42K74
$$ 165 161 -132 -51 117 -15 -102 16 -155 -184 -124 -130 152 68 -440 -165 -25 -301 61 145 -381 -1 -35 -277 -3
3402cn3j19L3J60l6L53l27L3L0r3k05K93k37J11l9J97p2j90l7L73l35J06m7q6
$$ -3 -56 -175 -142 18 -18 335 8 41 71 -22 -227 66 -171 -60 -99 98 26 -164 -201 172 -163 -57 -104 -190
3426a90L26j89j98K16L15k20k08L72m28K04P0k42J71o7K77j46k7j11K19l91K21
$$ -190 136 -53 -251 -35 280 60 -148 224 -204 0 70 -172 -1 -68 209 63 36 -75 144 -247 -26
3447b6J71l35R1J88m00M39l17j50M28J0k08k10L88j43Q5r7j10K86k28J27L1Q0
$$ -26 145 -190 -99 89 -311 128 -189 -339 89 99 -109 -319 69 -74 11 -86 -196 90 -138 -11 20 100
3469A00O8j36K9o0L49m09J82j46m3j7j83M66q9k79M5K74j09k9O7k57K69J92m50
$$ 100 168 32 61 1 350 -59 123 -23 -66 -83 -266 200 111 -168 -123 151 42 13 80 -177 92 284 -166
3492a66J36J84j25K16q1j47J30J13n65K01N7q7K33p2m55N01K17k74J36k27o4L55
$$ -166 -30 154 29 245 164 17 147 260 -305 -104 -47 -134 99 27 -428 73 290 16 152 -75 -139 216
3514B16l80K69r8k4q8J37k50K82k18j57M27n1j04k4J04l66M15o7R3k94J44Q2j69
$$ 216 -164 105 7 -17 -105 32 -218 64 -154 -311 116 65 -39 -63 41 -325 90 23 116 -178 -34 48 -121
3537a21J75j76K19j52K35m32QK41p4L33k59L93m44J35l9q5M8R8j79pK52l89N39
$$ -121 54 -122 97 -55 180 -252 -244 -3 -77 256 -3 390 -54 81 42 -43 5 103 -76 -83 169 -220 319
3560C19l10j04K01j05l05M41J28k87K50k62j2m9P3K54m27K5RK05j03J14J23l34
$$ 319 9 -95 106 1 -304 137 265 -22 228 -34 -46 -95 -22 232 -195 -170 -161 44 -59 55 178 -156
3582a56K08j42J51R5k66K04j34O5o5o3q6K15J81n37L84J04m12K83m68K51N01k31
$$ -156 52 -90 61 156 -110 94 -40 25 -40 -103 -189 26 207 -330 54 158 -254 29 -439 -188 313 82
3604H2k74L26l7j18l0m6J33K7l73J89K62k93L41k00j22M23Qm80J90J24j29L1J22
$$ 82 -192 134 97 -21 -51 -97 36 63 -310 -121 141 -152 189 -11 -133 290 298 -182 8 132 3 34 156
3627A56k51p8J51j15Q6Q9r1j19P1m9L34j95M9j9l53L76N7n5j71r6J69O1j04L6
$$ 156 -95 -173 -22 -137 -51 38 -53 -172 -101 -150 184 -11 38 19 -334 42 99 44 -127 -223 -54 7 -97 -61
3651f1j05j69K78NO4J67j64j09L8K43k89J25J22J5o6nl87K83J12j59K80j48r3
$$ -61 -166 -335 -57 -52 12 179 15 -94 -56 187 -102 23 145 160 94 89 -298 -15 97 -62 218 70 -23
3674b3L27n14M04m00J67k8K36k80M4M2L1j58J58j8r3J79j73L61nl20L51n17R8
$$ -23 304 -210 194 -206 -39 -67 169 -111 -67 -25 6 -152 6 -12 -105 74 -99 262 257 -63 288 -229 -131
3697a31K6N8J01m1k42L96mk77r2Q8rJ48l00M08q0j24j01J19R0k06J33N9j92J71
$$ -131 -105 -47 54 13 -229 167 163 -114 -206 -118 -127 21 -279 129 49 -75 -176 -57 33 -173 -40 19 -173 -2
3721bk82J73j50M1O9J30J85L1l57K61r6j2j1oj41J29j22N6m8N19o28J90L98l30
$$ -2 -284 -111 -261 -220 -151 -21 164 195 -162 99 3 -9 -20 -26 -167 -38 -160 -104 -152 367 -261 -71 327 -3
3745cj9L95n65P8K20j30L2J30k69k0J5K9K79j3p6n9k87J6M84k43J48j67Ro8P8
$$ -3 -22 373 -192 -114 106 -24 8 138 -131 -151 -136 -107 172 159 83 24 -263 -247 237 -6 142 -25 -16 -84 -6
3770fPj45J78k22J7J01j15K63JjN7k95l9M83l93K61m8k83K39k9Mk24J33j39L77
$$ -6 1 -144 34 -188 -171 -70 -185 78 79 78 135 -160 -199 284 -109 152 104 -179 60 31 35 -189 -56 -195 182
3795A82N4l21R6J46j3P7l92Q6K34k32J2J81j72n0J41L25n47M04q0j62J50k27J09
$$ 182 236 -85 11 157 144 221 -171 -85 149 -83 -71 110 -62 -112 29 354 -193 211 131 -31 119 -108 1
3818Ar4R7R5l42L85j36Jk44K09k1Q9n9n0k29M01j79k7J79j34J99K94m00N1M4k53
$$ 1 -93 4 99 -243 142 6 7 -237 -28 -49 40 -19 -69 -298 103 -76 -103 76 -58 141 435 35 86 130 -123
3843a23R1j20K84R1k00k76M21j76j36L24j74k17L94k25nN9l08L20J10n02K89J8
$$ -123 -32 -152 132 223 23 -253 168 -8 -144 180 6 -211 183 -42 -47 12 -296 24 134 -368 -79 -61
3865f1j69m3R4J74r5R0L2l01K83Mk5L7k4J92k83K62j37pqL9j43K08l82K25k5J52
$$ -61 -230 -273 -179 -5 -100 -10 22 -279 4 8 -17 20 -4 188 -95 167 30 23 15 54 -89 119 -263 -38 -63 89
3891H9l16J90L23l60M30l77J20j29j42K55p3N2q0j33J83j15J50j20J61L1l71J73
$$ 89 -227 -37 286 -74 356 -21 99 -30 -172 83 10 62 -18 -151 32 -83 67 -53 108 139 -232 -59
3913e9R1j78M78k62j6J02k75O4M7Jo1M2k7N6J28j18O1j5J21l03J04j66M62k81
$$ -59 32 -146 332 70 54 156 -119 -55 -8 -7 -68 -26 -53 3 131 13 74 59 180 -123 -19 -185 277 -4
3937dO7K25k32j00L04j80Mj85J53J69k21J70l54M68j59j05K22k95J10k33M01j61
$$ -4 63 288 56 -44 260 80 84 -101 52 221 0 170 -184 284 125 20 242 -53 57 -176 225 64
3959F4p0J4j9K08j76O5k76L20k23l8K39p7k33L99k42K81k47P9J02j74R4j68o8
$$ 64 -6 8 -11 197 21 86 -190 130 -93 -131 108 31 -202 197 -45 236 -11 68 170 -4 90 -78 -146
3982a46J31p9K31j69p9M00P8k40m5k68R5J87m87L77K4j80l10O05k9j40K64j55
$$ -146 -15 -94 137 -32 -111 289 367 127 82 -186 -91 96 -391 -14 10 -170 -480 125 96 -44 220 65
4004F5K1Q8o0o4J4j18K03L28m40K16l50J37J9k33K21r0j04j87M29M9k4m0k51J20
$$ 65 86 174 114 50 64 -54 149 477 37 253 -97 40 59 -174 47 -43 -147 -334 95 144 120 80 -171 -51
4028e1K70r2k44L34j97j12m2L88k92R5l7m5K0Q5l27J33P5n4q3P4q2K58j87J34
$$ -51 219 127 -117 217 20 -92 -134 254 -38 57 20 -25 -5 80 -247 -114 -39 -93 -176 -102 -184 74 -113 21
4052B1r1j6P3N0N9j71j73R1l7j66J78K48k25J33J39o9J71k56o7n9K94j7J23m70
$$ 21 -70 -86 -13 37 96 -75 -248 -157 -194 -360 -182 66 -159 -26 113 44 215 -41 -108 -167 127 110 233 -237
4076b37J59R0J92j73j9N2j08R0L8q4j04q1P6O6J11R1k2k51K17o1j36j98M5M87
$$ -237 -78 12 204 31 12 64 -44 46 84 0 -104 -185 -109 -43 68 159 137 -114 103 42 -94 -292 -247 240
4100B40j23k16M19m91L90j19l75K85l7P5j24L43m67J08o7N7L57k45L8q8l5O2q4
$$ 240 117 -99 320 -171 219 100 -275 10 -27 48 -76 267 -200 -92 -159 -102 255 10 48 -40 -75 -13 -97
4123i7m4K59k00j11R4J58O3nJ85j07k24J34J19k54l0J68J55m08P4r9O1Q2O6J63
$$ -97 -141 118 -82 -193 -99 59 122 117 302 195 -29 105 224 -30 -60 108 263 -145 -71 -170 -109 -27 39 202
4147B02m02K13l4R1L3j90JK85l27nJ41k30L08j43k34L47j58j20K28O1K1j08o5
$$ 202 -200 13 -21 70 103 -87 -86 199 -128 -133 8 -222 86 -57 -291 56 -102 -222 6 67 88 -20 -85
4170h5j12L23k15k06L31k55J48j4j44K98Q2l58K22K68k27k3l41O81m09O7k52K99
$$ -85 -197 126 -89 -295 36 -219 -71 -85 -229 69 151 -207 15 283 56 33 -308 373 -36 31 -221 78
4192G8k63K39l27L40J4j12j27J52L08l02j63K34j9n7J18k39K94k79N3J13O1j38
$$ 78 -185 54 -273 67 81 -31 -158 -6 302 0 -163 71 52 -5 113 -126 168 -111 -58 55 116 -22
4214b2K49l93Q3oJ53k06J53J8J5j35J49k69L21p9J67k68M4O9k96K54J68k68J18
$$ -22 227 -166 -83 -89 64 -142 11 29 44 -91 58 -211 110 31 198 -70 -26 43 -253 1 169 -99 19
4237A9K76j31j54k93L36n7M8j02k3J64j98Q5J6J14k08K39l35k3L20r0K7j1r7J47
$$ 19 295 164 10 -283 53 -4 44 -58 -81 83 -115 -30 -14 100 -108 131 -204 -227 93 3 30 19 -78 69
4261F9l38N77j16l76J04Q5j77M86k05j10J8j26J51K8P2j96N2j61j61J22N2K01
$$ 69 -269 308 192 -184 -80 5 -172 314 109 -1 17 -109 42 70 142 -54 -2 -163 -324 -202 -150 51
4283E1n7J08PL6j92j54L57j01N5O2q7k66J6l1K07j66R1kJ18k66K32N7k9j89K2
$$ 51 -6 102 109 145 -47 -201 156 55 110 172 85 -181 -165 -196 11 -155 -64 -66 52 -214 18 75 46 -143 -121
4308a21J49m4Q2j35J2j0n5J69J89j27l19Q8J01L3O3n7N2j48K93q2j86J74m3J52
$$ -121 28 -16 66 -69 -57 -67 -122 47 236 109 -210 -122 -21 12 75 18 70 -78 215 133 -53 121 78 230
4332B30k01P5l31L16j9n2O8P3Mj64k6p7J05j96L08L4l02L24k40Q8k1K46j93Q0
$$ 230 29 104 -227 89 70 18 86 159 163 -1 -27 -104 1 -195 113 147 -155 169 -71 17 -4 242 49 129
4356A29kj20j71K25j32J23q4nJ06j11K67j37j9k05N2P0j31k82M49J36k82J10n3
$$ 129 127 7 -164 61 -71 52 -32 -37 69 -42 225 88 69 -136 -84 -14 -145 -427 22 158 -124 -14 -67
4379f7K14q7J46k93J73%J3Pm4k36J48O2j12N0L64m12L1J3l7k0k77K34J24R8r3
$$ -67 147 60 206 -87 86 86 99 106 62 -174 -26 36 -76 -26 338 -74 -43 -30 -67 -87 -364 -130 -6 92 -1
4404aJ68j84L9J26m5l96K78J99j29k91K41Q1l8j83L66q3j91L15r2j15j21K0K12
$$ -1 167 -17 22 148 103 -293 -15 184 55 -236 5 86 48 -135 231 148 -43 272 180 65 -56 -36 176
4427A76k78J34O4j14J80k30J92j30J30o8k9K32k86J3j46J90j70L20k05L05m00
$$ 176 -102 32 96 -18 162 -68 124 -6 124 56 27 259 -27 -14 -160 30 -140 180 -25 280 -120
4448a20j17j1K07j20K97k78J94J12j73m9O4qR3j01Q2L8k99J85j99K02mj35j4K34
$$ -120 -237 -248 -41 -161 136 -142 52 164 -9 -58 6 -2 91 -10 72 110 -189 -4 -203 -1 -5 -140 -154 80
4472H0lk13J94J59l81K04K9k92L42J6m7q4k61J17N7J60r0J95k0L7k88j04J67J65
$$ 80 77 -136 58 217 -164 40 69 -223 119 135 88 4 -257 -140 -83 77 -13 182 162 199 -89 -193 -26 139
4496A39k16J7j25M90j12p7P2N2k13k03K30q5J41l7k16J39j87J47Mm0J34j54J74
$$ 139 -77 -60 -185 305 193 116 188 240 27 -176 54 -31 110 73 -143 -4 -191 -44 -40 -80 54 -100 74
4519G4O5m29J51J44P9k0mP3p4K31m41L2J32q9L10l22J80j52J91K2k67J88k69J80
$$ 74 139 -290 -139 5 84 64 60 133 59 290 -151 -119 13 -76 234 -88 92 -60 131 153 -114 74 -195 -15
4543a5L2l24O35l11j01K5m8L10l67K24M6k38J52k81M12j69K6k8q1jJ13n3r8J26
$$ -15 17 -307 328 17 -84 -59 -107 203 -164 60 106 -132 20 -261 151 -18 8 -20 -101 -102 11 -42 -140 -14
4567a4p2K51j73l9J01k34j28K29J40k26J91k47N14j60r4k77K83o2K68l03k17O13
$$ -14 -86 165 -8 -47 54 -180 -308 -79 61 -165 26 -221 293 133 39 -238 45 -17 251 -52 -269 344
4589C44k05j33J87k65L22k97J19j72J81p5j29l1J39l91M79K65j12k22n6L22j57
$$ 344 139 6 193 -72 250 -47 72 -100 81 6 -123 -154 -15 -406 73 338 226 4 -52 270 113
4610A13q1J5J7j29J15j20n0J81m6j50J77j11L87l64O1j92K08O0j19O0l68M72r4
$$ 113 32 47 64 -65 50 -70 -120 61 15 -135 42 -69 318 -46 15 -177 31 91 -28 32 -336 136 42
4633D2k38P3L41j58J38r2j65L4J4J70m00L37o1m6o4J92j31J55j92mQ5K05k31J25
$$ 42 -196 -123 218 60 198 106 -59 -25 -11 159 -241 96 35 -11 -75 117 -14 141 -51 -55 30 235 4 129
4657A29q9j10P2L09l01k20L22R8j41j2M2l94K56J40r5K16l9k95M9K95j06k6Qn6
$$ 129 40 -70 2 311 10 -210 112 210 69 57 99 -295 -39 101 6 222 183 -112 -63 232 126 100 108 52
4681E2j77J41j15l99M44J76K58m81K67l73M22j81j41N5j14L95l84L08k57R1K85
$$ 52 -125 16 -99 -498 -54 122 380 -101 166 -207 215 34 -107 -52 -166 229 -155 153 -104 -13 272
4702B72l75j74J07K53j61r5J61r0n1J50M7R0j11j77j66K93K95k37M3J49m65L49
$$ 272 -103 -277 -170 83 -78 -173 -12 -102 -153 -3 44 134 23 -154 -320 -27 268 31 74 223 -242 107
4724A07L8j28K4J71k73qJ53K7Jk83J04k80M40p0J14k68J00J60L21n32O0J28k1
$$ 107 145 17 41 212 -61 -69 84 111 112 -171 -67 -347 93 23 137 -131 -31 129 450 -82 -22 106 85
4747H5lk6N2M5k77L07j45k98K36J83k28J30K7l19M13k28k41K69r5M9j14Q9L01
$$ 85 82 56 108 153 -124 183 38 -260 -24 159 -69 61 88 -231 182 -46 -287 -18 -113 -64 -178 -89 212
4770B12j02j19m2oO53m43k11J1k0K52n1j55J61k32PJ9K4n2PJ29K85l76K7k0J6
$$ 212 110 -9 -51 -57 596 153 -58 -47 -67 185 134 -21 140 -92 -85 -66 -42 -94 -87 42 327 -49 -22 -42 -26
4795b6Q3k98L0K79j79J62k64K67J9O7p7j20J49j67L23k30pq1L9J5J72O9j98J37
$$ -26 57 -241 -211 68 -111 51 -213 54 73 140 63 -57 92 -75 248 18 11 -70 -31 -16 156 225 27 164
4819A64l48K2L00k47J81j14k2K23j07q0NJ36k12K40j54oK4L1K33l39K06k23j39
$$ 164 -184 -162 138 -109 72 -42 -64 159 52 -28 -23 113 -99 141 -13 -19 5 36 269 -70 136 -87 -226
4842b26K28K14n47K79j3O2o8o3M06l65KJ24p7j16J88j14J26J10j91J18j77j69
$$ -226 2 216 -331 -52 -65 -3 -71 -134 272 -93 -91 33 -44 -160 28 -86 40 150 -41 77 -100 -269
4864b69m7J68K54j65k1N8K94l61R2K59n18L69J92l41J5L9l56M26K0p5j96j13L54
$$ -269 -316 -148 106 -59 -80 -22 272 -89 3 262 -256 113 305 -36 -21 18 -338 88 108 33 -163 -276 78
4887G8l83K28R2n9o9J92j33j14L1K9N8K3J92j40R1k69j4O3q9J71M5O5n0j50L94
$$ 78 -305 -77 15 -44 -113 79 -54 -168 -137 -108 -50 -27 165 25 116 -153 -167 -104 -193 -22 23 88 38 -112 282
4912B82k39m7M0J21r2r7k23J47M8M4J38j9k03o6L09l96L46P4k57oK48j37r1J13
$$ 282 43 -4 36 157 65 -32 -255 -108 -60 -16 122 103 -100 -166 143 -253 93 167 -90 -96 152 15 -76 37
4936C7qj87P6j95M48M5k59J72j10o9j09J7R2N4k41K01N6m9K7q8n0L35l48J87L
$$ 37 29 -158 -82 -277 171 216 -43 129 19 -50 -159 -142 -50 4 -237 -36 20 -29 -2 -90 -140 195 -153 34 37
4961C7K67n57M39N6l20J18J7P3j57L0k2J5l9l3L11m4j95j86m7J68J06J09n3n4
$$ 37 304 -253 186 242 -78 40 57 130 -27 3 -19 -4 -43 -76 235 191 -4 -190 -237 -69 37 146 93 39
4985C9N5R6l01M98l37j28j10L47j19j3j17J18J1k53K0J94%m9J4K69l71L88j63
$$ 39 94 190 -111 387 50 -78 -188 159 40 27 -90 28 39 -214 -194 0 0 -49 -35 234 -137 251 88
5008H8j84J42k64J92J24k70J81l04J25L79j64k45K28J56m73L31j70J30R3l11K61
$$ 88 -96 46 -218 -26 98 -172 9 -295 -170 209 45 -200 28 184 -289 42 -128 2 95 -216 45
5029D5o3J04J53j53j04R7L9k32J6J26K06l67J54l0Q6l5o3r5J70l74L38O8k74L01
$$ 45 -18 86 239 86 -18 79 118 -114 -98 28 234 -133 21 -9 77 42 -21 -116 54 -320 18 86 -188 113
5053A13k83J78P7k71j7K53n8P4m5p5J76L5q2j42j87L99k30J05j49L07q1J27j44
$$ 113 -170 8 85 -186 -203 50 -8 66 21 -54 122 157 75 -67 -254 145 -85 20 -129 178 97 224 80
5076H0O4k17P2J80j54o1j81K47r9J86k68K53j76J40Oj17L0k2J69K4j11j13J69
$$ 80 144 -73 -1 179 25 -36 -217 30 -69 117 -151 102 -74 66 72 -45 -15 -37 132 156 45 -68 101
5099A01J65k20j98J60K11j72j09J51J5k27K85r5j33J71p3j16j00O5J02j88K77
$$ 101 266 46 -152 8 219 47 -62 89 104 -123 162 67 -66 105 32 -84 -184 -119 -17 -205 72
5120G2K04j03qk79K99k77n5%J8J92J09K25k37k27N3K50l05M7j82K18j73J35k37
$$ 72 276 173 165 -114 185 -92 -147 -147 -129 63 172 397 160 -67 -14 236 -69 -22 -204 14 -159 -24 -261
5143b61K06j16K05J09j62J94j69J9J69Q8l63N1J14m32M39j4j34J17J04l64K98
$$ -261 -55 -171 34 143 -19 175 6 25 194 282 -81 -30 84 -348 91 77 -57 60 164 -200 98
5164I8l60L01j16M1Q9j88L63l25J93J3J15k53j93l3P9L5mO9j04J94l9l5L54k33
$$ 98 -262 39 -77 -36 53 -135 228 -97 96 109 224 -29 -222 -255 -176 -141 -145 -76 -180 14 -25 -60 294 61
5188F1J6j44j45L69l41K35m1J60j85O8K93m61o1L19j80O0r4J77j79K23j70L1q3
$$ 61 77 -67 -212 157 -184 51 10 170 -15 53 346 -115 -176 143 -37 23 -71 106 -73 150 -20 11 -72
5211g2L77j42l64K31N8j06K23m56J95J1J36Q9k82k5K8q3R9K13n8n2L16k36k51
$$ -72 305 163 -201 30 88 -18 205 -251 -56 -45 91 180 -102 -127 -99 -182 -83 130 72 20 336 100 -151
5234a51J63j52L63j1j99j07J88k38J85Pm5K64l05j73J95j66K95k79k2J10J84k06
$$ -151 12 -140 223 212 13 -94 94 -144 41 48 3 267 -38 -211 -16 -182 113 -166 -188 -78 106 -100
5256a00K03O2n6o7K6r8J25j74M05m63Q4K96m29K68k04J68m2K80k10l26J69J84
$$ -100 103 165 109 42 68 -30 95 -79 326 -137 -53 243 -186 82 -122 46 4 284 74 -252 -83 101
5278A01j78K1k8J28j47l0P9K91j39J31j86k44J02L06k05j15J47Q5p1J5J9M5m6
$$ 101 -77 -56 -84 44 -103 -133 -54 237 98 229 43 -201 -99 207 2 -113 34 119 48 63 82 127 81
5301H1l34M79l89M2J74j39n4K72q7Rm9j40J73L5j29J07k92J72K95l22J12j1q5
$$ 81 -253 226 -163 -121 53 -86 -140 132 45 54 5 -135 38 73 -56 51 -241 -69 226 -96 16 5 -80
5324h0P9J94q5N7k94K83l9l7n1nj61K05J72k16j30pK17K59k88j48J33R3k80K08
$$ -80 -1 193 108 165 -129 154 115 78 27 22 -139 66 238 22 -108 -115 102 361 73 -75 58 151 -129 79
5348G9P4j9j92o3K22j99J17m5J19n7O4j79o1J11L08k80j12J5L72m26P5Q9Q2j9
$$ 79 153 134 -58 -121 101 -98 19 -26 93 36 100 -79 -140 -29 279 -1 -113 -98 274 -152 -77 12 94 75
5372G5j66j80O43m76q1j12K54n4NJ75l32K06R3o1K11k65J42o6J62l03J14J6MJ27
$$ 75 -91 -271 372 -104 -185 -297 -43 -97 -92 83 -249 -43 50 -11 200 -65 77 11 173 -130 -16 0 4 131
5396A31J2N4j32QJ55l02o8K12j17m6J16K7N9j1k22N3P8J8J53l4j84NR7k93k31
$$ 131 143 197 65 73 228 -74 -142 70 -47 -93 23 50 109 98 -124 -71 7 25 178 144 -40 -35 62 -231 -462
5421d62L94j69K86N1L1l8j93J56O4k31Q3r2P2K41j60r4J02j45R5n7L4K0L1q1P8
$$ -462 -68 -237 49 100 131 93 -100 56 120 -111 -28 -120 -48 193 33 -61 41 -104 -9 -66 -32 -12 19 -62 16
5446A6K6Mj02l8L02l09J10J10l8J13j90N7J02j09PJ22k17r7m6J23k7M3L47l28
$$ 16 42 46 -56 -94 208 -101 9 119 81 194 4 61 163 54 61 183 -34 -131 -177 -54 -81 -38 309 -19
5470a9J95K4m23M38j04n1l7J12l44n8K83J62k48jN6p6J30j40J88N9j1m40L70J27
$$ -19 176 200 -223 215 111 60 23 135 -209 -267 16 178 -70 -71 -15 -91 39 -101 87 146 135 -305 65 192
5494A92K9m25j30M44l12N5L87n01K4K40K5j44J34k27J2R2R9P0P0k02K13J9k11
$$ 192 221 -204 -334 110 -202 -147 240 -261 -237 3 28 -116 18 -209 -197 -105 -6 64 134 -68 145 164 -47
5517d7q5K37J8O0O3m73K99j21J99j65Qq1P8J43k93L65k35J07M0j00o5J6L52l68
$$ -47 -132 105 123 183 246 -227 72 -49 150 -15 -7 -88 -10 133 -160 205 -30 77 117 17 -48 -32 320 -48
5541d8J44l21M1J80J78k69p4L2J45L0r8MJ45k03J43o0j10J57o9J19j49J60j24
$$ -48 96 -225 -184 -4 174 -95 -169 -137 8 38 -60 -56 89 -114 29 -31 -141 16 -53 66 -83 77 -47
5564d7J0M7J21j25n2J3J27j71J96l37L4M22m23K87j7J2J1j41j70M02m9k71Q6N4
$$ -47 -37 10 131 6 -46 -33 94 -77 119 -218 -184 238 -185 102 85 97 108 -33 -203 199 150 -121 -35 19
5588A9k85L57k81K27p2N2n2J06O9j90J1K41k12R3N4j47J40k46N07o37P6L56k26
$$ 19 -266 91 -190 37 -35 17 -35 71 140 -50 -39 202 -10 83 137 -10 130 -116 391 -246 -170 186 -40
5611d0J32j34K86k81J10k0Q0J9j35j47J98j42L19P4m93J1K18k70L59m9j06Q0J37
$$ -40 92 -42 244 -37 73 53 133 152 17 -130 68 -74 245 319 -174 -163 55 -215 144 95 -11 69 206
5634B06j60l51K12m0K00l05P0KK54j47%K32k66J01j49J20k54L26j16M0p3J84P
$$ 206 46 -305 -93 -133 67 -238 -168 -166 88 -59 -59 173 -93 8 -141 -21 -275 51 -65 -25 -98 86 93
5657I3j16J10n10N18l54O4J50J69j94m4MJ49J40m60L60M5l75J94j57L60l1j70
$$ 93 -23 87 -423 95 -259 -195 -45 124 -70 -114 -110 39 179 -281 79 124 -251 -57 -214 146 115 -55
5679e5L99k98m5j37J92j70J36j24M0J48j40J67N8j57J66r1r4l7O9l7N4J39o3k01
$$ -55 344 46 1 -136 56 -114 22 -102 -62 86 -54 113 171 14 180 89 -5 -42 27 -10 44 183 120 -81
5703h1J9j02j14K81o3q3j33J56N6J14P0N0k71J87J8o8J63j36r5J0j18J47J27L7
$$ -81 -62 -164 -278 3 -60 -143 -276 -120 -64 50 120 170 -101 86 104 36 199 63 -32 -22 -140 7 134 171
5727A71k17m5J18J08j66K7J61O9j84k22K84j56j73L18k73lK99j19K38l77L1K77
$$ 171 -46 -91 27 135 -31 -4 157 226 42 -180 104 -52 -225 93 -180 -183 116 -3 235 -142 -111 166
5749A66k28K15m65L21q0m5J76j80L03r2l7O2k12m5K49j72J61j15J05n9l72K18
$$ 166 -62 153 -312 9 -71 -116 60 -120 183 91 54 116 -96 -141 108 -64 97 -18 87 28 -344 -126
5771a26p0K0J47J90k72Q5j02P4k7J50m4J38k08K21p2q5L5l6k73L87r9k73N0L88
$$ -126 -196 -176 -29 161 -111 -26 -128 -54 -81 69 25 163 -45 176 104 19 54 18 -255 132 33 -240 -190 198
5795A98k17J6m13M41J99l62J4J83N8l04J57q2L0L03K18l97n1Jm8n2L43j4k18M8
$$ 198 -19 -3 -416 25 224 -138 -124 59 117 -187 -30 -112 -82 221 439 42 -9 -8 -56 -108 235 221 3 51
5819E1J95m80L26m7l05L02P5K1j88Q0M2J43j48r9K22o3O8j51O6j03lk50L43q0
$$ 51 246 -234 92 45 -260 42 117 138 -50 30 72 215 67 -32 190 127 195 44 110 7 4 -246 97 17
$$ [...]
8191B40
##END NTUPLES=NMR FID
##END=
