##TITLE=1H_Pr C8-Am
 CDCl3
 8 sc, 
 17.12.2021
##JCAMPDX= 6.0         $$ Bruker NMR JCAMP-DX V2.0
##DATA TYPE= NMR FID
##DATA CLASS= NTUPLES
##ORIGIN= UXNMR, Bruker Analytische Messtechnik GmbH
##OWNER= root
$$ XWIN-NMR		Version 3.5
$$ Fri Dec 17 12:04:10 2021 Russian Standard Time (UT+4h)  she@DPX200
##.OBSERVE FREQUENCY= 200.131346
##.OBSERVE NUCLEUS= ^1H
##.DELAY= (6, 6)
##.ACQUISITION MODE= SIMULTANEOUS
##.ACQUISITION SCHEME= undefined
##.AVERAGES= 8
##.DIGITISER RES= 18
##SPECTROMETER/DATA SYSTEM= spect
##.PULSE SEQUENCE= zg30
##.SOLVENT NAME= CDCl3
##.SHIFT REFERENCE= (INTERNAL, CDCl3, 0, 15.7039)
##AUDIT TRAIL= $$ (NUMBER, WHEN, WHO, WHERE, WHAT)
$$ ##TITLE= Audit trail, XWIN-NMR		Version 3.5
$$ ##JCAMPDX= 5.01
$$ ##ORIGIN= Bruker BioSpin GmbH
$$ ##OWNER= she
$$ F:/spectra/data/she/nmr/H-F/1/audita.txt
$$ ##AUDIT TRAIL=  $$ (NUMBER, WHEN, WHO, WHERE, WHAT)
(   1,<2021-12-17 12:02:59.79 +0400>,<she>,<DPX200>,
      <created by zg, POWCHK disabled, PULCHK disabled
       configuration hash MD5:
       00 E9 B6 7A A2 85 ED C7 34 08 36 98 17 FE 4E 26
       data hash MD5: 16K
       83 F0 3F 93 D0 6D A2 4F 4B BD 92 91 77 03 A1 C3>)
$$ ##END=
$$ 
$$ hash MD5
$$ 65 A1 50 0A 75 9B 40 4B 7C 5D F5 9C 1B 92 3F FA
##$RELAX= 
##$RELAX= 
##$RELAX= 
##$RELAX= 
##$RELAX= 
##$RELAX= 
$$ Bruker specific parameters
$$ --------------------------
##$DU= <F:/spectra>
##$EXPNO= 1
##$NAME= <H-F>
##$PROCNO= 1
##$TYPE= <nmr>
##$USER= <she>
##$AMP= (0..31)
100 100 100 100 100 100 100 100 100 100 100 100 100 100 100 100 100 100 
100 100 100 100 100 100 100 100 100 100 100 100 100 100 
##$AQSEQ= 0
##$AQ_mod= 1
##$AUNM= <au_zg>
##$AUTOPOS= <>
##$BF1= 200.13
##$BF2= 200.13
##$BF3= 200.13
##$BF4= 200.13
##$BF5= 200.13
##$BF6= 200.13
##$BF7= 200.13
##$BF8= 200.13
##$BYTORDA= 1
##$CFDGTYP= 0
##$CFRGTYP= 5
##$CHEMSTR= <none>
##$CNST= (0..31)
1 1 145 1 1 1 1 1 1 1 1 1 1 1 1 1 1 1 1 1 1 1 1 1 1 1 1 1 1 1 1 1 
##$CPDPRG= <>
##$CPDPRG1= <>
##$CPDPRG2= <>
##$CPDPRG3= <>
##$CPDPRG4= <mlev>
##$CPDPRG5= <mlev>
##$CPDPRG6= <mlev>
##$CPDPRG7= <mlev>
##$CPDPRG8= <mlev>
##$CPDPRGB= <>
##$CPDPRGT= <>
##$D= (0..31)
0 1.2 0 0 0 0 0 0 0 0.06 0 0.03 0 0 0 0 0.0002 0 0 0 0 0 0 0 0 0 0 0 0 
0 0 0 
##$DATE= 1639728179
##$DBL= (0..7)
120 120 120 120 120 120 120 120 
##$DBP= (0..7)
150 150 150 150 150 150 150 150 
##$DBP07= 0
##$DBPNAM0= <>
##$DBPNAM1= <>
##$DBPNAM2= <>
##$DBPNAM3= <>
##$DBPNAM4= <>
##$DBPNAM5= <>
##$DBPNAM6= <>
##$DBPNAM7= <>
##$DBPOAL= (0..7)
0.5 0.5 0.5 0.5 0.5 0.5 0.5 0.5 
##$DBPOFFS= (0..7)
0 0 0 0 0 0 0 0 
##$DE= 6
##$DECBNUC= <off>
##$DECIM= 32
##$DECNUC= <off>
##$DECSTAT= 4
##$DIGMOD= 1
##$DIGTYP= 9
##$DL= (0..7)
0 120 120 120 120 120 120 120 
##$DP= (0..7)
150 150 150 150 150 150 150 150 
##$DP07= 0
##$DPNAME0= <>
##$DPNAME1= <>
##$DPNAME2= <>
##$DPNAME3= <>
##$DPNAME4= <>
##$DPNAME5= <>
##$DPNAME6= <>
##$DPNAME7= <>
##$DPOAL= (0..7)
0.5 0.5 0.5 0.5 0.5 0.5 0.5 0.5 
##$DPOFFS= (0..7)
0 0 0 0 0 0 0 0 
##$DQDMODE= 0
##$DR= 18
##$DS= 0
##$DSLIST= <SSSSSSSSSSSSSSS>
$$ [...]
##$SUBNAM2= <"">
##$SUBNAM3= <"">
##$SUBNAM4= <"">
##$SUBNAM5= <"">
##$SUBNAM6= <"">
##$SUBNAM7= <"">
##$SUBNAM8= <"">
##$SUBNAM9= <"">
##$SW= 18.0517287032376
##$SWIBOX= (0..15)
0 0 2 0 0 0 0 0 0 0 0 0 0 0 0 0 
##$SW_h= 3612.71676300578
##$TD= 16384
##$TD0= 1
##$TE= 0
##$TE2= 300
##$TE3= 300
##$TEG= 300
##$TL= (0..7)
0 120 120 120 120 120 120 120 
##$TP= (0..7)
150 150 150 150 150 150 150 150 
##$TP07= 0
##$TPNAME0= <>
##$TPNAME1= <>
##$TPNAME2= <>
##$TPNAME3= <>
##$TPNAME4= <>
##$TPNAME5= <>
##$TPNAME6= <>
##$TPNAME7= <>
##$TPOAL= (0..7)
0.5 0.5 0.5 0.5 0.5 0.5 0.5 0.5 
##$TPOFFS= (0..7)
0 0 0 0 0 0 0 0 
##$TUNHIN= 0
##$TUNHOUT= 0
##$TUNXOUT= 0
##$USERA1= <user>
##$USERA2= <user>
##$USERA3= <user>
##$USERA4= <user>
##$USERA5= <user>
##$V9= 5
##$VALIST= <valist>
##$VCLIST= <CCCCCCCCCCCCCCC>
##$VD= 0
##$VDLIST= <DDDDDDDDDDDDDDD>
##$VPLIST= <PPPPPPPPPPPPPPP>
##$VTLIST= <TTTTTTTTTTTTTTT>
##$WBST= 1024
##$WBSW= 4
##$XGAIN= (0..3)
0 0 0 0 
##$XL= 0
##$YL= 0
##$YMAX_a= 182055
##$YMIN_a= -247535
##$ZGOPTNS= <>
##$ZL1= 120
##$ZL2= 120
##$ZL3= 120
##$ZL4= 120
##$ABSF1= 10
##$ABSF2= 0
##$ABSG= 5
##$ABSL= 3
##$ALPHA= 0
##$AQORDER= 0
##$ASSFAC= 0
##$ASSFACI= 0
##$ASSFACX= 0
##$ASSWID= 0
##$AUNMP= <proc_1d>
##$AZFE= 0.1
##$AZFW= 0.1
##$BCFW= 1
##$BC_mod= 2
##$BYTORDP= 1
##$COROFFS= 0
##$CY= 11.3945322036743
##$DATMOD= 1
##$DC= 2
##$DFILT= <>
##$DTYPP= 0
##$F1P= 2.36226072786647
##$F2P= -0.459571619588291
##$FCOR= 0.5
##$FTSIZE= 0
##$FT_mod= 4
##$GAMMA= 1
##$GB= 0.15
##$INTBC= 1
##$INTSCL= 1
##$ISEN= 128
##$LB= 0.24
##$LEV0= 0
##$LPBIN= 0
##$MAXI= 10000
##$MC2= 0
##$MEAN= 0
##$ME_mod= 0
##$MI= 1.114404
##$NCOEF= 0
##$NC_proc= 0
##$NLEV= 6
##$NOISF1= 3.799351
##$NOISF2= 2.8
##$NSP= 1
##$NTH_PI= 0
##$NZP= 0
##$OFFSET= 15.70392
##$PC= 1
##$PHC0= -15869.7
##$PHC1= 11.40079
##$PH_mod= 1
##$PKNL= yes
##$PPARMOD= 0
##$PSCAL= 0
##$PSIGN= 0
##$REVERSE= no
##$SF= 200.130013532006
##$SI= 16384
##$SIGF1= 3
##$SIGF2= 2
##$SINO= 400
##$SIOLD= 16384
##$SREGLST= <1H.CDCl3>
##$SSB= 0
##$STSI= 0
##$STSR= 0
##$SW_p= 3612.71676300578
##$SYMM= 0
##$S_DEV= 0
##$TDeff= 0
##$TDoff= 0
##$TI= <>
##$TILT= no
##$TM1= 0
##$TM2= 0
##$TOPLEV= 0
##$USERP1= <user>
##$USERP2= <user>
##$USERP3= <user>
##$USERP4= <user>
##$USERP5= <user>
##$WDW= 1
##$XDIM= 8192
##$YMAX_p= 0
##$YMIN_p= 0
$$ End of Bruker specific parameters
$$ ---------------------------------
##NTUPLES= NMR FID
##VAR_NAME=  TIME,          FID/REAL,        FID/IMAG
##SYMBOL=    X,             R,               I
##VAR_TYPE=  INDEPENDENT,   DEPENDENT,       DEPENDENT
##VAR_FORM=  AFFN,          ASDF,            ASDF
##VAR_DIM=   8192,          8192,            8192
##UNITS=     SECONDS,       ARBITRARY UNITS, ARBITRARY UNITS
##FACTOR=    0.0002768,     1,               1
##FIRST=     0,             0,               0
##LAST=      2.2672688,     0,               0
##MIN=       0,             -247535,         0
##MAX=       2.2672688,     182055,          0
$$ Real data points
##PAGE= N=1
##DATA TABLE= (X++(R..R)), XYDATA
$$ [...]
$$ plain form
1866 -67 -79 105 -760 -16 -141 -403 171 -555 -56 240 -569 78 -15 -188 362 -70 38 689 -295 183 481
1887 481 -366 547 225 -68 451 -83 -34 141 -569 -32 26 -490 448 -472 -383 -20 -307 72 241 -666 210
1908 210 -131 50 350 -168 12 255 69 418 84 -201 676 -52 90 444 -442 160 -133 -301 159 -268
1928 -268 -262 119 -526 102 -284 -442 336 -393 -400 300 -426 -51 177 -386 212 8 -173 432 -51 274 487
1949 487 -116 499 202 -125 346 -343 -193 81 -705 72 68 -594 182 -743 -237 -69 -346 -40 -186 -436 250
1970 250 -148 -129 423 -32 226 518 180 692 -12 -104 375 -277 190 132 -368 512 27 -369 512 -275 -67
1991 -67 94 -272 -105 -308 -776 77 -337 -110 83 -557 106 109 -160 311 -19 78 399 -107 264 266 -252 609
2013 609 245 -84 413 -286 -117 -83 -522 242 -241 -462 96 -633 -154 15 -625 -176 9 -345 307 -254
$$ packed form
1866f7j2J84q65P44j25k62N74p26M99K96q09O47r3j73N50m32J08O51r84M78K98
1887D81q47R13l22k93N19n34M9J75p10N37N8n16R38r20Q9L63k87L79J69r07Q76
1908B10l41J81L00n18J80K43j86L49l34k85Q77p28J42L54q86O02k93j68M60m27
1928b68OL81o45O28l86j58P78p29pP00p26L75K28n63N98k04j81O05m83L25K13
1949D87o03O15k97l27M71o89J50K74p86P77mo62P76r25N06J68k77L06j46k50O86
1970B50l98J9N52m55K58K92l38N12p04r2M79o52M67n8n00Q80m85l96Q81p87K08
1991f7J61l66J67k03m68Q53m14K27J93o40O63Lk69M71l30R7L21n06L71Kn18Q61
2013F09l64l29M97o99J69L4m39P64m83k21N58p29M79J69o40M49J85l54O52n61
$$ plain form
2033 -254 -334 270 -211 306 175 -207 600 -189 -177 758 -359 64 534 -167 475 268 -189 269 -434 -221
2053 -221 295 -741 16 -127 -435 462 -451 -171 111 -473 291 85 -496 -17 245 171 581 -499 268 424
2073 424 -114 716 -67 -67 488 -9 220 282 -268 367 -6 -343 427 -609 -240 238 -514 -149 -29 -459 5
2094 5 -384 -332 251 -296 113 33 -100 517 261 -67 440 -272 416 308 -343 202 89 97 480 -132 -401 317
2116 317 -628 39 -199 -614 -70 -165 -75 70 -367 -90 -43 -224 133 96 81 378 -168 127 141 -91 501 -83
2138 -83 160 418 -291 368 253 -233 129 77 140 484 -355 -167 263 -563 -198 25 -446 434 -369 -244 -1
2159 -1 -93 241 452 -372 347 96 3 587 -170 219 396 -84 543 -13 -341 488 -270 -202 131 -436 -150 -228
2181 -228 -554 188 -385 -3 161 -441 -196 178 -335 100 -52 -135 349 -181 372 402 -445 443 365 231 266
$$ packed form
2033b54q0O04m81N17j31l82Q07p89J2R35j117M23M70p01O42k07m57M58p03K13
2053b21N16j036P57j43l08Q97r13K80K82n84P64k06n81M79K62p4M10j080P67J56
2073D24n38Q30p83%N55m97K29O2n50O35l73l37P70j036L69M78p52L65J20m30M64
2094El89N2N83n47M09q0j33O17k56l28N07p12O88j08o51N45j13QL83o12k69P18
2116C17r45O67k38m15N44r5R0J45m37K77M7j81L57l7j5K97n46K95J4k32N92n84
2138h3K43K58p09O59j15m86L62n2O3L44q39J88M30q26L65K23m71Q80q03J25K43
2159ar2L34K11q24P19k51r3N84p57L89J77m80O27n56l28Q29p58O8L33n67K86p8
2181b28l26P42n73L82J64o02K45L74n13M35j52q3M84n30N53L0q47Q88p8j34L5
$$ plain form
2202 266 -213 119 201 -372 23 -103 -341 243 -209 -122 192 -212 -163 163 -531 185 -330 -34 -111 -145 158 12
2224 12 -361 380 -105 -158 405 -262 163 285 -123 308 276 -140 421 -168 184 199 -412 103 -407 -267 166
2245 166 -413 -33 8 -355 139 47 -307 470 -111 -201 378 -193 339 159 -200 338 264 237 193 -549 33 52
2267 52 -208 36 -49 -474 577 -92 -107 93 -765 224 -77 -223 184 -238 -117 117 -451 103 29 -398 301
2288 301 -108 30 493 -56 445 469 116 298 186 2 209 -65 143 152 -513 3 -219 -117 355 -142 -359
2309 -359 181 -262 66 11 -515 317 -16 -129 213 -23 147 257 -13 278 -50 -152 480 -185 70 310
2329 310 -253 37 43 -349 153 -463 -27 33 -574 136 113 -417 -142 -184 -154 189 -324 228 169 -137 302 -3
2351 -3 -67 386 -236 249 207 -328 327 -5 -63 440 1 266 216 -344 2 277 -392 246 -314 -308 -26 -214 152
$$ packed form
2202B66m79L32Q2n73L95j26k38N84m52Q7L14m04M9L26o94P16n15K96p7l4L03j46
2224A2l73P41m85n3N63o67M25J22m08M31l2m16N61n89L52J5o11N15n10J40M33
2245A66n79L80M1l63M94r2l54P77n81r0N79n71N32j80l59N38p4k7m4p42N82J9
2267E2k60K44q5m25J051o69j5K00q58R89l01j46M07m22J21K34n68N54p4m27O99
2288C01m09J38M63n49N01K4l53J82j12j84K07k74K08Ro65N16k22J02M72m97k17
2309c59N40m43L28n5n26Q32l33j13L42k36J70J10k70K91l28j02O32o65K55K40
2329C10n63K90Ol92N02o16M36O0o07P10k3n30K75m2L0L43n13N52n9l06M39l05
2351co4M53o22M85m2n35O55l32n8N03m39K65n0n60L46K75o69O38n60OK82j88L66
$$ plain form
2374 152 -165 -410 419 -63 41 226 -265 -139 85 -200 297 115 -359 349 -281 228 364 -134 147 -71
2394 -71 102 243 -256 -159 -18 -436 -109 -24 -320 113 -357 -267 215 -307 -66 141 -207 361 -10 86 583 85
2416 85 146 444 -155 77 176 -88 184 -97 -80 116 -207 263 -117 -266 55 -129 -39 96 -293 -85 -46 -445
2438 -445 101 31 -107 323 -218 253 287 -237 385 235 -232 457 -210 100 236 -53 470 -64 -141 -80 -280
2459 -280 -82 128 -342 130 -56 -1 92 21 -71 242 -288 167 -121 -478 406 313 31 516 -193 174 291 -57
2481 -57 177 169 15 385 9 -154 147 -314 182 96 -70 126 -213 243 5 -639 188 -77 -392 106 -301
2502 -301 -172 243 -96 -79 398 -305 403 -138 -287 505 30 186 266 -398 183 216 -210 300 -188 -298 299
2523 299 -131 102 -105 -286 2 -105 -113 60 -524 23 227 -133 151 131 47 273 14 130 219 -152 368 -187
$$ packed form
2374A52l17k45Q29m82J04J85m91J26K24k85M97j82m74P08o30N09J36m98K81k18
2394g1J73J41m99R7J41m18L27Q5k96M33m70R0M82n22K41K07l48N68l71R6M97m98
2416H5O1K98n99K32R9k64K72k81J7J96l23M70l80j49L21j84R0J35l89K08L9l99
2438d45N46p0j38M30n41M71L4n24O22j50m67O89o67L10J36k89N23n34p7O1k00
2459b80J98K10m70M72j86N5R3p1r2L13n30M55k88l57Q84r3k82M85p09L67J17l48
2481e7K34qj54L70l76j63L01m61M96q6j66J96l39M56k38o44Q27k65l15M98m07
2502c01J29M15l39J7M77p03P08n41j49P92m75J56Q0o64N81L3m26N10m88j10N97
2523B99m30K33k07j81K88j07qJ73n84N47K04l60K84k0q4K26k59J16Q9l71N20n55
$$ plain form
2545 -187 -260 337 -364 -58 254 -343 155 43 -219 50 -72 -28 6 -396 -9 -52 -273 -82 -390 -39 249
2566 249 -149 -74 411 -189 187 -177 -68 334 -276 120 286 -16 187 291 -105 13 -413 -19 45 -354 106
2587 106 -146 -315 286 -52 -122 410 -86 181 26 -226 238 -83 137 323 -195 -123 116 -10 277 -154 -188
2608 -188 229 -344 -185 260 -230 257 -51 -281 266 -131 -27 150 -515 -125 -125 -344 230 -17 -44 146 -290
2629 -290 47 302 -291 181 101 59 354 -147 25 331 -328 176 -83 -62 294 -305 -264 157 -143 247 -230
2650 -230 -476 310 -373 40 -228 -397 -123 32 -150 187 -63 23 335 -72 116 289 -174 64 369 -141
2670 -141 27 -182 109 98 -106 93 45 -263 174 -344 -35 146 -173 -75 -29 -251 177 -137 -83 85 -422 219
2692 219 246 -20 243 42 59 323 -12 154 302 -287 384 36 -64 61 -43 31 117 -370 -119 48 -326
$$ packed form
2545a87p3N97p01L06L12n97M98j12k62K69j22M4L4m02L87m3k21J91l08L51K88
2566B49l98P5M85o00L76l64J09M02o10L96J66l02K03J04l96J18m26L94O4l99M60
2587A06k52j69O01l38p0N32m96K67j55k52M64l21K20J86n18P2K39j26K87m31l4
2608a88M17n73J59M45m90M87l08k30N47l97J04J77o65L90%k19N74k47k7J90m36
2629b90L37K55n93M72q0m2K95n01J72L06o59N04k59K1L56n99M1M21l00L90m77
2650b30k46P86o83M13k68j69K74J55j82L37k50Q6L12m07J88J73m63K38L05n10
2670a41J68k09K91j1k04J99m8l08M37n18L09J81l19R8M6k22M28l14N4J68n07O41
2692B19K7k66K63k01J7K64l35J66J48n89O71l48j00J25j04P4Q6m87K51J67l74
$$ plain form
2713 -326 155 -181 -243 60 -141 -13 278 -246 -25 -100 62 151 -78 247 -77 -179 529 182 -87 200 -53
2734 -53 184 -94 -168 147 -181 -86 349 -361 -100 219 -415 214 165 -620 -21 -110 -94 334 -297 -30 40 -201
2756 -201 152 143 -204 292 -62 253 184 -38 307 69 -55 329 128 -14 140 -328 267 45 -177 243 -402
2777 -402 -137 47 -71 108 3 -322 330 138 182 221 -231 81 142 -50 308 56 -219 175 -240 -171 377
2798 377 92 80 17 -102 299 -136 65 315 -36 -51 142 -128 66 -198 -179 249 -414 242 70 -29 323 81
2820 81 -105 228 -94 134 403 -142 207 177 -99 162 -74 341 -1 -345 -108 -63 -331 -10 -192 -164 235
2841 235 -270 100 79 -133 356 -189 -180 142 -305 231 -48 144 151 316 -139 729 -22 283 131 -107 413 146
2863 146 -226 107 -212 -276 62 -254 127 -10 -154 -106 -27 -35 -17 -81 478 98 -2 225 -86 -41 437 113 236
$$ packed form
2713c26M81l36o2L03k01J28K91n24K21p5J62Q9k29L25l24j02P08l47k69K87k53
2734e3K37k78p4L15l28R5M35p10K61L19o34O29m9p85N99q9J6M28o31K67P0k41
2756b01L53rl47M96l54L15o9k22L45k38j24L84k01j42J54m68N95k22k22M20o45
2777d02K65J84j18J79j05l25O52j92M4L9m52L12O1j92L58k52k75L94m15O9N48
2798C77k85j2o3j19M01m35K01K50l51j5J93k70J94k64J9M28o63O56j72r9L52k42
2820H1j86L33l22K28K69n45L49l0k76K61k36M15l42l44K37M5k68L21j82K8L99
2841B35n05L70k1k12M89n45RL22m47N36k79J92PJ65m55Q68p51L05j52k38N20k67
2863A46l72L33l19o4L38l16L81j37j44M8P9qJ8o4N59l80j00K27l11M5M78l24J23
$$ plain form
2886 236 -2 -125 249 164 36 411 -172 -160 208 97 245 -23 -125 184 -342 -291 -332 66 112 -131 -159 231
2908 231 -107 -67 189 -123 165 108 141 399 245 251 212 78 -259 81 50 47 -13 -194 324 -271 18 124 -116
2931 -116 28 -76 -243 -351 -287 -105 203 169 200 178 61 309 35 -132 383 155 187 192 -58 320 -59 -252
2953 -252 270 -123 392 338 -115 70 -171 -92 462 -83 -242 -92 -389 -4 -279 -333 360 -339 -104 335 -172
2974 -172 109 1 -21 127 33 36 226 34 120 -13 -149 -50 118 -229 150 -156 -147 40 -170 19 18 -99 230
2997 230 32 -133 -79 -327 -152 -75 -108 -1 -7 -159 155 16 53 307 98 559 168 -59 692 -75 -119 334
3019 334 -278 -2 40 -327 165 -210 57 3 -334 -5 184 -162 -43 -184 -53 -15 -214 -116 -15 -279 69
3040 69 44 100 273 -59 201 102 -99 142 61 -191 224 -70 -163 170 -106 -83 130 -354 173 -214 -305 -1 -100
$$ packed form
2886B36k38j23L74q5j28L75n83J2L68j11J48k68j02L09n26N1m1L98M6k43k8L90
2908B31l38M0K56l12K88n7L3K58j54Ol9j34l37L40l1lo0j81N18n95K89J06k40
2931a16J44j04j67j08O4J82L08l4L1k2j17K48k74j67N15k28L2Nk50L78l79j93
2953b52N22l93N15n4m53J85k41P9N54n45j59J50k97L85k75n4O93o99K35M39n07
2974a72K81j08k2J48r4LJ90j92Q6j33j36R9J68l47L79l06RJ87k10J89jj17L29
2997B30j98j65N4k48J75P7l3J07oj52L14j39L7K54k09M61l91k27P51p67m4M53
3019C34o12K76M2l67M92l75K67n4l37L29J89l46J19j41J31L8j99R8J01k64L48
3040F9k5N6J73l32K60r9k01K41q1k52M15k94r3L33k76K3K13m84N27l87r1L04r9
$$ plain form
3063 -100 -171 -361 -306 -37 -21 -65 219 71 64 41 89 239 -51 129 100 5 -182 -11 -36 256 253 -161 162 -158
3087 -158 -107 107 -291 53 -200 -142 -36 204 -90 59 93 16 265 -45 489 -132 100 177 -189 9 -79 -145
3109 -145 167 37 -250 269 12 -40 264 -239 -55 -149 -44 136 -132 -58 107 -160 10 91 -361 118 -21
3130 -21 -95 -26 -110 -14 59 234 209 -21 -175 271 256 240 -20 -240 76 -41 -162 200 -292 -105 69 -273 -153
3153 -153 13 -136 215 -60 89 57 -82 86 151 37 -43 -60 14 93 -27 -197 238 95 297 -63 -11 158
3175 158 -193 163 -22 -337 84 28 -290 -111 -205 -88 72 -13 -120 242 -106 186 -230 -53 299 -29 100
3196 100 179 -116 307 184 -117 66 79 0 42 -49 40 -4 -99 31 -28 -146 -127 -145 262 -97 -169 249 -100 9
3220 9 159 -192 81 -282 15 241 26 -145 -11 -134 -8 201 -106 314 14 -275 257 99 41 -92 -251
$$ packed form
3063a00p1j90N5K69J6m4K84j48pk3M8J50k90J80k9r5j87J71k5K92lm14L23l20
3087a58N1K14l98L44k53N8J06K40k94J49L4p7K49l10N34o21K32P7l66J98q8o6
3109a45L12j30k87N19k57n2L04n03J84r4J05J80k68P4J65k67J70Q1m52M79j39
3130b1p4O9q4R6P3J75k5k30j54M46j5j6k60k20L16j17j21L62m92J87J74l42J20
3153a53J66j49L51k75J49l2j39J68O5j14q0j7P4P9j20j70M35j43K02l60N2J69
3175A58l51L56j85l15M21n6l18J79r4J17J60q5j07L62l48K92m16J77L52l28J29
3196A00P9k95M23j23l01J83J3p9M2r1Q9m4r5J30n9j18J9j8M07l59p2M18l49J09
3220IJ50l51K73l63K97K26k15j71J34j23J26K09l07M20l00k89N32j58n8j33j59
$$ plain form
3241 -251 24 -55 -425 -24 -8 80 -115 -92 60 98 -312 325 111 -255 -7 -234 152 68 -43 216 -11 118
3263 118 402 200 83 234 -248 230 6 -47 188 -43 8 141 -337 -74 -184 31 164 3 268 -73 -162
3284 -162 54 -208 71 210 -64 40 164 -128 130 259 -108 243 134 -396 237 -262 -248 146 -125 209
3304 209 176 92 132 -236 -18 20 -258 353 192 -204 62 22 -1 58 70 7 247 -227 118 13 170 323 -112
3327 -112 -354 -49 176 98 85 181 290 -278 158 -75 -188 146 2 -372 -68 1 -25 224 -241 -10 90 -180
3349 -180 299 5 -269 73 133 156 96 -148 350 215 -17 253 91 -4 40 -100 119 -74 -223 92 -36 -71
3371 -71 425 -10 -53 -74 -117 -182 -117 77 77 10 27 -34 -7 -14 112 105 317 -78 127 141 -132 318 -54 -123 34 -333
3397 -333 98 138 -295 28 -49 40 322 15 -145 -147 -36 9 75 -39 70 -269 213 19 78 78 150 -156 3 -119
$$ packed form
3241b51K75p9l70M01J6Q8j95K3J52L8m10O37k14l66K48k27L86q4j11K59k27J29
3263A18K84k02j17J51m82M78k24n3K35k31N1J33m78K63j10K15J33j61K65l41q9
3284a62K16k62K79J39k74J04J24k92K58J29l67L51j09n30O33m99J4L94k71L34
3304B09l3q4M0l68K18L8k78O11j61l96K66m0k3N9J2o3K40m74L45j05J57J53m35
3327a12k42L05K25p8j3R6J09n68M36k33j13L34j44l74L04O9k6K49m65K31J00k70
3349a80M79k94k74L42O0K3o0k44M98j35k32K70j62r5M4j40K19j93j49L15j28l5
3371g1M96m35m3k1m3o5O5J94%o7J7o1K7pJ26pK12l95K05J4k73M50l72o9J57l67
3397c33M31M0m33L23p7Q9K82l07j60kJ11M5O6j14J09l39M82j94N9%P2l06J59j22
$$ plain form
3421 -119 127 89 -221 -145 -58 -160 42 239 -198 91 -308 -98 197 -226 -51 243 -92 -52 -71 58 -225 -14
3443 -14 -38 267 -99 29 -140 69 335 268 74 221 -233 323 -45 -265 333 106 41 39 -159 68 35 -270
3465 -270 311 -52 -48 -94 -314 134 72 -84 155 -86 -105 102 -129 100 237 -95 166 108 -195 -22 48 -136
3487 -136 190 40 80 -191 -417 17 -154 23 -78 -373 255 -181 -115 2 -149 -135 49 -197 107 198 -101
3508 -101 112 164 27 418 -353 -378 151 -192 106 298 126 -40 -82 22 182 7 -101 204 -92 -23 -258
3529 -258 -140 -223 -108 84 96 46 -234 -2 -60 199 -284 -12 -78 -73 389 189 124 4 -66 -304 272 -40 27
3552 27 -201 161 120 -186 126 298 -81 -163 93 -113 -42 -151 82 137 -197 90 12 -23 255 134 48 -80 244
3575 244 -23 92 -137 204 7 -57 -15 167 36 89 -199 -149 16 3 -70 -205 192 79 -98 209 213 -23 97
$$ packed form
3421a19K46l8l10P6Q7j02K02J97m37K89l99K10K95m23J75K94l35M0j9J29k83K11
3443a4k4L05l66J28j69K09K66o7j94J47m54N56l68k20N98k27o5kj98K27l3l05
3465b70N81l63Mm6k20M48o2j56K39k41j9K07k31K29J37l32K61n8l03J73P0j84
3487a36L26j50M0k71k26M34j71J77j01k95O28m36O6J17j51J4J84k46L04R1k99
3508a01K13N2j37L91p71k5N29l43K98J92j72j66m2J04J60j75j08L05k96O9k35
3529b58J18q3J15J92J2n0k80K32n8K59m83K72o6NM62k00o5j20p0k38N76l12O7
3552B7k28L62m1l06L12J72l79q2K56k06P1j09K33N5l34K87p8l5K78j21q6j28L24
3575B44k67J15k29L41j97o4M2J82j31N3k88N0J65j3p3j35L97j13j77L07Mk36J20
$$ plain form
3598 97 265 -218 420 -320 -115 38 -153 356 -35 -118 108 211 182 -78 -64 243 -42 -190 27 -63 -113 -123
3620 -123 -210 -187 53 117 -12 3 -214 -46 214 22 -99 83 266 -8 -129 13 -37 -11 -3 55 -109 26 16
3643 16 52 30 150 125 -17 229 56 -165 -15 -184 -251 185 -207 -17 -184 -47 73 -42 65 54 111 10
3665 10 161 203 1 -249 48 221 4 18 151 -164 135 34 57 196 -134 135 -102 -48 155 59 -85 164
3687 164 14 -129 57 -79 74 203 13 85 260 -88 350 -71 306 79 0 -48 75 -41 114 -205 -170
3708 -170 -46 -69 -171 221 18 -94 -105 -195 -56 170 -50 -212 80 199 -36 -159 82 -43 166 249 103
3729 103 188 28 -14 197 -199 115 -165 -12 140 11 -79 64 245 -93 283 -223 62 77 -68 19 -19 122
3751 122 -70 -154 35 -127 108 52 -34 -228 6 -28 -18 265 -2 -66 -129 49 -8 74 -270 -14 -92 385 -235
$$ packed form
3598I7J68m83O38p40K05J53j91N09l91q3K26J03k9k60J4L07k85j48K17r0n0j0
3620a23q7K3K40O4j29J5k17J68K60j92j21J82J83k74j21J42n0K6QN8j64J35j0
3643A6L6k2J20k5j42K46j73k21J50j69o7M36l92J90j67J37J20j15J07j1N7j01
3665A0J51M2k02k50K97J73k17J4J33l15K99j01K3J39l30K69k37N4K03r6j44K49
3687A64j50j43J86j36J53J29j90P2J75l48M38m21L77k27p9m8J23j16J55l19L5
3708a70J24k3j02L92k03j12j1r0J39K26k20j62K92J19k35j23K41j25K09Q3j46
3729A03Q5j60m2K11l96L14k80J53J52j29r0J43J81l38L76n06K85J5j45Q7l8J41
3751A22j92q4J89j62K35n6q6j94K34l4J0K83k67o4o3J78n7Q2l44K56p8M77o20
$$ plain form
3774 -235 -335 131 -113 39 30 -54 160 -84 -158 319 22 -183 -45 206 -104 130 -286 -77 -74 46 321 -30
3796 -30 -52 116 -31 179 105 -259 -137 -99 -29 89 -19 30 -2 -44 109 -150 -310 -116 -126 -170 175 100 130 157
3820 157 66 179 103 -19 221 -209 299 175 140 118 20 -163 163 19 -61 102 185 56 -152 74 102 -102 106
3843 106 325 26 0 33 -86 -165 52 -46 -73 67 133 -165 -132 204 -14 200 369 -204 119 195 -225 93 39
3866 39 23 -24 99 70 -49 -24 -35 -268 -289 -57 16 -63 -69 -12 108 -25 40 147 -88 131 -67 95 -98 19
3890 19 -43 15 -203 157 183 282 35 16 -224 4 290 -342 -148 1 36 124 -2 118 -49 -189 -55 -39 -33 201
3914 201 68 28 11 -114 139 -272 -109 -32 -3 19 248 -111 28 -135 37 46 162 32 -66 -109 54 -141 -24
3937 -24 -12 -285 260 87 -7 -57 -34 -68 -169 46 50 134 118 197 253 -48 506 -72 281 -228 -334 -164 40 -40
$$ packed form
3774b35j00M66k44J52rq4K14k44p4M77k97k05J38K51l10K34m16K09LJ20K75l51
3796c0k2J68j47K10p4l64J22L8P0J18j08M9l2m2J53k59j60J94j0m4L45p5L0K7
3820A57r1J13p6j22K40m30N08j24l5k2r8j83L26j44q0J63Q3j29k08K26K8k04K08
3843A06K19k99k6L3j19p9K17r8k7J40O6k98L3L36k18K14J69n73L23P6m20L18n4
3866C9j6m7J23k9j19K5j1k33k1K32P3p9oN7J20j33O5J07k35K19j98J62j93J17
3890A9o2N8k18L60K6R9k47j9k40K28K86o32J94J49L5Q8j26J20j67j40J34J6OK34
3914B01j33m0j7j25K53m11J63P7K9K2K29l59J39j63J72RJ16j30r8m3J63j95J17
3937b4J2k73N45j73r4n0K3l4j01K15MQ4j6P9N6l01N54n78L53n09j06J70K04q0
$$ plain form
3961 -40 197 -208 -35 39 -272 382 -107 -215 109 -308 -164 144 -290 36 76 -232 -148 -3 -9 -121 -74 275
3983 275 -39 -150 22 -79 -119 163 98 -51 -113 -36 117 -16 -336 96 -220 -229 -16 -114 -66 -246 -105 194 3
4006 3 -114 0 212 -98 -67 -158 318 -139 -45 74 24 174 6 -104 153 30 -25 148 -84 22 231 -150
4028 -150 -12 -70 -209 158 117 173 165 -300 155 416 -31 19 182 14 95 -181 197 116 -147 42 196 -114 131
4051 131 141 -20 -11 -215 -106 277 -125 251 175 111 -122 -319 293 108 -102 56 55 137 85 33 -33 214 48 311
4075 311 63 -202 203 -98 65 85 -219 94 124 59 1 -21 -31 -147 -47 28 -248 -186 108 50 -47 225 -10
4098 -10 0 -34 102 -105 257 289 66 43 125 52 -150 206 -137 -70 104 40 -62 34 -61 -240 -115 -294 50 197
4122 197 -111 49 -132 -99 148 57 246 174 123 -127 -142 -8 263 -176 32 -50 132 13 37 -127 105 -101
$$ packed form
3961d0K37m05J73P4l11O54m89j08L24m17J44L08m34L26M0l08Q4J45oj12M7L49
3983B75l14j11J72j01m0K82o5j49o2P7J53j33l20M32l16rK13r8M8j80J41K99j91
4006Cj17J14K12l10L1r1M76m57R4J19n0J50j68j10K57j23n5J73k32J06K09l81
4028a50J38n8j39L67m1N6qm65M55K61m47N0J63j68Q1k76L78q1k63J89J54l10K45
4051A31J0j61Rk04J09L83m02L76p6o4k33j97O12j85k10J58jQ2n2n2o6K47j66K63
4075C11k48k65M05l01J63K0l04L13L0o5n8k2j0j16J00P5k76O2K94n8r7K72k35
4098a0J0l4J36k07L62L2k23k3Q2p3k02L56l43O7J74o4j02R6r5j79J25j79L44J47
4122A97l08J60j81L3K47r1J89p2n1k50j5J34K71m39K08q2J82j19K4j64K32k06
$$ plain form
4144 -101 196 32 23 7 -16 157 -74 -23 58 -86 -101 -168 122 -166 51 -196 31 -150 -345 161 168 -77 36
4167 36 99 -15 0 -82 154 -156 -202 228 -140 -262 171 -133 144 -85 -21 218 165 276 -10 -430 -328 25
4189 25 -65 -63 -30 -158 111 62 -115 278 -91 -56 47 -102 43 -49 -3 58 -328 67 78 25 -95 -116 224 200 -170
4214 -170 28 197 203 79 -28 -12 119 -59 159 59 21 76 -44 226 -105 -93 48 181 224 252 200 75 -94
4237 -94 -3 -2 -34 -22 -65 206 -170 109 -125 112 98 -164 -22 6 -137 -26 -56 -436 -83 -134 31 -91 -347 -46
4261 -46 44 67 -63 -30 -182 160 96 236 223 35 142 -233 -71 -17 -163 36 -293 -62 24 87 34 -42 -76 -180
4285 -180 189 -32 14 53 -21 84 -72 58 -10 -112 -79 -48 29 -125 -17 -194 -73 -44 -83 -35 103 -11 23 -61
4309 -61 -189 -230 84 41 -91 -36 -26 -134 -112 -30 157 84 -44 99 180 -24 246 -75 161 174 79 96 -159 -96
$$ packed form
4144a01K97j64rj6k3J73k31N1Q1j44j5o7K90k88K17k47K27j81j95N06Pk45J13
4167C6O3j14J5q2K36l10m6M30l68j22M33l04K77k29O4K39n3J11k86m20J02L53
4189B5r0KL3j28K69m9j77L93l69L5J03j49J45r2M6O1l86L95J1n3j20k1L40k4l70
4214a70J98J69Oj24j07J6J31j78K18j00l8N5j20K70l31J2J41J33M3K8n2j25j69
4237i4R1Jl2J2m3K71l76K79k34K37j4k62J42K8j43J11l0l80L53n1J65j22k56L01
4261d6R0K3j30L3j52L42o4J40j3j88J07l75J62N4j46J99l29K31Q6O3n3p6l4j04
4285a80L69k21M6L9p4J05j56J30o8j02L3L1P7j54J08j77J21K9l9M8J38j14L4q4
4309f1j28m1L14m3j32N5J0j08K2Q2J87p3j28J43Q1k04K70l21K36J3r5J7k55O3
$$ plain form
4333 -96 -112 -92 -202 97 -174 -84 54 159 -120 -324 -5 7 277 -73 -6 -273 -73 100 -234 239 -68 22
4355 22 20 41 102 -92 24 258 -9 96 -85 55 136 -7 -143 56 -63 -185 99 -47 114 117 -76 5 44
4378 44 135 264 -60 67 9 75 317 -125 187 279 -71 168 58 163 214 -377 -87 -18 -178 25 -86 21
4400 21 205 -177 -55 -86 -120 -22 106 -121 -25 169 64 18 175 -142 198 3 157 354 41 121 64 170 110
4423 110 -6 -191 -192 -152 67 -145 30 -54 -127 -105 48 47 -82 93 -50 68 -110 84 -145 46 311 -160 -58
4446 -58 189 -36 -141 17 10 -31 -93 -208 56 -93 -88 -79 25 17 -128 18 -5 -116 -33 -90 93 21 36 -240 88
4471 88 6 19 35 -32 -69 240 36 80 93 -136 144 -136 -130 180 103 93 -296 149 135 -114 -210 -199 -304 -101 158
4496 158 5 -87 -231 -135 419 164 -94 61 -4 136 -42 -227 233 -58 101 287 -93 -128 -31 78 -85 -16
$$ packed form
4333i6j6K0j10K99k71R0J38J05k79k04L19J2K70l50O7k67K00J73l34M73l07R0
4355B2kK1O1j94J16K34k67J05j81J40Q1j43j36J99j19j22K84j46J61Lj93Q1L9
4378D4R1J29l24J27n8O6K42m42L12R2l50K39j10J05N1n91K90O9j60K03j11J07
4400B1J84l82J22l1l4R8J28k27R6J94j05m6J57l17L40j95J54J97l13Q0n7J06o0
4423A10j16j85jM0K19k12J75q4p3K2J53jj29J75j43J18j78J94k29J91K65m71J02
4446e8K47k25j05J58pm1o2j15K64j49NRJ04qj45J46k3j11Q3n7J83p2J5k76L28
4471H8q2J3J6o7l7L09k04M4J3k29K80k80OL10p7j0l89M45j4k49r6J1j05K03K59
4496A58j53r2j44R6N54k55k58J55o5J40j78j85M60k91J59J86l80l5R7J09j63O9
$$ plain form
4518 -16 48 -111 -102 -54 119 20 11 -39 115 -177 -65 46 -29 -147 -44 58 106 -135 -200 -159 219 -20 -157 47
4542 47 -86 167 185 304 -8 -155 176 38 -19 -1 7 39 -45 -118 69 115 -169 -255 -98 -170 120 -49 77 236
4566 236 -170 118 40 -115 63 -6 -133 179 -160 312 377 137 148 312 158 -26 255 -60 -24 -61 174 48
4588 48 -244 50 -53 -112 -26 -25 150 -189 146 8 -84 -40 -189 -149 213 -200 -47 62 156 144 -14 66 -133 -292
4612 -292 -6 -201 40 71 117 57 -77 23 128 -74 -35 19 122 -145 88 41 -41 -122 96 -109 141 141 -238
4635 -238 39 22 280 -153 150 166 -20 186 56 -97 270 16 112 -18 -125 -131 -190 -98 -202 -128 -257 21 336
4658 336 97 -49 -220 -235 411 -104 20 2 55 12 -198 -82 -25 -126 80 202 -99 59 20 263 182 -15
4680 -15 -274 -28 -114 -38 -166 -154 193 -76 -13 106 29 -35 -20 305 137 -146 131 29 -122 -52 -77 -196 254
$$ packed form
4518a6O4j59RM8J73r9rn0J54k92J12J11p5j18J03J02M8k41o5M1L78k39j37K04
4542D7j33K53J8J19l12j47L31j38n7J8QL2q4p3J87M6k84q6J57p2K90j69J26J59
4566B36m06K88p8j55J78o9j27L12l39M72O5k40J1J64j54j84K81l15L6l7K35j26
4588D8k92K94j03n9Q6JJ75l39L35j38r2M4j49M0L62m13J53J09R4j2j58Q0j99j59
4612b92K86j95K41L1M6o0j34J00J05k02L9N4J03k67K33m7q2q1K18k05K50%l79
4635b38K77j7K58m33L03J6j86K06j30j53L67k54R6j30j07on9R2j04P4j29K78L15
4658C36k39j46j71j5O46n15J24j8N3m3k10J16N7j01K06J22l01J58l9K43q1j97
4680a5k59K46q6P6j28J2L47k69O3J19p7o4J5L25j68k83K77j02j51P0k5j19M50
$$ plain form
4703 254 181 140 77 239 74 77 -140 345 31 10 209 -24 -2 81 -88 204 183 -248 48 146 21 -43 36 192
4727 192 106 -83 -40 255 -12 -159 -133 -60 79 94 126 -115 69 187 34 -364 -178 -39 67 -163 -61 -22
4749 -22 -114 -21 30 -44 60 18 -223 219 -231 -39 -34 -154 -91 136 147 -5 133 -1 -69 -54 194 -226 -79 87
4773 87 -122 64 217 127 -90 -23 -88 -9 106 157 167 254 -289 373 112 251 -58 144 107 -32 -20 199 32
4796 32 13 -159 13 90 -91 -191 160 -135 149 252 -183 193 167 26 -108 -126 -2 -78 -391 197 83 -153
4818 -153 21 -312 -110 -63 212 202 218 15 70 51 42 -178 -109 216 68 -77 87 3 -84 333 61 -57 89
4841 89 -80 72 188 158 140 -51 119 -15 -174 227 -70 41 118 -86 96 344 -29 45 89 -203 62 77
4863 77 4 8 -273 -101 218 89 192 27 -129 361 9 -135 -63 -244 55 115 163 -37 -189 289 -241 -38
$$ packed form
4703B54p3m1o3J62j65Lk17M85l14k1J99k33K2Q3j69K92k1m31K96R8j25o4P9J56
4727A92q6j89M3K95k67j47K6P3J39J5L2k41J84J18j53l98J86J39J06k30J02L9
4749b2r2R3N1p4J04m2k41M42m50J92Nj20O3K27J1j52J38j34o8J5K48m20J47J66
4773H7k09J86J53r0k17O7o5P9J15N1J0Q7n43O62k61J39l09K02l7j39J2K19j67
4796C2j9j72J72P7j81j00L51k95K84J03m35L76k6j41j34j8J24p6l13N88j14k36
4818a53J74l33K02M7K75j0J6k03N5j9rk20O9L25j48j45J64q4q7M17k72j18J46
4841H9j69J52J16l0j8j91J70j34j59M01k97J11P7k04J82K48l73P4M4k92K65J5
4863G7p3Mk81J72L19j29J03j65j56M90l52j44P2j81K99O0M8k00j52M78n30K03
$$ plain form
4885 -38 -254 338 29 -67 -95 -90 -87 -66 -5 209 146 -134 14 -135 150 5 129 191 108 -30 -55 84 -100 127
4909 127 -162 4 46 28 127 -142 -128 44 28 -157 -93 66 -104 -80 -45 108 26 -109 -59 25 -65 104 -194 -84
4933 -84 -122 75 -48 -90 21 87 -188 165 -86 -198 -108 14 189 37 192 167 -12 19 36 62 149 47 107 -7
4957 -7 30 -22 -73 173 224 -13 97 73 -133 -120 -64 95 95 194 -126 -262 -65 272 -172 18 -56 -71 103 -33 -111
4982 -111 126 64 166 112 -89 -56 228 -65 -29 304 -101 38 52 -165 120 59 -71 -37 -116 -84 -88 70 -7 -71
5006 -71 59 176 -105 97 -1 -208 109 -24 -68 108 190 2 -66 72 -20 -207 -110 -14 -216 -116 173 138 60
5029 60 52 -211 -16 -18 84 49 -170 -68 251 26 124 64 47 -179 -2 2 72 130 252 109 -6 -119 -72 -100 -76
5054 -76 32 28 -32 242 119 151 166 13 -26 -25 122 -229 -127 -94 -120 130 262 93 -23 -49 93 113 86 274 40
$$ packed form
4885c8k16N92l09r6k8NLK1O1K14o3k80J48j49K85j45J24O2q3j38k5J39j84K27
4909A27k89J66M2j8R9k69J4J72j6j85O4J59j70K4L5J53q2j35N0Q4r0J69k98J10
4933h4l8J97j23m2J11O6k75L53k51j12R0J22J75j52J55k5j79L1J7K6Q7j02O0j14
4957gL7n2n1K46N1k37J10k4k06J3N6J59%R9l20j36J97L37m44J90p4j5J74j36p8
4982a11K37o2J02n4k01L3K84k93L6L33m05J39J4k17K85o1j30L4p9L2mJ58p7o4
5006g1J30J17k81K02r8k07L17j33m4J76Q2j88o8J38r2j87R7R6k02J00K89l5p8
5029F0qk63J95kJ02l5k19J02L19k25R8o0j7k26J77MP0N8J22j43j15j13M7k8K4
5054g6J08mo0K74j23L2J5j53l9JJ47l51J02L3k6K50J32j69j16k6J42K0k7J88k34
$$ plain form
5079 40 139 282 -162 -12 -40 -64 -102 -113 37 215 -351 -25 -17 1 249 26 -48 -52 -37 98 -23 73 46 -113 112
5104 112 252 112 -183 32 195 -141 118 16 -27 -197 -14 32 -186 -44 -35 -110 -182 -161 67 40 -23 217 126
5127 126 0 -52 -226 201 95 -345 -94 -143 -48 -62 158 220 126 21 -92 65 -112 56 -173 -19 187 205
5149 205 -215 -145 207 180 5 -60 119 175 -104 -103 -87 103 -94 -45 122 -221 31 -144 -57 77 51 76 10 69
5173 69 224 265 -114 135 -40 -5 193 183 151 205 93 166 -37 153 191 -111 -142 42 24 -45 80 -54 79 -27
5197 -27 -2 26 -21 9 -131 -65 153 -44 55 62 -5 16 198 73 181 68 224 -203 67 131 48 23 -44 -94 -107 -33
5223 -33 13 232 158 53 53 100 -112 110 48 104 137 13 26 69 -283 -334 -95 -59 -94 -165 -85 198 98 -51 -148 95
5249 95 55 -268 4 -206 -11 173 242 -36 -72 67 13 0 209 39 152 202 -119 6 -70 -20 -41 158 -12
$$ packed form
5079D0R9J43m44J50k8k4l8j1J50J78n66L26QJ8K48k23p4mJ5J35j21R6k7j59K25
5104A12J40j40k95K15J63l36K59j02m3j70J83M6k18J42Rp5p2K1K28k7o3K40r1
5127A26j26n2j74M27j06m40K51m9R5j4K20O2r4j05j13J57j77J68k29J54K06J8
5149B05m20P0L52k7j75o5J79N6k79JJ6J90j97M9J67l43K52j75Q7J34k6K5o6N9
5173F9J55M1l79K49j75L5J98j0l2N4j12P3k03J90L8l02l1J84j8o9J25j34J33j06
5197b7K5K8m7L0j40O6K18j97R9Po7K1J82j25J08j13J56m27K70O4q3k5o7n0j3P4
5223c3M6K19p4j05%M7k12K22o2N6L3j24J3M3l52n1K39L6l5p1Q0K83j00j49r7K43
5249I5m0l23K72k10J95J84O9k78l6J39n4j3K09j70J13N0l21J25p6N0k1J99j70
$$ plain form
5272 -12 42 -50 -6 60 -257 22 154 115 -139 12 -98 -85 -145 -27 237 -7 -37 125 201 214 -152 15 -199 25
5296 25 -93 -52 107 200 117 228 -143 180 73 280 5 108 73 -61 -102 76 226 -75 -106 -152 80 -153 58
5319 58 80 261 216 -30 220 -44 195 -87 -226 -98 -24 -109 -70 -79 6 -90 34 82 -21 -308 -140 152 140 -155
5343 -155 103 -18 -16 -143 -64 91 -31 -114 -117 117 41 146 168 129 33 59 -99 289 -51 378 -59 -54 -65 97 -202
5368 -202 51 -106 -5 250 57 -2 -207 -17 -134 19 23 -75 -132 116 45 37 17 234 -39 162 59 -186 274
5391 274 -139 96 -73 -122 -33 -197 -82 -154 61 55 100 327 -260 -228 -437 -120 -375 36 237 -268 124 -320
5413 -320 -123 -61 49 -110 242 157 218 -123 133 -118 14 207 193 193 23 400 -180 147 -99 -29 -180 -10
5435 -10 -39 -177 -158 -61 -218 87 30 58 -66 228 -5 -68 -95 124 25 -14 113 193 123 202 -103 -17 -97 -36 57 -140
$$ packed form
5272a2N4r2M4O6l17K79J32l9k54J51j10J3o0J18K64k44l0J62P6J3l66J67k14K24
5296B5j18M1J59R3q3J11l71L23j07K07k75J03l5j34m1J78J50l01l1m6K32k33K11
5319E8K2J81m5k46K50k64K39k82j39J28P4q5L9rQ5r6J24M8j03k87J68K92j2k95
5343a55K58j21Kj27P9J55j22q3lK34p6J05K2l9r6K6j58L88l40M29m37Nj1J62k99
5368b02K53j57J01K55j93n9k05J90j17J53Mr8n7K48p1qk0K17k73K01j03k45M60
5391B74m13K35j69m9Q9j64J15p2K15oM5K27n87L2k09L17k55M11K01n05L92m44
5413c20J97O2J10j59L52q5O1l41K56k51J32J93j4%j70L77n80L27k46P0j51J70
5435a0k9j38J9R7j57L05n7K8j24K94k33o3k7K19r9l9J27Q0p0P9l05Q6q0O1R3j97
$$ plain form
5461 -140 -95 75 33 195 122 -158 -106 -56 39 -43 -53 -114 -16 68 162 203 -165 -97 53 -192 83 -144 -14 173 90
5486 90 160 -55 -71 79 148 -82 154 -226 60 21 -57 -116 278 -254 -129 -101 121 154 -77 -341 51 -57 -108
5509 -108 -152 137 148 148 98 60 -95 189 75 -163 307 108 -231 -66 -45 46 -49 -162 46 -237 90 77 -42
5532 -42 -112 207 -24 -152 -59 161 63 -116 -33 -54 71 21 -113 -130 54 58 -177 17 320 -84 245 244 19 -136
5556 -136 -194 -11 -273 281 -252 53 93 -42 166 110 -94 -31 40 -128 -31 68 71 75 124 73 -12 -36 10 -188 -218 104
5582 104 -57 -43 -193 -284 125 -73 43 8 -68 60 -133 128 -36 148 -25 118 75 223 -22 104 134 -62
5604 -62 -17 84 115 -156 223 371 139 22 -116 122 27 -27 201 107 -97 -150 102 128 -300 -61 -84 -314 13
5627 13 70 -13 -140 -76 -50 1 13 -144 -198 -167 50 -143 -310 -201 300 126 -5 -71 31 206 -72 -18 101 191
$$ packed form
5461a40M5J70m2J62p3k80N2N0R5q2j0o1R8Q4R4M1l68O8J50k45K75k27J30J87q3
5486I0P0k15j6J50O9k30K36l80K86l9p8n9L94n32J25K8K22L3k31k64L92j08n1
5509a08m4K89J1%n0l8j55K84j14k38M70j99l39J65K1R1r5j13K08k83L27j3j19
5532d2p0L19k31j28R3K20r8j79Q3k1J25n0j34j7J84Mk35J94L03m04L29jk25j55
5556a36n8J83k62N54n33L05M0j35K08n6k04O3P1j68R7R9LMM9n1q5k4M6j98l0L22
5582A04j61J4j50r1M09j98J16l5p6J28j93K61j64J84j73J43m3J48k45J26L0j96
5604f2M5J01L1k71L79J48k32j17j38K38r5n4K28r4k04n3K52K6m28K39k3k30L27
5627A3N7q3j27O4K6N1J2j57n4L1K17j93j67J09N01j74j31o6J02J75k78N4J19R0
$$ plain form
5651 191 -18 -148 -41 -75 -168 -158 -8 -23 177 216 -20 322 89 53 -145 -159 227 6 -221 -52 -150 -101 126
5674 126 74 266 48 -57 100 -184 76 -6 113 -171 99 140 62 84 -27 214 61 97 -104 141 -238 70
5696 70 34 -25 152 69 -174 -215 -142 142 31 72 57 -109 -59 -54 -116 -37 -14 32 -195 -62 296 -221 129 -80 -175
5721 -175 -48 63 7 -52 71 -13 50 -144 56 -134 -87 213 19 -95 -41 -197 89 1 -252 253 -71 13 180
5744 180 -26 101 -66 -128 40 44 -52 -157 17 -195 -159 20 -1 63 -106 199 -74 39 130 -97 -45 91 -38
5767 -38 -176 -7 -22 -44 129 164 -75 21 -14 155 -181 292 -128 -43 -49 -147 82 -18 13 -12 -153 -122 162 -64
5791 -64 -60 126 -79 228 44 -56 185 78 180 33 -162 -49 -126 48 -25 -99 275 59 -313 -121 -226 -5
5813 -5 -88 -41 -41 5 90 -27 37 152 -188 249 -204 45 -85 137 -125 -73 -134 -57 -11 -117 -41 -107 61 -50 157
$$ packed form
5651A91k09j30J07l4r3J0J50j5K00L9k36L42k33l6j98j4L86k21k27J69r8M9K27
5674A26n2J92k18j05J57k84K60q2J19k84K70M1p8K2j11K41j53L6k01K45l79L08
5696G0l6n9J77q3k43m1P3K84j11M1j5j66N0No2P9K3M6k27J33L58n17L50k09r5
5721a75J27J11n6n9J23q4O3j94K00j90M7L00j94j14N4j56K86q8k53N05l24Q4J67
5744A80k06J27j67o2J68Mr6j05J74k12L6J79k1O4j69L05k73J13R1k27N2J36j29
5767c8j38J69j5k2J73L5k39R6l5J69l36M73m20Q5or8K29j00L1k5j41L1K84k26
5791f4MJ86k05L07j84j00K41j07J02j47j95J13p7J74p3p4L74k16l72J92j05K21
5813eq3M7%M6Q5j17O4J15l40M37m53K49j30K22k62N2o1P7M6j06P6o6J68j11K07
$$ plain form
5838 157 41 52 -183 -39 -27 287 -273 63 61 -314 160 -140 55 157 -7 -97 80 -9 -76 74 93 53 7
5861 7 -12 -15 3 136 18 -167 -29 36 -74 -226 -298 -24 91 -9 -126 -45 -14 -51 90 -123 -169 23 101 -10
5885 -10 111 -145 265 -163 47 58 173 138 -54 165 -79 1 -34 35 109 -53 32 241 175 196 -14 116 47 115
5909 115 -162 173 119 154 79 -162 238 49 -81 -55 -398 -73 141 71 -159 -166 87 -77 114 163 -215 211 206
5932 206 -87 -51 178 -80 -192 -59 141 -85 144 234 137 -8 106 97 6 241 -164 40 58 -62 -125 -49 29
5955 29 -109 4 -180 165 105 133 115 -54 -214 24 -165 -27 80 -118 -4 -37 119 24 -23 -236 88 112 -2
5978 -2 72 17 156 98 138 140 -299 103 -110 -96 -216 -108 -89 133 150 42 -185 17 287 29 -107 -20 -134 121
6002 121 -92 -57 -127 -163 -124 -284 -183 -406 129 -9 -195 -51 -39 -157 -176 110 35 9 289 -33 33 -298 -76
$$ packed form
5838A57j16J1k35J44J2L14n60L36kl75M74l00J95J02j64r0J77q9o7J50J9m0m6
5861Gj9lJ8J33j18j85J38O5j10j52p2K74J15j00j17Q1L1l7J41k13m6J92P8j11
5885a0J21k56M10m28K10J1J15l5j92K19k44Q0l5O9P4j62Q5K09o6K1k10J30o9O8
5909A15k77L35n4L5p5k41M00j89j30K6l43L25K14p0k30pK53j64J91M9l78M26n
5932B06k93L6K29k58j12J33K00k26K29R0r7j45J14rr1K35m05K04J8j20o3P6P8
5955B9j38J13j84L45o0K8j8j69j60K38j89J38J07j98J14l3J56r5m7k13L24K4j14
5978bP4n5J39n8M0Km39M02k13J4j20J08J9K22J7j08k27K02K70k58j36Q7j14K55
6002A21k13L5p0l6L9j60J01k23N35j38j86J44J2j18j9K86p5k6K80l22O6l31K22
$$ plain form
6025 -76 -36 221 -63 -195 72 -141 -96 -290 -155 77 -59 35 -144 235 54 69 34 355 97 -291 -245 22
6047 22 113 -2 -10 -4 -114 -206 101 62 96 82 -103 -140 -196 -207 175 -16 -58 -64 -88 173 11 -157 52 -21 96 65
6073 65 74 -24 -82 32 168 127 16 11 -308 32 -209 -131 -138 283 137 235 -247 -194 29 -239 207 140 277 269 102
6098 102 -229 -149 49 7 -95 -147 -136 100 -122 421 109 -115 64 142 23 82 -42 -84 17 255 112 -81
6120 -81 -6 -41 73 -55 -137 100 54 144 -7 107 228 208 133 387 110 -181 132 71 141 48 35 155 26 51
6144 51 152 165 73 -128 1 -26 34 45 -138 -23 246 -76 14 139 -272 73 -107 2 -216 -172 -108 -154 -53
6167 -53 -47 25 -89 -23 -198 243 18 86 -24 -66 -36 -54 56 -227 46 271 168 55 130 -84 -55 -139 -33 -53
6191 -53 50 224 62 -202 -19 -14 99 -198 -59 -85 32 64 35 82 144 75 -217 97 186 -16 -191 35 11 157
$$ packed form
6025g6M0K57k84j32K67k13M5j94J35K32j36R4j79L79j81J5l5L21k58l88M6K67
6047B2R1j15qOj10r2L07l9L4j4j85l7n6j1L82j91m2ok4K61j62j68K09p3J17l1
6073F5Rr8n8J14J36m1j11nl19L40k41P8pM21j46R8m82N3K23k68M46o7J37qj67
6098A02l31Q0J98m2j02n2J1K36k22N43l12k24J79P8j19N9j24m2J01K38j43j93
6120h1P5l5J14j28q2K37m6R0j51J14J21k0p5K54k77k91L13o1P0r3j3J20j29K5
6144E1J01J3r2k01J29k7O0J1j83J15K69l22R0J25m11L45j80J09k18M4O4m6J01
6167e3OP2j14O6j75M41k25O8j10m2L0j8J10k83K73K25j03j13P5k14K9q4J06k0
6191e3J03J74j62k64J83NJ13k97J39k6J17L2k9M7O2o9k92L14Q9k02j75K26k4J46
$$ plain form
6215 157 -178 -33 -116 77 -137 -90 253 -190 47 -157 -38 79 82 53 43 -25 18 -117 -38 -193 42 24 -165
6238 -165 152 -193 127 52 26 177 -136 -14 132 82 132 -82 -128 221 295 -170 -26 13 -206 -124 -148 -165 -151 237
6262 237 71 132 -179 -132 125 -179 111 69 -225 71 22 -86 294 -192 113 15 -260 -116 110 77 229 -60
6284 -60 143 -228 65 -139 4 77 88 -129 89 198 226 -42 -387 5 -14 66 -113 -43 40 31 -50 -96 156 126
6308 126 -24 188 -54 23 -4 -219 -131 114 -58 52 -94 -94 -143 124 106 -24 200 -88 163 23 77 215 -90
6331 -90 -94 -105 113 -46 -50 263 11 -92 206 71 68 58 51 80 -8 36 236 141 105 -94 39 121 -96 190 91 -4
6357 -4 91 254 71 -114 -33 31 107 -23 -2 33 -68 144 -152 154 257 146 -46 89 -91 -193 -159 21 16 -15
6381 -15 0 -56 -96 34 -72 -49 30 -314 -138 -49 -36 66 57 -149 158 -188 -164 11 181 89 69 -59 -93 62 -115
$$ packed form
6215A57l35J45q3J93k14M7L43m43K37k04J19J17Lk9j0o8M3j35P9j55K35j8j89
6238a65L17l45L20p5k6J51l13J22J46n0N0k14m6L49P4m65J44L9k19Q2k4j7J4L88
6262B37j66O1l11M7K57l04K90m2k94K96m9j08L80m86L05r8k75J44K26l3J52k89
6284f0K03l71K93k04J43P3J1k17K18J09K8k68l45L92j9Q0j79P0Q3rq1m6K52l0
6308A26j50K12k42P7k7k15Q8K45j72J10j46%m9K67j8j30K24k88K51j40N4J38l05
6331i0mj1K18j59mL13k52j03K98j35lj0pK9q8M4K00r5l6j99J33Q2k17K86r9r5
6357dR5J63j83j85Q1O4P6j30K1L5j01K12k96L06J03j11j92J35j80j02L4J80nl1
6381a5J5n6m0J30j06K3P9l44J76Q9J3J02rk06L07l46K4J75J70r2k0j28l4J55j77
$$ plain form
6406 -115 -82 -132 21 -116 -188 -204 73 147 54 115 -6 21 -193 -10 39 -41 42 -37 81 92 108 150 -233 -193 -111 -201
6432 -201 10 23 -28 148 -143 106 46 44 -154 46 52 113 37 -235 -80 72 -39 -48 70 -64 131 202 -68 -178
6456 -178 -143 -175 6 108 -23 -136 242 -49 -90 -69 21 1 -177 42 -100 -280 -105 -65 -5 -135 -31 164 8
6479 8 -86 144 -116 141 147 9 -65 -96 107 -2 73 -156 -216 34 -5 22 98 -15 292 269 12 74 -187 -250 28
6504 28 179 -61 -58 103 -156 -17 33 20 37 109 85 -93 211 -12 4 -116 -7 66 -155 146 -94 284 54
6527 54 -119 -13 -111 155 -170 264 -49 81 -64 -24 63 177 52 1 -78 -96 -91 120 -93 -166 19 195 -230
6550 -230 122 8 111 -163 -92 -190 173 -77 44 -2 -190 -112 -58 37 153 -186 -70 -113 -187 236 71 -199 2
6573 2 326 143 -77 -94 -12 334 -116 -131 158 156 8 52 35 192 -113 -112 120 -103 72 -78 -128 90 -230 81
$$ packed form
6406a15L3n0J53j37p2j6K77P4r3O1j21K7k14J83M9q0Q3p9J18J1J6M2l83M0Q2r0
6432b01K11J3n1J76k91K49o0kj98K00OO1p6k72J55J52j11rJ18j34J95P1k70j10
6456a78L5l2J81J02j31j13L78k91m1K1R0k0j78K19j42j80J75M0O0j30J04J95j56
6479Hr4K30k60K57Oj38p4l1K03j09P5k29o0K50l9K7P6j13L07k3k57O2k61o3K78
6504B8J51k40LJ61k59J39N0j3J7P2k4j78L04k23J6j20J09P3k21L01k40L78k30
6527E4j73J06r8K66l25M34l13J30j45M0Q7J14j25n1p9j8NK11k13p3J85J76m25
6550b30L52j14J03k74P1r8L63k50J21m6j88P8N4R5J16l39J16m3p4M23j65k70K01
6573BL24j83k20j7Q2L46m50j5K89kj48M4j7J57l05JK32k23J75j50n0K18l20L11
$$ plain form
6597 81 -27 301 -280 56 166 73 -11 150 184 -135 69 -40 -14 35 105 -194 -166 -104 124 76 69 -239 104 -230
6621 -230 -70 3 -108 442 290 57 -99 -163 179 -166 -133 -5 -4 -101 163 -79 72 3 -66 -143 44 89 128 -147
6645 -147 47 162 -23 -280 104 -60 -134 67 -201 -152 223 85 -170 -201 -110 -126 -69 120 -159 -211 -67 -12 150
6668 150 27 14 -3 -187 93 -171 189 101 -160 126 37 108 -153 -29 137 -24 24 -25 -173 -181 0 -174 11
6691 11 -197 154 -47 -24 -109 -282 -165 108 84 -283 72 -65 -79 -64 -126 -13 -33 76 -24 295 104 -252 43
6714 43 58 -386 -22 -51 49 -208 175 -51 110 113 92 -133 -432 -28 -152 -30 -64 65 200 -118 35 325
6736 325 58 55 34 -78 -91 158 -115 167 -309 24 83 -72 -130 -185 47 -121 26 106 -3 246 63 172 -128
6759 -128 -351 -88 347 -16 -153 -96 -88 -70 -9 -218 89 185 190 -75 -50 -99 -36 1 -335 64 -143 -10 -152 -26
$$ packed form
6597H1j08L28n81L36J10r3q4J61L4l19K04j09K6M9P0k99K8O2K28m8pl08L43l34
6621b30J60P3j11N50j52k33j56o4L42l45L3J28Jr7K64k42J51o9o9p7J87M5L9k75
6645a47J94J15j85k57L84j64p4K01k68M9L75j38k55l1R1j6N7J89k79n2J44N5J62
6668A50j23j3j7j84K80k64L60q8k61K86q9P1k61J24J66j61M8m9j48qJ81j74J85
6691A1k08L51k01K3q5j73J17K73k4l67L55j37j4J5o2J13k0J09j00L19j91l56K95
6714D3J5m44L64k9J00k57L83k26J61Lk1k25k99M04j24J22l4J29J35l18J53K90
6736C25k67lk1j12j3K49k73K82m76L33N9j55n8n5K32j68J47Q0j09K49j83J09l00
6759a28k23K63M35l63j37N7QJ8O1k09L07R6Nk65K5m9O3L7l36L99k07J33j42J26
$$ plain form
6783 -26 -31 118 134 4 60 -8 -59 -81 68 -189 -87 188 18 156 288 -206 73 5 -108 113 45 -57 221
6806 221 -254 115 -57 82 -232 -38 97 -137 127 -181 77 266 3 281 -30 -151 -147 -7 -33 -139 143
6827 143 144 -197 -126 137 6 57 -288 118 89 -64 273 -48 6 -14 217 128 17 -114 101 -39 -134 -149 -135 118
6851 118 -141 29 99 46 -65 145 44 -137 212 -72 81 -78 -1 -118 -48 266 -43 -113 -205 -99 -72 74
6873 74 86 165 -87 -10 -108 -167 -99 -36 -9 54 13 -45 27 -21 162 53 -16 173 -86 -308 -85 -260 40 -4 -4 38
6899 38 123 -72 -218 208 -240 -93 -17 313 256 101 -149 -178 232 -8 -1 20 -15 99 117 143 -47 13 142 -177
6923 -177 102 -16 -48 57 -254 105 89 -225 -237 -104 178 -125 17 -166 -143 114 71 28 -1 -194 157 -105
6945 -105 -317 12 -195 -107 184 64 -144 149 -351 -69 77 -249 -44 99 115 -63 -222 -7 89 -104 126
$$ packed form
6783b6nJ49J6j30N6o8n1k2J49k57J02K75j70J38J32m94K79o8j13K21o8j02K78
6806B21m75L69j72J39l14J94J35k34K64l08K58J89k63K78l11j21MJ40k6j06K82
6827A43Jl41P1K63j31N1l45M06k9j53L37l21N4k0K31q9j11j31K15j40r5j5J4K53
6851A18k59J70P0n3j11K10j01j81L49k84J53j59P7j17P0L14l09p0r2J06K7J46
6873G4J2P9k52P7r8n9O8O3K7O3m1n8P2m8J83j09o9J89k59k22K23j75L00m4%M2
6899C8Q5j95j46M26m48J47P6L30n7j55k50k9M10k40PK1l5J14J8K6j90O0J29l19
6923a77K79j18l2J05l11L59j6l14j2J33K82l03J42j83K3K57m3m3k9j93L51k62
6945a05k12L29k07Q8K91j20k08K93n00K82J46l26K05J43J6j78j59K15R6j93K30
$$ plain form
6966 126 123 -77 -88 283 -90 65 -50 146 -154 -124 -9 -80 82 -175 -41 120 175 -128 -80 195 -24 -216
6988 -216 -5 19 -124 -244 -43 169 73 -56 24 55 -14 -123 -81 -89 3 125 12 19 125 -123 233 162 23 99
7012 99 52 140 -4 21 -243 -89 -17 -110 74 27 246 -30 80 -206 -213 243 -201 119 84 -131 -9 -319 244
7035 244 -20 53 -30 -236 154 -10 142 -209 -93 -227 -46 -22 21 196 255 -171 54 154 -112 140 175 38
7057 38 33 -119 58 18 128 -21 75 -42 54 86 -68 -12 -50 -127 58 -147 -157 44 -39 61 147 -5 24 -297 203
7082 203 28 178 244 -78 99 78 -77 -43 193 68 71 -86 22 -249 -157 166 -104 -61 -133 73 -3 220 -39
7105 -39 28 -34 -32 65 3 5 91 -11 112 -136 9 98 39 98 181 -1 -188 32 -39 -112 -23 -209 156 -185 -53 -107
7131 -107 -71 -175 208 -37 -85 -266 -6 70 42 155 -39 127 -87 -50 25 225 124 96 79 29 -90 -314 36
$$ packed form
6966A26lk00j1L71l73J55j15J96l00L0J15p1J62k57J34J61N5l03M8K75k19j92
6988b16K11K4j43j20K01K12r6j29Q0L1o9j09M2qR2J22j13PJ06k48L56p1j39P6
7012I9m7Q8j44K5k64J54P2r3J84m7K19k76J10k86pM56m44L20l5k15J22l10N63
7035B44k64P3q3k06L90j64J52l51J16j34J81K4M3J75N9m26K25J00k66K52L5j37
7057C8nj52J77m0J10j49R6j17R6L2j54N6l8p7J85k05j0K01q3J00Q6j52K9l21N00
7082B03j75J50O6l22J77k1j55L4K36j25Lj57J08k71R2L23k70M3p2K06p6K23k59
7105c9O7o2KR7o2KQ6j02J23k48J45Q9n9N9Q3j82j87K20p1p3Q9j86L65l41J32n4
7131a07L6j04L83k45m8j81K60P6k8J13j94J66k14L7P5K00j01k8j7n0j19k24L50
$$ plain form
7154 36 -36 -62 182 156 -24 51 251 300 94 59 -135 -376 -69 30 78 11 -89 -136 79 -199 -136 -52 -261 -19
7178 -19 -2 -40 89 25 -59 -106 -70 -29 26 97 -69 -206 45 -23 -308 -50 -52 -137 -61 46 -78 -18 -27 -14 -129 -214 184
7205 184 137 58 96 199 55 219 89 63 -273 228 -85 57 30 -282 45 -82 -104 22 294 -266 -105 41
7227 41 -117 -13 -107 114 -105 -104 109 -220 -144 -143 204 8 111 -185 -87 102 114 -65 -71 -57 -20 100 -139 -285
7251 -285 -96 -120 -70 -72 -12 -82 -3 108 35 254 -76 -80 -116 -97 25 -28 138 -21 -67 -49 84 66 48 175 61 -220
7277 -220 104 -86 -129 75 345 36 -8 88 7 7 326 266 121 -75 79 -26 -57 -42 -74 -151 -5 25 -279 -40
7301 -40 -2 48 -29 -62 -92 -76 -161 -77 -161 74 56 149 -109 -62 -72 227 -85 94 -54 -69 -33 2 -174 -240 84 -11
7327 -11 210 -188 207 73 206 144 142 119 205 66 -63 -161 -29 250 256 112 128 9 64 -198 141 85 -195 -160
$$ packed form
7154C6p2k6K44k6j80P5K00M9k06l5j94k41L07R9M8o7j00m7K15k78O3Q4k09K42
7178a9J7l8J29o4q4m7L6M1N5P1j66j37K51o8k85K58kq5P6J07j24O0rJ3j15q5L98
7205A84m7p9L8J03j44J64j30k6l36N01l13J42k7l12L27j27k2J26K72n60J61J46
7227D1j58J04r4K21k19JK13l29P6JL47j96J03k96R8J89J2j79oJ4L7J20k39j46
7251b85J89k4N0kO0p0P9J11p3K19l30ml6J9J22n3J66j59m6J8J33j8j8J27j14k81
7277b20L24j90m3K04K70l09m4R6q1%L19o0j45j96J54j05l1J5l2p7J46L0l04K39
7301d0L8N0p7l3l0J6q5Q4q4K35j8R3k58M7j0K99l12J79j48j5L6L5j76o6L24r5
7327a1K21l98L95j34J33o2kk3Q6j39j29r8J32K79Oj44J6j19N5k62L39n6k80L5
$$ plain form
7351 -160 -44 -214 -114 -62 -137 69 72 28 129 100 -17 65 -134 -189 24 286 -90 194 2 245 -70 119 -53
7374 -53 -45 370 -329 -48 213 118 -5 73 83 -39 224 150 -34 43 -109 87 28 -225 -174 78 35 59 -106 307
7398 307 171 -58 224 -66 147 94 14 -302 129 264 230 -100 -423 -20 -140 -149 235 145 -46 36 3 185 16
7421 16 133 72 -79 -24 -134 285 205 -2 -127 146 -70 -54 -158 -130 61 -183 -1 -152 189 235 -82 40
7443 40 -43 -119 219 -121 -63 -59 178 108 -26 -130 118 84 84 -123 -9 3 17 110 -106 1 -37 -11 -193 -112 158
7468 158 10 -40 -73 -170 -118 -7 -230 20 14 -79 -128 76 124 -23 -203 -14 313 -74 -211 36 -113 113 -135
7491 -135 176 -37 74 213 -79 29 -9 49 195 -132 -48 -43 143 2 -147 -120 -74 -61 -101 82 -60 -53 -102 -166
7515 -166 178 54 7 54 -26 -30 -73 125 56 180 -211 -94 -16 -38 -121 107 -34 183 82 -145 -11 48 29 70
$$ packed form
7351a60J16j70J00N2p5K06Lm4J01k9j17Q2j99n5K13K62l76K84j92K43l15J89j72
7374e3QM15o99K81K61r5j23P8J0j22K63p4j84P7j52J96n9k53N1K52m3K4j65M13
7398C07j36k29K82k90K13n3q0l16M31J35l4l30l23M03j20rL84r0j91Q2l3J82j69
7421A6J17o1j51N5j10M19q0k07j25K73k16J6j04K8J91k44J82j51L41M6l17J22
7443D0q3p6L38l40N8MK37p0j34j04K48l4%k07J14J2J4R3k16J07l8K6j82Q1K70
7468A58j48n0l3r7N2J11k23K50or3m9K04M8j47j80J89L27l87j37K47j49K26k48
7491a35L11k13J11J39k92J08l8N8J46l27Q4NJ86j41j49K7M6J3m0J83j42Pm9o4
7515a66L44j24m7M7q0mm3J98o9J24l91J17P8k2q3K28j41K17j01k27J34N9j9M1
$$ plain form
7539 70 -179 13 82 -115 -199 349 -15 122 -199 91 384 -256 105 87 -28 154 -74 170 336 -94 129
7560 129 267 288 -21 -188 10 -175 -229 -37 -243 -55 -164 -97 326 26 143 207 120 -167 -126 -95 114 188 -75
7583 -75 -188 7 15 -233 -41 -70 48 -230 0 35 -47 -61 137 -171 -131 -45 185 108 -247 -369 -15 -131 48
7606 48 -241 -99 216 -38 89 325 -90 -94 46 -63 -114 237 34 -213 18 27 -153 -17 -38 -90 107 -30 -85
7629 -85 -92 63 -172 -128 77 195 64 -25 39 175 50 118 97 -136 259 80 143 -56 137 170 -32 283 -122
7652 -122 -133 155 38 -160 -142 -196 -72 19 -80 2 104 249 188 -25 191 3 -130 33 -1 -20 -200 -70 -218
7675 -218 -183 -307 86 -85 108 -40 -91 -37 76 58 -105 -189 -63 -55 50 12 11 11 -65 -118 -84 144 32 -287 -232
7700 -232 90 -26 237 -168 38 -56 -164 35 73 -67 41 -99 -129 -20 130 -41 -58 -29 -12 -240 106 50
$$ packed form
7539G0k49J92O9j97q4N48l64J37l21K90K93o40L61j8j15J82k28K44J66m30K23
7560A29J38K1l09j67J98j85n4J92k06J88j09O7M23l00J17O4q7k87M1L1K09P4k63
7583g5j13J95Qk48J92k9J18k78K30L5q2j4J98l08M0Q6K30p7l55j22L54j16J79
7606D8k89J42L15k54J27K36m15mJ40j09n1L51k03k47K31Rj80J36k1n2J97j37n5
7629h5pJ55k35M4K05J18j31q9O4J36j25O8k1k33L95j79O3j99J93L3k02L15m05
7652a22j1K88j17j98J8n4J24R1r9Q2J02J45o1k13K16j88j33J63l4j9j80J30j48
7675b18L5j24L93j71J93j48n1N4J13j8j63q4J26QJ05l8j%p6n3L4K28j12l19N5
7700b32L22j16K63m05K06r4j08J99L8j40J08j40l0J09J50j71j7K9J7k28L46n6
$$ plain form
7722 50 -101 72 -164 73 -14 -190 -86 -57 63 -52 87 -138 280 -72 -121 344 -120 53 -13 -158 -146 -59
7744 -59 108 -446 -61 -40 -43 24 -156 89 -115 -111 -198 -98 176 22 88 44 149 -67 80 158 189 -10 -38 171
7768 171 48 -12 -8 -154 -223 87 -298 -88 -69 142 -169 -144 145 109 110 59 49 105 246 -87 55 5 -188 39
7792 39 -224 -101 266 -16 -35 125 83 50 167 78 5 128 -105 36 140 26 -187 -15 -70 385 -73 69
7814 69 136 -71 -92 -271 -73 68 -128 -47 136 -180 66 154 -1 -313 87 61 -185 -13 -104 -154 162 105 166
7837 166 -191 236 23 212 113 7 159 -113 141 174 56 34 -191 -29 208 228 -113 193 -310 -243 35 -59
7859 -59 59 -199 -147 75 -148 100 187 -45 -174 44 63 -91 32 73 201 102 105 -153 112 -95 58 -139 -101
7882 -101 65 -28 74 79 -195 23 99 10 69 78 -7 -198 -69 -101 42 -212 -58 143 -22 14 -91 -177 263 138
$$ packed form
7722E0j51J73k36K37q7j76J04K9J20j15J39k25M18l52m9M65m64J73o6j45J2Q7
7744e9J67n54L85K1lO7j80K45k04Mq7J00K74j54O6m4J05k16J47P8L1j99k8K09
7768A71j23o0Mj46o9L10l85K10J9K11l11K5K89l6Jn1j0N6J41l33J42n0j93K27
7792C9k63J23L67k82j9J60m2l3J17q9p3J23k33J41J04j14k13J72n5M55m58J42
7814F9O7k07k1j79J98J41j96Q1J83l16K46Q8j55l12M00k6k46J72r1n0L16n7O1
7837A66l57M27k13J89r9j06J52k72K54L3j18k2k25J62K37K0l41L06n03O7K78r4
7859e9J18k58N2K22k23K48Q7k32j29K18J9j54J23M1J28r9Lk58K65k07J53j97L8
7882a01J66r3J02Nk74K18P6q9N9Rq5j91J29l2J43k54J54K01j65L6j05q6M40j25
$$ plain form
7906 138 -70 115 444 59 454 -150 29 129 -85 93 -187 225 116 174 69 -29 -59 29 193 -247 87
7927 87 -17 11 -106 -15 -78 -323 100 -20 87 250 -54 -93 -76 -35 -60 150 -151 -55 -210 -249 82 82 474 33
7951 33 176 -109 -47 -118 12 -142 100 -28 3 278 -17 158 26 103 -188 197 171 -9 -295 -167 35 101
7973 101 -296 -77 105 -136 -299 284 55 -120 272 159 280 52 -171 -14 71 52 49 -59 -115 -39 94 177
7995 177 -286 -267 -1 31 129 -14 99 155 206 -53 -18 -160 8 -205 -133 84 -48 92 -109 -17 -222 -186 5
8018 5 -184 -17 -9 6 87 36 222 -98 205 -164 265 78 -29 -190 119 128 20 145 204 -261 -6 120 147 109
8042 109 -79 13 189 110 158 -197 -20 -277 -103 230 135 -85 156 -247 -222 -231 -258 252 -343 22 143 39 31
8065 31 -27 -13 -166 -171 -22 -213 -227 -210 6 -128 -55 247 86 -235 83 37 32 -154 -114 -120 -5 88 -84 -71 29
$$ packed form
7906A38k08J85L29l85L95o04J79J00k14J78k80M12j09N8j05r8l0Q8J64m40L34
7927H7j04K8j17R1o3k45M23j20J07J63l04l9J7M1k5K10l01R6j55l9L31%L92m41
7951C3J43k85O2p1J30j54K42j28L1K75k95J75j32P7k91L85k6j80k86J28K02O6
7973A01l97K19J82k41j63N83k29j75L92j13J21k28k23J57Q5j9lj08n6P6J33Q3
7995A77m63J9K66L2R8j43J13N6N1k59L5j42J68k13P2K17j32J40k01R2k05L6J91
8018Ej89J67QJ5Q1n1J86l20L03l69M29j87j07j61L09Rj08J25N9m65K55J26K7l8
8042A09j88R2J76p9M8l55J77k57J74L33r5k20K41m03K5rk7N10n95L65J21j04q
8065C1n8J4j53nJ49j91j4J7K16j34P3L02j61l21L18m6nj86M0oJ15R3j72J3J00
$$ plain form
8090 29 -131 8 -59 -175 276 157 74 -50 179 -99 82 4 -173 83 118 288 -153 20 -6 72 47 -87 -228
8113 -228 80 -42 96 105 -141 110 83 -31 -202 179 -212 -243 -231 124 136 -301 96 78 -136 68 242 19
8135 19 -5 -18 -91 111 -138 175 136 -139 -343 234 -184 -156 105 183 27 190 -76 -158 58 -162 20 339 -202
8158 -202 -64 -11 77 399 307 -155 48 -209 -127 -68 -118 118 8 -223 -8 68 -44 93 -171 4 210 231 92
8181 92 154 101 -54 -152 23 -164 -80 173 50 213
$$ packed form
8090B9j60J39o7j16M51j19q3j24K29k78J81p8j77K56L5J70m41J73k6P8k5j34j41
8113b28L08j22J38Rk46K51k7j14j71L81l91l1J2L55J2m37L97j8k14K04J74k23
8135A9k4j3p3K02k49L13l9k75k04N77m18K8K61P8j56J63k66q2K16k20J82L19n41
8158b02J38N3Q8L22r2m62K03k57Q2N9n0K36j10k31K15P6j12J37k64J75K06K1j39
8181I2O2n3j55r8J75j87Q4K53j23J63
8191B13
$$ Imaginary data points
##PAGE= N=2
##DATA TABLE= (X++(I..I)), XYDATA
$$ plain form
0 0 0 0 0 0 0 0 0 0 0 0 0 0 0 0 0 -8 8 -8 8 -8 16 -16 16 -24 24 -27 32 -40 40 -48 56 -64 72 -80 90 -101 114
37 114 -126 139 -155 174 -194 214 -237 261 -288 317 -350 386 -424 468 -517 568 -627 697 -771
56 -771 859 -962 1083 -1225 1400 -1621 1907 -2293 2841 -3680 5107 -7983 15950 -81571 -247535
71 -247535 62321 182055 -26285 -106011 18739 43951 -7930 23094 20689 -64207 -9669
82 -9669 72876 5586 -59897 -16243 54422 50040 -46812 -61125 34070 58304 -31222 -76107 16966
95 16966 72137 -19796 -42582 14118 -14110 -21430 39902 28261 -36865 -33173 34375 34154 -20307
108 -20307 -11198 295 -8204 26897 20296 -26264 -13528 18435 22071 -634 -19634 -5118 1140
121 1140 465 2407 -9563 6428 13085 -20327 -15468 2193 1727 13411 -1364 -23501 -1610 28362
$$ packed form
0@%%%%%%%%%%%%%%%qJ6j6J6j6K4l2L2m0M8n1N9p2Q0q8J04j20J36j52J70j91K15
37A14k40K65k94L29l68M08m51M98n49O05o67P36q10Q92r85J085j195J324j468
56g71J630j821K045k308K625l021L528m200N134o521Q787j3090K3933r7521j65964
71b47535L09856J19734k08340p9726J24750K5212n1881L1024k405q4896N4538
82i669Q2545o7290o5483M3654P0665m382r6852j4313R5195K4234q9526m4885R3073
95A6966N5171r1933k2786N6700k8228p320O1332j1641o5126L692O7548k21n4461
108b0307R109J1493q499L5101o601m6560J2736L1963L636k2705j9000J4516O258
121A140o75J942j1970J5991O657l3412M859J7661m66J1684j4775k2137K1891K9972
$$ plain form
135 28362 14965 -34529 -23140 36006 14894 -15985 11508 3147 -16905 8345 24435 -62
147 -62 -24451 895 19396 -8914 -2223 11222 -18110 -11183 14816 4096 -10493 -11166 3189
160 3189 6455 -5709 2154 1017 -8509 23 -5118 2679 18650 -2986 -10446 6964 8742 3826
174 3826 -3228 -1780 1137 -2298 15729 9113 -23814 -6151 15809 -1413 -7423 2994 7741 -10030
188 -10030 -18545 12116 13329 -15762 -11676 1567 8234 6411 -9593 -3637 4155 935 10277 3445
202 3445 -9445 -2886 5122 12591 1155 -10629 8261 4931 -13246 1420 11726 2588 -10063
215 -10063 -8957 11224 2928 -13127 -2428 -1278 -1991 4724 -724 -1491 -5071 -6665 8138 5788
229 5788 -1827 383 -4368 2301 6763 881 4028 -5225 -5396 14148 8271 -6102 -7207 -423 10953
$$ packed form
135B8362j3397m9494J1389N9146k1112l0879K7493q361k0052K5250J6090k4497
147f2k4389K5346J8501k8310O691J3445k9332O927K5999j0720j4589o73J4355
160C189L266j2164P863j137r526Q532n141P797J5971k1636p460J7410J778m916
174C826p054J448K917l435J8027o616l2927J7663K1960j7222o010J0417M747j7771
188a0030q515L0661J213k9091M086J3243O667j823j6004N956P792l220R342o832
202C445j2890O559Q008P469j1436j1784J8890l330j8177J4666J0306r138j2651
215a0063J106K0181q296j6055J0699J150p13O715n448p67l580j594J4803k350
229E788p615K210m751O669M462n882L147r253j71J9544n877j4373j105O784J1376
$$ plain form
244 10953 557 -9350 1011 -2027 -3070 2005 -4713 -347 1511 -5134 -2388 -2902 3049 6065 -7956
259 -7956 -3889 5566 3179 4652 -5582 -7356 8499 8662 3953 -2091 -6731 4925 4897 -950 2493
274 2493 -4404 -1920 5416 -2448 -1582 -3157 -5656 2878 23 -1511 174 -5493 -7 421 -4329 4810
290 4810 1007 -4518 1638 430 4386 4787 -2461 710 -576 2194 9551 -3013 -6508 3261 3148
305 3148 4690 -3345 -8242 2353 1434 567 1166 -6297 -1432 130 -3628 1853 -3221 -3440 3965 -1305
321 -1305 -257 2512 -1033 1516 -2183 820 8745 -910 -2011 2746 -1094 3533 2943 -1692 585
336 585 -3495 1668 6045 -4020 -3408 -2030 -2044 3534 -2619 -5328 -407 -2333 2132 2324 -4564 -805
352 -805 -759 867 4724 -2526 150 4150 -1813 1978 2467 -27 2603 -2055 1617 5246 -1919 921
$$ packed form
244A0953j0396r907J0361l038j043N075o718M366J858o645K746n14N951L016j4021
259g956M067R455k387J473j0234j774J5855J63m709o044m640J1656k8n847L443
274B493o897K484P336p864Q66j575k499Q534k855j534J685n667N486M28m750R139
290D810l803n525O156j208L956M01p248L171j286K770P357j2564l495R769j13
305C148J542q035m897J0595r19q67N99p463M865J562l758N481n074k19P405n270
321a305J048K769l545K549l699L003P925r655j101M757l840M627n90m635K277
336E85m080N163M377j0065O12J378j4N578o153k709M921j926M465J92o888L759
352h05M6J626L857p250K676M000n963L791M89k494K630m658L672L629p165K840
$$ plain form
368 921 -910 -4362 2943 410 -2463 -1164 -4720 1276 2197 -3690 -586 -3239 -1716 3844 -1808 -185
384 -185 1208 -2989 2707 2881 -136 1915 -2321 1903 5367 174 2577 -300 -3664 3942 1256 -1103
400 -1103 -527 -3686 1427 2150 -2739 -493 -4084 -1987 2910 -3390 -1003 644 -3420 780 -28 -157
416 -157 3104 -2044 246 2279 -429 4801 1890 -3146 2075 1446 2175 2366 -4451 -545 2897 1360
432 1360 2172 -5252 -3861 3065 -1013 59 -1050 -5589 780 1215 -813 -513 -3934 1176 2683 -1821
448 -1821 2738 913 -1034 3189 -877 187 3733 210 1194 -605 52 5207 -790 -2554 133 -2925
464 -2925 2834 2802 -4843 -2786 -1738 1345 2845 -4633 -3638 -326 217 4203 -1920 -3884 3198 701
480 701 591 1724 -1793 1748 1574 1239 3651 -1415 848 2646 -2960 1574 2797 -1014 -405 -3221
$$ packed form
368I21j831l452P305k533k873J299l556N996R21n887L104k653J523N560n652J623
384a85J393m197N696J74l017K051m236M224L464n193K403k877l364P606k686k359
400a103N76l159N113P23m889K246l591K097M897o300K387J647m064M200q08j29
416a57L261n148K290K033k708N230k911n036N221o29P29J91o817L906L442j537
432A360Q12p424J391O926m078J072j109m539O369M35k028L00l421N110J507m504
448a821M559j825j947M223m066J064L546l523R84j799O57N155n997j764K687l058
464b925N759l2p645K057J048L083J500p478R95L312N43L986o123j964P082k497
480G01j10J133l517L541j74l35K412n066K263J798n606M534J223l811O09k816
$$ plain form
496 -3221 -1522 2753 -1517 -1835 -2678 -2751 3718 -876 -3184 1082 -2906 -312 3113 -457 -236 -1974
512 -1974 -26 5300 925 275 332 -2243 4115 3428 -1190 786 -1784 -77 3809 -1377 -2091 -1846 -593
529 -593 2971 -3241 -3006 2841 -2210 -2948 -178 -555 1990 -2236 -2955 2116 1063 2447 603 -3999
545 -3999 2144 3413 927 2300 -2692 -917 4306 1470 480 -2006 -1716 3324 -1201 -1208 1778 -3481
561 -3481 -1162 343 -1342 1063 -2665 -3387 1343 131 1079 -282 -3055 2848 813 -748 3807 198
577 198 -1306 812 410 3579 914 -2051 1402 -411 1285 2855 -2736 -1707 -78 -522 2683 -2505
593 -2505 -4637 594 722 735 -2226 -3031 2347 -787 -2328 2823 210 -630 330 -1016 2869 1968 -486
610 -486 1379 -964 1774 4322 -961 -344 -566 -575 3698 -754 -3113 -211 -1036 1232 -310 -2823 509
$$ packed form
496c221J699M275m270l18q43p3O469m594k308M266l988K594L425l570K21j738
512a974J948N326m375o50N7k575O358o87m618J976k570J707L886n186p14K45J253
529e93L564o212K35N847n051p38K770l77K545m226p19N071j053J384j844m602
545c999O143J269k486J373m992J775N223k836r90k486K90N040m525pK986n259
561c481K319J505j685K405l728p22M730j212R48j361k773N903k035j561M555l609
577A98j504K118m02L169k665k965L453j813J696J570n591J029J629m44L205n188
593b505k132N231J28J3k961q05N378l134j541N151k613q40R60j346L885r01k454
610d86J865k343K738K548n283O17k22rM273m452k359K902q25K268j542k513L332
$$ plain form
627 509 -1549 -1875 1949 -1163 -349 -186 -2776 1801 2039 178 922 -2228 1002 3754 -47 1292 -719
644 -719 -1750 3906 1152 -1000 -818 -1974 2513 1387 -2908 -281 -1585 -1103 1051 -2087 39 -208
660 -208 -3498 400 163 -537 1956 -1934 -734 1700 935 2790 -1052 -2993 3330 2778 650 -473
676 -473 -2290 2506 2234 -1215 663 -1128 -501 1310 -1939 56 90 -2535 -345 -2123 -940 2581
692 2581 -1877 -2237 -72 140 3238 -549 -2564 1342 905 2006 1987 -2260 609 1775 717 2356
708 2356 -1397 -633 1636 -615 1108 121 -2397 -65 -956 -98 1290 -2483 -1117 44 -1847 1023
724 1023 235 -1262 423 -1776 854 2325 -751 833 -378 -391 3579 725 -723 -72 -636 3069
740 3069 1717 -2249 -4 -1078 515 1631 -2327 -488 -152 -1679 1082 -593 -1895 166 -1552
$$ packed form
627E09k058l26L824l112Q14J63k590M577K38j861P44l150L230K752l801J339k011
644g19j031N656k754k152J82j156M487j126m295K627j304M82K154l138K126k47
660b08l290L898k37p00K493l890J200K434p65J855l842j941O323n52k128j123
676d73j817M796k72l449J878j791O27J811l249J995L4k625K190j778J183L521
692B581m458l60K165K12L098l787k015L906m37J101j9m247K869J166j058J639
708B356l753P64K269k251J723r87k518K332q91Q58J388l773J366J161j891K870
724A023p88j497J685k199K630J471l076J584j211j3L970k854j448O51n64L705
740C069j352l966K245j074J593J116l958J839L36j527K761j675j302K061j718
$$ plain form
755 -1552 -310 611 -1242 1614 -648 -1601 2433 570 610 820 -1385 1913 1956 331 1426 -1551 -407
772 -407 2649 -108 -22 -1062 -2141 1910 310 -1375 -485 -2791 -124 969 -1410 74 -1344 -1176
788 -1176 1649 -1322 -136 1294 -900 864 733 383 2262 -763 -596 1657 -204 2049 571 -2301
804 -2301 915 385 484 712 -2627 -863 485 -826 511 -1789 -1935 911 -1148 84 313 -2189 785
821 785 501 66 1549 -1139 -189 1195 -454 2230 972 -918 1533 -61 179 1576 -1019 159
837 159 -178 -1017 1759 -660 -1578 -22 -1775 235 512 -2248 -179 -679 -488 1541 -960 -355 660
854 660 -614 1909 848 -772 1419 -92 981 2401 -700 629 241 -391 1980 -481 -610 429
870 429 -1612 319 518 -1554 256 -1433 -1310 716 -1539 -293 -94 -1764 1020 335 -759 776
$$ packed form
755a552J242R21j853K856k262r53M034j863M0K10k205L298M3j625J095k977J144
772d07L056k757Q6j040j079M051j600j685Q90k306K667J093k379J484j418J68
788a176K825k971J186J430k194J764j31l50J879l025J67K253j861K253j478k872
804b301L216n30R9K28l339J764J348j311J337k300j46K846k059J232K29k502K974
821G85k84m35J483k688R50J384j649K684j258j890K451j594K40J397k595J178
837A59l37q39K776k419r18J556j753K010K77k760K069n00J91K029k501O05J015
854F60j274K523j061j620K191j511J073J420l101J329l88o32K371k461j29J039
870D29k041J931J99k072J810j689J23K026k255J246J99j670K784o85j094J535
$$ plain form
886 776 -923 182 2095 -126 1132 364 -516 2074 325 176 799 -1443 821 1136 -1209 112 -1403
903 -1403 -680 1110 -1568 -387 -432 -1948 453 -313 -1044 619 -1357 -118 1190 -656 1354 353
919 353 -698 1430 -151 1104 1813 -1491 509 863 -79 1515 -953 -736 880 -582 875 -225
935 -225 -2222 -47 -327 -150 341 -2465 -311 1008 -1187 79 -666 -709 1451 -579 472 1289 -860
952 -860 1087 881 -596 1743 205 496 655 -1435 968 1289 -1055 206 -1199 -104 1775 -1622
968 -1622 -1263 -465 -845 1400 -868 -1807 603 -764 756 464 -1932 591 804 109 1171 -1041 372
985 372 1960 -625 565 562 21 1584 -834 -513 1391 -793 -144 -220 -1824 693 -36 -647 -290 -2099
1003 -2099 194 1324 -1306 -354 -874 -56 1904 -756 -384 1003 -446 1601 497 -387 1223 -55
$$ packed form
886G76j699J105J913k221J258p68q80K590j749j49O23k242K264L15k345J321j515
903a403P23J790k678J181m5j516K401p66p31J663j976J239J308j846K010j001
919C53j051K128j581J255P09l304K000L54r42J594k468K17J616j462J457j100
935b25j997K175k80J77M91k806K154J319k195J266p45m3K160k030J051Q17k149
952h60J947k06j477K339j538K91J59k090K403L21k344J261j405J095J879l397
968a622L59P98l80K245k268r39K410j367J520k92k396K523K13o95J062k212J413
985C72J588k585J190ln41J563k418L21J904k184O49p6j604K517p29o11L57j809
1003b099K293J130k630R52n20Q18J960k660L72J387j449K047j104q84J610j278
$$ plain form
1019 -55 604 1381 -984 490 345 -371 693 -605 -410 645 -1655 -620 -207 -1105 521 -1185 -1314
1036 -1314 820 -652 -23 539 -1447 940 269 146 1232 -1168 224 1827 -214 648 -106 -470 1720
1053 1720 -76 -115 804 -760 375 143 -745 384 -1123 -1203 687 -1167 -246 146 -1248 206 -179
1070 -179 -213 1150 -1053 -25 1377 -308 833 224 -449 1229 51 398 1310 -740 585 319 -483
1087 -483 788 -474 -933 505 -1236 104 285 -1572 111 -736 -506 912 -1376 -655 536 -363 941
1104 941 -370 -642 1349 169 611 1357 -735 1072 576 -622 1350 -178 16 785 -1305 96 266
1121 266 -886 389 -907 -880 743 -832 -652 -361 -1518 836 -48 -1156 336 -723 594 1089 -723
1138 -723 408 225 -220 1585 -157 -545 1095 -265 861 373 -947 832 -652 -245 606 -1377 -69
$$ packed form
1019e5O59P77k365J474j45p16J064j298J95J055k300J035M13q98J626j706j29
1036a314K134j472O29N62j986K387o71j23J086k400J392J603k041Q62p54l64K190
1053A720j796l9R19j564J135k32q88J129j507q0J890j854R21L92j394J454l85
1070a79l4J363k203J028J402j685J141o09o73J678j178L47R12k050J325k66q02
1087d83J271j262m59J438j741J340J81j857J683q47K30J418k288P21J191q99J304
1104I41j311k72J991j180M42P46k092J807m96j198J972j528J94P69k090J401J70
1121B66j152J275j296K7J623j575J80K91j157K354q84j108J492j059J317M95j812
1138g23J131j83m45J805j742l88J640j360J126m88j320J779j484M07Q51j983J308
$$ plain form
1155 -69 82 -1406 83 -475 -634 548 -1315 -572 427 -320 1002 -544 -847 1549 274 491 512 -1158
1173 -1158 1084 1264 -270 570 -572 184 1311 -972 299 60 -404 915 -632 -974 463 -919
1189 -919 -300 -184 -933 714 -93 -799 296 -553 412 787 -1068 468 479 5 1589 -370 -64 1007
1207 1007 204 1079 178 -1049 1099 155 -255 313 -1243 -116 -57 -1157 470 -1355 -734 664 -1095
1224 -1095 -288 512 -791 342 -477 -423 1107 -98 271 703 -192 1243 801 -404 704 -483 464
1241 464 1233 -589 -37 -52 -495 974 -476 -1142 406 -960 219 255 -1610 202 -664 -558 571 -503
1259 -503 72 395 -816 568 264 -247 972 -27 325 1241 -263 665 71 -594 1015 -247 -155 128
1277 128 -992 536 448 -797 99 -971 -517 482 -791 -159 -126 -837 622 108 -192 824 -494 255
$$ packed form
1155f9J51j488J489n58j59J182j863P43R99p47J322j546l03K396j275K17K1j670
1173a158K242J80j534Q40j142P56J127k283J271k39m64J319j547l42J437j382
1189i19O19J16p49J647q07p06J095q49R65L75j855J536J1m74J584j959L06J071
1207A007q03Q75r01j227K148r44m10N68j556J127N9j100J627j825O21J398j759
1224a095Q07Q00j303J133q19N4J530j205L69M32q95J435m42j205J108j187R47
1241D64P69j822N52j5m43J469j450o66J548j366J179L6j865J812q66J06J129j074
1259e03N75L23j211J384l04n11J219r99L52R16j504R28n94o65J609j262R2K83
1277A28j120J528q8j245Q96j070M54R99j273O32L3p11J459n14l00J016j318P49
$$ plain form
1295 255 774 -213 950 144 -364 1179 -158 353 671 -772 349 175 -582 423 -755 -561 387 -742
1313 -742 1 -55 -1055 159 -633 -393 920 -576 -265 421 -20 821 35 -220 759 190 759 1039 -957
1332 -957 412 453 69 814 -339 -359 632 -607 49 104 -1101 344 -453 -511 184 -974 154 50 -1039
1351 -1039 402 -2 -485 482 -522 268 1009 -142 644 104 98 1609 132 -374 352 -207 989 304
1369 304 -973 344 -486 -2 668 -944 -342 -30 -569 256 -618 -840 430 -643 116 374 -413 492
1387 492 290 -477 1238 18 280 852 -541 683 526 50 612 -893 -477 907 -585 92 -367 -859
1405 -859 392 -301 -948 -356 -1141 113 381 -916 -79 -406 -285 670 -379 46 916 -448 656 226
1423 226 -273 1056 -131 262 514 -230 965 160 -660 225 -329 -216 370 -1155 198 300 -581 322
$$ packed form
1295B55N19r87J163q06n08J543j337N11L18j443J121j74p57J005j178J94R48j129
1313g42P43n6j000J214p92K40J313j496L11O86m41Q41p86k55R79n69N69K80j996
1332i57J369M1l84P45j153k0R91j239O56N5j205J445p97n8O95j158J128j04j089
1351a039J441m04m83R67j004P90P41j151P86n40oJ511j477n06P26n59J196o85
1369C04j277J317q30M84O70j612O02L12n39Q25q74k22J270j073P59K58p87R05
1387D92k02p67J715j220K62N72j393J224j57m76N62j505M16J384j492O77m59m92
1405h59J251o93o47N92p85J254K68j297Q37l27J21R55j049M25Q70j364J104m30
1423B26m99J329j187L93K52p44J195q05q20Q85n54J13N86j525J353J02q81R03
$$ plain form
1441 322 -688 -950 517 -287 -62 437 -746 386 223 -312 566 -586 315 460 -225 703 389 -148
1459 -148 876 -301 72 621 -506 -17 -223 -533 491 -395 -610 -130 -810 267 85 -836 -52 -339
1477 -339 -278 630 -535 -24 668 -330 919 351 -256 990 -169 358 892 -343 320 238 -372 641 -578
1496 -578 -619 415 -778 -109 174 -935 142 -479 -119 445 -733 21 -11 -552 353 245 -114 635 -337
1515 -337 289 1129 179 541 -90 -167 984 -480 -13 407 -677 337 407 -420 -23 -580 -652 294 -595 52
1535 52 8 -774 283 -209 -200 447 -105 -138 574 -352 509 203 -333 969 -168 187 968 -266 354 316 -142
1556 -142 542 -188 -420 376 -457 140 -144 -955 310 -339 -212 561 -1012 -128 243 -189 201 -103 -253
1575 -253 606 -169 53 333 -375 743 378 -392 619 100 27 344 -397 445 261 -587 35 -509 -408 371
$$ packed form
1441C22j010k62J467q04K25M99j183J132j63n35Q78j152R01J45o85R28l14n37
1459a48J024j177L73N49j127M89k06l10J024q86k15M80o80J077j82r21P84k87
1477c39O1R08j165N11O92r98J249n68o07J246j159N27N34j235O63q2o10J013j219
1496e78m1J034j193O69K83j109J077o21L60N64j178P54l2n41R05j08l59P49r72
1515c37O26Q40r50L62o31p7J151j464M67M20j084J014P0q27L97n57p2R46q89O47
1535E2m4p82J057m92RO47n52l3P12r26Q61l06n36J302j137L55P81j234O20l8m58
1556a42O84p30k32P96q33N97k84q11J265o49J27P73j573Q84L71m32L90l04j50
1575b53Q59p75K22K80p08J118l65p70J011n19p3L17p41Q42j84q48O22n44J01P79
$$ plain form
1595 371 -809 -428 -44 -641 533 -45 -683 449 -129 234 428 -472 476 416 -52 881 -128 158 660
1614 660 -201 375 19 -379 389 -297 -78 222 -532 -14 -320 -586 287 -172 -192 144 -995 -89 491 -283
1634 -283 101 -236 -147 897 -128 48 406 -516 604 248 -170 475 -277 71 582 -702 133 165 -313
1653 -313 337 -721 -286 408 -749 -356 -61 -617 212 -513 -551 286 -341 500 148 -619 496 316 181
1672 181 750 -342 103 716 -69 94 83 -402 713 -37 -195 326 -601 126 35 -686 259 -553 -542 76
1692 76 -734 71 218 -461 264 -377 -167 616 -372 238 482 -299 686 389 -208 639 96 42 520 -457 210
1713 210 -197 -184 475 -507 -354 -91 -372 -87 -308 -659 295 -371 -322 372 -571 130 194 -501 439 187 -33
1734 -33 655 -298 47 873 -227 528 96 -73 772 7 107 259 -443 106 121 -693 221 -530 -366 582
$$ packed form
1595C71j180L81L84n97J174n78o38J132n78L63J94r00R48o0m68R33j009K86N02
1614F60q61N76l56l98P68o86K19L00p54N18l06k66Q73m59k0L36j139R06N80p74
1634b83L84l37Q9J044j025J76L58r22J120l56m18O45p52L48N11j284Q35L2m78
1653c13O50j058M35O94j157L93K95n56Q29p25l8Q37o27Q41l52p67J115j80j35
1672A81N69j092M45O13p85J63j1m85J115p50j58N21r27P27r1p21R45q12J1O18
1692G6q10Q05J47o79P25o41K10P83r88O10K44p81R85k97n97Q47n43n4M78r77O67
1713B10m07J3O59r82J53K63k81K85k21l51R54o66M9O94r43P01O4o95R40k52k20
1734c3O88r53L45Q26j100P55m32j69Q45p65J00J52p02N49J5q14R14p51J64R48
$$ plain form
1754 582 -583 -221 109 -550 328 -37 -377 695 -127 285 620 72 350 127 -3 616 74 77 329 -275
1774 -275 370 105 -335 407 -282 -459 189 -590 330 -135 -863 301 -217 -354 315 -754 -389 446 -233
1793 -233 399 -206 -20 864 69 226 433 -413 705 213 -194 331 96 9 271 -459 189 -193 -474 136
1813 136 -575 -442 77 -596 74 -328 -628 382 -116 -367 128 -99 350 405 -351 351 346 2 564 -133 -123
1834 -123 263 -128 298 -182 -511 92 -160 -178 97 -560 105 299 -568 217 -595 -460 449 -466 -137 282
1854 282 -514 409 -65 -63 873 -59 309 211 -251 769 301 -114 201 -217 -45 446 -485 61 -217 -405 222
1875 222 -366 -528 170 -780 85 -6 -813 126 -280 -142 299 -225 -147 205 -495 352 -42 146 517 -176 -56
1896 -56 139 -191 255 20 -417 251 7 61 36 -511 101 105 -416 110 -752 -548 517 -406 -242 -102 -331
$$ packed form
1754E82j165L62L30o59Q78l65l40J072q22M12L35n48K78k23j30O19n42LK52o04
1774b75O45k65m40P42o89j77O48p79R20m65p28J164n18j37O69j069L65Q35o79
1793b33O32o05J86Q84p95J57K07q46J118m92m07N25k35q7K62p30O48l82k81O10
1813A36p11J33N19o73O70m02l00J010m98k51M95k27M49N5p56P02nl44N62o97J0
1834a23L86l91M26m80l29O03k52j8K75o57O65J94q67P85q12J35R09r15L29M19
1854B82p96R23m74KR36r32L68r8m62J020m68m15L15m18J72M91r31N46k78j88O27
1875B22n88j62O98r50Q65r1q07R39m06J38M41n24P8L52p00Q47l94J88L71o93J20
1896e6J95l30M46k35m37O68k44N4k5n47O12Mn21N26q62K04J065r23J64J40k29
$$ plain form
1917 -331 476 31 -223 204 -101 -22 539 -168 462 47 -490 412 26 -119 584 -380 -102 255 -352 198
1937 198 -125 -266 243 -201 -3 125 -435 206 -188 -7 407 -402 121 190 -92 712 149 -294 309 -132
1957 -132 260 743 -333 428 395 -406 412 -258 -202 182 -498 174 106 -417 197 -323 -574 376 -856 -129
1977 -129 116 -299 411 56 -169 329 -74 162 681 -116 253 262 -263 414 -113 206 254 -488 337 65 -345
1998 -345 162 -284 -373 216 -704 -232 -31 -563 281 -297 -511 197 -445 110 380 -382 392 276 -264 623
2018 623 -24 177 246 -545 -50 293 -250 280 -149 -138 370 -510 127 74 -470 209 -115 -246 289 -524 -123
2039 -123 334 -665 426 122 11 518 -24 22 580 -174 587 79 93 584 -198 96 204 -446 420 33
2059 33 -339 -20 -200 -174 102 -516 -130 -162 -525 290 -269 -388 222 -188 60 207 -394 262 336 -265 270
$$ packed form
1917c31Q07m45k54M27l05P9N61p07O30m15n37R02l86j45P03r64K78L57o07N50
1937A98l23j41N09m44J98J28n60O41l94J81M14q09N23O9k82Q04n63m43O03m41
1957a32L92M83j076P61l3q01Q18o70N6L84o80O72o8n23O14n20k51R50j232P27
1977a29K45m15P10l55k25M98m03K36N19p97L69Rn25O77n27L19M8p42Q25k72m10
1998c45N07m46q9N89r20M72K01n32Q44n78k14P08o42N55K70p62P74j16n40Q87
2018F23o47K01O9p91M95L43n43N30m29J1N08q80O37n3n44O79l24j31N35q13M01
2039a23M57r99J091l04j11N07n42M6N58p54P61n08J4M91p82K94J08o50Q66l87
2059C3l72L19j80K6K76o18L86l2l63Q15n59j19O10m10K48J47o01O56P4o01N35
$$ plain form
2080 270 -33 174 498 -202 252 133 5 271 -206 -223 240 -520 -62 -64 -431 310 -267 -338 81 -566 109
2101 109 233 -495 173 -59 -112 381 -85 88 430 134 466 278 -101 362 1 29 316 -556 -111 93 -305
2122 -305 343 -290 -183 -118 -629 35 52 -543 -12 -311 -203 344 -239 310 320 -228 264 384 109 190 -61
2143 -61 304 264 -171 312 448 -243 438 -509 139 140 -255 166 176 -468 -5 -674 -331 308 -806 129 152 -487
2165 -487 171 -203 -295 604 -482 41 261 -217 464 -21 -116 555 -171 66 167 -501 121 -51 -156 540
2185 540 -359 -479 300 -354 90 2 -285 32 -167 -214 412 -325 102 215 -248 173 59 -117 532 12 -146
2206 -146 365 -143 324 -11 -125 390 -119 -1 191 -576 -59 15 -353 6 -257 -310 127 -642 -231 -132 -502
2227 -502 209 -125 -256 398 -224 270 86 -238 319 57 33 444 20 114 347 -162 142 244 -376 333 -398
$$ packed form
2080B70l03K07L24p00M54j19j28K66m77j7M63p60M58kl67P41n77p1M19o47O75
2101A09J24p28O68k32n3M93m66J73L42k96L32j88l79M63l61K8K87q72M45K04l98
2122c05O48o33J07O5n11O64J7n95N31k99J08N47n83N49J0n48M92J20k75Q1k51
2143f1L65m0m35M83J36o91O81r47O48Jl95M21J0o44M63o69L43O39j114R35K3o39
2165d87O58l74r2Q99j086N23K20m78O81m85r5O71p26K37J01o68O22j72j05O96
2185E40q99j20P79o54M44q8k87L17j99m7O26p37M27J13m63M21j14j76O49n20j58
2206a46N11n08M67l35j14N15n09J18J92p67N17P4l68L59k63n3M37p69M11R9l70
2227e02P11l34j31O54o22M94j84l24N57k62k4M11m24R4K33n09L04J02o20P09p31
$$ plain form
2248 -398 -350 265 -288 -80 1 -612 288 -82 -236 210 -393 55 415 -185 242 157 -285 551 22 199 312
2269 312 -36 350 365 34 345 50 -151 151 -231 -118 93 -187 34 -304 -187 163 -488 -106 233 -313
2289 -313 291 -13 -269 92 -54 130 528 -124 422 207 2 355 -257 -144 320 -75 157 -295 -282 492
2309 492 -43 -34 228 -370 99 -96 -432 2 -423 -293 171 -287 137 15 -12 326 -6 118 478 -240 89
2330 89 266 128 493 3 -334 108 -107 3 365 -530 112 32 -368 168 -124 -247 107 -576 -245 40 -626
2351 -626 200 -336 -272 438 -223 146 300 -308 477 -156 -114 491 -11 35 426 -55 212 298 -159 485 -128
2372 -128 -74 239 -378 56 288 -436 363 -357 -276 150 -351 86 195 -358 339 -161 -20 323 -124 180 413
2393 413 43 270 118 -26 205 -134 52 15 -286 88 -52 -211 258 -286 -46 324 -250 -27 -4 -477 234
$$ packed form
2248c98M8O15n53K08Q1o13R00l70j54M46o03M48L60o00M27q5m42Q36n29J77J13
2269C12l48L86J5l31L11k95k01L02l82J13K11k80K21l38J17L50o51L82L39n46
2289c13O04l04k56L61j46J84L98o52N46k15k05L53o12J13M64l95K32m52J3P74
2309D92n35RK62n98M69j95l36M34m25J30M64m58M24j22k7L38l32J24L60p18L29
2330H9J77j38L65m90l37M42k15J10L62q95O42q0m00N36k92j23L54o83L31K85o66
2351f26Q26n36O4P10o61L69J54o08P85o33M2O05n02M6L91m81K67Q6m57O44o13
2372a28N4L13o17M34K32p24P99p20Q1M26n01M37J09n53O97n00J41L43m47L04K33
2393D13l70K27j52j44K31l39J86l7l01L74j40j59M69n44K40L70n74K23K3m73P11
$$ plain form
2414 234 -287 -236 492 -415 -13 272 25 320 32 -82 388 -110 243 294 -296 272 -23 -444 479 91 67
2435 67 122 -513 -127 105 -210 87 -27 -262 68 -355 -6 236 -368 189 124 -248 424 85 57 245 -31
2456 -31 141 220 124 399 120 61 455 4 264 -117 -472 154 -269 36 5 -502 27 -203 -224 308 -5 -176
2478 -176 177 -119 214 287 -53 316 -61 -186 412 -43 -5 463 -215 135 149 13 -37 -243 -122 248 7
2499 7 -40 -51 -535 128 -100 -457 56 -218 118 220 -196 145 101 -21 309 -185 64 432 73 231 4 -226
2521 -226 295 -230 -21 325 -173 152 167 -235 84 -91 -34 186 -440 80 90 -382 -32 -49 69 261 -43
2542 -43 -13 263 -203 379 102 -64 325 93 131 323 24 295 54 -343 263 -103 -36 188 -124 20 -60 -252
2564 -252 165 -64 -273 42 -359 141 -161 -77 325 -11 -7 475 -75 37 413 -209 424 249 69 207 -235
$$ packed form
2414B34n21N1P28r07M02K85k47K95k88j14M70m98L53N1n90N68k95m21R23l88k4
2435F7N5o35L86K32l15K97j14k35L30m23L49K42o04N57o5l72O72l39k8J88k76
2456c1J72P9r6K75k79n9L94m51K60l81l55O26m23L05l1n07N29k30k1N32l13j71
2478a76L53k96L33P3l40L69l77j25N98m55L8M68o78L50J4j36n0k06J21L70k41
2499Gm7j1m84O63k28l57N13k74L36J02m16L41m4j22L30m94K49L68l59J58k27k30
2521b26N21n25K09L46m98L25J5m02L19j75N7K20o26N20J0m72L50j7J18J92l04
2542d3L0K76m66N82k77j66L89k32L8J92k99K71k41l97O06l66O7K24l12J44q0j92
2564b52M17k29k09L15m01N00l02Q4M02l36MM82n50J12L76o22O33j75j80J38m42
$$ plain form
2585 -235 -46 291 44 80 -208 -300 300 -233 0 13 -464 -81 -20 -326 -86 44 -23 78 -53 137 64 -354
2607 -354 183 267 -144 260 -336 112 304 -223 260 45 -239 367 64 3 246 -182 244 199 -187 201 -135
2628 -135 -197 93 -50 -8 -39 -208 108 -159 23 306 -67 -376 105 104 326 -183 -120 246 -209 181 64 -112
2650 -112 333 209 -160 69 -395 -103 168 -307 -193 -75 -356 211 -218 -168 -63 -248 355 92 -313 352
2670 352 224 -142 277 -28 -86 185 37 63 -52 -218 296 -67 -259 69 -352 -150 158 -251 14 -171 -12
2691 -12 353 -299 17 -85 -247 214 -61 -23 440 -38 166 203 -98 383 80 -153 332 -190 201 204 81 182
2713 182 124 -244 87 -7 -178 -47 -263 103 -248 -224 201 -307 -129 51 -202 -15 92 -176 -52 324 -139
2734 -139 -56 -52 3 81 -75 262 -108 -270 253 -72 145 257 -584 38 -165 -215 260 11 -284 -52 -30 144
$$ packed form
2585b35J89L37k47L6k88r2O00n33K33J3m77L83O1l06K40J30o7J01j31J90p3m18
2607c54N37Q4m11M04n96M48J92n27M83k15k84O06l03o1K43m28M26m5l86L88l36
2628a35o2K90j43M2l1j69L16k67J82K83l73l09M81jK22n09O3L66m55L90j17j76
2650a12M45j24l69K29m64K92K71m75J14J18k81N67m29N0J05j85O03k63m05O65
2670C52j28l66M19l05n8K71j48K6j15j66N14l63j92L28m21K02L08m09K65j85J59
2691a2L65o52L16j02j62M61k75L8M63m78K04L7l01M81l03k33M85n22L91Lj23J01
2713A82n8l68L31r4j71J31k16L66l51K4M25n08J78J80k53J87J07k68J24L76m63
2734a39Q3MN5P8j56L37l70j62N23l25K17J12q41O22k03n0M75k49k95K32K2J74
$$ plain form
2756 144 -200 -391 164 -59 -82 339 -102 488 246 -105 422 133 19 24 191 149 323 106 45 21 13 228 -1
2779 -1 -81 84 -269 175 72 -443 -8 -62 -56 89 -222 20 207 74 252 -239 -64 172 2 76 493 33
2801 33 156 103 -27 430 1 -53 179 -282 190 160 -309 -111 -39 -358 95 -179 8 159 -522 -36 -10 -37
2823 -37 163 -130 111 344 -2 355 -129 -193 160 -159 199 454 -303 206 -110 -153 325 -220 233 80 -149
2844 -149 -195 103 -93 -76 -117 -259 -76 -294 -155 64 -132 323 345 -95 396 94 -120 277 -11 65 110 -129
2866 -129 207 -24 176 229 -180 143 164 -128 49 98 -126 57 -249 82 -130 -160 -36 -372 43 184 -102
2887 -102 58 -87 -292 245 108 -123 305 -249 -89 99 126 106 -103 -154 -50 165 27 -65 -250 -52 -50 -314
2909 -314 41 -413 -201 -60 -94 -78 -157 -109 -73 -27 25 176 -273 174 155 -17 196 65 151 187 47 131 334 -162
$$ packed form
2756A44l44j91N55k23k3M21m41N90k42l51N27k89j14NJ67m2J74k17o1k4qK15k29
2779aq0J65l53M44j03n15M35n4OJ45l11K42J87j33J78m91J75K36j70P4M17m60
2801C3J23n3j30M57m29n4K32m61M72l0m69J98P2l19M53k74J87J51o81M86K6k7
2823c7K00k93K41K33l46L57m84o4L53l19L58K55p57N09l16m3M78n45M53j53k29
2844a49m6K98j96J7m1j42J83k18J39K19j96M55K2m40M91l02k14L97k88P6M5k39
2866a29L36k31K00N3m09L23K1k92J77M9k24J83l06L31k12l0J24l36M15J41k86
2887a02J60j45k05N37j37k31M28n54J60J88K7k0k09n1J04K15j38r2j85J98Kk64
2909c14L55m54K12J41l4J6p9M8L6M6N2J51m49M47j9j72K13j31Q6L6j40Q4K03m96
$$ plain form
2933 -162 -7 364 -337 501 -146 50 154 -354 202 152 -26 -212 -85 -136 125 -237 89 36 -364 17 -177
2954 -177 41 235 -103 -14 191 -90 332 14 -160 132 -270 143 112 -366 -142 -130 -324 82 -77 -126 -167 -220
2976 -220 109 -11 -131 35 -200 -63 103 72 34 32 -61 200 298 -90 190 -146 -159 0 -30 -156 -102 -364 -6
2999 -6 -100 -154 -85 -193 -74 -130 -120 -65 -190 -136 16 -10 -433 250 -142 181 -65 -258 146 114 75 -2 73 152 129
3024 129 -26 156 -139 -29 79 -270 71 104 -142 304 -80 -185 60 -114 17 -115 -177 103 41 -28 -11 -160
3046 -160 92 -85 0 123 -7 180 77 -51 -19 33 -110 50 413 -203 84 -158 -139 54 -100 -68 84 -312
3068 -312 4 16 -1 159 -99 -22 101 -366 12 77 63 64 30 65 3 -135 243 129 -96 204 -215 -392 103
3091 103 -334 133 -17 -533 1 -237 -207 34 -234 69 145 -248 -3 79 -209 343 -187 50 51 -250 45 111
$$ packed form
2933a62J55L71p01Q38o47J96J04n08N56n0j78j86J27n1K61l62L26n3m00L81j94
2954a77K18J94l38Q9K05k81M22l18j74K92m02M13l1m78K24J2j94M06j59m9m1n3
2976b20L29j20j20J66k35J37J66l1l8kr3K61R8l88K80l36j3J59l0j26N4k62L58
2999fr4n4O9j08J19n6J0N5j25N4J52k6m23O83l92L23k46j93M04l2l9p7P5P9k3
3024A29j55J82k95J10J08l49L41L3k46M46l84j05K45j74J31j32o2K80o2o9J7j49
3046a60K52j77Q5J23j30J87j03j28L2N2j43J60L63o16K87k42J9J93j54L2J52l96
3068c12L16J2j7J60k58P7J23m67L78O5j4Jl4L5o2j38L78j14k25L00m19j77M95
3091A03m37M67j50n16N34k38L0K41k68L03P6l93K45Q2k88N52n30K37Jl01K95O6
$$ plain form
3113 111 111 6 -76 11 -258 -179 238 138 99 265 -97 -46 63 -192 -187 -47 -297 -42 -224 -141 -88 -72 293 151
3137 151 -177 261 290 79 281 -291 140 -29 42 79 -106 -26 152 -146 -136 290 -97 138 -97 -9 163 -319
3159 -319 -133 84 -305 -147 -3 -286 233 -285 100 288 37 134 186 -159 183 -71 -129 244 136 -101 96
3180 96 -88 134 280 -111 278 6 18 51 -469 24 -66 -11 -23 217 31 0 -584 118 56 -296 83 -220 96
3203 96 168 -121 176 82 -55 473 -26 22 213 -78 -68 77 -252 296 -63 -300 84 -60 -44 219 -382 -32
3225 -32 118 -92 188 -63 85 307 -97 -30 -114 93 90 -46 -19 -41 189 -11 75 80 194 59 -168 68 137 -346
3249 -346 68 149 -100 240 -259 353 -164 -177 -15 6 53 74 -86 227 122 -12 410 -110 -103 86 -160 54
3271 54 445 -55 264 91 -42 239 -277 71 94 -242 -77 -97 -63 -97 -20 -128 33 -437 74 43 -121 150
$$ packed form
3113A11%j05q2Q7k69P9M17j00l9J66l62N1J09k55NJ40k50K55j82Q3N3J6L65j42
3137A51l28M38K9k11K02n72M31j69P1L7j85Q0J78k98J0M26l87K35k35Q8J72m82
3159c19J86K17l89J58J44k83N19n18L85J88k51R7N2l45L42k54n8L73j08k37J97
3180I6j84K22J46l91L89k72J2L3n20M93r0N5j2K40j86l1n84P02o2l52L79l03L16
3203I6P2k89K97r4j37N28m99M8J91k91J0J45l29N48l59k37L84j44J6K63o01L50
3225c2J50k10K80k51J48K22m04O7q4K07lj36K7k2K30k00Q6NJ14j35k27K36O9m83
3249c46M14Q1k49L40m99O12n17j3J62K1M7K1j60L13j05j34M22n20PJ89k46K14
3271E4L91n00L19j73j33K81n16L48K3l36J65k0L4l4P7j08J61m70N11l1j64K71
$$ plain form
3293 150 -17 6 -78 -195 58 -185 -169 280 179 39 40 -272 -20 0 -307 313 49 -183 92 -213 246 -128
3315 -128 -24 -83 127 -114 0 -109 -303 40 -69 189 -45 -147 11 265 -24 138 -1 445 -80 -150 -110
3336 -110 -17 314 -27 -400 -212 46 -172 122 -331 58 17 -242 40 143 -57 23 -16 -179 172 8 33 68
3358 68 -102 46 95 50 247 -125 88 -65 -184 123 -36 -148 2 12 -7 100 -144 360 -23 -321 30 3
3380 3 21 247 -461 115 19 -33 0 -173 52 175 26 144 -28 243 237 -9 -109 201 51 -13 389 -176 51
3403 51 13 -191 52 -66 -71 35 -107 -7 -98 116 110 -9 -229 41 -207 -51 43 -299 -28 60 49 194 176 50
3427 50 57 -22 -37 -124 216 235 -107 -70 172 -188 -123 12 -268 234 -155 143 80 -251 -83 -54 -119 233 -97 -113
3451 -113 50 -213 212 317 -61 60 178 21 -153 132 229 -121 174 28 -9 62 277 -281 -196 -75 -61 -106
$$ packed form
3293A50j67K3q4j17K53k43J6M49j01j40Jl12K52K0l07O20k64k32K75l05M59l74
3315a28J04n9K10k41J14j09j94L43j09K58k34j02J58K54k89J62j39M46n25p0M0
3336a10R3L31l41l73J88K58k18K94m53L89m1k59K82J03k00Q0l9j63L51j64K5L5
3358F8j70J48M9m5J97l72K13j53j19L07j59j12J50J0j9J07k44N04l83k98L51k7
3380CJ8K26p08N76r6n2L3j73K25J23j49J18j72K71ok46j00L10j50o4M02n65K27
3403E1l8k04K43j18nJ06j42J00r1K14oj19k20K70k48J56R4l42K71Q8j1J45j8j26
3427E0Pp9j5q7L40J9l42L7K42l60O5J35k80N02l89K98o3l31J68K9o5L52l30j6
3451a13J63k63M25J05l78J21J18j57j74K85R7l50K95j46l7P1K15n58Q5J21J4m5
$$ plain form
3473 -106 -110 -133 154 -11 -15 -32 -102 -101 68 149 198 185 173 101 -182 277 116 191 259 40 -42 102 -45 186 -87 -105
3499 -105 253 75 -208 117 173 -51 26 -232 -215 -406 -350 228 -98 -268 245 -331 263 88 3 -119 -115 -30 305
3522 305 -91 130 296 -256 -142 -52 84 -79 -61 -63 -68 -133 2 308 -129 68 -80 -125 135 -35 -57 174 -81
3545 -81 224 109 -92 216 153 81 76 -111 281 407 -51 -125 33 -116 49 -485 88 -78 -57 158 -129 -123 195
3568 195 -75 -62 -103 -200 243 -52 -108 74 -101 -7 -5 2 105 -39 12 28 -102 -199 250 -166 -18 173 -381 -75
3592 -75 112 -272 -214 -16 113 -250 -66 -74 -77 -5 -161 -177 236 -1 -247 4 40 -83 174 0 -34 53 -83 3
3616 3 -88 138 284 142 100 399 40 -67 136 -4 202 -131 -6 -166 -219 96 -347 -64 -85 82 -212 362
3638 362 167 125 328 -19 94 -48 63 -40 33 -67 143 135 91 -84 -152 301 -150 -144 52 -337 88 -3 -95
$$ packed form
3473a06mk3K87j65mj7p0JJ69Q1M9j3j2p2k83M59j61P5O8k19q2J44j47K31k73j8
3499a05L58j78k83L25N6k24P7k58J7j91N6N78l26j70N13n76N94j75q5j22MQ5L35
3522C05l96K21J66n52J14R0J36j63J8kno5J35L06m37J97j48m5K60j70k2K31k55
3545h1L05j15k01L08o3p2nj87L92J26m58p4J58j49J65n34N73j66K1K15k87OL18
3568A95k70J3m1r7M43k95n6J82j75R4KPJ03j44N1J6j30r7M49m16J48J91n54L06
3592g5J87l84N8J98J29l63J84qlP2j56j6M13k37k46K51L6j23K57j74l4Q7j36Q6
3616Cr1K26J46j42m2K99l59j07K03j40K06l33J25j60n3L15m43K83k1J67k94N74
3638C62j95m2K03l47J13j42J11j03P3j00K10qm4j75o8M53m51OJ96l89M25r1r2
$$ plain form
3661 -95 158 34 -215 2 -14 0 73 -350 168 199 -50 120 -62 -120 -195 -82 94 16 10 -20 15 3 -6 -111 -117 -52
3687 -52 -191 -53 -187 -233 -46 -18 141 314 -300 -26 -479 -164 60 16 106 128 -41 84 -90 -227 3 112
3709 112 93 142 44 42 40 15 -11 -165 18 -11 -172 -150 -43 -62 47 15 -49 102 -232 -164 151 -267 352 -218 -156
3734 -156 67 198 -94 -31 68 206 -15 -127 211 4 -337 -54 -112 16 -66 -285 72 7 -300 -120 -146 -14
3756 -14 -41 -1 138 -79 -119 -314 -65 134 -192 19 -218 92 -100 211 -136 39 124 -382 -62 4 17 77 153
3779 153 164 79 -137 -118 -12 -310 160 -153 -34 -120 -256 -139 183 -162 -250 304 -29 -41 -333 20 108 -59
3801 -59 152 106 -80 10 -156 147 88 -9 86 125 -78 120 194 -186 280 -144 -61 105 -35 208 -205 -250 138
3824 138 -152 22 -73 -74 24 -77 -96 38 -14 32 -124 -167 2 181 -105 29 -69 -267 -132 -392 -145 42 -245
$$ packed form
3661i5K53j24k49K17j6J4P3m23N18L1k49J70j82n8p5J13J76p8ol0L5j2rj05oO5
3687e2j39J38j34m6J87K8J59J73o14K74m53L15K24m4R0K2j69J25j74j37K30J09
3709A12j9M9r8kkk5k6j54J83k9j61K2J07j9J09l2o4J51l34O8L15m18O19n70O2
3734a56K23J31k92O3R9J38k21j12L38k07l41K83n8J28q2k19L57o5l07J80k6J32
3756a4k7M0J39k17m0j95K49J99l26K11k37L10j92L11l47J75Q5n06L20O6J3O0P6
3779A53J1q5k16J9J06k98M70l13J19q6j36J17L22l45q8N54l33j2k92L53Q8j67
3801e9K11m6j86R0j66L03n9r7R5L9k03J98P4l80M66m24Q3J66j40K43m13m5L88
3824A38k90J74r5jR8j01j9J34n2M6j56m3J69J79k86J34r8j98J35k60K47J87k87
$$ plain form
3847 -245 51 -377 -70 -22 -178 -7 -56 -39 63 91 -168 -116 154 -34 58 167 180 -197 -275 -49 181 176 -146
3870 -146 -39 -113 126 -69 247 88 207 170 -175 -134 4 -229 -67 -220 -87 96 -128 149 196 -156 198
3891 198 -89 219 89 64 250 69 73 -40 138 -135 2 -48 -166 218 -196 -134 -14 73 104 -132 -164 17 152
3914 152 73 -8 -174 -118 295 -16 -4 -38 -129 112 -153 292 15 -123 191 -172 -92 53 -31 247 -61 -133 72
3937 72 251 82 -46 -318 -100 73 -90 -162 -10 -42 237 1 91 13 -86 44 -48 33 76 -29 -292 37 46 -33
3961 -33 74 -182 86 104 -76 231 -101 36 -42 -26 -61 -33 -447 195 -3 -146 221 -45 46 114 -48 -18 45
3984 45 58 -57 44 -98 57 -132 243 77 39 109 -154 -87 19 -166 146 -50 44 253 55 179 147 50 66
4007 66 -9 131 59 -170 -158 63 160 -13 53 -40 145 -14 -47 165 -310 235 32 123 243 23 1 14 -50 -169
$$ packed form
3847b45K96m28L07M8j56J71m9J7J02K8k59N2K70j88R2J09J3l77p8K26K30nl22
3870a46J07p4K39j95L16j59J19l7l45M1J38k33J62j53J33J83k24K77M7l52L54
3891A98k87L08j30k5J86j81Mj13J78k73J37n0j18L84m14O2J20Q7L1k36l2J81J35
3914A52p9q1j66N6M13l11J2l4r1K41k65M45k77j38L14l63Q0J45q4K78l08p2K05
3937G2J79j69j28k72K18J73j63p2J52l2K79k36R0p8r9J30r2Q1M3j05k63L29Rp9
3961c3J07k56K68J8j80L07l32J37p8J6l5K8m14O42j98j43L67k66R1O8j62L0O3
3984D5J3j15J01j42J55j89L75j66l8P0k63O7J06j85L12j96R4K09j98J24l2r7J6
4007F6p5J40p2k29J2K21R7j73O6r3J85j59l3K12m75N45k03R1J20k20k2J3o4j19
$$ plain form
4031 -169 134 -172 -120 -18 -2 -34 -228 -119 95 -54 200 52 -32 454 -39 94 -37 -197 27 146 342
4052 342 39 -142 313 131 -317 -206 93 130 169 124 -61 -61 -45 -53 98 -30 207 186 -214 167 -424 -97 61
4075 61 1 154 165 -137 -139 78 -6 150 -251 -15 3 -192 311 1 17 -187 -87 -45 -44 28 42 45 -180 -90 -118 24
4101 24 260 -170 225 184 95 190 -42 36 -201 -52 57 -270 58 -154 -134 252 176 17 -6 91 120 67 -305 -31
4125 -31 57 -86 -177 -14 98 147 -48 -92 -18 -229 -50 24 -21 -47 -40 -47 216 119 -82 51 -27 164 117 -53 225
4150 225 -85 -212 79 -115 -40 -53 -247 39 -78 -8 -42 94 -103 57 -99 121 -40 -65 71 -88 113 -107
4172 -107 -120 -7 -202 117 160 72 -22 180 49 -162 -1 -60 -44 31 -90 -74 433 -65 -183 116 28 -3 -166
4195 -166 113 170 31 -5 55 58 280 -29 4 -111 207 147 94 -220 176 115 89 -167 5 76 138 94 180 -50 223
$$ packed form
4031a69L03l06N2J02J6l2j94J09K14j49K54j48q4M86m93J33j31j60K24J19J96
4052C42l03j81M55j82m48J11K99L7L9m5j85%J6qJ51j28K37k1m00L81n91L27J58
4075F1o0J53J1l02kK17q4J56m01K36J8j95N03l10J6k04J00M2JP2J4Lk25R0k8J42
4101B4K36m30L95m1q9R5k32P8k37J49J09l27L28k12K0L86p6j59k3R7K9n3l72K74
4125c1Q8j43r1J63J12M9j95m4P4k11J79P4m5k6PpK63r7k01J33p8J91m7j70K78
4150B25l10j27K91j94P5j3j94K86j17P0l4J36j97J60j56K20j61k5J36j59K01k20
4172a07j3J13j95L19M3q8r4K02j31k11J61n9J6P5j21J6N07m98j18K99q8l1j63
4195a66K79N7j39l6O0LK22l09L3j15L18o0n3l14L96o1k6k56J72P1O2m4Q6k30K73
$$ plain form
4220 223 148 -302 26 -223 13 -112 -345 90 -229 -39 252 -211 63 60 -52 -189 6 -170 15 -65 118
4241 118 -188 -72 112 -77 114 -19 11 -64 -104 -277 -102 -156 -165 -127 -139 -240 78 -116 101 86 -249 -3 209
4264 209 0 21 -236 -177 -214 -141 2 -43 91 -132 -109 199 -26 -252 17 -134 -88 -142 -129 28 30 -52 -178 201
4288 201 -154 -4 -330 -53 250 135 -202 -23 -248 64 79 -60 179 49 5 318 -261 -10 -31 -106 10
4309 10 -83 60 -46 -2 -386 -83 -111 26 101 242 13 29 20 -60 -54 -73 -83 183 258 -57 -33 134 -58 142 14
4334 14 -76 -172 -82 103 238 93 58 38 -56 2 54 -182 69 144 52 -120 -277 -3 139 28 232 -45 -45 -42 -86
4359 -86 -143 -105 128 279 -85 -204 43 -21 -186 93 -132 302 -94 -77 38 -101 229 -19 -30 26 -170 -272
4381 -272 115 47 -186 254 -190 -140 -24 -173 -72 45 19 80 108 74 47 -52 98 113 198 184 -50 120 74 114
$$ packed form
4220B23p5m50L28k49K36j25k33M35l19J90K91m63K74lj12j37J95j76J85q0J83
4241A18l06J16J84j89J91j33L0p5m0j73J75n4rL8j2j01L18j94K17j5l35K46K12
4264B09k09K1k57N9l7P3J43m5J34k23K3L08k25k26K69j51M6n4J3J57Kq2j26L79
4288B01l55J50l26K77L03j15l37J79k25L12J5j39K39j30m4L13n79K51k1p5J16
4309A0r3J43j06M4l84L03k8J37P5J41k29J6rq0Oj9j0K66P5l15K4J67j92K00j28
4334A4r0r6R0J85J35j45l5k0r4N8N2k36K51P5r2j72j57K74J42j11K04k77%Lm4
4359h6n7L8K33J51l64j19K47o4j65K79k25M34l96J7J15j39L30k48j1N6j96j02
4381b72L87o8k33M40m44N0J16j49J01J17k6O1K8l4k7r9J50J5Q5j4k34J70m6M0
$$ plain form
4405 114 235 -65 19 7 -167 -251 74 11 180 2 -131 -87 -360 -127 15 -124 -117 -78 -72 123 -10 21 -127 -209
4429 -209 71 -88 -17 -148 -353 -23 135 279 10 -5 -31 75 103 -213 79 -122 109 307 -82 -56 342 -23
4451 -23 135 6 -155 23 -21 199 113 67 248 -18 -153 -55 177 10 270 -150 -101 138 50 11 60 4 -11 224
4475 224 1 -222 -153 23 93 77 -2 16 269 -153 57 -106 -47 21 56 -35 -55 -173 232 223 -156 -12 259 69
4499 69 -136 -116 -139 -93 62 -56 -35 -197 -35 80 -123 147 -286 4 -108 -172 -114 -133 85 112 -211 -185 126
4522 126 105 289 -118 -126 12 233 -11 3 164 120 -320 186 60 -8 18 372 53 -117 20 -127 -107 -68 -132
4545 -132 97 0 5 293 -72 27 151 -76 -170 30 -310 187 -170 -37 -155 -35 99 75 -77 -58 -240 -281 -1
4568 -1 118 -229 -95 153 107 126 58 95 -60 109 -115 -98 125 199 42 111 79 202 286 -339 -214 -98 57 54
$$ packed form
4405A14J21l00Q4j2j74q4L25o3J69j78j33M4k73K33J42j39PL9OJ95j33L1j48q2
4429b09K80j59P1j31k05L30J58J44k69j5k6J06K8l16K92k01K31J98l89K6L98l65
4451b3J58j29j61J78m4K20q6m6J81k66j35R8K32j67K60m20M9K39q8l9M9n6j5K35
4475B24k23k23O9J76P0j6p9J8K53m22K10j63N9O8L5r1k0j18M05rl79J44K71j90
4499F9k05K0k3M6J55j18K1j62J62J15k03K70m33K90j12o4N8j9K18K7l23K6L11
4522A26k1J84m07qJ38K21k44J4J61m4m40N06j26o8K6L54l19j70J37j47K0L9o4
4545a32K29r7NK88l65R9J24k27r4K00l40M97l57J33j18J20J34k4j52J9j82m1K80
4568aJ19l47J34K48m6J9o8L7j55J69k24J7K23P4j57O9l2J23Q4o25J25J16J55l
$$ plain form
4592 54 -303 -122 -193 -85 -13 -60 -162 -69 53 26 -43 -291 70 -128 -42 228 22 -27 87 -36 -337 22 -57
4615 -57 -99 -117 115 223 308 51 -8 -33 -223 -60 26 71 -278 25 117 36 -5 -244 -180 -63 -23 -123 -174 95 -244
4640 -244 46 -137 -92 -5 -192 348 40 -19 359 -155 220 109 -65 83 27 16 -212 -309 21 197 -165 112
4662 112 -167 -422 -189 53 73 -284 82 3 8 -175 -119 -66 242 76 1 -2 47 29 114 -198 7 189 -189 5
4686 5 47 -307 177 174 -224 21 -63 -117 -218 -94 99 -74 -60 85 -78 -99 -155 -78 161 -6 107 108 64 -243 -186
4711 -186 -85 320 -109 12 256 -96 67 90 -105 -50 -111 -323 69 113 -119 16 17 37 54 36 -141 91 -253
4734 -253 -2 -79 54 181 -39 113 -76 169 -151 -216 171 65 -75 7 56 278 -44 -291 38 -29 155 -174
4756 -174 218 -79 -105 149 208 172 -102 49 -26 2 59 -38 14 247 39 -71 245 -36 114 -102 -120 6 97
$$ packed form
4592E4l57J81p1J08P2m7j02R3J22k7o9k48L61j98Q6K70k06m9J14j23l01L59p9
4615e7m2j8K32J08Q5k57n9k5j90J63Q6M5l49L03R2q1m1k39O4J17M0j00n1K69l39
4640b44K90j83M5Q7j87N40l08n9L78n14L75j11j74J48n6j1k28r7L30J76l62K77
4662A12k79k55K33K42K0l57L66p9Nj83N6N3L08j66p5lM9j8Q5l12K05J82l78J94
4686EM2l54M84ll98K45q4n4j01J24J93j73J4J45j63k1n6P7K39j67J13Jm4l07N7
4711a86J01M05m29J21K44l52J63K3j95N5o1k12L92M4k32J35JK0J7j8j77K32l44
4734b53K51p7J33J27k20J52j89K45l20o5L87j06j40Q2M9K22l22k47L29o7J84l29
4756a74L92k97k6K54N9l6k74J51p5K8N7r7N2K33k08j10L16k81J50k16j8J26R1
$$ plain form
4779 97 99 54 -23 95 -101 145 129 68 -156 -55 -236 84 -191 7 230 356 -90 -243 118 -80 84 47 76
4802 76 -25 -20 80 21 169 -116 63 104 -101 92 101 96 85 -135 75 -36 -58 -214 168 -77 -248 -320 1 -137
4826 -137 -86 -17 -213 -103 334 -33 -55 -122 -27 39 103 -142 51 -43 -176 -46 294 -308 -252 56 63 -22 -109 184
4850 184 43 -124 -18 -52 -157 75 42 -62 -399 -237 30 -4 41 -81 56 -136 94 99 -298 174 54 221
4872 221 -92 75 -72 1 -222 85 -150 -101 -238 -230 -43 -44 -137 -62 118 -198 120 -294 -21 -178 -35 282 199
4895 199 146 53 30 -69 -143 102 43 33 57 -37 132 250 -7 116 -68 -89 36 197 70 170 -108 -189 75 8
4919 8 141 -159 -252 73 -136 23 -35 -17 19 86 -2 -21 36 32 60 129 -48 354 -126 -94 161 20 91 -177 -254 152
4945 152 72 68 94 112 105 172 14 12 146 -140 186 68 -77 102 245 -46 45 177 47 -232 -153 132 -127 -173
$$ packed form
4779I7Km5p7J18j96K46j6o1k24J01j81L20k75J98K23J26m46j53L61j98J64l7K9
4802G6j01NJ00n9J48k85J79M1k05J93Rnj1k20K10j11k2j56L82k45j71p2L21j38
4826a37N1O9j96J10M37l67k2o7R5O6O4k45J93r4j33J30L40o02N6L08Pq5q7K93
4850A84j41j67J06l4j05K32l3j04l37J62K67l4M5j22J37j92K30Nl97M72j20J67
4872B21l13J67j47P3k23L07k35M9j37QJ87jr3P5J80l16L18m14K73j57J43L17q3
4895A99n3r3k3r9p4K45n9j0K4r4J69J18k57J23j84k1J25J61j27J00k78q1K64o7
4919HJ33l00r3L25k09J59n8J8L6O7q8j9N7mK8O9j77M02m80L2K55j41P1k68p7M06
4945A52q0mK6J8pO7j58kJ34k86L26j18j45J79J43k91R1J32j30k79P9K85k59m6
$$ plain form
4969 -173 -55 112 97 25 88 -46 -105 -37 -144 -97 23 11 -78 -213 104 -63 -148 -56 112 -58 -73 -54 -99 -199
4993 -199 78 -84 -85 154 144 65 -105 144 16 116 -139 139 -143 102 -269 10 -82 -3 -100 165 35 -42 -34
5016 -34 -94 92 -262 267 -80 -311 270 112 -289 146 -165 -12 158 175 -13 0 -8 124 149 -2 -74 -50 45
5039 45 128 -232 53 -219 -149 93 14 85 -109 -122 2 48 21 328 241 117 51 117 104 -80 52 -39 79 17 210
5064 210 -60 -98 138 99 156 -34 -106 17 -113 274 46 -156 51 53 -190 44 130 172 99 -27 125 -165 46
5087 46 -98 34 266 63 -255 32 8 73 -78 -54 2 -59 61 36 2 -113 183 -86 -110 -42 -70 -80 -9 -84 -218
5112 -218 -57 162 -91 176 109 298 -71 -7 -108 -164 263 -15 48 133 -371 -67 80 -59 23 80 -145 -148 -359
5135 -359 117 -54 146 192 -143 -165 -46 75 9 224 -110 -2 116 203 -56 203 72 237 71 24 -17 31
$$ packed form
4969a73J18J67j5p2O3j34n9O8j07M7J20j2q9j35L17j67q5R2J68j70j5J9m5j00
4993a99K77j62jK39j0p9j70K49j28J00k55K78k82K45l71K79r2P9r7K65j30p7Q
5016c4o0J86l54N29l47k31N81j58m01M35l11J53J70J7j88J3qJ32K5j51p2K4R5
5039D5Q3l60K85k72P0K42p9P1j94j3J24M6k7L07q7j24o6O6j3j84J32r1J18o2J93
5064B10k70l8K36l9N7j90p2J23j30L87k28k02K07Kk43K34Q6M2p3j26J52k90K11
5087D6j44J32K32k03l18K87k4O5j51K4N6o1J20k5l4j15K96k69k4O8k8j0P1p5j34
5112b18J61K19k53K67o7J89l69O4j01n6M27k78O3Q5n04L04J47j39Q2N7k25lk11
5135c59M76j71K00M6l35k2J19J21o6K15l34J08J18Q7k59K59j31J65j66m7m1M8
$$ plain form
5157 31 -33 -104 150 23 56 99 8 -83 -14 -64 -16 18 -204 180 221 161 -224 17 172 272 85 -49 -7 104 118
5182 118 -6 2 -83 93 87 -89 -54 -12 -23 -41 91 105 71 -125 101 32 -128 259 -148 45 -155 -75 123 -67
5206 -67 118 -158 27 26 -235 101 77 -94 -115 -26 -195 99 -39 -181 111 14 53 -115 -184 -85 126 -188 -124 -102
5230 -102 59 -155 393 148 -135 -170 -16 -320 -146 107 106 -28 -4 184 213 -114 39 40 70 16 -103 54 -12
5253 -12 157 81 -74 155 103 109 -88 56 38 193 123 -13 167 -295 -62 -447 -105 -53 -138 -94 16 -118 154
5276 154 179 129 -46 -38 0 131 -195 32 28 -190 115 25 106 9 -77 209 -53 -316 -175 127 -148 218 -7 -93
5300 -93 -105 -89 39 -253 -176 -2 -27 -36 179 30 -86 2 -80 235 -6 18 6 75 84 -121 -131 -87 52 -212 50
5325 50 37 -21 120 -56 6 56 -84 -30 -178 2 118 122 139 36 -44 334 85 146 -81 -119 -181 -206 18 298 143
$$ packed form
5157C1o4p1K54j27L3M3r1r1O9n0M8L4k22L84M1o0l85K41J55J00j87j34M2J11J4
5182A18j24Qq5J76oj76L5M2j1j8J32J4l4j96K26o9j60L87m07J93k00Q0J98j90
5206f7J85k76J85jk61L36k4j71k1Q9j69K94j38j42K92r7L9j68o9R9K11l14O4K2
5230a02J61k14N48k45k83l5J54l04J74K53jj34K4J88K9l27J53JL0n4j19J57o6
5253a2J69p6j55K29n2Oj97J44j8J55p0j36J80m62K33l85L42N2q5M4J10j34K72
5276A54K5n0j75QL8J31l26K27mk18L05r0Q1r7q6K86k62k63J41L02k75L66k25q6
5300i3j2J6J28k92P7J74k5rK15j49j16Q8q2L15k41K4j2O9Rk05j0M4J39k64K62
5325E0j3n8J41j76O2N0j40N4j48J80J16MJ7j03q0L78k49O1k27l8o2k5K24K80j55
$$ plain form
5350 143 -115 79 -36 13 -104 108 68 -213 -182 235 -255 90 -38 -67 -1 316 -102 182 -140 -80 197 -221
5372 -221 -89 -10 -111 58 126 -114 267 -64 -80 -58 -20 -148 156 -125 107 -77 61 -224 134 12 4 -131
5394 -131 -28 109 -62 -11 -23 -130 261 118 161 -31 18 -192 114 211 -9 9 45 -37 -250 -68 -76 48 140 -62
5418 -62 -196 97 38 200 26 65 83 166 74 85 -118 105 119 34 -174 -61 -40 -58 -203 -86 169 52 276 -122
5442 -122 -201 -103 -109 -90 143 -135 11 -211 89 71 108 28 -273 -205 18 178 -8 181 58 -83 232 52 -42
5465 -42 -32 -111 -96 -110 -9 -142 -35 -257 -11 63 32 16 -183 4 91 -134 -4 -30 70 49 -86 50 -89 -64
5489 -64 -59 61 277 105 54 1 -10 3 -24 335 -10 -143 -69 94 66 88 -146 163 -41 -171 -158 206 178 -245
5513 -245 237 -218 107 -33 -222 159 38 -117 145 -78 120 71 -270 328 -122 -93 -153 -77 171 88 329 -77
$$ packed form
5350A43k58J94j15M9j17K12m0k81L1M17m90L45j28k9O6L17m18K84l22O0K77m18
5372b21J32P9j01J69O8k40L81l31j6K2L8j28L04k81K32j84J38k85L58j22qj35
5394a31J03J37j71N1j2j07L91j43M3j92M9k10L06R7k20J8L6q2k13J82qJ24R2k02
5418f2j34K93n9J62j74L9J8Q3r2J1k03K23J4q5k08J13K1j8j45J17K55j17K24l98
5442a22p9R8oJ9K33k78J46k22L00j8L7q0l01O8K23J60j86J89j23j41L15j80r4
5465d2J0p9J5j4J01j33J07k22K46P4l1j6j99J87Q7k25J30k6J00k1j35J36j39K5
5489f4NJ20K16j72n1n3j1J3k7L59l45j33P4J63k8K2k34L09k04j30J3L64k8m23
5513b45M82m55L25j40j89L81j21j55K62k23J98m9l41N98m50K9o0P6K48q3K41m06
$$ plain form
5535 -77 165 176 -30 26 -205 25 -174 288 190 225 73 -217 -206 -20 -126 -244 -68 25 40 52 39 -170 17
5558 17 -32 -24 32 -89 112 -149 97 -124 14 184 -178 -64 -97 -132 -185 -180 -157 -9 -103 -106 -14 6 209 55 134 -97
5584 -97 -54 -229 293 21 143 114 -188 164 -77 -256 -110 269 108 -225 49 97 -141 -90 189 -263 76 63
5606 63 -120 50 -129 109 253 -17 -279 -102 123 -80 -46 194 168 -83 -57 21 -107 73 -36 1 -173 -220
5628 -220 -126 123 -293 -41 -42 116 128 -176 -49 57 -66 75 207 -188 147 -32 -51 -39 -61 -172 -38 45 -164
5651 -164 63 191 -28 39 86 -96 -26 116 -18 77 -15 -277 -109 183 -9 -192 65 -170 -45 -90 -83 -214 9
5674 9 198 59 -68 -57 183 -145 128 -198 3 -234 -41 96 -34 -40 -95 -89 29 131 -243 64 116 -82 -54
5697 -54 -86 96 165 84 130 -331 6 -115 3 27 -81 181 291 -149 181 88 -38 -237 -78 -44 289 -3 -73
$$ packed form
5535g7K42J1k06N6k31K30j99M62r8L5j52k90J1J86j06j18J76R3J5J2j3k09J87
5558A7m9QN6j21K01k61K46k21J38J70l62J14l3l5n3NK3J48r4lR2K0K03j54P9k31
5584i7M3j75N22k72J22k9l02L52k41j79J46L79j61l33K74M8k38N1K79m52L39j3
5606F3j83J70j79K38J44k70k62J77K25k03L4K40k6k51K6P8j28J80j09L7j74m7
5628b20R4K49m16K52jJ58J2l04J27J06j23J41J32l95L35j79j9J2k2j11J34Q3k09
5651a64K27J28k19O7M7j82P0J42j34R5r2k62J68K92j92j83K57k35J25m5Pj31K23
5674IJ89j39j27J1K40l28K73l26K01k37J93J37j30on5OJ18J02l74L07N2j98K8
5697e4l2J82O9q1M6m61L37j21J18K4j08K62J10m40L30r3j26j99J59L4L33k92p0
$$ plain form
5720 -73 -194 134 -50 139 -59 -60 -48 -330 75 14 -74 -246 -143 110 305 -48 25 -154 176 182 11 -34 -294
5743 -294 24 -38 -160 -87 106 305 -12 178 119 48 -110 38 -139 58 -73 -164 170 16 272 13 92 50
5765 50 80 -159 -347 -36 -185 23 89 -65 -53 154 47 -19 127 -61 97 -48 132 87 -198 -223 285 -163
5787 -163 104 -17 57 187 -72 -41 -277 16 -212 -7 -3 21 40 180 -70 139 39 109 -98 -147 145 29 204
5810 204 -167 -157 13 242 -190 -58 -96 21 -43 -200 123 79 52 27 -153 167 31 -107 97 -137 -24 -14
5832 -14 -77 123 102 -91 234 379 -59 28 165 133 -119 12 139 -120 -307 -88 -58 26 -9 242 172 90 -139
5855 -139 -176 -4 -144 123 184 78 78 109 -65 88 -114 338 222 84 -167 80 44 -93 21 215 -82 -97
5877 -97 188 -45 115 14 -246 79 15 -320 -107 125 -124 28 36 39 58 -67 51 -29 -56 -277 44 -58 132
$$ packed form
5720g3j21L28j84J89j98jJ2k82M05o1q8j72J03K53J95l53P3j79L30Oj71m5k60
5743b94L18o2j22P3J93J99l17J90n9p1j58J48j77J97j31r1L34j54K56k59P9m2
5765E0L0k39j88L11j49K08O6j54J2K07j07o6J46j88J58j45J80m5k85k5N08m48
5787a63K67j21P4J30k59L1k36K93k28K05MK4J9J40k50K09j00P0k07m9K92j16J75
5810B04l71J0J70K29m32J32l8J17o4j57L23m4k7k5j80L20j36j38K04k34J13J0
5832a4o3K00k1j93L25J45m38Q7J37l2k52J31J27k59j87K19L0Q4l5K51p0q2k29
5855a39l7J72j40K67O1j06%L1j74J53k02M52j16j38k51K47l6j37J14J94k97j5
5877i7K85k33J60j01k60L25o4l35K13K32k49J52QLJ9j25J18q0k7k21L21j02J90
$$ plain form
5900 132 -91 137 107 -27 81 -38 -34 82 -42 94 194 -36 -60 3 -80 179 -32 205 -170 -87 237 -110
$$ packed form
5900A32k23K28l0j34J08j19MJ16j24J36J00k30k4O3q3K59k11K37l75Q3L24l47
$$ [...]
8191b3
##END NTUPLES=NMR FID
##END=
