##TITLE=1H_Pr C8-6
 CDCl3
 8 sc, 
 10.11.2021
##JCAMPDX= 6.0         $$ Bruker NMR JCAMP-DX V2.0
##DATA TYPE= NMR FID
##DATA CLASS= NTUPLES
##ORIGIN= UXNMR, Bruker Analytische Messtechnik GmbH
##OWNER= root
$$ XWIN-NMR		Version 3.5
$$ Wed Nov 10 10:19:47 2021 Russian Standard Time (UT+4h)  she@DPX200
##.OBSERVE FREQUENCY= 200.1313468511
##.OBSERVE NUCLEUS= ^1H
##.DELAY= (6, 6)
##.ACQUISITION MODE= SIMULTANEOUS
##.ACQUISITION SCHEME= undefined
##.AVERAGES= 8
##.DIGITISER RES= 18
##SPECTROMETER/DATA SYSTEM= spect
##.PULSE SEQUENCE= zg30
##.SOLVENT NAME= CDCl3
##.SHIFT REFERENCE= (INTERNAL, CDCl3, 0, 15.7039)
##AUDIT TRAIL= $$ (NUMBER, WHEN, WHO, WHERE, WHAT)
$$ ##TITLE= Audit trail, XWIN-NMR		Version 3.5
$$ ##JCAMPDX= 5.01
$$ ##ORIGIN= Bruker BioSpin GmbH
$$ ##OWNER= she
$$ F:/spectra/data/she/nmr/H-F/1/audita.txt
$$ ##AUDIT TRAIL=  $$ (NUMBER, WHEN, WHO, WHERE, WHAT)
(   1,<2021-11-10 10:18:29.23 +0400>,<she>,<DPX200>,
      <created by zg, POWCHK disabled, PULCHK disabled
       configuration hash MD5:
       00 E9 B6 7A A2 85 ED C7 34 08 36 98 17 FE 4E 26
       data hash MD5: 16K
       34 3D 49 44 AE AD FC 5E E0 91 8E 09 48 DB 25 A0>)
$$ ##END=
$$ 
$$ hash MD5
$$ 1D 6C 73 21 92 01 06 62 67 1B 39 30 2D 06 32 0C
##$RELAX= 
##$RELAX= 
##$RELAX= 
##$RELAX= 
##$RELAX= 
##$RELAX= 
$$ Bruker specific parameters
$$ --------------------------
##$DU= <F:/spectra>
##$EXPNO= 1
##$NAME= <H-F>
##$PROCNO= 1
##$TYPE= <nmr>
##$USER= <she>
##$AMP= (0..31)
100 100 100 100 100 100 100 100 100 100 100 100 100 100 100 100 100 100 
100 100 100 100 100 100 100 100 100 100 100 100 100 100 
##$AQSEQ= 0
##$AQ_mod= 1
##$AUNM= <au_zg>
##$AUTOPOS= <>
##$BF1= 200.13
##$BF2= 200.13
##$BF3= 200.13
##$BF4= 200.13
##$BF5= 200.13
##$BF6= 200.13
##$BF7= 200.13
##$BF8= 200.13
##$BYTORDA= 1
##$CFDGTYP= 0
##$CFRGTYP= 5
##$CHEMSTR= <none>
##$CNST= (0..31)
1 1 145 1 1 1 1 1 1 1 1 1 1 1 1 1 1 1 1 1 1 1 1 1 1 1 1 1 1 1 1 1 
##$CPDPRG= <>
##$CPDPRG1= <>
##$CPDPRG2= <>
##$CPDPRG3= <>
##$CPDPRG4= <mlev>
##$CPDPRG5= <mlev>
##$CPDPRG6= <mlev>
##$CPDPRG7= <mlev>
##$CPDPRG8= <mlev>
##$CPDPRGB= <>
##$CPDPRGT= <>
##$D= (0..31)
0 1.2 0 0 0 0 0 0 0 0.06 0 0.03 0 0 0 0 0.0002 0 0 0 0 0 0 0 0 0 0 0 0 
0 0 0 
##$DATE= 1636525108
##$DBL= (0..7)
120 120 120 120 120 120 120 120 
##$DBP= (0..7)
150 150 150 150 150 150 150 150 
##$DBP07= 0
##$DBPNAM0= <>
##$DBPNAM1= <>
##$DBPNAM2= <>
##$DBPNAM3= <>
##$DBPNAM4= <>
##$DBPNAM5= <>
##$DBPNAM6= <>
##$DBPNAM7= <>
##$DBPOAL= (0..7)
0.5 0.5 0.5 0.5 0.5 0.5 0.5 0.5 
##$DBPOFFS= (0..7)
0 0 0 0 0 0 0 0 
##$DE= 6
##$DECBNUC= <off>
##$DECIM= 32
##$DECNUC= <off>
##$DECSTAT= 4
##$DIGMOD= 1
##$DIGTYP= 9
##$DL= (0..7)
0 120 120 120 120 120 120 120 
##$DP= (0..7)
150 150 150 150 150 150 150 150 
##$DP07= 0
##$DPNAME0= <>
##$DPNAME1= <>
##$DPNAME2= <>
##$DPNAME3= <>
##$DPNAME4= <>
##$DPNAME5= <>
##$DPNAME6= <>
##$DPNAME7= <>
##$DPOAL= (0..7)
0.5 0.5 0.5 0.5 0.5 0.5 0.5 0.5 
##$DPOFFS= (0..7)
0 0 0 0 0 0 0 0 
##$DQDMODE= 0
##$DR= 18
##$DS= 0
##$DSLIST= <SSSSSSSSSSSSSSS>
$$ [...]
##$SUBNAM2= <"">
##$SUBNAM3= <"">
##$SUBNAM4= <"">
##$SUBNAM5= <"">
##$SUBNAM6= <"">
##$SUBNAM7= <"">
##$SUBNAM8= <"">
##$SUBNAM9= <"">
##$SW= 18.0517286264689
##$SWIBOX= (0..15)
0 0 2 0 0 0 0 0 0 0 0 0 0 0 0 0 
##$SW_h= 3612.71676300578
##$TD= 16384
##$TD0= 1
##$TE= 0
##$TE2= 300
##$TE3= 300
##$TEG= 300
##$TL= (0..7)
0 120 120 120 120 120 120 120 
##$TP= (0..7)
150 150 150 150 150 150 150 150 
##$TP07= 0
##$TPNAME0= <>
##$TPNAME1= <>
##$TPNAME2= <>
##$TPNAME3= <>
##$TPNAME4= <>
##$TPNAME5= <>
##$TPNAME6= <>
##$TPNAME7= <>
##$TPOAL= (0..7)
0.5 0.5 0.5 0.5 0.5 0.5 0.5 0.5 
##$TPOFFS= (0..7)
0 0 0 0 0 0 0 0 
##$TUNHIN= 0
##$TUNHOUT= 0
##$TUNXOUT= 0
##$USERA1= <user>
##$USERA2= <user>
##$USERA3= <user>
##$USERA4= <user>
##$USERA5= <user>
##$V9= 5
##$VALIST= <valist>
##$VCLIST= <CCCCCCCCCCCCCCC>
##$VD= 0
##$VDLIST= <DDDDDDDDDDDDDDD>
##$VPLIST= <PPPPPPPPPPPPPPP>
##$VTLIST= <TTTTTTTTTTTTTTT>
##$WBST= 1024
##$WBSW= 4
##$XGAIN= (0..3)
0 0 0 0 
##$XL= 0
##$YL= 0
##$YMAX_a= 167924
##$YMIN_a= -255609
##$ZGOPTNS= <>
##$ZL1= 120
##$ZL2= 120
##$ZL3= 120
##$ZL4= 120
##$ABSF1= 10
##$ABSF2= 0
##$ABSG= 5
##$ABSL= 3
##$ALPHA= 0
##$AQORDER= 0
##$ASSFAC= 0
##$ASSFACI= 0
##$ASSFACX= 0
##$ASSWID= 0
##$AUNMP= <proc_1d>
##$AZFE= 0.1
##$AZFW= 0.1
##$BCFW= 1
##$BC_mod= 2
##$BYTORDP= 1
##$COROFFS= 0
##$CY= 11.3945322036743
##$DATMOD= 1
##$DC= 2
##$DFILT= <>
##$DTYPP= 0
##$F1P= 2.36226072786647
##$F2P= -0.459571619588291
##$FCOR= 0.5
##$FTSIZE= 0
##$FT_mod= 4
##$GAMMA= 1
##$GB= 0.15
##$INTBC= 1
##$INTSCL= 1
##$ISEN= 128
##$LB= 0.24
##$LEV0= 0
##$LPBIN= 0
##$MAXI= 10000
##$MC2= 0
##$MEAN= 0
##$ME_mod= 0
##$MI= 1.114404
##$NCOEF= 0
##$NC_proc= 0
##$NLEV= 6
##$NOISF1= 3.799351
##$NOISF2= 2.8
##$NSP= 1
##$NTH_PI= 0
##$NZP= 0
##$OFFSET= 15.70392
##$PC= 1
##$PHC0= -15511.57
##$PHC1= 13.80082
##$PH_mod= 1
##$PKNL= yes
##$PPARMOD= 0
##$PSCAL= 0
##$PSIGN= 0
##$REVERSE= no
##$SF= 200.130013532006
##$SI= 16384
##$SIGF1= 3
##$SIGF2= 2
##$SINO= 400
##$SIOLD= 16384
##$SREGLST= <1H.CDCl3>
##$SSB= 0
##$STSI= 0
##$STSR= 0
##$SW_p= 3612.71676300578
##$SYMM= 0
##$S_DEV= 0
##$TDeff= 0
##$TDoff= 0
##$TI= <>
##$TILT= no
##$TM1= 0
##$TM2= 0
##$TOPLEV= 0
##$USERP1= <user>
##$USERP2= <user>
##$USERP3= <user>
##$USERP4= <user>
##$USERP5= <user>
##$WDW= 1
##$XDIM= 8192
##$YMAX_p= 0
##$YMIN_p= 0
$$ End of Bruker specific parameters
$$ ---------------------------------
##NTUPLES= NMR FID
##VAR_NAME=  TIME,          FID/REAL,        FID/IMAG
##SYMBOL=    X,             R,               I
##VAR_TYPE=  INDEPENDENT,   DEPENDENT,       DEPENDENT
##VAR_FORM=  AFFN,          ASDF,            ASDF
##VAR_DIM=   8192,          8192,            8192
##UNITS=     SECONDS,       ARBITRARY UNITS, ARBITRARY UNITS
##FACTOR=    0.0002768,     1,               1
##FIRST=     0,             0,               0
##LAST=      2.2672688,     0,               0
##MIN=       0,             -255609,         0
##MAX=       2.2672688,     167924,          0
$$ Real data points
##PAGE= N=1
##DATA TABLE= (X++(R..R)), XYDATA
$$ [...]
1848c10j64J88o3k70O65o22j6K61m69L03N33o34L13L26j39Q3J08M21l54M56K51
1869H67m13k43O57n15k85O33q98K55N6p55M41J82l69k51L42J55l44qK65m67M98
1890a97l6j11L18K23j32J84L48m80N28K56n50P1K71j40j31k82J15k57OM6l41K76
1912a5K4q64M89J52o59P45p1n20L29J33l4J59J13R5QL09rk62L48Q4m85P71l91
1935D49j31M08n38R7J35k10j80m43R9J44l60J49Q3m51L86M91n47M67n69l8Q09
1956B50n93M20J69j7p7K09K65J91o21L83J84m54K35m86J47J91n33j22L53m93J55
1977b44j70M7m6P6j90j8kK82L2K1M46l03J84L85m63L01K99l64N84j43m67N6L4
2000C37R8j56q4J3m09K29k59j92J16l8l97O00q5l65L21r3o5M25n2M09l47j67N94
$$ y = [-310, -474, -286, -349, -619, 46, -576, -592, -331, -800, -497, 36, -598, -285, 41, -98, -15, 93, 514, 160, 616, 867, 454, 211, 868, 353, 68, 701, -197, 58, 114, -641, -200, -18, -387, -638, -296, -141, -485, -493, -228, -695, -197, -233, -344, -26, 197, 65, 249, 597, 117, 645, 901, 351, 422, 693, 553, 422, 140, 255, -2, 4, 50, -291, -15, 9, -855, -366, -214, -873, -128, -199, -719, -390, -257, -291, -132, -19, 76, 84, 393, 384, 122, 470, 554, 69, 840, 449, 318, 726, 188, 285, 420, 210, 30, -413, -314, -170, -530, -381, -298, -749, -363, 128, -419, 48, -521, -559, 250, -343, 77, 246, 229, 152, 361, 626, 817, 196, 579, 763, 309, 544, 58, 205, 396, -137, -259, 94, -399, -244, -414, -367, -413, -337, -527, -545, -547, -265, -233, -212, 234, -69, 115, 500, 37, 338, 637, 273, 857, 714, 247, 303, 337, 435, 279, 195, 208, -201, 28, -231, -423, -307, -345, -742, -142, -227, -592, -271, -364, -429, -4, -56, 353, 6, -161, 433]
2023D33j38L13k27o8J37L43m03K2p2k98L93o09K20k88K58q7m52L9M75k35k9k06
2045d79Q9M21m09j39M21j68j48M41J31J59j59M9K58J31k87K66j45J7j84j12J51
2066C04k82j92L52m84n4J2J24p7j99o8J37K5o8J33J30oK28m3N60k33j76M98k42
2089C79J52j76J1L3m27K70K36m66k09M63k72qq1Q0j14n45K96J4k95L40k21j0M34
2112a16k51J22N00m20L73K79k54R7J74m0J06n93K98QL5M0l52k2L55l48j82J9p02
2135h74N38r7k19K55m1n1K73m88Q74q6J15J70j43M72k08k93L56j48j12J67k85
2156A75J24J63m60K1Q4j27o4J04j56k38j3J39m24J22N49l13j75M77P9k48M20n03
2178b64K33J51J59j28ML32Ok10L55j33k60J96l58R0J27m80j59l07M1M70m00j69
$$ y = [433, 295, 608, 381, 313, 450, 793, 390, 412, 340, 42, 435, -174, 46, -242, 16, -71, -523, -484, -9, -244, -273, -479, -390, 31, -378, -517, -96, -264, -412, 29, 160, 319, 160, 209, 467, 598, 311, 577, 432, 449, 265, 153, 304, 22, -170, 182, -302, -356, -344, -220, -297, -496, -564, -427, -402, -470, -337, -207, -213, 15, -28, 532, 299, 123, 621, 379, 531, 355, 366, 399, -28, 242, 478, 12, -197, 266, -6, -14, -95, -15, -129, -674, -378, -364, -659, -319, -540, -550, -116, -367, -245, 255, -165, 208, 487, 233, 330, 504, 464, 570, -23, 275, 283, 318, 358, 6, -16, 339, -9, -191, -172, -874, -336, -433, -652, -397, -438, -489, -216, -704, 170, 84, 199, 369, 226, 698, 490, 197, 553, 405, 293, 460, 175, 299, 462, 2, 23, 107, -20, -84, 20, -136, -374, -387, -248, -672, -550, -1, -314, -489, -12, 67, -181, 239, -264, -31, 120, 279, 151, 155, 487, 493, 283, 638, 505, 245, 441, 83, 173, 300, -180, -339, -646, -605, -135, -535, -704]
2200g04L47k98N80k95O2Q2J59l22P66l86K04J99j48J70Q3k3k44n0Q0J89k03j79
2222F9j94Q1k2k3J16J63l32j50M07p25N64J54j81P6l95M09j04l91K98P2J00M3
2244C5n38N79L43k21Q0j5K53m7P4l66R7k30J59j19k8j77Jl19j2k69L15L41m86
2267e50K17K27j93J78k42r7J028p97M16K81M0l94k2M13j87l09M60m9o96O47k43
2288A28r4j3j37j3R7m66L21j56L7j14j39M68r2k4J08R6j01J63R3q5L54k95L77
2311E13k21k7N47l62L9l38J41J71o07lK29m16j37M30j18q3k51j57M84q4m7j12
2333d09K19j08J96J77L10m55J94M82k70O4r8j90M33j00m48K22r5l31J43k46K21
2354h9l11J61k2m41L14J97j27j27M39k50K05j11J01L39j16j14K88J54l24p5L81
$$ y = [-704, -357, -655, -75, -370, -308, -226, -67, -389, 377, -9, 195, 394, 246, 416, 499, 476, 232, 182, 262, 451, 248, 69, -125, -44, -66, -89, 27, 190, -142, -292, 115, -610, -46, 108, -73, 3, -392, 17, -87, -478, -180, -108, -8, 35, -503, 76, 419, 198, 278, 263, 516, 469, 543, 177, 274, 44, 203, 84, 56, -121, -120, -439, -451, -720, -405, -64, -550, -333, -106, -299, -121, -363, -460, 568, -229, 187, 468, 508, 114, 92, 505, 318, 9, 469, 420, -276, 371, 128, 34, 21, -116, -129, -32, -498, -177, -333, -296, -410, -549, -81, -173, -197, -89, 7, -94, 69, 162, 77, 431, 136, 513, 292, 265, 812, 450, 489, 151, 292, 463, -144, -147, 82, -334, -471, -41, -159, -242, -493, -650, -166, -250, -297, -409, -190, -298, -102, 75, 385, -70, 124, 606, 336, 400, 302, 112, 545, 445, -3, 219, 124, -207, -64, -310, -89, -400, -239, -261, -702, -388, -191, -318, -445, -6, -256, -51, -162, -61, 278, 162, 48, 336, 490, 166, 91, 472]
2375D72R1o10M09K14o34J09J77m42K50l59k01O55l87m14M46j18J17rj45J28m6
2396b97L97J7q8K22j67l1O52l27L5J28k17r6J05j2m03l2K63L4l13J52j16k06O
2419b94Q2k52Q6j14k40N05p3o7N14k02o4J29L0L8j9M95l83M8L54o26K92K6n8P8
2443B85L0k72j5K5k94P8P8R5l00j58O05m94r6L93k07K62K3j99L43m1M5J01m9j32
2467A06J95l0K55m61K97M1k29l25M36j81J85n4n22J07J5J3k32r1J46K1K87j42
2489a63j57J2M12j10k13N23l43M13k28N0K77l4l55K08k52J29k4l6n7k21Q0L40
2511B51n17OJ31j90K20l19J15L25l12j97J92J85P8k99M51J22n2J95r5j84J88j39
2533A55P3K23r0k99L81k42J7k57j52o9k5k7J19k53J77J53l27K37R8j46K9K49j37
$$ y = [472, 563, -47, 362, 576, -58, 51, 228, -214, 36, -323, -524, 131, -256, -670, -224, -342, -225, -234, -379, -251, -297, 100, 117, 29, 251, 84, 53, 705, 378, 413, 541, 324, 228, 333, 321, -82, -114, 149, 183, -130, 22, -94, -300, -294, -212, -464, -378, -492, -732, -227, -300, -367, 147, -55, -119, 10, 40, 78, 59, 554, 171, 219, 573, -53, 239, 265, 207, 285, 315, 43, 28, 53, -241, -163, -85, 10, -290, -448, 157, -337, -433, -40, -247, 15, 38, -161, 182, 141, 186, 287, 238, 106, 301, 271, 526, 65, 362, 403, 174, -151, 285, 104, 289, 235, -287, -180, -165, -152, -384, -475, -329, -308, -21, -163, -320, -308, 104, -6, -219, 304, -39, 374, 146, 196, 473, 439, 84, 292, 40, 169, 145, 109, 52, -169, -89, 251, -266, -260, -129, -319, -99, -418, -303, 22, -290, -487, -295, -110, -32, -331, 120, 242, 190, 385, 290, 106, 294, 155, 228, 451, 361, 62, 443, 201, 218, -39, -191, -260, -285, -312, -193, -446, -269, -116, -443, -206, -108, -254, -225, 24, -113]
2556a13K27q8J88m1n0J17n7k4J67J00k01j22J9L17j92J99m26m43M58n1k93N11
2578B02m01k5k10J24J49j7K2J99j32n3j7o9N78J09l74K2N6L7l0O5J44j81o8j0
2602A20J86l74J15m09K10R9k84P9j58N5m2J91pJ41K0q1J08j9L46n28J1M74q6J24
2626B91j21K62k85Q2J15J14k79Nj72j51J43J3l40O4J9l5J22j79R7j09K11j50J15
2649a68j18L26Kk17J82K2L58M9j68K59l81k0L9k62J62L1j40L45m96J9k88J37N4
2672b73k08J07J7J19L4J9O2J12N3k5N9p7k43P68k93j16K15k04N9L9or3j9m9K98
2697C55o12K58k55j24L22k34K5R1l40K79K2r3K74k1J64k24j36M46m8k4K30k79
2719G6k5K83j05k1J16l23J25K2j36j03Q3pn5N3J74l19q4J41j31j8P1k09L86ok0
$$ y = [-113, 114, 26, 214, 173, 123, 240, 183, 159, 326, 426, 225, 103, 122, 439, 247, 446, 20, -423, 35, -16, -309, 202, -199, -224, -434, -310, -161, -178, -156, 43, -89, -142, -159, -228, 350, 459, 85, 107, 163, 200, 170, 235, 379, 198, 130, 120, 306, -68, 47, -362, -152, -53, -337, -258, -416, -361, -403, -212, -219, -78, -58, -139, -31, -50, 296, -232, -221, 253, 167, 291, 170, 432, 147, 229, 344, 458, 179, 184, 12, -139, 4, 17, -323, -259, -240, -275, -153, -332, -235, -344, -133, -283, -168, -286, 40, 42, -175, 7, 29, 387, 436, 268, 527, 146, 126, 165, -97, 65, 96, -44, 301, -195, -176, -464, -327, -273, -481, -374, -357, -238, -204, -185, -123, -11, 42, 17, 76, -1, -244, 524, 231, 115, 330, 126, 185, 224, 218, 125, 106, 57, 355, -257, 1, -254, -378, -56, -290, -265, -174, -514, -235, -213, -306, -32, -53, 111, -113, -249, 197, 149, 125, 355, 76, 51, 334, 229, 208, 324, 1, 126, 148, 12, -91, -8, -15, -70, -17, 157, -162, -246, -105, -236, -254, -183, -392, -6, -12, -32]
2744c2K13J15o00J91J03J73l31K49L91m51j06L51Ok18lj73L31k74J0M3j75Lq0
2767b64L74m00R2N9j36K53m15M51p8O0j43J13L51k20J16J32n60P15k56K78j00
2788D22l73N7J5j32J02J1n6l02r7L73l57J10k04K28m7j4O8r7M24p7j32J43J98
2811B63m25K79MKj04L28j89j3l4N13m68J39o2m26L62j58k68K73r4L1l28K03J87
2834A5j03j76Q7j29Q6J50L28j74Q4K04l35J11N0lp2Mm1K21k33K0j73L14l34R9
2858@j5k11J38k6j27L09k33J98J0k70j13L13j83K36k19O4L53o2m3J34j00KJ92
2881C47l09P1mL29n75K84l54J95k10K85n35M38j85j18K82j87rL8J51k7K30k69
2903a32L14J91j87j07J3J18J23k07K04j30j20P4P0M7j16pn1j86j09K21j38l84
$$ y = [-32, 181, 296, -304, -113, -10, 163, -168, 81, 472, 21, -85, 266, 272, 54, 51, -122, 209, -65, -55, -12, -187, -184, -264, 110, -290, -198, -139, -275, -22, -437, 14, -64, -4, -147, -34, 317, 97, 213, 345, -215, 500, 244, 522, 422, 49, 106, 121, -11, 91, 102, 46, -256, -353, 20, -337, -227, -431, -203, -250, -264, -196, -293, 131, 54, -78, 65, 263, -162, 117, 121, 123, 19, 347, 158, 145, 111, 624, 156, 295, 233, -193, 169, 11, -257, 16, -78, -47, -375, -172, 15, -88, -264, -177, -306, -220, -70, 258, 84, 168, 372, 37, 148, 198, 195, 123, 127, 86, 307, 74, 94, -79, 235, -99, 0, -15, -226, -88, -114, -241, 68, -165, 33, 43, -227, -340, -27, -210, 26, -193, -129, 224, 162, 119, 253, 153, 155, 347, 38, 109, 105, 434, -141, 143, -211, -16, -226, 59, -476, -38, -223, -341, -59, -246, -255, -217, -66, -93, 137, -132, 182, 373, 186, 79, 92, 210, 333, 126, 330, 200, 80, 154, 224, 271, 155, 148, 97, -89, -198, 23, -115, -499]
2925d99N07k5rj35k12J32J2L1l8L73r7j67K98p2j06K55N6Jp8J85l96K79l0q1Q2
2950B66l82K24j31k46k6J49j92J12O5N6oj52j00N4O4K90J47l42J95l13L28l1J92
2973B21p4L7k4kk2O8m9j72P5j97L6Rn8o1L38m06L7m7J80l31J03J00q6J45L03r7
2999B6l8K29j60N5J8PJ60J18k56M3j04J44k54L9K84l64N1J10l16l1R0n3J29O0
3023a3k61j52L14J23q1J33k64R7L46j04M8k1l6j32K35L6j16k21M51j66N2k09k97
3046b38J99Q3P5l71K38j67k35q0M31k85L53M0l62K90k4m9J40q1l5K05R1L21l09
3069B30P8j94R7k77L48k38j66O5l34P77n82m0jK12p1j61o4K84k51j42M32p9j74
3092b51R1J35P8q0j29M60l7m7J6k36J82l6k7k8n7k9k72J25K28k47J9o9k18N68
$$ y = [-499, 8, -17, -26, -161, -373, -241, -229, -198, -236, 137, 40, -127, 171, 99, -7, 248, 304, 305, 227, 412, 16, 295, 265, 184, 266, -116, 108, -23, -269, -295, -146, -338, -226, -161, -105, -111, -263, -363, -309, -245, 45, 192, -150, 45, -268, 60, 29, 221, 147, 184, 160, 158, 136, 204, 155, -17, 58, -139, -103, -94, -152, -213, 125, -281, -244, -291, -111, -442, -339, -239, -325, -180, 123, 26, -12, 217, 57, 112, 130, 137, 297, 415, 159, 202, 98, 242, -12, 27, 311, -53, -2, 108, -208, -239, -149, -202, -73, -13, -274, -426, -112, 11, -70, 63, -201, -104, 242, 138, 186, 165, 129, -3, 232, 268, 152, -69, 382, 216, 268, 59, -238, -39, 44, 119, -252, -14, -181, -416, -496, -65, -350, 3, 43, -319, -29, -53, -102, 38, -43, -78, 127, 218, 539, 230, 308, 114, 211, -66, 282, 44, -122, -57, -391, 386, -196, -236, -237, -25, -96, -257, -321, -37, -288, -430, 2, -77, -251, -160, -25, 53, -27, -156, 304, 267, 220, 236, 0, 182, 146, 119, 91, 34, 5, -267, -142, 86, -161, -142, -211, -429, 139]
3116A39M1m99L02lj97p9L10n1M09o92L31J74j09J94j26Q4N1q9j0J19r0k08K53
3139B54r8j85J36r9j61j19L7J57R3l7j12j14K20k7oJj8J50K70j18j52Q8J20j52
3163A28j0J05N7k30L24j21q1k2k08J21l30Q2Q9j36J10n9q4j79J79L02j63L92n03
3186b37K48r9L43j18l2j14K13j21K99l19p4J22J36L0m21j70N12k46q3J66o7J84
3208A52j38l49J54J57k10L20k87J26P7J3J15k38L21J00j98J37rk29K25j05QJ22
3230B64j89j01K58j38J6k04j62J25%J17j35J08P7k08N5J85j26l20M58k9j19K95
3252B27l54J95J11j2Q0j32L0j92M45k56L0Q8R0l77j17K59j67j94P0n1K9J26n9
3275a31K03j96N8p6k74M18l70M16k15L16nj8J38M4o0l16M45k38k47K56J0J94l80
$$ y = [139, 180, -319, -17, -20, -217, -296, 14, -37, 372, -320, 11, 185, 76, 270, 144, 228, 279, 190, 180, 299, 209, 1, 254, 156, -29, 107, 8, -153, -272, -235, -78, 15, -22, -134, -248, -28, -55, -61, -60, -78, 72, 342, 224, 72, 160, 280, 128, 118, 223, 280, 50, 374, 253, 172, 150, -58, 63, -267, -185, -96, -232, -122, -181, -265, -444, -265, 37, -126, 266, -237, 11, -88, 255, 137, 105, -9, 204, 83, 382, 63, -11, 111, 247, 277, -144, -314, 198, -48, -131, 35, -32, 152, 14, -335, -181, -24, -234, 86, -201, -75, 2, 15, 130, -108, 213, 313, 115, 252, 243, 14, 239, 134, 142, 264, 75, -26, 232, 94, 110, -94, -256, -131, -131, -14, -149, -41, 36, -172, -117, 68, -58, -378, 80, 51, -68, 227, -127, 68, 179, 167, 247, 115, 145, -47, 398, 142, 172, 260, 350, -27, -144, 115, -52, -246, -176, -227, -198, -72, -131, 72, -124, -66, -142, -416, 2, -368, 48, -167, 149, 144, 126, 264, 308, 248, -68, 377, 139, -108, 148, 158, 352, -28]
3298b8m2j9J26k08L5M7N2J67j90Q6k05PK15l9J09J85k98K53q2r1R6j83Nn9K76
3323B15j4R5k41J70m0j47L0j91J99o8J64k05l3j92N01n49L49pj24j11O4J03M0
3346HO5j43L88l02q4L46k06j0k71M13j4K0k74j43J37L32l51Om2R4j74Q9J05l8
3370d9m9m3J92m2l9m1m7R4K08j02Kj28K03Q4o8k36P0j91O22j94j26n1n5j66K36
3395H4k92L1m9K09M0l31K22J10j02K31j60J63Mm46J65J70m7J23M2J0j61r1Q9J43
3419A57j71M9J27Q5j98j33k20J99j55L57m6P3j65J37l64K10o5K20q7k34K09R8
3441H3L4J12j75k31L63k17K93j40Q7n3ok7J27m6k21J54k57J39r8k6J26r7O7j09
3465a18J91k32J28p8P4k70K43N6P4J20K9j15p4oK87q0j59O1o0k6j38O6j94K26
$$ y = [-28, -70, -89, 37, -171, -136, -89, -37, 130, -60, 26, -179, -172, 43, 4, 113, 298, 0, 253, 171, 80, 176, -7, -2, -61, 215, 201, 296, 55, 225, 185, 38, 68, -123, 76, 8, 172, -33, -66, -258, 243, -306, 43, 36, -88, -199, -135, -32, 8, 73, -70, 318, 16, -68, 278, 72, 62, -209, 204, 190, 210, -64, -207, -70, 262, -89, -83, -125, -31, -205, -116, -11, -49, -98, -141, 51, 9, -30, -71, -118, -24, 184, 82, 84, -44, 159, 243, 175, -61, 9, -182, 440, 246, 120, 69, 14, -152, 84, -208, -177, -226, -17, 23, -308, -86, 24, -78, 153, -7, 156, 160, -286, -121, 49, 2, 125, 167, 177, 16, -75, 14, 157, -14, 35, 162, 247, 49, -84, -304, -105, -260, 97, 51, 124, -41, 96, -268, -58, -123, 97, 10, -224, -15, 83, 117, 229, 54, -177, 186, -31, 262, 122, 209, 156, 150, 123, 250, 204, -17, 137, -120, 19, -79, -105, 21, -76, -9, -118, 73, -159, -31, -109, -35, -305, -62, -6, 68, 188, 217, 102, 28, 22, 309, 229, 70, 131, 71, 45, -93, -27, -221, 5]
3489Em49N06k84j26L89l33K92J01j84J13l01J91L00n64K33L18j72K4K22k38L43
3510C86l96jM58l74l7J27m3N7k22o8M2J00p0K8m03K52n5m2J44L1N2rj68J84L23
3535B96k75n3K38k7j15j44K80o8q9r0P3j18J68k09K08J10k30j88L42k95J78k70
3557b78J64Q4k47Q8Jl8L07j56k25L10k18K40J31Pj38J57r3J28k43LJ5J9j17K6
3581g3q6L02j68k3L0j11J04K4k33J68j17N0J02n7N3l43M03j23K9J50P5R4J6m55
3605a89N25n7k84K69P2k93j12J15nO3k06L71o9m60L52j33K9j77Q2O1q1j92J09
3628b10K58j31q6L62k79J53R7k52N06m42Q2j34P0k17L26L2r5L7J42k84j81K37
3650im1l4K09n8j10K9l23L62J32l69K45J1K50j31j1O6k25J9L5K06K5k64l05M66
$$ y = [5, -444, 62, -222, -348, 41, -292, 0, 101, -83, 30, -271, -80, 220, -344, -111, 207, 35, 59, 281, 43, 386, -10, -11, 447, 73, 36, 163, 120, 177, -45, -113, -71, 29, -41, -13, -416, -164, -219, -261, -117, -86, -34, -43, -211, -27, 296, 21, -32, 206, 179, 64, -80, 200, 132, 43, -47, 26, -92, 76, -133, 75, 185, -45, -233, 109, -186, -8, -278, -114, -30, -277, -189, -188, -226, 81, -75, -300, 10, -208, 32, 163, 170, 32, 189, 96, 224, -19, -16, -1, 18, -99, -73, -159, 143, -25, -48, -18, -129, -25, -1, -234, -66, -183, -133, -31, -88, -35, -378, 25, -98, -69, 81, 156, 250, 266, -189, 336, 279, -5, 264, 336, 43, -69, 46, 41, 104, -102, 269, 200, -260, 92, -41, -12, -189, -107, -46, -127, -319, -210, 48, -83, -169, 193, -86, 67, 164, -88, 418, -24, 58, -76, -6, -223, 103, 135, 40, 77, 219, -65, -246, -9, -50, -84, 125, 67, -43, -14, -337, 25, 157, -212, 33, 44, 294, 163, 152, 218, -7, 12, 47, 253, 278, 14, -291, 175]
3674A75j34J69k18j85O6J40k38J09k17J37P2J04m6J31j30N0m4o5M58j99j27K20
3696B28k0k29J03Nm6N4j80K59O7K1l04j80K0L40k08r5J57K0j19J26O2J68l60j27
3720b38J42r0J94r6L80o6j15l27L74j38J06q8L1J01p2lqJ35n25L04K11k08r3O5
3744b4k10K8J56j32j00M8K08Kq3j39J64Q4k32K61k1r8J70m4o9L52m0K4j44n8p0
3769C3R3pm0l5j18nk59J50j20L79j88N2M3k28J24J92R9m1k86Q0L32j34J89q2R5
3794C18k01nK40j32m45J55K37m9O1k84p2j0K9j14L71l59J94J48J58k84R7L8j08
3817a7J40M5j28oP7j8P2j88On8L06k79P5n1M6m2j27K84O9j73j19K3J77k42R4k22
3843b56Q4j15K2N11r2l71N3J15L30m02L58j13k09K26Pk34K83M7p8P2l45J71j73
$$ y = [175, 41, 210, -8, -193, -127, 13, -225, -116, -333, -196, -124, -20, -66, 65, -65, -15, -59, -124, 334, 135, 8, 228, 208, -21, 82, 87, 41, 95, -85, 174, 241, 262, -42, -222, -202, 138, -70, -165, -8, 12, -107, 19, 81, 249, -111, -238, -96, -186, 8, -88, 292, 226, 111, -216, 158, 20, 126, 38, 69, 170, 98, 95, 87, 222, -303, 1, 212, 4, -89, -24, -234, -206, -50, -182, -282, -234, -26, -24, -107, -246, -82, 2, -230, 31, 10, -88, 82, 38, -31, 321, 281, 305, 161, 103, 33, 126, 119, 79, 44, -74, -79, -338, -188, -308, 71, -117, -65, -22, -250, -126, 66, 165, 124, -162, -82, 250, 116, 305, 223, 318, 117, 112, 352, 220, -225, -70, 167, 118, 179, -105, -177, -187, -158, -272, 99, -260, -66, 82, 240, -44, 53, 91, -17, 123, 168, 40, 34, 111, 93, 165, -23, -17, -75, 231, -48, 27, -24, 22, -20, -147, 137, 206, 33, -86, -63, 114, -128, -34, -256, -172, -287, -265, 246, 154, -217, -164, -49, 281, -121, 237, 124, -85, 141, 148, -86, 197, 244, 166, 238, -107, 64, -109]
3866a09L1L04l84L33k31M7j1J82m63%L78L1j57k3j12L27M1k25J00J99j34q4m2
3889bJJ08L5m0j12K4j04J93j38J04n4k32J67j35N9J77j12n9J26j78N1K1o4r2L89
3914A33j82J00K66k19q0J20O5j60O4n1q5J03k93K45p3M7j14j20L08j47Q0l3q5
3937a11J12l3o7r9J04m2K20j87J60Nq4O4j01k0K76k50R8N5m6j2j49l0J93m0J1
3962B7k97J26L16j64Q8l75J61J49j92pj03J61J58J92l90O0K1M0j31L87j99j25
3984i7K86k42p8j38K71j87L13k10J22j72k81K55J56O0j7l78J83q6J55j1l4K76
4006A46j47Q7k5j1R9k05J01j08n6J84j3j9R1r5l11L81k8j27P7q6j35K97j64r8
4030a65Q0l3O2j56J60j71J13K9j6N6K04j49p2L8n9J78K95l22L9o6J23j37J18j97
$$ y = [-109, -78, 226, -158, 175, -56, -9, -20, 162, -301, -301, 77, 108, -49, -72, -184, 143, 184, -41, 59, 258, 124, 40, -2, -1, 107, 142, 102, -10, 14, -90, 103, -35, 69, 15, -217, -50, -185, -126, 51, -61, -120, 6, -172, -121, -100, -164, -256, 133, -49, 51, 317, 98, 18, 138, 203, 43, 107, 56, -29, 74, -219, 26, -47, 0, -114, -234, 74, -73, 7, -26, -111, 1, -32, -99, -198, -94, -136, 84, -103, 57, 62, -22, 42, -59, -79, 197, -53, 45, 100, 54, 42, -107, -137, 56, 16, 27, -270, -144, 172, 8, 96, -279, -118, 31, -161, -168, -271, -110, 48, 240, -150, -90, -69, -29, -160, 227, 28, -97, 189, -53, -131, -269, 2, -185, 128, -82, 40, -132, -413, -158, -2, 58, 41, -337, -154, -240, -85, -96, -130, 146, -1, 86, 61, 50, 149, -56, 45, -63, -119, 65, 52, 33, 124, 29, -282, 99, 71, -56, 21, -65, -200, 97, -67, -165, -85, -118, -56, -212, -52, -223, -110, -81, -97, -41, 163, 14, -58, -20, -79, 99, 394, 72, 111, 45, 168, 31, 149, -48]
4054d8M8j50j09J46n0J23r9K16j7j39r7J70K1J22j48k9K47M8j97j5J80Lj86K9
4078F9M7j88J48j50J67Kq8o3qQJ82l21M08k19j64K45n4j21Nj17J41k6pJ26J02
4103A24l5k87M21j1j62l9P8N3k78%K55kn6j5k17o6M12j53j90K62j75J45M8m4j12
4128d4q2L8J37k27K11Q7j33J21J0j98K7K28M7k06J11j30K5K9j6l6K94m01J52j69
4152a25K08j50R2L51m33p9L37j17j30l0J10J7l4J55l3r8J64M6k86P7J09j0l2k9
4176H0l15J62K6M7m1J3j58K15j03j24K19r2Qrj2j02J58J25j69J93q5P7j40K62
4200B35k09j2j5J23J07j30k10K57j31J22k59K48l17L60k74l64L70r3J47j91J15
4221a21j05M7N4J94j35J34j7K5N3P5l36J57P4n4q2K54r3o9l89M61o6p4J31j51
$$ y = [-48, 0, -150, -259, -113, -163, -40, -139, 77, 60, -79, -176, -6, 15, 137, -11, -40, 207, 255, 58, 43, 223, 226, 40, 69, 116, -72, 76, -74, 93, 95, 7, -56, -64, -56, 126, -195, 213, -6, -170, 75, 21, -100, -95, -212, -71, -97, -104, 22, 124, 89, -198, 223, 212, 50, 11, 89, 142, -136, -136, 119, 117, 61, 46, -171, -237, 175, 22, -168, 94, -81, 64, 112, 68, -44, -126, -88, 49, -178, 33, 120, -13, 108, 118, -80, -53, 175, 222, 16, 127, -3, 22, 51, 35, -1, 293, -108, 44, -125, 83, -67, 25, 376, -57, -136, 201, 84, -46, -76, 34, 51, 17, 172, 139, 41, 205, 251, -35, 42, 151, 141, 109, 80, -235, -73, -47, 0, -41, -28, -186, 29, -74, -198, 21, -71, -63, -72, -84, -186, -28, 97, -72, 121, 36, 113, -27, 235, 26, 14, -1, 122, 229, 99, -111, 146, 15, 137, -122, 126, -191, 169, -105, -469, -99, -192, -45, -236, -121, -226, -179, -125, 69, -66, 68, 51, 76, 129, 204, -132, 25, 99, 45, -37, 217, 124, 55, -334, 127, 61, -13, 118, -33]
4245c3K01ql44p7K00l2MJ31j00K83k43K8m1ko8q0J78m8n9M22j80o1n24O30k00
4270b3m5L06J22l72l1j2K7M6rj98L33m22M07k23M1J2K5n4J46l43L50j07r3L24
4294B07k34RL76l36j98K48J98l36R7MP3k0l64J55J66R9l82K29J91J4l34R1j21
4317a68L21p3j24J27K3j50P7O3P2p5j75K36l89N41k13l5j12J49JQ3j09j29J32
4340G3j32K8L9Q4k48n0QK73j08j17K97p4J92l09j26J76o5J9k4M63l63J23k21J89
4364A27l32J39L34k98K13P3l34O4j46j5J12j41p7K87j88P2n4R6J43j10k21K45
4386a1M9j06O9n9J26M0Q8j11j35J24O8k00k1K15j32k69L61j91L45k79p0J01k45
4409b43j6K48j28K36o1n6K81k63R7p5q9l4K1j12K90O5o5k25K50m22M65j08j28
$$ y = [-33, 168, 160, -184, -261, -61, -93, -89, 42, -58, 225, -18, 10, -31, -33, -101, -181, -3, -51, -110, 312, 132, 71, -453, 177, -23, -68, 238, 360, -12, -43, -55, -28, 18, 9, -189, 144, -278, 129, -94, -53, -41, -16, -70, 76, -267, 83, -24, -117, 207, -27, -18, 358, 22, -176, 72, 270, -66, 31, 35, 108, 88, -276, -121, 45, 144, -238, -9, 182, 196, -138, -47, -168, 153, 80, -44, 83, 106, -44, 33, 96, 168, 93, -82, 154, -235, 306, 93, 58, -54, 95, 96, 179, 70, -59, 73, -59, -31, 8, 92, -156, -206, -198, 75, -33, -150, 147, 73, 265, -44, -170, 6, -59, -40, -64, 399, 36, 159, -62, 127, -205, -66, 268, -30, 183, 256, -78, -14, -160, -175, -63, -204, -281, 6, -182, -110, -164, -68, 75, -35, -256, -11, 38, -68, 1, -58, 68, 108, 196, 85, -50, 74, 142, -58, -79, 136, 4, -265, 96, -95, 250, -29, -99, 2, -243, -259, -11, -139, 97, 36, -20, 261, -2, 95, 20, -69, -103, -82, -194, 96, 161, 96, -129, 121, -301, 164, 56, -72]
4432g2J63k18K32p5q6n9j3M8R4n2jj15o5M13l44QL40n1j05n6J48k10L64j54Jk50
4458a15J43L69k76L5j96J5n6J69k60j39M82j40o1p2L5O8J52k65kL3J47l8lQ5o1
4483D9k34K23p6OK15j62p6J63j3k68Q8K3K16j94j45J41k03K37k24M6K87k38L1
4506a08L2K35Qj23l2j04J57k70K76N8k14J85n6J5j68N0J04l7p7K55k23m8L2J07
4530E4j49J04k4j11j1oK59j27J88R1j75l01J86k5K67Mr3k40M03l68L48n07M75
4553B42k71j00K0l8J28k4n1n4J56N3r1o5L68m65L06j68K88l43j29L22j23j6J22
4576F7N4j9j72J10j4n2K21j55J00j54n9J16K0o5k43L50N5m5k17j19K21K7j40m3
4600a56J35j68J88k3J3J58j90Kn8J56k63M33k08j45k2K69j00k1J2k0J82kk78K81
$$ y = [-72, 91, -127, 105, 30, -56, -115, -128, -80, 14, -38, -39, -154, -219, 194, -150, -142, 198, 147, 42, -14, 134, -76, 288, 134, 135, -115, 28, 397, 121, 156, -40, -25, -81, 88, -172, -311, 171, 31, -30, -102, -67, 1, 153, -112, -114, -81, 66, 28, 25, 110, 49, -185, 38, -38, -32, 183, 21, -55, 108, 95, -173, -85, -62, 154, -40, -185, -44, -247, -10, -234, -188, 99, -139, -108, -76, 159, 167, 44, 12, -92, 65, -205, 71, 129, -85, 100, 44, 59, -109, -59, 45, 8, -69, 186, -37, -85, -53, 54, -95, 9, -15, -126, -137, -143, 116, -11, 177, 268, 93, -208, -22, -47, 220, 224, 131, -109, 294, -74, 274, -233, 242, -29, -129, -109, -147, -19, -43, -94, -148, 8, 61, -30, -95, 273, -192, 114, -54, 234, -109, -238, 84, -39, -55, 67, 121, 102, -70, 40, 26, -26, 195, 40, 140, -14, -73, 43, 63, -2, -245, 105, 160, 115, -102, -221, 0, 27, -113, -156, -21, -189, -1, -24, -11, 147, -43, -41, -99, 57, -206, 227, 19, -126, -148, 121, 21, 0, 12, -8, 174, 172, -106, 175]
4624A75k02J51q4m7J46j95k87M68p8j72J74l1mJ19K3k37L07j34J96l0l14K46j95
4647eJ42k90P0QM01k93M9q7o0j99J53J36l35P7L62k95L42m58K54J97k46K17n41
4670d01N76n6rj23N4j55J44j23K51k53J6L04j41m35M34M7j71J4k01J57lj28K49
4693D7o8p6P6j49K94j87L02l85Q3K2O4J10k69K31j46J16j34R5J11Q2l27J07K15
4716B14l34m3QJ09M8j75j53K15Q1n6j52K36j42M4L63l75Q9OL5P7o9J01O6R5j61
4741A27J30k82J56l54K23J78j17R4j10M8l51rM10k99J35J68J46k21q8P8k1Q6p0
4764E7J5Lp9o0J46qj90M0K94l52J0K14j30q3N6j55M55l10q7mJ94M3k52L61m10
4789b32M36l54K86K6k5p9N7j48%L78m24J5N1M4j07M1O3pL8J79k03O3j96J62m3
$$ y = [175, -27, 124, 40, -7, 139, -56, -343, 125, 47, -125, 49, 18, 14, 133, 156, -81, 226, 92, 288, 258, -56, 190, -5, 137, -153, -83, -75, 326, 33, 82, -5, -65, -264, -111, 25, -310, -233, 129, -166, 176, -282, -28, 169, -77, 140, -401, 175, 119, 110, -13, 41, -114, 30, -93, 158, -95, -79, 225, 84, -351, 83, 130, -41, -27, -228, -71, -74, -202, 47, -21, -97, -21, -170, 124, -63, 239, -146, -63, -41, 23, 133, -136, 95, -51, 65, -69, 26, 137, 219, -108, -1, 214, -120, -163, -155, -46, 2, -173, -326, -111, -30, -86, -238, -2, -144, -100, 263, -112, -23, -17, 18, 95, 26, 127, 193, 288, 127, 257, -25, 131, -223, 0, 178, 61, 155, 45, 93, -258, -267, 143, -156, -21, 147, 293, 72, -16, 62, 41, 127, 57, 72, 75, -4, -64, 82, 74, -116, -76, 218, -134, -124, 90, -40, -123, -67, -222, 233, -77, -164, -168, 26, 69, -183, 178, -232, 204, -150, 136, 162, 137, 58, 115, -33, -33, 345, -79, -64, -13, 31, -76, -35, 28, 21, 59, 238, 35, 98, -98, 64, 21]
4814B1L6k12O9K54k43J72j36K82l90K93K01l25k8j3N9j18J34J3j35J50l7r2L41
4837B96l98j7n9n8K05j0K03l55J51J39j25p4o7M03k60R3n8m6J84k53J13j38m7
4860a78K38O9j92K54j07k1j80M8J85Ok71J39J17j30r6n5Q4o5J81m13K44j7l9J6
4884a83M08q4P2k12k2J84J16k00L9J47k70J86j01o7mr2mO4r6L22k50R3j9k73K19
4909b7l6J58q7K3r2j19L94j71k60M47O7j34R2Oj57N9j03J00j90J51k80J30m6K5
4933e0j78j9L45m57K84j3K9J8Q4k45K81p9lj1J90j02%k67K05n8j6J15k75L84k52
4958i0L02k51K24m59K79Rj83L75k85K0oj60J07L14l15N0o4J19o9Q7K2O0k16J27
4982cR2m7J31j84J91k86J71r2j8QK55l1l51J28k08K80k26l0K65r5l42L73J75l36
$$ y = [21, 57, -155, -86, 168, -75, 97, -39, 243, -147, 146, 347, 22, -6, -19, 40, -78, 56, 69, -66, 84, 47, -45, 296, -102, -119, -178, -236, -31, -41, 162, -193, -42, 97, -28, -102, -169, 234, -26, 67, 9, -37, 147, -106, 7, -131, -178, 60, 129, -63, 191, 84, 63, -117, -69, 116, 122, -149, -10, 107, -23, -119, -174, -90, -155, 26, -387, -143, -160, -199, -183, 225, 141, 213, 1, -21, 163, 279, 79, 118, 265, -5, 181, 80, 13, 9, -83, -87, -23, -119, 203, -47, 46, 27, -246, -27, -63, 95, 8, 31, -61, -180, 214, 43, -217, 230, 297, 163, 255, 261, 104, 163, 60, 160, -30, 121, -159, -29, -75, -50, -228, -247, 98, -359, -75, -88, -59, -41, 43, -202, 79, 0, -3, -14, 176, 74, 74, -193, 12, -46, -62, 53, -222, 162, -90, 212, -39, 185, -274, 5, 14, -169, 206, -79, -59, -65, -225, -118, 196, -119, -69, -133, -14, -83, 4, 26, 86, -130, -3, 89, 42, 173, -11, 180, -106, 65, -27, -45, -37, 218, 187, -164, -36, -244, 36, -190, -220, 45, -50, -392, -19, 156, -180]
5006a80O3q5J99K1%n3K10k73J16m0J55l31L71qk38J92j86J51m9N2O0k5M6k1J8
5031A65j85K60m05j05J34j50L26J15R4k48j3j27o1K78j15L2J3K85j54l00M3J09
5053iK89j81J59j22n3q8J4j21M42l08k29L90k13j54M39k90k70M32m30J26K13j11
5075g5K97l77L18k29K11j43J63k64J75j26M8L39o02J99K15m8R1k48J6J91k89q0
5097b18N1J55l9j66J46K65M4q1K1jJ03k64j04O3K73j31l80J82K20J26j38j3j89
5120g5N4j5O0k1M9l01J0J16j08J14kk05L73j03L13l27j47K36P7n4J25Jk63K88
5144A95Kj66L9p2q7K55j26k7l5J12j60L02j95k57L03r8n4N2J73j18k36J99p8j07
5168a84J88j1J5J89k07O7j82J08j30J01K29l95J73o5J05k02O0L78Kj47K5j84J63
$$ y = [-180, -117, -202, -3, 18, 18, -35, 175, -98, 18, -22, 133, -198, 173, 165, -73, 119, -67, 84, 35, 87, 147, 122, 168, 147, 165, -20, 240, -165, -270, -136, -286, 40, 155, 249, 1, -12, -139, -200, 78, -37, -5, 8, 293, 139, -161, -118, -9, 280, 99, 258, 136, 83, -5, 9, -112, 330, 22, -207, 183, -30, -184, 255, -35, -305, 127, -303, -177, 36, -75, 222, -155, 163, -66, 145, 2, 165, -99, 76, -50, -2, 337, -265, -66, 149, 101, 192, -56, -40, 151, -138, -218, -167, -12, -51, -217, -71, 194, 238, 157, 178, 177, 280, 16, -88, -25, 248, 117, -263, -81, 139, 265, 127, 114, -75, -21, -36, 24, 3, 52, -249, -239, -123, -231, -117, -119, -324, 49, -54, 259, -68, -215, 21, 98, 44, 169, 170, -93, 195, 197, 31, 70, -2, -89, 166, 40, 13, -22, 90, -70, 232, 37, -220, 83, -15, -69, -17, 156, 38, -198, 1, -77, -184, 4, -7, 8, 197, -10, 57, -125, -17, -147, -46, 183, -212, -39, -104, 1, -201, -141, 237, 239, 92, 117, -67, 96]
5191I6m2M7j35K7lj21J84%l03L98l30K30k1J21k12K2O1j66K53L2k10L74j70j77
5215d5J25L5k80m9R0j18R9J8R8l7J57j33k03M3L31j12P9J73m13K46l3j61j01J62
5239b9j0K46j30j9J9P2j41l1m5K2J42k99PK79ok99K41p2k39K47J6n7J7J65n6N2
5265I2J49q3J0j80P4r5r0j39K20jj4JK32m3r8O2R6l2P0j81k94j0L95l12J05l9
5291a05j8K08k08J60j05m9M4J44n3L6N6j64J34k8K03j29l79J88r2K4O6J24j03
5314d6l8J68k65Q0K15l16J97L6j4j08J42j03M5j08J48o4J64j92j47L37l5J52k20
5337B8m2k55O5K79K44l76K54m06qK50k78L59j18P1r0K4l9PJ05K23n22K29O6j62
5361i2N1n9L14k65j54k3L25J18m65K99J95o9o9j6j16L6m2j00K83K28k71o2J69
$$ y = [96, 54, 101, -34, -7, -10, -131, 53, 53, -250, 148, -182, 48, 27, 148, -64, -42, 19, -147, 106, 138, -72, 302, 132, -45, 80, 115, -165, -214, -124, -242, -143, -125, -27, -64, 93, -40, -243, -200, 131, 19, 98, 271, -142, 104, 71, -90, -191, -29, -39, 207, 77, 58, 77, 149, 8, -23, -68, -46, 96, -203, -196, 83, 77, -222, 19, -53, -292, -45, -29, -86, -69, 96, 40, 92, 241, 158, 168, -12, 62, -33, -123, -262, -42, -43, -57, -56, 176, 133, 35, 97, 193, 161, 231, 50, -244, -254, 141, -171, -66, -105, -123, 85, -123, 37, -68, -117, -73, 71, 18, 54, 110, -54, 80, 52, 255, 126, -253, -65, -157, -133, -67, 57, -46, -84, 84, -181, -101, 114, -202, -5, 31, 17, -91, 51, -52, -7, -115, 33, -31, 133, -59, -206, 131, 96, 248, 28, -14, -269, -204, 75, 319, -57, 197, -209, -217, 33, -245, 114, -4, 67, -23, 1, -38, -31, 74, 297, -225, 4, 70, -92, -41, -100, 214, -51, -205, -228, 97, 215, -250, 49, 244, 175, 106, 90, -26, 10, -32, -132, 151, 379, 108, 46, 215]
5384B15l08K66j7m46J82J53o7K77k43J03q9Q6r3QO5j95m1k3J79N3k7k21J14QJ54
5409I3k86J04p7P0P7J54k28q0J50p9N5k22L71q7N1p6N4q9K92l43LL00k62J72P0
5434A87l11O5P5j80L60m00K24k36L08k18j04N1K67k26K24j9q8K24k28p1j39K19
5456a6K18j43j88J63L44m60J05l8O1j80R2K09r6J97l11j64L81l81K09r3l9J05
5478b5j48R9L28j09k87J57r3j09o2L39k02K01M8j16l5o7R5J73j81m6P9J73j41
5501G1Rm3q0j04K85j8j94qj12J92qj26M69o62L50m2K04m07J98n0k5M4K74l37L57
5526B37j65j38j85R6j1L26j17oJ10k26j29J98R0j11o3J79p2j10J45j8k04K3R1
5549f0J09J21j05J3k46K86q3R7j58j69J34M5L9jj5J33j16j33k79L8J35L47nj78
$$ y = [215, -93, 173, 156, -290, -108, 45, -22, 255, 12, 115, 26, 112, 19, 27, 92, -103, -144, -167, 12, 65, 38, -183, -69, -61, 93, -193, -89, -166, -96, -19, 135, -93, -173, -23, -102, -47, -269, 102, 15, 66, -10, 44, -45, 247, -96, -93, 207, -55, 117, 187, -124, -59, 16, -164, 196, -204, 20, -216, 92, -126, -230, -179, 88, -138, 86, 67, -21, 203, -25, -96, -235, -16, 202, 59, -129, 34, 378, -82, 23, -15, 46, -134, -42, 167, 71, 268, -43, -207, 174, -207, 2, -91, -130, -25, -173, -74, 254, 145, -142, 15, -78, -187, -249, 90, -112, 89, 137, 21, -14, -81, 14, 187, 6, -40, 39, 212, 71, 80, 37, -43, -147, 138, 120, -74, -82, -194, -2, -10, -136, 333, -329, 21, -21, 183, -224, -26, -76, -101, -57, 217, -120, 237, 72, -66, -251, -155, -166, 160, 43, 37, 147, -79, -208, -10, 80, -31, -94, 85, 13, -97, 48, 30, -174, -151, -60, 49, 170, 65, 78, -168, 118, 35, 132, -26, -195, -61, -16, 23, 22, 7, 140, 24, -109, -388, -350, -215, 132, 127, -51]
5573e1J06k09J35J47j14J01l85K14l2L15l76O3J36k81J52J48j12o0K05l04K42
5594D0j60K59m72K90k7NQ5n3p6K6M4O9j16J90J71Mk72L65o55K59J14j35J7k12
5618b40L01m3j8N4J05j28k32M03l63J27K01l33m5K39k11J31q0K58j94j70J77k00
5640b61K84k29K57j04J2N7k7N4o2m9Q4M1M4J20m61K48J19k95L48j48k6K8K9l89
5664c26L08K6O0p7J38k30R8J05p7l09K85k63L03qj87L93m3p6k50j4M77q2l80q9
5688b18J7L01j46pR0o3o6j0Kq6L75Rm93K70l2j51J59oJ40k94L09k25k08M63l61
5713b31K90J57l58J59l7J84l63K21q6J24O7j36m2J05j24N6n4J18kk65J61p8K78
5736A44o3J16k39KK00k03l3K48m2k8p4l2L3l7K77n76L37k02R2j20R9Jj21K32p8
$$ y = [-51, 55, -154, -19, 128, 14, 115, -270, -56, -88, 227, -149, -86, 50, -231, -79, 69, -43, -103, 102, -202, 40, -120, 139, -333, -43, -70, -65, 20, -33, -109, -83, -39, 30, -86, 104, 275, 279, 7, 372, -283, -24, 90, -45, -28, -240, 61, 18, 0, 54, 159, 31, -201, 202, -161, -34, 167, -166, -211, 28, -183, -52, -132, 126, -68, -238, -61, -261, 23, -206, 51, -53, -41, 16, -11, 43, -19, -68, 16, 57, 101, 221, -240, 8, 127, -168, 180, 32, 6, 34, 63, -326, -18, 8, 68, -9, 129, -101, -3, 102, 25, -284, 1, -262, 41, 33, -154, 239, 196, 120, -130, -144, 333, 251, -129, -218, -201, 100, -46, -53, 37, -26, -92, -102, -100, -186, 189, 198, -295, -25, -57, -208, -49, -55, 85, -209, 100, -125, -333, 130, -231, 59, 216, -142, 17, -20, 164, -199, 22, -64, 60, 127, -9, -51, 54, -70, -14, -68, 50, 48, -217, -56, -134, 144, 81, 197, -42, -40, 160, -43, -76, 172, 130, 102, 28, -4, 29, -8, 269, -307, 30, -172, -80, -200, -101, -100, -221, 11, -67]
5761f7O8l7p9P0j06L6K37j26Nj70K72K70k34k49K88k08j6K44k09l5j73J40K30
5784A51j34q0J26k1j35J08j51K06n6j69J6M4kj2J9J37q4j21K22q7n4Q3o6n3L2
5809h1J60j16j10J36P2k77O1R7L59n52K14J3k3j27K66p6J11J0k38q8K71J64j54
5832I2J69j60p3Q7j90J4J96m4nJ5m6j30K62k67J64P7k48J40k31j38J84Q9k0k9
5856i2K68k64K34l41J54m4P9o1K06n5r1Q3M8k81K44K0Q9k75k1J67N4m78N78m39
5880b18K69j80K81j99R0J0l82M15j39OP7j49Q3P7q1J5j2l9J20k0l2J93j23J12
5904A74m72K48O0j2k15J37k6J21l3J61r5j39R5N1J25k41J18p3N8L2j71L73k42
5927C4J8J24p3p8o1n6K01j22L8m3K7j00j4O5J37k00J14Q9m73L58J3k24K72j21
$$ y = [-67, 1, -36, -115, -45, -151, -115, 122, -4, 1, -169, 103, 373, 139, -110, 178, -30, -46, 198, -11, -46, -219, -79, 151, 17, -63, 63, 42, -93, 15, -136, 70, 14, -155, -139, -95, -97, -109, -90, 47, -37, -158, 64, -23, -77, 6, -60, -113, -81, 79, -37, -147, -11, 61, -216, -155, -58, 301, -251, -37, -24, -47, -174, 92, 16, 127, 137, -101, -189, 82, 246, 92, 261, 101, 28, 115, -75, -61, 135, 91, 86, 101, 55, -75, 187, -80, 84, 161, -87, 53, -178, -316, -132, -43, -63, -92, 176, -88, 146, -195, -41, -85, -6, -67, 139, 84, -7, 76, 124, -157, 87, 107, 196, -79, -100, 67, 121, -357, 221, -218, 51, -129, 152, -47, 43, 53, -329, 86, -53, -47, 30, -119, -36, 41, -40, -25, -37, -76, 44, 24, -8, 185, 62, 174, -298, -50, 10, -2, -217, -80, -106, 15, -18, 143, 48, -91, 4, 55, 180, -61, 57, -16, 42, 74, -97, 276, 34, 52, 176, 103, 25, -36, -92, 109, -13, 25, -18, 9, -91, -105, -40, 97, -103, 11, 100, -373, -15, -2, -226, 46, -75]
5951g5N8J14k73j7L21lm2o1Q1j65p7J38P2jj12J04K7k98K78j8nj22P1K02k05P8
5977G0j14K29j92j51o4O34m67j26J57N1j23K96j38k08K84l04K93J07l49j9kJ11
5999b5J99q4j36kJ4O5j85L18k63J51M9k46j65J98PK44k57P0P6J02j24O3r1J0N5
6024D3K19k64p4j11J82J30k38N6qK32Q3j20o4j41L4J82r0K0R8P8j86k40K07J63
6048A91j18j16J49j75K85j27k52J14Q6p4N7O4l1R2j91N2j60L02k36J86M1j68m8
6071g7R4l9o8K89j77m2J11j44K39q8k5j48k0j1K74R6j52j27p3J59l2J12q8p7m3
6096e7j00J41j30L75j88J96j71n1p1K74n05K47JM3J86l65Q4j1j08K05M5k10R2
6119g8j1L0L4J69k46J92R2j10j39J15k03p3N41l45k6j71M30k79J36k2p8Jj70K06
$$ y = [-75, -17, 97, -176, -193, 128, 125, 83, 22, 103, -62, -139, -1, 71, 70, -42, 62, 89, -209, 69, 51, 46, -76, -5, 197, -8, 70, -44, 185, -7, -158, -222, 412, -55, -181, -24, 27, -96, 200, 62, -146, 138, -166, 127, 234, -115, -134, -136, -25, 174, 90, -46, -48, -34, 31, -154, 164, -99, 52, 101, -145, -310, -112, -105, 139, -118, -48, 28, 130, 6, 69, -22, -12, 43, 262, -2, -76, -187, -5, 125, -113, -57, -65, 167, 250, 130, 66, -75, -41, 141, 51, 71, 169, 247, 61, -179, 28, 191, 73, -43, 106, -69, 216, 89, -163, -49, 37, -37, 20, 84, 53, 145, -46, 6, -154, 148, -88, 98, 139, -29, -77, 17, -22, -90, 199, 22, -20, 91, -53, 186, 98, 73, -75, -95, -106, 168, 264, 112, -15, -88, 71, 39, 151, 63, -14, -57, -157, -16, -146, 229, 41, 237, 66, 15, -56, 218, -287, -40, -39, 4, 190, -175, -91, -102, -210, -5, 40, -170, -78, -89, -59, -25, 144, -102, 90, 182, 72, -67, 48, -155, -228, 313, -32, -58, -229, 201, -78, 58, 36, -42, -41, -211, -5]
6143eO2j5J88m2O3l53K31J2k31K40J1l98L15K1j91L3J65j82K14m9k21J07M4k22
6167b03K41l7j28R1J41o3l07J67O1r7J65J34m64M04o7j83J54K28q6k92J4K95j10
6190E8K79q8k93R4n9j02J08J33p7k83J81M5j98k2L46j94K71j16M8p0j01J07j45
6213g8R4Mk09L72l37J41L27n11J40J47K64j88l7J85m19L33k24j57L95k49Q7j12
6235c2J83q9l5o0j91L59l13J31K32l20Q6r5J70N6j83M5J2l2o7J63R6J42k20J29
6259A67r4m3J1j89K20l8kq6M2K4J98m44J44J97j15J96J8j79R2j26J26k3j47J33
6283H2l0j57J80P0j0k72N4M9J05l32J9J02K83P6m06L07j35K49j89OJ20l10J14
6306b5k44K39p1J48j88J06K5P3r0J29N2j20j84Q0k07L20j16M6J95k6Jl08j24J03
$$ y = [-5, 57, 42, 230, 188, 251, -102, 129, 141, -90, 150, 161, -237, 78, 99, -92, -59, 106, -76, 138, 89, -132, -25, 19, -203, 38, 1, -127, -36, 105, 42, -265, -98, -37, -134, 31, 165, -299, 105, 38, -145, 9, 237, 151, -141, -127, 168, 58, 337, 249, -44, 50, -9, -111, -3, 130, 53, -230, -49, -4, -202, -224, 122, -72, 199, 83, 131, 61, -40, 67, -78, 16, 20, -189, 183, -154, -13, 314, -197, -57, 90, 354, 166, 129, 314, -105, 228, 4, -153, 242, -7, 80, -32, 151, 62, 27, -33, -224, 135, -178, -47, 185, -135, -49, -144, 26, 82, -101, -56, -44, -76, -143, 20, 116, 258, 38, 167, 73, 30, 41, -148, 72, 34, 32, -54, -12, 12, 210, -234, -90, 107, -8, 188, 206, 27, 119, -7, 119, 96, -51, 82, 52, -105, 75, 145, 135, -137, -83, -34, 71, -261, -242, -140, 143, 219, -187, 120, -15, 234, 45, 51, 171, -139, -25, -269, -30, -101, 47, -141, -35, -10, 63, -27, 102, 154, 34, -150, -70, -277, 43, -73, -27, 168, 142, 143, -165, -289, -186]
6330a86J31Q6r1p4L15n6l2Q5k1j46k94O56l24j88L58%l07K17J31j37l1k95J81
6353b2l84L51M8L4j67OL45k41pJ07O6j23J53m0j09J64q5p7j77J2K40J1J57N6j99
6378A19j40n8k31L77L8k23R8k27L76l86L76Pj80j52q3M97k48J31j93R6N0j5l7
6401hj86L14r5q2M1K3J02r0L12m1l52J68J88j78k40j19K43l02J81J78k50o5J93
6424f5J39p4M2J56k84N4K60K6k65P4P4k55K71n57L84o7J59QJ25l82NJ60J40J01
6448B29k67K08k25P3O6j51O9J00j0j85J57J55J85n22J88j09J07O8l80L21j69j84
6470b76M12J8k32N8j51L2J34P5j13QJ16p7N1j52K89r9j69K6K25n3j63mL03k69
6494a1O9o3j83K44R8j10J3j35J9O3O9j2r9K43j7k20O8k4j29K03K2q7pk40L58l05
$$ y = [-186, -55, 31, -60, -134, 181, 125, 93, 178, 157, 11, -283, 373, 49, -139, 219, 219, -88, 129, 260, 123, 92, -203, -22, -406, -55, -7, 27, -140, -134, 211, -30, -37, 70, 136, 13, 166, 126, 17, 181, 96, 19, -158, -146, 94, 105, 262, 318, 119, -21, -79, -310, 67, 105, -118, -20, -247, 129, -257, 119, 126, -54, -206, -289, 208, -40, 91, -102, -6, 44, 29, -8, -194, 120, 25, -57, -16, 7, 109, 19, 331, 290, -62, 106, 294, 116, -124, -243, 0, -302, -121, 57, -193, -258, -65, 74, 0, 42, 198, -86, -32, 228, 254, -11, 63, 137, -118, 153, -404, -20, -87, 72, 80, 205, -177, -172, -12, 128, 229, -38, 170, -55, 18, 84, -67, 2, 102, 92, -93, 64, 219, 404, -118, 70, -39, 68, 136, -244, 77, -92, -276, 136, 154, -78, -20, -171, -139, -5, 70, -43, -35, 81, 4, 55, -97, 192, 93, -76, -50, 175, 122, -41, -45, 258, -11, 58, -5, -188, 56, 154, 44, 57, -78, -59, 4, 73, 61, -38, 205, 188, -32, 36, 12, -117, 86, 108, 21, 14, -226, 132, -173]
6520a73K27j51P5R7J37Q4k00M4m04N33j11l32R1J57K23k98m6Q6m5Q7M9P2j77j83
6544a58p6K13J20l8k90K26M6P8n8k22lj58L09K79k20k11J12k46L00Q1O1k79Q5
6567d9J78j29J17Q4k68j45j51K65M8l6K45k52j10J3J88n4P5J12j23j68J84j83
6589a59j94M86J5j03q7j19L77m26M1K12j14n0O7m3j82R8L3j78M0N6K67J93q6k62
6613a18L28k13m6K43l65K02J6j29K48kl3l50K56O1k53N7K36j16Q5K76l95J29p1
6636D6j65MK59j60J05J16j55k13K03p9M1M6j12K77k65p4P4K38k33J68l24J05K8
6659g0K90l64J85j90K4P8p7J84J37j00j42n7J18k70L01k17j31N18k28J10l86J57
6681a30J72k44J09J16J41q2r8L8O8J41L9k79j15K84j16l1J77j02q0O8O6k64J66
$$ y = [-173, 54, -97, -22, 75, 212, 296, 96, 140, -264, 269, 158, -174, -83, 74, 297, -1, -47, 39, -6, 81, 130, 202, 25, -158, -234, -21, 99, 61, -229, -3, 43, 121, 63, -159, -162, -320, -11, 268, 48, -163, -51, -297, 3, 84, 145, -134, -49, 129, 0, 117, 201, -67, -212, -363, -98, -50, -86, 159, -93, -203, -190, -2, -56, 19, 131, 8, -160, 24, -159, -353, 133, 148, 45, -42, -161, 216, -210, -169, 43, -71, -121, -54, -97, -279, -181, -148, -326, -286, -230, 37, 230, 144, -118, 210, -3, -49, 194, -171, 31, 47, -82, 166, 164, 131, -219, 37, 98, -155, -98, 138, 22, 107, 383, -12, 117, 46, -119, -115, 144, -16, 89, 205, 50, -163, 40, -39, 2, 48, -64, 213, -52, -126, -52, 186, -47, 121, -203, -98, -70, 220, -144, 41, -149, -125, -47, -124, 60, 197, 97, -45, -102, 16, -254, 47, -170, -301, 217, -11, 99, -287, -130, 42, -202, -93, 23, 164, 82, -16, 22, 90, 231, 270, -9, -124, 160, 44, 13, 190, 88, 8, 76, 142, -122, 44]
6704D4J8J66j83R9o7Pj78K08j65n4M10j83j48R4j66r7KK13J45n6j08k4k84L99
6728I2j01r0J74q1M1R9k64r6J51N9j44N0Rl2J0L23k30J01o6K05k53L45k37N5j61
6753d1J06m7j89J39K47j77KK4n4J4k1nn7K82n23J74k98K37Q9N9j15M4p1K08J1
6778C8K30j00k79K12r8o9J33o1J38j29p9m7j68M28k05R3J53k8l27L04j63O8J69
6801B13m08K18J57j14jj41J32j83K8L19k48Q7J10l31J09L72l76J19P9j62j24m5
6823a90J90K26l31rK57k52l0K99j61l5M6j46k1J90M2j99P9M7k5J62k36J38J6m7
6847A0j2k28K06J9j00J04J4J22r6p2K57j14oJ2k25q4J45l9rJ1N2j35J71K45j63
6872H5k07J47j83o8K02J00j25MN2J39k2j39j9L5QJ57r9Kk45J10K8L2N5m6j08J65
$$ y = [44, 62, 228, 45, 144, 77, 84, -94, 114, -51, -105, 305, 122, -26, 68, -98, -195, -193, 20, 165, 109, 1, -23, -307, 92, -9, -99, 75, -6, 35, 134, -130, -226, -75, -16, -160, -110, -101, -133, -123, 200, -30, 71, 5, 210, -43, 302, 65, 120, -41, 65, 18, -171, -32, 215, 38, 40, 64, 10, 24, 3, -2, -59, 223, -300, -126, -424, -187, -98, -39, -154, -110, -181, 27, 38, 268, 168, -111, 101, 3, -66, 67, 6, 144, 15, -64, -111, -279, 149, -56, 37, 190, 162, -165, 139, -24, 44, 213, -195, 23, 180, 66, 65, -76, 56, -127, -99, 220, -28, 59, 169, -162, -53, 319, -57, 62, 141, -21, -145, -190, 0, 226, -105, -114, 143, -109, -139, 160, -1, -36, 10, -136, -157, 33, 75, -124, -45, 2, -23, 139, -97, 41, 57, 10, -2, -230, -24, -5, -105, -1, 13, 135, 39, -33, 224, 110, 104, 116, -109, -193, -48, -87, -96, -85, -33, -168, 3, 248, 85, -122, 25, -158, -226, -24, 76, -49, -45, 7, 146, 124, -15, -34, 1, 9, 166, 67, 69, -176, -66, -38, -6, 49, 3, -105, 60]
6898F0n1M8po2J80j85j52L75k11JJ04l47P2P7J81j7k20j51M76j46J04J38k24O5
6922A08k56N2K24j66j63L9l41L88K26j28M9nKj7k40K47J33j15k5J2J1j36J1J50
6946F0j79N3J37p1K28m58K95l8p2p9J07M7p3J50l05J95J52q1M7j02K08k25j0j67
6970a81K38p7j6K79k06j15J95R7k03O1o8j01J01J62l01l3M9K58k31j07L00j96
6992i5J19J18pl09NJ99jq5K59l42j8K34k80J82J87j13J14j19j7r6O2Q6k7o8J18
7017A06k42J64l4k7J06m7l9J3J51m4n9M0l13J5K23L3n0O8L8R4K6n23K37K7L85
7042C48k83r2M25l34N9j71q2O8J3r8J52q1j92M60l17r3J75k9K44j67j13q1K71
7065H2ok26L65k33J00j07k26L31m8j04o6J38r7pj30M13k44p3J86p2J15l3K62k58
$$ y = [60, 9, 57, 50, -12, 168, -17, -169, 206, -5, -4, 100, -247, -175, -98, 83, 66, -154, -305, 171, 25, 129, 267, 43, 108, -148, -96, 128, -38, -201, -162, -503, -115, 111, -17, 32, 27, 29, 12, -228, 19, 152, 37, 12, 24, 35, -101, -90, 60, -119, -66, 71, 0, 228, -230, 65, 27, -45, -124, -17, 30, -43, 107, -198, -3, 149, 68, 115, 13, 221, -4, -14, -181, 57, -20, -36, 243, 37, -78, 117, 214, 11, 72, 4, -97, 4, 166, -135, -168, -119, 139, -92, -199, 101, -95, 24, 142, 135, -174, -169, 30, 29, -56, 203, -139, -157, 77, -203, -21, 166, 53, 167, 48, 31, -65, -3, 83, 56, -12, 106, -136, 28, -6, -33, 73, 26, -13, 0, 151, 107, 48, 88, -225, -210, 13, 46, -4, 64, 102, 196, 222, -301, -64, -37, 348, 65, -27, 398, 64, 123, -48, -130, -62, -49, -147, 5, -76, -268, 192, -125, -218, -43, -72, 172, 5, -108, -189, 82, 76, -150, 215, -18, 82, -25, -251, 80, 32, -72, -138, 0, -97, -104, -234, 179, -65, -138, 48, -24, 91, 58, 320, 62]
7089F2r4K0J6M4n2J38j02J27j53k47L16k09j5Q2J72n2L2O5k81J62j21J70j53j3
7113h6R3j27M4r1J24J65L4l39M56n30j0O72m93K94l65J79J10J0ok0k47M7R3j22
7137a15J59m9M4K7k4p4j1K5K05J9m18P2J37J05m5k8o1Q3j22K15k2l1p4QJ64j40
7163D9n7n4j32L2M6J62O3j1p5r9r3J37R2j84J80j56O2L1J12k15J90j79r5J83J24
7188A13Q1j05k4k40M49l04K84l30J26P1j82rL04Pk46j10J91q4RP4o7J20k40J42
7212C0ko5L3j81K08j35J22q0P3j79J88N6j57m1K27l47K83N7k15K4J88J16k65J92
7236A30l36J51J17j61J66k89L47j05k24p8M60j38n1q3K45o8j76M0m7Q3J14k81
7258a84L0Q9%J11J79l02j31J97m4J53j18j40j7M11j94k7Pp6P9J22j02%j13j07
$$ y = [62, -32, -12, 4, 48, -4, 134, 32, 159, 6, -241, 75, -134, -149, -67, 105, 53, 85, 150, -131, 31, -90, 80, -73, -86, 7, -120, -76, -167, -43, 122, 156, -183, 273, -257, -267, 405, -88, 206, -159, 20, 130, 140, 134, 114, -133, -86, 7, -115, 44, -5, 39, 66, 42, -32, -43, -18, 187, 206, -212, -140, -3, 102, 57, 29, -32, 51, -71, 144, 122, 91, 17, 25, 189, 49, -8, -62, -194, -162, -116, 46, 109, 98, 23, -76, -169, -32, 60, -124, 56, -100, -38, -7, 105, -110, 80, -99, -194, -11, 113, 194, 89, 65, -175, 274, -30, 254, -76, 50, 121, -61, -70, 234, 241, -5, -115, 76, -8, 1, 75, 8, 128, -112, 30, 28, -37, -4, -185, 23, -112, 10, -70, 3, -176, 12, 68, -89, -130, 97, -250, 33, 90, -125, -101, 87, 203, -62, 130, -206, -55, 62, -99, 67, -222, 125, 20, -204, -282, 178, 40, -11, -94, 151, 83, -93, -53, -100, -17, 97, -184, -154, -65, -65, 46, 225, -77, -208, -11, -55, 98, -20, -160, -177, 234, 40, 13, 20, -56, 23, 145, 43, 43, -70, -177]
7282a77J68NJ44k01J70J8J00k07O3J64m04K73K2Q8m74J18R5P4k5p0j26k6L00j26
7306c4J01j65K42l11J19j73K62lj24k3N2m7L65j19o4k70L43j9m0k08j34J49J74
7329G3m1j29J1J18L6M2Q6pk9k10j4J26j93K55j53J44j43k38N40n7j82j74K55O6
7353A82p7j37J2j70L44l72R3nO6j9J11J8q9J19m4j38K28k62j77K33R1J19n3j68
7377i5K5K77j08l1l28L67J49k61N2l44J57J22n2O7k0j04L68l35N2J45j05l0J93
7400A61o2N4k72M11l02J95j46m7Q2m60M16j47o2J88L16m99J29J16J03k28O1j74
7422a67K23J7p0j54p3R8J70q7N0%M2J28j86NJ64j11M4O1J86l79O0j09P8R9j8j31
7448f0P5K24l73K94j55j32j17K10J11J4k60J08l0p1J38K%J33k85K06oN1k26L24
$$ y = [-177, -9, -4, 140, -61, 109, 127, 227, 20, 83, 247, -157, 116, 138, 226, -248, -130, -35, 39, 14, -56, -182, -208, 92, -34, 67, -98, 144, -167, -48, -221, 41, 38, -86, -109, -57, -104, 261, 142, 78, -192, 151, 132, 92, -116, -250, -101, 73, 32, -97, -86, 32, 68, 110, 196, 189, 160, -50, -64, 62, -131, 124, -29, 115, -28, -266, 274, 217, 35, -139, 116, 182, 105, -32, -20, -190, 154, -218, -125, -130, -64, -83, 28, 46, -43, 76, 32, -106, 122, -140, -317, -84, 7, 126, 73, -95, -70, 207, 99, 68, -260, 107, 256, -5, 47, -297, -140, -18, -70, -3, -23, -127, 241, -94, -42, 103, -2, -32, 161, 99, 153, -119, 292, -10, 185, 39, -8, 74, -386, 30, -117, -179, 9, 325, -174, -45, 71, 174, -54, 7, -167, 56, 73, 3, -151, -224, -126, 44, -43, 7, 7, 49, 177, -9, -4, 160, 49, 93, 154, 340, -39, 21, -88, -10, 89, 71, -60, 15, 239, -134, 160, 5, -127, -244, -34, 77, 91, -169, -61, -91, -162, -24, -22, -22, 111, -174, 32, 26, 77, -149, 175]
7472A75q2J41j5o9J2j53l1J00r8lJ95m29K00J21k23J72j43Q2k13O1R4J04m1J28
7496H5J52l34nq5J9J5K02k88J61K38j21J8j90R1j3Q9J30o1j8n2R5j34j82L09k78
7521a57j09K13M4k73N42J19m85K10l6k6J19K0k14J88k71N0L4j89J70p3Q6L66k18
7544A10n3k41J57k4J05j3k12N9K61j12J1J36k44J04J6l3M5J6k11L8j9o2P1J55
7568F0j79L4rM08k34p0Oj13j17J72R7j19k5N9J90k97J81k0j4n3k2J67j45k14K00
7593e7Q8j25J49J9j56K78l38L60o3k70L47j51k17K24m5n5m7L3K00k30k8J43p6
7616a7J00J12k56O7J89j20j79j6N5P3J6L72l86J69ml38J10L3j94K47n2r3k1K58
7640A25j34J26l17K52l27K59j49m1NJ55N2N2q7p0J64k64J74M0K35m37K55j39L35
$$ y = [175, 93, 234, 219, 150, 162, 9, -22, 78, -20, -23, 172, -257, -57, 64, -159, 13, -130, -48, -261, -200, -106, -2, -43, 85, 237, -97, -102, -187, -168, -153, 49, -239, -78, 160, 39, 57, -133, -42, -55, 34, 164, 103, 85, 33, 128, -6, -188, 121, -157, -266, -53, -9, -282, 260, 379, -106, 104, 68, 42, 161, 181, -33, 155, -116, -66, -32, -221, -51, -124, -38, 328, 110, 57, -184, -27, -51, 54, 41, -171, -112, 149, 37, 48, 184, -60, 44, 60, 27, 72, 88, -123, -85, -104, -166, -95, 60, -119, -85, -94, 314, 80, 10, 16, -97, -214, -42, 55, -64, -89, -30, 160, -137, 44, 24, 10, -43, -65, 102, -43, -257, -57, 31, -94, 55, 74, -82, 196, -142, 218, 155, -115, 232, 81, -136, 88, 43, -12, -59, -26, 174, -56, -84, 59, -17, 83, 195, -61, 6, 195, 75, -104, -120, -65, 8, 24, 396, 10, 179, 175, -163, -53, -20, -214, 33, -19, -112, -133, 125, -9, 117, -200, 52, -275, -16, -165, -206, -201, -46, 6, 58, -29, -99, 65, -199, -25, 15, 250, -187, 68, -71, 264]
7663B64j80R5j45J39l13J39j23J25J31k01K01l00J13O6J39k21J49Q2m48K48M8
7684HJ54k87J34P0n1j08k9J72k1p3J32j35o0n2K35k78L15p3j39J61o7j82J19J26
7708G1M9k23K38k54J01n6J63q6J10k79j2K44J2N4k76J01p1J46lq1j06P2P8o6J7
7733e7k3J31o4oJ83j41m1M6l0Mj57q0K35m1k99M27k46L33k73o8K18oj06J60j7
7758H2j35J06J33j86j47K36m2l7j17K30j39l0J28J1J3k27K6qQ3l7o7l30O00l26
7782a80OK74M9l21J09O7O5M2k05p2j17K60nJ58k43K11p5m3J05k13K8O5J87K5k14
7807c7K40k88R0j2r8m3K46n9k28K18L9j39R8j59J6j03L60j89n6J26K64l18O3J33
7831A64Jk16Q0q8P9J5J79m12L27k14O5m6lJ13o8j27K84m0k34j5J36M14l76J38
$$ y = [264, 84, 179, 34, 173, -140, -1, -124, 1, 132, -69, 132, -168, -55, 11, 150, -71, 78, 160, -288, -40, 8, 162, -125, 9, 79, 28, -80, -109, 63, 42, -31, 101, -34, -94, -146, 89, -189, 126, 53, -86, 75, 8, -174, -55, 71, 120, -103, 135, -119, -18, -74, 89, 3, 113, -166, -178, 66, 78, 132, -144, -43, -114, 32, 29, -52, -158, -86, -8, -74, -57, -80, 51, -13, -19, 164, 23, -18, 28, -2, 2, -155, -235, 0, -41, -340, 87, -159, 174, -99, -167, 51, 45, -61, 99, 82, -53, 53, 186, 0, -147, 89, 47, 10, -107, 123, -16, -46, 82, 93, 106, -121, -95, -103, -20, -57, -124, -454, 146, -180, -174, 100, 149, -172, -63, 4, 69, 111, -94, -166, -283, -23, -28, 130, -113, 98, 23, -20, 85, -128, -100, -35, 152, 177, -37, 203, -85, 5, -7, -105, -148, 98, 39, -189, 29, 68, -71, 27, -132, -116, -219, 141, -48, -104, 22, 286, -32, 31, 164, 165, -51, 29, -59, 20, 35, 214, -198, 129, -85, -20, -66, -69, 44, -24, -151, 133, 93, -141, -156, -20, 394, 18, 156]
7855A56l15J54Q0j73K13J10m57L31R0k19P6Q9j29J59N7l90n8J63j66j19N48l64
7877a64L68m6k34Q9o5k15J91J02M9J35l87L98nm27J65j24J28j18J82O2k70K07
7899B1Mj28J01M0J10o8k18J1J0KL2j07N10l46J60l23J78r1J80N0p6Q4r1%l6l2
7925b3R5O0j28J35Ok38L07m59J94K05n9R8M5j92q2Q8j82J4j9J83l70P06l95J49
7949A38j54o1O0k11J91j76L14q6l52M17k8l08J92j32K02l9j21J18J99n4k54K56
7971A11mp4j90L09J4j81N5l4M6j42Nj11L05N2k70L90l25K6P8Pp3P8j24j6P3J10
7997A15r3q8j79Q9p3K71p5J89k17m8J51M9Q1j70j0R1J76k74K32k71J5oL34k88
8021AQ8j53J82k98p9K68J07k00K46j09j05J47m9K24j61q3j92L08k53m6R4M9j83
$$ y = [156, -159, -5, 75, -98, 115, 225, -232, 99, 189, -30, 46, 135, 6, 165, 222, -168, -226, -63, -229, -348, 200, -164, 204, 158, -76, 13, -52, -267, -76, 26, 75, 210, -177, 221, 216, -211, -46, -170, -42, -160, 22, 84, -186, 21, 25, -103, -2, 38, 148, 80, -138, -127, -117, -115, -83, -190, 320, -26, 134, -189, -11, -102, 78, 128, 52, 136, 45, 45, 9, -23, 72, 132, 4, 139, 145, -93, 214, -245, -51, 154, 95, 193, 238, 46, -36, 52, -130, -116, -135, 48, -322, 384, -11, 138, -16, -77, -17, -228, -37, -213, 101, 15, -337, 80, 52, -256, -64, -196, 6, -33, -154, -36, 163, 109, -145, 111, 107, 33, -157, 152, 166, -15, 40, 6, 52, -90, -85, -196, 109, 161, -109, 281, -44, -18, 60, 67, -6, 72, -52, -68, 5, 115, 22, -66, -245, -156, -229, 42, -33, 156, -61, -109, 42, 91, 172, 2, -8, 83, 259, -15, 217, -54, -39, -45, 289, 1, 89, -64, 118, -180, -259, 9, 116, -84, 162, 53, -52, 95, 46, 270, 109, 26, -166, 142, -111, -157, -63, -14, -197]
8044a97K68J06o9L0j83Q4M7n6n7k09K60j75k8J30J79j37j23J17Q5mk02K44l6l17
8068b43J40P0J83k36J96j06J21k39K81k4J29j20j7j84K05j46j68J78L8lk81J18
8090a08j16l5J28J29l3J65k56J91l0p5Mj40K12j23N7J38k6r3Q3j29K09k02P8N6
8114H4n0n4j02K82k93lJ28J20L2j24r4J26j25K14m19J99K21k60J12O0K8k0L5o7
8138C0j7Q2m17K62K18k14l09L54l5l2J69k36K24L3k36K01o1P5J72l12J94k64L33
8161B14j29J68k94O5K27N4l74K9N1P2p3J2m2j53J66J94k19O7k6j36K71m64M91
8184A71K0k19P7J55j06Q9l80
$$ y = [-197, 71, 177, 108, 138, -45, 39, 86, 30, -27, -236, 24, -151, -179, -49, 130, -7, -130, -13, 72, 68, -134, 110, 74, -243, -103, -33, 150, -86, 110, 4, 125, -114, 167, 143, 272, 152, 135, -49, 156, 10, -158, 20, 58, 55, -226, -108, -224, -259, -131, -2, -35, 130, -126, 65, 35, -40, -36, -176, 36, -87, -30, 108, 82, -11, 72, -57, 152, -50, 28, 84, 34, -20, -122, 160, -133, -136, -8, 112, 144, 20, -74, 52, -73, 141, -278, -79, 142, -118, -6, 54, 82, 62, 97, 30, 13, 95, -322, -60, 158, -56, -365, -11, -46, -78, 91, -145, 79, 112, -124, 77, 16, 91, 263, -49, 145, -119, 214, 85, 253, -41, 24, 251, 305, -69, -40, 11, 83, 10, 22, -20, -173, -7, 187, -32, 35, 9, -127, 144, -320, 171, 191, -28, 49, 204, 98, 187, -193]
8191a93
$$ Imaginary data points
##PAGE= N=2
##DATA TABLE= (X++(I..I)), XYDATA
0@%%%%%%%%%%%%%%Qj6J6j6J6k1K9l2L7m5N1n9P2q3R1j04J20j37J56j76J98k23
36a18K51k80L12l48L86m29M76n27N82o42P08p80Q61r50J045j150J270j404J553
55H16j720J913k136K396k705L080l548M144m930O027p658J0312j5340K7914j11907
70i3342j62267L77618M5915k58351Q6546J39564j76150q595J79139r5526j48282
81a13731J42225M9433j44271K6287J00929o4607l3955N6703j6706k7668M9618
92B4257k7387p6980P4987P1191j16102l0358J28749j2368r1429O7561N5438q0454
104a2895l848O6181n6445k7399R4014l9340j09355P8859P7443p0305j2994L0890
116A4806l6458L3388O8819r0449p4909J17228K9891j31244J7818R3167o5585l6210
$$ y = [0, 0, 0, 0, 0, 0, 0, 0, 0, 0, 0, 0, 0, 0, 0, 8, -8, 8, -8, 8, -13, 16, -16, 21, -24, 27, -32, 40, -43, 48, -56, 64, -73, 83, -93, 105, -118, 133, -147, 165, -183, 203, -226, 250, -277, 305, -337, 371, -409, 452, -498, 547, -603, 667, -737, 816, -904, 1009, -1127, 1269, -1436, 1644, -1904, 2240, -2690, 3337, -4321, 5991, -9349, 18565, -93342, -255609, 122009, 167924, -90427, -3881, 135683, -40467, -49062, 130077, 34551, -113731, 28494, 77927, -66344, -40057, 60872, -3735, -37690, 19013, 2307, -25361, 24257, -3130, -80110, -5123, 66068, -50034, -80392, 48357, 35989, -55440, 12121, 67559, -12895, -16743, 49438, -7007, -34406, 59608, 20268, -89087, -10228, 67215, -3090, -16084, 14806, -21652, 11736, 80555, -9894, -84803, 32425, 62316, -68928, -51110, 42057, -23528, -59738]
128e9738Q4286p040o2150N1542M5969o9170j6046Q2179p158p7259J4407M9898
140B9720j0731k4204J039P053L546R11o113J47J1608j9399k7108L4207J8642m3661
154b4343n56K9064k1715N584N0216k6675o0148N0146O1501n9143l9542M5698J011
167A1098k0801K0430j4103k4062L6392J3003l8458O660L4950j9892j7462K7771
179A5526j0742k1817L4712o66m8276J6819M2819k5659l0888K7856J6666l0738
191a4388J043L0265j5950k1417J8745Q604r425K839J259q917O004J8001p987j3870
205e194R324q55j987J8819j6780l0057L0776K3367l9089j2679L7655l266l2043
218b2009K0227J7139l0042M216K6533k0972j3814K5185K920j8302J498J0272r71
$$ y = [-59738, 24548, 17508, -44642, 6900, 52869, -16301, -32347, 49832, 42674, -34585, -20178, 29720, 18989, -5215, -4176, 2877, 6423, 7334, 1221, 1368, 12976, -6423, -33531, 676, 19318, -24343, -24899, 4165, -17550, -11966, 38250, 11575, -48573, 1573, 63074, 3931, -35611, 10087, 11098, -9703, 10727, -3376, -27438, 8954, 21957, -16501, -9841, 25109, 5217, -12245, 15526, 4784, -17033, 17679, 17013, -31263, -14444, 28375, 2716, -28172, -316, 16350, -14388, -13345, 16920, 970, -20447, -1702, 6902, -2523, 316, 1575, -7342, -1338, 16663, 8676, -5194, 4130, 3275, 1288, 20107, 3327, -26730, 4046, 27413, -11676, -24355, 13300, 10034, -22009, -1782, 15357, -14685, -10469, 16064, -4908, -18722, 6463, 9383, -8919, -7421, 2851, 1880]
231A880J045J751j0039L474J5636j0683q810J5163k004j4032R530J1986j4276
244F21j3402J7200O796k1165K578J4749j4548o699J8089r86j6071M059J4310n545
258a4n982P228k885P43R747r937n003J6529k524j2403R226N321j2247J894J3688
273A3381j1555j4040J7515N540k0198J601J1772n803m405L931J34l742J473N043
287F47l035k074M326j609J740M037n201K66O717j625m508K551N241n725m653J0562
303G657p53j2651O590P334r335l244N174j402m121K331J509o910K489O930n559
318c961q47N532k811J638M378m869j153N785J061o042j14P227l232m110O785r93
334D274m598N029O00n025n50J872p13n540P79K908m768P73L374k487J452K431
$$ y = [1880, 2925, 4676, -5363, -1889, 13747, 3064, -5746, 9417, 7413, -6619, 2911, 14897, 621, -12781, 4419, 11215, -9950, -7372, 7377, -7171, -13870, 4219, 3233, -12838, -8779, 5531, -14, -5996, 1232, -1653, -910, 8837, -1100, -6103, 10426, 7902, -4501, 4725, 10046, -2201, -307, 13381, 1826, -12214, 5301, 10841, -9357, -7756, 4016, -1787, -6192, -2261, -2127, -5869, -4396, 647, -2388, -4462, -136, -1745, -5, 4032, -1169, -903, 5814, 4189, -319, 2232, 7473, 1748, -2905, 7657, 6904, -5747, 843, 8177, -1158, -4402, 772, -630, -4751, -2420, -911, -7821, -5332, 1598, -3961, -4808, 724, -2087, -449, 3929, -940, -2093, 3692, 4753, -1289, -1403, 5824, 2592, -1518, 5267, 4274, -324, 4705, 5305, 280, -270, 1602, 889, -4651, -3872, -964, -5732, -4959, -1585, -4072, -2620, -189]
350a89j760K018J227j203j949J176L107m020j285O309k216j555N973p57k816L362
366E422J441l291m142K443J29o204M66J374l693K153K065k302K360J072o30R99
382c38M75J31l332L14L831l837L10N462k214L46N015J11j470K33J507k546m614
399f16J926j576n172J054P5m47K838o81n86K901J850r4j715J83J29l262J370J973
417A50l547R74K795R3K693J282P7m77j715K668o98n181q51l79j6J014j949M59
435b608K465M99O27j88J412L78n392M46J512l128n8m06k276M238M040k59j00J778
453B980K545q7K31r34m691J204Q13n840J819L722n226n81M290K719q83k558p14
470a191R05J230k62m819j477L699k07P39K39k77L669O57k065K314O8j873j226
$$ y = [-189, -1949, 69, 1296, 93, -1856, -680, 2427, -1593, -2878, 3431, 1215, -340, 5633, 4876, 2060, 5422, 6863, 3572, -570, 1873, 2002, -4202, -3736, -2362, -6055, -3902, -1837, -4139, -1779, -707, -1337, -338, 137, 268, -3064, -2750, 1081, -2756, -2446, 3016, 802, 1148, 6163, 6274, 4804, 5037, 6544, 3998, -616, 1310, -266, -5438, -4384, -4309, -4756, -1918, -2599, -3185, -284, 1566, 1472, -243, -60, 69, -3193, -1823, 150, -3397, -2423, 372, 465, 3158, 4440, 4517, 4040, 2325, 4993, 4295, -886, -1737, -2116, -2132, -1118, -3067, -2608, -143, 356, 983, 795, 2207, 2585, -2807, -2361, -849, -3977, -4035, -4441, -6717, -2479, 1561, 1302, 1202, 2980, 5525, 5438, 5669, 4735, 44, 1248, 2061, -3779, -1960, 1762, -3464, -4045, 245, 2964, 2081, -477, -1191, -286, 944, 682, -4137, -5614, -1915, -2122, -1383, -1144, -1421, 2248, 2905, 840, 3154, 3222, 1349, 123]
487A23k874J313L191k556l727J302O427J748l315R47J15M91K721m684l884L974
503A312l458m039K716J183k038J32P58M99K381M394m689m098P287L105n236l36
519a27M18J688K511k336p60K935R9k389j363Q52J336k924m121k151L718M077o007
536d544l381M974K214J829L54n178J723N937j518l323N63J827j054q62J544J080
552B185Q85k018l563N816N191p027l035L104p31J621l52o327m91M915M46n244
568d625m49L630p41j703M99J50M703r6o468L856O476j415j514j379L43M493J012
585F772m391k694L694L28l731r2J75k371J322j810l249M867Q58n588J40L788K396
602D14J70l528k67N530K408m274j790N373o62l629L317j024k791M270j467m782
$$ y = [123, -2751, -1438, 1753, -803, -4530, -3228, 3199, 4947, 1632, 2579, 2694, 3185, 5906, 1222, -2662, 1312, -2146, -6185, -3469, -2286, -4324, -4192, -3434, -2935, -554, 3840, -849, -4947, 2340, 5445, 209, -127, 291, 1979, 4490, 2154, 1394, 4329, 4428, 2039, 676, 1528, 2864, -60, -4181, -6332, -2614, 1463, -4544, -7925, -2951, -737, 1092, 1446, -3732, -2009, 3928, 2410, -913, -350, 1477, 423, -439, 1105, 2185, 3070, 1052, -2511, 3305, 8496, 1469, -1566, 1538, 807, 2428, 2076, -4251, -4742, 173, 619, -4625, -5074, -1444, -2185, -3888, -3389, -3239, 1464, 1368, -5100, -1244, 5232, 3817, 2303, 924, 1267, 5760, 6772, 2381, -313, 3381, 3709, -22, -114, 61, -2310, -988, -2798, -6047, -1180, -322, -5910, -5770, -1982, 414, 584, -2944, -3211, 2319, 4727, 453, -1337, 4036, 3374, -255, 3062, 2038, -753, 3517, 2050, -2732]
618b732M707K944m759l193K457L163q30l678k640J214N199k191n355K658J891
633a145k44J897k490L45L071j428l43J920K01m46k48n11Q95K993q91n203J450
650a77N608l802k750J848k280J064O79m429Q23M435k937l091K795L510j698o55
666a057N00j640L250L201n431j491M644k58k31m86j439K132J460k259k62J485
682B118j87j994JR08j171L25o88k973L529J589m816P44J860q24J104n63j129J699
700d68J601j759p84K840K24j759J591L69j161K681j208l343L428J299l374j50
716B7lk31J228j383k239L06K683j665k157K369J33j899K541k28j533K458m98m39
734e30J188OL8P10j085N83J357J52j465R7K262k207j559K153j230r04L33k519
$$ y = [-2732, 1975, 4919, 160, -3033, -576, 2587, 1757, -1921, -4561, -3347, 1852, -339, -5694, -3036, -1145, -1389, 508, -1982, -1637, 1434, 6, -337, 1583, 1784, 1338, 1090, 579, 1474, 4467, 3576, -1627, -177, 5431, 1629, -1121, 727, -1553, -489, 190, -4239, -3416, 1019, -1918, -5009, -2214, 1296, -402, -1057, -557, -2197, 1053, 4254, -1177, -2668, 1976, 1718, 1487, 1001, -438, 1694, 3154, 895, 633, 2118, 1931, -63, -62, 846, -325, 0, -688, -3661, -132, 1457, -3359, -2615, -755, -1579, -475, -1038, -2167, -468, 1133, -626, -1410, 1430, 1654, -105, 1486, 1855, 694, 3375, 2167, -1176, 2252, 3551, 177, 27, 24, -207, 1021, -362, -2601, -2295, 388, -1277, -3434, -1065, -932, -2831, -290, -518, -2051, 407, -91, -530, 658, 664, 702, 1412, 327, 910, 2267, 2419, 954, 1051, 3313, 1106, -453, 1700, 470, -434, -101, -2620]
752b620O05K016k588l09J456o5l32J238N31j904J541K309k643m28L078j494l07
769H4J564j232J347P28j576P05N82j003r66J86N56k345m50J719j650j58J299j255
787a865J162O09j302J553m37j485J464N23j305j10J243K54q84J089J811r64O84
804B040L65j406J327k47k449J379k84k152J006J46j045l42J285L26j223K83O52
821c39j431R06M1r89J046k11k55K245o19m72J636K03L5l6n7J47p99Q1o57p13O09
842C71o14j047J417q51J59P34j044K08O94j094l77L47k34k18j13J123k97J55J254
861E73N7j58J798j093l76J216p97J20q5q36n6J32N28p89j009J287l49r33P03q73
881i40l77K92r05K75M31n78P45L38j68J057qO49J10k52J106l25n33N29m66l1J20
$$ y = [-2620, -2015, 1, -2587, -2896, -1440, -1505, -1837, -599, -68, -1972, -431, 1878, -765, -1193, 1885, 391, 84, 1648, 416, 1763, 2491, 915, 1620, 2202, 1199, 233, 419, 975, -1370, -1820, -101, -1751, -1909, -610, -1865, -703, -94, -1396, 157, -280, -1765, -301, 222, -1083, -1193, 50, 304, -580, 509, 2320, 1356, 2040, 2405, 999, 2326, 2079, -370, 1009, 725, -1427, -421, -275, -1320, -1662, -377, -51, -1274, -991, -339, -1770, -864, -823, -1812, -766, -977, -1232, 1013, 394, -78, 1558, 1761, 1796, 1760, 1703, 1850, 1051, 1132, 475, -238, 371, -243, -1290, 127, -724, -565, 169, -875, -667, 27, -1067, -1444, -1097, -1331, -1549, -1662, -539, -836, -681, 573, 630, 472, 2270, 1177, 801, 2017, 1220, 1340, 1255, 419, 363, 495, 1023, 234, -775, 512, 163, -770, -67, -940, -1317, -1025, -1930, -1655, -1224, -1802, -1057, -719, -887, 170, 162, 811, 921, 669, 1775, 1450, 917, 1446, 980, 949, 1069]
902A069r05J073l74j757J402K4j174j76j06L25q06j57Q56o32O4O55n75P46J66
921b82j69R92M22r66J356J02j23o80J15J030j380l90J572j079j030O60K4K30j112
940g08k23J413r92m77M79r04K39M21n59O72o29J24J083j31qP40K45L67j202M04
960C54J968j251r67J013j27l24o25N81O15j540N4R21r37k95o3q70M27l45L93L06
980g12j245Q73J027j75l0k41J206J275j447m35J395q13k21J21M41j41n93M49j01
999F33r09J412j12j406J0k6N39m46j721O11J128r35q6J02R48k5r54J038J064q71
1019fj20K84M59N64o31m5l4k43J985q7k128O28R75n62r81j091R46J91j566j38
1039a600K15N84J1j479J592O52q97J465n32j165J490P27o56q28O26J575p22p74
$$ y = [1069, 164, 1237, 863, -894, 508, 532, -642, -818, -924, -599, -1405, -1562, -706, -1338, -1274, -619, -1194, -448, -282, -451, 541, 963, -3, 1353, 1455, 1332, 652, 767, 1797, 417, 27, 1599, 520, -510, 150, 174, 404, -708, -931, 482, -510, -987, -508, -1412, -1173, -752, -1311, -639, -1268, -1144, -61, -192, -200, 540, 785, 1152, -50, 354, 2322, 1071, 104, 1117, 990, 666, 41, 622, 1237, -303, -249, 672, -265, -560, -623, -1493, -1066, -1411, -1018, -712, -1957, -1084, -57, -232, -262, -503, 703, 1978, 531, 96, 1491, 678, 457, 578, 1019, 878, 285, 734, 633, -276, 1136, 1024, -382, -372, -398, 141, -305, -2026, -1415, -287, -1222, -1308, -1206, -258, -283, -1237, -199, 865, -6, -126, 158, 617, 1181, 550, 505, 471, 228, 2213, 2126, -2, 626, 1601, 1039, 58, -1033, -87, 104, -1462, -1600, -1385, -801, -790, -2269, -677, -25, -922, 543, 11, -1154, 336, 1063, 407, -421, 205, 1780, 1058, 284]
1057B84R61n5K08o84o46J841j035k129J070N48p94j40n78l91J39R65M4j344R6
1076a640J744l46l08p04Q75J880j796r85K983o4j445J21R90Q89p54p78J68m65
1094C65M49k25q23k46j126J174R53k375r3K465j313j489J480R08n46j021P36J430
1112G03Rr45j33J261Q67j229J73Q55j434P13J109j827k07J130m43q31p27O88J019
1131G51j453p74J28J464k84k146J268J575j771M38J032j030M37Q67k05o4L38K47
1149H18K31m95M54J74L81j278j108K292K79k840N73O82n24n3l33m39R66m27n52
1168a199N24J34p9k27N72l98j87K083j124j383K073P49j203M24r6L82P69j197
1186F17l26O98N0q43m73Q32p94q22J293j238p75J811p50j130J395l1k16J83o02
$$ y = [284, 1245, 1190, 1398, 714, 68, 1909, 874, -1255, -185, 363, -431, -571, -1149, -1540, -1401, -436, -392, -1736, -1640, 104, -242, -550, -1254, -379, 1501, -295, -1280, 1703, 1639, 194, 315, 1305, 2194, 1440, 662, 830, 365, 814, 589, -234, -480, -1606, -432, 521, -1854, -1947, 518, -795, -2284, -804, 104, -442, -1463, -727, 703, 712, -233, -366, 895, 1762, 533, 706, 1561, 127, 840, 1949, 122, -85, 1045, 602, -229, -956, -268, 751, -702, -1476, -1348, 116, -168, -2314, -1046, 529, -1242, -804, 228, -802, -365, 502, 297, 233, 571, 818, 1049, 554, 1008, 1182, 1563, 285, -823, 1469, 1748, -1092, -519, 163, -361, -414, -747, -1186, -220, -647, -1199, -675, -541, -620, -847, -275, -673, -860, 1223, 99, -1284, 789, 1538, 335, 759, 663, 1045, 1814, 617, 291, 989, 1039, 196, -277, 555, -239, -1061, 232, -1006, -1781, 30, -720, -1850, -455, -486, -702, -519, -1121]
1205a121J195M82n63k88P90J071j544Q7J741j039j22O99j131O4J056j044n78M
1223b41k24O07k09j113q2J428j32j841R65R71j539M10J203p30J23Q23p19Q57K12
1242G69m63M43M11m58j13Q00k10j462J241N59k211M95J140j476j49K14p15J151
1260c4n53r08R54K52l82k37N96j19n47J447p3j083J378P16j281N36Q1J17O39q98
1280F01l82R03m85j267M42M78p02q79J351j97j207R34q6p24Q03m3j72M14o09K88
1300e39J093o40o23J044P61o86n07J453k05q48P93m53l18M88q66lP93r95qL64
1320I8m43p99O05M71j023p7P18m0l98N02l53K05P94o93O90O83r01L82L03l46J88
1341E66n0K81k28j67L40r23N65J64j109K27N21j357R07l6q71L94K98m38j07M07
$$ y = [-1121, 74, 556, -7, -295, 495, 1566, 22, 109, 1850, 811, 689, 1388, 257, 321, 1377, 333, -245, -241, -465, 142, -67, -1180, -1262, 166, 34, -1807, -842, 129, -1410, -1000, 203, -527, -404, 419, -300, 557, 769, 306, 749, 1160, 702, 589, 1389, 1179, -283, 958, 1517, -694, -199, 941, -535, -684, -470, -1185, -34, -587, -1495, -541, -289, -671, -908, -312, -431, -978, 469, 396, -687, 691, 1407, 126, 662, 743, 860, 1499, 601, 219, 1122, 637, -630, -188, 290, -412, -1291, 60, -137, -1344, -410, -496, -1220, -417, -460, -632, -218, -827, -539, 554, -86, -709, 335, 1096, 410, -97, 1356, 1151, 303, 1096, 643, 325, 813, -53, -56, 737, -258, -266, 98, -345, -1144, -539, -68, -1091, -1168, -450, -490, -888, -386, -739, -534, 260, -433, 257, 940, 39, 421, 724, 378, 566, 516, 797, 569, 402, 742, -181, 384, 548, -561, -334, 187, -1170, -263, -299, -1170, -776, -478, -916, -1023, -616]
1361f16L81k79J98M42m74M68O35m86N60L38r68P83K56q29M67j81m55R8k58j15
1381c5m59L13J14p59J50K79q39P29j63l92Q36k11l46Q99l50J11L94r5M07pR6J18
1403G90l10N81Q2j033N70k94q3N55j233j29P03n67l55J69j34Om23O19j58k24N71
1424b97r2j93N99l68N07M05m28J32P43m92J15j85M38q2m15M40j16o49K26j07l83
1445b02K39q26M38N2n28L8j19l33Q57l26L40o8k2P77j61l25O97j15J06K9k76O44
1467I16P4p36N37j7n28L44n81R8po05K30k81k09O6o3P0L6l98P91l85l13Q69p2
1490a64J31k05K22P42k68j36M03k90M63k7m43R9P6j99J34m07m18N51n54j30m58
1511h78N25r0m27l76R52m55RJ96J39K86n6J50L54m18L13L97k79L34j48k86J85
$$ y = [-616, -235, -514, -316, 126, -348, 120, 755, 269, 829, 1167, 199, 982, 1238, 409, 876, 695, 240, 338, 80, -35, -494, -181, -67, -826, -676, -397, -1236, -507, -670, -1062, -226, -437, -783, 116, -234, -123, 271, 176, 583, 576, 672, 790, 480, 1061, 1143, 110, 680, 386, 303, 858, -375, -504, 199, -368, -723, -554, -688, -682, -1105, -486, -644, -868, -297, -389, -582, 17, -351, 156, 561, 133, 265, 1008, 516, 631, 446, 884, 802, 387, 827, 711, 62, 288, 181, -202, 37, -789, -351, -299, -827, -789, -908, -1241, -384, -710, -370, -438, -460, 317, 156, -169, 528, 413, 519, 548, 272, 916, 990, 254, 791, 774, 246, 590, 9, 107, 100, -505, -275, -556, -765, -699, -762, -692, -656, -1054, -263, -648, -961, -92, -164, -33, -238, -16, 726, 458, 322, 725, 435, 898, 871, 428, 527, 603, 404, 538, 131, -287, 264, -290, -420, -878, -353, -443, -870, -1246, -294, -749, -740, -544, -405, -119, -175, -25, 329, -89, 224, 621, 342, 676, 528, 242, 427]
1532D27j8P2M0m41j28N8M6L16p84m90P52l77l28L93j66Q8m2j12N53m02M65K70
1554A92l86L03L88k26L64l50L33Q2m45J51M94m89j86l96N36J70p89j69N73o95
1574e45R7n7k14K21J89m1k71m28P68J58o6K3l7P11K83q39M15M89l73O9LL17m09
1597D63l06N16k37l69J44l89k90j37j66N27l33m80O48N1l32K15K58k0q4k60Q75
1618B94K76m26K49n6M78K22p74O98m38k36O55n84o22L79m4j70k33o5N9K17q11
1639i32K55p3L77j37l51R69l79j22L57j53n0P10l5l6J95P2K72n34QN4n9J56q25
1662b61M92O08j150m04P15j09n88J68l09L91J70o32K73R2K58r4J28J50j85O41
1682C54M52q94J76J230q01o5r2L56ll30m87K91J20j52m83L5M20j005J29P47o03
$$ y = [427, 409, 481, 521, 80, -48, 10, 56, 372, -412, -902, -150, -527, -855, -462, -628, -540, -582, -694, -141, -543, -78, 192, -194, 109, 497, 271, 635, 285, 618, 700, 255, 406, 900, 411, 225, -171, 365, 535, -254, -423, 150, -545, -448, -505, -719, -498, -309, -350, -621, -1049, -281, -123, -189, -166, -203, 508, 791, -48, 367, 856, 483, 552, 555, 872, 463, 157, 673, 436, 67, 211, -178, -468, -605, -771, -244, -577, -1057, -409, -358, -690, -475, -217, -237, -321, -581, 294, 570, 144, 393, 337, 815, 1037, 263, 961, 523, 287, 942, 358, -264, 115, 71, -99, -332, -397, -338, -121, -932, -677, -750, -373, -510, -861, 108, -271, -393, -36, -189, -239, 471, 436, 400, 595, 667, 939, 405, 413, 467, 408, 564, -261, 231, 839, -311, -715, 0, -109, -697, -529, -838, -447, -277, -909, -636, -544, -286, -380, -252, -102, -287, 354, 806, -88, 88, 1318, 517, 452, 360, 716, 713, 383, -104, 187, 307, 155, -328, -293, 127, -878, -749, -2, -605]
1703f05K77J59n65J18N74o1j87%K13O77l16j96k13O59J23p86J19P43o16M64J45
1724G26q00N17K05k66m11k09J39j17l59k9J27J31q0m95N30M44o60L30L83l03L27
1745A30j95J94L36l75%O26NJ71l76L74l76l73O28m70j214Q47l2o34M96p42M40
1766e40J60q5r9K57K02n5j87L90k03j62Q55n40k44Q68m2j51O21o74L37J44o58
1787A94J6M51l49o54L87K36p08k62Q31o10j22M90o80L05K33m74K94j05j84M94
1807b17L46k93J97M57N95j013N17Q01o70j09J79n31L1j09m15L80j49n34J24J51
1827b62k37O1L44j97n40K88L55m54M03L34l00M65m9j52M89K3k41L69l7j23n6N6
1849E39Q7q08N80j61l57K61j02l17L14l14m53P45n20j34K80J05l46J62J04K15
$$ y = [-605, -328, -169, -734, -616, -42, -103, -290, -290, -77, 600, 284, 88, -125, 534, 657, -129, -10, 733, 117, 581, 726, -74, 443, 648, 382, -29, -238, -99, -216, -575, -604, -477, -346, -426, -921, -391, 53, -607, -277, 106, -197, 130, -65, 129, 465, 90, 90, 716, 721, 892, 516, 890, 514, 141, 769, 299, -915, -68, -100, -734, -238, -980, -540, -380, -465, -564, -307, -105, -160, -347, 43, -160, -322, 533, -7, -251, 617, 575, 424, 1045, 371, 708, 852, 194, 210, 661, 312, -342, 45, 281, -427, -689, 142, -468, -590, -100, -780, -475, -242, -716, -422, -527, -711, -217, 129, -164, 33, 490, 1085, 72, 589, 1390, 720, 611, 790, 259, 290, 181, -234, 146, -3, -537, -413, -262, -499, -438, -94, -291, -831, -543, -188, -642, -239, 95, -205, 260, 211, 59, 548, 571, 330, 699, 662, 539, 483, 539, 626, -182, 398, 237, -120, 141, 39, -278, 36, -278, -731, 14, -506, -640, -360, -255, -601, -439, -335, -120]
1869a20l08Q14Rj2M49n38j37N64k68O2K11l35j30L11j76m39p4N4j2l0Q3j72l73
1892e67J67k19k01N78n62L81O17p69N77K63k99K62n2L26P6j43J17k82R3K60n79
1913D4M03P3n18J43q7j75N6j29k38J25l68K90m2K2M7k02K21L07k72J90M2j68M89
1936B53J53l12L57J17k93L50j71J32m00R4J28m05L05k41n40N01p3m09L75k80j82
1957e41L55k18j25L0K79J4J05j0O13o52L61J49OJ91k89j54N17n15J03j63J79j6
1979B19K1n0k04k18j19j00O7L30m17j89M80m38L67J49l12J62L96q9k2L6J26L33
2001E28k25O0J18j45J98l27j14K90l57J08k3k97j25K40l13M22l95j72J29k58M07
2022b51k35M3J19J33p2O72p19O03J88m94M91p1j87K55l1j50K5j44K40l46n4K76
$$ y = [-120, -428, 386, 395, 383, 832, 294, 157, 721, 453, 515, 726, 391, 261, 572, 396, -43, -117, -63, -75, -105, -22, -194, -567, -400, -619, -820, -242, -804, -423, 194, -575, 2, 265, -34, 228, 176, 502, 578, 435, 552, 270, 363, 623, 44, 447, 520, 2, 145, 58, -117, -61, -190, -428, -303, -671, -381, -423, -401, -354, -556, -335, -28, -300, -110, -68, -236, 253, 406, 94, 451, 568, 275, 625, 454, 586, 186, 280, 408, 3, 308, 67, -473, 28, -45, -454, -79, -359, -541, -186, -404, -529, -499, -220, -206, -101, -111, 502, -150, 211, 360, 366, 557, 268, 114, 631, 116, 219, 56, 235, 219, 240, 190, -14, -232, -351, -451, -384, -54, -471, -660, -180, -618, -251, -102, -414, -252, 144, 55, 33, 69, 195, 528, 303, 363, 481, 336, 534, 207, 93, 383, 26, 134, 111, -186, -311, -71, -384, 38, -357, -529, -400, -658, -251, -486, -443, -324, -191, -263, 409, -310, 293, 481, -13, 478, 407, 220, 475, 444, 294, 319, 175, 415, 69, 15, 291]
2044B91l40J89k60k01J2R0k07K41k26OOk70N75j33j84M66j37J00L21j69L68o8
2066D70l39N94m08j51K57p6j5l15N3K16l36l96M07l21K18M8o18K27J22j17K15
2087b65j37K84L73j3k85J81J10N42n17m53R94n34p9L97m68L49l77p4M06m32K6
2108B8j07k22P6j34k30L36n10K78L71l53M0K94M1j06r8M98L46k13l0l1J92J73
2130F39rJ8q2j56J47k20l00j28J5m75L25o12K15J55j92J03J62R8N1o1K49J69p6
2153C5j6J17JL39k56M3O7J64Q6j87J0k31K77j23k71m00O13q8p29M06K57m14J36
2176a64n20K75N00l34M5j16RL15l84M03P6j14K70j23N2P04l87Jj54o2o3K62n69
2199g8P7J63k04k76L4k4J68j70L00l95J14K78m69K11L19n6L33l75J18J47J81j90
$$ y = [291, -49, 140, -120, -321, -309, -219, -426, -185, -411, -405, -399, -669, -94, -227, -411, 55, -82, 18, 339, 170, 538, 470, 131, 725, 317, 166, 423, 347, 332, 17, 70, 286, -50, -446, -39, -360, -142, -94, -712, -485, -363, -480, -265, -402, -118, 255, 242, -43, 138, 248, 790, 273, -180, 814, 280, 201, 598, 130, 479, 102, 28, 434, 2, 28, -79, -301, -225, -359, -589, -253, -763, -485, -114, -467, -427, -133, -92, -198, -296, 202, 548, 335, 305, 274, 466, 639, 630, 648, 566, 410, 557, 337, 37, -91, -76, -551, -226, -838, -623, -468, -660, -557, -395, -297, -246, -307, -58, 111, 35, 19, 136, 137, 476, 220, 263, 330, 494, 580, 393, 403, 172, 449, 326, 55, -345, 268, 180, -549, -143, 114, -300, -164, -684, -409, 91, -243, -198, -314, -305, 10, -374, 29, 105, -9, 261, 138, 190, 894, 507, 508, 354, 292, 229, 491, -78, -1, 162, -42, -318, -284, -308, -140, -310, -10, -405, -291, -13, -482, -271, 48, -8, 325, -50, 68, 215, 396, 206]
2221B06k01J06M69k69l62N94l89r8m4J47n15N96o28L93j90LM49o53J10O4M5Q4
2243h3m40K66L68p02L47M31r0J25J38l23L25n5j55J59K5o3K10m04J18j37L8K92
2265C90j038M84K11m06J74k60j24L95k7n04N19J22j26k0J77k0k3J34K23k55K56
2286B82L06l41Q0J91k90L17o33P2M29o72M22k36P7l3m77M27j87k39K51J31l83
2307e06K44k07J69L34k76K36J52j01N0J21J69L93o08N06l15k41L78k48k00K37
2327B87k90j17L0j93l62L90J44l28j52K39O5l47M39q1oO32m05j65N88l66O7O08
2349F77l46k78L33L1k96L0L60m04j14N16o14k97K76l39J71J75k44k6L45k45L85
2370I6k39j13M3M41k07j59J44L40l34M27J72m79J41Q7k34K70N0l65L27n00J21
$$ y = [206, 5, 111, 580, 311, -51, 543, 154, 56, 12, 159, -356, 240, -388, 5, -185, -182, 267, -386, -276, -212, -167, -83, -523, -257, 111, -591, -244, 187, 97, 222, 360, 37, 362, 307, 152, 311, 336, 273, 483, 79, 197, 60, 98, 390, -648, -164, 47, -359, -185, -445, -569, -174, -201, -705, -186, -64, -190, -210, -33, -53, -76, 58, 281, 26, 282, 588, 247, 327, 518, 228, 545, -88, -16, 413, -259, 163, -73, 4, -29, -506, -79, -266, -505, -254, -123, -506, -262, -469, -300, 34, -242, -6, 146, 45, 95, 216, 385, 778, 170, 676, 361, 120, 498, 250, 50, 287, -3, -120, -90, -283, -645, -255, -111, -439, -591, -352, -287, -634, -195, -276, -282, 350, -55, -220, 368, 2, 69, 677, 331, 53, 386, 417, 121, 151, 511, 107, -7, 509, -105, -402, -126, -465, -294, -119, -363, -389, -44, -289, 96, -143, -256, -213, 228, 21, -138, 6, 346, 12, 439, 611, 132, 273, 360, 126, 396, 446, 81, 408, -92, 29]
2391B9k37J48q6n33N21K08m49J42J14l96M10m8m08M57K40n48P65k93KJ91J73j4
2413C88j85K08P5k57J07j49k60J46p0j44J23p9r8J67m02M6m0K83j90k03J97L09
2435b8k73J99nK29M5J86j28R0k59K05J85k15K30k04j65L5k5n0R5m21N14l38j30
2458b28K65l35j23K46m87L96M6K57k38J47k3j52J99K80JK15Pj84K2K73l95O2J33
2481C84k57R3ll38K43k70j9r6J33K6m15K80l7k79L01K67k59J20pk67N27K4j15
2504C6K63o7J29l7j29L34l43L30k69q9J2k10o0K67k30j13J30k9k96J94n1o7m2
2527c37J83J3k2K71j94j42K03J69l98L54j22J62L0L3k6jj59L35m25K01J19k02
2549D5k65J27j2O1k98J42K37l77O0J90j36J30q4J7K23K7k07p5M59K34n97K61J84
$$ y = [29, -208, -60, -146, -679, -158, 50, -399, -257, -143, -539, -129, -177, -585, -128, 112, -436, 329, 36, 38, 229, 402, 388, 203, 411, 486, 229, 336, 187, -73, 73, 3, -141, -18, -97, -195, -28, -430, -384, -424, -141, -331, -534, -337, -28, -301, -102, -107, 122, 167, 353, 225, 315, 56, 261, 446, 231, 461, 257, 92, 127, 102, 52, 147, -274, 240, -98, -228, 37, -298, -421, -175, -662, -266, -220, 37, -201, -54, -77, -229, -30, 250, 251, 466, 473, 289, 311, 584, 189, 251, 384, 127, 220, 217, -121, 122, -148, -167, -263, -130, -104, -519, -239, -276, -555, -254, 13, -246, -126, -133, -400, 127, 151, 36, 299, 232, 361, 324, 195, 529, 186, 516, 247, 158, 170, -40, -100, 167, -63, -176, -46, -75, -371, -177, -228, -295, -337, -154, -141, -163, 108, -86, -228, -25, 144, -254, 100, -22, 140, 170, 203, 177, 176, 17, 352, -73, 128, 247, 45, -220, -93, -105, -44, -342, -200, 37, -340, -280, -90, -226, -96, -180, -163, 60, 87, -120, -195, 264, 498, -99, 162, 346]
2572C46J5m5j6oJ28k92J7j19k59L36k07j57l3L5K45k60m40K91L64J0m06L79J06
2595C2k72O28l59J59l52O79n8n60M22J61l03N5q5R4l5k42P6k30J6j47k2j30J81
2618b92J65J28n86J68L19n2P9l48K68J75j35K14K89J9k14K89k30Q7J34j57p8r0
2640A52J70j30k80rmo5m2j76j39N52m30p8K9L32Oj12M27k52K59l1K72k81R8k9
2664B39J63l1j51j4J13m30J94K40l88j30K0K76k94j12P4%J67l4k60J12L12l1m05
2687c70Q1K81J3R7K4O3oJ09k2j27J46J89m16L49l22p8J12k62j7L11j62k42q3J58
2711a74r1J85k77L17l30L17J2m44N10J92n4j22J1j91N13l49K67p0O0j04m9L6p0
2734I5k57M24m77Q3J83k57J90j5l26L50k16K4K1K29j90J56r4J99k90j44K65J71
$$ y = [346, 361, 316, 300, 294, 422, 130, 147, 28, -231, 105, -102, -259, -292, -257, -12, -272, -712, -421, -57, -47, -453, -74, 32, -240, 388, 29, 188, -164, 515, 457, -103, 319, 480, 177, 232, 147, 241, 206, -36, 40, -190, -174, -321, -343, -473, -292, -127, 1, -585, -417, -98, -150, -71, -419, -151, 24, -111, 103, 392, 411, 197, 486, 256, 343, 477, 320, 242, 152, 322, 192, -88, -97, -101, -166, -208, -384, -523, 29, -401, -479, -450, -118, -112, -224, 203, -49, 210, 179, 451, 170, 268, 239, 402, 371, 220, 206, 319, -111, 83, 323, -65, -195, -175, 101, -193, -305, -231, -231, -64, -98, -358, -246, 66, 35, -370, -289, -8, 5, 102, 126, 189, 183, 292, 270, 143, 289, 478, 62, 411, 89, 11, 123, -139, -156, 155, -7, -249, -332, -174, -265, -80, -357, -40, -370, -53, -41, -485, 25, 217, 163, 41, 52, -139, 374, 25, 292, 222, 282, 178, 129, 165, 95, -162, 262, -215, -132, 51, -206, -16, -31, -357, -7, -223, -199, -178, 51, -139, 17, -77, 122, -168, -312, -47, 124]
2756A24J27j0k02J89o0k50M12j33J91j47R5m94M36l06J30k90k09k0L44J7j20l97
2778e73M79j97K1J33O9o3Q5J17K3k6P6K60j92J06j18j92q0J46M8L70m21l4J48
2801A85k58j4j13mJ8K3lk38K95m7J91l33K83k71M4M18j90j5j33M70l82K67k42
2824d9M44k27k51K77J31k86J36r5o9j46k86M15k04o3r2K74l16J84K05j98P5k45
2846c86N10l56L10K13o5n3j06K32K42q0n36K60j10o1J25J44k05Q0k05K96l53m6
2868a50J35k99K49j94k42K86j2J03O2l22L24L6lo8K61J44M2m36K86M7q0K68k35
2891B02k9j3k4j02K0j07k28K31j3j57j87K59r6j7K07l24K77l7j7o3M17k86J09
2914B2j0p5K29O4m0J24l5j77K38k13J48j82m8k4m08K47J47l28K53o1oj23l4K00
$$ y = [124, 251, 241, 39, 228, 168, -82, 330, 197, 388, 241, 336, -158, 278, -28, 102, -188, -397, -417, -73, -56, -176, -573, -94, -291, -270, -137, -68, -131, -46, 71, 94, 68, 144, 404, 212, 318, 200, 8, -72, 74, 122, 492, 71, 37, 185, -73, -87, -200, -204, -186, -163, -166, -404, -109, -156, 35, -298, -15, -286, -242, 176, -14, -29, -162, 308, -74, 193, -49, 395, 168, -83, 194, 325, 39, 175, 80, 11, -135, -421, -6, -210, -273, -365, -91, -407, -223, -18, -216, -141, -386, 124, -232, 78, 291, 226, 173, 67, 299, 541, 461, -75, 185, 75, 14, 139, 283, 78, 158, -47, 249, -104, -150, -15, -314, -65, -259, -501, -215, -227, -124, -62, -384, -60, -24, -27, -95, 166, 310, 352, -84, 202, 249, 169, 437, 202, 173, 160, 136, 34, 54, -53, -281, -50, -63, -220, -407, -148, -244, -261, -54, -378, -101, -138, -155, -218, 199, -87, 22, 12, -63, 166, 230, 190, 314, 279, 102, 340, 127, 275, 93, 45, 21, -387, -140, 7, -321, -68, -129, -135, -258, -292, -92]
2938i2J85o4j23j30Q3K85j6m3J20j35K93l19k91O02q3J2m0n3K39l37k10N5N0r2
2962a04R5l62R8L7k41L96j85j7J79Q2m5J75j04J78O7j41n2r5K11k12J36O6mp8
2986H0L20k30r1k65K16J01q5k76K0L30k53L68k26j12j6o1M9M6L7m5j9K05k48j8
3010a73M03j35R7J81l17j46K13N9Q3j6j90M6l73P6k%J95j08k57L61J9k52L46m23
3034c13L82j13r8J86j4Q5O9j91R6r6K73q8n0m7k7n0j3J96k60L82l58k4j06l0K85
3059G6Q2j89j4J90m98M21j72P1L4j25J66M3Q9k22O7Q8L24k87J37k00M3J59p3k57
3083d7O0J25J61l77l33L26k44K77r3j13Q1o4K68j60j8J47J45q3k4K08l50J40L58
3106C90m00L96l96J74J29j74L7mnp3k56j80L19j53J01l65J88L7J46K7l70K58j5
$$ y = [-92, 93, 29, -94, -224, -141, 144, 128, 85, 205, 70, 363, 44, -247, 355, 272, 284, 244, 191, 430, 93, -117, -62, -12, -104, -9, -371, -273, -236, -477, -81, -266, -283, -104, -22, -67, 108, 4, 182, 249, 108, 56, -39, 172, -40, 96, 162, 158, 80, 400, 170, 79, -186, 30, 131, 46, -230, -210, 120, -133, 235, 9, -103, -119, -180, -131, -85, -48, -93, -112, 93, -155, -173, 230, 95, 192, 373, 56, -90, 123, 182, 265, 249, 59, 105, -268, -192, -194, -194, 1, -107, -364, -3, 16, -236, 110, -313, 69, -44, -142, 44, 30, 115, 184, -7, 89, -7, 266, 178, 128, 81, 54, 4, -9, 187, -73, 309, -49, -73, -179, -209, 76, 158, -31, -45, 145, -353, 68, -104, -33, 1, -124, 42, 85, 174, -48, 19, 107, 431, 144, 281, 81, 124, 283, 210, -47, 13, 138, 299, -78, -411, -85, -329, -52, -145, -258, -177, -241, 27, -133, -151, -4, 141, 58, 34, 242, -108, 32, 390, -10, 386, -10, 164, 293, 119, 156, 152, 147, 74, -182, -362, -43, -196, -95, -460, -272, -235, -89, -62, -432, -174, -189]
3129a89K07p5N11m96R1K75l86J31J40j17M9M0R9p0j08K0kr0j85M49o83M75k12
3152a26j61J35k28K24J61k69o3J76J3J06j7j7K82j94J97J27j63K18k53m0Oj39
3174b5J08n1o4K35j75r5J71l02R6K86m11J38J50k17J52m56L74J05j40K6K12n8
3196E9j56J86j20J6j9K92K7k36J03r4q7m9R5KL27l56o5l2j21K61j83j56J97j5
3220a24M5J56j04o6p9J60k3M5QR6j13M87k69j31m4J08L5M5k32J20P0k18J94l41
3244a75K80j24l52M99l68j09J54K9n1o3K91mj07m1O8J21K34l21J85j38J11j07
3266A2K99j30j02K12l39QM44k58j59J39j07j70K64l16J59nN2j86N0K46j59l54
3288d00K90L08j01k3j44K69l60M59j10J15l83K42q5L0k3o8N6k94L09o9J88m67
$$ y = [-189, 18, -57, 454, -42, 49, 324, -62, 69, 209, 92, 141, 181, 280, 210, 102, 122, 120, 30, -155, 294, -389, 86, -126, -287, -152, -380, -156, 5, -264, -327, -151, -138, -32, -49, -66, 216, 22, 219, 346, 183, 401, 148, 108, 114, -25, 83, 32, -32, 203, 28, -67, 104, -198, -102, 184, -227, -89, 61, -156, -4, -460, -86, 19, -121, -95, 117, 59, -97, 89, -31, -15, -34, 258, 285, 49, 152, 58, -29, -78, 17, 19, 346, -10, -75, -107, -228, 33, -150, -306, -109, -124, -79, 77, -27, -93, -172, -12, -35, 10, 18, 114, 1, 488, 219, 88, 44, 152, 187, 232, 0, 120, 190, -28, 166, -175, 105, -19, -371, 128, -240, -349, -195, -166, -217, -280, 11, 7, -100, -141, -73, 48, 282, -39, 146, 8, 119, 12, 311, 181, 79, 291, -48, -40, 404, 146, -13, 126, 19, -151, 113, -203, -44, -49, 3, -183, -133, 113, -46, -400, -110, 198, 97, 74, -70, 199, -161, 298, 188, 303, -80, 162, 77, 107, 84, 16, 72, -222, 87, 18, 206, -261]
3310b61J29O9k18o3J88J36p1k1L9j0k9q2K51J70k20N9J16j97J07J15K8p3M6l01
3334i3K15j72N9J40r4o3j4N6l69K77k2K73m89M4oJ12K78k55J23M9J37J0k36M2
3358BK45k75o9J71k10J86K73j54j33K9m3L3j69K47j74j65K31n87N61L2L6o5k12
3381b10kJ81J24j39K4N6RL7P0L40m11k35M57k91J61J8k75K15j31j66K34j85O5
3404e4J49l20M2J41k19P7j5qK43J45l91J25K00l5l6J03k78J56r3J90JJ0p9KJ69
3429B25l13K32j11m6K39j68q4k7M0k93j24L65o1k93L39o3j28L39j23K7Q0r8M5
3452aJ82l2k43L59k66J59l17M89l62J31k46K61j11K8Q1k66O9l10J98k9J4J3J33
3475f6k89N27k26j34L79k24k36N22j88Pl8k4j9J36m4Lo1K5K17l39o4k2m0L8L8
$$ y = [-261, -132, -63, -281, -344, -156, -20, -91, -112, -73, -83, -112, -194, 57, 227, 7, 66, 182, -15, 92, 207, 235, 162, 208, -93, 122, -50, 9, 149, 55, -8, -22, 34, -335, -58, -80, 193, -296, -252, -258, -146, 132, -123, 0, 49, 186, 196, -40, 2, 247, -28, -97, 74, -136, 50, 323, 169, 36, 65, 22, 55, -114, 133, -41, -206, 25, -562, -1, 31, 67, 2, -210, -212, -31, 93, -46, -22, 34, 43, 80, 150, 490, 79, -156, 301, 10, 171, 189, -86, 129, -2, -168, 66, -119, -54, 95, -225, -183, -42, -261, -184, -199, -207, 36, 181, -210, -85, 115, 80, 44, 147, -131, 25, -68, 122, 123, 133, 54, 56, 225, -88, 144, 33, -13, 226, 58, -26, -53, -13, -306, -430, -65, -126, -419, -80, -143, -271, 68, -55, -28, 52, -46, -1, 181, 149, -94, 265, -1, 158, -159, 330, -32, 99, -147, 114, 3, 31, 112, -154, -85, -395, -197, -226, -212, -199, -66, -355, 172, -54, -188, 191, -33, -269, 253, 65, 72, 34, 10, -9, 127, 83, 86, 25, 50, 267, -72, -136, -158, -198, -160, -122]
3500a22K9O2L5j59J11K8P5l90L34J38k17K26j06j92K57L5q2K12j8J16l79J02R
3523A04o2J35o7j5r9j49Q1L3k61L09q6j07o0Q5q5J46Q1m51L16p1jJ46L24j05r3
3548D8j85N15l22j81J71j51K63k00R3n1J11k73K71L8K2l76J14J12j9j11J45K5
3570E9j62M0r2jL64k31J45j58J11Qj71J68l2K31j09rk5k68N87p92J88Q8k08L88
3594A19k25R6l09L34M2j1l64J36n8R2K67R8j23l37M46j77o6nqJ8J05n7P3K5j86
3619g5L5M23m64r0J21j08J35M1p4k31M80j2l27j78K79r8L14j79P6P7m6j99N13
3642D13l08J13j08K2jJ43n03L81m9J0k5k3K55m51J71o0k99J18J66k97N29l05j0
3665a18q2O6L26k87p5J68j49K41Kn4n2N5L7J82k92J17k0Qj04R7j51l9L73l36J73
$$ y = [-122, -93, -31, 4, -155, -44, -16, 59, -331, 3, 141, -76, 150, 44, -148, 109, 144, 62, 274, 256, 372, -7, 95, 104, 42, 177, 110, 95, -4, -153, -72, -39, -300, 9, -77, -184, -244, -159, -244, -98, -17, -468, -152, -223, -224, -78, 246, 141, 48, -137, 378, 56, -125, 46, -105, 158, -42, 51, 0, 111, -162, 109, 147, 169, -207, -93, 19, 0, -111, 34, 59, -103, -63, -155, -156, 208, -23, 122, -36, 75, 83, -88, 80, 48, 279, 170, 161, 136, -132, 455, -337, -149, -61, -269, 119, -106, -10, -319, 15, 57, 46, -318, -182, -240, -148, 119, 217, 94, -243, 203, 26, -40, -45, -53, -35, 70, 13, 86, 111, -75, -40, 383, -81, -171, -50, -158, -23, 18, -56, -287, 193, 181, -146, -324, -45, -143, 171, -8, 68, 145, 99, -100, 413, 105, 218, 110, 132, 131, 274, -229, 152, 103, 113, 88, 65, 320, -131, 40, -20, -319, -201, -35, -332, 197, -108, -118, -200, -134, 192, -95, -170, -2, -151, 90, 92, 38, -14, 41, 78, 260, -32, 85, 65, 73, -31, 66, -85, -124, 249, -87, 86]
3690H6j04r8K13o0j07Q4j06J25j02j80J93j69O55l55k4Q9j6j31L49k08j06P7o0
3713D5j36P6l6j23L10j71K8j83L37l26K02N8m3Oq5kQ1n6J48l38K30l6m7l2j53
3738b46M25k77K34l10K64j29J17q4R9j98J18J6j29J88j75j63N1p1O0K20K32l01
3760e9o5L66l44K6K92j71P3o1P4L1j09M6j23J57k72K70p1p3R7j94k38L38R6m95
3784d09J61K37J2K9o7j62P5j27K87j07k23M03K9k37L7K06q2n5L00j46o6J8k37
3807a24J51l0j35K26K11m69j6J50j77N0p4J22j3N6J24l08K72m7n8J73j54J75Q4
3830A89k5k05K6J79k00M28k70k37J84J47N2k13J1KJ58m00L24l34J60l32K35J82
3852F1m09O3J67K25k8j7OK5o7r7K66J51l67Q5j28J91j19j15K09J32m43L34p6N6
$$ y = [86, -18, -116, 97, 37, -70, 14, -92, 33, -69, -249, -56, -225, 430, 75, 51, 140, 124, -7, 342, 134, 28, 105, 45, -91, -15, -51, -174, 136, -35, -7, -190, 147, -179, 23, 81, 38, 44, -41, -43, 38, -18, 130, -208, 22, -14, -61, -93, -246, 179, -98, 136, -174, 90, -39, 78, -6, 93, -105, 13, 29, -100, 88, -87, -250, -199, -270, -210, 10, 242, -59, -124, 242, -102, -76, 216, 45, 118, 57, 131, 162, 53, 99, -24, 133, -139, 131, 60, -13, 84, -110, -348, -10, 86, -409, -248, -11, 1, 30, -37, -199, -124, -251, 36, -71, -294, 109, 138, -99, -62, 144, 62, 7, 307, 161, 95, 113, -124, 27, -3, -138, 88, 299, -170, -186, -36, -213, -163, -237, -115, -128, -72, 52, -256, 16, -31, -89, 84, -70, 105, 189, 164, -41, -15, 164, -36, 392, 122, -115, 69, 216, 268, 55, 66, 68, 226, -174, 150, -184, -24, -356, -121, 61, -348, -285, -118, 107, 79, 62, 68, 93, 26, -71, 195, 346, -21, 64, -64, 127, 8, -107, 102, 234, -209, 125, 49, 105]
3876A05j55r0J56j29J19j58jJ59j23R1J97m05M22j41J50j94k7K13P8k1k77J51
3898A20J75J4k19j37J73j7RK15o3j22k51Jp9n1J71j81K63l4j09K02j4l2j45OJ70
3923F5J39J03l39K75j31m9J33j30j85J75J03j28j6K06k39L1P5m2J4r1O7k37J27
3946g4J99l76L71J2m53K16J01pj9K56j10r3J11l28K63j17N0k4J54O4k92K78k80
3969i8K46p2j08j74O4l27K85L6K42j15j61J78J8r9J69j55K76j96J21k20K25j1
3991A24l16N99j91j65J28k38J28k12K27J36l38j58K67j98M00j52m7K02m77L06
4011B5p7M3j01q2K97q9%J71q1r1J52n5L5O0j77Q8j23J51o6k0j90J75k3j29K2J94
4037A09j79j26J74j24K46J12k18R2q6j51Q6J69N9j97Q2qm5O1j9K09j5r9j27k7
$$ y = [105, -50, -140, 16, -113, 6, -152, -153, 6, -117, -26, 171, -234, 188, 47, 197, 3, -24, 189, 267, 246, -31, 120, 295, 309, 90, -47, 126, 109, 118, 333, 270, 148, -103, -102, -181, -232, -61, -242, 21, -13, -122, 80, 66, 34, -111, -105, 65, 204, 307, -32, 243, 112, 63, 196, 66, -119, 56, 159, 31, 15, 221, -18, 13, 88, 46, 60, -31, 36, -201, -74, 125, -251, 120, 132, -321, -105, -4, -11, -30, 226, 116, 23, 134, -194, 69, -48, 2, -22, 132, 196, -96, 182, -98, 148, 76, -32, -206, -142, -469, -184, -148, 94, -21, -182, -4, 14, -85, 84, -71, 205, 9, 130, -90, 135, 124, -192, 407, 216, 51, 179, -59, 69, -143, 84, 220, -118, -276, -9, -207, 193, 41, -6, 196, -281, 25, -52, -9, -110, -192, 105, 16, 16, 187, 106, 15, 167, 112, 147, 207, 30, 118, -5, 146, 80, 60, -130, 45, 22, -107, -85, 109, -70, -196, -22, -146, 100, 212, -6, 86, 0, -151, -65, 104, 163, -34, 48, 40, -5, 56, 37, 246, 231, 132, 5, -22]
4061b2J17m90N77j20k64K72l87J74J45j6j00J80j93M02k56o2L7K1J24k01K31j31
4083C8P4k09J37J12p9k9l6k92L15Rj56R2k56J59j00l1O5K04ml6j07o9N1K46k6
4108G2k62J78L1j6P1l57K43R4j44J11kJ78k8k59K39P4l67J69J84k53o2L15n07
4131b98Q1J54lJ61j6o8l8J1O4j06O9p3J80l07K00p0n7k8J06M5Q2P6J3j66j28R7
4157a9r3R8j07J82P0l52k3K02o3J26J60k85K79j71o6K01o2K11k73J50j38oR9j08
4181A2j9jN3j52L65k38N1p2j62K47k00K98l38OJ12J5o0J26p2l3J00J45j6j68J69
4206A68J1q6k84K69P7l80J58J2K03j09l8J81k30K35k31q5Q4p6j9Q3j14j8l5K58
4230C4m3j32M3M79m19k4J09K07m11K64o3Q9R4k56J14J39k51N6P1o9mP2o8J5q7
$$ y = [-22, 95, -395, 182, 62, -202, 70, -317, -143, 2, -14, -114, 66, -127, 275, 19, -43, -6, 15, 139, -62, 169, 38, 112, -97, 40, 152, 73, 44, 8, -284, 31, 40, -116, -24, -280, -121, -221, -252, -187, 17, 13, -23, -130, -199, -148, 98, 72, -190, -12, 19, 3, 74, -283, -40, 54, -90, 21, 19, 197, 169, -90, 149, 223, -144, 25, 209, -44, -106, 209, -298, -217, -63, -66, 95, 79, 11, -27, -16, 48, -58, 11, -62, 118, -189, 11, -59, -116, -144, -38, 7, 89, 165, 178, 12, -116, -19, -112, -14, -121, 61, 131, -221, -244, -42, -105, 21, 181, -104, 175, 4, -62, 139, 77, 288, 15, 165, 27, 21, 120, 12, -7, -8, 45, -107, 258, 20, 71, -1, -163, 84, -116, 182, -156, -150, -38, -23, -83, 43, -29, -62, 38, 183, 167, -1, 168, 179, 93, -191, 78, 155, -225, -67, -55, 148, 39, 1, 182, -48, 187, -44, -129, -45, -121, -140, -57, -171, -189, -224, 34, -9, -141, -98, 381, -38, -62, 47, 254, -157, 107, 44, 133, 227, -29, 85, 224, -27, 29, 100, 31, 27, 99, 31, 46, -41]
4255d1K97j24l89L41j74j42J56J51j58J16j19J51J90j33p0O6M8M5k96J41l7l6
4277a7J7J4q0M3J16j43J9K20k01O9m74K99k3r4J90QN5l4k70K83k09n6K60J98m09
4302b19L80j36J42j54l2j24P7L1j17k7M90n32J97l9J37l6m6p7n7J83l5j35N7p5
4326a47Q4j6R9k7J94k38k09L28j46K45j80L17l42J33k95K79k82N99l21o9j23o1
4348a78J02m1J93k86J4J15J21k19K91j41j41K1J78N0J03q8j65J46m1m8J13K5j92
4371f8QJ75o4K9M8l35K85j51M1J35j6k97k0K57j17K51k04M4j29K32j34L11O4j57
4395A88j0k6R0j79J9p5LJ13j98K01Q8j45k35m7oJ37KJ6L4L8j49k7J4J68j86L13
4421A41j64J20k30L67j56r3j64L36j75K04r5kj40L31k20k54M08k01k6R2j02J46
$$ y = [-41, 256, 132, -257, 84, -90, -232, -76, 75, -83, 33, -86, 65, 255, 122, 52, 118, 166, 211, -85, 56, 19, -17, 0, 14, -66, -23, 93, -50, -31, 189, -12, 57, -417, -118, -141, -235, -45, -37, 18, -16, -286, -3, -212, -268, -8, 190, -219, 161, 25, 167, 13, -19, -143, -66, -35, -152, -179, 311, -221, -24, -63, 74, 38, -8, -85, -142, 41, 6, -129, -72, -147, -63, -79, 20, -7, 187, -51, -260, 68, -78, 167, -13, 304, -38, 95, -200, 79, -203, 396, 75, 6, -117, -178, -76, -117, 76, -210, -196, -81, 40, -179, 112, -29, -170, -149, 29, 79, 182, 94, -71, 75, 34, -14, 99, 124, -68, -60, 115, 51, 80, 128, -207, 78, -73, -32, 103, 87, -210, -230, 27, -90, 161, -43, 1, -128, 104, -30, 281, 345, 188, 178, 152, 242, 63, 82, 7, 10, 123, -75, 126, 214, 69, -166, -213, -219, -82, -80, -64, -30, 8, -141, -168, -154, 14, -172, 141, -23, 97, -133, 234, 78, -15, -179, 157, -18, 186, 91, 89, -51, 280, 60, -194, 214, 13, -13, 79, -23, 123]
4443A23M0j44k81L62j29k5j41l2J45L2J45j61K42j86j78L90k47q1N20k70J03m34
4465b07K75J29L9q0j26R1k30P6l3R3j24K36k39P3J68l28N23m27J08P8q9Q4L1j16
4489EO4k2l20L73r6J0Jj96J57j20K7J44j76L1L31k75m7j1Q4k4J76l92M96p7l14
4514a71L67k6O3N2k21n3J82m3j79K09j65J70l8l57L08j06p5R4L5k44J95l6nL9
4538ej14K8k56K83j34J02M2j48J75r4Q6KQ5J32Mk91J3J8J19r0KK18n3J37l26L23
4564B58k68j21J13o3K85l5k94j17L4P1l2J36R1pM2k66j07RM07J19l84J20O0K58
4588C09o8j55j64Q5K23k43o9k5M2P5k13J05J24q1k48M68k14o6O1K42j62k9J20
4611A17k12j5k07L09k3K9j99M42k98k23K19M3j5M1p0j60K74O6k59kJ8j19J93j49
$$ y = [123, 163, 19, -262, 100, -29, -54, -195, -227, -82, -50, 95, -66, 176, -10, -188, 202, -45, -126, 394, 124, 227, -207, 68, 197, 236, 156, 30, 121, -109, -33, -66, 27, -97, 139, -100, -27, 141, -187, 336, -91, 17, 95, 6, 90, 121, 5, 69, 47, -273, 100, 4, 14, 15, -181, -24, -144, -117, 27, -149, -118, 213, -62, -109, -120, -36, -60, 116, -276, 220, 143, -171, 196, 170, 233, 285, 64, 11, 193, 150, -29, 180, 15, 185, 147, -210, 98, -8, -83, 11, 46, -198, -3, -39, -44, -5, -119, -91, -347, -64, -198, -96, -54, -202, -27, -121, -35, -33, 52, 184, 188, -103, -90, -72, 47, -43, -41, 177, 124, 261, -65, 258, -10, -131, -18, -81, 204, 169, -125, -242, -208, -137, -169, -33, 58, 51, 93, -173, -280, -271, 136, 255, -129, -9, 51, 309, 241, 86, -78, 7, 230, -13, -82, -107, -65, 10, -203, -98, 26, -55, -303, 165, -49, -115, -54, 188, 26, -3, 117, -95, -110, -317, -8, -31, -2, -201, 241, -57, -280, -61, -18, -33, 8, -62, -222, 52, 118, -141, -143, -125, -244, -51, -200]
4635b00J65lJ35KM3j54j36J56q2MJ57K5k20J05J88k79m0L35l78K05j62R6J35k80
4659a83K91j4m04J43R2j2Kj13J70j67K03o2j32J12K84k41J61p5n7p9R6J77r5k3
4683G4j26r3L8J62P8k23K39k19K18j82P8q7Q4J19k45J93j54Mj32K56j37j30J92
4706GK55l38L8Q9r7j59Q0j65K34kJ66j73n5N3jJ1L5J79k18k7O7p2j61K03o8J7
4732a02K96k67l7k1kR6j84J57M8k35L03L5JJ80j62k2km13M79o4%k2m00J55J71
4757a2n5J11r9k42N04k13q4Q9k49K34n9J27K15n09J93L6J95k53M38k18j40l1j97
4780b19K38p4R5O6N0j93J81k85j3J39j0o3J13k98L06lm1j04m9K74k6j85jK05M7
4805A50j76J74k95L52k84J37K5l6P8j84o4P5N1p3K28o7p9r3M9j5O6Q5k35K57q5
$$ y = [-200, -35, -38, 97, 99, 142, -12, -148, 8, -74, -70, 87, 112, -108, -3, 185, -94, -134, 201, -177, 28, -134, -38, 97, -183, 108, 94, -310, -167, -75, -87, -85, -198, -28, -195, 8, -54, -186, -74, 210, -31, 130, 55, -2, -81, 15, 192, 97, 74, -52, -145, -107, 55, 133, -90, 149, -70, 148, -34, 44, -43, 41, 160, -85, 108, -46, -42, -174, 82, -55, -185, 7, 262, -76, -38, 51, -46, -205, -125, -290, -56, -58, 108, -65, -120, -67, -68, -57, -22, 157, -61, -88, -21, -93, -254, -51, -119, -102, 194, -73, -110, -131, -133, -37, -221, -64, -16, -251, 52, 87, 88, 268, 106, 84, 82, -331, 148, 84, 84, 62, -338, -183, -12, -67, 44, -55, -297, 207, -6, -90, -1, -250, -16, -75, 52, 267, -242, -49, -13, 182, -71, 367, 149, 9, -22, -219, 19, -55, 40, 106, 156, -37, 144, -141, -154, -15, -25, -88, 25, -273, 33, 30, -11, -115, -164, 110, 84, -101, -102, 103, 150, -26, 148, -147, 205, -79, 58, 83, 47, 125, -59, -123, -48, 3, -70, 158, 91, 12, -81, -32, -47, 19, 104, -131, 126, 41]
4830D1P9k48K17n7O8k40j30L63M2j45J59M0j19j44J14j01J95k15lJ50n3L9l76
4853c24J32K23j6k13P0r9K54k47L78j26k6J07l3o8J1Q6k6j72K37j80P2J1QL6j09
4878a4j12K13j17l70L33j36K02kN0J77l16J68mk95K30J41k43J78J54k01Q3j39
4900b0J69p6M9j13J9L0j8k45L27K4J03l83P4l8j6J5o7J54j65K94k51O6L9J72k27
4925h4r3K31k63L20J00k80J81j39r1K02q8m3M0N7m0k02J94K4K00m34M70k72j97
4948b07K35j35J78k64N7J40K72l15k00M31J5k88L35l55J26R2j42J09o7q0R3J68
4970A98m11J27J0R6l2J17k12J04j91J95k6j80K18j6o0J73k09P4J73P0j21j61J55
4993I1k39p3K22L4J8R7O8k82J58m5k07R1L05k44M5j02m4J0j61J59J03k53L26k57
$$ y = [41, 120, -128, 89, 32, 100, -140, -270, 93, 135, -10, 149, 189, 70, -74, 40, -61, 134, -81, -84, 66, 13, 52, -324, -192, 31, 15, -198, -128, -227, 27, -220, 158, 32, 6, 113, 80, 12, 23, 109, 83, -89, 148, -32, 40, 51, 59, 95, -14, -126, 87, -30, -400, -67, -203, -1, -3, 47, 224, -92, 76, 72, -223, 7, 148, -95, 83, 237, 36, 119, -20, 149, 73, 122, 9, 28, 58, 40, -205, 122, 146, 249, -134, -60, -98, -114, -99, -166, -12, -177, 117, -134, -68, -29, 143, -84, -177, 54, -209, 111, 211, -69, 112, -27, -118, 84, -4, -47, -7, 50, 10, -192, 2, 26, 226, -208, 262, -10, -207, 28, -107, 71, -193, -136, 4, 276, -39, -239, 192, 207, -81, 254, -101, 25, 117, -25, 84, 17, -63, 30, 198, -213, -86, -76, 20, -12, 105, -107, -3, -194, 1, -25, -205, 13, -3, -63, 110, -99, -25, 148, 218, 97, -64, 91, -148, -221, 1, 35, 53, 150, 218, -64, 94, 49, -158, -67, 238, -6, 39, -63, -107, -97, -258, -99, 4, -249, 77, -180]
5017a80K70q5J51j73P7j58L25m87K60K05j85J22k59J96p6j87K41k67J35M1j02
5038a36j07K91L4p2m8j9J99l42L09r0j01J50k07P3l7J90j65P5j33M79l36o4l7
5061i4p2M25k18J23j33P9J8j83l3J23O8Q2k70J43j34Qj45J06J2j23L11l8l54J87
5085a12L51j34j18n3M3l4J36k29J27J13nK83k47jj76r9L30p6J81k59j56L41k31
5108b5l5P2l1J04J96l82L18L4k60O1j71L08r6K8n3j38MO8j8j12Q5j65L29N0m13
5133b42L33j14J00J04l7m26J94M83l23j17p6r9J21L03j6k04M0l4k72J87J49J39
5155A93j03j18N7l6j60O7m4K01nO4j60o1P2J20M2l95n4J91J53J17j60J77k58J20
5179B0P6M9l26J1K46n2K0j36K27K3j01j23J90kJ74k13j29M8l2JJ4M3M0j58R5J65
$$ y = [-180, 90, 5, 156, -17, 60, -98, 227, -260, 0, 205, 20, 142, -117, 79, 3, -184, 57, -210, -75, -34, -136, -243, 48, 82, 10, -38, -57, 142, -200, 109, 19, -82, 68, -139, -66, -103, 87, -78, -3, -136, 343, 7, -57, -94, -166, 259, 41, 164, 31, 110, 128, -55, -88, 35, 103, 185, -85, 58, -76, -68, -213, -107, -95, -218, 93, 55, -299, -112, 239, 105, -13, -66, -23, -57, 79, -150, -23, 90, 85, 368, 121, 120, -56, -155, 175, 99, 280, 21, -135, 206, -25, -60, 12, -19, 85, 281, -101, 217, 251, -9, 52, -119, 189, 93, 121, 68, -70, -66, 2, -16, -128, -43, -208, 121, 171, -242, 91, -23, 77, 181, 144, -282, -88, 395, 72, -45, -121, -220, -99, 204, 188, -16, 24, -10, -282, -95, 54, 193, 90, -28, 29, -7, -167, -100, -144, 57, 52, 116, -44, -105, -33, 87, 129, -266, -320, -129, 24, 141, -19, 158, -100, 20, 96, 145, -181, -170, 76, 24, 44, -92, 135, 158, 57, -66, 124, 122, 296, 83, -46, 2, -30, -29, -15, 28, 68, -90, 5, 170]
5205A70k42r0J7K5K13L7k88J02K81j22M3j79J39L7J16j23j41J26%l0k47j97M43
5228I0q4J35J34l03k5R2Nk39J93R2J14k64k0oK36k19L27k37N6k35J06J60r4J35
5252A49J45m07p7N7O8L1j82L26q3J16k76J95l6l0J14m3k88L26k54J0J87l62M17
5275A03l1k33L9K41j46K98l37R3m1r7K67k55K1k94L74k19J12J3R0M6J17%m56R0
5299b05J11K04q8j84K01q6J94l17K10j26j6J78j11L69l04k7k41J84J65k69L20
5320A62p0l03P0K92k30J46l1j40J66k06O5k12K53j21p1M42l12J07J84l96L31R2
5342B18n7l25J9K86j36N3L1l62L54L3l90M10r9J01l01k2J59L6j64P5p1J56K17
5365B21L9j60k4oJ10o4j55J57j62J09J14k2n1j76K0J2o0N1K03j71K7l01M39n7
$$ y = [170, -72, -162, -145, -120, 93, 130, -158, -56, 225, 103, 146, -33, 106, 143, 259, 136, -5, 121, 121, 91, -156, -353, 90, 6, 141, 275, -28, -53, 39, 44, -195, -2, 90, 204, -60, -80, -86, 150, -69, 258, 21, 77, -158, -52, 108, 14, 149, 294, -113, -190, -133, -65, -34, -216, 110, 27, 143, -133, 62, 26, -4, 110, 67, -221, 105, -149, -139, 48, -314, 103, 72, -161, -122, 119, -27, 271, -66, 27, -14, -111, 156, -99, -78, -372, 2, -217, -105, -92, -2, 44, 161, 161, -295, -205, -94, 110, 22, -162, 39, -47, 147, -170, 40, -86, -102, 76, -35, 334, 30, 3, -238, -54, 111, -158, 162, 92, -211, -141, 151, -79, 67, 36, -104, 62, -144, -79, -291, -38, -159, -230, 212, -100, 7, 191, -205, 126, 218, 161, -164, -145, 141, 5, 58, 89, -273, 81, 114, -276, 134, 35, 136, -165, -187, -28, 8, -156, -81, -152, 4, 221, 260, 100, 76, 70, 180, 116, -39, 118, -44, 65, 179, 157, 106, -70, -50, -38, -98, -47, 156, -15, 12, -289, 150, 93]
5389I3l12L69j00j01K26k06pJ0J77k50L59k7O5l98n1M56j98J6j41rj52K24j77
5412a34L28k48J02K7O2l03J54J76l9K86n55K9Q4L02m55nJ28M7L9l2J07J04m52
5435b48L51j28J91k8n19M54j14K9J17M7n8m19K06k3J90p6P9nj41J02k9j04P1O7
5459A2n6j1j44J18J74J48k10J17k22K83l39J05K1RJ61k89j7n8J78o6K86j56M3
5482H7j42Q4j72K89ok75N5j29K81j42J12j02j96L50j32P5j28j07K95kj67J75R
5505A12O1l71M05k49j05J26o1J4J90l18Q6L18R0l18J01K0j90K64l28M10k60M0
5527C7j80n9J04j08L18j15l4L66j80r7k39L2L59m31J80J06j41K2j75j07K06O4
5549g2J4j85K30O3k3l7j47Q8K74k03l1P4k1J26j2r8k1K09j19j40J83Jj8n6m2k65
$$ y = [93, -219, 150, 50, -51, 175, -31, -38, -28, 149, -101, 258, 231, 296, -102, -153, 303, 105, 121, -20, -29, -181, 43, -134, 194, -54, 48, 75, 137, -166, -12, 164, 125, 411, -144, -115, -31, 271, -184, -189, -61, -14, 25, -7, 100, 204, -248, 103, -25, 166, 138, -381, 73, -41, -12, 105, 152, 94, -325, -119, -142, 48, -28, 51, 46, -95, 7, -22, -126, -55, 12, -44, -55, -199, -81, 93, 241, 31, 148, -74, 209, -130, -25, -4, 5, 166, -123, -140, -198, -20, -86, 200, 44, 87, -55, 29, -143, 146, 140, -135, -80, -209, 72, -70, 42, -60, -256, 94, -38, 37, -91, -198, 97, 95, -72, 103, 112, 173, -198, 207, -42, -147, -21, -82, -68, 122, -196, -110, 208, 298, -20, 81, 101, -89, 175, -153, 257, -3, 37, -143, -202, -98, -206, 112, -3, -37, 329, 149, 52, -187, -155, 204, -227, -47, 59, -82, -60, -235, -342, -136, -72, -58, -243, -13, 50, 27, -10, -157, -69, 205, 2, -29, 45, 24, 150, 138, 40, 19, 228, 109, -31, 152, 153, 135, 79, 37, -228]
5575b28L10o3j37j9J21O6j65K6N7J61l6j49k01J35J51K44l04m8K0L22k09J93L1
5598B78j74j47k59J72O8R5j77J76J17n01M66m9N0m32K79L1l4n3j79L48J3m6j40
5621i8R2K31j81M6k31K51o5k3j96L06Q9J4l24J16j87J26P2j21J01k09L81j07j74
5644i1k0L42k51m2L74j02J43j66j75J86k4k39p7M7jJ96l24K70k2R0j07j95L17
5667A29J4o7k50K29j82Q2R0o8J43j24J51k02P8N2r4q4K94j01k36J76K7K01l51
5690i3J03J29P7l03p3j12J96L02k94m1p4KM13j76p7pQ5j7o3j16R9j35K63m16L84
5715E6J54Q9k37Q4m9q4j9K13j7k82qP6lj67J54Q3j74j17L60j90l6j4j09K06j45
5740a76j46L96j57J28j10L64k41L8J69m13R9P2P4j78J09Nl7mQ1k81R3j7r7J42
$$ y = [-228, 82, 19, -118, -137, -16, 50, -115, -89, -32, 129, 93, -56, -257, -122, 29, 273, -31, -79, -59, 263, 54, 247, 278, 104, -43, -302, -130, -62, 33, -144, 32, 149, -352, 114, 65, 115, -317, -38, -7, -41, -94, -273, 75, 88, 42, -98, -6, 225, 44, 90, -141, 110, 45, 22, -174, 132, 221, 235, -89, 27, -160, -34, 38, -83, 18, -191, 190, 83, -91, -111, 231, -20, -62, 312, 210, 353, 187, 12, 198, 174, -65, -142, -95, -96, 100, -224, 46, 24, 114, 7, -188, 129, 143, 76, -174, 55, -127, -45, 45, -23, 120, -4, 147, -55, 23, 75, -19, -103, 191, 90, -146, 30, 57, 258, -93, 10, 139, 216, -87, -160, -272, -76, 226, -68, -109, -183, -181, 232, 56, -21, -28, 57, 40, -23, -139, -40, -175, 88, -328, 56, 210, 299, 62, 146, 97, 13, -6, 207, 190, -92, -100, -24, -27, -194, -40, 43, -131, -248, 112, -78, -114, -128, -237, -31, -176, -322, 74, -83, 45, -65, 299, 58, 96, 265, -148, -49, 23, 97, -81, 28, 33, -4, -8, 73, -208, -115, -132, -229, -87]
5764h7J98j32J86j96L8K2P1l20J15J91k12K23j6j08J34n4P9K26l02k04J13J82
5786A47m88N65k96m7K93n6p0j52K40j28O4k10Q2j05J02N5j15J57j38J2K70j39
5808D3K4R3m38O9O19l02j1M2N0j38j02K38l09K5j39M75k66o8j46J33K89j42PJ2
5832E8o2l31L64j63L93k22O9r7l5k59L40j87L01K6k11p6R2J90j65m8j55j27L56
5855E1L3mR3k54j74J51O0N4M8j98K13L9j4o7J59r2M8j82J15j95J31j74J38Oj17
5880a32O2Q8O0k91M72k44j17k03O4M4q5J07K21k1r7J01j00K23j99lK96q1j10k96
5904b41L78J95l99J89m4r8K91j01j61k36L57k81k5K24J93m48K48r8K13l03K05
5925E8J98l11J39n6P5O1j89K62j02j44o8J58r3j8N6l44K91J72j48P8M2q8J14j4
$$ y = [-87, 111, -21, 165, -31, 7, 29, 100, -220, -105, 86, -126, 97, 81, -27, 107, 53, 132, 358, 56, -148, -35, 147, -341, 224, -72, -119, 174, 118, 48, -104, 136, 8, 72, -138, -56, -161, -59, -4, -119, 38, -100, -88, 182, 43, 67, 160, -278, -209, 410, 108, 97, 139, 189, 51, -51, 187, -122, -97, -236, 239, -27, -95, -241, -108, 181, 39, 46, 58, -4, -335, 29, -134, 259, 37, 106, 9, -26, -285, 55, -132, 169, 195, -16, -92, 0, 190, 25, -23, -178, -305, 51, 84, 80, 173, -81, -255, -104, -44, 10, 58, -140, 73, 112, 98, 31, 190, 98, 146, -36, 79, -116, 15, -159, -21, -15, -132, -70, 18, 78, -213, 259, 15, -102, -305, -241, -197, -282, -175, 46, 25, -72, 29, -71, 152, -47, -50, 246, 165, 55, -241, 137, 332, -67, 122, 78, -20, 271, 170, 9, -227, 130, -151, -176, 48, 241, -207, 41, -57, 156, -147, 58, 256, -55, 84, 28, 103, 164, -25, 237, 135, -9, -77, 81, -12, -30, 26, -318, -27, 145, -3, 75, 117, 29, 143, 129]
5949A29l18J49L9Q5k21l7J59J88l23P3J89l3n8K5K51j82j58k6J41n4J6k60K55
5972B9L4m12K67lJ18K98k94L7j32O1J4n9K5R4k68J65j11J06r4j02K18M3k4Kj11
5997i9j07K14N0j48K05j93O4J66j05j46j23K17k22J38m7P2J10k49K58m3r9J47
6019F0mO5k81J83j01J51j10Q1j9J07k5j32p5N16l39Q2j64k06K02j77L12k00k9
6042a03L57k02m6ol05M95k37K00l08o2J64L08m52K13J14M9o1Q2n2o5m0k54J67
$$ y = [129, -189, -40, -1, 84, -137, -174, -15, 173, -150, -77, 112, 79, 21, 46, 297, 115, -43, -69, 72, 18, 34, -226, 29, 63, -349, -82, -85, 33, 331, 37, 74, -58, 3, 17, -42, -17, 77, -191, -26, -137, -31, -125, -227, -9, 34, 10, 12, -99, -206, 8, 58, -90, 115, -78, -14, 152, 47, -99, -222, -5, -227, -89, -136, -64, 46, -203, 55, 12, -87, 60, 56, 121, -160, 23, -78, 73, -37, 44, 25, 132, 107, -25, -100, 416, 77, 159, -5, -211, -9, -186, 126, -74, -103, 254, 52, 6, 0, -305, 190, -47, 153, -155, -217, -53, 255, -197, 16, 130, 179, 118, 200, 148, 83, 43, -211, -44]
$$ [...]
8191a22
##END NTUPLES=NMR FID
##END=
