##TITLE=1H_Pr C8-1
 CDCl3
 8 sc, 
 27.06.2022
##JCAMPDX= 6.0         $$ Bruker NMR JCAMP-DX V2.0
##DATA TYPE= NMR FID
##DATA CLASS= NTUPLES
##ORIGIN= UXNMR, Bruker Analytische Messtechnik GmbH
##OWNER= root
$$ XWIN-NMR		Version 3.5
$$ Mon Jun 27 14:24:59 2022 Russian Standard Time (UT+4h)  she@DPX200
##.OBSERVE FREQUENCY= 200.13135
##.OBSERVE NUCLEUS= ^1H
##.DELAY= (6, 6)
##.ACQUISITION MODE= SIMULTANEOUS
##.ACQUISITION SCHEME= undefined
##.AVERAGES= 8
##.DIGITISER RES= 18
##SPECTROMETER/DATA SYSTEM= spect
##.PULSE SEQUENCE= zg30
##.SOLVENT NAME= CDCl3
##.SHIFT REFERENCE= (INTERNAL, CDCl3, 0, 15.7039)
##AUDIT TRAIL= $$ (NUMBER, WHEN, WHO, WHERE, WHAT)
$$ ##TITLE= Audit trail, XWIN-NMR		Version 3.5
$$ ##JCAMPDX= 5.01
$$ ##ORIGIN= Bruker BioSpin GmbH
$$ ##OWNER= she
$$ F:/spectra/data/she/nmr/H-F/1/audita.txt
$$ ##AUDIT TRAIL=  $$ (NUMBER, WHEN, WHO, WHERE, WHAT)
(   1,<2022-06-27 14:23:49.79 +0400>,<she>,<DPX200>,
      <created by zg, POWCHK disabled, PULCHK disabled
       configuration hash MD5:
       00 E9 B6 7A A2 85 ED C7 34 08 36 98 17 FE 4E 26
       data hash MD5: 16K
       8A 0F A0 FE 91 43 47 91 9C 30 3C A4 65 8F 27 30>)
$$ ##END=
$$ 
$$ hash MD5
$$ 6E F6 65 D1 EE 6C 95 8B E1 31 64 30 3B 72 34 7E
##$RELAX= 
##$RELAX= 
##$RELAX= 
##$RELAX= 
##$RELAX= 
##$RELAX= 
$$ Bruker specific parameters
$$ --------------------------
##$DU= <F:/spectra>
##$EXPNO= 1
##$NAME= <H-F>
##$PROCNO= 1
##$TYPE= <nmr>
##$USER= <she>
##$AMP= (0..31)
100 100 100 100 100 100 100 100 100 100 100 100 100 100 100 100 100 100 
100 100 100 100 100 100 100 100 100 100 100 100 100 100 
##$AQSEQ= 0
##$AQ_mod= 1
##$AUNM= <au_zg>
##$AUTOPOS= <>
##$BF1= 200.13
##$BF2= 200.13
##$BF3= 200.13
##$BF4= 200.13
##$BF5= 200.13
##$BF6= 200.13
##$BF7= 200.13
##$BF8= 200.13
##$BYTORDA= 1
##$CFDGTYP= 0
##$CFRGTYP= 5
##$CHEMSTR= <none>
##$CNST= (0..31)
1 1 145 1 1 1 1 1 1 1 1 1 1 1 1 1 1 1 1 1 1 1 1 1 1 1 1 1 1 1 1 1 
##$CPDPRG= <>
##$CPDPRG1= <>
##$CPDPRG2= <>
##$CPDPRG3= <>
##$CPDPRG4= <mlev>
##$CPDPRG5= <mlev>
##$CPDPRG6= <mlev>
##$CPDPRG7= <mlev>
##$CPDPRG8= <mlev>
##$CPDPRGB= <>
##$CPDPRGT= <>
##$D= (0..31)
0 1.2 0 0 0 0 0 0 0 0.06 0 0.03 0 0 0 0 0.0002 0 0 0 0 0 0 0 0 0 0 0 0 
0 0 0 
##$DATE= 1656325429
##$DBL= (0..7)
120 120 120 120 120 120 120 120 
##$DBP= (0..7)
150 150 150 150 150 150 150 150 
##$DBP07= 0
##$DBPNAM0= <>
##$DBPNAM1= <>
##$DBPNAM2= <>
##$DBPNAM3= <>
##$DBPNAM4= <>
##$DBPNAM5= <>
##$DBPNAM6= <>
##$DBPNAM7= <>
##$DBPOAL= (0..7)
0.5 0.5 0.5 0.5 0.5 0.5 0.5 0.5 
##$DBPOFFS= (0..7)
0 0 0 0 0 0 0 0 
##$DE= 6
##$DECBNUC= <off>
##$DECIM= 32
##$DECNUC= <off>
##$DECSTAT= 4
##$DIGMOD= 1
##$DIGTYP= 9
##$DL= (0..7)
0 120 120 120 120 120 120 120 
##$DP= (0..7)
150 150 150 150 150 150 150 150 
##$DP07= 0
##$DPNAME0= <>
##$DPNAME1= <>
##$DPNAME2= <>
##$DPNAME3= <>
##$DPNAME4= <>
##$DPNAME5= <>
##$DPNAME6= <>
##$DPNAME7= <>
##$DPOAL= (0..7)
0.5 0.5 0.5 0.5 0.5 0.5 0.5 0.5 
##$DPOFFS= (0..7)
0 0 0 0 0 0 0 0 
##$DQDMODE= 0
##$DR= 18
##$DS= 0
##$DSLIST= <SSSSSSSSSSSSSSS>
$$ [...]
##$SUBNAM2= <"">
##$SUBNAM3= <"">
##$SUBNAM4= <"">
##$SUBNAM5= <"">
##$SUBNAM6= <"">
##$SUBNAM7= <"">
##$SUBNAM8= <"">
##$SUBNAM9= <"">
##$SW= 18.05172834244
##$SWIBOX= (0..15)
0 0 2 0 0 0 0 0 0 0 0 0 0 0 0 0 
##$SW_h= 3612.71676300578
##$TD= 16384
##$TD0= 1
##$TE= 0
##$TE2= 300
##$TE3= 300
##$TEG= 300
##$TL= (0..7)
0 120 120 120 120 120 120 120 
##$TP= (0..7)
150 150 150 150 150 150 150 150 
##$TP07= 0
##$TPNAME0= <>
##$TPNAME1= <>
##$TPNAME2= <>
##$TPNAME3= <>
##$TPNAME4= <>
##$TPNAME5= <>
##$TPNAME6= <>
##$TPNAME7= <>
##$TPOAL= (0..7)
0.5 0.5 0.5 0.5 0.5 0.5 0.5 0.5 
##$TPOFFS= (0..7)
0 0 0 0 0 0 0 0 
##$TUNHIN= 0
##$TUNHOUT= 0
##$TUNXOUT= 0
##$USERA1= <user>
##$USERA2= <user>
##$USERA3= <user>
##$USERA4= <user>
##$USERA5= <user>
##$V9= 5
##$VALIST= <valist>
##$VCLIST= <CCCCCCCCCCCCCCC>
##$VD= 0
##$VDLIST= <DDDDDDDDDDDDDDD>
##$VPLIST= <PPPPPPPPPPPPPPP>
##$VTLIST= <TTTTTTTTTTTTTTT>
##$WBST= 1024
##$WBSW= 4
##$XGAIN= (0..3)
0 0 0 0 
##$XL= 0
##$YL= 0
##$YMAX_a= 287765
##$YMIN_a= -391365
##$ZGOPTNS= <>
##$ZL1= 120
##$ZL2= 120
##$ZL3= 120
##$ZL4= 120
##$ABSF1= 10
##$ABSF2= 0
##$ABSG= 5
##$ABSL= 3
##$ALPHA= 0
##$AQORDER= 0
##$ASSFAC= 0
##$ASSFACI= 0
##$ASSFACX= 0
##$ASSWID= 0
##$AUNMP= <proc_1d>
##$AZFE= 0.1
##$AZFW= 0.1
##$BCFW= 1
##$BC_mod= 2
##$BYTORDP= 1
##$COROFFS= 0
##$CY= 11.3945322036743
##$DATMOD= 1
##$DC= 2
##$DFILT= <>
##$DTYPP= 0
##$F1P= 2.36226072786647
##$F2P= -0.459571619588291
##$FCOR= 0.5
##$FTSIZE= 0
##$FT_mod= 4
##$GAMMA= 1
##$GB= 0.15
##$INTBC= 1
##$INTSCL= 1
##$ISEN= 128
##$LB= 0.24
##$LEV0= 0
##$LPBIN= 0
##$MAXI= 10000
##$MC2= 0
##$MEAN= 0
##$ME_mod= 0
##$MI= 1.114404
##$NCOEF= 0
##$NC_proc= 0
##$NLEV= 6
##$NOISF1= 3.799351
##$NOISF2= 2.8
##$NSP= 1
##$NTH_PI= 0
##$NZP= 0
##$OFFSET= 15.70392
##$PC= 1
##$PHC0= -18053.71
##$PHC1= 21.40069
##$PH_mod= 1
##$PKNL= yes
##$PPARMOD= 0
##$PSCAL= 0
##$PSIGN= 0
##$REVERSE= no
##$SF= 200.130013532006
##$SI= 16384
##$SIGF1= 3
##$SIGF2= 2
##$SINO= 400
##$SIOLD= 16384
##$SREGLST= <1H.CDCl3>
##$SSB= 0
##$STSI= 0
##$STSR= 0
##$SW_p= 3612.71676300578
##$SYMM= 0
##$S_DEV= 0
##$TDeff= 0
##$TDoff= 0
##$TI= <>
##$TILT= no
##$TM1= 0
##$TM2= 0
##$TOPLEV= 0
##$USERP1= <user>
##$USERP2= <user>
##$USERP3= <user>
##$USERP4= <user>
##$USERP5= <user>
##$WDW= 1
##$XDIM= 8192
##$YMAX_p= 0
##$YMIN_p= 0
$$ End of Bruker specific parameters
$$ ---------------------------------
##NTUPLES= NMR FID
##VAR_NAME=  TIME,          FID/REAL,        FID/IMAG
##SYMBOL=    X,             R,               I
##VAR_TYPE=  INDEPENDENT,   DEPENDENT,       DEPENDENT
##VAR_FORM=  AFFN,          ASDF,            ASDF
##VAR_DIM=   8192,          8192,            8192
##UNITS=     SECONDS,       ARBITRARY UNITS, ARBITRARY UNITS
##FACTOR=    0.0002768,     1,               1
##FIRST=     0,             0,               0
##LAST=      2.2672688,     0,               0
##MIN=       0,             -391365,         0
##MAX=       2.2672688,     287765,          0
$$ Real data points
##PAGE= N=1
##DATA TABLE= (X++(R..R)), XYDATA
0 0 0 0 0 0 0 0 0 0 0 0 -8 8 -8 9 -16 16 -24 25 -32 40 -48 56 -65 79 -90 106 -123 143 -167 193 -219 250
32 250 -284 322 -364 412 -461 517 -580 647 -721 801 -890 986 -1091 1205 -1328 1466 -1618
49 -1618 1782 -1962 2161 -2381 2626 -2901 3209 -3557 3959 -4421 4965 -5609 6395 -7376 8635
64 8635 -10322 12712 -16376 22749 -36952 137888 -200696 -304598 213763 31734 -64104
75 -64104 175066 -5784 -302465 65496 230407 -83962 -55420 113591 -148011 -94892 235167
86 235167 52394 -171324 33384 -7631 -126811 147954 172653 -219639 -156937 163168 43297
97 43297 -54713 110842 -57885 -202054 126984 194389 -104899 -58616 52920 -95142 -827
108 -827 200639 -21596 -199564 26759 92195 -37145 58205 38876 -163306 -19913 162366
119 162366 -17359 -65813 58227 -59695 -96061 127903 88247 -135243 -40328 70736 -56359
130 -56359 13921 140285 -73752 -151956 90628 101472 -45088 1930 1499 -80896 29120
141 29120 112405 -33809 -74897 30747 -11868 -26928 91596 14796 -115769 -262 66751
152 66751 -17205 12568 28368 -82022 -43273 97724 32525 -74176 -3747 14224 -39280
163 -39280 43574 61377 -64659 -39106 50422 -510 -5353 51062 -18877 -71129 26541 60627
175 60627 -15713 -12957 641 -46643 12278 76773 -23038 -61970 20214 10114 -16026 34214
187 34214 8736 -58696 -9437 45347 -3787 -14399 20009 -25345 -31314 47889 26738 -33132
199 -33132 -3169 2991 -13573 31106 29242 -36505 -24311 29571 7802 -11717 21008 -7417
211 -7417 -40817 20402 31166 -24989 -4534 13048 -27677 -4665 37681 -3505 -33844 5141
223 5141 10995 -13500 15202 16301 -34763 -8525 34741 -3695 -10592 17346 -10827 -16442 26977
236 26977 15331 -23564 -2954 16749 -10933 -2891 23625 -12778 -22920 20858 4562 -20426
248 -20426 10675 7188 -21591 -1536 16282 -6412 -10300 9382 -3986 -13437 16723 8557 -21036
261 -21036 3279 13956 -9258 2734 11619 -9396 -5034 14895 3265 -11937 5006 9426 -11467
274 -11467 -313 13532 -10197 -7468 11380 -4399 -9053 6702 708 -9175 -243 5557 -5105
287 -5105 -4440 7951 -2629 -7517 8898 1508 -7172 6123 3210 -4842 3693 5249 -2422 -2145 6051
302 6051 3642 -6058 2465 5316 -6443 1131 5081 -6630 -1905 3745 -2451 -3922 -403 1980 -2922
317 -2922 -3819 3124 -1959 -3487 4573 -1724 -3340 4443 315 -1557 2651 1612 357 -160 3149 2182
333 2182 -2922 3265 2790 -4625 2814 2630 -4760 552 1951 -2428 -2075 -599 481 -2652 -1847 1070
349 1070 -3564 -870 3187 -4289 -1380 3839 -1818 247 2111 -1485 872 2579 1372 -211 39
364 39 3694 -668 -615 4963 -1970 -2208 4598 -2118 -1933 3523 -2197 -3149 1040 -176 -2017 -773 742
381 742 -3848 -2922 5382 -1199 -5156 4114 -1658 -4004 8360 1510 -7775 2027 6302 -505 128 4587
397 4587 -3365 -4745 10089 3766 -9380 4011 3489 -9454 4934 8543 -10401 -5514 6800 -2910
411 -2910 -4537 8557 -1267 -16140 4638 13108 -9171 -2056 7523 -12020 -1610 19651 -3021
424 -3021 -13907 7260 4488 -7812 10474 11677 -18520 -7693 20125 -638 -7891 11923 -9465
437 -9465 -17982 19890 13978 -19787 -5501 7818 -10219 1803 20789 -13548 -24715 17273 10264
450 10264 -15607 11509 7351 -27635 2522 28983 -6820 -12148 11682 -8706 -12054 29714 12489
463 12489 -33342 -2174 20255 -10973 6509 21896 -29181 -23641 33265 13006 -21578 3614
475 3614 -524 -25317 16350 34024 -25517 -24804 20457 -3045 -7525 31078 -6916 -41285 15707
488 15707 29981 -14959 333 16001 -28785 -12750 45974 7915 -35082 5608 4339 -19066
500 -19066 29608 25361 -45622 -21340 33919 3243 -9063 18735 -19445 -39068 32663 35929
512 35929 -31483 -11869 14266 -24145 5156 47333 -16096 -43108 17205 15756 -10450 24967
524 24967 7695 -52362 -2344 54662 -4450 -23610 16054 -18955 -23333 47537 22272 -47419
536 -47419 -10721 19893 -12567 12213 33436 -36250 -42563 36387 23190 -19360 12617 -7075
548 -7075 -46062 24527 55149 -24786 -33491 16754 -4197 -5698 42837 931 -55291 6248 36881
561 36881 -11546 6032 18037 -43256 -19303 53457 12439 -34205 2925 -2811 -25749 32136
573 32136 38136 -44398 -31886 30329 2450 -3043 30764 -21991 -48835 29954 39544 -20538 -5899
586 -5899 7505 -32116 3592 56963 -7709 -48352 11650 13606 -12687 28717 12547 -50807
598 -50807 -9585 41488 -210 -11901 14249 -23128 -29521 40783 28138 -37782 -10715 13035
610 13035 -18373 14070 39207 -28911 -39654 25990 19708 -11180 13604 -1447 -39061 10669
622 10669 44968 -12701 -20927 12852 -14576 -9418 41744 5864 -44033 -1739 22019 -6998
634 -6998 8735 15657 -34884 -21433 39075 11653 -23941 6112 -3809 -24358 23985 29958 -27727
647 -27727 -18282 17959 -3351 -2447 27840 -7619 -37039 13688 26865 -11130 1138 6678 -26664
660 -26664 -709 36355 -3067 -25821 5389 1988 -10732 19712 12391 -32040 -10064 24542
672 24542 -1770 -5962 13649 -14416 -20573 23073 16636 -17832 -3250 6271 -12218 6031 24783
685 24783 -11564 -21658 13372 6940 -7598 14042 1718 -25018 2990 21865 -5262 -7980
697 -7980 6272 -9890 -8597 20651 5622 -21993 -319 9514 -8416 4934 12140 -15523 -10541
710 -10541 15822 4015 -7573 5936 42 -12823 7700 15504 -9477 -6854 8744 -4689 -2438
723 -2438 13993 -2497 -14657 4735 7765 -5379 1395 4355 -10529 -4474 12859 -501 -9634
736 -9634 4103 -285 -7061 7822 5699 -10059 -2253 7404 -1372 -1395 6460 -2204 -7526 6540 6182
751 6182 -5656 1233 3858 -6364 1008 7627 -3175 -4848 3024 608 -3434 3097 2072 -6847
765 -6847 -1060 5434 -2932 -2325 3601 -3285 -3190 4665 785 -4054 751 2005 -1309 182 3629 -1513
781 -1513 -2562 4221 1116 -2401 2561 659 -2788 1426 1781 -1612 -276 708 -644 -1820 1466 436
797 436 -3157 247 1157 -2239 46 785 -1942 -214 1251 30 -134 348 979 -281 -20 1792 -306
814 -306 -280 1794 -359 -7 1186 -407 40 253 -77 341 -754 -445 112 -1103 310 -261 -1330 404
832 404 -364 -867 466 -519 -417 281 -242 606 283 133 1247 -165 279 941 -231 639 922 -43 816
851 816 -35 -295 518 -330 -114 39 -819 409 -544 -743 728 -991 -709 639 -917 -326 238 -632 106
870 106 415 -33 -85 -378 1049 407 -562 1410 -156 -877 2158 274 -830 1434 294 -800 201
887 201 924 -824 -1525 894 19 -2061 1346 429 -3292 253 1639 -2152 165 1149 -1989 -933 2587
904 2587 586 -2218 815 1983 -2254 1555 3279 -3217 -1106 4277 -449 -1410 2831 -657 -3150
919 -3150 2367 2836 -3134 -1717 2444 -3333 -1447 5591 -1877 -5926 2844 1523 -3410 2708 1939 -5765
935 -5765 -1279 6263 -483 -3597 3347 -994 -4503 6723 4146 -7400 -204 4698 -2991 1228 6187
950 6187 -4664 -6792 5923 4202 -5456 1349 1487 -8044 1844 9262 -5108 -6200 4581 -1911
964 -1911 -2871 8178 1017 -10906 653 8465 -3209 -221 6264 -7399 -6039 12536 3388 -8118
978 -8118 2368 1263 -6676 6696 9279 -9919 -7718 8490 658 -3696 8170 -3070 -14305
991 -14305 6912 11420 -7720 -2308 3903 -8343 -1088 14369 -1384 -13542 3266 5153 -5220
1004 -5220 8030 6494 -15863 -4145 15450 28 -5504 6271 -5589 -10075 12669 10793 -12698
1017 -12698 -5130 5946 -5674 1975 14280 -9466 -16308 9723 7110 -6436 5353 739 -16466
1030 -16466 2378 19029 -3797 -11160 5327 -3274 -5539 16919 5223 -19716 -994 11612
1042 11612 -3589 3203 9321 -14577 -11356 17228 8132 -11542 1137 79 -13221 9054 17791
1055 17791 -13279 -13347 8552 -413 -1616 13573 -3809 -21017 5366 16396 -5339 -2129 5032
1068 5032 -13754 -3820 22616 1868 -17323 2093 3412 -6170 11824 9913 -18483 -9175 14995
1081 14995 2366 -4384 8270 -8361 -16910 14571 15147 -12833 -5350 4257 -9248 3533 18854
1094 18854 -7782 -19178 7062 8246 -4799 8080 2562 -20484 131 20995 -1873 -8513
1106 -8513 5294 -7260 -7119 18668 8198 -18727 -4293 9205 -4336 3821 12207 -14302 -14711
1119 -14711 14639 7639 -8004 3718 -1882 -14472 7699 18107 -8289 -11768 5953 -1731 -2435
1132 -2435 15907 -224 -19722 3203 12882 -3579 1477 5212 -13329 -5315 18024 3947 -12448
1145 -12448 1338 574 -8374 10382 11252 -15297 -8785 10465 -32 -1906 8923 -6216 -14716
1158 -14716 9102 12378 -7592 -2725 3837 -9101 651 16462 -3283 -13267 4741 3243 -3948
1171 -3948 8458 3759 -14159 -2419 13251 -417 -4912 4626 -5587 -8007 11946 6828 -11003
1184 -11003 -1942 4163 -4802 2606 9285 -7286 -9932 7208 4858 -4750 4054 833 -10622 3088
1198 3088 11732 -4295 -5285 4013 -2831 -2083 9577 1441 -10308 551 6391 -3123 970 5041
1212 5041 -7932 -5074 8926 1879 -5815 2005 -262 -5874 4368 6235 -6121 -4604 4844 -787
1226 -787 -1833 6111 -1124 -7844 3973 5192 -3360 575 2561 -4645 -795 6874 -234 -4995 1642
1241 1642 1213 -3219 3223 2858 -6035 -1337 4561 -1302 -1495 2660 -2111 -3818 3400 2780 -3541 -359
1257 -359 2147 -2428 460 4455 -1926 -3299 2904 860 -1591 2169 695 -3191 469 3266 -1192
1272 -1192 -1601 1655 -889 -2240 2678 453 -3120 582 901 -1533 350 1317 -1597 -1594 1617 597
1288 597 -1664 613 652 -1777 866 1914 -1106 10 1195 -277 125 1171 217 -1127 468 1300
1304 1300 -611 -391 956 -1014 -593 1259 -398 -778 520 -293 -561 234 25 -500 -545 483 -141 -673
1322 -673 728 -34 -717 792 290 -278 445 193 40 413 -13 327 -234 204 241 -559 -113 202 -674 162
1342 162 73 -498 75 -282 -195 -77 -487 9 38 -493 46 -58 -73 310 -226 339 321 -117 532 210 5 351
1364 351 100 64 268 -125 397 154 -196 387 -385 -371 158 -406 -535 115 -506 -78 -426 -207 -146 -451 241
1385 241 329 -436 521 493 -454 571 389 -509 205 654 383 60 169 521 -715 269 854 -726 -386 770
1405 770 -857 -459 856 -524 -923 348 344 -747 171 687 -968 -623 1581 -255 -943 1310 88
1422 88 -1427 1513 954 -1256 -188 1160 -561 -403 1797 -481 -2074 1699 1086 -1848 741 769 -2712
1439 -2712 205 2369 -1279 -1657 1109 -574 -1679 2026 952 -3301 -55 2538 -1281 -47 2979
1454 2979 -1960 -2213 3408 1345 -2276 709 881 -2468 1559 4197 -2693 -2851 2881 -275 -1685 3184
1470 3184 -327 -5030 1474 3629 -2157 -882 1726 -3043 -1871 5267 400 -5067 1158 1617 -3076
1485 -3076 3009 3684 -5197 -2170 5069 623 -1827 3119 -1282 -4928 4022 4974 -4295 -1814 2767
1500 2767 -3163 130 6329 -2641 -6530 2835 2503 -2785 2527 1556 -6897 -663 7885 -929 -4277
1515 -4277 2666 -2315 -3424 7258 3358 -7252 -1152 4294 -1551 1103 5392 -5079 -6227 6823
1529 6823 3816 -4573 1479 12 -6811 2988 8375 -4481 -5858 2947 -667 -1738 6658 19 -10126
1544 -10126 1182 7337 -2522 -20 3183 -7095 -3235 9924 1953 -6886 993 1360 -3900 5671
1558 5671 6883 -8407 -5313 6919 543 -1784 5592 -3670 -9295 6098 7907 -5338 -2655 2046
1572 2046 -5620 170 10544 -2108 -9916 2851 3255 -2999 5798 2692 -10632 -1501 9810 -37
1586 -37 -3371 3053 -3994 -5522 9454 6264 -9279 -2572 4371 -3256 2606 8016 -6812 -8728 6749
1601 6749 4436 -3850 2568 -604 -9536 2799 11109 -4091 -6246 3175 -2307 -1724 9651 634
1615 634 -11232 505 6973 -2007 1453 4099 -8243 -4887 10794 3048 -6911 1407 -486 -5818
1629 -5818 6478 8067 -8148 -5841 5231 -81 -765 6519 -3378 -10368 4579 7852 -3895 -1104
1643 -1104 2060 -6798 21 10804 -581 -7942 1951 1711 -2323 6020 3858 -9621 -2814 8265
1657 8265 65 -2278 3643 -4407 -6006 7785 5066 -6640 -1956 2324 -3704 1773 7565 -4988
1671 -4988 -7867 4927 2929 -2625 3800 -194 -8236 1629 8561 -2070 -3550 2551 -2674 -2345 7770
1686 7770 1778 -7821 -79 3930 -2243 1694 4427 -5696 -3653 6714 2775 -3221 852 -171
1700 -171 -5319 3729 6138 -4631 -3531 3100 -845 -463 5296 -1516 -6336 2353 4016 -2297 239
1715 239 1873 -4128 -720 6715 334 -4446 1332 439 -2491 3542 2483 -5357 -1782 3729 -541
1730 -541 -1092 2827 -1968 -4166 3394 2957 -3439 -519 1233 -3020 702 4307 -2081 -3176 2013 1079
1746 1079 -1484 2013 996 -3678 168 3826 -1066 -1114 2055 -1473 -1618 3397 970 -3151 205 1519
1762 1519 -1353 483 2248 -2022 -2040 2415 660 -1869 1212 -101 -2309 1404 2267 -1549 -802 1306
1778 1306 -650 -927 1838 223 -1977 820 1076 -1106 562 979 -1602 -394 1495 -279 -1263 456
1794 456 162 -996 761 1053 -1205 -667 712 -668 -365 991 -688 -1063 722 603 -459 -16 754
1811 754 -486 -67 1097 -358 -524 539 228 -385 707 161 -543 -2 359 -471 -602 154 44 -725
1829 -725 -3 231 -482 177 147 -362 251 162 -395 113 35 -84 33 130 99 3 149 428 -45 18 59 -37 100
1852 100 378 65 -1 -17 -16 26 -318 -13 -215 -286 165 -421 -207 90 -148 -244 249 -78 127 109 -38 -114 -293
1875 -293 8 352 -168 231 75 -314 384 217 -338 163 198 41 133 -17 -120 -458 -127 59 -304 -148 266
1896 266 -615 -258 256 -151 52 130 62 -221 212 431 -227 -205 539 -262 -38 704 -174 -342 608 -117 -169
1917 -169 3 109 -409 -259 623 -239 -625 332 -57 -949 733 242 -954 109 415 -349 -58 480 -203
1936 -203 -395 837 657 -605 160 782 -1039 376 1179 -778 -646 940 -11 -346 1095 -117 -1638
1953 -1638 436 1057 -1038 -157 919 -1285 -793 1838 -161 -1592 399 218 -1315 637 1239 -1357
1969 -1357 -702 1830 130 -395 1563 -210 -2120 1555 1799 -1661 62 1048 -1239 -54 2299 -557
1985 -557 -2637 903 804 -1355 1079 969 -3034 -263 2960 -741 -1432 1288 -886 -1450 2640 1561
2001 1561 -2661 -269 1802 -1004 329 2850 -2108 -2600 2758 1369 -1545 1277 210 -3097 981
2016 981 3534 -1669 -2520 1546 -742 -1258 3537 156 -4793 411 2950 -1223 426 1274 -3186 -1893
2032 -1893 4412 1303 -3366 845 405 -2516 2710 3675 -3723 -2493 2989 15 -727 2871 -1424 -4574
2048 -4574 2417 3797 -2352 -870 1407 -3322 -155 5342 -1161 -4993 1192 950 -1473 3024 1582
2063 1582 -5497 -1170 5222 140 -1573 2217 -2295 -3347 5159 3172 -4397 -1071 1524 -1942 1558
2078 1558 4681 -3416 -5077 3326 2251 -1979 1809 -207 -5852 1415 6058 -2048 -2879 1242 -1654
2093 -1654 -1099 5688 973 -6195 -136 3415 -1202 1563 2704 -4899 -3128 5966 1990 -3041 654
2108 654 61 -3482 4027 5383 -4402 -4473 2798 -203 -1067 4382 -1646 -6277 2802 4567 -1648 -10
2124 -10 569 -4497 -366 6801 -794 -4736 121 491 -1314 4822 3505 -6145 -1537 4925 -151 -325
2140 -325 2588 -2507 -3709 4556 3683 -3625 -944 1262 -3085 1467 5553 -2973 -5232 2487 1604 -1188
2156 -1188 2707 46 -5383 513 5179 -664 -2110 1832 -2194 -1745 5550 1689 -5412 -188 2032
2171 2032 -1279 1955 2956 -4506 -2902 3665 1513 -2370 1323 -767 -3932 2845 4163 -3100 -2448
2186 -2448 1694 -927 -192 4097 -920 -4841 1504 3007 -1116 375 1427 -3832 -667 4810 63
2201 63 -2938 1207 -358 -1756 2997 2302 -3940 -1606 2677 -229 -408 2383 -2201 -3459 2821 2295
2217 2295 -2370 -186 554 -2449 737 3515 -1478 -2973 1367 643 -964 2158 738 -3720 283
2232 283 3017 -748 -701 1183 -1571 -1118 2900 1141 -2684 148 1212 -1425 1073 2126 -2378 -1745
2248 -1745 2141 288 -1172 1146 -151 -2374 1176 2040 -1334 -877 1276 -881 -532 2394 -266 -2426
2264 -2426 643 1113 -775 414 782 -1717 -580 1970 62 -1203 504 -133 -1216 1368 1357 -1676
2280 -1676 -426 786 -673 -225 891 -485 -1444 772 869 -616 -6 523 -1142 129 1399 -596
2296 -596 -423 790 -134 -366 632 387 -783 72 948 -434 -280 607 -240 -534 1121 231 -682 -22 420
2315 420 -446 146 393 -312 -484 557 177 -269 536 176 -420 454 668 32 -102 -74 -55 -127 239 53 -446
2336 -446 48 195 -248 205 419 -365 100 110 -53 47 68 87 -214 82 92 -373 -26 425 16 28 140 109
2358 109 -107 384 27 121 164 190 426 -126 203 9 -117 157 123 -359 -156 129 -148 100 -30 -221 -96
2379 -96 -18 -139 -150 -54 -80 15 -95 234 -237 -46 -23 -195 16 102 -264 177 6 244 51 -184 227 -40 -66
2402 -66 254 -89 -103 232 -167 -72 36 -35 -100 -88 161 -91 -48 58 -215 -195 145 -122 -415 15 295 -262 289
2425 289 191 -173 9 347 84 -340 169 37 -603 28 262 -444 -23 233 -436 -163 340 -112 -418 174
2445 174 129 -404 58 340 -613 -280 708 -240 38 281 -185 -245 247 513 -342 -31 399 -437 -23 917 -95
2466 -95 -451 795 73 -567 446 169 -1081 -118 820 -149 -676 385 -375 -677 840 378 -1083 -27
2484 -27 562 -782 312 1167 -933 -883 976 538 -507 492 612 -1066 664 1572 -973 -827 478 -549
2502 -549 -377 1444 224 -1872 44 1089 -511 135 728 -1629 -783 1862 446 -1067 644 121
2518 121 -1362 1400 1665 -1606 -745 1384 -101 -306 1441 -482 -2035 1084 1556 -1225 195 594
2534 594 -1821 3 2321 -335 -1704 535 215 -772 1676 910 -2675 -607 2460 -341 -583 1256
2550 1256 -1397 -1726 2405 1284 -2020 -324 621 -952 714 2418 -1604 -2153 1794 909 -616 1311
2566 1311 -271 -3019 795 2702 -1254 -1392 572 -835 -1053 2989 276 -3271 105 1635 -903
2581 -903 1088 1836 -2807 -1489 2813 747 -1439 751 -476 -2133 2065 2835 -2533 -1670 1532 -808
2597 -808 -240 2515 -1220 -3446 1294 2184 -1024 249 691 -2775 -393 3622 -176 -2568 870 -195
2613 -195 -1273 2943 1344 -3361 -1117 2498 -68 -63 1736 -1776 -2635 2831 1989 -2247 -229 353 -2148
2630 -2148 1182 3457 -1909 -3134 1293 639 -1115 2126 88 -3885 237 3368 -646 -1168 892
2645 892 -1836 -1054 3625 796 -3142 -216 1292 -1060 1072 2241 -3154 -2005 2726 921 -1276
2660 -1276 1024 -597 -2848 1856 3013 -1888 -1607 975 -1316 59 3028 -603 -3582 1107 1936
2675 1936 -1233 866 779 -2913 -498 3392 251 -2010 764 -417 -1238 2541 2096 -2953 -1059 1998
2691 1998 -343 -27 2018 -1767 -2668 2067 1609 -1585 172 299 -2004 286 2759 -1245 -2484 1094
2707 1094 -152 -754 1863 310 -3025 -29 2268 -302 -501 949 -1586 -1140 2562 1033 -2353 -63
2723 -63 745 -1085 1030 1692 -1828 -1745 1322 309 -720 966 -566 -2236 900 1879 -1030 -740 777
2740 777 -1164 -439 2124 -110 -1885 488 798 -688 700 877 -1834 -637 1892 253 -964 373
2756 373 -158 -830 1127 1038 -1222 -525 877 -375 -100 1202 -939 -1410 1033 581 -767 449 227
2773 227 -1067 259 1466 -295 -854 502 -274 -108 1147 419 -1235 173 1231 -314 -173 975
2789 975 -579 -625 837 435 -1011 37 335 -435 175 775 -777 -519 482 -160 -449 760 -168 -810
2807 -810 509 747 -336 -134 79 -132 -241 651 109 -717 426 191 -222 186 404 -712 -50 276 -231
2826 -231 -341 104 -26 -645 297 246 -608 -59 284 -474 -265 541 28 -389 252 444 -277 246 466 -235
2846 -235 -91 236 264 -173 252 -291 -106 5 -32 -236 -31 185 131 -153 44 -129 -105 123 0 -203 159
2867 159 144 -283 216 144 22 -63 -197 196 -32 120 -7 11 -115 216 -80 0 147 113 173 -91 -423 15
2889 15 310 -121 -171 -36 -21 -127 53 8 -111 -67 263 -19 -133 125 62 -111 -42 -32 108 -130 -22 7 -73
2912 -73 -14 -27 -138 255 77 -54 27 202 -314 -145 -35 -275 -138 -22 257 -94 26 214 -233 -152 29 -154
2934 -154 -82 28 114 5 238 127 -92 -39 231 -61 31 175 30 -281 7 -41 -132 79 166 -212 -243 344 138
2957 138 13 -7 -391 -299 -16 158 -361 -18 -58 -102 67 249 -22 -198 194 215 -321 649 330 -438 457 390
2979 390 126 -300 171 -313 -78 437 52 -518 151 460 -328 89 575 -514 -349 850 71 -256 253
2998 253 226 -586 212 671 -627 -208 799 -389 -214 761 -53 -945 294 761 -570 48 30 -742 -231
3017 -231 1004 -107 -1010 320 26 -723 786 532 -1051 -312 987 -257 -282 563 -601 -930 600
3034 600 532 -753 -3 618 -628 236 1424 -699 -1189 827 440 -364 827 108 -1566 103 1280
3051 1280 -587 -523 682 -826 -860 1438 207 -1789 -23 588 -667 369 741 -1191 -925 1512 367
3068 367 -910 534 -221 -1368 1210 1576 -674 -545 577 -527 -236 1661 -412 -1901 7 1354
3084 1354 -554 46 467 -1638 -591 2099 117 -1020 293 -139 -907 1352 1458 -1713 -1053 1131
3100 1131 -37 -51 1535 -1204 -1778 1491 1366 -924 -40 368 -1503 525 2251 -728 -1624 897 229
3117 229 -580 1438 264 -2607 -13 2045 -203 -569 729 -1180 -997 2085 1159 -1854 -238 481
3133 481 -892 1060 1898 -1447 -1714 1519 930 -584 881 -366 -2225 641 2256 -792 -1076 742
3149 742 -851 -263 2192 256 -2369 214 1132 -650 906 879 -1817 -913 2411 611 -1322 530
3165 530 -268 -1401 1616 1757 -1545 -965 1174 -241 206 1615 -910 -2053 965 1343 -955 240
3181 240 556 -1661 -19 2350 -501 -1555 478 -97 -594 1365 600 -2002 -361 1458 -180 -245 931
3198 931 -1237 -1249 1724 910 -1292 -213 377 -910 490 1615 -1151 -1564 590 397 -552 782 -168
3215 -168 -1918 391 1641 -338 -435 477 -1030 -523 1758 544 -1798 -56 929 -481 751 1106 -1430
3232 -1430 -729 1748 247 -549 292 -179 -1009 923 1533 -909 -624 645 -362 151 1568 -336 -1510
3249 -1510 627 643 -454 453 286 -1041 -248 1395 -7 -1038 560 -33 -717 1022 676 -1339 -221
3266 -221 921 -211 -30 880 -754 -849 681 539 -718 9 354 -880 404 929 -562 -844 715
3283 715 167 -358 661 207 -908 248 775 -329 -200 406 -544 -464 954 350 -835 59 302 -422
3301 -422 294 332 -409 -510 591 -7 -307 251 -141 -723 449 676 -353 -177 215 -293 -68 554 33
3320 33 -459 270 437 -340 250 344 -653 47 668 -163 -288 340 -56 -247 322 258 -397 -275 521 -9 -194
3341 -194 389 -124 19 247 27 -204 332 292 -331 -25 367 -64 -29 62 -141 -106 250 278 -146 137 231 -76
3363 -76 -80 237 116 -84 220 315 -215 -232 26 -51 117 169 -99 -123 84 -78 -284 181 -122 -400 -265 237 -190
3386 -190 -93 121 93 57 3 23 -71 30 -23 -238 -43 -23 -65 -3 -99 68 -271 -140 93 -42 72 152 238 15
3410 15 176 -158 -234 -178 102 -130 -37 244 -225 64 29 -117 -24 172 16 6 220 204 55 -30 -301 -269 172
3433 172 248 -192 123 263 -452 -115 153 -84 80 -130 -44 -4 -175 221 -136 -235 155 -118 -54 42 133 -363
3455 -363 39 352 55 95 302 -167 -116 96 -89 -14 143 256 -319 -12 293 -45 -11 362 -90 -200 77
3476 77 -33 -195 11 52 -122 279 433 -64 -212 174 48 40 211 205 -9 101 239 -16 17 141 -148 -162 553
3499 553 97 -286 -105 -16 -179 62 381 -704 -239 314 -316 -259 195 -183 -521 391 356 -313 124 298 -16
3520 -16 152 368 -428 -377 285 147 -100 420 240 -422 -247 454 -193 -100 484 -428 -442 541 367 -649 -67
3541 -67 370 -246 51 641 -308 -582 376 461 -194 452 152 -918 69 1192 -175 -361 174 -123 -453 651
3561 651 122 -1037 -76 517 -431 11 229 -566 -475 789 230 -567 54 39 -695 283 851 -507 -604 511
3581 511 -93 -230 751 -497 -1064 638 785 -526 -51 424 -700 -158 1323 -8 -1203 314 19
3598 19 -559 682 634 -1134 -384 1054 136 -331 645 -383 -1036 1036 982 -1138 -108 576 -635 93
3616 93 1271 -513 -1109 677 379 -407 527 139 -1306 144 1393 -42 -587 242 -690 -651 1136 394
3634 394 -1515 -110 634 -683 261 743 -1297 -791 1124 358 -557 346 -2 -997 838 1262 -578 -767
3652 -767 511 -515 -208 1269 -203 -1893 142 1059 -696 -81 409 -1186 -463 1401 258 -1390
3668 -1390 126 -10 -806 847 960 -1455 -801 938 -57 -71 577 -550 -1318 928 1013 -559 -43 110
3686 110 -802 226 1613 -433 -1317 454 237 -478 823 358 -1362 -172 1247 13 -391 266 -720
3703 -720 -871 1202 702 -1283 -230 634 -753 437 979 -871 -880 993 686 -280 488 184 -1310 573
3721 573 1323 -503 -568 446 -564 -272 1158 159 -1007 94 607 -506 343 523 -904 -408 1256
3738 1256 273 -863 192 42 -762 562 753 -848 -614 572 -150 -39 672 -112 -1102 638 836 -610
3756 -610 -5 381 -712 -229 1251 -32 -994 255 344 -369 700 552 -1003 56 616 -228 63 414
3774 414 -456 -579 955 460 -644 -153 352 -129 162 592 -265 -443 366 -38 -276 472 -116 -720 218
3793 218 588 -267 -351 230 -356 -255 708 99 -520 175 345 -218 139 325 -741 -302 403 40 -548 151
3813 151 -130 -317 290 64 -336 -243 279 -52 -103 474 139 -478 53 304 -492 -111 364 -289 -2 415 -68
3834 -68 -269 405 125 -321 263 228 -148 24 260 -101 45 122 -133 -56 214 81 -65 84 112 -105 104 478
3856 478 -186 -58 210 -299 -298 38 159 -355 71 158 -276 -174 5 -104 -273 5 242 62 47 -29 -217 46
3878 46 233 96 -66 301 -96 -49 139 4 -79 -83 87 -81 -191 -27 -277 -203 -166 -81 -324 -11 164 -149 50
3901 50 181 47 -29 319 173 -312 -88 139 277 112 -7 61 280 -28 -48 -219 88 117 -267 -213 -132 275
3923 275 82 9 -264 315 13 34 28 -49 -208 -167 159 102 283 -63 103 -130 -265 126 26 -7 59 102 156 67
3947 67 -63 -162 -251 27 -10 -6 94 300 -19 99 11 -426 8 23 108 22 84 -175 -29 275 117 -236 84 200
3971 200 -14 -8 282 271 -12 63 -161 124 -66 102 26 182 110 -91 -314 135 -69 -226 -10 -99 269 265 122
3994 122 -164 -162 158 -102 -81 -112 -183 -74 182 34 -98 282 100 -150 -72 242 -154 125 181 -90 -37 354 10
4017 10 -259 136 222 -385 -226 152 -178 -18 204 -80 -161 351 100 -44 81 11 -106 -164 47 -124 -428 116
4039 116 -370 -529 594 228 -278 124 381 -173 42 304 -97 -344 502 363 -350 -75 93 -424 134 739
4059 739 -351 -155 273 -114 -347 470 -45 -223 166 768 -111 -92 230 -250 -208 638 -10 -675 95 280
4079 280 -389 317 444 -814 -531 464 164 -217 485 -302 -522 239 501 -129 82 173 -420 -58 678 -185
4099 -185 -811 389 452 -18 392 193 -785 -307 837 -256 -445 169 -339 -589 528 642 -827 -183 422
4118 422 -235 101 716 -557 -650 630 475 -345 216 38 -821 203 1005 -322 -619 349 -287 -509 1070
4137 1070 -24 -1194 83 531 99 86 348 -851 -642 636 415 -686 275 75 -587 447 703 -818
4155 -818 -622 555 -32 41 773 -241 -1065 372 700 -240 -147 142 -988 -313 1175 -71 -942 159
4173 159 65 -277 671 300 -992 -559 940 -44 -229 436 -518 -763 799 764 -652 -415 361 -464 241
4192 241 991 -391 -754 343 445 -514 571 238 -771 95 818 -266 -542 222 -325 -648 997 247
4210 247 -1295 -165 448 -644 305 575 -740 -901 865 581 -718 187 -36 -719 402 1065 -500
4227 -500 -594 483 -62 -44 740 63 -1318 299 634 -449 58 216 -648 -421 1103 240 -812 142 -161
4246 -161 -369 651 517 -821 -536 697 81 -81 484 -374 -702 429 485 -552 -266 404 -279 -18 993
4265 993 -208 -703 431 194 -257 384 -53 -650 -228 553 -266 -81 324 -328 -446 628 204 -663 -46
4284 -46 259 -173 27 410 -259 -533 533 123 -415 155 130 -409 102 504 -475 -256 98 -69 -68 268 87
4305 87 -634 256 527 -356 -11 148 -401 -281 452 139 -243 142 147 -309 452 389 -231 -255 249 -103 -220 83
4327 83 48 -400 489 222 -307 -168 304 -301 -234 219 -362 -365 142 81 -526 56 170 -461 -210 296 112 -51
4349 -51 3 2 -172 2 232 -247 28 470 -262 249 227 125 -123 101 83 -56 91 -45 -285 -69 348 -221
4371 -221 -293 268 -96 -142 267 -70 -45 36 153 -96 -23 98 -52 -292 63 63 -223 109 88 -69 309 98 -58
4394 -58 50 35 -104 -11 245 -49 115 19 170 -28 -50 206 -129 -205 -6 -171 -134 -55 -64 -34 18 275 -27 -52
4418 -52 207 3 -217 -75 163 -154 138 -61 -64 182 -102 -59 -229 164 200 -192 -44 17 80 60 9 -58 -221
4441 -221 176 -1 293 60 -335 97 26 -158 -100 70 174 86 33 145 -70 48 38 185 4 -80 38 78
4463 78 -167 467 11 84 275 234 19 249 142 177 -73 114 206 107 106 -50 1 -212 -66 -191 130 -121 29
4486 29 237 175 -12 -205 1 22 -181 137 -65 -163 -55 -190 -114 109 44 -279 -114 5 -88 -54 246 231 -98
4509 -98 127 112 140 -172 389 -226 -175 162 -206 -243 92 -97 -122 219 230 -281 -10 227 -55 -6 58 -127 -312
4532 -312 -26 97 -298 50 -62 -172 121 135 -149 -136 94 20 -194 135 195 -579 7 265 14 88 338 -81
4554 -81 -174 459 145 -38 164 235 -357 157 441 -356 -235 90 -78 -166 269 -406 -291 162 327 -133 -414
4575 -414 242 -461 -140 419 21 -631 216 231 -177 274 357 -341 -159 659 122 -173 250 -31 -443 581
4595 581 366 -445 -262 33 -225 -96 458 -88 -700 304 301 -214 192 443 -766 64 494 -158 -185 361
4615 361 137 -237 454 361 -585 -32 542 -102 46 165 -566 -454 454 301 -369 147 189 -720 387 519
4635 519 -441 -641 490 174 66 466 -126 -752 424 533 -279 95 273 -636 116 1025 65 -606 -44
4654 -44 229 -567 734 415 -621 -394 459 59 -169 238 -188 -585 399 423 -518 -383 80 -264 99 809
4674 809 -409 -868 238 176 -284 322 347 -976 -89 855 50 -365 167 -282 -644 719 504 -780 -201
4693 -201 330 -195 -1 367 -582 -628 388 246 -484 210 -110 -695 191 920 -240 -687 246 -181 -183 870
4713 870 253 -785 135 385 102 -234 486 -701 -369 727 114 -841 207 -42 -540 469 529 -704
4731 -704 -464 611 47 -149 330 -177 -722 555 536 -446 22 435 -765 -62 804 -94 -512 314 100
4750 100 -261 351 334 -788 -19 804 260 -186 472 -235 -362 384 252 -659 -167 393 -382 372 749 -219
4770 -219 -436 315 286 -199 484 -63 -433 116 440 53 -118 321 -225 -286 613 159 -417 46 630 116 79
4791 79 343 -487 -166 419 329 -454 352 -67 -504 97 583 -296 -270 258 -15 -259 386 -374 -728 290 308
4812 308 -313 239 141 -318 158 533 -2 -66 140 204 -446 -61 62 -591 -258 451 -131 -359 301 -34 -275
4833 -275 220 197 -557 -11 42 -347 -69 674 108 -412 606 86 -189 91 265 -395 16 290 -195 -209 244
4854 244 -240 -6 349 -167 -81 51 254 -80 67 36 -147 -243 374 -72 -119 -98 82 -292 113 378 128 37
4876 37 266 184 44 95 243 -192 130 10 -155 -135 151 81 -70 -49 141 -262 186 299 -150 70 132 -214
4898 -214 105 294 27 58 281 -195 -273 19 148 -33 128 180 -20 -94 162 -48 -32 203 0 -111 122 -188
4920 -188 -70 59 -144 -10 -173 -369 -109 -218 25 -288 -9 101 -72 -228 117 1 73 -94 -28 296 265
4941 265 38 90 -96 -58 -81 -19 -37 -303 -50 -252 -106 75 20 20 -264 78 72 179 149 -115 203 -162 -59 225
4965 225 139 -174 73 123 -212 83 131 62 -28 106 -44 152 176 3 99 -30 -18 7 133 41 161 -80 -48 -122
4989 -122 -103 82 224 263 -30 99 -180 -175 -49 -185 -322 91 -22 -343 -33 28 -316 35 -89 -16 -137 -146 -131
5012 -131 -58 -51 147 -104 115 183 108 -89 187 -102 -146 -57 -39 -59 -112 -149 -74 75 470 -63 22 322 -231 -364
5036 -364 167 411 -77 -76 107 -111 53 313 -156 -320 54 89 -238 181 -133 -274 -53 -176 -96 42 292
5057 292 -84 172 184 73 -82 34 68 -73 45 175 -264 56 247 268 -206 66 -37 -195 142 350 -55
5078 -55 99 79 -254 -128 333 40 -387 81 227 116 199 183 -460 18 176 -230 -346 248 -236 10 333
5099 333 257 -234 -240 225 -212 -54 330 -162 -458 384 238 -190 63 156 -219 -168 540 -113 -61 131 -38 -157
5121 -157 60 150 -586 -1 463 -320 22 395 -55 -238 600 72 -151 149 65 -214 447 703 -456 -300
5141 -300 329 105 -244 253 -207 -464 133 350 -266 -231 110 -169 24 543 82 -428 181 157 -313 364 241
5162 241 -639 -66 622 -49 -226 216 -227 -298 608 307 -433 -103 228 -90 250 425 -297 -561 280 277 -97
5183 -97 197 148 -297 72 678 -40 -421 9 -193 16 543 292 -559 -202 332 -86 0 393 -572 -387 734
5204 734 15 -349 -86 216 -473 284 562 -696 -251 231 -139 -136 583 -221 -825 452 473 -286 7 137
5224 137 -418 -353 860 19 -353 371 259 -270 552 287 -589 -243 597 194 -90 -50 -458 -696 309 482
5244 482 -509 50 414 -441 132 428 -300 -537 304 306 -83 169 117 -504 -7 534 -97 -34 69 -111 -26 571
5266 571 69 -474 95 19 -194 163 227 -386 -389 552 269 -354 98 -88 -431 239 452 -313 -171 151 -52
5287 -52 -319 509 8 -462 -5 426 -143 107 -104 -385 -77 486 166 -358 -76 -80 -377 40 92 -247 -74
5308 -74 114 -1 -210 334 -215 -467 364 249 -162 -58 147 -274 44 396 -230 -303 538 96 -189 15 92
5329 92 -233 -11 383 -101 -104 222 -217 -378 43 130 -345 -109 232 -99 -91 201 -248 -186 37 68 -366 13 189
5352 189 -574 49 535 -126 8 222 -39 159 167 173 -409 76 234 99 147 -29 -98 -123 368 -88 -46 256 80
5375 80 -94 -64 -130 -255 -64 89 45 -31 54 -151 -18 167 140 -518 49 7 -184 15 17 72 -112 -39 229 56
5399 56 58 37 -83 -225 108 62 6 47 -41 -229 -70 -6 38 100 386 -56 68 16 -9 -16 274 312 -101 122 144 -101
5425 -101 -25 -30 -290 206 -69 26 -26 -6 -211 2 159 291 51 75 21 -265 -63 -85 -191 -19 170 183 11
5448 11 10 102 -1 -30 42 -133 103 172 83 52 262 159 121 -190 -11 27 -129 -43 -147 44 -64 -39 -153 26
5472 26 188 -109 -183 -127 130 -152 -67 -109 -118 -195 -313 75 -15 67 -99 -162 -90 -278 -144 -3 31 -175 -88 6 -126
5497 -126 -22 -123 -32 -169 89 -86 -33 28 -116 -92 16 114 -333 -186 116 26 -24 7 -93 -343 91 -183 205
5520 205 172 18 -148 53 2 -164 -150 -87 332 -3 224 -12 -91 171 58 -156 -61 155 59 9 94 56 -106
5543 -106 133 -6 -161 100 251 -93 -2 135 -96 -13 58 -125 -26 430 -45 9 86 226 33 19 295 -49
5565 -49 -419 137 413 9 12 48 -240 -246 318 257 79 -63 49 -105 -80 -72 -356 -100 113 171 -34 27 -101 -151
5589 -151 70 310 -49 -44 17 -53 -125 176 60 -422 364 110 4 293 -54 -217 71 133 47 170 176 -123 -26
5612 -26 158 518 -4 -124 69 -142 246 169 -299 -228 77 -118 -116 247 -146 -517 156 132 14 -93 25 -119
5634 -119 -329 253 -28 -380 -23 -2 -112 201 407 -414 -348 443 14 -72 130 -153 -162 134 397 -310 -213 265
5656 265 -192 93 528 137 -417 157 98 -257 180 210 -134 -183 470 -211 -259 148 -155 -292 286 247 -504 -106
5678 -106 316 46 317 374 -305 -262 406 199 -22 203 145 -274 200 385 -263 -392 60 20 -55 189 -89 -414
5700 -414 24 425 31 52 148 -306 -234 489 285 -306 -61 429 -144 85 -25 -459 -365 394 -99 -205 357
5721 357 -161 -521 264 488 -120 -64 126 -115 -43 314 -116 -300 284 189 -60 230 229 -456 39 525 -47 -95
5743 -95 119 -138 -225 297 141 -432 96 221 -79 103 402 -115 -455 312 65 -199 53 118 -324 -198 423
5764 423 -309 -362 189 38 -360 230 76 -462 -141 44 -96 146 188 -205 -342 319 -45 -370 -91 103 -383
5785 -383 124 405 -158 -350 272 187 -58 332 -19 -426 -27 416 -129 199 46 -248 -165 539 -307 -244 221
5806 221 262 -122 82 -93 -356 -159 319 8 -45 125 -13 -202 292 390 -174 64 173 -90 181 257 -275
5827 -275 -101 315 -26 -199 81 -143 -119 -293 193 5 -303 -37 1 -96 147 -36 -417 -120 153 138 133 -107
5849 -107 -86 -309 91 65 -190 1 -104 -256 98 34 -204 -96 140 -104 -126 132 -4 -239 141 190 -138 146
5871 146 1 -27 -76 159 139 45 102 120 -116 196 260 -226 93 125 34 42 -73 -106 68 -161 46 -247 6 123
5895 123 -9 -281 315 58 -260 66 16 -37 -70 -68 -176 299 -7 -191 16 43 -113 -83 251 30 -159 348
5917 348 -95 -54 79 281 -157 -168 105 70 -16 -86 28 -358 -19 123 -68 82 -40 50 -110 13 157 -145
5939 -145 1 164 -281 -146 3 -169 60 89 -82 -112 75 7 32 74 191 10 101 61 98 -127 16 -13 -50
5962 -50 -24 85 48 -88 -108 32 202 -100 -21 -126 22 -5 -50 165 -127 180 105 310 4 -191 182 -257 31
5985 31 -75 119 -63 -83 309 -125 -189 253 -115 -187 0 -153 36 -19 -48 -70 -126 187 178 -45 133 75 80 49 -50
6010 -50 306 312 -42 -13 -82 59 15 -109 161 52 -236 148 -128 -101 -76 44 -187 -144 -179 -166 -20 87 205 9
6034 9 64 -164 -129 -129 3 -140 -52 22 193 -211 181 89 -76 -18 117 44 -178 254 -183 136 169 -228 -92 204
6058 204 -11 60 16 62 -23 -343 -46 -86 91 178 -16 104 3 151 -85 -118 251 31 221 197 -234 0 -71
6081 -71 -119 174 103 29 -115 -181 21 -55 -128 159 39 -191 121 119 -132 -151 -255 -19 -46 212 -23 -76 77 39
6105 39 -37 117 -47 -281 -234 -6 -6 -153 -230 -18 -137 199 84 -238 -47 27 -48 155 -87 -80 207 335 33
6128 33 -136 158 -97 -152 134 479 133 -113 68 -250 -177 170 17 -354 -11 85 -253 8 192 -156 -90 162
6150 162 -79 -198 3 10 -169 319 288 -328 -55 228 -163 -153 422 -355 -249 121 265 -341 165 -137 -38 49
6172 49 197 -19 35 93 -88 -28 239 -178 -548 -144 178 -86 -185 217 -186 134 188 118 -145 -143 11 -42 308
6195 308 403 -411 -46 448 121 39 295 20 -434 174 -64 -365 -140 -128 -270 99 305 170 -254 41 83
6216 83 -341 165 158 -403 -48 335 -132 -102 168 -93 -101 345 342 -388 -175 -26 -13 80 132 -166 -101 134 50 -122
6240 -122 50 71 -572 -56 442 -39 -59 192 -42 -336 152 -50 -495 66 353 -167 320 129 -224 -422 468
6261 468 153 -100 0 -21 -487 185 326 -263 -152 -132 -236 -133 252 -114 -307 151 65 -119 57 207 -516
6282 -516 -196 350 -35 -118 -25 112 -323 120 210 -265 -250 235 139 -196 82 -165 -159 301 -4 -73 -52 196 -145
6305 -145 -117 166 43 -321 104 256 -264 -82 128 -176 -141 468 154 -88 243 -14 -185 185 140 11 81
6326 81 183 -271 102 236 2 -203 -60 118 -175 16 -43 -169 186 148 -110 -150 282 -138 115 187 -222 -355
6348 -355 -135 187 -62 289 206 192 -131 297 54 -303 122 -193 -150 56 -21 -145 -219 141 5 -171 107 19
6370 19 -268 -133 -79 -79 -124 77 -245 -249 383 46 -221 122 261 109 -24 16 -39 -5 210 10 32 -77 -9 164
6394 164 250 -3 -301 119 67 -68 -164 34 -76 0 139 -9 -186 395 53 -242 136 103 -137 -5 75 -84
6416 -84 85 206 -106 32 -77 -26 10 -50 -70 -95 52 164 -144 -64 84 45 -264 -72 72 -269 -300 -30 64
6439 64 -129 169 -247 105 -132 6 45 23 168 -59 117 1 97 43 -11 -127 -78 151 210 -242 -90 -155 16
6462 16 -163 -65 221 -113 -66 75 -14 -141 -20 -29 -60 160 -2 -21 -231 48 -50 157 114 -40 165 68 79 136
6486 136 165 5 72 42 -76 -76 27 -68 42 -195 103 74 -47 164 12 -41 186 26 -122 219 302 54 125
6509 125 -142 -289 -24 18 23 -207 37 -91 -17 113 40 -125 -152 79 -51 -18 -34 153 214 177 215 10 159 172
6533 172 34 -133 -156 -134 -171 -68 -60 103 162 303 -40 -115 35 -39 -130 73 263 -136 65 -51 -11 -127 153
6556 153 -50 -67 115 -47 -227 19 -118 -53 -285 -48 -283 -271 60 -165 33 -109 84 -118 305 -1 -47
6577 -47 -51 -164 -340 -264 108 196 -296 -110 83 -144 196 367 62 1 71 -21 -132 158 60 -237 27 -224 -249
6600 -249 92 183 -62 194 21 35 -197 260 -93 96 118 66 -96 252 -205 -174 156 -83 56 52 139 -50 -2
6623 -2 -136 209 -11 36 31 64 11 98 -57 -149 16 -76 -134 93 181 101 -209 148 -100 -109 291 -195 -180 -132 -14 98
6649 98 54 87 -79 26 350 -117 -104 228 33 -17 59 -114 -145 -151 281 -132 145 76 54 77 221 353 -278 126
6673 126 194 -110 -80 224 -248 -146 76 -19 144 209 -152 -95 45 105 109 117 77 -109 14 306 -5 -31 267 -37
6697 -37 -10 102 126 -358 -75 -21 134 165 27 -63 -40 59 47 -358 -59 197 -158 287 318 -308 -143 167 123 216
6721 216 -82 -25 -348 1 97 93 -100 62 122 138 131 -96 -446 -78 372 11 135 380 -205 -178 94 39 100 237
6745 237 187 -190 266 307 -270 -143 -137 -18 -158 197 136 -136 -108 104 94 102 139 -249 -107 -46 47 -232 120 32
6769 32 -127 236 289 -38 -124 204 82 -123 -50 -200 -276 -43 229 -196 -37 -88 93 -26 327 58 -298 27
6791 27 5 -292 89 -225 -43 -162 -11 -76 -198 84 -13 -92 365 139 -276 -21 17 -1 -57 41 -242 -166 130
6814 130 -45 -40 -12 235 -275 7 240 78 186 249 -117 -138 210 -213 -79 -80 -170 150 -244 46 -215 -349 113
6837 113 115 -64 -5 -196 -115 222 210 -70 -114 106 32 -100 133 -2 -250 118 44 -197 86 160 -13 -56 58
6860 58 -48 -54 -79 141 -358 -127 -23 31 121 98 84 -23 151 -171 170 170 21 -165 -5 -103 -295 66 174 -254
6884 -254 47 77 -19 179 30 331 -77 123 186 -256 -106 205 3 103 167 -85 7 -133 48 -21 120 184
6906 184 -38 -29 71 -56 -117 136 72 18 113 163 172 -92 102 -108 78 -31 8 59 29 -19 74 121 113 -243 -61 203
6932 203 66 -223 -233 23 -136 105 97 62 129 -33 40 23 41 -95 -10 -24 64 -237 -151 14 -54 105 156 -82 -131
6957 -131 -95 -282 -89 -68 -164 16 147 155 -216 -39 159 -33 45 -3 159 67 -41 34 -80 41 -124 -9 -66
6980 -66 -278 194 -3 -159 -165 -139 221 237 -7 -117 56 -247 -162 -124 94 -115 -68 111 -261 -234 35 66 -295
7003 -295 86 -113 -18 187 147 54 48 298 72 -92 259 -8 -122 30 -102 -172 43 69 99 104 12 104 180 95 52
7028 52 -122 24 218 218 152 188 81 -175 113 -209 169 -143 159 154 -20 -149 158 -20 -97 158 -48 -10 88
7051 88 -58 91 154 -79 158 -32 130 -107 107 -96 -229 126 -229 145 -102 33 -25 -135 192 -263 -36
7072 -36 71 -231 7 -59 -51 -97 69 -161 118 177 55 159 117 -5 11 100 64 176 -197 75 -35 0 -121 -133
7096 -133 -207 -60 54 54 -98 178 197 -35 34 183 -74 115 -103 -76 -202 -39 23 -200 -9 102 -57 -60 25
7119 25 -175 102 45 -126 -22 -66 -33 -159 26 -156 -16 113 -3 35 -149 31 -131 -13 251 -175 78 221
7141 221 -28 93 79 242 -125 86 -13 -258 -124 93 57 -67 210 57 -13 24 -34 48 -271 226 -107 0
7163 0 94 -30 189 196 220 41 218 111 54 -125 72 75 -400 -20 -50 109 201 180 -129 -165 65 1 125 40 -43
7188 -43 243 -100 152 63 139 -21 147 107 130 71 -98 78 11 -337 -158 -126 -123 155 210 164 -67 28 32 175 201
7213 201 46 -119 -45 55 -71 -76 -60 -174 20 101 23 -63 -70 91 -128 -24 278 -232 168 -88 -266 170 195
7236 195 64 73 -297 292 -181 -80 -126 -388 -48 264 -189 -202 -119 239 122 -17 159 -239 82 187 193 -113
7258 -113 -30 62 -256 73 -84 -121 112 -105 -54 204 167 38 -100 29 206 -23 15 125 -19 -34 81 35 -194
7281 -194 47 111 -110 184 249 -132 -72 4 5 107 -98 -136 -399 116 -43 61 184 144 -207 129 25 -37 -185
7304 -185 205 -109 -224 125 -3 -8 68 53 -7 156 -63 -168 -285 13 145 -40 -133 -76 -177 144 53 34 -327
7327 -327 -19 -221 9 198 57 -152 8 137 -108 -54 239 -146 -139 303 -239 27 204 -36 125 101 2 -260
7349 -260 45 173 58 191 -197 -33 -78 66 97 -247 -209 -62 -83 59 53 -70 151 166 -333 -251 -7 -218 -396
7372 -396 -58 13 -38 -145 26 -5 -90 157 -117 -145 10 256 85 -183 128 -66 -81 234 -65 63 -92 58
7394 58 72 203 -50 -29 103 133 47 119 -84 58 -41 13 315 58 -242 -53 -124 86 126 170 -133 65 48 -74
7418 -74 -161 193 -24 109 72 -34 -163 40 -103 -181 -107 -257 -105 -115 204 -172 66 90 -68 168 202 30 -74
7441 -74 -202 -205 -54 179 100 197 154 55 -8 -11 205 148 -38 146 -165 44 87 36 -107 28 -285 34 -17 247 -156
7466 -156 -167 -86 -112 -173 -61 -73 110 32 126 181 -139 -78 179 -87 -1 265 126 170 -18 333 61 107 38 122 -2
7491 -2 12 -73 -18 -27 -121 46 -93 -179 126 -42 -7 5 -178 95 -114 30 92 -120 -31 27 16 -162 -150 73 36 -55
7517 -55 153 -55 -6 93 201 -203 -12 156 -213 180 156 47 -181 147 4 115 -118 54 18 66 -130 50
7539 50 45 -16 65 194 -50 118 -197 29 -169 -88 -109 -25 -19 84 129 -9 18 -61 -42 18 42 0 99 56 -207 -177 -191
7566 -191 178 -79 -201 184 -68 7 -44 199 -171 9 53 -362 8 279 77 8 -46 126 89 -86 147 -199
7588 -199 13 -37 -54 -86 160 -83 52 -170 194 -182 -9 -60 -66 -140 -8 107 -163 47 8 -3 -30 -202 -8
7611 -8 184 176 157 137 -101 -46 405 53 136 176 183 -138 91 -4 195 -7 31 196 83 -184 -31 -301 -358 27 -40
7636 -40 -87 -10 -29 95 -165 200 188 111 -90 -138 -15 -246 323 138 203 -234 -105 -113 38 -90 95 3 82 179
7660 179 -110 13 2 186 -36 180 42 77 -137 86 49 -71 -174 -186 45 -121 18 28 -30 -158 6 117
7682 117 -324 133 84 51 103 400 54 -11 122 -183 -254 187 285 -94 95 141 287 100 137 47 -44 -52 100 -221
7706 -221 67 13 -16 296 139 5 -96 149 -41 48 330 89 -235 -55 -62 -181 -38 43 -136 93 -72 268
7728 268 -194 -54 -63 -105 -43 165 140 -74 141 82 79 185 -20 -252 222 265 253 -87 64 8 354 29 49 -208
7752 -208 -27 222 -110 240 127 -366 -138 354 182 -183 203 372 180 198 39 -127 -8 139 -88 56
7772 56 -14 -228 -65 165 -90 132 -99 -41 -317 -27 283 103 -220 -228 47 -147 -6 135 -296 10 -41 133
7794 133 -79 -158 7 -227 28 -118 -38 91 -44 37 -91 -10 -179 -144 109 -26 -5 165 -67 89 231 210
7816 210 -232 77 -88 -389 60 111 -78 -312 -138 -57 -112 263 134 155 32 66 -166 -130 -19 -17 216 62 -69
7839 -69 -175 -68 130 -64 66 247 -17 -154 308 22 -270 226 -44 -259 251 201 -247 -138 433 -75 61
7860 61 10 134 -184 139 68 -18 -101 130 -179 23 45 -68 66 132 85 18 -124 72 -191 -215 179 129 -111 -112
7884 -112 26 -66 273 -12 -333 111 34 -105 -53 78 37 -109 -233 40 154 91 142 22 37 75 -23 -136 98
7907 98 -185 -19 15 19 97 -77 128 -275 -85 37 44 -181 -88 230 -53 133 -45 3 194 -282 25 -187 -188 16
7931 16 234 -48 97 -103 -62 -3 -50 260 29 -155 132 394 -7 192 -9 3 -131 254 174 -370 -159 181
7953 181 -14 30 114 -154 -123 175 146 30 6 -3 -206 -78 95 139 -139 -40 250 22 -25 -44 -183 163 128 -48
7977 -48 173 151 -41 -55 112 -128 -157 -46 0 -202 2 -84 -167 -254 178 -268 -61 90 0 232 19 91 -114
8000 -114 171 -175 -221 26 -105 -101 138 -55 -4 8 55 -3 -165 -51 -60 233 107 135 73 -89 76 -118 150 37
8024 37 -115 -334 -58 39 11 168 -236 145 125 136 27 -146 61 39 -66 -211 45 -36 107 0 64 -115 -142
8047 -142 48 50 10 100 65 -160 -17 -167 -86 -22 65 54 268 110 -90 -117 10 35 14 98 76 -53 -4 65 -159
8072 -159 -325 54 341 35 207 -94 -116 -96 50 -111 18 124 -120 -246 44 -50 282 -22 112 -21 1
8093 1 275 -116 235 34 93 131 -72 90 -12 102 132 -208 96 293 -86 -246 -90 34 -114 25 -92 -114
8115 -114 32 71 -29 27 -8 -29 71 -8 215 7 -240 -50 82 -43 80 174 -21 -84 68 17 -20 50 -98
8138 -98 265 -16 117 -82 -106 188 131 41 -69 -96 -150 -59 -100 175 25 101 -91 -127 -207 244 170 212 -321 150
8162 150 -134 178 4 -105 -152 -181 140 -94 19 -117 -91 31 231 -5 -41 -199 56 -151 177 -134 192
8183 192 -157 -56 -25 120 9 -76 -29 -242
8191b42
$$ Imaginary data points
##PAGE= N=2
##DATA TABLE= (X++(I..I)), XYDATA
0 0 0 0 0 0 0 0 0 0 0 0 3 -8 8 -8 8 -16 16 -24 24 -32 40 -45 55 -64 73 -83 98 -114 130 -148 170 -194 221
33 221 -247 279 -313 352 -394 438 -490 543 -604 668 -741 817 -902 996 -1097 1209 -1330
50 -1330 1466 -1615 1781 -1967 2177 -2411 2681 -2994 3361 -3796 4324 -4981 5821 -6936 8496
65 8496 -10832 14686 -22167 41810 -200120 -391365 241785 155785 -129270 72263 32798
76 32798 -261323 49219 287765 -65905 -150438 109757 -50682 -102827 211527 81843 -223803
87 -223803 -11753 83748 -82934 82158 155210 -201467 -177591 200168 108926 -115519 33240
98 33240 -7023 -169559 99259 212357 -127127 -138166 78797 -21328 -24404 160099 -12174
109 -12174 -211877 28434 161073 -27324 -12203 44451 -117864 -29077 179779 4001 -122400
120 -122400 37114 -215 -81707 100220 95736 -142900 -73230 106634 -7613 -30437 101862
131 101862 -50885 -157599 88268 133086 -73490 -52552 21245 -46416 17517 105676 -31831
142 -31831 -99427 34998 37869 -25792 59593 24749 -110327 -5257 99924 -7944 -28491
153 -28491 22013 -53165 -38856 94272 38522 -93293 -22967 44286 -20570 15499 52717 -61169
165 -61169 -56198 61310 20219 -28720 27200 -9735 -64496 26399 72201 -20472 -38369 10566
177 10566 -15217 8740 69656 -16443 -73277 24150 39269 -17909 14127 10820 -51717 -10823
189 -10823 53838 2092 -33922 9291 -8512 -29523 38793 29945 -45678 -16912 18548 -5853
201 -5853 16103 23031 -36214 -28149 35946 19365 -19452 8330 4314 -31161 17061 41521 -22452
214 -22452 -18158 20902 -12530 -8408 34903 -694 -39515 2961 21974 -11026 269 13812
226 13812 -28703 -15525 36191 1363 -25654 10620 -1230 -18095 20838 17064 -25728 -9198
238 -9198 22263 -1897 -8752 20337 -3103 -23671 19967 16647 -20731 4887 14950 -17389 -3885
251 -3885 19456 -3670 -14961 6441 1975 -13896 8901 10828 -22123 -4246 17752 -8528 -6823
264 -6823 10824 -7086 -8375 13321 4777 -12553 1761 12724 -6975 -3627 15589 -3819 -9734
277 -9734 13381 2218 -9764 7004 4824 -8298 -496 6564 -3090 -6665 5363 -307 -10240 4643
291 4643 3734 -10431 1562 4489 -6991 234 4581 -3502 -3321 4430 4043 -5391 362 7724 -3195
306 -3195 -940 7926 -2770 -1972 6694 22 -2704 1323 2581 -1076 -3506 2458 167 -5207 2613
321 2613 -176 -5931 2315 345 -4330 576 380 -1469 -1247 1015 1872 -3148 1334 4456 -3318 1150
337 1150 5493 -2926 958 5157 -761 -479 2074 1689 -364 -1412 2343 -997 -2170 2943 -3080 -4066
353 -4066 3429 -1899 -3358 1258 -2397 -1553 1206 -641 -1623 -1311 2100 300 -1871 4170 573 -3026
369 -3026 4948 1559 -2503 4517 749 -2586 2647 1834 -785 -201 943 -1763 -2719 4099 195 -7266
385 -7266 1888 908 -5651 4471 1846 -9991 -508 6840 -1509 -3215 2126 -1327 -4109 7660 5963
400 5963 -9637 933 8639 -6068 2298 10662 -7413 -6553 9930 1918 -5382 5548 1191 -13355
414 -13355 2318 14935 -8064 -9857 7970 -6497 -6147 16021 -2162 -18895 4892 9329 -7679
427 -7679 3100 10365 -14621 -10070 21646 5506 -14129 7564 202 -14827 17417 18065 -20280
440 -20280 -9475 15000 -1761 -2772 15971 -8384 -24984 15110 18241 -18375 -821 10809
452 10809 -22560 -3137 29541 -6205 -22726 8959 1649 -11926 20487 13183 -32997 -7448
464 -7448 29852 -3119 -6592 18498 -18370 -23539 34802 20424 -28749 -4896 11240 -15044 9131
477 9131 31423 -22825 -32940 23704 11228 -15734 17252 -1094 -40376 11412 37727 -16486
489 -16486 -16630 15153 -15638 -14381 40414 11839 -43250 -1047 22011 -11454 14579 24335 -39866
502 -39866 -24100 43436 14204 -22481 7845 -5831 -30407 27696 40447 -35010 -27401 23630
514 23630 -7140 -5216 37385 -13194 -49742 17020 31200 -14358 4444 8940 -41246 -4782
526 -4782 58181 -65 -41358 10922 3198 -19611 37382 25022 -50580 -17081 36502 506
538 506 -3331 24064 -26590 -41086 39012 35484 -30689 -7035 5043 -32311 16603 53563 -27358
551 -27358 -48382 20574 15433 -10861 25041 2729 -53148 2793 50820 -8044 -16000 15970
563 15970 -26261 -18780 53343 17838 -46108 -5017 16750 -13956 19298 33882 -41768 -38222
575 -38222 39746 18196 -18266 14365 -11808 -43607 27423 46968 -27368 -25675 13529 -14087
587 -14087 -1520 47755 -5927 -56739 10438 33993 -11883 9356 13725 -42229 -10786 50502
599 50502 6290 -27742 7115 -6199 -22672 34657 31089 -42593 -21870 26525 -4234 477
611 477 29785 -24284 -43000 28730 31216 -19986 -3686 4328 -28510 6416 45461 -12147 -35066
624 -35066 13444 4127 -10422 31341 8507 -45781 -3325 36126 -1683 -6331 11765 -23288
636 -23288 -19767 39754 17732 -34060 -4104 9582 -17171 14714 28202 -28894 -26862 23544
648 23544 7788 -10366 15947 -3861 -34881 11739 34796 -12839 -13740 9775 -14513 -2838
660 -2838 35070 -739 -32697 4874 15403 -7497 9806 12318 -27860 -12660 30324 4467
672 4467 -16706 8033 -5884 -19111 19984 19200 -22757 -11587 11746 -5182 -259 19694 -9644
685 -9644 -25243 13199 15762 -10641 4531 5286 -20522 1925 25985 -3880 -15176 6368 -686
698 -686 -7098 16499 8051 -22733 -3698 16704 -4419 -2585 10118 -12126 -12944 16454 7260 -12825
712 -12825 398 3395 -10130 3825 15249 -9011 -12222 9555 1831 -5142 10816 142 -14615
725 -14615 4779 12448 -4901 -3138 5372 -5996 -4576 12606 2297 -12270 1842 4483 -6400
738 -6400 4076 6156 -10350 -4744 8501 74 -4906 3549 -765 -7668 4648 7567 -6582 -2503
752 -2503 5428 -3770 -899 8127 -1600 -6050 3953 3208 -2896 1846 3175 -5049 -1603 6926 -884
767 -884 -4868 3310 -862 -4119 3975 1446 -5177 -388 2337 -1844 -1285 2154 -1194 -3854 2720 2027
783 2027 -3371 1513 2045 -2729 1108 2987 -989 -361 1613 507 -776 989 1553 -2408 -133 2369
799 2369 -1936 -789 1373 -1782 -1071 858 -839 -885 -504 289 -434 -894 832 -128 -1250 1443 211
816 211 -714 1457 16 -244 962 267 612 254 81 863 -239 136 787 -821 296 288 -1050 67
834 67 -564 -826 -102 -1004 -387 261 -945 118 -346 -912 672 -203 -512 501 -431 456 600 -456 547
853 547 458 391 893 -152 586 397 -253 654 -254 -954 910 -366 -850 483 -811 -576 -42 -608 -611 -605 358
874 358 113 -1130 668 144 -1174 1429 872 -1486 1062 876 -920 478 1230 -101 -573 1149 1281
891 1281 -1132 974 1537 -2787 -209 2411 -1727 -980 973 -1498 -1236 1873 275 -2872 -545 1871
907 1871 -1863 -450 3197 -2626 -2621 4045 986 -2432 2129 529 -2833 2062 3761 -2481 -2151 3370
923 3370 -617 -1865 4478 -69 -6235 2219 3734 -3885 243 2143 -4683 -2032 5936 167 -5753
938 -5753 1418 1141 -4362 3963 4696 -7744 -2097 6762 -1217 -1355 4918 -2939 -6215 6066 6498 -5344
954 -5344 -1426 3766 -4876 158 9439 -3516 -8712 5093 1917 -4317 5021 1667 -10495 -410
968 -410 9777 -2420 -5171 4791 -3849 -6627 10898 5044 -11338 -623 5180 -4241 3564 8692
982 8692 -8597 -8753 10236 5208 -6146 4177 535 -11823 5773 13690 -7974 -7506 5884 -3368
996 -3368 -2782 11982 -689 -15661 1621 9582 -4692 1189 5740 -13185 -6033 17122 2632
1009 2632 -10724 3310 -98 -7976 10438 11497 -13393 -8409 10329 325 -1776 11100 -6274
1022 -6274 -16585 10236 12727 -8901 -1245 2856 -12075 711 18529 -3754 -16581 4348 3772
1035 3772 -5516 10786 5420 -19841 -3513 17035 -1191 -3971 6817 -9188 -10759 17444 11238
1048 11238 -14989 -3872 6617 -7353 5117 16848 -12075 -16882 11541 6803 -5506 7223
1060 7223 -1641 -18890 4818 19563 -5862 -10519 4977 -6416 -4779 19675 2794 -21375 370
1073 370 11061 -4132 4970 8604 -16024 -9972 18389 6772 -9837 3126 -2138 -13272 12654
1086 12654 17177 -14763 -11129 8653 -2089 -183 14873 -6426 -20789 7341 14674 -6238 -509
1099 -509 3273 -15660 -1197 22494 -1254 -15636 3610 533 -5991 14125 8164 -19504 -6563
1112 -6563 15153 805 -2226 8902 -9859 -14451 15647 12195 -12115 -2369 2567 -9836 5049
1125 5049 17142 -9071 -16697 7272 4849 -4704 9380 600 -19374 1720 17720 -3544 -6053
1138 -6053 4666 -7918 -4919 17304 5362 -16117 -1457 7448 -4645 5538 10738 -13492 -10537
1151 -10537 13794 4640 -6224 4395 -2919 -12584 7797 13997 -9076 -8668 5527 -3791 -1653
1164 -1653 13520 -2593 -16111 4376 8674 -4400 2805 4204 -11958 -3194 14754 2152 -9209
1177 -9209 2683 -181 -6389 9686 8231 -12148 -4814 8263 -1531 -607 7291 -5722 -10610 7505
1191 7505 7433 -6411 -660 2403 -8238 1292 12021 -4096 -9104 4287 1277 -3003 6896 2129
1205 2129 -10414 -435 9390 -1397 -2447 4561 -4625 -5232 9438 3752 -7825 239 2607 -4407
1219 -4407 2710 6093 -6100 -6109 5298 1641 -3715 3416 -292 -7657 2752 6841 -3980 -2505 3205
1234 3205 -2747 -1399 6326 218 -6087 1425 3913 -2310 1231 3564 -4962 -2244 5757 54 -2992
1249 -2992 1826 -598 -3488 3026 3085 -3918 -2051 2755 -1438 -1389 3377 -1586 -4496 2275 2186 -2145
1265 -2145 613 1023 -2562 -150 3498 -386 -2540 1690 861 -2008 2422 1615 -3145 96 2220 -1168
1281 -1168 -248 1377 -1289 -1509 1549 1041 -2096 -277 1032 -1767 4 1744 -1328 -1150 1484 -304
1297 -304 -399 839 -62 -923 287 1036 -165 -559 923 -20 -416 1388 211 -953 559 478 -500 167
1315 167 168 -208 -163 205 219 -689 272 326 -989 250 362 -826 86 49 -173 296 32 111 -80 170 831
1336 831 -108 -226 596 -347 369 307 -208 229 105 36 306 -409 -77 -84 -254 -77 -44 -377 -76 -237 -411 5
1358 5 -315 -185 261 -129 168 -163 74 502 -211 247 316 -73 232 458 -191 481 382 -310 358 85 -7 -1
1380 -1 -410 -102 -295 -43 -12 -689 -246 385 -679 -37 477 -681 -39 398 71 112 266 388 -221 -80 1036
1401 1036 -180 -170 1003 -151 -510 1345 -12 -935 347 588 -573 -139 678 -870 -1180 1261 134
1418 134 -1591 425 280 -1470 1001 1154 -1518 -713 1321 -278 -642 1393 358 -1972 1238 2071
1434 2071 -1233 133 1388 -1514 -73 2766 -418 -2191 1296 458 -1094 1301 1427 -3177 -921
1449 -921 2874 -912 -1505 1705 -1402 -2553 2956 1819 -3073 -181 1683 -1474 340 3614 -2000
1464 -2000 -3559 3076 1711 -2172 2116 640 -4166 1146 4593 -1713 -2408 1869 -1121 -1845 4241
1479 4241 1157 -5630 188 3116 -2070 614 2888 -4624 -3145 5329 1335 -3672 1285 443 -3923
1494 -3923 2914 5611 -4545 -3437 4160 -571 -790 5450 -1530 -6749 3121 5103 -2747 -13 2153
1509 2153 -5039 -1234 7900 -318 -6755 1894 856 -3471 4693 3183 -7785 -2516 6101 -52 -1545
1524 -1545 3570 -3259 -6139 6404 6033 -5794 -1443 2724 -4171 1866 8353 -4064 -7367 3941
1538 3941 2895 -2306 3960 790 -9070 370 9486 -2009 -4332 2836 -4002 -3412 9143 2557 -9460
1553 -9460 -899 4281 -2486 2548 5902 -7631 -6386 8546 3361 -4374 2841 -983 -7790 5948
1567 5948 9238 -5713 -5538 3995 -1684 -863 8530 -1395 -11543 2435 7062 -3083 1224 2572
1581 2572 -8947 -2381 11269 929 -7520 1100 -269 -4585 7338 6452 -9721 -4439 7318 -166
1595 -166 -713 6225 -5210 -8640 7482 7296 -5484 -1035 1387 -6490 1824 10929 -3982 -9622 3663
1610 3663 1938 -2850 6429 927 -11644 -64 9462 -1013 -3003 2913 -4980 -4462 10078 4370
1624 4370 -9225 -1021 3482 -3355 3998 7462 -7664 -7283 7308 3462 -3033 3293 -1402 -8991
1638 -8991 3872 9657 -4613 -4712 2945 -3449 -1143 9357 -668 -10064 1182 5375 -2261 2419
1652 2419 3238 -8207 -3420 10050 1532 -5590 1933 -1216 -4809 6937 6123 -7539 -3875 4654
1666 4654 -948 -238 6136 -3764 -8380 5143 5751 -3956 139 1153 -6859 687 8811 -2361 -6603
1681 -6603 2177 366 -2366 5377 2189 -8184 -872 6641 -1009 -612 3416 -4129 -4131 6503 3575
1696 3575 -5495 -277 2108 -2742 1647 5519 -4500 -5988 4481 1650 -1710 3586 -452 -6700
1710 -6700 1936 5967 -2515 -2023 2063 -2509 -1020 5987 470 -5644 850 2706 -1928 2247 2699
1725 2699 -4555 -2024 5024 692 -2244 1641 -717 -3672 3086 3435 -3919 -1923 2139 -1659 -59
1740 -59 3706 -1446 -3957 1895 2283 -1962 472 1200 -3130 -346 4103 -592 -2692 1625 79 -1536
1756 -1536 2750 1410 -3215 -532 2411 -241 -393 1754 -1347 -2453 2626 1353 -2419 212 764
1771 764 -1871 402 2251 -1822 -1553 1080 126 -909 1144 483 -2328 295 1845 -1010 -152 1321
1787 1321 -931 -560 1739 397 -1557 333 686 -544 404 1028 -957 -904 1134 -174 -1005 929 -356
1804 -356 -1256 651 759 -732 -503 401 -229 -565 538 33 -838 627 632 -742 113 515 -471 144 692
1823 692 29 -240 287 282 -463 459 455 -824 48 157 -781 -11 288 -260 -67 88 -88 15 98 54 -80 -329
1845 -329 334 -111 -249 203 -51 -56 231 117 -83 -22 -46 127 22 -150 191 129 -36 372 37 12 -248 -549
1867 -549 33 -308 -380 -134 -275 4 -184 -217 154 -351 -70 -179 -86 -169 250 -117 132 274 44 321 28
1888 28 243 105 -118 321 146 -13 -2 -87 -179 292 -163 -428 -7 -329 -209 57 -93 -326 -227 300 -4 -508
1910 -508 387 243 -586 302 517 -135 406 283 -271 -40 535 113 -389 123 519 -337 456 416 -905 -262
1930 -262 645 -584 -48 569 -406 -431 441 287 -673 -290 374 -713 -242 1458 -845 -853 911 450 -709
1949 -709 455 429 -904 167 1459 -571 -840 1150 -394 -946 1640 218 -1890 325 900 -1077
1965 -1077 177 964 -1380 -1070 1919 337 -1650 701 261 -1927 1080 2154 -1654 -876 1228 -479
1981 -479 -308 2180 -306 -2575 966 1926 -1205 39 1192 -2202 -548 3149 -387 -2286 871 17
1997 17 -1712 1698 1683 -3126 -1282 2471 -217 -733 2200 -1454 -3050 3067 2457 -2261 304 950 -1946
2014 -1946 785 3949 -1393 -3270 1803 1152 -1251 2126 544 -4418 197 3936 -1190 -1530 1204
2029 1204 -1748 -2033 4004 1607 -4190 -397 1928 -1955 1203 3218 -3507 -3030 3806 1519 -1777
2044 -1777 1736 -756 -3869 2164 4731 -2423 -2688 1966 -1169 -812 4644 -595 -5566 1135 3069
2059 3069 -1563 947 1406 -4692 -1680 5252 787 -3916 1003 -455 -3160 3866 4017 -5105 -2127
2074 -2127 3311 -288 -181 3533 -2562 -4772 3978 3940 -2583 -208 1182 -4001 932 6472 -1747 -4938
2090 -4938 1722 527 -1389 3736 912 -6343 -868 5106 -426 -1349 2045 -3258 -3528 6006 2848
2105 2848 -4534 -431 1429 -3031 2551 4124 -3257 -4395 3939 1799 -1067 2650 -1161 -5453 2481
2120 2481 6002 -2904 -2581 1281 -2135 -770 6011 312 -5903 552 2350 -1176 1456 2576 -5408
2135 -5408 -2154 6181 732 -2841 1137 -1265 -3366 3861 4174 -4265 -2583 2864 -1020 170 4489
2150 4489 -2447 -5483 2875 3490 -1719 431 444 -4625 463 5775 -640 -3985 1286 -194 -1831 4101
2166 4101 1845 -5734 -709 3787 -367 -454 2507 -2828 -2752 4835 2569 -3164 -45 907 -2856 2123
2182 2123 4340 -2923 -3385 2650 751 -772 2634 -353 -5095 1275 4244 -1458 -1409 1498 -2510 -861
2198 -861 4855 385 -3964 377 1339 -1467 1960 2285 -3504 -1977 3705 755 -1575 1508 -851 -3248
2214 -3248 2610 3381 -2562 -1414 1317 -1061 140 2982 -1172 -3491 1195 1859 -1355 791 821 -3107
2230 -3107 -383 3493 -587 -1766 981 -489 -1008 2589 1558 -2813 -489 2126 -477 97 1862
2245 1862 -1716 -2230 2646 1493 -1641 406 246 -1798 653 2260 -1160 -1764 1068 -12 -904 1664
2261 1664 151 -2365 531 1986 -797 -207 983 -1214 -660 1876 370 -1502 308 516 -996 674
2277 674 1222 -1386 -897 1214 -67 -761 705 -333 -1267 773 1010 -959 -631 833 -561 -257 1332
2294 1332 -297 -1069 739 269 -596 394 224 -962 -78 1189 -326 -343 514 -244 -628 723 495 -980
2312 -980 249 247 -486 117 463 -276 -530 571 349 -807 -72 101 -495 281 428 -259 -329 434 175 -138
2332 -138 161 66 -157 115 551 -268 29 509 -256 -238 448 191 48 153 -167 -125 60 317 -553 -405 141
2353 141 16 -273 170 -232 -312 212 232 -327 -140 -201 157 -64 257 71 -133 183 51 34 -107 81 -29
2374 -29 210 35 85 13 -111 -175 0 -255 103 -68 -424 216 -314 -68 30 101 -81 142 110 -126 80 118 80
2397 80 -166 332 103 -78 88 249 -61 434 29 20 95 129 -358 32 253 -221 41 -236 23 -215 134 45
2419 45 -309 -271 91 -404 131 77 -44 -52 201 17 -188 243 289 -368 148 414 -193 -116 377 -59 -124 558 -88
2442 -88 -367 -190 110 -232 -208 415 -384 -398 626 -128 -599 261 -30 -655 394 700 -449 -336 473 83
2462 83 -245 646 -74 -831 477 601 -390 299 675 -826 44 1091 -259 -570 167 58 -688 774 744
2481 744 -975 -356 854 -338 -106 823 -707 -1207 904 571 -600 256 590 -972 -31 1560 -796
2498 -796 -1053 938 209 -622 1210 278 -1708 277 1418 -453 -332 641 -977 -932 1671 608 -1750
2515 -1750 84 484 -974 544 1358 -1436 -1301 1515 367 -625 1047 -146 -1752 757 1956 -1246
2531 -1246 -796 976 -920 -421 1903 -378 -2420 709 1193 -460 506 974 -2373 -558 2629 -59
2547 -59 -1529 641 -272 -1515 1909 1228 -2226 -1031 1316 -431 323 1950 -1159 -2402 1919 1756
2563 1756 -1345 497 541 -2163 450 3339 -676 -2274 687 108 -829 2446 844 -3337 -214 2396
2579 2396 -563 -399 1129 -2266 -1759 3053 1181 -2396 -157 417 -1228 1268 2826 -2395 -2455 2208
2595 2208 824 -879 1820 -657 -3095 1445 3196 -943 -1060 735 -1635 -471 3743 -86 -3480
2610 -3480 384 1314 -1067 1322 1205 -3551 -1559 3129 503 -1265 780 -975 -2384 2570 2602 -2528
2626 -2528 -1286 1414 -905 531 2911 -1588 -3224 1769 2069 -1047 448 292 -3476 27 3846
2641 3846 -417 -2118 871 -625 -1076 2929 1087 -3752 -549 2467 -381 -28 1677 -2376 -2391 3094
2657 3094 1637 -1825 338 282 -1961 1530 3146 -1963 -2302 1528 205 -628 2312 -213 -3519 507
2673 507 2846 -1035 -709 1004 -2173 -580 3442 377 -2829 149 560 -1192 1443 1873 -2857 -1687
2689 -1687 2476 347 -862 1460 -813 -2353 2136 2392 -1724 -989 842 -1020 115 2618 -842
2704 -842 -2813 1115 1289 -790 829 350 -2692 -322 2679 -169 -1367 827 -734 -1193 2437 1162
2720 1162 -2428 -483 1461 -591 273 1662 -1305 -1840 1889 1123 -1310 378 280 -1768 682 2171
2736 2171 -1151 -1270 482 -174 -303 1481 -231 -2049 280 1556 -785 -202 1191 -1335 -1073 2171
2752 2171 362 -1438 476 326 -902 903 1308 -1560 -767 1331 190 -539 1130 -235 -1407 787
2768 787 1137 -939 -207 618 -1022 -57 1354 -431 -1292 448 192 -588 909 495 -908 130 1354
2785 1354 -84 -574 778 -178 -704 999 435 -981 -245 637 -307 3 887 -74 -846 587 129 -592
2803 -592 420 233 -918 345 748 -689 -474 252 -99 -250 771 -2 -705 44 412 -252 123 364
2821 364 -399 -221 635 18 -420 -69 279 -308 88 544 -508 -319 169 -72 -229 49 -85 -363 134 230
2841 230 -385 -164 125 -233 -78 314 -281 -350 300 61 -265 271 37 -448 -49 127 343 -124 50 -197
2861 -197 -4 -12 68 -252 133 244 -204 -19 -16 -359 -161 106 -4 -123 -10 4 -234 -77 164 159 21 7 177
2884 177 35 299 -216 -102 -50 171 -6 53 188 141 42 188 67 -318 112 -135 -151 58 77 97 -229 275
2906 275 242 34 -69 -124 -270 35 64 60 -24 -93 13 82 141 -65 110 -139 58 -75 -13 49 -11 -162 185 -165
2930 -165 -298 82 267 4 -39 -132 -96 -198 243 -163 -109 140 -280 -242 191 179 -520 24 215 -256 117 66
2952 66 13 -119 409 83 -18 389 106 -319 18 152 -384 -30 167 -150 -35 234 49 -328 219 189 -410
2973 -410 20 368 -412 150 611 -299 -491 447 50 -173 393 172 -358 -80 784 -326 -171 321 -382 -542
2993 -542 606 412 -672 110 13 -453 39 521 -581 -869 652 -105 -520 530 125 -885 273 1027
3011 1027 -490 -98 477 -230 -290 1073 95 -733 276 504 -388 480 576 -1207 -500 987 4 -858 422
3030 422 -34 -826 700 892 -1208 -300 840 -161 55 1126 -346 -1213 957 692 -687 127 383
3047 383 -1225 221 1384 -118 -1128 361 -209 -638 1239 377 -1645 104 1294 -658 98 826
3063 826 -1029 -1067 1259 826 -1256 118 617 -1224 509 1669 -1148 -1458 814 -28 -47 1143 -192
3080 -192 -1809 585 1921 -613 -311 655 -984 -581 2273 10 -1961 226 511 -695 875 1138
3096 1138 -1628 -1165 1647 243 -573 618 -477 -1634 1399 1777 -1319 -646 698 -752 300 2149
3112 2149 -770 -2161 677 1120 -857 507 524 -2214 -333 2321 -142 -1261 349 -327 -969 1813
3128 1813 1191 -2135 -798 1403 -230 -50 1689 -1550 -1994 1909 1252 -1071 145 293 -1733 603
3144 603 2391 -778 -1774 788 -65 -732 1811 -124 -2418 47 1734 -499 -86 742 -1383 -1016 1976
3161 1976 587 -1873 -205 428 -1003 1042 1429 -1871 -1397 1441 173 -470 956 -790 -1993 1172
3177 1172 1887 -1055 -631 509 -1029 -25 2081 -179 -2158 496 917 -744 818 694 -2217 -679
3193 -679 1910 -57 -987 619 -641 -1034 1614 1092 -1993 -744 949 -411 265 1276 -797 -1601
3209 -1601 1047 1235 -763 525 139 -1478 305 1984 -463 -1288 800 -236 -504 1125 342 -2058
3225 -2058 -2 1186 -595 -16 539 -1104 -924 1384 388 -1075 -102 251 -814 538 1271 -946 -759
3242 -759 995 159 -270 1088 -214 -1374 585 1225 -653 -205 455 -909 -214 1225 279 -1338 88
3259 88 652 -554 504 572 -1158 -394 1071 89 -561 347 -174 -895 1014 702 -831 -374 466 -589
3277 -589 -95 1100 -166 -954 455 369 -543 64 246 -800 -97 1131 -212 -592 280 -397 -407 691
3295 691 261 -860 138 313 -343 4 626 -537 -634 674 561 -260 195 -35 -337 125 669 -317 -444
3314 -444 298 -194 81 435 49 -583 217 578 -183 -203 379 -330 -194 452 -80 -488 230 111 -130 260
3334 260 137 -532 -397 396 98 -133 258 151 -438 206 29 -345 -25 327 -435 -21 248 -60 -369 -185
3354 -185 -16 -387 -16 226 -312 15 193 -219 28 218 123 -39 250 -12 -209 -180 339 -118 270 334 -5
3375 -5 66 -91 53 -49 96 -182 -241 -119 223 -112 -2 147 -60 -180 200 -139 -105 -60 125 85 153 43 -26
3398 -26 -179 -47 211 -76 30 0 134 171 256 71 184 -60 -2 241 -73 15 -278 -4 -113 -214 -122 -9
3420 -9 125 -388 -79 -61 -30 117 54 23 -39 11 33 -80 219 -45 -124 324 184 98 19 -8 35 -38 4 -150 -101 81
3446 81 313 -32 129 -92 -166 -128 49 -97 -6 291 -124 221 52 31 -31 138 253 131 32 187 -127 144
3468 144 334 -157 -84 186 31 213 -108 185 -102 -226 241 -92 38 305 -164 -268 -19 109 -592 47
3488 47 99 -153 118 95 -156 -212 277 185 -98 680 187 -570 217 156 -205 44 351 -399 -147 302 196 -642
3510 -642 6 43 -271 217 461 -321 -422 93 50 -131 373 -41 -480 235 541 73 14 321 -524 -185 678
3531 678 182 -397 292 59 -540 367 364 -693 -345 630 -40 -146 690 -294 -660 749 320 -638 -201 -27
3551 -27 -664 79 658 -157 -604 509 340 -427 686 243 -850 184 996 -44 49 351 -385 -288 864
3570 864 288 -725 16 221 -371 191 616 -820 -761 883 229 -561 383 -148 -1160 383 956 -185
3588 -185 -715 490 -443 -283 1269 -68 -1300 235 578 -223 531 503 -941 -758 1278 365 -523 248
3606 248 -307 -895 776 911 -959 -546 551 -610 -13 1026 -299 -1258 524 827 -300 128 230
3623 230 -1009 118 1427 -93 -875 515 -4 -586 1184 575 -1583 -217 1245 -307 -10 574 -751
3640 -751 -950 1255 876 -883 -140 169 -913 379 1523 -707 -1220 605 202 -325 609 9 -1487
3657 -1487 404 1700 -481 -209 709 -530 -397 1528 423 -1328 0 784 -610 677 949 -897
3673 -897 -789 1054 318 -591 343 -394 -1229 911 1157 -967 -740 640 -338 76 1542 -470 -1425 509
3691 509 696 -359 504 449 -1046 -233 1516 -16 -965 340 -239 -761 979 742 -1226 -469 728 -241
3709 -241 183 792 -862 -1084 943 695 -454 -81 348 -735 400 1280 -432 -929 738 152 -232 879
3727 879 198 -1574 172 877 -216 -316 344 -825 -423 1183 251 -1076 98 173 -639 446 682 -955
3745 -955 -806 841 262 -337 561 -6 -966 513 1107 -471 -351 208 -398 -29 1157 -350 -798 329
3763 329 509 -454 310 100 -801 -334 916 42 -403 451 -114 -674 598 632 -743 -444 646 -17 -144
3782 -144 783 -119 -692 361 412 -474 316 106 -438 45 639 -98 -199 171 -164 -356 342 339 -505 1 483
3803 483 -265 -114 307 -419 -160 564 225 -389 -99 60 -334 249 260 -216 -306 487 247 67 356 -38 -328
3824 -328 163 265 -196 -60 260 -227 -429 441 13 -359 219 82 -334 2 191 -190 -142 -1 73 -215 83
3845 83 -73 -78 291 290 -369 -16 359 -260 -9 193 27 -106 2 224 -323 252 282 -220 -89 237 -410 -174
3867 -174 27 21 -152 122 107 -213 25 203 -63 15 239 -83 -235 271 -81 -107 157 -60 -73 31 38 69 52
3890 52 81 -198 -8 142 -40 -186 145 169 128 44 1 -96 27 -62 31 -248 19 106 -78 -34 182 25 -164 376
3914 376 -49 10 21 173 -53 -40 19 -68 -210 -28 -109 193 254 -247 86 86 -272 82 -21 20 -158 -18 123
3937 123 -31 22 311 168 19 25 220 -219 196 59 29 -73 -45 -178 63 -33 178 -143 215 105 98 -22 -7
3960 -7 2 -186 197 -310 -299 39 11 1 -83 -75 174 8 175 34 -135 345 23 7 101 73 -179 18 56 -12 -36
3985 -36 55 -212 -62 89 155 -264 31 -8 -81 -31 126 -102 -278 228 -82 -73 -76 75 -130 -4 381 -201 -109 25
4009 25 -178 -74 142 42 -56 104 236 -80 96 428 -325 -197 116 21 -104 353 91 -604 151 348 -410
4030 -410 -175 93 -115 30 479 95 -630 200 270 -328 418 378 -517 -265 583 119 143 378 -240 -310 411
4051 411 368 -177 183 -30 -192 53 594 -284 -454 378 194 -351 331 241 -482 3 524 -214 -618 309 -76
4072 -76 -367 520 149 -497 95 167 -203 277 290 -382 -495 627 218 -248 167 32 -657 544 1005 -556
4092 -556 -340 408 -232 58 401 73 -626 166 605 -336 -1 251 -824 -343 942 65 -456 122 47 -617
4112 -617 641 522 -671 -412 703 -23 -479 549 -495 -754 452 683 -400 96 109 -479 -20 1018
4130 1018 -296 -870 290 120 -487 775 177 -796 -173 835 -182 -193 301 -323 -381 663 737 -730
4148 -730 -292 588 -394 227 945 -766 -682 832 279 -517 376 90 -706 402 1173 -444 -644 339 -416
4167 -416 -112 1312 107 -1063 99 830 -297 141 630 -801 -391 1097 223 -563 307 -27 -753 769
4185 769 1038 -763 -609 375 -281 -173 904 -428 -1106 316 817 -502 204 274 -931 -44 1289 -238
4203 -238 -957 301 -40 -260 868 463 -832 -164 769 -183 -221 347 -653 -569 1040 455 -755 -42 70
4222 70 -510 284 849 -556 -805 451 338 -327 513 184 -883 346 966 -476 -35 386 -510 -184 931
4241 931 70 -863 22 643 -218 61 509 -1199 -409 793 161 -505 190 -183 -771 570 562 -882 -677
4260 -677 419 -40 -78 732 -116 -1086 222 666 -252 322 191 -530 -184 990 -88 -506 183 46 -352
4279 -352 515 396 -837 -217 160 -74 -75 540 -265 -440 417 512 -624 145 241 -334 170 868 -244 -528
4299 -528 369 65 -52 325 154 -616 297 460 -41 -185 491 -279 -142 289 -42 -301 83 39 -182 161
4319 161 254 -444 -313 304 -56 -377 87 232 -300 271 182 -279 -220 213 -37 75 604 -92 -329 287 294 -280
4341 -280 364 180 -435 -74 254 -68 -338 135 -23 -255 209 189 -383 -1 275 74 -52 105 -157 -343
4361 -343 267 306 -43 -7 129 68 -99 163 -62 -273 77 206 -97 154 219 -247 -31 322 27 -130 108
4382 108 -2 -88 -139 -19 -179 103 -4 -51 98 107 15 -27 238 -192 137 51 61 47 -99 97 76 -66 348 -14
4406 -14 -57 109 -72 -136 -35 6 47 52 -4 -300 44 249 -38 132 -128 -48 -44 -170 268 -88 -94 87 -28 140
4430 140 96 -10 -5 53 134 -37 -66 46 -94 -303 -113 -4 -116 79 -36 11 102 -106 -108 -66 -63 -11 -145 96 -81
4455 -81 21 -36 305 -7 114 151 15 -37 -69 170 -275 116 -183 221 105 159 -125 104 35 158 -42 49 -156
4478 -156 -122 27 29 -27 2 -82 -81 -134 -119 135 -50 118 117 -25 124 -160 -184 -49 149 -3 -64 193 55 120 142
4503 142 -17 0 78 80 -102 -127 225 -40 -63 158 -9 -109 252 -105 -249 37 148 -286 307 215 -338 2
4525 2 138 132 -113 303 291 -88 242 279 -281 201 119 -340 267 221 30 -37 233 139 -156 125 229 -400 -203
4548 -203 353 144 92 299 -122 10 290 128 -283 379 181 -137 115 174 -139 -491 463 -31 -144 -94 90
4569 90 -490 137 625 -246 -222 31 -111 -313 554 287 -504 37 303 -306 224 76 -324 -362 574 228 -182
4590 -182 73 190 -492 312 837 -646 -304 366 -136 -1 538 -409 -589 125 331 -194 -59 333 -585 -76
4610 -76 841 -325 -478 48 26 -171 285 274 -693 -332 602 -324 -469 354 -535 -368 682 625 -656 -141
4630 -141 228 -308 43 748 -158 -666 421 498 -354 273 113 -591 127 606 -155 -639 65 -264 -242 538
4650 538 257 -812 -21 323 -2 330 690 -703 -489 707 276 -365 141 -133 -567 130 769 -384 -328
4669 -328 312 9 283 817 -245 -884 577 625 -288 154 380 -537 -54 709 187 -688 98 71 -533 575
4689 575 461 -638 -266 827 9 -106 200 -446 -456 668 523 -561 -259 122 -426 -95 854 -577 -717
4708 -717 168 -27 -272 484 -67 -875 -76 736 -120 -229 305 -332 -362 734 348 -654 -17 328 -315 354
4728 354 262 -567 -816 341 243 -235 444 -70 -631 95 609 -237 -556 196 -154 -316 673 -167 -753 186
4748 186 431 -410 266 379 -762 -239 831 24 -366 108 -17 -626 474 569 -687 -248 492 -170 5
4767 5 205 -331 -600 577 478 -449 -133 272 -536 -121 697 -22 -536 241 74 -177 409 254 -689 -359 669
4788 669 -112 105 374 -496 -338 546 203 -587 151 378 -342 161 369 -725 -335 254 117 -389 216 -31
4808 -31 -642 314 464 -116 -236 91 -271 -86 598 -12 -398 47 425 -96 39 562 -692 -145 644 -61
4828 -61 -269 240 -16 -288 307 83 -302 -116 -34 -335 -79 111 -194 -432 191 341 -13 -135 184 -293 -198
4849 -198 411 25 -192 66 -29 -173 287 78 -300 179 368 -14 34 314 -232 -270 67 88 -309 -265 234 -351
4871 -351 -88 234 -44 -242 204 34 64 199 -45 65 -81 -52 204 8 452 91 -80 99 4 -108 96
4892 96 -15 -195 -61 151 -227 40 157 -37 195 48 42 -278 338 -113 -249 -81 153 118 -186 376 -40
4913 -40 -60 130 62 64 31 -53 -68 -10 -117 7 -154 71 -113 -17 -145 300 -119 -192 42 -101 61 196 4 -166
4937 -166 43 -118 -284 97 211 -58 50 -83 11 -113 52 -5 57 51 -141 -157 88 -203 -87 -121 -118 -42 -138 235
4961 235 11 189 -168 68 109 -200 136 -148 138 113 163 -9 53 146 101 -65 164 181 127 -88 -106 72 145
4984 145 -7 -125 -11 -11 -83 289 -99 -186 -151 -18 46 63 135 54 -118 150 -10 180 -140 57 152 -287 -10
5007 -10 -70 -215 134 89 -204 208 71 -219 84 -10 -128 -42 122 -43 -240 206 239 -38 158 141 -229 -254 -29
5030 -29 122 15 138 48 -254 106 76 -180 -165 -94 -171 155 59 -87 -106 151 -13 -150 313 38 -271 235 304
5053 304 -235 41 -247 90 -84 176 138 -251 28 286 -205 158 41 -191 -312 292 78 -110 85 1 35
5074 35 -3 382 -88 -97 142 -131 -125 327 -32 -226 344 233 -258 17 16 -272 177 365 174 -516 86 296 -165
5097 -165 115 346 -324 -211 326 65 -102 334 -44 -258 313 200 -240 -154 325 -274 -16 526 -110 -410
5117 -410 238 -158 -220 23 208 -564 -230 341 -48 -333 123 -118 -464 573 248 -261 -148 257 39 303
5137 303 266 -152 -363 301 -74 -294 291 -133 -455 179 419 -489 -418 54 38 -155 636 -198 -584 195 476
5158 476 -185 136 151 -365 -359 610 98 -524 143 -204 -21 436 226 -640 -253 253 132 -158 112 -142 -419
5179 -419 257 557 -277 74 242 -295 -33 287 -216 -423 168 -25 -256 285 479 -776 -338 447 -359 -23
5199 -23 231 -399 -438 659 417 -640 166 282 -528 199 669 -611 -606 370 407 -235 11 15 -406 422 761
5220 761 -501 -353 120 -175 -318 585 91 -506 -131 321 101 226 425 -629 -214 783 202 -380 80
5239 80 -155 -328 421 361 -395 -214 323 -12 118 570 -321 -736 183 463 -306 -57 203 -419 -31 607 -270
5260 -270 -222 162 39 -424 509 145 -652 23 302 138 2 384 -208 -363 745 323 -287 57 -176 -341
5280 -341 85 403 -232 -624 231 121 -261 235 -28 -469 23 617 -193 -93 -55 -180 -152 325 256 -879 65
5301 65 239 -265 84 197 -486 -183 508 -126 -218 59 -156 16 503 419 -362 -363 231 10 79 163 240 -154 269
5324 269 140 -337 35 59 -281 -7 268 -19 -61 -7 -161 49 -11 -61 -221 -104 174 -72 -211 256 -498 -157
5346 -157 334 39 2 -201 221 -258 -31 215 -55 -257 266 77 193 184 -172 -62 242 211 -208 -68 73
5367 73 3 -83 342 150 -30 -4 138 -218 71 11 -258 -32 283 115 -213 183 22 -183 342 -15 -17 -71 80
5390 80 -25 -82 43 -260 -46 51 98 -237 203 115 -157 -84 18 28 -148 31 225 143 175 84 -350 46 167
5413 167 187 -228 60 -170 -165 10 117 -10 213 307 -162 81 112 231 -52 373 -99 96 106 -9 7 190
5435 190 -118 25 -5 252 -18 115 -26 -55 44 -32 199 47 -120 36 94 -162 -40 -30 -73 -17 131 -184 -285
5458 -285 139 204 80 77 98 -239 79 -159 -288 24 143 116 -29 -68 145 54 34 -35 -54 23 -60 66 27 -72 -117
5483 -117 -73 136 -193 13 70 -12 -248 39 -47 10 -109 159 42 5 -44 39 -76 192 130 -169 300 38 245
5506 245 -198 211 70 -179 6 73 -41 -92 -83 -280 -58 87 -7 3 -105 -307 54 179 -24 -31 -87 372 -61
5529 -61 73 90 56 310 163 2 187 -111 -139 53 162 392 -153 -80 162 -342 -65 20 -102 -111 210 -65 -50
5552 -50 15 -20 -128 188 49 153 -317 -10 42 -93 170 -205 -268 -32 80 -155 -16 114 -8 187 240 -142
5574 -142 -241 191 115 -124 89 32 -320 -129 100 119 147 167 146 -174 332 220 -343 121 292 60 79 158 -5
5597 -5 -18 184 221 -451 121 157 -257 -98 316 -36 -193 54 -86 -370 176 159 -375 63 308 -186 99 -72
5619 -72 -159 -73 240 33 32 133 179 -169 -188 297 -273 -275 210 -153 77 465 -165 -333 -207 453 -127 -72 113
5642 113 -392 -212 562 148 -164 5 173 -112 157 468 100 -248 253 -14 -292 122 -44 -302 173 578
5662 578 -127 -244 106 -299 -55 444 -18 -355 -62 16 -355 350 83 -98 -96 224 -383 -258 69 -145 -396
5683 -396 249 245 -325 98 224 -42 -7 565 -130 -432 -63 289 -110 47 -70 -545 186 435 3 -295 71
5704 71 9 -201 461 301 -712 -89 262 12 186 127 -144 -321 433 85 -150 -39 -212 -495 75 562 -104
5725 -104 -201 286 58 -62 473 -110 -448 75 235 -211 -39 419 -162 -131 409 -61 -304 -81 68 -270 373
5746 373 202 -506 -122 525 -34 -106 35 -158 -302 140 323 -386 111 -49 -417 -16 472 -212 -527 385
5766 385 39 -189 160 -33 -463 -41 488 -302 -251 123 133 -231 462 284 -422 -43 206 -170 180 375 -52
5787 -52 -208 105 -11 20 113 48 -128 -58 367 -111 -235 224 -182 -95 424 135 -203 -54 287 -420 -54 167
5809 167 -359 -25 281 11 -177 -8 69 -401 196 278 -198 -125 325 -3 -274 204 -213 -196 333 280 -274 -122
5831 -122 214 -117 -189 156 -40 -482 201 140 -201 -86 35 -366 -142 184 10 -25 172 -92 -177 271 171
5852 171 -118 -59 154 -20 222 60 -212 -148 4 42 -21 -54 71 -395 109 96 -165 -126 57 -112 -172 18 197
5875 197 33 -59 -241 -136 163 16 -94 -106 203 156 -154 138 16 -122 227 231 -1 -69 251 -289 -12 9
5897 9 -184 -211 -8 88 -129 13 56 -224 -22 -22 -228 -27 -79 -179 -13 90 24 -75 -45 207 -168 -103 151 25
5921 25 42 91 183 -148 106 302 -114 -237 -151 4 34 143 -6 26 7 90 13 63 -25 -298 -203 121 -15 -14 169
5946 169 -162 -83 -215 80 -71 -88 -184 -28 110 135 -15 -125 -4 59 -257 -23 -25 -8 -31 74 56 -115 -308
5969 -308 -18 -65 97 65 99 42 35 10 -210 251 -92 -118 -10 120 -196 160 -42 -195 -114 137 -12 9 -30 -141
5993 -141 -193 15 -148 83 12 -187 162 -149 96 35 -333 131 -57 -185 -186 -1 1 110 248 -38 167 82 -181
6016 -181 -91 -249 -91 -54 169 -46 -148 -142 88 10 -90 52 77 103 201 235 -100 -2 56 66 87 -110 46 -154
6040 -154 -46 -57 -17 109 -152 -170 -32 179 -139 -31 -90 -39 -88 75 -54 -178 -58 297 -56 104 236 37
6062 37 73 138 89 -131 109 179 -179 39 74 131 -79 -31 15 258 147 280 -211 225 284 -103 7 -34 -11 88
6086 88 31 153 -133 70 -48 -213 -18 170 -144 215 214 -140 -26 84 81 -81 221 -62 8 168 168 -106 309
6109 309 197 -126 -338 50 -72 -75 287 -51 -188 57 98 -82 -101 142 -186 -144 155 47 -267 -47 -36 -244
6131 -244 134 415 -90 26 176 -42 41 239 -46 -375 147 325 236 -207 150 -189 107 338 185 -150 55
6152 55 24 -195 45 138 -203 -189 33 -140 -17 189 -266 -248 246 253 8 32 291 -269 -19 610 -73 -205 213
6175 213 -30 -390 -34 115 -526 -236 351 -72 27 220 67 -76 262 209 -285 -88 63 2 47 340 -68
6196 -68 -279 293 237 -190 108 -90 -166 -87 65 -31 -327 154 63 158 177 -62 -434 -285 425 -284 126 72 -184
6219 -184 173 309 -64 -272 -128 -69 -78 264 -2 -66 -302 151 -14 -23 380 -241 -500 -91 490 -83 21 372
6241 372 -251 347 369 -223 -180 124 131 -164 95 104 -319 -189 213 98 -57 203 -215 -348 345 185 -225 -112
6263 -112 46 -111 213 297 -71 -167 210 -4 -240 92 115 -155 23 383 -125 -256 47 35 -267 175 136 -465
6285 -465 3 182 153 -100 -42 -237 -143 397 194 -44 94 -42 -321 363 176 -261 -72 285 -376 58 -50
6306 -50 -229 -443 38 283 -160 54 -48 -256 157 463 187 -63 237 68 105 29 -11 -167 -79 372 -17 41
6328 41 495 101 -506 155 239 -133 -22 48 -107 105 77 -62 47 226 -96 183 81 -120 -99 -3 296 181
6350 181 -89 251 10 -51 173 29 4 140 151 -56 -41 140 -110 51 111 87 -113 94 -39 -218 244 50
6372 50 -149 -155 37 -117 -164 84 -41 -158 9 -232 90 110 158 -137 -252 -94 -155 -100 -152 -77 65 275 106
6395 106 -121 -58 227 86 -159 91 21 -83 2 153 -202 -95 -149 -254 -213 23 35 -115 -97 -130 -266 172 -198
6418 -198 -126 -108 -25 12 -97 -80 16 30 249 67 61 -133 -13 60 55 55 -130 87 -9 12 45 157 -244 310 49 -57
6444 -57 -177 60 -45 -100 253 225 34 -31 25 32 -225 218 17 119 141 200 50 34 222 43 -256 180 98 100
6468 100 -251 140 259 132 249 -85 -406 -123 168 -22 -129 -69 32 -61 111 -73 -74 -115 -58 -15 83 -45 -73
6491 -73 -293 32 -52 35 172 -147 -228 -18 140 -102 -233 9 274 -129 26 -61 -151 155 6 -31 122 -22
6513 -22 -134 126 77 -101 -158 64 -105 -273 -30 57 -33 214 -72 74 61 54 -50 -46 182 -63 106 19 -122 -95
6537 -95 25 -6 119 -25 82 102 -81 1 -135 27 -10 -186 -313 -161 127 172 28 66 237 4 27 13 188
6560 188 -37 -100 15 70 -79 -14 67 16 90 -218 13 27 32 293 149 -190 24 -30 -82 40 111 9 37 -21 126
6585 126 332 335 -318 33 -146 213 140 59 108 -30 107 32 93 -231 3 -94 96 -167 90 -128 -67 -113 -29 -78
6609 -78 311 63 26 -26 -32 -35 -283 145 105 30 26 -73 28 14 -15 241 65 -34 -235 -75 148 140 69 48 174 -239
6635 -239 -155 40 158 -140 -18 -132 76 215 -13 -4 148 175 -197 -10 37 205 15 226 -79 -69 92 226
6657 226 -163 250 317 -245 -142 82 -17 -189 -54 22 224 155 -85 61 94 -40 -270 48 204 -96 -118 163
6679 163 142 -11 255 55 -312 75 395 -58 -214 168 -6 53 90 145 -334 121 -32 -167 115 -157 -348
6700 -348 -439 156 -133 -125 270 40 86 138 -105 -157 60 151 -36 50 191 -112 73 30 356 -156 79 313 -222
6723 -222 -69 361 -152 -234 53 -102 23 221 26 -206 -186 299 24 -86 151 -325 -46 194 123 -185 345
6744 345 -116 -196 71 141 -229 -125 -2 152 -65 83 -112 -361 1 276 131 -113 -107 -465 -8 249 78
6765 78 -234 2 57 -58 329 193 -158 -103 274 51 -142 179 108 -213 106 217 -240 63 253 -122 101
6786 101 123 -67 -178 62 34 72 -68 105 -346 -97 102 -94 -320 -39 -15 -277 139 -132 -79 -283 256 183
6808 183 -106 164 -239 -39 -43 -161 -68 71 37 -88 94 292 -75 -131 -58 450 36 96 50 -125 177 129 99
6831 99 99 6 -289 -171 180 107 -316 127 -202 111 -51 18 -156 -112 117 -53 238 -2 -100 -36 226 274 -230
6854 -230 -19 -4 40 -14 222 -3 -27 77 205 -163 -137 310 -8 -19 397 -42 -35 -106 -57 28 56 -157 89 110
6878 110 -5 -95 77 194 -19 -194 107 125 -93 -28 -51 -158 -58 -55 13 56 81 298 21 41 162 -82 84
6901 84 -2 -50 152 5 170 -48 234 64 -107 -6 100 -142 262 -47 -33 -104 47 0 32 187 111 -198 79
6924 79 252 10 9 128 -88 4 -34 15 -47 26 116 75 -78 145 -43 19 29 70 -160 333 9 -102 67 -86
6948 -86 -152 155 59 -243 238 35 -268 -130 -26 -252 -148 140 92 -177 22 113 27 -195 73 -20 110 383
6970 383 25 -94 -9 -88 55 264 -99 -10 35 235 65 143 -232 119 -114 37 22 10 269 48 -114 -285
6992 -285 84 -58 229 110 32 -109 -211 -88 -36 58 97 -41 -14 89 62 -210 8 202 2 190 -72 -94
7014 -94 -17 59 47 -53 -71 -201 -87 49 52 -139 -33 -94 121 143 137 -102 44 111 25 -256 3 15 225 100 -303
7039 -303 31 229 -151 -57 167 13 90 -62 30 -45 -141 -66 9 79 97 68 39 -36 180 -114 198 77 -7 -24 -128
7064 -128 11 202 193 63 -203 151 7 -161 -119 69 205 276 -171 315 112 -127 -98 65 -75 116 75 -225
7086 -225 -363 154 187 6 98 -30 17 -67 163 -2 108 -225 -63 -184 -184 -214 -111 -282 77 -222 -168 -78 -293
7109 -293 -55 -125 117 41 -202 -1 -80 87 179 -290 -156 235 185 73 46 -115 35 50 70 -79 -12 -133 142
7132 142 66 -88 68 99 150 81 21 -8 -18 -260 33 4 191 -243 -68 -189 204 -19 24 -13 192 72 -215
7155 -215 -16 67 -75 29 -18 371 219 -62 -202 -225 240 -59 226 -201 131 -9 18 318 35 -176 76
7176 76 -97 -210 25 138 -244 29 31 -156 -107 9 -29 -301 -112 -176 -121 -43 -3 -208 -226 -104 125 -3 -67 -13
7200 -13 48 201 -63 -260 102 134 45 161 137 220 50 98 3 21 17 108 143 -119 -140 -106 164 88 -72 -64 -115 158
7226 158 23 -115 8 -13 -178 143 -2 -132 95 -70 -69 68 31 25 -247 279 84 -190 128 123 186 73 195
7249 195 -236 47 132 -157 -206 267 59 -115 -94 18 -107 25 -8 4 133 70 17 -29 113 131 -187 -9 161
7272 161 -235 -61 51 -196 -180 237 64 40 24 12 -440 266 -148 -47 -54 -30 78 -82 199 31 -221 123
7294 123 78 -82 -15 -82 -252 -126 190 -339 93 -192 19 -133 0 -65 -180 0 322 -30 -35 187 -289 -122
7316 -122 3 95 -22 -61 -113 44 -27 347 -237 -64 -12 8 61 72 -55 -225 -24 -41 -317 188 96 -39 19 13
7340 13 -208 -59 19 147 -91 63 -21 -37 -2 235 -37 -180 74 -103 -168 4 -37 -143 -243 13 -121 48
7362 48 -106 -174 -96 29 7 -84 112 6 -68 -84 381 142 -403 267 48 -98 99 -11 -112 329 14 -282
7384 -282 -94 58 129 -55 -158 48 -251 150 14 -84 -73 216 -165 154 -252 -137 18 230 32 -268 -137
7405 -137 -170 119 24 -50 -262 89 75 -201 286 181 22 -25 -59 75 64 43 -35 -147 107 49 -196 -86 15
7428 15 262 125 -281 36 -51 -136 152 -150 -194 47 90 -49 21 321 52 -62 -222 -30 60 -167 208 209 132
7451 132 181 31 -218 -88 -143 7 122 -264 -286 104 129 -22 -45 -227 -54 11 73 -152 -58 -57 22 -53 -119 -129 -67
7476 -67 165 187 52 -209 42 -187 -42 -81 -29 -100 64 193 -303 26 -9 5 210 145 -115 -91 -126 -51 148 5
7500 5 -62 -51 -41 -12 198 -18 341 29 133 -38 81 8 -140 -33 -107 -61 -4 216 -311 -162 132 -165 326
7523 326 185 12 167 125 -52 -40 72 119 -91 36 9 109 35 205 215 137 145 87 -4 45 49 -203 77 -97 -21
7548 -21 95 -122 -40 -114 110 88 -108 41 -86 -19 13 -77 30 -120 0 -93 4 107 133 -177 227 -230 170
7571 170 91 132 144 190 16 58 -199 -53 86 22 25 149 -73 35 -150 -217 310 -5 23 -219 5 141 212 35
7595 35 301 -173 -224 -128 -122 128 44 -28 -91 -6 203 -223 -126 36 44 -48 -34 -129 59 -180 -124 -154 37 92 379 61
7621 61 -53 -191 53 -52 -165 -135 -132 -166 -139 -93 128 189 93 224 -157 19 18 -34 -109 351 312 147 -78 116 145
7646 145 247 120 134 5 -61 -74 -117 -137 -270 39 -6 -57 55 -112 331 190 -115 180 101 -63 -191 -53 -102
7669 -102 97 235 -57 -38 -1 -83 -45 -72 -15 -51 -41 136 -14 -26 44 102 -92 283 -254 -215 -42 -92 -24 53 208
7694 208 -125 152 172 28 -42 -58 257 -208 65 306 -128 60 -164 -210 -74 114 -131 -23 66 -84 -167 188
7716 188 215 -54 -82 123 -21 -71 218 -50 172 316 25 -151 -175 246 -202 -16 1 169 -200 -69 65 -136
7738 -136 -96 -27 -165 41 -195 -372 -130 -77 -250 -106 202 -2 -165 45 -62 -225 15 -32 53 -116 96 -46
7760 -46 162 -129 -42 -85 36 184 -36 103 -15 -68 138 -10 -200 -102 27 40 -91 186 -93 99 -3 344
7782 344 -86 19 239 21 -89 107 -35 -14 -114 378 -122 -122 70 -64 -74 25 -144 148 -61 -91 -82 149 39
7805 39 -188 -113 -68 212 -68 -30 -164 -273 193 25 -97 -1 62 -161 32 278 35 -203 -99 242 -230 21
7827 21 207 -297 -8 246 -127 -2 -213 -197 -118 58 138 -141 -41 51 109 133 96 57 86 306 162 29 200
7850 200 120 -107 -71 100 166 -121 162 -174 -55 323 116 137 -128 164 89 -82 -66 -200 102 479 12 -205
7872 -205 27 11 93 119 205 -56 -62 -45 -21 -45 66 -26 -242 40 294 -13 7 -54 -128 37 36 99 37 270 -128 -37
7898 -37 109 -111 -278 19 61 91 -179 26 -28 -110 195 291 59 28 -74 -41 -141 144 114 -114 51 88 -88
7921 -88 55 7 66 -147 8 -114 -100 -25 -18 23 -174 64 -225 -183 75 -271 136 -134 31 181 -89 116 -190
7944 -190 -158 -15 -11 48 -27 -116 -21 -118 -51 -82 74 22 -333 -105 149 -191 151 -136 -21 -93 -18 84 -200 14
7968 14 -169 199 110 264 -279 208 -83 85 271 20 13 444 88 119 102 111 35 -140 -117 -101 68 -93 -220 -57
7992 -57 0 -24 -11 57 71 -36 161 122 -61 -53 -145 -150 265 -204 178 134 -172 30 -2 109 122 258 -223 73 -84
8017 -84 -163 -119 -109 44 -11 -156 28 -106 51 126 -106 -43 163 279 -136 -84 -10 -42 -24 308 166 58 -11 85
8041 85 -108 85 166 -293 63 95 -87 -103 -233 -33 -27 -53 -48 -136 -194 12 231 -118 306 -12 149 -83 -1 -182
8065 -182 -186 105 42 -2 -58 125 -168 9 -44 173 -167 32 8 334 142 -236 94 149 -79 -35 42 123 245 84
8089 84 -21 -92 90 194 56 -50 166 -108 -36 156 -104 -25 -68 -42 209 -28 -150 151 125 28 132 -29 104
8112 104 55 15 -130 30 161 -60 44 77 -310 36 64 -77 186 -293 -80 -200 73 -13 -136 -273 -59 79
8134 79 72 100 -68 -172 33 -43 246 102 -366 -20 136 -295 -114 -180 -128 -124 21 183 59 256 86 8 -2 154
8158 154 -37 -118 -51 161 -1 15 -140 -83 -134 39 47 -16 211 -74 24 48 44 56 -168 -422 220 58 141 199 -126
8183 -126 -111 62 -302 -4 121 -43 -89 361
8191C61
##END NTUPLES=NMR FID
##END=
