##TITLE=1H_Pr C6H2O
 200.13MHz, CDCl3,
 8 sc
 
 31.1.2025
##JCAMPDX= 6.0         $$ Bruker NMR JCAMP-DX V2.0
##DATA TYPE= NMR FID
##DATA CLASS= NTUPLES
##ORIGIN= UXNMR, Bruker Analytische Messtechnik GmbH
##OWNER= pz
$$ XWIN-NMR		Version 3.5
$$ Fri Jan 31 14:07:57 2025 Russian Standard Time (UT+4h)  she@DPX200
##.OBSERVE FREQUENCY= 200.1313
##.OBSERVE NUCLEUS= ^1H
##.DELAY= (6, 6)
##.ACQUISITION MODE= SIMULTANEOUS
##.ACQUISITION SCHEME= undefined
##.AVERAGES= 8
##.DIGITISER RES= 18
##SPECTROMETER/DATA SYSTEM= spect
##.PULSE SEQUENCE= zg30
##.SOLVENT NAME= D2O
##.SHIFT REFERENCE= (INTERNAL, D2O, 0, 14.3821)
##AUDIT TRAIL= $$ (NUMBER, WHEN, WHO, WHERE, WHAT)
$$ ##TITLE= Audit trail, XWIN-NMR		Version 3.5
$$ ##JCAMPDX= 5.01
$$ ##ORIGIN= Bruker BioSpin GmbH
$$ ##OWNER= she
$$ F:/spectra/data/she/nmr/H-C/1/audita.txt
$$ ##AUDIT TRAIL=  $$ (NUMBER, WHEN, WHO, WHERE, WHAT)
(   1,<2025-01-31 14:06:19.87 +0400>,<she>,<DPX200>,
      <created by zg, POWCHK disabled, PULCHK disabled
       configuration hash MD5:
       00 E9 B6 7A A2 85 ED C7 34 08 36 98 17 FE 4E 26
       data hash MD5: 16K
       81 B5 0C 42 0D 05 AB 78 A9 00 6A 40 6E 19 04 BF>)
$$ ##END=
$$ 
$$ hash MD5
$$ 44 C3 00 02 45 27 97 2E 1D 09 2B BD 25 12 4A 4E
##$RELAX= 
##$RELAX= 
##$RELAX= 
##$RELAX= 
##$RELAX= 
##$RELAX= 
$$ Bruker specific parameters
$$ --------------------------
##$DU= <F:/spectra>
##$EXPNO= 1
##$NAME= <H-C>
##$PROCNO= 1
##$TYPE= <nmr>
##$USER= <she>
##$AMP= (0..31)
100 100 100 100 100 100 100 100 100 100 100 100 100 100 100 100 100 100 
100 100 100 100 100 100 100 100 100 100 100 100 100 100 
##$AQSEQ= 0
##$AQ_mod= 1
##$AUNM= <au_zg>
##$AUTOPOS= <>
##$BF1= 200.13
##$BF2= 200.13
##$BF3= 200.13
##$BF4= 200.13
##$BF5= 200.13
##$BF6= 200.13
##$BF7= 200.13
##$BF8= 200.13
##$BYTORDA= 1
##$CFDGTYP= 0
##$CFRGTYP= 5
##$CHEMSTR= <none>
##$CNST= (0..31)
1 1 145 1 1 1 1 1 1 1 1 1 1 1 1 1 1 1 1 1 1 1 1 1 1 1 1 1 1 1 1 1 
##$CPDPRG= <>
##$CPDPRG1= <>
##$CPDPRG2= <>
##$CPDPRG3= <>
##$CPDPRG4= <mlev>
##$CPDPRG5= <mlev>
##$CPDPRG6= <mlev>
##$CPDPRG7= <mlev>
##$CPDPRG8= <mlev>
##$CPDPRGB= <>
##$CPDPRGT= <>
##$D= (0..31)
0 0.7 0 0 0 0 0 0 0 0 0 0.03 0 0 0 0 0 0 0 0 0 0 0 0 0 0 0 0 0 0 0 0 
##$DATE= 1738317979
##$DBL= (0..7)
120 120 120 120 120 120 120 120 
##$DBP= (0..7)
150 150 150 150 150 150 150 150 
##$DBP07= 0
##$DBPNAM0= <>
##$DBPNAM1= <>
##$DBPNAM2= <>
##$DBPNAM3= <>
##$DBPNAM4= <>
##$DBPNAM5= <>
##$DBPNAM6= <>
##$DBPNAM7= <>
##$DBPOAL= (0..7)
0.5 0.5 0.5 0.5 0.5 0.5 0.5 0.5 
##$DBPOFFS= (0..7)
0 0 0 0 0 0 0 0 
##$DE= 6
##$DECBNUC= <off>
##$DECIM= 32
##$DECNUC= <off>
##$DECSTAT= 4
##$DIGMOD= 1
##$DIGTYP= 9
##$DL= (0..7)
0 120 120 120 120 120 120 120 
##$DP= (0..7)
150 150 150 150 150 150 150 150 
##$DP07= 0
##$DPNAME0= <>
##$DPNAME1= <>
##$DPNAME2= <>
##$DPNAME3= <>
##$DPNAME4= <>
##$DPNAME5= <>
##$DPNAME6= <>
##$DPNAME7= <>
##$DPOAL= (0..7)
0.5 0.5 0.5 0.5 0.5 0.5 0.5 0.5 
##$DPOFFS= (0..7)
0 0 0 0 0 0 0 0 
##$DQDMODE= 0
##$DR= 18
##$DS= 0
##$DSLIST= <SSSSSSSSSSSSSSS>
$$ [...]
##$SUBNAM0= <"">
##$SUBNAM1= <"">
##$SUBNAM2= <"">
##$SUBNAM3= <"">
##$SUBNAM4= <"">
##$SUBNAM5= <"">
##$SUBNAM6= <"">
##$SUBNAM7= <"">
##$SUBNAM8= <"">
##$SUBNAM9= <"">
##$SW= 18.0517328524113
##$SWIBOX= (0..15)
0 0 2 0 0 0 0 0 0 0 0 0 0 0 0 0 
##$SW_h= 3612.71676300578
##$TD= 16384
##$TD0= 1
##$TE= 0
##$TE2= 300
##$TE3= 300
##$TEG= 300
##$TL= (0..7)
0 120 120 120 120 120 120 120 
##$TP= (0..7)
150 150 150 150 150 150 150 150 
##$TP07= 0
##$TPNAME0= <>
##$TPNAME1= <>
##$TPNAME2= <>
##$TPNAME3= <>
##$TPNAME4= <>
##$TPNAME5= <>
##$TPNAME6= <>
##$TPNAME7= <>
##$TPOAL= (0..7)
0.5 0.5 0.5 0.5 0.5 0.5 0.5 0.5 
##$TPOFFS= (0..7)
0 0 0 0 0 0 0 0 
##$TUNHIN= 0
##$TUNHOUT= 0
##$TUNXOUT= 0
##$USERA1= <user>
##$USERA2= <user>
##$USERA3= <user>
##$USERA4= <user>
##$USERA5= <user>
##$V9= 5
##$VALIST= <valist>
##$VCLIST= <CCCCCCCCCCCCCCC>
##$VD= 0
##$VDLIST= <DDDDDDDDDDDDDDD>
##$VPLIST= <PPPPPPPPPPPPPPP>
##$VTLIST= <TTTTTTTTTTTTTTT>
##$WBST= 1024
##$WBSW= 4
##$XGAIN= (0..3)
0 0 0 0 
##$XL= 0
##$YL= 0
##$YMAX_a= 598202
##$YMIN_a= -614962
##$ZGOPTNS= <>
##$ZL1= 120
##$ZL2= 120
##$ZL3= 120
##$ZL4= 120
##$ABSF1= 10
##$ABSF2= 0
##$ABSG= 5
##$ABSL= 3
##$ALPHA= 0
##$AQORDER= 0
##$ASSFAC= 0
##$ASSFACI= 0
##$ASSFACX= 0
##$ASSWID= 0
##$AUNMP= <proc_1d>
##$AZFE= 0.1
##$AZFW= 0.1
##$BCFW= 1
##$BC_mod= 2
##$BYTORDP= 1
##$COROFFS= 0
##$CY= -3
##$DATMOD= 1
##$DC= 2
##$DFILT= <>
##$DTYPP= 0
##$F1P= 0
##$F2P= 0
##$FCOR= 0.5
##$FTSIZE= 0
##$FT_mod= 4
##$GAMMA= 1
##$GB= 0.15
##$INTBC= 1
##$INTSCL= 1
##$ISEN= 128
##$LB= 0.25
##$LEV0= 0
##$LPBIN= 0
##$MAXI= 10000
##$MC2= 0
##$MEAN= 0
##$ME_mod= 0
##$MI= 1.114404
##$NCOEF= 0
##$NC_proc= 0
##$NLEV= 6
##$NOISF1= 3.799351
##$NOISF2= 2.8
##$NSP= 1
##$NTH_PI= 0
##$NZP= 0
##$OFFSET= 14.38212
##$PC= 1
##$PHC0= 84.69435
##$PHC1= 19.99223
##$PH_mod= 1
##$PKNL= yes
##$PPARMOD= 0
##$PSCAL= 0
##$PSIGN= 0
##$REVERSE= no
##$SF= 200.129724274929
##$SI= 16384
##$SIGF1= 3
##$SIGF2= 2
##$SINO= 400
##$SIOLD= 16384
##$SREGLST= <1H.CDCl3>
##$SSB= 0
##$STSI= 0
##$STSR= 0
##$SW_p= 3205.1282051282
##$SYMM= 0
##$S_DEV= 0
##$TDeff= 0
##$TDoff= 0
##$TI= <>
##$TILT= no
##$TM1= 0
##$TM2= 0
##$TOPLEV= 0
##$USERP1= <user>
##$USERP2= <user>
##$USERP3= <user>
##$USERP4= <user>
##$USERP5= <user>
##$WDW= 1
##$XDIM= 8192
##$YMAX_p= 0
##$YMIN_p= 0
$$ End of Bruker specific parameters
$$ ---------------------------------
##NTUPLES= NMR FID
##VAR_NAME=  TIME,          FID/REAL,        FID/IMAG
##SYMBOL=    X,             R,               I
##VAR_TYPE=  INDEPENDENT,   DEPENDENT,       DEPENDENT
##VAR_FORM=  AFFN,          ASDF,            ASDF
##VAR_DIM=   8192,          8192,            8192
##UNITS=     SECONDS,       ARBITRARY UNITS, ARBITRARY UNITS
##FACTOR=    0.0002768,     1,               1
##FIRST=     0,             0,               0
##LAST=      2.2672688,     0,               0
##MIN=       0,             -614962,         0
##MAX=       2.2672688,     598202,          0
$$ Real data points
##PAGE= N=1
##DATA TABLE= (X++(R..R)), XYDATA
$$ [...]
1397H83M316q132r84Q610k779p314N679M972p467k161Q214q29p709L975N906o259
$$ 883 5199 -2933 -3917 4693 1914 -5400 279 5251 -2216 -4377 3837 3008 -4701 -726 5180 -1079
1413a079l407P510O0p597L075O329n599m108P042J656p527J418O884m096m951
$$ -1079 -4486 3024 3084 -4513 -1438 4891 -708 -4816 2226 3882 -3645 -2227 4657 561 -4390
1428d390O069K340p193O28O910l445n837N489L792o916j180P438j660o608M342
$$ -4390 1679 4019 -3174 -2546 4364 919 -4918 571 4363 -2553 -3733 3705 2045 -4563 -221
1443b21M652o072k114O791k62o961L101N817n247l771O723J145p126J638O183
$$ -221 4431 -1641 -3755 3036 2774 -4187 -1086 4731 -516 -4287 2436 3581 -3545 -1907 4276
1458D276m122m363N821J966o915P20O632l266n359N515L255o547o40O723j938
$$ 4276 154 -4209 1612 3578 -3337 -2617 4015 749 -4610 905 4160 -2387 -3027 3696 1758
1473A758n776M408L712o106j443O845j379o500L925M973n796k627O893j19o643
$$ 1758 -4018 390 4102 -2004 -3447 3398 2019 -4481 -556 4417 -1379 -4006 2887 2768 -3875
1488c875K557N569m860l497O398J050o879J799O165m181m547N862K171o382k2
$$ -3875 -1318 4251 -609 -4106 2292 3342 -3537 -1738 4427 246 -4301 1561 3732 -2650 -2672
1503b672O293k710n096N011K691n987l15O316k173n438M424L670n347j861O057
$$ -2672 3621 911 -4185 826 3517 -2470 -2785 3531 1358 -4080 344 4014 -1333 -3194 2863
1518B863o96n585L055M067n109j894N799l34n745K430N121m264l403N528J232
$$ 2863 2167 -3418 -363 3704 -1405 -3299 2500 2166 -3579 -1149 3972 -292 -3695 1833 3065
1533C065n921J141N288l243l865M902J875n884K98O034k312n361M313L381n234
$$ 3065 -2856 -1715 3573 330 -3535 1367 3242 -2642 -2344 3690 1378 -3983 330 3711 -1523
1548a523j289N305j195m552L129L474m882j585N787l96n665K491M810m266k798
$$ -1523 -2812 2493 1298 -3254 -125 3349 -1533 -3118 2669 2273 -3392 -901 3909 -357 -3155
1563c155M846Q57n249J543M540l918l059N265J218n768Q92N520k845m256M307
$$ -3155 1691 2548 -2701 -1158 3382 -536 -3595 1670 2888 -2880 -1988 3532 687 -3569 738
1578G38K423n245o1N124k149m280M258K833n648r02N976j057n361K923L681m221
$$ 738 3161 -2084 -2145 2979 830 -3450 808 3641 -2007 -2909 3067 2010 -3351 -428 3253 -968
1594i68j803M833n12m728K784L665m397k199N491M39n206J236M524k780l156M059
$$ -968 -2771 2062 1550 -3178 -394 3271 -1126 -3325 2166 2605 -2601 -1365 3159 379 -2777 1282
1610A282Q93m607J187M341l206l305M395J958m880k87M901j448m065L137K126
$$ 1282 2175 -2432 -1245 3096 -110 -3415 980 2938 -1942 -2229 2672 1224 -2841 296 2422
1625B422l953k88M372j612l951L100L237m173j982M631L21m448J276L365k769
$$ 2422 -1531 -1819 2553 941 -3010 90 3327 -846 -2828 1803 2124 -2324 -1048 2317 -452
1640d52j921L821K25m267J366M186k549l213L439K080m104k03L643j434k701K745
$$ -452 -2373 1448 1673 -2594 -1228 2958 409 -2804 635 2715 -1389 -1592 2051 617 -2084 661
1656F61J426l847MM134j222m145K667L105l421j699L876j40l448J803K587l217
$$ 661 2087 -1760 -1756 2378 1156 -2989 -322 2783 -638 -2337 1539 1399 -2049 -246 2341 -876
1672h76j475M297K4m618J568M014k661k964L486J185l629N07L399k315k528L540
$$ -876 -2351 1946 1970 -2648 -1080 2934 273 -2691 795 1980 -1649 -1142 2257 -58 -2586 954
1688I54J426m440J49M426j359l835K566K369k861r15L255r62l143K588K226l766
$$ 954 2380 -2060 -1911 2515 1156 -2679 -113 2256 -605 -1520 1735 773 -2370 218 2444 -1322
1704a322j104M240j64l996J618L045k540j646L081J79l312J454K916k795k050
$$ -1322 -2426 1814 1650 -2346 -728 2317 -223 -1869 1212 1391 -1921 -467 2449 -346 -2396
1719b396L690Q24l812M75L312j560k536K426J251l106J10L299j719k839K939J952
$$ -2396 1294 2118 -1694 -1219 2093 533 -2003 423 1674 -1432 -1322 1977 258 -2581 358 2310
1735B310l304r81L502j6l204J389K275k345j253L066l30l064J456K586k354j901
$$ 2310 -994 -1975 1527 1511 -1693 -304 1971 -374 -1627 1439 1109 -1955 -499 2087 -267 -2168
1751b168K875J065l150L37K870j766j808K481P97l104M39L221j697k647K488J921
$$ -2168 707 1772 -1378 -1041 1829 63 -1745 736 1533 -1571 -1132 2089 392 -2255 233 2154
1767B154l152p25L203p20k623J872J771k816n81L193l79l317J642K739k553j473
$$ 2154 -998 -1723 1480 760 -1863 9 1780 -1036 -1617 1576 1197 -2120 -478 2261 -292 -1765
1783a765K954L34k952Q96K313k041j459K807M20l296P95K894j681k143K535J028
$$ -1765 1189 1523 -1429 -533 1780 -261 -1720 1087 1507 -1789 -994 1900 219 -1924 611 1639
1799A639k860J25K726j341k096K353J157k876j43L043r43k571J753J692k259o39
$$ 1639 -1221 -1096 1630 289 -1807 546 1703 -1173 -1316 1727 784 -1787 -34 1658 -601 -1240
1815a240K458n58k293J452J736k172r83K707j11k532J089K172j703j406K126N85
$$ -1240 1218 660 -1633 -181 1555 -617 -1600 1107 996 -1536 -447 1725 22 -1384 742 1327
1831A327k340L11K182j347j666J889R71k376l0K355p88j921J383J428k022m75
$$ 1327 -1013 -702 1480 133 -1533 356 1327 -1049 -1079 1276 488 -1433 -50 1378 -644 -1119
1847a119K224m30j985J250J551j986o60K132p1k215Q04K078j599j419K190L25
$$ -1119 1105 675 -1310 -60 1491 -495 -1155 977 906 -1309 -505 1573 -26 -1445 745 1070
1863A070k310M23K131j266j583K021Q87k378P3K455j003k208J942J321k340k82
$$ 1070 -1240 -817 1314 48 -1535 486 1373 -1005 -932 1523 520 -1688 254 1575 -765 -1047
1879a047K270p50k048J656J487k354o13K716m49k433J363J795k107p44K143jk204
$$ -1047 1223 473 -1575 81 1568 -786 -1399 1317 868 -1565 -202 1593 -514 -1258 885 884 -1320
1896a320J057J855j785j148K240L41k618P09K117j300j598J837P83k192K90K010
$$ -1320 -263 1592 -193 -1341 899 1240 -1378 -669 1448 148 -1450 387 1170 -1022 -732 1278
1912A278j165j600J985R42k279n0K183p28j787J292J197j873l75J868l62j888
$$ 1278 113 -1487 498 1440 -839 -889 1294 566 -1221 71 1268 -605 -980 888 526 -1362
1928a362J163J472j682p90J977O0j804N60J498j112r88J495K64j694N42J580j128
$$ -1362 -199 1273 -409 -1199 778 838 -966 -406 1092 -20 -1008 487 751 -943 -401 1179 51
1945E1j090J501N73j595j98J716o19j483J199Q35j579k00J800l53j723J188J245
$$ 51 -1039 462 1035 -560 -758 958 339 -1144 55 890 -689 -889 911 558 -1165 23 1268
1962A268j565o88J688J02j841O69J429j267r66J770J94j896N12J865j191j363
$$ 1268 -297 -985 703 805 -1036 -367 1062 -205 -1171 599 793 -1103 -591 1274 83 -1280
1978a280J641O92j911J2J871q20j336J515P30j839n9J958o35j706J306J042j749
$$ -1280 361 1053 -858 -846 1025 205 -1131 384 1114 -725 -784 1174 539 -1167 139 1181 -568
1995e68m84J989n76j496J090J192j613o10K041j74j906Q68J663j647q97J801J29
$$ -568 -1052 937 361 -1135 -45 1147 -466 -1076 965 791 -1115 -247 1416 -231 -1128 673 802
2012H02j832N80J373j030j055J551N66j790K40J606q02j276J174Q73j542k25J648
$$ 802 -1030 -450 923 -107 -1162 389 955 -835 -595 1011 209 -1067 107 980 -562 -787 861
2029H61m28j328R43R39j391l36J559l20j335P10J128j189p00J315J39j385N52
$$ 861 433 -895 48 987 -404 -740 819 499 -836 -126 1002 -187 -887 428 567 -818 -266
2046b66J171j059p83J537K44j574J41J601p35j232J103P82j492j96J540m77j103
$$ -266 905 -154 -937 600 844 -730 -589 1012 277 -955 148 930 -562 -758 782 305 -798
2063g98Q25R34j340n41J788l68j345O82J196j212o95J459J2j374O97J060j043
$$ -798 27 961 -379 -920 868 500 -845 -163 1033 -179 -874 585 597 -777 -80 980 -63
2080f3q04J377K33j658M22J450r27j087J227N49j317Q6J357p20j030J230P13j543
$$ -63 -867 510 743 -915 -493 957 30 -1057 170 719 -598 -512 845 125 -905 325 1038 -505
2098e05l09J581m93j252R88Q07j318k08J398m47j180Q99R59j296n48J643r7j322
$$ -505 -814 767 274 -978 10 817 -501 -709 689 242 -938 -39 920 -376 -924 719 622 -700
2116g00L60J148r16n47J049J67j297O01J178j114p25J191K63j160n6J073k47r01
$$ -700 -340 808 -108 -655 394 561 -736 -135 1043 -71 -796 395 658 -502 -558 515 268 -633
2134f33O40L83q33J84R46m88r60R38O95j216k98J185n7j083L30Q05p31m04J120
$$ -633 7 390 -443 -259 687 199 -761 177 872 -344 -642 543 486 -597 -267 538 -193 -597 523
2153E23q4j146L97J216p80q57P82P41j162j25J070m06o61Q01L45j089KJ228m20
$$ 523 439 -707 -310 906 126 -731 51 792 -370 -495 575 169 -492 309 654 -435 -433 795 375
2172C75j216Q34P20q69m61J076j28j108O51P33r00m09J375m9j372L45J211r18
$$ 375 -841 -7 713 -156 -617 459 331 -777 -126 607 -293 -702 673 624 -748 -403 808 -110
2190a10o94J091K32r96L09Q50p97p51J211L16j237J23J233m80j159R05O66r46
$$ -110 -804 287 519 -477 -168 682 -115 -866 345 661 -576 -453 780 300 -859 46 712 -234
2208b34k02J019m52q36Q97N64j201l8J109j59j251N88Q16p90l08Q12n6q64N35
$$ -234 -436 583 131 -705 192 756 -445 -483 626 467 -784 -196 620 -170 -478 334 278 -586 -51
2227e1O44q34l28J016P5r72J35R27n98m62O30K10q99L30P90n97p18Q85M95j210
$$ -51 593 -241 -569 447 522 -450 -315 612 14 -448 182 392 -507 -177 613 16 -702 183 678 -532
2247e32J30Q68j62q15L14P30p86j40Q52r3r03L51Q11p33n01Q40J97r18J94O62
$$ -532 -402 466 304 -511 -197 533 -253 -393 459 366 -537 -186 625 -108 -609 231 428 -490 -296 366
2267C66m49l22N51J86p76J90J003n91p83P04N81p35m42R41k27p37O11L82q21j17
$$ 366 -83 -405 146 332 -444 -254 749 158 -625 79 660 -75 -517 424 197 -540 71 453 -368 -485
2287d85J084l24p98L50P94p77l85Q84j1p52K83P25p86k97R76o4r64K51R21n12
$$ -485 599 275 -523 -173 621 -156 -541 343 332 -420 -137 588 -198 -495 481 417 -547 -296 625 113
2307A13p45P87J57q49J87O08j89o02O88L81q92J6Q50k93p69N69L90n99j64N84
$$ 113 -632 155 312 -537 -350 258 69 -533 155 536 -356 -340 510 217 -552 17 407 -192 -356 228
2327B28k8o05M10L18m57m10Q63o9p29M32N89n53l37N84R1p33K82N26l56m22N09
$$ 228 200 -405 5 323 -134 -544 319 250 -479 -47 542 -11 -348 236 327 -406 -124 402 46 -376 133
2348A33L80p45r1P22j92o56L72L28m75o3O06k8n98K41N24o24q5N58L2p66K80P01
$$ 133 513 -232 -323 399 207 -449 -77 251 -224 -287 319 291 -307 -66 458 -166 -251 307 339 -427 -147 554
2370E54o55l45O50K01p33J63N72l96m61O18J93o37k8P71l38n79M01N10p24l4O96
$$ 554 -101 -446 204 405 -328 -165 407 11 -450 168 361 -276 -304 467 129 -450 -49 461 -263 -297 399
2391C99l13n78O81K78o54k82Q74j90p50M33N19o26l24R51j74o68M11N33o03k97
$$ 399 86 -492 189 467 -187 -469 405 215 -535 -102 417 -209 -533 418 244 -424 -13 520 -83 -380
2411c80P29K5p00J02O87m01m51N47R6m79J08N67m21l72N59J78o93J30N54j80o14
$$ -380 349 374 -326 -224 463 62 -389 158 254 -225 -117 450 29 -343 216 394 -299 -169 385 205 -409
2432d09M77J47m35j8N46k16m16L55L68m62l47O24Qm99J05N92m33l10M78Q2n50
$$ -409 68 215 -220 -238 308 92 -324 31 399 -63 -410 214 222 -277 -172 420 -13 -323 155 237 -313
2453c13K51L71k25m16L50M20n70o4M79k60l86M28K25m59p9N09l4n77K39M75m36
$$ -313 -62 309 84 -332 18 438 -132 -196 283 23 -363 65 290 -169 -248 261 227 -350 -111 364 -72
2474g2l08O00N3o38K65M64l56l67N97Mm72O5N60n26k28M20K50n17j06O67k59m20
$$ -72 -380 220 273 -365 -100 364 8 -359 238 242 -230 -165 395 -131 -359 61 311 -206 -312 355 96 -324
2496c24P65m1p28K16N96k77m98L85L09m47j48N59k87n25M97K21l57j44M45k7n74
$$ -324 441 400 -328 -112 484 207 -291 94 403 -44 -192 367 80 -445 52 273 -84 -228 217 190 -384
2517c84K74M38m29k37N32m3l32J83K19l63k29N40J3n61J95N21l12m16M03K14l93
$$ -384 -110 328 -101 -338 194 151 -181 2 221 -142 -371 169 182 -379 -184 337 25 -391 12 226 -167
2538a67JN28k44l97K55M03l85k75M99O7n73J96L40k63j60L95p4l84J85K12k17
$$ -167 -166 362 118 -279 -24 379 -6 -281 218 285 -288 -92 248 -15 -175 220 146 -238 -53 159 -58
2559e8l39N66l2l72J2M93k85k76L46K79o14R9N42k36m43M46J97n71p1M56m9l82
$$ -58 -397 169 137 -235 -223 270 -15 -291 55 334 -280 -181 361 125 -318 128 325 -246 -317 139 90 -292
2581b92K47K46k99o7M21o7m94K29N23n74o6L35O6o26L40M43l48l55M88o0l65K18
$$ -292 -45 201 -98 -165 256 189 -305 -76 447 -127 -193 142 208 -418 -78 365 17 -338 150 90 -275 -57
2603e7L45l44k82M85K25p11J07N51k28l95L59J52m04J5M00j02m21L84K06n64N
$$ -57 288 -56 -338 147 372 -339 -232 319 91 -304 55 207 -197 -182 218 116 -305 79 285 -279 -274
2624b74N70j82k71J11L26k81k22M96j39l60K23L69n29n5L77k9k58m7L97j64k93
$$ -274 296 114 -157 -46 280 -1 -223 273 134 -226 -3 366 -163 -218 159 130 -128 -175 222 58 -235
2645b35L93k4k26L5K38j41l24L02J49l14n5M98k49k10K85P6j58k12M70j66l74
$$ -235 158 134 -92 -57 181 40 -284 18 167 -147 -202 296 47 -163 122 198 40 -172 298 132 -242
2666b42Q4M29l69j49L49K33n05m5N42l35j36L03M8l56k1M41k33l37K16K62l26
$$ -242 -158 271 -98 -247 102 335 -170 -215 327 -8 -144 159 207 -149 -170 271 38 -299 -83 179 -147
2687a47k48N45n7n01L80K68n46J17N37k47m43L07L13m73OL47P2m35J29L27k77
$$ -147 -395 150 93 -408 -28 240 -306 -189 348 101 -342 -35 278 -195 -189 158 230 -205 -76 251 -26
2708b6k62N28J7n32J48L51k26k30L02J11l79M4L98k59k94M72R3m84l3M75q1m68
$$ -26 -288 240 257 -275 -127 224 -2 -232 70 181 -198 -154 244 -15 -309 163 256 -228 -261 214 133 -335
2730c35K77K61k53r9L72k08k25J42K05j81k61N50k05j80J10J63k13j6K69l6j76
$$ -335 -58 203 -50 -149 223 15 -210 -68 137 -44 -305 245 40 -140 -30 133 -80 -96 173 137 -39
2751c9q8M35l51k43L95J67m74J04K15j00k49J59K00l13j3L58j04l71K42K83j23
$$ -39 -127 308 -43 -286 109 276 -198 -94 121 21 -228 -69 131 -182 -195 163 59 -312 -70 213 90
2772I0l48L61k7l16O0K45j46j95M12Jm20L01J99j88k56J81K29l09j9M47j90k77
$$ 90 -258 103 76 -240 -180 65 -81 -276 136 137 -283 18 217 29 -227 -46 183 -126 -145 302 112 -165
2794a65K80J59l75MK34j10l56K45L19l11k8K21J3l92K75J65k59p5L67q2m44L22
$$ -165 115 274 -101 -97 137 27 -329 -84 235 -76 -104 117 130 -262 13 178 -81 -156 211 129 -315 7
2816GR4j68j97M15p3k22Q5L28k87j44K43J20l51Q7K50j21k75K40J77l21n3L72
$$ 7 101 -67 -264 151 78 -144 -59 269 -18 -162 81 201 -150 -63 187 66 -209 31 208 -113 -166 206
2838B06j75j70J45K14k75oJ38p1j92J91J20j67j30J50J02k95K36L3j24p8L06q9
$$ 206 31 -139 6 220 -55 -61 77 6 -186 5 125 -42 -172 -22 80 -215 21 54 -70 -148 158 69
2860F9j51p4L26k00k15L45J50l85k0L02ll28M9K64k24j3K94q9k42J80J75k88J0
$$ 69 -82 -156 170 -30 -245 100 250 -135 -155 147 144 -184 -135 129 -95 -108 186 97 -145 35 210 -78 -68
2883f8K50k1l27K96O6l27m8L70r5k99nM38l25m4J62J12k88P7K68k10j12J80K04
$$ -68 182 161 -166 130 196 -131 -179 191 96 -203 -208 230 -95 -139 23 135 -153 -76 192 -18 -130 50 254
2906B54m82J06K41j09l05K65K24k23j15K72j4k84K88K9j61r5K81p6k13J32K37
$$ 254 -228 -122 119 10 -295 -30 194 -29 -144 128 114 -170 118 147 -14 -109 172 96 -117 15 252
2927B52k08j38K51q1j06m8J79j70j72K97M6k95J05J51p6r8J22P0k11J53Q4p6j07
$$ 252 44 -94 157 76 -30 -78 101 -69 -241 56 102 -193 -88 63 -13 -111 11 81 -130 23 107 31 -76
2950g6J56J25k36j10K31K5k05R1O8j69q0L63j27j36k7K70j78o6P8K57l93J80J01
$$ -76 80 205 -31 -141 90 115 -90 1 69 -100 -180 183 56 -80 -107 163 -15 -81 -3 254 -139 41 142
2973A42j91j44J43J92l80J53L55j70k78J73K60l94n9L77j73j7q7L00j66j85L81
$$ 142 -49 -193 -50 142 -238 -85 270 100 -178 -5 255 -139 -198 179 6 -11 -98 202 36 -149 232
2994B32p5l86P8L80k66k97L76J32k64R1K28k59j33L24j1k81k1K13N1l84M02Q1
$$ 232 157 -229 -151 229 -37 -334 42 174 -90 1 229 -30 -163 161 150 -131 -152 61 112 -272 130 211
3016B11l47J33R3r6j39K03N8l36J07K62n1k87K80J26l12m1K54l9k84K62M9j13
$$ 211 -136 -3 90 -6 -145 58 116 -220 -113 149 98 -189 91 217 -95 -136 118 79 -205 57 106 -7
3038gr2J52J09j46k8J14p5j51K15O6l17K64Q8k18j86K35K27l63O5J11kk01J95
$$ -7 -99 53 162 16 -12 102 27 -124 91 157 -160 104 192 -26 -212 23 250 -113 -48 63 61 -140 55
3061E5k0j35%J60o9J9p5J55j47n4J13O7j37LK55j23k14L12J1k43J31J12j18k90
$$ 55 35 -100 -100 60 -9 10 -65 90 -57 -111 2 69 -68 -65 190 67 -147 165 176 -67 64 176 58 -232
3085b32L43J47l11j86M99j82k12J74R8k26j25K92k7j94R1O5j24J51J28o1k38R2
$$ -232 111 258 -53 -239 260 78 -134 40 138 -88 -213 79 52 -142 -51 14 -110 41 169 108 -130 -38
3107c8L65m10l6K00j35k29K50K26l63M4K19K3l17J51J58l6j02J74q3j61R4J45
$$ -38 327 -83 -119 81 -54 -283 -33 193 -170 -126 93 116 -201 -50 108 72 -30 144 61 -100 -6 139
3129A39j96j46M03m3k76l8L52j01k19K26k4j40L2K97l49j33K31M0j11NQ9M7p6
$$ 139 -57 -203 200 157 -119 -157 195 94 -125 101 77 -63 -31 266 -83 -216 15 55 -56 -51 38 85 9
3152Ir3L33k13j58K70p0j95J67m3P4j11JJ76k55R1L9K9M3j57R5r6j10K16O0k35
$$ 9 -84 249 36 -122 148 78 -117 50 7 81 -30 -29 147 -108 -17 22 51 94 -63 32 -64 -174 42 102 -133
3177a33nK96j80o7J77k4j84O1J53J9j88J21Q3l29J98J68j62j71K87l3j93J9K02
$$ -133 -138 158 -22 -89 88 64 -120 -59 94 113 -75 46 129 -200 -2 166 4 -167 120 87 -106 -87 115
3200A15q5l58M63K3l34M9L59k74r5J81J27k00p6K36m7r4N3K7j25p6J99r8j8J11
$$ 115 30 -328 135 158 -176 -127 232 -42 -137 44 171 -29 -105 131 84 -10 43 70 -55 -131 68 -30 -48 63
3224F3K2j02j43L01j4l27J64K16k75p6J18J02r8j08K51q2j06J20R0k23L2K13k73
$$ 63 85 -17 -160 141 127 -200 -36 180 -95 -171 -53 49 -49 -157 94 12 -94 26 116 -107 -75 138 -135
3247a35P5P3k7j71J45Q0M5r3M0Nk0m4O1R4j29l4J54l4j70J52k8o5m6J99r6j91
$$ -135 -60 13 -14 -185 -40 40 85 -8 32 37 17 -27 34 128 -1 -35 119 85 -85 67 39 -26 -72 127 31 -160
3273a60K02J02k16k3J12Oj03J40K78l47j35K34n2J5p8K45k65J6N6J29k33LK23
$$ -160 42 144 -72 -95 17 23 -80 60 338 -9 -144 90 38 53 -25 220 -45 -29 27 156 -77 -74 149
3296A49j52p6J57J9j56mK40j28o9P5oo9n2J07j42q8K05K8j16J03J17j41m7k1O3
$$ 149 -3 -79 78 97 -59 -63 177 49 -20 55 49 -20 -72 35 -107 -195 10 38 -78 25 142 1 -46 -67 -4
3321dj23J57P5j45p3Q9J69j46m4O3J17k54K10J51m04k2K21L8k57J50J53p8J14
$$ -4 -127 30 105 -40 -113 -24 145 -1 -45 18 135 -119 91 242 -162 -184 37 75 -182 -32 121 43 157
3344A57k01J15j02o9J44kr1J11J12k42J4J99j98l5J11lq6O0n9J22k39J08M4j18
$$ 157 -44 71 -31 -100 44 42 -49 62 174 -68 -54 145 -53 -88 23 20 -66 -6 -65 57 -182 -74 -30 -148
3368a48Q1J00J43k55j6J93l3l6k4J60j49q1K14o4j85Q1N8j7r7P2J34j51k0J78
$$ -148 -67 33 176 -79 -95 98 65 29 5 165 16 -65 149 85 -100 -19 39 22 -75 -3 131 -20 -40 138
3392A38k26mK00j88m3Q2P1j68K0J78M3j47k4J14p5r2J77P7k57N8R5m5n0J81j12
$$ 138 -88 -92 108 -80 -123 -41 30 -138 -118 60 103 -44 -68 46 -29 -121 56 133 -124 -66 29 -16 -66 115 3
3417Cl9MJ54m7n2K03j83j77l8K95k44L1OJ68j71k3J25J04j01n8J68j60j1O1K4
$$ 3 -36 -32 122 75 23 226 43 -134 -172 123 -121 -90 -84 84 -87 -110 15 119 18 -40 128 -32 -43 18 42
3442D2j12J9J04j45P6Q0Lj04R3R6j64QJ8J7p1K3J16o3n4R5J3j57P8J46j58q6K2
$$ 42 -70 -51 53 -92 -16 64 67 -37 56 152 -12 -4 14 31 -40 -17 99 36 -18 77 90 -67 11 157 -1 -87 -65
3469f5Q0n4o4O4J4n9R5J02j97j23K12L7lj46J62o7L6J11j29n1o1K31j80q8J20
$$ -65 15 -39 -103 -39 -25 -84 11 113 -84 -207 5 42 39 -107 55 -12 24 135 6 -45 -106 125 -55 -143 -23
3494b3J15j36m1K08kj57l2J58j69PK62j27j75J41R5l9j91L19j99j41J34l3j8p3
$$ -23 92 -44 -85 123 121 -36 -68 90 -79 -72 190 63 -112 29 124 85 -106 213 14 -127 7 -26 -44 -117
3518a17J99m9j06K3Q5q4n3K78p9j99K1L6o3PM8J81k44J55J21j63j31L5K18j51
$$ -117 82 33 -73 -50 35 -49 -102 176 97 -102 -81 -45 -108 -101 -53 128 -116 39 160 -3 -134 -99 119 -32
3542c2QL8Q9j67K8N7m1p4J28K7n5qJ4q1L2M4J0o9K0pN9q2L2N8j16J4K64p5j32
$$ -32 -24 14 103 -64 -36 21 -20 -94 34 61 6 -2 12 -69 -37 7 17 -52 -32 -39 20 -62 -30 28 -88 -74 190 115 -17
3571a7J37L2j72o3J38l3j42M4K06q8n1J33jm5j25R0O8k00J20nj59J81K3K8l7j2
$$ -17 120 152 -20 -83 55 22 -120 -76 130 42 -9 124 123 78 -47 43 111 -89 31 26 -133 48 71 99 62 50
3597E0%p9J4R9j1q5p9M4J5j25J42J48j65RJ12m8j44J18mm9J54l1k54R1J23j0j33
$$ 50 50 -29 -15 84 73 -12 -91 -47 -32 -157 -15 133 -32 -23 89 41 -103 15 11 -38 116 85 -169 -78 45 35 -98
3624i8J61Mj13q7J25J32m29L70m1l8l7N3O0j38K8J75r2l6NL7j03K3M1M2m9ll7
$$ -98 63 67 -46 -133 -8 124 -305 65 24 -14 -51 2 62 -76 -48 127 35 -1 4 41 -62 -39 2 44 -5 -8 -45
3651d5j36K17m5L9LJ10j32q4M2Ll0P3%M5p7j0MJ41j71LN1M8j1n7O7j24N4k3O7
$$ -45 -181 36 -9 30 33 143 11 -73 -31 -28 -58 15 15 60 -17 -27 -23 118 -53 -50 1 49 38 -19 48 -76 -22 -45 22
3680B2J4q3J32m1j58K02j23m3J51L1j65q3J21P7q9K0Q7l8p6J04J0q5j19K39r9
$$ 22 36 -47 85 44 -114 88 -35 -78 73 104 -61 -144 -23 54 -35 -15 72 34 -42 62 72 -13 -132 107 8
3705Hj22K02n3j55J01J87k86N4K01r3r6L6N6j21l3Q0J43j26j8J70j21k1P0Mj39
$$ 8 -114 88 35 -120 -19 168 -118 -64 137 44 -52 -16 40 -81 -114 -34 109 -17 -35 135 14 -7 63 67 -72
3730g2M5Mr2M0J03N3l4m9O8j3j88J30N4j6j27N1N9l0O8K2j0o9L7p7MO0oP4r8J7
$$ -72 -27 -23 -115 -75 28 81 47 -2 66 53 -135 -5 49 33 -94 -43 16 -14 54 76 66 -3 34 -43 -39 21 15 89 -9 8
3760Ho3J0q2K30j41L2j07K05j11J05r6K5N7j45J84n7j71J6J16j6L9lL7j04l0Q2
$$ 8 -55 -45 -127 103 -38 -6 -113 92 -19 86 -10 15 72 -73 111 54 -117 -101 15 -1 38 35 72 -32 -62 20
3786B0K3m4%J31j04n1J46j01j35K26or8j26K28r9J4k8K9m0R2L7o2j13J68n4j40
$$ 20 43 -1 -1 130 26 -25 121 20 -115 111 105 7 -119 109 10 24 -4 25 -15 77 114 52 -61 107 53 -87
3812h7Q6O8j09r8J10K6k4M8J1m8oN6J4j76P1J47j91R5Q8r4p1N0J0J05r7O1k2n9
$$ -87 -1 67 -42 -140 -30 -4 -28 20 31 -17 -23 33 47 -129 -58 89 -102 -7 81 -13 -84 -34 -24 81 -16 45 23 -36
3840c6P4q1M9l2n0j8J44m4m8M4j02L3k1J44r8r9J11O5p0O0q7o4N7R7n4K1J14j00
$$ -36 38 -43 6 -26 -76 -94 50 6 -42 2 -100 -67 -88 56 -42 -141 -30 35 -35 25 -62 -126 -69 28 -26 -5 109 9
3868IO2O7r0r2jj6K04k92L9R4P8r4k0J2o4J24J1L5j93J04J51j33p7J95q5Oj2K6
$$ 9 71 138 48 -44 -45 -61 143 -149 -110 -16 62 -32 -52 -40 -104 20 31 66 -127 -23 128 -5 -82 113 28 34 22 48
3896D8l8r8J15m5Q5k1j33R9j23Q2O6j4P6r7M4r3ON4k8J24j09Pl7M8%K6O5j71K27
$$ 48 10 -88 27 -18 67 46 -87 12 -111 -29 37 23 99 2 46 -47 -41 13 -15 109 0 7 -30 18 18 44 109 -62 165
3925A65l06J13J39j80M0N9j3Q1r6M7qJj4p3q2J61pr2l6Q9j5j1N6q2J1R3m8l0M6
$$ 165 -141 -28 111 -69 -29 30 17 98 2 49 41 42 28 -45 -127 34 27 -65 -101 -12 -27 -38 18 -64 -53 40 -8 -38 8
3954HLK8L2q0K9nj05R8J08j9j34L0Q2j22O2P8n5N9l8p2Q9q4L4p5j6J3J21k4l09
$$ 8 11 39 71 -9 20 15 -90 8 116 97 -37 -7 75 -47 15 93 38 97 59 -13 76 -8 26 -49 -65 -52 69 45 -264
3983b64K35J07j36J33o0j29J42j24L0M7Q1j7O9j33M7j35P8kJ32j6j51J99k08m2
$$ -264 -29 78 -58 75 15 -114 28 -96 -66 -19 62 45 114 -19 28 -107 -29 -31 101 85 -66 133 -75 -117
4007a17J16O7O1j54R2j12P7n1K28j38j30RJ36r2K8k0l4lJ74j30k1PR1j61qJ24
$$ -117 -1 66 127 -27 65 -47 30 -21 207 69 -61 -52 84 -8 20 0 -34 -37 137 7 -14 -7 84 -77 -85 39
4033C9j5o3Q6J2k7l7k3P2r5J72n5Oj9LK5j19o6K19p9j05N9J0p8J09j8N2j35N4
$$ 39 24 -39 47 59 32 -5 -28 44 -51 121 66 72 53 56 81 -38 -104 115 36 -69 -10 0 -78 31 13 65 -70 -16
4061a6Q8j09N1N6j09L8J62k21K9J16p9L5j53J35o2j0R3p6n0QR6LNR4o5p9J9J7
$$ -16 72 -37 14 70 -39 -1 161 -60 -31 85 6 41 -112 23 -39 -49 44 -32 -82 -74 22 25 30 124 59 -20 -1 16
4089A6J09r0R9j41k0K7K5j20R3N0J5k6k2m6l2J01j11J2P4Q9l8p7P2r4o1P4M8l7
$$ 16 125 35 134 -7 -27 0 25 -95 -2 48 63 37 15 -31 -63 38 -73 -61 13 102 64 -13 59 -35 -96 -22 26 -11
4117a1J7K7o1l1R8r1M7O0k0N3j06R4r7nJ13L6r1p4L5p5KJ53j10l2Q7j4J25j33
$$ -11 6 33 -28 -59 39 -52 -5 55 35 88 -18 76 -21 -26 87 123 32 -42 -7 -82 -80 73 -37 -69 18 4 129 -4
4145dq8Q8N8j29J29J8j17Q3j77K8K06j65O2m7P5pL2j1Ml2MM4np9P2RKj8j6J40
$$ -4 -92 -4 54 -75 54 72 -45 38 -139 -111 95 -70 -8 -55 20 13 45 34 38 6 10 54 49 -30 42 51 53 35 19 159
4175A59j83O6%k0L3jk2MK9r3p4J75j19n1J31l9Rk1j01N5oM0Q7M6k07O9NQ0j10
$$ 159 -24 42 42 22 55 54 32 36 65 -28 -102 73 -46 -97 34 -5 4 -17 -118 -63 -69 -29 58 104 -103 -34 -29 51 -59
4204e9M5OK4K5Jmp0l2L2o1K21j74N1k8L0L1j20K07j53Ro1J19j87Q9L6k8L2J7J1
$$ -59 -14 -8 16 41 42 38 -32 -64 -32 -93 128 -46 5 -23 7 38 -82 125 -28 -19 -80 39 -148 -59 -23 -51 -19 -2 9
4233Ir6Q4P7p8l6P7j58k9J28K9L2Oo0m4J12l3p7O0l6O2%j1J8J53j38Qk7k8M3l4
$$ 9 -87 -3 74 -4 -40 37 -121 -150 -22 7 39 45 -15 -59 53 20 -57 3 -33 29 29 18 36 189 51 59 32 4 47 13
4263A3l7J01r6J27L9j52l6k7O9l2j7J13n3q9J20j9k8K7K9j78J46k0P2j8m0n8N3
$$ 13 -24 77 -19 108 147 -5 -41 -68 1 -31 -48 65 12 -77 43 24 -4 23 52 -126 20 0 72 54 14 -44 9
4290IL7m6m7k8J20n3n7L4J32M9j77K7n0J12l1L6j35J58J4j21J59q7p9k0M9l4J
$$ 9 46 0 -47 -75 45 -8 -65 -31 101 150 -27 0 -50 62 31 67 -68 90 104 -17 142 55 -24 -44 5 -29 -28
4317b8LJ5j9NQ5q3pK4n6P3N8m9j01J58k56K30J3p4N9N0p4n8J19j4Kk3J3k2J7r8
$$ -28 -25 -10 -29 -24 61 -22 -29 -5 -61 12 70 21 -80 78 -178 52 65 -9 50 100 26 -32 87 73 75 52 65 43 60 -38
4347c8R2l2K4okp9Q6j04O7J5pNn3kn3k2M4J39j62M9N4J4j49R3R6j10j7j4Q5M3
$$ -38 54 22 46 40 38 -41 45 -59 8 23 16 21 -32 -34 -87 -109 -65 74 -88 -39 15 29 -120 -27 69 -41 -58 -72 13 56
4377E6p1J49j31J31j55J4M1L1l9P9n9m7M2n4J1j1k8l8J25j7L5nq5j03J23m5O6
$$ 56 -15 134 3 134 -21 -7 34 65 26 105 46 -1 41 -13 -2 -13 -41 -79 46 29 64 59 -26 -129 -6 -51 15
4404A5j7j0O2L3o9J7p5m1J44j19N6m4O3M3Mon9K2m3L4j9M9r0k1J18L5o7o3K4m7
$$ 15 -2 -12 50 83 14 31 -44 -85 59 -60 -4 -48 15 58 62 56 -3 19 -24 10 -9 40 -50 -71 47 82 15 -48 -24 -71
4434g1N5j5O8L7j43O4n9Q5m3Qj5oP5j30q4J17N4l9J15n1j12P8m2J17l4K8M8j1
$$ -71 -16 -31 37 74 -69 -5 -64 21 -22 -14 -29 -35 40 -90 -174 -57 -3 -42 73 22 -90 -12 -54 63 29 57 105 94
4462I4j6J5q1M6k2L8Q7j48L1p3O8l2j43J05J14n6n3k0L2n5M7n9P3J06j52R5p2
$$ 94 78 93 12 58 36 74 161 13 44 -29 39 7 -136 -31 83 27 -26 -46 -14 -69 -22 -81 -8 98 -54 41 -31
4489c1M9r7J03L2mL4q8M9n7j9P2pr2n5N9J48j62M5r8K06k20R6J27n5N0PpP7j02
$$ -31 18 -79 24 56 52 86 -2 47 -10 -29 43 36 -56 -111 -52 96 -66 -21 -119 87 -133 -37 90 35 85 92 85 162 60
4518F0j4M9L7L8k41lm3J11n7q4P0Q6J9m6j0J1J12j42K7mM4j0O8Q2j43r5R6R6n
$$ 60 46 95 132 170 -71 -74 -117 -6 -63 -147 -77 9 28 -18 -28 -17 95 -47 -20 -24 20 10 78 160 17 -78 18 114 109
4547A09o2k4r5L0N9j4j8O1J9q7j26K28l1q9N8j89J01P8jM6j21J67j21MMJ15j41
$$ 109 47 23 -72 -42 17 3 -15 46 65 -22 -148 80 49 -40 18 -171 -70 8 7 53 -68 99 -22 -18 -14 101 -40
4574d0L1JM4m4M3q4J4J09n6j19N3j1N3l8L0J01l1km5O0n5k7m3J02o6J01m6K4q5
$$ -40 -9 -8 36 -8 35 -49 -35 74 18 -101 -48 -59 -6 -44 -14 87 56 54 9 69 14 -13 -56 46 -20 81 35 59 -26
4603b6Q6Kr9Mm3J7M2P2j85M9J05n5p9J32k3R2l3M9j69j4J07m4RQ7q3j19J35J3
$$ -26 60 62 -37 -33 -76 -59 -17 55 -130 -81 24 -31 -110 22 -1 91 58 107 -62 -76 31 -13 -4 83 0 -119 16 29
4631B9Nj1k4O1PLp9K0j3K3K7J19j14j26K5m5J45o1k0K7J79k05Lk7J31k83K87p5
$$ 29 34 23 -1 60 67 70 -9 11 -2 21 48 167 53 -73 -48 -93 52 -9 -29 -2 177 -28 -25 -52 79 -204 83 8
4659Hp8J17l7Q4j46M4K0M4j19N7O2j7o5N1M0q3%L7K8n2kM9J35j96P4n4M7n1K1
$$ 8 -70 47 10 94 -52 -8 12 56 -63 -6 56 39 -26 25 65 -18 -18 19 47 -5 -7 42 177 -19 55 1 48 -3 18
4688A8n3KJO6j04oLJ58k9j62J79n5k9P5l5k3m0j7J73j63L4K2l3LK4Q4o2l4J9L
$$ 18 -35 -33 -32 34 -70 -76 -73 85 56 -106 73 18 -11 64 29 6 -34 -51 122 -41 -7 15 -18 -15 9 93 31 -3 16 19
4718A9M1j18J63o0K9J6q3rj3m4J0j1N6r0R0q0O9l4o3N1J04j66P2QL6P3q8M2N8
$$ 19 60 -58 105 45 74 90 7 -2 -15 -59 -49 -60 -4 -94 -4 -84 -15 -49 -112 -61 43 -123 -51 -43 -7 66 -22 20 78
4747G8k3J00n8j58J04R2q6p9L3roK6%j25J42O4J03j17j05J61j03j12nM8M5j31
$$ 78 55 155 97 -61 43 135 49 -30 3 -6 -12 14 14 -111 31 95 198 81 -24 137 34 -78 -83 -35 10 -121
4773a21J57J7j29L5O0pM3n0k7j3J00n1L9j0L2j51P1r4J63p0m0N2k5J3k2M0j01
$$ -121 36 53 -76 -41 19 12 55 5 -22 -35 65 14 53 43 75 -76 -5 -99 64 -6 -46 6 -19 -6 -28 12 -89
4800h9J39n0J29mj19j3Lm3L2O2K2m5L6r8J19j68o0J97j17Q8o1K0o9O6q1P0M6n1
$$ -89 50 0 129 125 6 -7 -4 -47 -15 47 69 24 60 -38 81 -87 -147 50 -67 21 -40 -20 -89 -23 -104 -34 12 -39
4828c9P0k7J51j38n8N9p7R3K0o3n0R2K8j9k0o7J33j34R4l0Q3j20l3P9j12Q1qL2
$$ -39 31 4 155 17 -41 18 -59 34 54 -9 -59 33 61 42 22 -45 88 -46 48 18 101 -19 -52 27 -85 -4 -12 20
4856B0n5J46j30L2l7L3k4m9K5J6J54j14M1j25nJ65r1O4j61J06J52j34l3O1q5k6
$$ 20 -35 111 -19 13 -24 9 -15 -64 -39 -23 131 17 58 -67 -72 93 2 66 -95 11 163 29 -4 57 -28 -54
4882e4J36j29L5M9m9M1K1l0J23p4k3k0j09Q2n5l2Q8Rj21J53j19J10O6j34N6N7
$$ -54 82 -47 -12 37 -12 29 50 20 143 69 46 26 -83 -1 -56 -88 0 9 -112 41 -78 32 98 -36 20 77
4908G7j23M1N0j04J69j43m9K5J55k26K89j26j2J07j01l4J7p6K43q2j20j3L0K4
$$ 77 -46 -5 45 -59 110 -33 -82 -57 98 -128 161 35 23 130 29 -5 12 -64 179 97 -23 -36 -6 18
4932A8n8R3K1j20n1Q3J7O3r2J07j21K04k00L0J4k2r8K02j68J03o1J52k19J20j37
$$ 18 -40 53 74 -46 -97 -14 3 66 -26 81 -40 164 -36 -6 8 -14 -112 90 -78 25 -36 116 -103 17 -120
4957a20J18k2J9M0k3j0K3%j22K20j18N4p4j5J60K2k23J88j27k6M2M7o8nO5n9j1
$$ -120 -2 -24 -5 35 12 2 25 25 -97 123 5 59 -15 -30 130 152 -71 117 -10 -36 6 53 -15 -20 45 -14 -25
4984b5m3RKj04J17l4J86j44Q1l5o2M5M9R6j30L3r7J12mm1K9%j49K92j82j6M7p3
$$ -25 -68 -59 -57 -161 -44 -78 108 -36 45 10 -52 -7 42 138 8 41 -56 56 52 11 40 40 -109 183 1 -15 32 -41
5012d1K6M8O9n5j4J0j81J51n6J8K2l5l3Nm5K5J7M8J00j48K8L0N4J9o1l3N3p4O1
$$ -41 -15 33 102 47 33 43 -138 13 -43 -25 -3 -38 -71 -66 -111 -86 -69 -21 79 -69 -41 -11 43 62 1 -32 21 -53 8
5041Hk4M2K4q4L2J5n0k0J41n8j01J24j2qk4J00m1m0l9J06r9O2m6nK5n1k2M3p6
$$ 8 -16 26 50 -34 -2 13 -37 -57 84 26 -75 49 37 29 5 105 64 24 -15 91 -8 54 8 3 28 -23 -45 -2 -78
5070g8J41p1mk9rJ00q6j5R5p3N1L9n9K1%M0j1j0n2m3K9J43o3j29J39j31mO5K0
$$ -78 63 -8 -12 -41 -50 50 -36 -51 44 -29 22 61 2 23 23 63 52 42 -10 -53 -24 119 56 -73 66 -65 -69 -4 16
5099A6J7l2o4J06N8j4m2o3n3J05k9j00O2M5j8KRK4L0k2j02J66j16l0J43j49k2
$$ 16 33 1 -63 43 101 87 45 -18 -71 34 5 -95 -33 12 -6 -4 5 29 59 37 -65 101 -15 -45 98 -51 -73
5126g3J04J1P2m7rl7K3m1j5L3O4j22K4J0p2N3k3L6N3j0j44K38j45l9P9n9rl1M3
$$ -73 31 42 114 67 58 21 44 3 -12 21 85 -37 -13 -3 -75 -22 -45 -9 44 34 -110 128 -17 -56 23 -36 -45 -76 -33
5155c3ll4K1L9l9M7j06J28oj20Q1J02j10L8N8n5m4O0jj01Q1K3J4Pjm7l2r4M2N7
$$ -33 -36 -70 -49 -10 -49 -2 -108 20 14 -106 -25 77 -33 5 63 8 -36 24 23 -78 3 26 40 47 46 -1 -33 -127 -85 -28
5185b8L8ll7pk1N8k7l9L4J33n3J2j08L6l5P7l4M8j05N9NP2l0K2J1m9o1l8M7P0
$$ -28 10 7 -30 -37 -58 0 -27 -66 -32 101 48 60 -48 -12 -47 30 -4 44 -61 -2 3 75 45 67 78 29 -32 -70 -23 47
5215D7k1k3l1P7o6l3O1J6K5j03J59j01m5j3oN2q1P0r0Q4l8P8K9j81J97jKm5n8
$$ 47 26 3 -28 49 -17 -50 11 27 52 -51 108 7 -38 -51 -57 -5 -86 -16 -106 -22 -60 18 47 -134 63 62 64 19 -39
5244c9j5R3J2r0m0P4n2j9N8L0J00j01j5O7k8K8M1j01Nj9nJ9P5l9J26l31J79k5
$$ -39 -54 39 51 -39 -79 -5 -57 -76 -18 12 112 11 -4 63 35 63 104 3 8 -11 -16 3 78 39 165 -166 13 -12
5272a2l4R7j49P6J7o3o0K11n7pj08K6k0J33no2o5P4o1P4L7K5p5J77j74J7O1q2
$$ -12 -46 51 -98 -22 -5 -68 -128 83 26 19 -89 -63 -83 50 45 -17 -82 -8 -69 5 42 67 -8 169 -5 12 73 -9
5300iM4K1r6J48j45J18l8j63J28Q1j55L5Q5j58J60r3P2q9J28M1j53q4N4o1Q5J47
$$ -9 35 56 -40 108 -37 81 43 -120 8 89 -66 -31 54 -104 56 -37 35 -54 74 115 -38 -122 -68 -129 -44 103
5326A03o9k6PN1J0j19N4O6r7jL5Q7m7l2J40k00m9J89j19j24Q7Q6k9P5q6l1l5P4
$$ 103 34 8 15 66 76 -43 11 77 -20 -21 14 101 54 22 162 -38 -87 102 -17 -141 -54 32 3 78 -8 -39 -74 0
5354@k0m5nJJ65j18J3nJ7J49k63Q6R9j97R7N0j17P1k1J00j89J63J09l03K71j35
$$ 0 -20 -65 -70 -69 96 -22 -9 -14 3 152 -111 -25 74 -123 -26 24 -93 -22 -43 57 -132 31 140 -163 108 -27
5380b7K1j20J62l4k2M8k3j2N0q8l3O2n0%L3L8l7P9j6j04J3Q0J9n5r3J57j0l9J0
$$ -27 -6 -126 36 2 -20 28 5 -7 43 -45 -78 -16 -66 -66 -33 5 -32 47 31 -73 -60 20 39 -16 -109 48 38 -1 9
5409IMp1p6O1Q5OJ04j30J2P8mp1p9Q9J02r3L3j13J12k4P4q5n1M1M0K4r9O5o5j0
$$ 9 13 -58 -134 -73 12 18 122 -8 4 82 78 7 -72 17 119 26 59 -54 58 34 108 23 -28 13 53 77 -22 43 -22 -32
5439c2K2O4j56J22Nj29J24P8q3j18nJ34j5m3L9k7l7K2N5P0p0K2j54J73j32Q9J1
$$ -32 -10 54 -102 20 25 -104 20 98 15 -103 -108 26 11 -32 7 -20 -57 -35 20 90 20 42 -112 61 -71 18 29
5466B9j06J01k6J05r8J00J9j23k8K3Q3j17j0J49j6J5j28N9q4L8m2K0M6j85K31
$$ 29 -77 24 -2 103 5 105 124 1 -27 -4 79 -38 -48 101 85 100 -28 31 -53 -15 -57 -37 9 -176 55
5491E5j01J6J55m4m9j60N1P1j2o1K8n5N2K1Q0lL7j31Q7o4K4np3K84j31o1Qj00
$$ 55 -46 -30 125 81 32 -128 -77 -6 -18 -79 -51 -106 -54 -33 47 44 81 -50 37 -27 -3 -8 -81 203 72 11 19 -81
5519h1J32l7K5P3j12o5Q6j16J9M3L4j52K10p0Qm0M7j6m0O6M8j10M9P5p2j96J70
$$ -81 51 14 39 112 0 -65 21 -95 -76 -33 1 -151 59 -11 -3 -43 4 -12 -52 14 62 -48 1 76 4 -192 -22
5546b2m5l0J02lK7o0P2Rr5Q5J13k76J73n2Ln1Q0qm9L5o7L8j70K16j65J06L3j13
$$ -22 -67 -97 5 2 29 -31 41 50 -45 40 153 -123 50 -2 1 -50 30 22 -27 8 -59 -21 -191 25 -140 -34 -1 -114
5574a14J35n1K6k7j03J20J16j35O2j12K7K4N6j6l0O4K0j7o0k2j13J22Q1M0j2m8
$$ -114 21 -30 -4 -31 -134 -14 102 -33 29 -83 -56 -32 24 8 -22 42 62 45 -15 -37 -150 -28 53 93 81 33
5600C3m4oj10N4R7m7k1J5l1K1l1L5KM4j01Q7l5l4Q6r6LN6M6q2J12m3N9r3J3k0
$$ 33 -11 -17 -127 -73 24 -23 -44 -29 -60 -39 -70 -35 -33 11 -90 -3 -38 -72 14 -82 -79 -23 23 -59 53 10 69 -24 -11 -31
5630c1J44j19qjN4PM0q6l6P8%J5K1N4o3j37J17j24l4J74n1%P1j19k4k1P5o3J36
$$ -31 113 -6 -14 -15 39 46 86 0 -36 42 42 57 78 132 69 -68 49 -75 -109 65 14 14 85 -34 -58 -79 -4 -67 69
5659F9K9j52P8PR7k29J02K5q9K2R2k2L1j5q8J6O8L3j8l6R8j27O4jj6o3O1m9L2
$$ 69 98 -54 24 31 128 -101 1 26 -63 -41 51 29 60 45 -43 -27 41 74 56 20 118 -9 55 54 38 -25 36 -13 19
5688A9Jj02J07l4k4j9o0R4p5J37Jj5o0j55K56j45L9J03q0k1R2O1r2rn5p0P3l3
$$ 19 20 -82 25 -9 -33 -52 -112 -18 -93 44 45 30 -30 -185 71 -74 -35 68 -12 -33 59 120 28 19 -36 -106 -33 -66
5716f6L7L2j06J52n3%j5K6Qp8M1m7o4J39J08O4q5j08N5m7j7N9nj00L5J56j68K2
$$ -66 -29 3 -103 49 -4 -4 -19 7 15 -63 -22 -69 -133 6 114 178 93 -15 40 -7 -24 35 30 -70 -35 121 -47 -25
5744b5l4J4o0K10q5o4J04o7%k3Q1oj2J12j80P1O7j68M5Q1p2M8q5J07n8J5kpJ70
$$ -25 -59 -45 -105 105 20 -44 60 -7 -7 -30 51 45 33 145 -35 36 103 -65 -20 61 -11 37 -48 59 1 16 14 7 177
5773A77k50J33n0O4j80J21k8N7r0L5%K7lo5m7N3L9L5%K7j82J19M2J46j73P7l4
$$ 177 -73 60 10 74 -106 15 -13 44 -46 -11 -11 16 13 -52 -99 -46 -7 28 28 55 -127 -8 34 180 7 84 50
5800E0qL2o6N4M3q1J8P1j94N3J18j13m9l0R2J4p9N3k5K4K5K7rO7p2m7N6q8P0n7
$$ 50 42 74 8 62 105 24 42 113 -81 -28 90 -23 -72 -102 -10 4 -75 -22 -47 -23 2 29 20 87 15 -32 24 -64 6 -51
5830e1P8l0K8l0O5J3j07MO9p4M9Ol3k4M6n7J54r5J1j09K8J06j14J43o4n7k2J28
$$ -51 27 -3 25 -5 60 73 -34 -30 39 -35 14 20 -13 -37 9 -48 106 11 22 -87 -59 47 -67 76 12 -45 -67 61
5858F1j36P8o6Q0R2j62P0j00M4P8om3qrL3P4l2j30J83j17J7r9J07j02Q2J07j22
$$ 61 -75 3 -63 17 109 -53 17 -83 -39 39 33 -10 -18 -27 6 80 48 -82 101 -16 1 -98 9 -93 -11 96 -26
5885b6K7N7o4P1n7k4J8QJ7pQ2n1oo5N5n4J6n0Rl0J22q1k1k5N2J4J5o2M4p6J02
$$ -26 1 58 -6 65 8 -16 2 10 27 20 102 51 45 -20 35 -19 -3 -53 -44 -74 48 -33 -54 -79 -27 -13 2 -60 -16 -92 10
5916A0J8o0l6J6O7n7J3oNK6kj5O6Qj25j16L22r7o4j6l8J19L2l4j58J50m0K0P0
$$ 10 28 -32 -68 -52 15 -42 -29 -35 -30 -4 -6 -21 45 53 -72 -188 134 37 -27 -43 -81 38 70 36 -122 28 -12 8 78
5945G8j04m3O3M1j68O4nP8J0n6N7LO1k17J48j29L1L3N7J42j14M7l8J8m7l0R6q8
$$ 78 -26 -69 -6 35 -133 -69 -74 4 14 -42 15 18 79 -138 10 -119 -88 -55 2 144 30 77 39 57 10 -20 76 -12
5973a2J9l2Kp1P7J06j12R7j24R4n4M8n5qRM6j8j6n4L4M7n5Q8k55J27N5p2J26j9
$$ -12 7 -25 -23 -94 -17 89 -23 74 -50 44 -10 38 -17 -25 -16 30 12 -4 -58 -24 23 -32 56 -199 -72 -17 -89 37 18
6002A8K5Q4k88j7J10N9NQ5j55J5O3p7J16l8q4J03K0j3n3J02J4o9j15O3j4J25o2
$$ 18 43 127 -161 -178 -68 -9 -4 81 -74 -59 4 -73 43 5 -79 24 44 31 -22 80 94 25 -90 -27 -41 84 22
6029B2K6o1R3p9p2R4l6j1P5o3N8n1K3L2p4kN2o5L6l7O2OP0q4Qm7J22k4j33R9m3
$$ 22 48 -13 80 1 -71 23 -13 -24 51 -12 46 -5 18 50 -24 -26 26 -39 -3 -40 22 28 98 14 22 -25 97 73 -60 39 -4
6060dR1l8o5J06j13K0N7n6j10J57j35J16j3k1j6J27k00P0p0P8J09K2j13M8k0q4
$$ -4 87 49 -16 90 -23 -3 54 -2 -112 45 -90 26 13 -8 -24 103 -97 -27 -97 -19 90 112 -1 47 27 -57
6086e7L7Q1j05J1n2P0J8RRl8J23q2j2JK7r7l0J25m7M6L3j05N9l0Q2n7K9K3m3k2
$$ -57 -20 61 -44 -33 -85 -15 3 12 21 -17 106 24 12 13 40 -57 -87 38 -9 37 70 -35 24 -6 76 19 48 71 28 6
6116Fl3q2J24o1J79n4r9j0O0o0o7Q1j4O4J8o6Rl3Q9om2R0k6J4p4Rj9J07j54J27
$$ 6 -27 -109 15 -46 133 79 -20 -30 30 -30 -97 -16 -30 34 52 -14 -5 -38 51 45 3 93 67 81 7 16 -3 104 -50 77
6146G7L0o7k6l7R9j68J74m0q4j53J27J13k3m9P5n1j4j5j1J68q3q0M5j0M8r1m2
$$ 77 107 40 14 -23 76 -92 82 42 -42 -195 -68 45 22 -27 48 -3 -17 -32 -43 125 42 -38 7 -3 45 -46 -88
6173h8N8P5o8O1j02K1Rl4J69l2r6MR6q4M3l1k2L2J06kj33j1k3j3M4l9J01R4k92
$$ -88 -30 45 -23 38 -64 -43 -34 -68 101 69 -27 -23 73 -11 32 1 -21 11 117 115 -18 -29 -52 -65 -21 -60 41 135 -157
6202a57R8K20j38j22P4Pp5J59j52J07m0o8P0P1o8oO8p5M3j05K8K7N1j80R2Q1p0
$$ -157 -59 161 23 -99 -25 -18 -93 66 -86 21 -19 -87 -17 54 -14 -20 48 -27 16 -89 -61 -34 17 -163 -71 10 -60
6229f0R7p7Q7l5j20J85r5L3k9n4J06o5o2J76l3L3p1n8J17o2j15J11Q1p9j8j29
$$ -60 37 -40 47 12 -108 77 -18 15 -14 -68 38 -27 -89 87 54 87 16 -42 75 13 -102 9 90 11 -7 -136
6255a36P1J38j14J23j16j4L4k5Q8oq1L1qj13J69o4J12p5l6K1J1j8K9K3j41J41
$$ -136 -65 73 -41 82 -34 -48 -14 -39 49 43 -38 -7 -15 -128 41 -23 89 14 -22 -1 10 -8 21 44 -97 44
6281D4k9j9O8n4p1N5j0M2j14N3J3K4q6M2K2J76j90K0J9pL1qJ1k8J5N1m0M9j63
$$ 44 15 -4 64 10 -61 -6 -16 26 -88 -35 -22 2 -84 -42 -20 156 -34 -14 5 -2 29 21 32 4 19 70 30 79 -84
6310h4J50r9R0Nl6N9j09Q1j8O7l06J48L7j7p5P7L3J1j26J22j7J04m9j01k6R5l6
$$ -84 66 -33 57 62 26 85 -24 57 39 106 -200 -52 -15 -32 -107 -30 3 14 -112 10 -7 97 48 -53 -79 16 -20
6337b0R4Lk43J53K8O9p6O5n1J0nL1n8O7j9o9J0Olko3J14k6m8J08n2N7j48K2K3
$$ -20 74 77 -166 -13 15 84 8 73 22 32 27 58 0 67 48 -21 -11 -5 -8 -10 -73 41 15 -33 75 23 80 -68 -46 -23
6367b3l3Ll0J18K5l4K8j18O6QM0lJ8p0j1O9pj8n8J02P6o1j25O5j9q4K6O5J21j51
$$ -23 -56 -53 -83 35 60 26 54 -64 2 10 50 47 65 -5 -16 53 46 28 -30 72 148 87 -38 27 8 -76 -50 15 136 -15
6397a5QO6l2k8lN7J3m2JJ48j74n1J01k00K40oo0Ml8L8p8J76j44p1J29j09N1o4
$$ -15 -7 59 27 -1 -4 53 66 24 25 173 -1 -52 49 -151 89 83 23 27 -11 27 -51 125 -19 -90 39 -70 -19 -83
6425h3J47%p0%jq5N2l3J02L7j79J34n5O4p1O8K3j15J10J3K7k3j43n4P7N8j6O5
$$ -83 64 64 -6 -6 -7 -92 -40 -73 29 66 -113 21 -34 30 -41 27 50 -65 45 58 85 62 -81 -135 -58 0 -16 49
6453D9j13J17J3k3j11M9K4R9j8j60J36j37J68j45J25q5k0J02J8q8N7q7l5Q6No4
$$ 49 -64 53 66 43 -68 -19 5 104 86 -74 62 -75 93 -52 73 -12 -32 70 88 0 57 -30 -65 21 26 -38
6479c8J25o0pQ9q9j14J71k3j94K64r5k7l3J01j45J26n3Ln7R7k4m6R6O4o1p6l3
$$ -38 87 27 20 109 20 -94 77 54 -140 124 29 2 -31 70 -75 51 -2 1 -56 41 17 -29 67 131 70 -6 -39
6506c9R2q2L9q8J67k9k8m8L2l4LJ04j5r1k1M4n4O8K6p6J43m6k20J14Q2l3Q2r7
$$ -39 53 -29 10 -78 89 60 32 -16 16 -18 -15 89 74 -17 -38 6 -48 20 46 -30 113 67 -153 -39 43 10 92 -5
6534em5J28j06K4j07J03P0r9N0o2J21q6mQJ25r4p9J87n2q8j8R0j15j28K23pl7
$$ -5 -50 78 -28 -4 -111 -8 62 -37 13 -49 72 -14 -18 -10 115 21 -58 129 77 -11 -29 61 -54 -182 41 34 -3
6561cj57J71l2JK5j0j1K9Kl2N1j11j38J90N8L1j08Q0j30P4O1l0j42J86j2o4N2
$$ -3 -160 11 -21 -20 5 -5 -16 13 15 -17 34 -77 -215 -25 33 64 -44 36 -94 -20 41 11 -131 55 43 -21 31
6588C1K1m3k9o1J81k0m1Qj0L4o7q9J24j9j0M2m6M6j06LM0j4k7O5m0J01O5j11M7
$$ 31 52 9 -20 -81 100 80 39 47 37 71 4 -85 39 20 10 52 6 52 -54 -51 -11 -25 -52 13 -27 74 139 28 75
6617G5r7J0O4K5k5j11K7n1k5n4K17%Rp4N9l0OJ3o0R3N7k34J52o6P7o1k6K4L9m5
$$ 75 -22 -12 52 77 52 -59 -32 -83 -108 -162 55 55 64 -10 49 19 25 38 -22 71 128 -106 46 -20 57 -4 -30 -6 33 -12
6647a2r1Q6pR9k2l2m8jL8J0k6l8Q3p4M0j9rPK4m8j1M5j9M4R%O3r0k5Qj03R7j2
$$ -12 -103 -17 -24 75 53 21 -27 -28 10 20 -6 -44 39 -35 5 -14 -23 -16 8 -40 -51 -6 -25 19 28 28 91 1 -24 -16 -119 -22 -34
6680c4j7J63n8j31J68k14J68J5p4N4j23k1J97j42R5O5j32m1k3N5K6k8o0R8M5q8
$$ -34 -51 112 54 -77 91 -123 45 60 -14 40 -83 -104 93 -49 46 111 -21 -62 -85 -30 -4 -32 -92 6 51 -37
6706c7N4L8lq1k7J15J1j1p2M8J3j4o1J15j49J13Jj20P6J14r8m1L3mJ05j05p2J3
$$ -37 17 55 52 -29 -56 59 70 59 -13 35 48 34 -27 88 -61 52 53 -67 9 123 25 -16 17 13 118 13 -59 -46
6734d6R8K4r5J5lrM0j18N6O2L8j70J46k07J44R2q6L7q5M7j3Q4m0J31q5L4Rp0l8
$$ -46 52 76 -19 -4 -7 -16 24 -94 -38 24 62 -108 38 -169 -25 67 -19 18 -67 -20 -33 51 11 142 57 91 100 30 -8
6763hq8P6k3J9R0M6r2M1q3n0q7J91J3J7k0j25K5O8N6r9j7m3m5J16J64j91pJ42
$$ -8 -96 -20 -43 -24 66 112 20 61 -22 -72 -159 32 45 62 42 -83 -58 10 66 -33 -50 -93 -138 -22 142 -49 -56 86
6791H6n6p1N1k8m2k2R4Lk8O7Mo9P0m9J18j47R9nl5m2M8kj08J4L0k3m3P1o6J23
$$ 86 30 -41 10 -18 -60 -82 12 15 -13 54 58 -11 59 10 128 -19 80 75 40 -2 46 44 -64 -50 -20 -43 -86 -15 -81 42
6821D2j65J29k7n0N8J5l3m2N2l2J30k0j11L1k2J23j66K21j63K9K5N0j8L1o7k3
$$ 42 -123 6 -21 -71 -13 2 -31 -73 -21 -53 77 57 -54 -23 -45 78 -88 133 -30 -1 24 74 56 87 20 -3
6847cN8j03M0pP9j21J12o6O0j2j30K36j77NQL6pk08J50J3M5n8L4M9m2N6j05o1
$$ -3 55 -48 -8 -15 64 -57 55 -11 49 37 -93 143 -34 -29 -21 15 8 -200 -50 -37 8 -50 -16 33 -9 47 -58 -119
6875a19P6N2k2k6L3n2K1N3R1j07M8k6n3O9n6L5J20j16P3o6l8Q0j9r0J33l9j35
$$ -119 -43 9 -13 -39 -6 -58 -37 16 107 0 48 22 -31 38 -18 17 137 21 94 28 -10 70 51 -39 94 55 -80
6902h0J51j71J81r8k4J1P9r2j42J36O8j74J93N6j07L8r3P3p8m2J90rp6J18p3O4
$$ -80 71 -100 81 -17 -41 -30 49 -43 -185 -49 19 -155 38 94 -13 25 -68 5 -73 -115 75 66 -10 108 35 99
6928I9q7R2q3J34j63K2m6N5M2q9k8J4N8j8O0j85O2R9l7p8J01J0p9Mo6J06j03R6
$$ 99 12 104 21 155 -8 14 -32 23 65 -24 -52 -38 20 2 62 -123 -61 38 1 -77 24 34 -45 -41 -107 -1 -104 -8
6956hJ01j57J09q2N0M1j20J14M2o8r6O0J22p5J9o0j6q0J55m9O1p2P0o4O3l4k1
$$ -8 93 -64 45 -37 13 54 -66 48 90 22 -74 -14 108 33 52 -8 -24 -104 51 2 63 -9 61 -3 60 26 5
6983Em0J02r4J3m7J45j76R2M5j53J42K5m2L9q4j1kQ5l4j07Q4M6p4K4O6n3M9o2
$$ 5 -35 67 -27 -14 -61 84 -92 0 45 -108 34 59 17 56 -28 -39 -41 44 10 -97 -13 33 -41 -17 49 -4 45 -17
7011a7P1n0J09p4n1R2K6n1j5Kl0j1M0p3J30j05o1Q0j8N2j42O5J9l8pJ90k5k2j52
$$ -17 54 4 113 39 -12 80 106 55 40 42 12 1 41 -32 98 -7 -68 12 -6 46 -96 -31 -12 -50 -57 133 108 86 -66
7040f6J12j74L3J4RJ44j75J86r0J3J08j97J2P6N4k7K0p0J01j10P6N8q1K8o5l6
$$ -66 46 -128 -95 -81 -72 72 -103 83 -7 6 114 -83 -71 5 59 32 52 -18 83 -27 49 107 26 54 -11 -47
7066d7RM7j3N7j28J15r3L0J13J0r3n4k7J04k9R2o9lJ0j7j0M5j23M6O3j03J4N4
$$ -47 -38 9 -4 53 -75 40 -53 -23 90 100 7 -47 -74 30 1 93 24 21 31 14 4 49 -74 -28 35 -68 -54 0
7094@K5R6n4r2K0P8j88J18Rj5J13j05r6Q4k2O7j24Q7j39K05j69L4J6Q0j2N3Qj10
$$ 0 25 121 67 -25 -5 73 -115 3 12 -3 110 5 -91 -7 -29 38 -86 1 -138 67 -102 -68 -52 28 16 69 77 -33
7122c3pR9K4k58K51j13jj6j0N0k3J05p4N1j8j06J00M4j06J2K6O9j43Q0O9q4J1
$$ -33 -40 59 83 -175 76 -37 -38 -54 -64 -14 -37 68 -6 45 27 -79 21 65 -41 -29 -3 66 -77 3 72 -12 -1
7149aq9Q2m9k6j5RJ13k4j1o7J5J08j71J00o0J39l2l1O0k8l8LM5j88K14K1j71Q2
$$ -1 -90 -8 -57 -83 -98 -89 24 0 -11 -78 -63 45 -126 -26 -86 53 21 -10 50 22 -16 -13 32 -156 58 79 -92 -10
7177a0J12n0p1J06j19J41k8m4nm3O8L9p4Qrj34L8Q1q0Q9q9l1J85o1K3l4j02L4
$$ -10 102 52 -19 87 -32 109 81 37 32 -11 57 96 22 30 21 -113 -75 6 -74 15 -74 -105 80 19 42 8 -94 -60
7205f0K5l1q1J37j18N4J16j3n5qM4j22J10N5q1Mo9J32P1j20M0l1Or1R5j3P5L6
$$ -60 -35 -66 -147 -10 -128 -74 42 29 -26 -34 10 -112 -2 53 -28 -24 -93 39 110 -10 30 -1 5 -86 9 -4 71 107
7233A07j32J07r7J7J21r3r9O7R6p9qq0J38r4k0K9o6N5J28j51M2K2Mpk2K6J65q2
$$ 107 -25 82 -15 2 123 30 -69 -2 94 15 7 -73 65 -29 -49 -20 -86 -31 97 -54 -12 10 14 7 -15 11 176 94
7261I4j61M3j3K12k49R1P6oj01l9N4Jn2K1l3J76r8K8l6j28M0Q6p6M9l3j8lJ3M7
$$ 94 -67 -24 -37 175 -74 17 93 87 -14 -53 1 2 -50 -29 -62 114 16 44 8 -120 -80 6 -70 -21 -54 -72 -75 -62 -15
7290a5MP5q9kN9j3r7P4L1ln6P1k5P2r4M5N4k27K04j04N9l7P9jq8K0J8q2J08J8
$$ -15 -11 64 -25 -27 32 19 -78 -4 27 24 -32 39 14 86 -8 37 91 -136 68 -36 23 -14 65 64 -24 -4 14 -68 40 58
7320E8j32J89j86J04r3O2R7j33Q4l0P1r5P9r8L7p9L6K2J0j11J06N7q9R3j8j14
$$ 58 -74 115 -71 33 -60 2 99 -34 50 20 91 -4 75 -23 14 -65 -29 -7 3 -108 -2 55 -34 59 41 -73
7346g3J19o1r4J94m1J01j22kn0J16k1j01N9J8k7O3j35qL1J5q7m3J83n6k9nL2J9
$$ -73 46 -15 -109 85 44 145 23 21 -29 87 66 -35 24 42 15 78 -57 -65 -34 -19 -106 -149 34 -22 -51 -56 -24 -5
7374ej9J22k8j91J24O0r1Q7p0j6o2J28j07J50j5O8m9j18K4R6j17j8jQ5l6m0P6
$$ -5 -24 98 70 -121 3 63 -28 59 -11 -27 -89 39 -68 82 67 135 86 -32 -8 88 -29 -47 -48 37 1 -39 37
7401C7j62J34pnJ6M1m6Pq0J02L1J4L7j48L4n4j1N9M0l7l4Q6p8J26q2j4R2K3j97
$$ 37 -125 9 2 -3 13 54 8 15 -65 37 68 82 119 -29 5 -49 -60 -1 39 2 -32 54 -24 102 20 6 98 121 -76
7430g6J64j01j0O3p6P8rL4j40O4J42r7m1J2j31J58m3Q1m0K5k4n0J28j15l3O8j42
$$ -76 88 -13 -23 40 -36 42 33 67 -73 -9 133 36 -5 7 -124 34 -9 72 32 57 33 -17 111 -4 -37 31 -111
7457a11J73j50J72j05Q0j34l1J01J6o9j0R8o9P5K7j4j5q2o1J75Mj70J95L5r4m3
$$ -111 62 -88 84 -21 59 -75 -106 -5 11 -58 -68 30 -39 36 63 49 34 -48 -109 66 70 -100 95 130 36 -7
7483gl2J3Mj11Q4%R4q2l2M3J27j28q0O5L7j8j8P2m2j9j11Q5J9lQQ8K3j37J49j38
$$ -7 -39 -26 -22 -133 -49 -49 45 -37 -69 -26 101 -27 -107 -42 -5 -23 -41 31 -11 -30 -141 -56 -37 -40 -32 56 79 -58 91 -47
7513d7ON3n1M3k5P9K7p6l5J23k32P5O8j3r4M2LK4k9R3j16L0R2o2J58j34J6k6j99
$$ -47 -41 12 -39 4 -21 58 85 9 -26 97 -135 -60 8 -5 -99 -57 -54 -30 -59 34 -82 -52 40 -22 136 2 18 -8 -207
7542b07M8J24P5j34J86p7j49J30PJ3j12N6Q9r3R0j71K37j05O8j09pP6l9K2O0j07
$$ -207 -159 -35 40 -94 92 15 -134 -4 3 16 -96 -40 49 -44 46 -125 112 7 75 -34 -41 35 -4 18 78 -29
7568b9J57o2j79J05J6k6K9q6J76j97K4J26k6j01J33NMj31RQ7l4n0J08m8j3Q0N6
$$ -29 128 66 -113 -8 8 -18 11 -75 101 -96 -72 54 28 -73 60 65 69 -62 -53 34 0 -50 58 10 -3 77 133
7595A33j46J0O6n0K0o2L5m1J46j42R3j7Oj16R0km3J07o8j8j2M9k6J3r3O9K3k2
$$ 133 -13 -3 63 13 33 -29 6 -35 111 -31 62 45 51 -65 25 23 -20 87 19 1 -11 38 12 25 -68 1 24 2
7623BL6Q7j05l0plj4l7J07J8m6J0J1j05J87r0o6j8rJ07P3j52J74j72RR8j51J12
$$ 2 38 125 20 -10 -17 -20 -34 -71 36 54 8 18 29 -76 111 21 -45 -63 -72 35 108 -44 130 -42 -33 65 -86 26
7651B6qj33R8j0o6M0M2P7j10j8K8k8O1J7j2M5q7p2O2m6L7K7P0k9M4k8k4qRJ2j5
$$ 26 18 -115 -17 -27 -93 -53 -11 66 -44 -62 -34 -62 -1 16 4 49 -38 -110 -48 -94 -57 -30 40 11 55 27 3 -5 4 16 1
7682Ar1R6lM9nl9l0Q1n8J54j49j8j8l6J37J5j11q5J10j20P9ol0J37o8p4j8J53
$$ 1 -90 6 3 52 47 8 -22 59 1 155 6 -12 -30 -66 71 86 -25 -110 0 -120 -41 -47 -77 60 -8 -82 -100 53
7710E3m4M7nj33J97j51K7L1J4m4o3P4l0M8L9k0r2m0PJ42m5N0k9O5%O6j64o6K7
$$ 53 9 56 51 -82 115 -36 -9 22 36 -8 -71 3 -27 21 60 40 -52 -92 -85 57 12 62 33 98 98 164 0 -66 -39
7739c9J02L3j29O4j33J56j35OJ05j3p5J14J5j55J86j21l7J39n6M4j26lJ9L2J5
$$ -39 63 96 -33 31 -102 54 -81 -75 30 17 -58 56 71 -84 102 -19 -56 83 27 71 -55 -58 -39 -7 8
7764HK0k3m5L8L0K3r3L8O8J2q2l7Q4q8q4J69j11Q6OM2m9j03Q0M7q2l2J6jJ39j62
$$ 8 28 5 -40 -2 28 51 -42 -4 64 76 -6 -43 41 -47 -131 38 -73 13 19 61 12 -91 -11 36 -46 -78 -62 -63 76 -86
7794h6kJ0J79j71J92j08o4J20j48J29n9J30j52m9J49M1qo8o6J10K8j99P6m6N4
$$ -86 -88 -78 101 -70 122 14 -50 70 -78 51 -8 122 -30 -79 70 111 103 35 -31 79 107 -92 -16 -62 -8
7819hk6J42q2k2O8j27M7n1M7l4n7J16k8N0qo5j4P8n7J4l4N4j4M4M4j16L6J4m5
$$ -8 -34 108 26 4 72 -55 -8 -59 -12 -46 -103 13 -15 35 27 -38 -52 26 -31 -17 -51 3 -11 33 77 -39 -3 11 -34
7848c4NQ2n1J4J2R7r8Nm6j33Q8Q7L7j10N7r0Q2jnJ01p0k3P7p5K5M1K1j75L1P2
$$ -34 -29 53 2 16 28 125 27 32 -14 -147 -59 28 65 -45 12 -78 4 3 -2 99 29 6 83 8 33 74 95 -80 -49 23
7878B3O0L2o9o3K3m0O6n1O9k3M7p2J36j67K7m6M3N3o4P1o6N4p2k4J09j07O4m0
$$ 23 83 115 46 -17 6 -34 32 -19 50 27 74 2 138 -29 -2 -48 -5 48 -16 55 -11 43 -29 -53 56 -51 13 -27
7906b7K8oJm8J08l4k2N8p0P6n1l4k0P0j13R2J3L9R7r1r6P1j37K00j07Q6k15J38
$$ -27 1 -5 -4 -52 56 22 0 58 -12 64 13 -21 -41 29 -84 8 21 60 157 66 -30 41 -96 104 -3 83 -132 6
7934Fm1n5M4P1J34j17K2q9P2j78R4Q8p8l3O2J9l6o6L4K2N0m4n8k3O5J09n5j18
$$ 6 -35 -90 -46 25 159 42 64 -25 47 -131 -37 51 -27 -60 2 21 -15 -81 -47 -25 25 -19 -77 -100 -35 74 19 -99
7962i9P4J27r3M7j18Q6%j66R1J56p6n5JJ01l7k8k8J89j64l4M1L3j37J44q1J1Q4
$$ -99 -25 102 9 56 -62 24 24 -142 -51 105 29 -26 -25 76 39 11 -17 172 8 -26 15 48 -89 55 -26 -15 69
7989F9o2J6N1m5Nl1N8j04J2K7m6M5m8O9r7L0N7j7q1J26n8M7k8kj15Q5J05q9n6
$$ 69 7 23 74 29 34 3 61 -43 -31 -4 -50 -5 -53 16 -81 -51 6 -11 -92 34 -24 23 -5 -7 -122 -37 68 -21 -77
8018g7P0N1n3K1r5J87j00N5k3j5k1Q0q7Ppr6J66j58J00m9l9LJ36q0l6O9j8p7K2
$$ -77 -7 44 -9 12 -83 104 4 59 36 21 0 80 -7 0 -7 -103 63 -95 5 -44 -83 -80 56 -24 -60 9 -9 -86 -64
8047f4Q0p1j2Q1M0j11RL7m2J54k1rj03N7M5J1J4j13R0k01J25lK8m2j0M7m8k4m5
$$ -64 16 -55 -67 14 54 -57 -48 -11 -53 101 80 71 -32 25 70 81 95 -18 72 -129 -4 -7 21 -21 -31 16 -32 -56 -101
8076a01L1O5n4P4O0q2m1P4j22J73r6n2O8j09P3Q3j18J21ML4q8QP6l7K1qj01J02
$$ -101 -70 -5 -59 15 75 -7 -48 26 -96 77 -19 -71 -3 -112 -39 44 -74 47 51 85 -3 5 81 44 65 57 -44 58
8104E8j20J5J05j30J21j14K05k06M9P9r1N3N9j06J8O6k2m1n3m6J05M3j16PJ63
$$ 58 -62 -47 58 -72 49 -65 140 -66 -17 62 -29 24 83 -23 -5 61 39 -2 -55 -101 4 47 -69 -62 101
8129A01q0j80P7L8Q2q5k0J47lj13J2P3j4j67J50n7J3J43m1nK1j77K54j41o0J18
$$ 101 21 -159 -82 -44 38 -47 -67 80 77 -36 -24 49 35 -132 18 -39 -26 117 76 71 92 -85 169 28 -32 86
8155H6j33O3n3QMn6M2nR6q2J10K6j32m1p6K00q0O2m7k4P4J3j09L1p5N6Q5J7r3
$$ 86 -47 16 -37 -29 -25 -81 -39 -44 52 -30 80 106 -26 -67 -143 57 -23 39 -8 -32 42 55 -54 -23 -98 -42 43 60 -33
8184c3lJ9L5j4r1L2j0
$$ -33 -36 -17 18 4 -87 -55 -65
8191f5
$$ Imaginary data points
##PAGE= N=2
##DATA TABLE= (X++(I..I)), XYDATA
0@%%%%%%%Qj6J6j6K3l1L2m0N6p2Q8j04J20j44J76k08K44k87L39l96M56n24O03
$$ 0 0 0 0 0 0 0 0 8 -8 8 -8 15 -16 16 -24 32 -40 48 -56 64 -80 96 -112 132 -155 184 -212 244 -280 323
30C23o93P91q97J016j151J300j461J635j829K044k278K532k808L111l445L808
$$ 323 -370 421 -476 540 -611 689 -772 863 -966 1078 -1200 1332 -1476 1635 -1810 1998
46A998m204M636n110N630o199O827p526Q305r172J0146j1251J2515j3979J5697
$$ 1998 -2206 2430 -2680 2950 -3249 3578 -3948 4357 -4815 5331 -5920 6595 -7384 8313
60H313j7745K0237k3345K7349l2722M0352n2104P2670j18670L96408j46142p89563
$$ 8313 -9432 10805 -12540 14809 -17913 22439 -29665 43005 -75665 320743 174601 -614962
72f14962P37939K82663o86756J8794O71307m33180m37183O85358K57331q25040
$$ -614962 122977 405640 -281116 -262322 408985 -24195 -461378 223980 481311 -343729
82c43729K3121P24788k82244n67028N08672K93383n95933p721O25979k43037n07518
$$ -343729 -320608 404180 121936 -445092 63580 356963 -238970 -246691 379288 136251 -371267
93c71267M00673K88327n29391l1891N54591j92204m94960L81806L80308m52729
$$ -371267 29406 317733 -211658 -243549 311042 118838 -376122 5684 385992 -66737
103f6737k19991M21481l513l42664K08971K34541l67220j00762M69361L075m72009
$$ -66737 -286728 134753 131240 -211424 -2453 232088 -135132 -235894 233467 236542 -235467
114b35467P2247L72753j51827k36558K14074Q1728k51894P5948K78709j89288
$$ -235467 -163220 209533 57706 -178852 35222 116950 -134944 -58996 219713 30425
124C0425k65836K47033J93591k81928r7049K87632o312k57237J22433K18512k07888
$$ 30425 -235411 11622 205213 -76715 -173764 113868 107556 -149681 -27248 191264 -16624
135a6624j57575K40509N0471k47446O8851K27723j74929j73349K69571J11760
$$ -16624 -174199 66310 116781 -130665 -61814 165909 -9020 -182369 87202 198962
145A98962l19338m5969K93945m8144k20260J45928J16454k19754J2390K74406
$$ 198962 -120376 -166345 127600 79456 -140804 5124 121578 -98176 -85786 188620
155A88620j26436k88841K02867K39057k50855j39030K65411J4387k35435J20111
$$ 188620 62184 -226657 -23790 215267 -35588 -174618 90793 105180 -130255 -10144
165a0144J78337k33296j09701K88476J8534k93205Q0312K55868j62055j72225
$$ -10144 168193 -65103 -174804 113672 132206 -160999 -80687 175181 13126 -159099
175a59099K24722P1123k51126K3613K23735j11528j58503J82952P4840k22597
$$ -159099 65623 136746 -114380 -90767 132968 21440 -137063 45889 120729 -101868
185a01868K0795K32132j07680k11246J63268J50234j89222o3687J88831k9240
$$ -101868 -81073 151059 43379 -167867 -4599 145635 -43587 -107274 81557 52317
195E2317j61837J20626J19356j95258p0079K33656J1709k30563N3260J94478j10241
$$ 52317 -109520 11106 130462 -64796 -134875 98781 110490 -120073 -66813 127665 17424
206A7424j27920J56716M4747j90023L5138J91314j11105j59936J74667J02475
$$ 17424 -110496 46220 90967 -99056 -63918 127396 16291 -143645 31022 133497
216A33497k10004k2801K15687o2904j91887J37167J35919j90381n2696K16475
$$ 133497 -76507 -99308 116379 53475 -138412 -1245 134674 -55707 -108403 108072
226A08072m2293k05552J34804J58288k08676q6971K44459J121k36511Q8000J87740
$$ 108072 65779 -139773 -4969 153319 -55357 -142328 102131 103252 -133259 -45259 142481
237A42481j64348j05432K14689K132k30182R8432K03225j76679j35872K24565
$$ 142481 -21867 -127299 87390 89522 -140660 -42228 160997 -15682 -151554 73011
247G3011M6021k32025N3220J99947j44962j36243K07677M7795k32432M7678K15171
$$ 73011 119032 -112993 -59773 140174 -4788 -141031 66646 114441 -117991 -70313 144858
258A44858j31756j61260J90691Q2404k16099N983K06877q8680j62221J53398R2829
$$ 144858 13102 -148158 42533 124937 -91162 -85179 121698 33018 -129203 24195 117024
269A17024j88443j2369J89244o5122j60431J24945J08803j59669m1787J66974
$$ 117024 -71419 -83788 105456 40334 -120097 4848 113651 -46018 -87805 79169
279G9169k9152j47956R2031J05102j37450m9625J57518r200j51634O4725J25871
$$ 79169 50017 -97939 -5908 99194 -38256 -87881 69637 60437 -91197 -26472 99399
290I9399j08197q2578J36415K8546j44555K7875J31459p8323j01908J14800N9510
$$ 99399 -8798 -91376 45039 73585 -70970 -43095 88364 10041 -91867 22933 82443
301H2443j35806j1099J37817l9242j20862Q5360Q7581j17814m0519J33305j1689
$$ 82443 -53363 -64462 73355 34113 -86749 -1389 86192 -31622 -72141 61164 49475
312D9475j29422O1942J07122j04403o9285J32012J9368j39267L5880J24194q6953
$$ 49475 -79947 -18005 89117 -15286 -84571 47441 66809 -72458 -36578 87616 663
323F63q9374J24009M0047j41995J5196J37346p0000j09918J14946O3528j39824
$$ 663 -88711 35298 75345 -66650 -51454 85892 15892 -94026 20920 84448 -55376
334e5376m699J41321n4644j16830J04577P3358j36949j8411J45092m1233j29357
$$ -55376 -60075 81246 26602 -90228 14349 87707 -49242 -67653 77439 36206 -93151
345i3151R3805Q9620j30632l4280J44231k5167j32367P9743R9829j19922n1754
$$ -93151 654 90274 -40358 -74638 69593 44426 -87941 -8198 91631 -28291 -80045
356h0045J40719l314j38090N6021J12440r7544o9441J20731J8432j23582L1570
$$ -80045 60674 57360 -80730 -24709 87731 -9813 -79254 41477 59909 -63673 -32103
367c2103J07397p3756p5969J02026L3466j13324J1480J05433n1627q0917Q1827
$$ -32103 75294 1538 -74431 27595 61061 -52263 -40783 64650 13023 -67894 13933
378A3933M5923r7487m954R9631l4443q7201O8480O1642r3355k7787J03149j0081
$$ 13933 59856 -37631 -42585 57046 22603 -64598 3882 65524 -27831 -55618 47531 37450
390C7450r9212M4940Q1109p3219n1667R2724J5378r9789K4870R2678o1134p0978
$$ 37450 -61762 -16822 64287 -8932 -60599 32125 47503 -52286 -27416 65262 4128 -66850
402f6850Q8162L8175j02222K57J01524l9635q5383P3828N5303r7545j4970J05418
$$ -66850 21312 59487 -42735 -42478 59046 19411 -65972 7856 63159 -34386 -49356 56062
414E6062k8739r6634O7671P1471r6225l5401J10464o714j06470M9058Q5165q2800
$$ 56062 27323 -69311 -1640 69831 -26394 -61795 48669 41955 -64515 -15457 69708 -13092
426a3092m7769J03123K005j06118M2793R1704q0450o3119J03084K3290j09115
$$ -13092 -60861 42262 44267 -61851 -19058 72646 -7804 -70923 32161 55451 -53664
437e3664K1699R6259o3145o6469R3705K6537j07434J7427J03524n7750q2916Q8498
$$ -53664 -31965 64294 1149 -65320 28385 54922 -52512 -35085 68439 10689 -72227 16271
449A6271M8808j05223o770J04790l5454q7153P0196N6083r2544j7381R9107k3106
$$ 16271 65079 -40144 -46914 57876 22422 -64731 5465 61548 -30996 -48377 50730 27624
461B7624r2090N8838P1292q3551l9911R3281L800q5840L2999O5595o3421l6376
$$ 27624 -64466 -5628 65664 -17887 -57798 35483 39283 -46557 -13558 52037 -11384 -47760
473d7760Q4233L151r2520K9041Q4938n7217o3777P5460L1532q2323N395P8115
$$ -47760 36473 39624 -52896 -23855 61083 3866 -59911 15549 47081 -35242 -29847 48268
485D8268m0453o3169O9955M0006q8595j0193R3623k2240q3995N1564O2309p2893
$$ 48268 7815 -55354 14601 54607 -33988 -44181 49442 27202 -56793 -5229 57080 -15813
497a5813l2452Q2528j833p9089L6604O2638o7817l6393Q9248L989r6059K7232
$$ -15813 -48265 34263 32430 -46659 -10055 52583 -15234 -51627 37621 41610 -54449 -27217
509b7217Q7089n3322o2707P1596K7554p8771J4354P4921n4292n9485Q4422L3888
$$ -27217 59872 6550 -56157 15439 42993 -35778 -21424 53497 -795 -60280 24142 58030
521E8030r9285l875R5373k7743p5536N5753M3919p5586n908Q3533l1774p5577
$$ 58030 -41255 -45130 50243 22500 -53036 2717 46636 -28950 -34858 48675 16901 -58676
533e8676O2889N4161q2912k3445Q9967r914q4021M0480O5041o3165l5418P4903
$$ -58676 4213 58374 -24538 -47983 41984 32070 -51951 -11471 53570 -9595 -45013 29890
545B9890q51p4467L6880O3178o6549m4979Q4003K1765q7191L371P5893k8018n0487
$$ 29890 29039 -45428 -8548 54630 -11919 -56898 27105 48870 -38321 -34950 40943 12925 -37562
558c7562M9961J8766o4447J3529O9637m0427o4119N7630M7053o5968k1513O4504
$$ -37562 12399 31165 -33282 -19753 49884 9457 -54662 2968 50021 -15947 -37460 27044
570B7044r228n4449L7992L7418n8908j4949O9548r326o9058L3916N8799n4953
$$ 27044 17816 -36633 1359 38777 -20131 -35080 34468 25142 -43916 -10000 48799 -6154
582f154m0218O8032J6287p0109R311O0066l2996m0131N2857J4268o7094J2186
$$ -6154 -46372 21660 37947 -32162 -22851 37215 4219 -35912 16945 31213 -35881 -23695
594b3695P1977l5500o5616N0877M7174n6541j9128N4168j2532m4534M2685L1135
$$ -23695 48282 12782 -52834 -1957 45217 -11324 -30452 23716 11184 -33350 9335 40470
606D0470o4983j3878P4935o491p1232K6297N4370m3429l0031N4132K457n6466
$$ 40470 -24513 -38391 36544 30053 -41179 -14882 39488 -3941 -33972 20160 22617 -33849
618c3849K4195M9448m5706l2770O0463R979o5808J4354O0962l5182m6649M8345
$$ -33849 -9654 39794 -5912 -38682 21781 31760 -34048 -19694 41268 6086 -40563 7782
630G782K5268n2779J542M8929k9779l8497N3362K3304o7884o346O9329j0847n8570
$$ 7782 33050 -19729 -18187 30742 963 -37534 15828 39132 -28752 -35098 34231 23384 -35186
643c5186K6702L8685l9914j3024M9150j2610n0871L4941M4416m9335l1123N4971
$$ -35186 -8484 30201 -9713 -22737 26413 13803 -37068 -2127 42289 -7046 -38169 16802
655A6802J1864n3053Q561M4031k8179k9350M2605J0880m8851J0141M6530k9731
$$ 16802 28666 -24387 -15826 28205 26 -29324 13281 24161 -24690 -14549 31981 2250
667B250l7082M5285K2759n3842n857N3949j2419m4482L0033K6687m3912m270N1658
$$ 2250 -34832 10453 33212 -20630 -26487 27462 15043 -29439 594 27281 -16631 -20901 30757
680C0757j8021n2087L5954M4101m8025k8951N2476P527m8629J6344L7739l6988
$$ 30757 12736 -39351 -3397 40704 -7321 -36272 16204 23731 -24898 -8554 29185 -7803
692g803k1084N1512K718n6157J5480N1254l2189l7947M3957J7563m9256M812M6008
$$ -7803 -28887 22625 25343 -30814 -15334 35920 3731 -34216 9741 27304 -21952 -17140 28868
705B8868k5649l4570M1341J7768n0317K269N1892k1521m5147L6722L0810m4988
$$ 28868 3219 -31351 9990 27758 -22559 -20290 31602 10081 -35066 1656 32466 -12522
717a2522j1217M5266j0065l7932K9175K5624m3706r954N0832o960m9684K2273
$$ -12522 -23739 21527 11462 -26470 2705 28329 -15377 -25331 25501 18541 -31143 -8870
729h870L9214l4044k2417M0336K670m0625J7133L5770l2928k5135M3420J0676
$$ -8870 30344 -3700 -26117 14219 16889 -23736 -6603 29167 -3761 -28896 14524 25200
741B5200m6789N784M2349k1438l1910L2359J6934l8134k64L7898j6124l1776L0216
$$ 25200 -21589 -15805 26544 5106 -26804 5555 22489 -15645 -15909 21989 5865 -25911 4305
754D305K1032l9118o663M1133q032l6415K0905K6349l0670j1856L5679m244l5413
$$ 4305 25337 -13781 -20444 20689 12657 -23758 -2853 23496 -7174 -19030 16649 12405 -23008
767b3008K0087K9695l2587j9377L9105N489l9929R114L4337k2308k4386L2905
$$ -23008 -2921 26774 -5813 -25190 13915 19404 -20525 -11411 22926 618 -23768 9137
779I137J0903l7762M645L6988j8958k9858K9965J8481l6154m745L6056r732l1559
$$ 9137 20040 -17722 -13077 23911 4953 -24905 5060 23541 -12613 -17358 18698 8966 -22593
792b2593K2887K1236l2086p442L5779p078l3296K0600K5600l0134j4096L4882
$$ -22593 294 21530 -10556 -17998 17781 10703 -22593 -1993 23607 -6527 -20623 14259
804A4259L90l4291J3621K8200k5547j7257L2758M170l4457R164L0482k0749k2613
$$ 14259 14649 -19642 -6021 22179 -3368 -20625 12133 16303 -18154 -8990 21492 743 -21870
817b1870K9311J0609l3391K629L1903j5273k5110K5723J4951l1330k690L2735
$$ -21870 7441 18050 -15341 -12712 19191 3918 -21192 4531 19482 -11848 -14538 18197
829A8197r443k9284K0381K1102k8527j0092L1901k747l0581J4527K4406k3557
$$ 18197 8754 -20530 -149 20953 -7574 -17666 14235 11488 -19093 -4566 19840 -3717
841c717j5099K9482L929l0971Q432K7376j9450j9071K7085Q067l0365L987K8864
$$ -3717 -18816 10666 14595 -16376 -7944 19432 -18 -19089 7996 16063 -14302 -10315 18549
854A8549j5097k2797K4346J2793l0098l99L0616j2548k6121K3117J7000l0143
$$ 18549 3452 -19345 5001 17794 -12304 -12703 17913 5365 -20756 2361 19361 -10782
866a0782n152L2436p188k9619J9234K2209k8030j0733L2579k289l1865J4750K5418
$$ -10782 -15934 16502 9314 -20305 -1071 21138 -6892 -17625 14954 12665 -19200 -4450 20968
879B0968k4708j5816L0311L832l1651Q872K7721j9685j9005K7276P114k9635N465
$$ 20968 -3740 -19556 10755 14587 -17064 -8192 19529 -156 -19161 8115 15229 -14406 -8941
892h941K7219j6408k0915K4752J1263k9141P22K8486j2052k3257K1122J4179k6921
$$ -8941 18278 1870 -19045 5707 16970 -12171 -11449 17037 4985 -18272 2850 17029 -9892
905i892k980K7729q279k4719J7818J7919k4732p914K7563k804k5604J3402K0090
$$ -9892 -12872 14857 6578 -18141 -323 17596 -7136 -15050 12513 9709 -15895 -2493 17597
918A7597k1167j1622K5495J526k6594Q610K3174j7725j6564K3975P340k6204K737
$$ 17597 -3570 -15192 10303 11829 -14765 -6155 17019 -706 -17270 6705 14045 -12159 -9422
931i422K4739j2038j9556J9309J1932k3899k359K4952p805k1923J6623J5506k2261
$$ -9422 15317 3279 -16277 3032 14964 -8935 -11294 13658 5853 -16070 553 16059 -6202
944f202o876K4446k675k3064J1899J7989j9839j0185K4235K69k4788R934K1118
$$ -6202 -13078 11368 8693 -14371 -2472 15517 -4322 -14507 9728 9997 -14791 -4857 16261
957A6261j8165j4048K4032N295k6046N160K3961j5050j7860K2470Q448k6503K017
$$ 16261 -1904 -15952 8080 13375 -12671 -7511 16450 1400 -16460 6010 14458 -12045 -10028
970a0028K5965j2369k1446K0518J3859k5555l742K6444o722k2966J6481J5186
$$ -10028 15937 3568 -17878 2640 16499 -9056 -12798 13646 6924 -16042 439 15625
982A5625k2852n407K5448m987k3476J4019J8358k1098r861K4373j94k3586R894
$$ 15625 -7227 -12634 12814 7827 -15649 -1630 16728 -4370 -14231 10142 9948 -13638 -3744
995c744J8550j7987j0830K2632J664k4129P771K1833j5497j5524K0829P399k2672
$$ -3744 14806 -3181 -14011 8621 10285 -13844 -6073 15760 263 -15261 5568 12967 -9705
1008i705K335K0289j0715j5692J7547Q232k1698k66K2524p942j9781J4786J3887
$$ -9705 -7370 12919 2204 -13488 4059 12291 -9407 -9673 12851 4909 -14872 -86 13801
1021A3801j8900n819K0228k648j8498J0405J4242j6619p951K0502M50k1008O822
$$ 13801 -5099 -10918 9310 6662 -11836 -1431 12811 -3808 -11759 8743 9193 -11815 -4993
1034d993J8426j2765j2734J6176N298j7680K647J6495j0765j2673J7040P002k0382
$$ -4993 13433 668 -12066 4110 9408 -8272 -5625 10870 105 -12568 4472 11474 -8908
1047h908k9K0582o534j7254J2415J1495j6508l791J8152m879j7361J2480J3504
$$ -8908 -8937 11645 5111 -12143 272 11767 -4741 -8532 9620 4741 -12620 -140 13364
1060A3364j8406p178K0816J99k0353O840J7134j2927j1026J7241L124j8865N535
$$ 13364 -5042 -12220 8596 8795 -11558 -4718 12416 -511 -11537 5704 8828 -10037 -4502
1073d502J7268j3086j2994J8328P190k0457k78J9197o865j4798J2642P804j6679
$$ -4502 12766 -320 -13314 5014 12204 -8253 -8531 10666 3801 -10997 1645 9449 -7230
1086g230M25J7504q242j5963J4671J1899j8225n454J9107j828j6534R065J1616
$$ -7230 -6805 10699 2457 -13506 1165 13064 -5161 -10615 8492 6664 -9870 -805 10811
1099A0811j4846m959J7547k271j7816Q813J5068j3898j0502J7197M130j7440K856
$$ 10811 -4035 -8994 8553 6282 -11534 -2721 12347 -1551 -12053 5144 9274 -8166 -5310
1112e310J4894r296r818J3950L768j6599K572J7107q594j4884J3026J0632j5352
$$ -5310 9584 288 -9530 4420 8188 -8411 -5839 11268 2674 -12210 816 11448 -3904
1125c904m220J4833k790j2475R182Q145j4074l348J6971k201j6619P330J3827
$$ -3904 -8124 6709 3919 -8556 626 8771 -5303 -8651 8320 6119 -10500 -3170 10657
1138A0657j1421q084J3785J492j3644M891J1700j0971q127J5202L020j7419K980
$$ 10657 -764 -8848 4937 6429 -7215 -2324 9376 -1595 -9722 5480 8500 -8919 -5939
1151e939J6385q382j2693J2271P219j4115q07J4107o051j1909J2320P772j6590
$$ -5939 10446 2064 -10629 1642 8861 -5254 -6061 8046 1995 -9914 2406 10178 -6412
1164f412k462J7964l010j5778P634J1495j1275n479J3285j585j3490Q113J1196
$$ -6412 -8874 9090 6080 -9698 -2064 9431 -1844 -7323 5962 4377 -9113 -1000 10196
1177A0196j3186p109J5618K146j5335L470J2833q110q256J1745K570j3612L649
$$ 10196 -2990 -10099 5519 7665 -7670 -4200 8633 523 -7733 4012 6582 -7030 -3381
1190c381J2808r384j0039J3207N453j4921m74J4505m515j1652R041O724j1877
$$ -3381 9427 43 -9996 3211 8664 -6257 -6731 7774 3259 -8393 648 7372 -4505
1203d505r14J3059n056j2047R854R270j2610n290J3596M42j2493M648R481r129
$$ -4505 -5419 7640 2584 -9463 391 9661 -2949 -8239 5357 5799 -6694 -2046 7435 -1694
1217a694n056J1827k13j2677M744J1649q423q648J0828M559j1562M46J0829n181
$$ -1694 -6750 5077 4864 -7813 -3069 8580 157 -8491 2337 6896 -4666 -4220 6609 1428
1231A428q040Q995L910j1255L65J1595m689j0450Q254P655j0646l409J1259j446
$$ 1428 -6612 2383 6293 -4962 -4597 6998 2309 -8141 113 7768 -2878 -6287 4972 3526
1245C526j0013O072P332r623l762J1860l13j2362M715J0707q195p306J0417K764
$$ 3526 -6487 -415 6917 -2706 -6468 5392 5079 -7283 -2568 8139 -56 -7362 3055 5819
1259E819j0950K184R794o937p252J0052L619j1863L92J1775m486r445Q119N909
$$ 5819 -5131 -2947 6847 -90 -7342 2710 6329 -5534 -5142 6633 2147 -7298 821 6730
1273F730r986j364J0200l122r070P222O327j0144k720J1265j596j0651N625P953
$$ 6730 -3256 -4620 5580 2458 -6612 610 6937 -3207 -5927 5338 3742 -6909 -1284 6669
1287F669q245m301R884K5r961M195Q797q048o027J0538K134j1040J923R836n351
$$ 6669 -1576 -5877 4007 4032 -5929 -1734 7063 -985 -7012 3526 5660 -5380 -3457 6379 1028
1302A028p295Q118L820r726J84R756m422q287P632N336r679j658J0269k060q938
$$ 1028 -6267 1851 5671 -4055 -3871 5885 1463 -6824 808 6144 -3535 -5193 5076 3016 -5922
1317e922N543O632q177l012R486r01r377M579P331p501m574R098J073r415K810
$$ -5922 -379 6253 -1924 -4936 4550 3649 -5728 -1149 6182 -1319 -5893 3205 4278 -5137 -2327
1332b327Q174n993n714Q497K166r625J750Q876n012o955P842M069r498l77R813
$$ -2327 5847 -146 -5860 2637 4803 -4822 -3072 5804 792 -6163 1679 5748 -3750 -4127 5686
1347E686l467q284O529N548q778k182R452j879q852N414O844p939l600R578k01
$$ 5686 2219 -6065 464 6012 -2766 -4948 4504 2625 -6227 -813 6031 -1908 -5508 4070 3869
1362C869r141L870P705p075m618Q622J032r205K520Q192o053n582Q304K220r119
$$ 3869 -5272 -1402 6303 -772 -5390 3232 4264 -4941 -2421 5771 -282 -5864 2440 4660 -4459
1377d459J493Q474m801o553P439L375q701J72Q808l894p268P071M605q852j140
$$ -4459 -2966 5508 707 -5846 1593 4968 -3733 -3561 5247 1353 -5915 1156 5761 -3091 -4231
1392d231R080k342p952N238N677p601k605Q435r26q028M329O266o658l592Q042
$$ -4231 4849 2507 -5445 -207 5470 -2131 -4736 3699 2773 -5255 -926 5340 -1318 -4910 3132
1407C132P92q161K446P018n248m906P166J692p726J397O983m243n341O478L014
$$ 3132 3924 -4237 -1791 5227 -21 -4927 2239 3931 -3795 -2398 4585 342 -4999 1479 4493
1422D493p558L9P291k834o090N362L588o731p89P005j951o438M648M831o384k590
$$ 4493 -3065 -3026 4265 1431 -4659 703 4291 -2440 -3229 3776 1825 -4613 35 4866 -1518 -4108
1438d108P344j87p276K976N720n188l743O789R16p043J921O448m236m772N995
$$ -4108 3236 3049 -4227 -1251 4469 -719 -4462 2327 3243 -3800 -1879 4569 333 -4439 1556
1453A556K641p079K60O605k980n466N155L399o516p68O745j915o082M429M397
$$ 1556 4197 -2882 -2622 3983 1003 -4463 692 4091 -2425 -3193 3552 1637 -4445 -16 4381
1468D381o217j832O796q45o210L204M915n316k633O537J01o775K715N803n029
$$ 4381 -1836 -3668 3128 2283 -3927 -723 4192 -1124 -3757 2780 2881 -3894 -1179 4624 -405
1483d05l830O420J246o966J268O334l863m710N886K268o732N31O655k990n287
$$ -405 -4235 2185 3431 -3535 -2267 4067 204 -4506 1380 3648 -3084 -2553 4102 1112 -4175
1498d175M980L375o279j072O552j703n642L886L846n548j567O445j113n938L376
$$ -4175 805 4180 -2099 -3171 3381 1678 -3964 -78 3768 -1780 -3347 3098 1985 -3953 -577
1513e77M705m880k968N853M97n809J837N087m192k957N327R61n900J323N664l601
$$ -577 4128 -752 -3720 2133 2630 -3179 -1342 3745 -447 -3404 1923 2884 -3016 -1693 3971 370
1529C70m267M938K352n890j04N684k313m340M160K888n523p32O006j413n504L284
$$ 370 -3897 1041 3393 -2497 -2601 3083 770 -3570 590 3478 -2045 -2777 3229 1816 -3688 -404
1545d04M406m843k459N405k2n032K079M171l967k602N451M81n808J521N329l383
$$ -404 4002 -841 -3300 2105 2083 -2949 -870 3301 -666 -3268 2183 2664 -3144 -1623 3706 323
1561C23l890M557J983n214M77M830k638l783M560K212n618k94N879j956n211L689
$$ 323 -3567 990 2973 -2241 -1764 3066 428 -3355 1205 3417 -2201 -2495 3384 1428 -3783 -94
1577i4L367m707j362N182j048m713L417L572n090j916O189k47n722K062M569l482
$$ -94 3273 -1434 -2796 2386 1338 -3375 42 3614 -1476 -3392 2797 2550 -3172 -1110 3459 -23
1593b3l120M707O33m934J605M376l714l031N130J358n474L30N096k259l705L627
$$ -23 -3143 1564 2197 -2737 -1132 3244 -470 -3501 1629 2987 -2487 -2157 2939 680 -3025 602
1609F02K020m365J7M618k219l948L932K665m850j062M725m87m256K010L007l439
$$ 602 2622 -1743 -1726 2892 673 -3275 657 3322 -1528 -2590 2135 1648 -2608 -598 2409 -1030
1625a030j156M212o29m312K502L617l574k620M376J223m612N28L831k140k695
$$ -1030 -2186 2026 1397 -2915 -413 3204 -370 -2990 1386 2609 -2003 -1475 2356 216 -2479
1640b479L278J144m030O23M198k082l676L221K621l786j205L823n48l259K061
$$ -2479 799 1943 -2087 -1464 2734 652 -3024 197 2818 -968 -2173 1650 1102 -2157 -96
1655i6K194l347o79M170p84m158K022L588k946k635L603Q91l776J067L019k494
$$ -96 2098 -1249 -1928 2242 1458 -2700 -678 2910 -36 -2671 932 1823 -1953 -886 2133 -361
1671c61k162L890P17m348Q42M433k223l562L122K196l713m70L577j419k871K759
$$ -361 -2523 1367 2084 -2264 -1422 3011 788 -2774 348 2544 -1169 -1639 1938 519 -2352 407
1687D07J972l917p32M535p36m174J939L178k862j551L298k63l193J806K784l259
$$ 407 2379 -1538 -2270 2265 1529 -2645 -706 2472 -390 -1941 1357 1094 -2099 -293 2491 -768
1703g68j615M077L36m087Q98L393j949k492K870R50l327O26L296k189k571L384
$$ -768 -2383 1694 2030 -2057 -1159 2234 285 -2207 663 1613 -1714 -1088 2208 19 -2552 832
1719H32J568l916k50L801j043k958J967J973k809o71L243j097k952K199K537l089
$$ 832 2400 -1516 -1766 2035 992 -1966 1 1974 -835 -1506 1737 640 -2312 -113 2424 -665
1735f65j614L512M31l378Q94K617j812j772K723L26k914J080K762j985k290K683
$$ -665 -2279 1233 1664 -1714 -820 1797 -15 -1787 936 1262 -1652 -572 2190 205 -2085 598
1751E98J344l040k75L046j167k429K200J310k882o6L210j112k843K022K363k709
$$ 598 1942 -1098 -1373 1673 506 -1923 277 1587 -1295 -1361 1849 737 -2106 -84 2279 -430
1767d30j432L214k6l035J257K275k363j238L182n5l273J073L096k174k213K900
$$ -430 -1862 1352 1326 -1709 -452 1823 -540 -1778 1404 1349 -1924 -851 2245 71 -2142 758
1783G58R12l009M77K595j618j967K496J107l087J98K972j191k681K304J576k857
$$ 758 1670 -1339 -862 1733 115 -1852 644 1751 -1336 -1138 1834 643 -2038 266 1842 -1015
1799a015m40K786r11k183J792J637k644n26L100n00k846J427K189k201j198K465
$$ -1015 -1455 1331 420 -1763 29 1666 -978 -1504 1596 1096 -1750 -323 1866 -335 -1533 932
1815I32J53k363Q22J993j829j291K458L93k641N45K304j212j939J940J084k346
$$ 932 1085 -1278 -456 1537 -292 -1583 875 1268 -1373 -828 1476 264 -1675 265 1349 -997
1831i97j32K430q28k008J833J224k186m92K419l92k324J220J671j758q83K001
$$ -997 -1129 1301 473 -1535 298 1522 -664 -1156 1263 871 -1453 -233 1438 -320 -1203 798
1847G98N0k134Q14J880j511j211K082L31k119L17K170j139j848J865J055k458
$$ 798 848 -1286 -472 1408 -103 -1314 768 1099 -1020 -703 1467 328 -1520 345 1400 -1058
1863a058J75K268j065j820J622J329k245n00K597n90k275J388J736k090o77K337
$$ -1058 -883 1385 320 -1500 122 1451 -794 -1294 1303 713 -1562 -174 1562 -528 -1205 1132
1879A132l23k167J135J816k003r55K336R8k454R09J906j429j510K196L87k294
$$ 1132 809 -1358 -223 1593 -410 -1365 971 1069 -1385 -476 1430 1 -1509 687 1074 -1220
1895a220N88K203j477j424J990P01k459K15K456j194j846J685J059k060q1K008
$$ -1220 -632 1571 94 -1330 660 1361 -1098 -883 1573 379 -1467 218 1277 -783 -864 1144
1911A144p63j805J627J222k096n13K353n89j813J012J411j513p17J846M8j981
$$ 1144 381 -1424 203 1425 -671 -1184 1169 580 -1233 -221 1190 -323 -1040 806 854 -1127
1927a127Q78J671j526j046J732M55j928J63J729q53j356J590O49j674J9J668p33
$$ -1127 -249 1422 -104 -1150 582 1037 -891 -728 1001 148 -1208 382 1031 -643 -624 1044 311
1944C11j356J237R78j691l92J741j74j703Q30J364j427o55J700l8j868R06J468
$$ 311 -1045 192 1170 -521 -913 828 654 -1049 -219 1145 -282 -937 763 725 -1143 -237 1231
1961A231j353j146J741N40j927L68J645j057j214J659N86j834J17J877p88j757
$$ 1231 -122 -1268 473 1013 -914 -546 1099 42 -1172 487 1073 -761 -644 1233 445 -1312
1977a312J521R23j804l16J898m81j590J123J275j708m70J851k10j873J042J484
$$ -1312 209 1132 -672 -988 910 429 -1161 -38 1237 -471 -941 910 700 -1173 -131 1353
1993A353j657r43J929N3j741N26J507j202r83J716K88j928M92J804j265j280J790
$$ 1353 -304 -1247 682 735 -1006 -480 1027 -175 -1158 558 846 -1082 -590 1214 -51 -1331 459
2010D59M42j693Q7J751q72j220J306P98j741j28J776n72j635J320Q74j432m66
$$ 459 901 -792 -705 1046 174 -1046 260 1058 -683 -811 965 393 -1242 78 952 -480 -946
2027i46J540p0j371O55J159j154n53J501j63j432M46J357r45q86J136L58j293
$$ -946 594 524 -847 -192 967 -187 -740 761 598 -834 -388 969 24 -862 274 632 -661
2044f61K56J226q27r95J449L06j442k3J605m21j414Q73J007j272n69J631p7j539
$$ -661 -405 821 -6 -1001 448 754 -688 -711 894 473 -941 -68 939 -333 -902 729 652 -887
2062h87Q44J075j271n88J441Q1j637N40J364r44j071J452L61j393K72J271r10
$$ -887 -43 1032 -239 -827 614 695 -942 -402 962 18 -1053 399 760 -633 -361 910 0
2079@r57J482L81j485N9J421n78j314J071P89j314j19J309m48j258J158Q09j497
$$ 0 -957 525 906 -579 -520 901 323 -991 80 869 -445 -564 745 297 -961 197 1006 -491
2097d91l30J557k01j514Q21J130j152n67J420j94j189N95J021j099o22J368J04
$$ -491 -821 736 535 -979 -158 972 -180 -747 673 479 -710 -115 906 -193 -815 553 657
2114F57j516M50J187q15o54R15M16j189L32J146q81r01J124O19j284l63J182j69
$$ 657 -859 -409 778 -37 -691 224 640 -549 -217 929 48 -853 271 890 -394 -757 425 256
2132B56q56M27O89q93l4R13k84q80O41P48j007m82J040K43j108L22R05n39p05
$$ 256 -600 -173 516 -377 -411 502 218 -662 -21 727 -280 -762 278 521 -587 -265 640 101 -604
2151f04Q60L51j219K78J128o72r34P39Q30j037l91J070Jr18M86O64r71j10J198
$$ -604 256 607 -612 -334 794 122 -812 -73 757 -280 -671 399 400 -518 -32 632 -339 -449 749
2170G49l68j144O14R89r12p80J225J32j055L00P81p07n80J211J06j178J26J235
$$ 749 381 -763 -149 840 -72 -852 373 505 -550 -250 531 -176 -756 455 561 -617 -491 744
2188G44n04j035R59O80j245k2J065m93p67R94M23j297j16J391l85j139O28Q48
$$ 744 240 -795 164 844 -401 -423 642 149 -618 376 799 -498 -614 777 392 -747 -119 729
2206G29j058j00Q88k32o99N18O37r92l14J174k6j207M42R91p35o48Q08L17r27
$$ 729 -329 -429 459 227 -472 46 683 -309 -623 551 525 -682 -240 751 16 -632 176 493 -434
2225d34K51P73o72n87R26K76j078J70Q98k72o91N90M10o97r7Q00l67r35Q48N81
$$ -434 -183 590 -82 -669 257 533 -545 -375 523 251 -440 150 560 -137 -234 566 199 -736 112 693
2245F93j059k63R91Qq63K92P49n14o75Q17K73p79J81P31n99n09P24L14q76j09
$$ 693 -366 -629 362 370 -493 -201 548 34 -641 176 449 -330 -149 582 -17 -526 198 512 -364 -473
2265d73R31l57n86O88L79r65J1Q99l81q36P63N72q70k74Q82k4q42L60O78o15l81
$$ -473 458 101 -485 203 582 -383 -372 527 146 -690 73 645 -225 -499 383 359 -483 -123 555 -60 -441
2286d41Q54m2q72K60P84n80n67Q05K35q92J84Q48n51m38P93J07r37K85P33m27
$$ -441 413 371 -501 -241 543 -37 -604 201 436 -456 -272 576 25 -413 380 487 -450 -165 568 141
2306A41o41N36M59q13K8O44k04n69M39M07o35j93Q64j84p69M40N43o06k74P18
$$ 141 -500 36 495 -318 -290 354 150 -419 20 427 -208 -401 463 279 -490 -50 493 -113 -387 331
2326C31r9o10L37N41m44l96N16J24p13K34N17l99m09M61K90o08KQ00k96o49M65
$$ 331 232 -378 -41 500 56 -340 176 300 -413 -179 338 -61 -470 -9 281 -327 -325 475 179 -470 -5
2347eM57o81r5P44k12n82K49O17n08l58N06J27o82J66P21n66k46N60Q5o13P5O25
$$ -5 452 -229 -324 420 208 -374 -125 492 -16 -374 132 259 -423 -257 464 -102 -348 212 297 -316 -241 384
2369C84l69n16N93M15q37%P70l34n84O05L31p63k31R94l05o59M15O24o75k43P00
$$ 384 15 -501 92 507 -330 -330 440 106 -478 127 458 -305 -536 458 153 -506 -91 533 -142 -385 315
2390C15n4p17N30M62o82k06O92K5p02K78N93n89m03P22K1p00K46O67n29n45Q47
$$ 315 261 -456 74 536 -146 -352 340 365 -337 -59 534 -55 -458 264 285 -415 -169 498 -31 -576 271
2411B71J43q16J99O18k71n28M52K69o47J28N15j81m26L35K35o12nN12j46n23M20
$$ 271 414 -402 -203 415 144 -384 68 337 -310 -182 333 152 -274 61 296 -316 -321 191 45 -478 -58
2432e8L59n02l2N26p2n92L40M80n16l12O48J26o38Q4M47j30o24N86J49m47l1M79
$$ -58 301 -201 -233 293 221 -371 -31 449 -67 -379 269 395 -243 -159 288 158 -466 120 269 -178 -209 270
2454B70l14l01L05M15m98k27M82N6l69K07M28n11k38M79J7o12L59L29m42j55M08
$$ 270 -44 -345 -40 375 -123 -350 132 188 -181 26 454 -57 -295 184 201 -411 -52 277 -165 -320 88
2475H8K63n88l3O64k37m86M77J67n43J11M40k90m12M23M37o65r7N40k41l55M39
$$ 88 351 -237 -270 394 157 -329 148 315 -228 -117 323 33 -379 44 481 -184 -281 259 18 -337 102
2496A02K18n50j5N61j73n70M43L86m44j34L35J4n31M30L67n20k73N85p4m85K68
$$ 102 320 -230 -245 316 143 -427 16 402 -42 -176 159 173 -358 72 439 -81 -354 231 157 -328 -60
2517f0L34l06l08N55m7l93J46M18k82l50M21J90n75J04N88m23m44L33L69m26J
$$ -60 274 -32 -340 215 168 -225 -79 339 57 -293 128 318 -257 -153 435 12 -432 -99 270 -156 -155
2538a55L22k2n07L65J84l35k20O31j6m92Q8L96p4k84J28J69l99J31L24k54l16
$$ -155 167 145 -362 3 187 -148 -368 263 247 -245 -157 239 165 -119 9 178 -221 -90 234 -20 -336
2559c36L82K45m77j41P01k67m36L86L38n47j9L48O9m02K26K26m46j11L98km55
$$ -336 46 291 -186 -327 374 107 -329 57 395 -152 -171 177 246 -156 70 296 -150 -261 137 135 -320
2580c20K00M66k88k04L20k6l91J16N40n33j25M09J24o02K30L99l19k50L66J96
$$ -320 -120 346 58 -146 174 148 -243 -127 413 -120 -245 164 288 -314 -84 315 -4 -254 112 308
2600C08n88J07M19j68k94L14K34m83o7M23l5m24K54L95m04k29M32o1l67K60K91
$$ 308 -280 -173 246 78 -216 98 332 -151 -218 205 170 -254 0 395 -9 -238 194 133 -234 26 317
2621C17m54j52M91m4m02K22J16j27k23M06N5m69J17M53k92l13M59N3l35n0L87
$$ 317 -137 -289 202 158 -244 -22 94 -33 -256 150 205 -264 -147 306 14 -299 160 213 -122 -172 215
2642B15o8l00J51J39k20J2K04j14l52M04J90l90mL19o0k78J67L46l73j90L26J48
$$ 215 147 -153 -2 137 -83 -71 133 19 -333 71 261 -129 -133 186 126 -152 15 361 -12 -202 124 272
2664B72n77K28M40l70j92J91K98l72r7M13j71k91J48K95l79M8L36j02l54K32L28
$$ 272 -305 -77 363 -7 -199 -8 290 -82 -179 234 63 -228 -80 215 -164 -116 220 118 -236 -4 324
2685C24m65r9L92L1m58J95L59m29j34N66j14m84J99N15m17j86L80M7m22P6M32
$$ 324 -141 -240 152 183 -275 -80 279 -150 -284 282 168 -316 -117 398 -19 -205 175 222 -200 -124 308
2706C08k46l30M89k6l93J42K95k12k03K36K96l97k32M08j02k46L14J33l76K5L33
$$ 308 62 -268 221 195 -198 -56 239 27 -176 60 356 -41 -273 135 33 -213 101 234 -142 -117 216
2727B16l8m53K34L96m17o6K33o3j27J5K55k60k58M47Ll82J47L54p9k44J78k4j43
$$ 216 178 -275 -41 355 -62 -128 105 42 -85 -70 185 -75 -333 114 117 -265 -118 236 157 -87 91 67 -76
2750g6J06J45k39j97K81K87l91j17M15j23k25K6K12o4j03K35K8m83K16L42k11
$$ -76 30 175 -64 -261 20 307 -84 -201 214 91 -134 -108 104 40 -63 172 200 -283 -67 275 64
2771F4k88M28K5l67O5K50j48j93L47J4l66J55K31k71j21K57K09m58l0M09m6l62
$$ 64 -224 204 229 -138 -73 177 29 -164 183 197 -169 -14 217 -54 -175 82 291 -167 -197 212 166 -196
2793a96J46K52j43k60M34j61k68J47K29k71j91L82R2l46J81J53l18PL32J03m20
$$ -196 -50 202 59 -201 233 72 -196 -49 180 -91 -282 100 192 -154 27 180 -138 -131 201 304 -116
2814a16K6J91j15j09K89o8k43P7L49l57j07K29K00n70J38L81k49k19K12K09k20
$$ -116 -90 101 -14 -123 166 98 -145 -68 281 -76 -183 46 246 -324 -186 195 -54 -273 -61 148 -72
2835g2j04L61r2j76MK31q7k48L00k2l35K59J51j60j93L34k8k52R5K04r8j05J11
$$ -72 -176 185 93 -83 -79 152 65 -183 117 95 -240 19 170 10 -183 151 123 -129 -34 170 72 -33 78
2858G8R5j63j58K24j9k73K66K79n02O3L17q5k28J16R4l20J06K00J0l27K79J55
$$ 78 173 10 -148 76 57 -216 50 329 -173 -110 207 122 -106 10 104 -216 -110 90 100 -227 52 207
2880B07k62R2R6m8k64J55K35j65k90L34J69l92J3L10j04k76J92K51l95JK22o0
$$ 207 -55 37 133 85 -179 -24 211 46 -244 90 259 -133 -120 190 86 -190 2 253 -142 -141 81 21
2902B1j87K27J33l37mL77j00k83J96J84l69j8L39r2k92J48J63j77j27M41j08l29
$$ 21 -166 61 194 -143 -147 230 130 -153 43 227 -142 -160 179 87 -205 -57 106 -71 -198 243 135 -194
2924a94K69K19l57n5J86J37l11J85O5k47n1J36J45k86P4J48n9j17Q6L9qo0J87
$$ -194 75 294 -63 -118 68 205 -106 79 144 -103 -154 -18 127 -159 -85 63 4 -113 -27 12 4 -56 131
2947A31q0j18N3J96j95m9L20m8l61J39J49j83q3K60l4j94N6J98k01j65K77Q3k65
$$ 131 51 -67 -14 182 -13 -62 258 210 -151 -12 137 -46 -129 131 97 -97 -41 157 -44 -209 68 151 -114
2970a14M8K94k20o8J11J09k81J50J32j35j71J23K56k19j46K51o6j02l5K46j92
$$ -114 -66 228 8 -60 51 160 -121 29 161 26 -145 -22 234 15 -131 120 54 -48 -83 163 -29
2991b9j28K30M4l99K13K53j43k66K68P7l44J99K62l06j82K93O2k77K9K90o0k89
$$ -29 -157 73 117 -282 -69 184 41 -225 43 120 -224 -25 237 -69 -251 42 104 -173 -144 146 86 -203
3013b03K83P5k52l8L29j89j89K24K17l73O5J88j31j76R4K51k02j01K04M4k54J9
$$ -203 80 155 -97 -135 194 5 -184 40 257 -116 -51 137 6 -170 -76 175 -27 -128 76 120 -134 -115
3035a15K29l21Q1J41P7k04M0J57jj03J29K7j99j30L31m1k11J45Q1k47M0K34Ok46
$$ -115 114 -207 -126 15 92 -112 -72 85 84 -19 110 137 -62 -192 139 98 -113 32 113 -134 -94 140 146 -100
3059a00J9K26K0k71K19j26j39M4J30j14p7K19R5k61L0K93j88p8J34N1k33M0L26
$$ -100 -81 145 165 -106 113 -13 -152 -108 22 -92 -169 50 145 -116 -86 207 19 -59 75 126 -107 -67 259
3082B59k34j72J92J87l05Q1J70j69j56J55J89k46l6K08Q0l79K93Qj91j40L50K0
$$ 259 25 -147 45 232 -73 8 178 9 -147 8 197 -49 -85 123 203 -176 117 125 -66 -206 144 164
3104A64l21J88J24j40n1J22O5j34j17L17k40j90J86J49k02k1K37j63o9Q7J79j70
$$ 164 -157 31 155 15 -36 86 151 17 -100 217 -23 -213 -27 122 -80 -101 136 -27 -96 -9 170 0
3126@m9K11k24j72K74J14k13j5J28%k19K35J6q8j15K53j2l35J31J84r1j27J99
$$ 0 -49 162 -62 -234 40 154 -59 -74 54 54 -165 70 86 -2 -117 136 124 -211 -80 104 13 -114 85
3149H5J6k97Q3M40l19j20Q1J03o6l1O8n1p0K9P9o6p2N2J01j27J80q7r5q3K32M
$$ 85 101 -196 -113 327 8 -112 -31 72 6 -25 43 -8 -78 -49 30 -36 -108 -56 45 -82 98 11 -84 -167 65 69
3175F9j95J71J29j84j42J62K5j44qJ41j11K7k8J64j62P5N0L6k73K78J2j02r5K71
$$ 69 -126 45 174 -10 -152 10 35 -109 -117 24 -87 -60 -88 76 -86 -11 39 75 -198 80 92 -10 -105 166
3199A66j12j91J62P4j90j02J66J59l53R7K29j63q8K25j3j63J3K53j72p7J27L6
$$ 166 54 -137 25 99 -91 -193 -27 132 -221 -124 105 -58 -146 79 66 -97 -84 169 -3 -80 47 83
3221H3j75J17J31j86r5J96P0k18j7J36m3k17L32K7k58N6K45j44j58J21j5J7j21
$$ 83 -92 25 156 -30 -125 71 141 -77 -94 42 -1 -218 114 141 -117 -61 184 40 -118 3 -12 5 -116
3244a16K21n8j70K07L7k24m9J84J11j58m4Q6m5m7J09o4p2p9K78j58m8K04J2j23
$$ -116 105 47 -123 84 121 -103 -152 32 143 -15 -59 27 -18 -65 44 -20 -92 -171 107 -51 -99 105 117 -6
3268fn6J72l7j93J17Pj34J52J34l8k33J51J09j43n8J50j2j34qP9M3p5M3L5j78
$$ -6 -62 110 73 -120 -3 4 -130 22 156 118 -115 36 145 2 -56 94 82 -52 -60 19 62 -13 30 65 -113
3293a13J32R7j73q5J27J04k11J7J77P9k47R5J06j29L7P6l7k85K06K59j84n3R8
$$ -113 19 116 -57 -142 -15 89 -122 -105 72 151 -96 -1 105 -24 13 89 52 -233 -27 232 48 -5 93
3316I3p3r0J06j3j95J65K18km31K03K25j75j76K66n5j20J57l3j47N7J50j07j08
$$ 93 20 -70 36 23 -172 -7 211 209 -222 -19 206 31 -145 121 66 -54 103 70 -77 -20 130 23 -85
3339h5J31M4j3j51J57N2k45J01K8j11Q0K2k3r3Q5O3J17k27N7J21k07K1M9pPn2
$$ -85 46 90 77 -74 83 135 -110 -9 19 -92 -12 10 -13 -106 -21 42 159 -68 -11 110 -97 -76 -27 -34 -27 -79
3365g9K49k77p2L49j33r3K7K22j20j12J30Rj24n4J66j05l8Q3K21j80p5Q2j29o1
$$ -79 170 -107 -179 170 37 -56 -29 193 73 -39 91 100 -24 -78 88 -17 -55 28 249 69 -6 76 -53 -114
3389a14O5Q1j03j49K33R6k50J30K37k31r3J98j2o3q3J42j23K1P2n6o3L4N3o3N6
$$ -114 -49 32 -71 -220 13 109 -141 -11 226 -5 -98 100 88 25 -58 84 -39 -18 54 -2 -65 -31 22 -41 15
3414A5MJ55l38J75mj26k5K15q0j36J25Q2j1j13J09k9j76J25J77j44p6m5K76j97
$$ 15 19 174 -164 11 7 -119 -144 71 -9 -145 -20 62 51 -62 47 18 -158 -33 144 0 -76 -121 155 -42
3438d2J8M8N6q0O7J00j13j44J70l2j67J27J05j24J4K3P1j59j4R6J13j74L2l7%
$$ -42 -24 24 80 0 67 167 54 -90 80 48 -119 8 113 -11 3 26 97 -62 -76 20 133 -41 -9 -46 -46
3463d6J40j72J22j79J19N1J1q4k0J12o0RJ19j48q4J00N5o4n7J34m2j49J96q7J01
$$ -46 94 -78 44 -135 -16 35 46 -38 -58 54 -6 3 122 -26 -110 -10 45 -19 -76 58 16 -133 63 -24 77
3488G7r4J74k33N4R4M9n1j59R9Q1k10P3J79j17r8J68j07j33J87R6o0j51J80j43
$$ 77 -17 157 -76 -22 72 121 70 -89 10 91 -119 -46 133 16 -82 86 -21 -154 33 129 69 -82 98 -45
3512d5m4J4K21r5k11J84P8j91J9J84q9o5O9k5M8j3M8q3l1l5J51j15P8pj00j37
$$ -45 -89 -75 146 51 -160 24 102 -89 -70 114 25 -40 29 4 52 39 87 4 -27 -62 89 -26 52 45 -55 -192
3538a92J90J26k44L2J02N5j90J91l0p6p4R7R9j42L6O1m9k8M7o5p1Q2Q3p2j8J54
$$ -192 -2 124 -120 -88 14 69 -121 70 40 -36 -110 -13 86 -56 -20 41 -8 -36 11 -54 -125 -43 40 -32 -50 104
3564A04q0l8o4J88j43o3RK43j17p4P7J38j99N4Q6j73%N7J09r1n3O3L2j62J72L3
$$ 104 24 -14 -78 110 -33 -96 -87 156 39 -35 42 180 -19 35 121 -52 -52 5 114 23 -30 33 65 -97 75 108
3590A08j69L4P7p8p0O2R9l9M3L0j56J9K7R2j42k7L9r1J00J21k4J7j56R4O9o2J1
$$ 108 -61 -27 50 -28 -98 -36 63 24 67 97 -59 -40 -13 79 -63 -90 -51 -142 -42 79 55 72 -84 10 79 17 28
3617B8k7q1O3P9p2j07K00O8k04n3J12Pl3lO4K3j95K16p4k4K6L4j5RP7kk13M8J11
$$ 28 1 -80 -17 62 -10 -117 83 151 -53 -106 6 13 -20 -23 41 64 -131 85 11 -13 13 47 32 41 118 116 -97 -49 62
3646F2p1LP0j35J23n6K3j3m5R3J1p5j0J62k26Q7o9K48j91p8J11kj8JO7Nn7o6J53
$$ 62 -9 -6 64 -71 52 -4 19 6 -39 54 65 -10 -20 142 -84 3 -66 182 -9 -87 24 22 4 5 72 77 20 -46 107
3675A07q4J4Q0o6j27J8O8k0L0O9l0p7O1N5qj70M7Nj7k7R8o1o6K6J16j13L1N4n0
$$ 107 23 37 117 51 -76 -58 10 -10 20 89 59 -18 43 98 90 -80 -33 -28 -45 -72 26 -35 -101 -75 41 -72 -41 13 -37
3704c7J36j38R9n6j11P2k8l0J75J0j12J6R7j43j02Q3J93k51J17M4J1p8J0Q2p2
$$ -37 99 -39 60 4 -107 -35 -63 -93 82 92 -20 -4 93 -50 -152 -69 124 -127 -10 34 45 -33 -23 59 -13
3729a3K2Q2M7k43J03J52k23J86j13K2l1L8L9j0qj12O6k3O4pJ30k24O0l2l4O9O2
$$ -13 9 91 138 -105 -2 150 -73 113 0 22 -9 29 68 58 50 -62 4 -19 45 38 168 -56 4 -28 -62 7 69
3756F9o9k6J09o0o7l4J30j25O4o2J22oJ4k0Rj04jJ19K3n0L4j07J41j64J5J31k30
$$ 69 0 -26 83 23 -44 -78 52 -73 -9 -71 51 45 59 39 48 -56 -57 62 85 35 69 -38 103 -61 -46 85 -145
3783a45K10k7K1qj6l2mPJ25j20J9p7L6P9j02j8L9j25J76q3J5j8p9J39o0MQ3j23
$$ -145 65 38 59 51 35 3 -1 6 131 11 30 -47 -11 68 -34 -52 -13 -138 38 -45 -30 -48 -127 12 -48 -44 39 -84
3811h4Q1M6K6j91J16k1m3P7M9j03P2M5m5j13J19L6m0q6K47r4j8j18oJ37j49J1
$$ -84 -3 43 69 -122 -6 -27 -70 7 56 -47 25 70 25 -88 31 67 27 -59 188 94 76 -42 -48 89 -60 -49
3837d9N6J2o8R2l6j00K2J58k85J53R3k4Qo4N1L0j14k2o3J33j16J64o4r2M2P4P9
$$ -49 7 19 -49 43 7 -93 -71 87 -198 -45 48 24 32 -32 19 49 -65 -87 -150 -17 -133 31 -33 -125 -83 -9 70
3864G0j6O9k28J04J5J12r0o9J07J8r9M6KL2j3j16P0j18J8J22j5o7N7N2q5k8L8
$$ 70 54 123 -105 -1 14 126 36 -33 74 92 -7 39 41 73 60 -56 14 -104 -86 36 21 -46 11 63 -22 -50 -12
3891a2J6J2q3P7k1J0M6m9n6j1J18j56k2J50R2k2QK8j60l4K7L0j1Q0J15k47nR3
$$ -12 4 16 -67 10 -11 -1 45 -4 -60 -71 47 -109 -131 19 111 89 97 125 -35 -69 -42 -12 -23 57 172 -75 -80 13
3919A3M9j77kR8LL5J09j08k2n7Q7J01j33J6K7j18J02Qj05O5K6k7j9k8N4Kl0k2
$$ 13 62 -115 -117 -19 -16 19 128 20 -2 -59 28 129 -4 12 39 -79 23 31 -74 -9 17 -10 -29 -57 -3 -1 -31 -53
3947e3R5l1J9k9K3j15L0M6N4mo0j22J37q3J37J17j16j7o9J05n2L2K9p8j5Ml0o9
$$ -53 42 11 30 1 24 -91 -61 -15 39 35 -25 -147 -10 -93 44 161 45 28 -41 64 12 44 73 -5 -20 -16 -46 -115
3975a15R7Jj05Q3L1J23o7O9j13J1l0K8l8m7Q9Q3j75K9R8j41qJ64j20m7R5k7p2
$$ -115 -18 -17 -122 -39 -8 115 48 117 4 15 -15 13 -25 -72 17 100 -75 -46 52 -89 -97 67 -53 -100 -5 -32 -104
4002a04K0M1m9R6k8O2p1o7L1KJ03K0m8R0pk1m4m9N1N7j89K1Q8Nk0l1K1P3n0RP1
$$ -104 -84 -43 -92 4 -24 38 -33 -100 -69 -67 36 56 8 98 91 70 26 -23 28 85 -104 -83 5 10 -10 -41 -20 53 3 12 83
4033H3p1KKL9j2P1j02QN1n1o5l1J98m3n6p3N2P0q3J3n5K7L9L1mo7nl7J12j25Q6
$$ 83 12 14 16 55 43 114 12 20 71 20 -45 -76 122 79 23 -50 2 72 -11 2 -53 -26 13 44 40 -27 -32 -69 43 -82 4
4064DrM3l9J22j47K1k7o2N3J21j00J26o8M3m6j20J9M6MJ9p6J00M8Nj57M1J6J6
$$ 4 -5 38 -1 121 -26 -5 -32 -94 -41 80 -20 106 38 81 35 -85 -66 -20 -16 3 -73 27 75 80 -77 -36 -20 -4
4092djjj6L5j59J54p1J78j69J93n6j05Jj67J74K6K4j35P0PK4J02j60J2L5l9NM6
$$ -4 -5 -6 -22 13 -146 8 -63 115 -54 139 83 -22 -21 -188 -14 12 36 -99 -29 -22 2 104 -56 -44 -9 -48 -43 3
4120Co6Q%M8n0L3lK0m7O1k0l6Q2p0J36l6N3j59Q1P3j01r2QK5L6M5q9j7J66p6q5
$$ 3 -63 -55 -55 -7 -57 -24 -27 -7 -54 7 -13 -49 33 -37 99 63 116 -43 38 111 10 -82 -74 -49 -13 32 -57 -74 92 16 -69
4151f9J72j34J50j07NmQ2j21N9R5j15q1L1J71j88M8l4m0p3J52P7n2mj8L3q9O7
$$ -69 103 -31 119 12 17 13 95 -26 33 128 13 -68 -37 134 -54 -6 -40 -80 -153 -1 76 24 20 2 35 -54 13
4178A3L1K4j37LJ42j26o0P3l1J37j04lJ7J5M5o6Q9n9N1p6o5Q3n1J43n4M2r5j6
$$ 13 44 68 -69 -66 76 -50 -110 -37 -68 69 -35 -38 -21 -6 39 -27 62 3 54 -22 -87 -4 -55 88 34 76 -19 -35
4206c5Q7o0OR8j77%k6L0J4N4P8o7kj5Q0M7j04p0J10o3Q3M3j23l0J11r7Mm5N0J1
$$ -35 52 -8 -2 96 -81 -81 -107 -77 -63 -9 69 2 0 -15 65 112 8 -62 48 -15 68 111 -12 -42 69 -28 -24 -69 -19 -8
4236hJ18k00Q0lN1N0l9j37J52lj2j58L2J1N9L1o1K4Q3o7L6q6J0L5k7P9j45J22
$$ -8 110 -90 -10 -13 38 88 49 -88 64 61 49 -109 -77 -66 -7 24 -37 -13 70 3 39 -47 -37 -2 -29 50 -95 27
4264B7J11j90M0r0J28l8J9Ro6K5O5m6l2KN0M9K8j4j38PJ08j27J12O2j35O1J7n1
$$ 27 138 -52 -12 -102 26 -12 7 16 -50 -25 40 -6 -38 -36 14 63 91 77 -61 -54 54 -73 39 101 -34 27 44 -7
4292grjN2q7q5J42o5j0J02q2L1K7j2O1n2L0m8J07n6km0k2r4P6J6O8k1n0K0q3J54
$$ -7 -16 -17 35 -52 -137 5 -60 -70 32 -50 -19 8 -4 57 5 35 -13 94 38 36 -4 -26 -120 -44 -28 40 19 -31 -11 -94 60
4323F0l0j06P8m9o7N2J10R0j46knN9q2L7m6L0K8j21K07j40P2m3K1j00oN8K2k1
$$ 60 30 -76 2 -47 -114 -62 48 138 -8 -10 -15 44 -38 -1 -47 -17 11 -110 97 -43 29 -14 7 -93 -99 -41 -19 -40
4351d0K8n2M4Qj1N1m7p0J99p1kl6L3k5j00K16o9j09J04l0K2J48j48j8n2j1K3J6
$$ -40 -12 -64 -20 -12 -23 28 -19 -89 110 39 37 1 34 9 -91 125 56 -53 51 21 43 191 43 25 -27 -38 -15 1
4379ArL7q3R0q4N1K4%K0k9l7J02j41O6j25K16j59O8n4J04q9N8J5o7k3O7J1j5M0
$$ 1 -8 29 -54 36 -48 3 27 27 47 18 -19 83 -58 8 -117 99 -60 8 -46 58 -31 27 42 -25 -48 19 30 15 55
4408E5o8Q7q4Kk8J57j10Jq0Q1k0j3J0KL0j46J00J1J30j91RK6K7oj3J3J9J01j23
$$ 55 -13 74 -10 -8 -36 121 11 12 -68 13 -7 -20 -10 -8 22 -124 -24 -13 117 -74 -65 -39 -12 -18 -31 -18 1 102 -21
4437b1m3N7jj7P0JP0j04jj4Q2l0p8QN9o1J31p4l0n3L9o7J16l6l4L8k0J4lq2N0
$$ -21 -64 -7 -8 -25 45 46 116 12 11 -3 79 49 -29 -21 38 -23 108 34 4 -49 -10 -77 39 3 -31 7 -13 1 -2 -84 -34
4468c4o1k0R4M2m8L0K4q3L5o9J68j46j2Q4M1p2O2m6l6O3%K7J2j7p4Q1j20K27j65
$$ -34 -95 -115 -21 21 -27 3 27 -56 -21 -90 78 -68 -80 4 45 -27 35 -11 -47 16 16 43 55 38 -36 45 -75 152 -13
4497a3o0J22mj43M4P0o2L0l8J21j64N0k6P4k7P6j6n2M4j82R4M6J35j31j8R5k7
$$ -13 -73 49 45 -98 -54 16 -46 -16 -54 67 -97 -47 -73 1 -26 50 34 -18 26 -156 -62 -16 119 -12 -30 65 38
4524C8J34o4K2r1K9j29qP9o2R0l3k6o4Q8j1l0OL8J24j29m5L5%O6l4q5k8L7N4j21
$$ 38 172 108 130 39 68 -61 -69 10 -52 38 5 -21 -85 3 -8 -38 -32 6 130 1 -44 -9 -9 57 23 -62 -90 -53 1 -120
4554a20J81p5R1k8j27Q0o7J32q3k6J09j7L6j03o8J68j23pOOJ29j36M2ok1J4k0
$$ -120 61 -14 77 49 -78 2 -65 67 -16 -42 67 50 86 -17 -85 83 -40 -47 -41 -35 94 -42 0 -6 -27 -13 -33
4581c3j7K4n6j2J76j10L8k2j2jo3J08j13j8J00R3p3m7l4J64q2j2l0N9q3M5j3Q9
$$ -33 -50 -26 -82 -94 82 -28 10 -12 -24 -25 -88 20 -93 -111 -11 82 9 -38 -72 92 10 -2 -32 27 -56 -11 -24 65
4609F5k4n9J02n8q3J45j50k1L5N9J5p6o9J55q5oL8Q4J2n1l1mM8j06m5J67j78J01
$$ 65 41 -18 84 26 -57 88 -62 -83 -48 11 26 -50 -119 36 -49 -55 -17 67 79 28 -3 -7 41 -65 -110 57 -121 -20
4637b0L5j04J42q7J06n5K8j09l8J07nJ09j02j06j8J28p5m2P4N4j9lM7L6q9r2K01
$$ -20 15 -89 53 -34 72 17 45 -64 -102 5 0 109 7 -99 -117 11 -64 -106 -32 22 3 0 47 83 -6 -98 103
4664A03j27J6K7n8o4J28J0ML8o9n3J95n6j58O1Nr7K6J39o0l5L0kk6Q0j19P6l7
$$ 103 -24 -8 19 -39 -103 25 35 39 77 8 -45 150 94 -64 -3 2 -95 -69 70 10 -25 5 3 -23 57 -62 14 -23
4692b3j4l0K0J5L2k7O7q6j8j4J45j43N9kL9m7j4O8q2P9l8jJ1j17L5J97r8rl2k6
$$ -23 -37 -67 -47 -32 0 -27 40 -46 -64 -78 67 -76 -17 -19 20 -27 -41 27 -55 24 -14 -15 -4 -121 -86 111 13 4 -28 -54
4722e4K2%L2k6NJ9r5J33q3K9J2q7J65rr0K2K2K5p1KK8Q5j24jJ8m8J6N5Q3j45J05
$$ -54 -32 -32 0 -26 -21 -2 -97 36 -47 -18 -6 -93 72 63 -27 -5 17 42 -29 -27 1 86 -38 -39 -21 -69 -53 2 85 -60 45
4753D5j1j2j02N0kM8l1Q7j7k24J29J14k3j44J55p2L0K1j10P1m6kKP7P9j9r6J5
$$ 45 34 22 -80 -30 -32 16 -15 72 55 -169 -40 74 51 -93 62 -10 20 41 -69 2 -44 -46 -44 33 112 93 -3 12
4781A2mL1l7p5J44q0M6J10j57L3q5O1J09k44J18N6k2k5P2l0j6P7j44J01n9j7j06
$$ 12 8 39 2 -73 71 -9 37 147 -10 23 -62 -1 108 -136 -18 38 16 -9 63 33 17 94 -50 51 -8 -25 -131
4808a31L7K5LQ2r3J67pk7q5J17j58QO2K8m0j0R9k8l5n9L9ol1P0qn9j4L5M9r6L6
$$ -131 -94 -69 -66 16 -77 90 83 56 -29 88 -70 -62 0 28 -12 -22 77 49 14 -45 -6 -12 -43 27 19 -40 -54 -19 30 -66 -30
4839c0Q2n4j17M8N7p4J80q2l3l8N1j31Q6pO8o1N2O3k08R6O2L5l1q9N9R8l2j58
$$ -30 52 -2 -119 -71 -14 -88 92 10 -23 -61 -10 -141 -55 -62 6 -55 -3 60 -148 -52 10 45 14 -75 -16 82 50 -108
4867a08J38R7j11l3l6R8m7O7k5l5j1J80l00Q3m7J20o3K0k4q2J19L4j40Q5P3n7
$$ -108 30 127 16 -17 -53 45 -2 65 40 5 -6 174 -126 -43 -90 30 -33 -13 -37 -119 0 34 -106 -21 52 -5
4893ep9J04r3J38j25olP0N8J6O3k16R6mq3mP5p7J43k46J33N2O4k9n9j0R9Qr0j09
$$ -5 -84 20 -73 65 -60 -66 -69 1 59 75 138 -78 18 14 -69 -73 2 -75 68 -178 -45 7 71 42 -17 -27 72 80 -10 -119
4923a19Q3L4L9o4j7j3L5L7l8K5m4l3P1R1o8MM0q9n4N6J2k9l1J69k85K94m4m7q2
$$ -119 -36 -2 37 -27 -44 -57 -22 15 -23 2 -42 -75 -4 87 19 23 63 -26 -80 -24 -12 -41 -72 97 -188 106 62 15 -67
4952f7J30j2q3J8J13m9j12J25p9J7m1N2n2oJ23j10NM4k7J9q7N5lp2L6K8k4J57
$$ -67 63 51 -32 -14 99 50 -62 63 -16 1 -40 12 -40 -46 77 -33 -28 16 -11 8 -79 -24 -27 -99 -63 -35 -59 98
4980I8j24k7P9M5k37J83J4j09N7oL3O6n5J33k21Q5l7r3K01p8J00n2l4jQm5J0j5
$$ 98 -26 -53 26 71 -166 17 31 -78 -21 -27 6 72 17 150 -71 14 -23 -116 85 7 107 55 21 20 28 -17 -7 -22
5008b2J49j42J08m0o5j36Q5J4OJ08j32N7J2k6J92j17k1K2ON6j5j13O1j0n2mnJ0
$$ -22 127 -15 93 53 -12 -148 -63 -49 -43 65 -67 -10 2 -24 168 51 30 52 58 114 99 -14 47 37 -15 -19 -24 -14
5036a4J1J1K6j39J61m9L8pl0J00j44N2n2q5Q2j4j3M1j39J95n3L0k1oK5j38J30
$$ -14 -3 8 34 -105 56 7 45 38 8 108 -36 16 -36 -121 -39 -53 -66 -25 -164 31 -22 8 -13 -19 6 -132 -2
5063bJ23j41O7k2Ln5J00j25P2K9jJ16p7o5pn2P3L6p5O1j08J55j25L9p8J15o8K7
$$ -2 121 -20 47 25 28 -27 73 -52 20 49 48 164 87 22 15 -37 36 72 -3 58 -50 105 -20 19 -59 56 -12 15
5091A5K9m5Rr8L2j8Q5O4Mq4j26O6P3ro4J0K5R5mj01L1pM5j74J42N3L6j94J38j07
$$ 15 44 -1 8 -90 -58 -76 9 73 77 -7 -133 -67 6 -3 -67 -57 -32 63 59 -42 -11 -18 27 -147 -5 48 84 -110 28 -79
5121g9J33K5q0m2O9J22j29N5o6o1NJ8R1oj42M1K05j90k3N0Pl8m5L5J22q9k1L7
$$ -79 54 79 -1 -43 26 148 19 74 8 -53 -48 -30 61 55 -87 -46 159 -31 -54 -4 3 -35 -80 -45 77 -12 -33 4
5149Dk2L4K2o0N4l8j70M5J37n2OJ3J42j10q8P2J32j07l0P5o6Qo2P5p0k0J08j72
$$ 4 -18 16 38 -22 32 -6 -176 -131 6 -46 -40 -27 115 5 -83 -11 121 14 -16 59 -7 1 -61 14 -56 -76 32 -140
5177a40K29N2j49P8r7l5J06j57Q8J0J33j59O1l7N6N7j23l8J63j51rR5pj7l6K0
$$ -140 89 141 -8 70 -27 -62 44 -113 -25 -15 118 -41 20 -17 39 96 -27 -65 98 -53 -62 33 26 9 -27 -7
5203gj2O7j1Q2j43Q1M9j04j09J86p4o3R8M6j69R4lo1R7J6m2n2L5Lo2J42r4or8
$$ -7 -19 48 37 119 -24 57 106 2 -107 79 5 -58 40 86 -83 11 8 -53 44 60 18 -34 1 4 -58 84 -10 -16 -114
5232a14K07k21k0J49l6K9o4M0L7L7k7J0R1j79R5lm9MN9k0n5J35p4k0lQ5n3K8j10
$$ -114 93 -128 -148 1 -35 -6 -70 -30 7 44 17 27 118 -61 34 31 -18 -14 45 25 -30 105 31 11 8 93 40 68 -42
5261d2lO2j38K12j11ro1R3nLmM7nN3Ko1r9J55n4m3l8R9rlRO1p9j6k8Rj8O3m0P3
$$ -42 -45 17 -121 91 -20 -29 -90 3 -2 1 -3 44 39 92 94 33 -66 89 35 -8 -46 53 44 41 50 111 32 16 -12 -3 -21 42 2 75
5295G5j05l8J29m1j21J0P5O3r7J18j20R3l4K7o0P8l6K6m9J07P0j06Mn7o2rK56
$$ 75 -30 -68 61 20 -101 -91 -16 47 -50 68 -52 41 7 34 -26 52 16 42 -7 100 170 64 68 11 -51 -60 196
5322A96k46j3NJ97j52q9K2oJ17j7J4mo6J01k0N8r0n4Q0l5J9N8r4m1J30j44R8j06
$$ 196 -50 -63 -58 139 -13 -102 -80 -86 31 14 28 24 -42 59 39 97 7 -47 33 -2 17 75 -19 -60 70 -74 24 -82
5350h2R9l0NP1q3p5R5QMR3K2m5j73Q7n8P0k0m4l1N7J56j33R0j00j5O7o5j0J17
$$ -82 17 -13 -8 63 -20 -95 0 8 12 105 127 82 -91 -4 -62 8 -12 -56 -87 -30 126 -7 83 -17 -32 35 -30 -40 77
5379G7n4k7Q1q1K2k5oJ21q7m1J16J2j14R0j03%K8L3q3Q8lj21K05j24l6j9J53m1
$$ 77 23 -4 77 -4 18 -7 -13 108 21 -20 96 108 -6 84 -19 -19 9 42 -41 47 44 -77 128 4 -32 -51 102 61
5407F1q2J2M5j7p7J39j61N5J0j02J49j02R3K8m6m0P9o0R9j76J51o0jM1j12J10
$$ 61 -21 -9 36 19 -58 81 -80 -25 -15 -117 32 -70 23 51 5 -35 44 -16 83 -93 58 -2 -3 38 -74 36
5433C6j17J27L0j32l4J56r8Lj9M6q5J88j4j48J32q5n9J93k36J97j02p3J19J0j61
$$ 36 -81 46 76 -56 -90 66 -32 -29 -48 -2 -87 101 87 -61 71 -14 -73 120 -116 81 -21 -94 25 35 -126
$$ [...]
8191c1
##END NTUPLES=NMR FID
##END=
