##TITLE=1H_Pr C6
 200.13MHz, CCl4,
 8 sc
 
 11.8.2025
##JCAMPDX= 6.0         $$ Bruker NMR JCAMP-DX V2.0
##DATA TYPE= NMR FID
##DATA CLASS= NTUPLES
##ORIGIN= UXNMR, Bruker Analytische Messtechnik GmbH
##OWNER= pz
$$ XWIN-NMR		Version 3.5
$$ Mon Aug 11 15:42:17 2025 Russian Standard Time (UT+4h)  she@DPX200
##.OBSERVE FREQUENCY= 200.1313
##.OBSERVE NUCLEUS= ^1H
##.DELAY= (6, 6)
##.ACQUISITION MODE= SIMULTANEOUS
##.ACQUISITION SCHEME= undefined
##.AVERAGES= 8
##.DIGITISER RES= 18
##SPECTROMETER/DATA SYSTEM= spect
##.PULSE SEQUENCE= zg30
##.SOLVENT NAME= CDCl3
##.SHIFT REFERENCE= (INTERNAL, CDCl3, 0, 14.3821)
##AUDIT TRAIL= $$ (NUMBER, WHEN, WHO, WHERE, WHAT)
$$ ##TITLE= Audit trail, XWIN-NMR		Version 3.5
$$ ##JCAMPDX= 5.01
$$ ##ORIGIN= Bruker BioSpin GmbH
$$ ##OWNER= she
$$ F:/spectra/data/she/nmr/H-C/1/audita.txt
$$ ##AUDIT TRAIL=  $$ (NUMBER, WHEN, WHO, WHERE, WHAT)
(   1,<2025-08-11 15:40:54.25 +0400>,<she>,<DPX200>,
      <created by zg, POWCHK disabled, PULCHK disabled
       configuration hash MD5:
       00 E9 B6 7A A2 85 ED C7 34 08 36 98 17 FE 4E 26
       data hash MD5: 16K
       9D EA EF 19 F8 91 27 13 57 B7 1A 11 98 53 B0 50>)
$$ ##END=
$$ 
$$ hash MD5
$$ 8C 7C EF AF 9A 83 0B 35 30 69 39 11 93 54 C5 E4
##$RELAX= 
##$RELAX= 
##$RELAX= 
##$RELAX= 
##$RELAX= 
##$RELAX= 
$$ Bruker specific parameters
$$ --------------------------
##$DU= <F:/spectra>
##$EXPNO= 1
##$NAME= <H-C>
##$PROCNO= 1
##$TYPE= <nmr>
##$USER= <she>
##$AMP= (0..31)
100 100 100 100 100 100 100 100 100 100 100 100 100 100 100 100 100 100 
100 100 100 100 100 100 100 100 100 100 100 100 100 100 
##$AQSEQ= 0
##$AQ_mod= 1
##$AUNM= <au_zg>
##$AUTOPOS= <>
##$BF1= 200.13
##$BF2= 200.13
##$BF3= 200.13
##$BF4= 200.13
##$BF5= 200.13
##$BF6= 200.13
##$BF7= 200.13
##$BF8= 200.13
##$BYTORDA= 1
##$CFDGTYP= 0
##$CFRGTYP= 5
##$CHEMSTR= <none>
##$CNST= (0..31)
1 1 145 1 1 1 1 1 1 1 1 1 1 1 1 1 1 1 1 1 1 1 1 1 1 1 1 1 1 1 1 1 
##$CPDPRG= <>
##$CPDPRG1= <>
##$CPDPRG2= <>
##$CPDPRG3= <>
##$CPDPRG4= <mlev>
##$CPDPRG5= <mlev>
##$CPDPRG6= <mlev>
##$CPDPRG7= <mlev>
##$CPDPRG8= <mlev>
##$CPDPRGB= <>
##$CPDPRGT= <>
##$D= (0..31)
0 0.7 0 0 0 0 0 0 0 0 0 0.03 0 0 0 0 0 0 0 0 0 0 0 0 0 0 0 0 0 0 0 0 
##$DATE= 1754912453
##$DBL= (0..7)
120 120 120 120 120 120 120 120 
##$DBP= (0..7)
150 150 150 150 150 150 150 150 
##$DBP07= 0
##$DBPNAM0= <>
##$DBPNAM1= <>
##$DBPNAM2= <>
##$DBPNAM3= <>
##$DBPNAM4= <>
##$DBPNAM5= <>
##$DBPNAM6= <>
##$DBPNAM7= <>
##$DBPOAL= (0..7)
0.5 0.5 0.5 0.5 0.5 0.5 0.5 0.5 
##$DBPOFFS= (0..7)
0 0 0 0 0 0 0 0 
##$DE= 6
##$DECBNUC= <off>
##$DECIM= 32
##$DECNUC= <off>
##$DECSTAT= 4
##$DIGMOD= 1
##$DIGTYP= 9
##$DL= (0..7)
0 120 120 120 120 120 120 120 
##$DP= (0..7)
150 150 150 150 150 150 150 150 
##$DP07= 0
##$DPNAME0= <>
##$DPNAME1= <>
##$DPNAME2= <>
##$DPNAME3= <>
##$DPNAME4= <>
##$DPNAME5= <>
##$DPNAME6= <>
##$DPNAME7= <>
##$DPOAL= (0..7)
0.5 0.5 0.5 0.5 0.5 0.5 0.5 0.5 
##$DPOFFS= (0..7)
0 0 0 0 0 0 0 0 
##$DQDMODE= 0
##$DR= 18
##$DS= 0
##$DSLIST= <SSSSSSSSSSSSSSS>
$$ [...]
##$SUBNAM0= <"">
##$SUBNAM1= <"">
##$SUBNAM2= <"">
##$SUBNAM3= <"">
##$SUBNAM4= <"">
##$SUBNAM5= <"">
##$SUBNAM6= <"">
##$SUBNAM7= <"">
##$SUBNAM8= <"">
##$SUBNAM9= <"">
##$SW= 18.0517328524113
##$SWIBOX= (0..15)
0 0 2 0 0 0 0 0 0 0 0 0 0 0 0 0 
##$SW_h= 3612.71676300578
##$TD= 16384
##$TD0= 1
##$TE= 0
##$TE2= 300
##$TE3= 300
##$TEG= 300
##$TL= (0..7)
0 120 120 120 120 120 120 120 
##$TP= (0..7)
150 150 150 150 150 150 150 150 
##$TP07= 0
##$TPNAME0= <>
##$TPNAME1= <>
##$TPNAME2= <>
##$TPNAME3= <>
##$TPNAME4= <>
##$TPNAME5= <>
##$TPNAME6= <>
##$TPNAME7= <>
##$TPOAL= (0..7)
0.5 0.5 0.5 0.5 0.5 0.5 0.5 0.5 
##$TPOFFS= (0..7)
0 0 0 0 0 0 0 0 
##$TUNHIN= 0
##$TUNHOUT= 0
##$TUNXOUT= 0
##$USERA1= <user>
##$USERA2= <user>
##$USERA3= <user>
##$USERA4= <user>
##$USERA5= <user>
##$V9= 5
##$VALIST= <valist>
##$VCLIST= <CCCCCCCCCCCCCCC>
##$VD= 0
##$VDLIST= <DDDDDDDDDDDDDDD>
##$VPLIST= <PPPPPPPPPPPPPPP>
##$VTLIST= <TTTTTTTTTTTTTTT>
##$WBST= 1024
##$WBSW= 4
##$XGAIN= (0..3)
0 0 0 0 
##$XL= 0
##$YL= 0
##$YMAX_a= 462824
##$YMIN_a= -473711
##$ZGOPTNS= <>
##$ZL1= 120
##$ZL2= 120
##$ZL3= 120
##$ZL4= 120
##$ABSF1= 10
##$ABSF2= 0
##$ABSG= 5
##$ABSL= 3
##$ALPHA= 0
##$AQORDER= 0
##$ASSFAC= 0
##$ASSFACI= 0
##$ASSFACX= 0
##$ASSWID= 0
##$AUNMP= <proc_1d>
##$AZFE= 0.1
##$AZFW= 0.1
##$BCFW= 1
##$BC_mod= 2
##$BYTORDP= 1
##$COROFFS= 0
##$CY= -3
##$DATMOD= 1
##$DC= 2
##$DFILT= <>
##$DTYPP= 0
##$F1P= 0
##$F2P= 0
##$FCOR= 0.5
##$FTSIZE= 0
##$FT_mod= 4
##$GAMMA= 1
##$GB= 0.15
##$INTBC= 1
##$INTSCL= 1
##$ISEN= 128
##$LB= 0.25
##$LEV0= 0
##$LPBIN= 0
##$MAXI= 10000
##$MC2= 0
##$MEAN= 0
##$ME_mod= 0
##$MI= 1.114404
##$NCOEF= 0
##$NC_proc= 0
##$NLEV= 6
##$NOISF1= 3.799351
##$NOISF2= 2.8
##$NSP= 1
##$NTH_PI= 0
##$NZP= 0
##$OFFSET= 14.38212
##$PC= 1
##$PHC0= -1714.643
##$PHC1= 7.592291
##$PH_mod= 1
##$PKNL= yes
##$PPARMOD= 0
##$PSCAL= 0
##$PSIGN= 0
##$REVERSE= no
##$SF= 200.129724274929
##$SI= 16384
##$SIGF1= 3
##$SIGF2= 2
##$SINO= 400
##$SIOLD= 16384
##$SREGLST= <1H.CDCl3>
##$SSB= 0
##$STSI= 0
##$STSR= 0
##$SW_p= 3205.1282051282
##$SYMM= 0
##$S_DEV= 0
##$TDeff= 0
##$TDoff= 0
##$TI= <>
##$TILT= no
##$TM1= 0
##$TM2= 0
##$TOPLEV= 0
##$USERP1= <user>
##$USERP2= <user>
##$USERP3= <user>
##$USERP4= <user>
##$USERP5= <user>
##$WDW= 1
##$XDIM= 8192
##$YMAX_p= 0
##$YMIN_p= 0
$$ End of Bruker specific parameters
$$ ---------------------------------
##NTUPLES= NMR FID
##VAR_NAME=  TIME,          FID/REAL,        FID/IMAG
##SYMBOL=    X,             R,               I
##VAR_TYPE=  INDEPENDENT,   DEPENDENT,       DEPENDENT
##VAR_FORM=  AFFN,          ASDF,            ASDF
##VAR_DIM=   8192,          8192,            8192
##UNITS=     SECONDS,       ARBITRARY UNITS, ARBITRARY UNITS
##FACTOR=    0.0002768,     1,               1
##FIRST=     0,             0,               0
##LAST=      2.2672688,     0,               0
##MIN=       0,             -473711,         0
##MAX=       2.2672688,     462824,          0
$$ Real data points
##PAGE= N=1
##DATA TABLE= (X++(R..R)), XYDATA
$$ [...]
1883C111m981l530K073M321o65m499j419M121M518r28l927j1M789L066k767m321
1899a049K89M014J071m463m292J313L781J62m364k389L145M830l14l852o34M384
1915A632L769j637m171m38M135J784l717m681M60L674Q66m198l369K233M526M52
1931A320l587j502L897M456p67m005p60L679K727k593m903m60L480J480l854l861
1947e253J056M157J322l488k135K927M628L26l483j628L579L475j600m695j210
1962b022L247J937l059m577O3L936J684l109k935K025M758J208l185j966L085
1977A090L996n96m331j769K755K697k327m779q44L371K020k576l617R32M699J766
1993B487k639k337K219M451N67l630k369K325L064j492m493j903K857K462k251
$$ plain form
1883 3111 -1870 -5400 -3327 994 329 -4170 -5589 -1468 3050 2122 -1805 -1816 2973 6039 3272 -1049
1899 -1049 -760 3254 4325 -138 -4430 -3117 664 826 -3538 -5927 -2782 2048 1734 -2118 -2752 1632
1915 1632 5401 3764 -407 -845 3290 5074 1357 -3324 -2864 810 1676 -2522 -5891 -3658 868 1320
1931 1320 -2267 -3769 128 4584 3817 -188 -948 2731 5458 2865 -2038 -2498 982 2462 -1392 -5253
1947 -5253 -4197 -40 1282 -2206 -4341 -1414 3214 3540 57 -1571 2008 5483 3883 -812 -2022
1962 -2022 1225 3162 103 -4474 -4411 -475 1209 -1900 -4835 -2810 1948 3156 -29 -1995 1090
1977 1090 5086 4490 159 -1610 1145 3842 1515 -3264 -4108 -737 1283 -1293 -4910 -3978 721 2487
1993 2487 -152 -2489 -270 4181 4748 1118 -1251 1074 4138 2646 -1847 -3750 -893 1569 -682
2008f82l957J51L997K401k104k900J764M540J373l099k678J901L546m35m443k314
2024b939K223K597j612m114j013L400K946j776l213R98M427K183k346k991J503
2039B73L734N70l876l127J648L014p27m470j856K821K983j075l505k1M116K970
2055C472j830k890P15L931J457l038l499J065L180j02m104k691J947L171n72l620
2071c408r01L538L338j005k950P0L857K195k303l438M99L218P47l721l379J094
2087b549L318j13l592j715K515L768j73l110m37L628K889j463l373k57L308J360
2103D004l064l694M32K997N61l359k630K007L694K70l007j240L104L665o11l246
2119a17q30L157K206k321l798m65L008J034l113l123J022L526Q29k722j842K542
$$ plain form
2008 -682 -4639 -4488 -491 1910 -194 -3094 -1330 3210 4583 1484 -1194 707 4253 3818 -625 -2939
2024 -2939 -716 1881 269 -3845 -4858 -1458 1488 -288 -3501 -2503 1924 4107 1761 -1230 273
2039 273 4007 4577 701 -2426 -778 2236 1509 -2961 -4817 -1996 987 -88 -3593 -3614 502 3472
2055 3472 1642 -1248 -533 3398 4855 1817 -1682 -617 2563 2461 -1643 -4334 -2387 784 212 -3408
2071 -3408 -4309 -771 2567 1562 -1388 -1318 2539 4734 2431 -1007 -508 2710 3457 -264 -3643 -2549
2087 -2549 769 656 -2936 -4651 -2136 1632 1459 -1651 -2088 1540 4429 2966 -407 -664 2644 4004
2103 4004 940 -2754 -2322 675 1236 -2123 -4753 -2746 948 1218 -1789 -3029 75 3740 3129 -117
2119 -117 -947 2210 4416 2095 -1703 -2168 840 1874 -1239 -4362 -3340 186 1015 -1707 -3549 -1007
2135a007L863J25l053j109K745K904j459l749j069K605J720k674l557R2L255J424
2151A056k678k265J782L775J004k589j689K536L258n71l599j449K341K078j940
2166A050l911m72K638J822k241k874Q87L880J624k432j892J774L540N82l177k018
2182a220K031K435j257l744j409K195K303j942l181J45L449J897j770k264J350
2197i82L678J108k520k273J442K740M0l811k131J852K379j334l427p77K874K549
2213A407j355k698O59L684J925k033k482R61L148M74l259k531J198K581n73l587
2229b481j611K370K746r25k711k14L143K691j322k621N77L054J259k507k925N49
2245i28K826ql262k254J536K650k80k931p54K873K854p00k458j27K869K139j906
$$ plain form
2135 -1007 2856 2981 -72 -1181 1564 4468 3009 -740 -1809 796 2516 -158 -3715 -3623 -368 1056
2151 1056 -1622 -3887 -2105 1670 2674 85 -1604 932 4190 3619 20 -1429 912 2990 1050
2166 1050 -2861 -3333 -695 1127 -1114 -3988 -3101 779 2403 -29 -1921 -147 3393 3975 798 -1220
2182 -1220 811 3246 1989 -1755 -3164 -969 1334 -608 -3789 -3644 -195 1702 -68 -2332 -982
2197 -982 2696 3804 1284 -989 453 3193 3233 -578 -2709 -857 1522 188 -3239 -4016 -1142 1407
2213 1407 52 -2646 -1987 1697 3622 1589 -893 68 3216 3690 431 -2100 -902 1679 1106 -2481
2229 -2481 -4092 -1722 1024 99 -2612 -2826 317 3008 1686 -935 -358 2696 3955 1448 -1477 -928
2245 -928 1898 1890 -1372 -3626 -2090 560 280 -2651 -3405 -532 2322 1622 -836 -963 1906 4045 2139
2262B139l174K61K627O32k820k792P33K834J78k888j412K168L070%k723n15K929
2279A247K413j178k866m30K568J352k382l081J68K522P75k782k136J477L140N80
2295A387k470j019K237L014k58k917r63K544J868j787l159n13K321J126k224k768
2311c581O58L117R67k176j666J887L279K46k497j159K043K315r63l347j065K280
2327C38J462j845k906k06K725J465j864k114J232L237R93k076j630J786K716k48
2343C065k965j532J720J744j184l204q18K410J636j396k491M52L046J733j637
2358E79j965J358K874L69k379k003J298K262p75l162j334J718K033r83k622k34
2374b966K660J991j069k060N41L078J269k092k224R74K296qk721k288J231K305
$$ plain form
2262 2139 -1035 -774 1853 2485 -335 -3127 -2394 440 618 -2270 -3682 -1514 1556 1556 -1167 -1682 1247
2279 1247 3660 2482 -384 -814 1754 3106 724 -2357 -2189 333 1108 -1674 -3810 -2333 807 1387
2295 1387 -1083 -2102 135 3149 2891 -26 -989 1555 3423 1636 -1523 -2036 285 1411 -813 -3581
2311 -3581 -2923 194 1161 -1015 -2681 -794 2485 2731 234 -925 1118 3433 2470 -877 -1942 338
2327 338 1800 -45 -2951 -3157 -432 1033 -831 -2945 -1713 1524 2517 441 -1189 597 3313 3065
2343 3065 100 -1432 288 2032 848 -2356 -3174 -764 872 -524 -3015 -2563 483 2216 579
2358 579 -1386 -28 2846 3215 836 -1167 131 2393 1618 -1544 -2878 -1160 873 -110 -2732 -2966
2374 -2966 -306 1685 616 -1444 -903 2175 3444 1352 -872 102 2398 2390 -331 -2619 -1388 917
2390I17o39k733r31K394K174n44k141o6K958J685j453k188M67K232P90k529k291
2407a898O29K241m7k696j596J655K591m15k110n21K577K229p73k200j32K465J155
2424C154j927k554Q2K220L58k485j899J022K359K03k067j043J935K694j45k206
2440b99m96K141J835j236k707l11K072P49j916k395J41K560O92k168j470J481
2456a327K690L41j858r93J818K356p05k492q61J983J321j641k724j39K091R14
2472G74j650k104R50K642R53j802j276J429K659%k282j245J601J746r86k736q86
2489b213J948J269j362k374K06K566J320j483j604R94K744O81j939j446J139K001
2505B447m00k639j338J492J648j216k340m61K049J775j023j997N63K676J225j530
$$ plain form
2390 917 278 -2455 -3386 -992 1182 638 -1503 -1569 1389 3074 1621 -567 -100 2132 2922 393 -1898
2407 -1898 -1269 972 925 -1771 -3367 -1712 879 464 -1646 -2167 410 2639 1866 -334 -466 1999 3154
2424 3154 1227 -1327 -1245 975 1333 -1152 -3051 -2029 330 533 -1534 -2577 -642 2052 1907 -299
2440 -299 -795 1346 3181 1945 -762 -1073 999 1748 -168 -2563 -2422 138 830 -1338 -2808 -1327
2456 -1327 1363 1704 -154 -1147 671 3027 2322 -170 -1031 952 2273 632 -2092 -2231 -140 774
2472 774 -876 -2980 -2030 612 1565 -237 -1513 -84 2575 2575 293 -952 649 2395 1409 -1327 -2213
2489 -2213 -265 1004 -358 -2732 -2526 40 1360 -123 -1727 -733 2011 2692 753 -693 446 2447
2505 2447 2047 -592 -1930 -438 1210 -6 -2346 -2807 -758 1017 -6 -2003 -1440 1236 2461 931
2521I31j725Q06K387J84k334j829J078J791o06k556q89J670J901p99j998M4K386
2538D42J774j092j907N55K232P33j975j871O41J830j63k294j523J201J833k66
2554A50j943o99K217J998o79j843N1K096J436j276k245J64J903L97k010j950O97
2571a536J995m1k022j123J670K173J03j835n04K084J657q76k017k46J755J040
2587B277j829k181J12J949L11j753j614J072K381J78j666p66J692K101k60k023
2603a9o79J787J317j233k253m04J658Q52j644j858N22K098O85j597j075J398K167
2620A722J92j652r54J459J716q87k143q17J612R93j275k222J06J888J042j278
2636d98j505R18K237O34j479j017J077J943k43k056j171J194J334q91k166o23
$$ plain form
2521 931 -794 12 2399 2583 249 -1580 -502 1289 683 -1873 -2762 -1092 809 10 -1988 -1944 442
2538 442 2216 1124 -783 -228 2004 2737 762 -1109 -468 1362 1199 -1095 -2618 -1417 416 150
2554 150 -1793 -2492 -275 1723 1044 -799 -748 1348 2784 1508 -737 -573 1330 1727 -283 -2233 -1536
2571 -1536 459 418 -1604 -2727 -1057 1116 1219 -616 -1120 964 2621 1745 -272 -518 1237 2277
2587 2277 448 -1733 -1621 328 639 -1114 -2728 -1656 725 903 -763 -1529 163 2264 2004 -19
2603 -19 -698 1089 2406 1173 -1080 -1484 174 1026 -618 -2476 -1954 144 829 -768 -1843 -445 1722
2620 1722 1914 262 -692 767 2483 1596 -547 -1364 248 1241 -34 -2256 -2150 -262 780 -498
2636 -498 -2003 -1085 1152 1786 307 -710 367 2310 2067 11 -1160 34 1368 477 -1689 -2312
2652b312J791J181j007j709L10K182J226j110j483R29J997L22j902j179Q99J625
2668A760n19k332r76J306J399p24j845j72J946J425j010j343N20K092Q55j574
2684H08j547P56J606kk158j306J120J459n46j985m69J607J494n06j438rK159J067
2702B110j014j468J53J856L16j689j542M06J535j39j713j175J201J705j46j568
2718a172k42J753J555o13j698R2J624Q62j323j916K19J518L99j985j276R00J785
2735D82j61j419o89J465J740k17j539j77J521J152r51j702j67J448M79j525j643
2752a903K28J880L68j522j037J192J740K59j572n24J510J565o68j687m17J268
2768F80Q15j112j906r8J657N97j317j279O49J862N73j447p89J372J610j61j594
$$ plain form
2652 -2312 -521 660 -347 -2056 -1746 436 1662 552 -931 -2 1995 2317 415 -764 135 1760
2668 1760 1241 -1091 -2067 -761 638 -86 -1931 -2103 -157 1268 258 -1085 -565 1527 2382 808
2684 808 -739 17 1623 1621 -537 -1843 -723 736 190 -1795 -2264 -657 837 331 -1107 -1116 1043 2110
2702 2110 1096 -372 -219 1637 1953 264 -1278 -872 663 524 -1189 -2364 -1163 542 396 -1172
2718 -1172 -1414 339 1894 1281 -417 -325 1299 2161 838 -1078 -859 659 1058 -927 -2203 -1303 482
2735 482 321 -1098 -1787 -322 1418 1201 -338 -515 1006 2158 1207 -495 -662 786 1265 -260 -1903
2752 -1903 -1675 205 573 -949 -1986 -794 946 1205 -367 -891 619 2184 1516 -171 -588 680
2768 680 1495 383 -1523 -1621 36 633 -684 -1963 -1314 548 1121 -326 -1115 257 1867 1706 112
2785A12p24J073J283q35j872m72J242R31j208j367J26J766R20j118j199P84J955
2802A397L42j361r67J017J314l09j860q35J014J214r40j757k4J437J062p48j380
2819a384M58J944O66j176j122P05J527J05j710j057Q65J024l79j721o27J289J255
2836F62o72j386R0J651J264r38j280N17J510N78j535j239O22J169k00j654j041
2853a882J126J115k12j464l39J552J329o67j146R3J533Q34r38j475L85J223J96
2870A263j467j299N85J227j25j384n51J091J400j04j267k29J582J060o24j511
2886c53J53J114N38j376j311K03J373J71j369r19P21J638P7j331l76J338J106
2903A397k45j228l96J313P88r77j596J2J265M48j322j177M56J476K21j060o56
$$ plain form
2785 112 -612 461 1744 909 -963 -1435 -193 738 -470 -1837 -1711 55 975 -143 -1342 -558 1397
2802 1397 1739 378 -589 428 1742 1433 -427 -1262 -248 966 26 -1731 -1755 -318 744 -4 -1384
2819 -1384 -926 1018 1684 508 -614 91 1618 1723 13 -1044 -179 845 466 -1255 -1882 -593 662
2836 662 -10 -1396 -1306 345 1609 671 -609 -92 1418 1996 461 -778 -156 1013 813 -841 -1882
2853 -1882 -756 359 147 -1317 -1656 -104 1225 558 -588 -495 1038 1872 934 -541 -156 1067 1263
2870 1263 -204 -1503 -918 309 184 -1200 -1751 -660 740 636 -631 -860 722 1782 1158 -353
2886 -353 -200 914 1452 76 -1235 -1032 341 512 -857 -1776 -1055 583 660 -671 -1047 291 1397
2903 1397 1152 -76 -472 841 1629 652 -944 -932 333 781 -541 -1718 -1262 214 435 -625 -1281
2920a281J068J471Q8j373m40J073J104o87j559j92J048O57j129j340O9J345O17
2937E39r85r81O32J583L71j134o29Q49J502k10j636o58J033O74p21j459j74J139
2955b65P74q86j050L95J425P11r09r08O73J453Q9j282q35Q28R20k98j656n96R48
2974d69J044n76j426M3J417R22p78r67M71J375N36j198q97O53J049k02j306q62
2992a171P02R61l93j310j37J037J019m37j060J31J361Q07q99j095L47J278J13
3009A254j271q69M16J051k36j359o05R66J177l07j118q7J288R99m72j297J96J445
3027A171L74j234j080K71R94K79j280j062P29J094j09r83m00J063J287l18j140
3044c44P1R94P79p04j330j8J204L42j253r62K21J095K03r60o78P23J335j3r29
$$ plain form
2920 -1281 -213 1258 1346 -27 -467 606 1710 1023 -536 -728 320 977 -152 -1492 -1423 -78 539
2937 539 -446 -1427 -795 788 1159 25 -604 245 1747 1537 -99 -757 276 950 229 -1230 -1404 -265
2955 -265 509 -377 -1427 -1032 393 1104 195 -713 -40 1413 1502 220 -615 213 1133 835 -821 -1417 -469
2974 -469 575 -1 -1427 -1384 33 955 177 -790 -319 1056 1592 394 -503 150 1199 997 -309 -1171
2992 -1171 -469 492 99 -1211 -1348 -311 708 271 -789 -658 703 1510 611 -484 -137 1141 1254
3009 1254 -17 -886 -470 581 345 -1014 -1619 -653 524 217 -901 -988 300 1299 827 -470 -274 1171
3027 1171 1545 311 -769 -498 496 775 -505 -1567 -838 256 147 -836 -1236 -173 1114 796 -344
3044 -344 -273 721 1500 796 -534 -552 652 994 -259 -1221 -1000 95 298 -662 -1340 -617 718 705 -224
3063b24l56J052J036m95j167k80J037L73q63j167N5J049L42q81q89M37J417K25
3081G01r96n61J086J173l59j067l81Q88Q29q03j347r3R43M89q25r83J84J268N45
3100F91r21p06P42J166K10r54o63Q15R26l57j219o10Q31O41p07j018p2J083O75
3119E53p48p82M44J267M74q96p97P10R75n3j193p61P30Q85n71j305k74J044O80
3138C82n42q57J45J216N73o68p67O26R47L10j153q21N88R14j64j389n76P10Q19
3157B93k41j064o9J189O67m73q13K15J134L98p42r37L34R94r0j052q23M68J010
3176C98j77j207k04R72Q94l12r62R7J026O89n29r97K66P93K06q42j013K99Q77
3195B74k5j078m75P09J001o8r41k9R64P17l35r53oR58L45o83r22J3R33N4q21q17
$$ plain form
3063 -224 -580 472 1508 1013 -154 -434 603 976 113 -1054 -999 50 392 -489 -1378 -941 476 701
3081 701 -295 -856 230 1403 1044 -23 -404 484 1313 510 -837 -930 13 502 -323 -1306 -1122 146 691
3100 691 -230 -936 -194 972 1182 228 -435 380 1306 949 -270 -880 -49 592 -115 -1133 -1205 -122 553
3119 553 -195 -977 -533 734 1208 312 -485 225 1200 1147 -46 -807 -77 808 237 -1068 -1342 -298 382
3138 382 -160 -1017 -872 344 917 249 -518 108 1055 1365 212 -609 -21 893 729 -660 -1236 -526 293
3157 293 52 -1012 -1081 108 775 302 -511 -296 838 1236 494 -443 -109 885 795 -257 -1080 -612 398
3176 398 221 -986 -1190 -218 676 364 -598 -501 525 1214 685 -312 -46 747 953 111 -902 -603 274
3195 274 249 -829 -1304 -595 406 338 -603 -632 332 1049 714 -239 -245 713 1058 375 -547 -534 399 453 -368 -1185
3217a185L70J010L1p46l79P62J068r1j023k16J010O11o09r80lP45K91q94q41K43
3237h26Q56K03p85n47O82J062ro65l96P96Q83l58j135k67P65N98o64j172L9R08
3257c2L76p44p63N93J019J43o63m07N45Q30lq60m07O32N74n64r27k50Q18M36n58
3278b12q65J64J075K87m78o50N89R13J85o80o92N00Q74l81j001m13O07O26m33
3297A5r68o5R35M89n02o85L29R31N44p58n52L97P99j9r07p09N68O71l51q67l04
3318a009O98P30m16o63j4J135L78n38o50L89P82L6p19o88M52N51o2r11m75O91
3338c03N36k41o63p1O80P97l08q28L78O05L11m74p65J96O27L0p11o80M59N52o4
3359F3o55m06P70P07k34n22j16R06M78m08q61J69O72J76p71n77N6O57j3n34m76
$$ plain form
3217 -1185 -815 195 226 -520 -899 -137 931 840 -183 -399 611 1222 613 -367 -370 375 666 -228 -1069 -826
3237 -826 30 233 -552 -1099 -417 645 636 -29 -425 371 1254 896 -239 -506 259 857 193 -979 -940 -32
3257 -32 344 -400 -1163 -570 449 592 -71 -478 67 897 894 34 -373 259 833 269 -658 -908 -90 346 -212
3278 -212 -1077 -913 162 449 -29 -679 -90 823 1008 328 -364 136 1010 629 -372 -785 -178 448 15
3297 15 -953 -1018 -83 406 -96 -781 -452 479 1023 265 -287 110 909 890 -17 -726 -158 513 162 -705 -1009
3318 -1009 -311 419 3 -660 -674 461 839 301 -349 40 822 858 139 -549 -97 454 392 -519 -994 -303
3338 -303 233 -8 -671 -742 -62 735 427 -401 -23 582 893 419 -346 -150 477 507 -204 -884 -425 127 63
3359 63 -592 -998 -228 479 245 -277 -393 513 991 583 -278 -109 563 739 -32 -609 -553 104 91 -443 -919
3380i19M49P88o7n44k77P57O27k69o19j19O83L07n92p98Q2O52J52n45p73M20Q25
3401B20Q5o71k28M90Q44l6q19m9O00N07m09q27j22N25K06m63o43J0Q85J80o84
3422c99k81L60Q37M7n70l18O34M42j72o35l86N86L84p02n30QO94L00o12m58L13
3443d58Q89R4n08k75L20O67J5o82m08M46N22l48p22k31O02L93n08o29J90P30K55
3464C54k71m72J96P42K59n57n47K68O32j47q17k51M50M56k59o97q0O86M07l38
3484A4n33J82P45L63n14n03K76N82J16p77l88K43N11k02p05j88O12M73l26m15
3504d34m8Q51K92l97l89K59L64K27n36n60K70N18k19n87m00M22O01j49n69j33
3524f17P10M24j96n09k3P33K69n48m71P0M77O9m77o79L45N06J4o53j04N25N34
$$ plain form
3380 -919 -470 318 251 -293 -570 187 814 545 -74 -193 490 797 205 -593 -511 141 293 -252 -1025 -605 220
3401 220 305 -366 -594 -104 740 704 -115 -164 436 943 534 -293 -415 110 316 -147 -790 -780 105 285 -399
3422 -399 -680 -320 517 564 -6 -324 310 752 580 -55 -441 145 529 -173 -703 -695 -1 299 -313 -771 -458
3443 -458 431 525 17 -258 62 729 744 62 -346 100 622 274 -448 -679 -77 316 -192 -821 -631 99 354
3464 354 83 -389 -193 549 808 251 -296 -28 604 457 -360 -611 -161 295 36 -661 -741 -55 352 14
3484 14 -519 -337 408 771 257 -246 30 612 728 -49 -437 -194 317 115 -590 -778 -166 307 -19 -434
3504 -434 -482 369 661 264 -125 134 498 725 189 -371 -101 417 198 -389 -789 -367 234 85 -484 -617
3524 -617 93 517 321 -188 -211 522 791 243 -228 -158 319 388 -89 -768 -423 83 97 -556 -660 -135 399
3545C99j56n50R6M74M60k23o68n4N22J30n25n06P0O77l7m24l67K79P22Q1o38j02
3567c40N37M65k42m27j73O15J87n51m41Q5L88J32n92l31K12O21K5m55j42L91O44
3588F08j13n06k08M85L34l58n89p7O55l8l45l75n9O05K74m97m03M66N31Q8n53
3609g5j66M89L26j28m76j85L04L09l51o10J61L06K71l73l91K88M91K07l35k66
3629b04K72M56m7m54l41L86M03l24n98n6M27K54k75m21O0O02K47m38k62K95L99
3650C81J11m03l45K91M38k42l93l38M79J94k71l72QM17L17k29l55J27O01K25m52
3671A89l11J58M51l9n73k30K93J36j6m30j19M59K31j13o08L46M58K26l55k37Q0
3692dL61J20l77m55L07K81j07n19j30L50K84l0m69P6M60K43j59l16J06K77K13
$$ plain form
3545 399 243 -307 -211 263 723 500 -168 -222 300 430 -95 -601 -531 146 109 -315 -682 -403 319 400 -238 -340
3567 -340 197 662 420 -7 -180 435 622 71 -370 -285 103 235 -357 -688 -476 145 170 -285 -427 -36 608
3588 608 495 -11 -219 266 600 242 -347 -424 231 193 -152 -527 -586 19 293 -204 -607 -141 390 478 -75
3609 -75 -241 248 574 446 -30 -215 89 398 47 -563 -402 -96 175 -198 -589 -301 190 397 62 -204
3629 -204 68 524 477 23 -318 68 471 147 -451 -507 -80 174 -101 -522 -462 140 387 -51 -313 -18 381
3650 381 492 89 -256 35 473 231 -162 -500 -21 173 -98 -470 -462 -45 272 43 -312 -185 416 641 189
3671 189 -122 36 487 448 -125 -355 -62 74 58 -372 -491 -32 199 86 -522 -176 282 508 153 -84 -4
3692 -4 357 477 100 -355 -48 233 126 -393 -523 -173 111 81 -388 -312 148 391 232 -84 22 299 512
3713E12m02k77J45L27j02m83j29J08M72k54k37j57N14J51k8m15J17M52O3j53l86
3734a62J31L07Q6n39j72L0M97p2l04l16L53L52J0m09J0L96K35k11m38J95L48N2
3756C79l56l55M9K46K80n10j04J60L54j1l75j44M75J90mk80k10M57K40l98k36
3777a53L1K08P1l00j60K3L48L7l17j90K94L80L8l42j55L57K48k06l34l6K63P6
3799A81k36m19R5M20J12k94k05J44M10L3k90j16K22L29j95k00j11J83K60k93k20
3820a90j52L45J38k41k70K14K65M4j88j22K44K65L8l50j62K68J31j22l12j11L54
3841H6Kj85l59K18K00J60k66j38L86J30K9j94k33L33J55j43k95o6K66J03k42k12
3863b65l7M31rj27l45K40K71J99l92j20K71J65o9k18p4M8K14j82k08j67L54K21
$$ plain form
3713 512 110 -167 -22 305 203 -280 -409 -301 171 -83 -320 -477 37 188 160 -255 -138 314 377 224 -162
3734 -162 -31 276 362 -177 -349 -319 178 106 -198 -514 -161 191 201 -208 -198 198 433 222 -216 -21 327 379
3756 379 23 -332 -283 -37 243 -267 -371 -211 143 132 -243 -387 88 278 274 -6 -216 241 481 83 -153
3777 -153 -122 86 157 -143 -303 -280 68 105 -212 -402 -108 272 310 -32 -187 170 418 212 -122 -158 105 181
3799 181 -55 -474 -379 41 153 -141 -346 -202 208 241 -49 -165 57 386 191 -9 -120 63 323 30 -190
3820 -190 -342 3 141 -100 -370 -156 109 153 -35 -157 87 352 390 40 -122 146 277 155 -157 -268 86
3841 86 88 -97 -456 -238 -38 122 -144 -282 104 234 263 69 -164 169 324 181 -114 -180 86 189 -53 -265
3863 -265 -302 129 120 -7 -352 -112 159 358 -34 -154 117 282 213 -5 -79 -31 183 1 -207 -374 -20 201
3885B01j64l75J19K28K47j96k65J52K96k0j61l06K43K53j06k54j32J93J26j24
3905d5k69Q0K77J23j02k13J40K68L3k67j23Q4K83P8m27j63J25J93n7k50l8J63
3927a07K10q5j71j8M38P0j18k50n4L19L7k83j82K55P2j01j58j35J66K02n0k38
3949a81L7K14J49k02j09J69J72ko3l61J62J97j45j17k33J39J30J58k46l8K02J69
3971B01p8j79m3K10K47j74k01NJ32M2j55k30N1J47M4j58j48J77L57j40j08j47
3993a48K88J24j57j38j6J53J02l04Rj22L00M8l37K8Q4J25Ll4l17K62L06m5m07
4016a93J04K02O8k10j35Q0J57N0k14L3j23K29J3j31n3P0K31K5j79j4J55n3O2l44
4040a70J12Q1L6p5k47R9J88J2j57J2P6J41k1r8j92K43J00Q5l44N7P3J81k37j72
$$ plain form
3885 201 37 -338 -219 9 256 60 -205 -53 243 223 62 -244 -1 252 146 -108 -240 -47 79 -45
3905 -45 -314 -234 43 166 64 -149 -9 259 292 25 -98 -14 269 347 -80 -243 -118 75 18 -232 -270 -107
3927 -107 103 18 -153 -171 267 337 219 -31 -85 234 271 -12 -194 61 133 32 -126 -261 -95 107 57 -181
3949 -181 -144 70 219 17 -92 77 249 247 184 -177 -15 182 37 -80 -313 -174 -44 114 -132 -170 32 201
3971 201 123 -56 -99 111 358 184 -17 -12 120 162 7 -223 -172 -25 19 -139 -287 -110 247 107 -1 -148
3993 -148 140 264 107 -31 -47 106 208 -96 -87 -209 91 139 -198 -170 -86 39 42 8 -309 -47 259 214 -193
4016 -193 -89 113 181 -29 -164 -84 73 123 -91 -58 -181 48 61 -70 -123 -53 178 203 24 10 165 112 174 -170
4040 -170 -58 23 59 -16 -263 -164 24 36 -121 -109 -33 108 87 -11 -203 40 140 225 -119 -62 11 192 -45 -217
4064b17J79J2R4o9j36J18K05q7r9j15J61J82j00j05j04J43Q5q8k69L3J87J07j23
4087fk36J23K71r8L1j79L5K61J7j35j39M6K00n0k07L1j7J58q0j71l5J70N0j07
4111f7j21O8K03K9r7j30J44J34Qj50k00K39J3n1j47K6K28k6n4k56P5K44ol3j54
4136h1J22J77p6j45j23K18J4k1k05M2K2J86j44j78j09L69J12r9k13J41P7O9j08
4159D7r7LJ52n2r0k3M6J8l4j16j15K44K10j72j89J01J80O7l07N1R6P9J8k00n9
4184a42J73M4K2k50J07J03M9j9j73j9K58q0R9j80pJ84n3o7r6K1J21o1l3k76K53
4209b2R4j04j75k7K30J36j95k4k1K65k1j56l9K3J60J2k09j03R6k9O7q5o2J09J18
4234C8Oj14rK23R4p5k35j9K03L8j32q9M5K3j0j02j7L5J53m3j15j3J83J1m2j16
$$ plain form
4064 -217 -38 -26 68 -1 -137 -19 186 99 0 -115 46 228 128 23 -81 62 147 59 -210 -177 10 117 -6
4087 -6 -242 -119 152 54 85 -94 -59 202 219 84 -55 -9 191 141 -66 -35 -52 106 26 -145 -180 -10 40 -67
4111 -67 -188 -120 83 112 15 -115 29 163 171 21 -179 60 73 22 -125 -99 129 103 49 -207 -132 112 106 73 -81
4136 -81 41 218 142 -3 -126 92 106 85 -120 -78 -56 130 -14 -192 -301 68 180 81 -132 9 86 155 47
4159 47 -50 -47 105 53 -37 -60 -14 4 -30 -146 -261 -17 193 21 -168 -67 113 180 -127 -76 20 99 117 -83 -142
4184 -142 31 75 97 -153 -46 57 106 87 -86 -105 153 73 172 -8 -15 169 116 49 -47 -26 95 34 1 -275 -22
4209 -22 72 -32 -207 -234 -4 132 -63 -87 -108 157 136 -20 -59 -36 124 136 -73 -176 -80 -109 -42 -127 -189 -80 38
4234 38 44 -70 -79 144 238 163 -72 -91 112 150 18 -71 -26 -3 -13 -115 -132 -97 56 13 -102 -115 68 79 37 -79
4260g9q0K67J42j90j15j22L03J0j37j68nK28k0j22J3J53J01j03j91M4Q9K49j93
4283G4j55lJ94p4o7j16J9J43lo8o4JK26rm8j24L6J31r2o6L1J40J10j90j26Q6L3
4310A9%j60m7J17J89R2k50j00L05M0j28r9pP4M6rj50M6K3Lj48j52K47J30rn3r6
4337g7l0K00K4j22j10J59J53p5k08J3J12MO7k16j6J1L07j60r1N8J71Qj42j42J43
4362D1J70l5j38j38J00Q0j1j82j5J04J44j00j62k4K17K3j68o4J63J42L9j38j40
4385i2J01M6r8qj50J10J26j04j22P0J94J01j91p4J48L1N2n8j09J7J28n7r5j63
4409a97J58J70j71j54o7L28k3L4k67M4K72L9j75j34J48J16P5j81j75J53J00n4
4431C9j40j62J65L01j59k08J82M3J19j19j67R9J0J20j28m1K7Q5n7j16j18J03K60
$$ plain form
4260 -79 -159 108 250 60 -55 -177 126 136 -1 -169 -174 54 34 -88 -75 78 179 76 -115 -71 18 267 74
4283 74 -81 -84 110 36 -31 -147 -128 15 12 -56 -120 -119 107 98 50 -74 -38 93 1 -65 -34 106 216 26 -100 -14 19
4310 19 19 -141 -188 -71 118 210 -40 -140 165 205 77 -22 -29 45 91 82 -68 -22 1 4 -144 -296 -49 81 72 19 -77
4337 -77 -107 93 117 -5 -115 44 197 122 -86 -73 39 43 110 -106 -122 -111 196 36 -55 3 174 182 40 -102 41
4362 41 211 176 38 -100 0 80 69 -113 -128 -24 120 20 -142 -166 51 74 -94 -158 5 147 186 48 -92
4385 -92 9 55 -43 -51 -201 -91 35 -69 -191 -121 73 174 -17 -91 57 88 140 82 -27 -10 118 61 -34 -197
4409 -197 -39 131 -40 -194 -261 67 44 78 -189 -145 127 166 -9 -143 5 121 196 15 -160 -7 93 39
4431 39 -101 -263 -98 203 44 -164 18 61 180 61 -106 -7 3 123 -5 -46 -19 66 9 -107 -225 -122 138
4454A38j06j25k1J94J12j45k36K50L1J2l4j31J59P5j32j98r6P4J78l5j22J0J08
4477d0J56qk22K3J06J70l0k81J29J10k5r6j67R7K92k26j51r2K23J10l8q9j08K13
4501E6R0r0p8N4J22m7n4j06r8N0N3p1k4P1N1L7o7q4J70J59J5k49k5J01J43k7l01
4528a49M2R5J31k33k4p4J94J32j70r8J39J88o8j95J0J17K08j01k87P1J8J21m4
4551B3j51j53L03O7o7k94K11K07j0j48o4J54J41m7k55J2J33P6q6n8k56L50J11
4574A99k68k13n7M79O5k04p8O5K69j13j31j13J21J69j77k5j47Q6J44Ql47K6K65
4597B3J52j40j28Q6K14J0k19p7J23J98m0j73k11Q9K64j83k11m3L18mp6j25R5J66
4621A08jp4k07K01J11J46k46k35J67J95n3j56j98K10R4k7j34MK29N1r6k26j9L20
$$ plain form
4454 138 32 -93 -114 80 192 47 -189 61 92 104 70 -61 98 173 41 -157 -253 -179 -1 -36 -158 -148 -40
4477 -40 116 108 -114 -91 15 185 155 -126 3 113 88 -8 -175 -78 214 -12 -163 -255 -32 78 40 -49 -157 56
4501 56 146 56 -22 32 154 107 53 -53 -151 -101 -48 -119 -143 -72 -21 16 -51 -135 35 194 209 -40 -65 36 179 152 -149
4528 -149 -107 -12 119 -114 -138 -212 -18 114 -56 -154 -15 173 105 -90 -80 37 245 144 -143 -72 -54 67 23
4551 23 -128 -281 22 89 22 -272 -61 146 136 -12 -76 78 219 172 -83 -71 62 138 52 -6 -262 88 199
4574 199 -69 -282 -339 140 205 1 -77 -12 257 144 13 -100 21 190 13 -12 -159 -73 71 79 -268 -242 23
4597 23 175 35 -93 -7 207 217 -2 -79 44 242 202 29 -182 -93 171 -12 -223 -266 52 48 -28 -153 -58 108
4621 108 107 33 -174 27 138 284 38 -197 -30 165 112 -44 -242 -32 62 35 -99 -95 134 185 89 -137 -156 164
4645A64J53k76j29J18J29n7j43n7QK07m5l09J31J22J57j9k00K9J00J68j64j80
4667i3l9K31Q9j40k87n7L95Nk56j42L09R0K5j57j42K06K01m9k40PJ32Q4k36j48
4691b12l4L25Kj79j28M0K25J96j78k55L17P1j2k11r3J63J02K3k62M0K0J25j00
4714a5j51L3L4K13o0j68N9K87k4n9l60L44Q1Rk78r7J97J25j20k29KK82j8j27j45
4739a85J22K47N9k56n1J48K12j62j69j26PL24o2k03j88K50J40j45l21K99K07K3
4761A70n5l00J99J48O5k00j20N2P9O7k15j02J71J49nl44QJ80K54j23k18O8L00
4784B28k7j28j08jJ52J34l08j36R9J95kl37N0K01Ok4j80K8J49K94j33k81J54K39
4808B64o0k47j15J02J67m1j84k06J40L22k6k45j3J99K18j77j73%K40J13j92k76
$$ plain form
4645 164 317 41 -88 30 159 102 -41 -98 -90 117 72 -237 -106 16 173 154 -46 -17 83 251 87 -93
4667 -93 -132 99 188 48 -239 -296 99 104 -152 -294 15 105 130 -27 -169 37 238 189 -51 -44 88 172 -64 -212
4691 -212 -246 79 81 -98 -226 -186 39 235 57 -198 119 190 178 -33 -126 37 139 162 -100 -60 -40 85 -15
4714 -15 -166 -133 -99 114 54 -114 -55 232 208 149 -211 133 214 223 -55 -152 45 170 50 -179 -177 105 87 -40 -185
4739 -185 -63 184 243 -13 -64 84 296 134 -35 -161 -154 170 108 -95 -283 -33 107 -38 -359 -60 147 170
4761 170 115 -185 14 162 227 27 -93 -41 38 105 -110 -212 -41 108 103 -241 -233 -53 201 78 -140 -72 228
4784 228 201 73 -35 -36 116 250 -58 -194 -95 100 98 -239 -189 12 18 -6 -186 -158 -9 285 152 -129 25 264
4808 264 204 -43 -158 -56 111 70 -114 -320 -180 142 116 -129 -142 57 275 98 -75 -75 165 278 86 -190
4830a90l3L17O1j80j79m7K31Q2k00l8J48J72nl44NL30J76j55k44J9K42K6j74k33
4854b13RK97J5j12l03J86K08M5j86p3J63L00j3l68q2K75M7j68j87k6J62J91k32
4877f5j24j3J96J92k69p8J36K84m4k52j16K09K22q6l08k20L57R3j02j27o7K71
4899H9J08j29k86J42K41J44l01j94J04L71j16l46nJ80J46j38j53q5K17J68j36
4920B1j40q9L44J15r9l03M7L22l2j69k87K17K56j73k29j09K58J45q3j99O3K21
4942I7R1m8l10J03K40M8j37l60K54J65M5l47j83K50J73m4l18l4K92L13k47k49
4964b06J7L50J24r2k89nK50O7k31n4o2K62J0k93j85K50K19l0k68oK67K01p1l09
4988h4j27K58J94k02k13J04J99r7q7k17K15R8P3j42r2R9L07j52l52J80J30J84
$$ plain form
4830 -190 -223 94 155 -25 -204 -251 -20 62 -138 -176 -28 144 139 -205 -200 130 306 151 -93 -74 168 194 20 -213
4854 -213 -204 93 108 -4 -307 -121 87 132 -54 -127 36 336 323 -45 -127 148 195 27 -160 -186 -24 167 -65
4877 -65 -189 -202 -6 186 -83 -161 -25 259 215 -37 -153 56 278 192 -116 -336 21 114 12 -115 -182 89
4899 89 197 68 -218 -76 165 309 8 -186 -82 289 173 -173 -178 2 148 10 -143 -228 -11 157 21
4920 21 -119 -208 136 251 152 -151 -104 218 186 17 -270 -53 203 30 -199 -308 -50 95 12 -187 -124 97
4942 97 188 140 -170 -67 173 221 84 -276 -22 143 188 -159 -342 -92 81 37 -281 -315 -23 290 43 -206
4964 -206 -189 161 285 193 -96 -101 149 216 -15 -69 -131 131 141 -152 -337 -87 132 102 -166 -172 95 296 225 -84
4988 -84 -211 47 241 39 -174 -70 129 32 -55 -272 -57 41 114 -28 -120 -21 286 134 -218 -38 92 276
5010B76j59l00J77J37k1r8l43O4L88P5l96q1J79L40L0k10k13J73K69r4l64l9K28
5033A8Q6k6k23j43L01L5r7k36R2L95k8j48j79K40J23M1l40m2J23L08j83l03j5
5056b01K37l5jk19L3L74%j64j51M6M12r7j76j47pK07N6k68j50J92K40o9k48l3
5080a69J05K79j51k90K24J97Qk01r6PK92rk48j26J14Q0Qk34o6J74K96n4l12P2
5104a00J60K21p9k42p7J78J97l19n0N0K02o8j03k46J24L41k35n0j65K88K44k35
5126C6o6j28K18J22k9k82l0K76K4k14j59J19J28r2o1j17K24K70j11j98QK62J3
5149B13l2k70n7K79jj69o1j08L20M2l02p8PM26j08j88O4O3K31k19n4q9J72R4j60
5174A5l08L4L65Nj77j65QK66J44j41k25J08L13j3k26j06J32J85j26k30p3K69Q
$$ plain form
5010 276 117 -183 -6 131 110 12 -331 -267 121 196 -200 -281 -102 238 268 58 -155 18 287 193 -171 -210 18
5033 18 104 78 -145 -288 13 48 -49 -285 -193 202 174 26 -153 87 210 251 -89 -131 -8 300 117 -186 -201
5056 -201 36 1 0 -219 -186 188 188 24 -127 -81 331 234 58 -89 -96 111 167 -101 -251 -59 181 112 -136 -169
5080 -169 -64 215 64 -226 -2 195 203 2 -94 -87 205 196 -52 -178 -64 16 24 -210 -276 -102 194 140 -172 -100
5104 -100 60 281 202 -40 -117 61 258 -61 -111 -61 141 73 -30 -276 -152 189 -46 -96 -261 27 271 36
5126 36 -30 -158 60 182 153 -129 -159 117 141 -73 -232 -113 15 -77 -138 -255 -31 239 128 -70 -62 200 213
5149 213 181 -89 -146 133 132 -37 -98 -206 114 156 -146 -224 -217 209 101 -87 -23 40 271 52 -2 -91 81 175 15
5174 15 -293 -259 106 111 -66 -231 -223 43 187 46 -179 -71 242 229 3 -103 29 214 88 -142 -215 54 62
5197F2j07j51J19K29O8j10k99J49K55J2l10k01L00L17j50k09k93K14K39j44j84
5218a94m7K03J29Ml41P5K58J91j91j20J12N0n0k1l04K97N0Nk59p4J92J26l7k29
5242a75n0K79J76k40q0q6L02J62k52k50K63nO0j33k99K40K24n5k48j45K45K51
5264A84q8j66k1J87K19k61j54M1K10L7j72j68J5L42j88j69j18J90J88n3j20r7
5286a62L01K28k41j96r1L17P5j02l40O0J78Q6k57j14J51J96K1j57j40J57K27q1
5308A16j28j57J42K94j04k68J10K6J31j96k01P6L25j7j66j68J86J40R2j51k58
5329a76K72R2P0m16K1J18K67k07k84P8K45J2k02n3J14J84l7j34j16J68J12J14
5351B42l26rN8K53j80l06J32J06J18n8l94J70L35K7j82m8l0K39L6k38j08J63O7
$$ plain form
5197 62 -45 -196 -77 152 220 110 -189 -40 215 227 -83 -284 16 333 183 -26 -319 -105 134 -10 -194
5218 -194 -241 -38 91 95 -246 -171 87 278 87 -33 79 129 79 58 -246 51 101 106 -153 -227 -35 91 54 -175
5242 -175 -225 54 230 -10 -90 -176 126 288 36 -214 49 44 104 -29 -328 -88 136 81 -167 -312 -67 184
5264 184 96 -70 -91 96 315 54 -100 -59 151 188 16 -152 -137 205 17 -152 -270 -80 108 55 -65 -162
5286 -162 139 367 126 -70 -161 156 231 129 -211 -151 27 113 -144 -258 -107 89 110 -47 -187 -30 197 116
5308 116 -12 -169 -27 267 163 -105 5 31 162 -34 -235 -159 166 149 -17 -185 1 141 233 82 -176
5329 -176 96 188 258 -158 -137 -19 248 41 -243 -165 80 92 -110 -163 -49 135 98 -36 -152 16 128 242
5351 242 -84 -93 -35 218 38 -268 -136 -30 88 30 -364 -194 141 168 -14 -62 -92 147 183 -55 -163 0 67
5374F7Ok23P5M7N7Mk88J57k7L54q5l61J11L38lk53j43J01K24K6j84j51P0K41p9
5399H1k13j03J57J57K1j54n1J98J47j83j74P1J84L2j84l03J59K27l7r3m6O8J33
5422I4r0r1j17J57K14q7r6k5K51pj00k30Q9J42L4k19r8J51N0M0j65j06J88K91
5446B70j80o1j94J13K33j78j34M5K25o0p3j77L4J66kk7j86J28J89Q2l55o8K43
5469C3P3j1j63OJ11J08j31k07M5J34R2j40j58J12J85J25k33j95K77R7L2k54k1
5492h3R0K20j82k08n9L09J29k77l6m4J83K30k47r3LJ07P4m8k00J84J34r1j74j10
5516a89J76J0K5j68kR5J17q1j44J13J50o3Jj13J30M3o6j18n0J35J36ok74l4J51
5541b6J61r3j60l0K65K2j12j39K00O5R2k12j20O8J17j07r2n5J88M7j3r3j50K01
$$ plain form
5374 67 73 -150 -75 -28 29 33 -255 -98 -125 229 144 -217 -106 232 229 -24 -167 -66 158 184 0 -151 -81 160 81
5399 81 -132 -235 -78 79 100 -54 -105 93 240 57 -117 -46 138 170 -14 -317 -158 69 32 -61 -107 -39 94
5422 94 4 -87 -204 -47 167 80 -16 -41 210 203 103 -127 -38 104 138 -81 -179 -28 22 62 -103 -209 -21 270
5446 270 90 29 -165 -52 181 3 -131 -86 139 79 6 -171 -137 29 27 0 -186 -58 131 213 -142 -210 33
5469 33 106 95 -68 -62 49 157 26 -181 -136 -2 90 -50 -208 -96 89 214 -19 -214 63 160 192 -62 -83
5492 -83 7 227 45 -163 -222 87 216 -61 -97 -141 42 272 25 -68 -65 42 116 68 -132 52 186 95 -79 -189
5516 -189 -13 -3 22 -146 -148 -53 64 -17 -161 -48 102 39 40 -73 57 100 34 -84 -134 1 137 131 -143 -177 -26
5541 -26 135 42 -118 -148 117 139 27 -112 88 153 245 33 -87 -19 98 -9 -101 -156 32 79 66 -27 -177 24
5565B4J13m9k15P6K42M2j89j53J32L2O7j42k01J05K03p6j75M1J6J81m4j14J14
5588C0M7J28r6j08n3J43n5m2j36R4K07j17j3k19J77J18j13j26m6J67K09n4k81
5611a39J39J19Pj18j78J35L6P4k9j13j0J18j4j64mm1L81j19q0OmL7k6j29R8j2
5637c0K03j89o8o6K16R9k39m4K5K04oj5j49M2J80j60kj65J74J80k54q2J0K35k8
5662G1k1r5r7J91P7q0j35N3K15r9k4n5RJ2R1k25j00J90K14j69k52J27J18J40j39
5687A7j57J07J37J09k51l0K8J13k7j21m1J78QO9k20P6P5k9n0p8QJ41OM5k71J65
5713GJ15m1j20J9n2J43m3j00p2O6J46j8r6K1O0R4%l35J43K08Oj62n7K3J72q3o8
5740b4j07J30kJ11j93p5J05J43O3j51m2J00J07j16o7o4l2K37j97n9J26J06m2j06
$$ plain form
5565 24 137 88 -127 -51 191 233 44 -109 23 55 122 -20 -221 -116 87 11 -164 -123 -107 74 30 -84 30
5588 30 77 205 109 1 -52 91 36 -6 -142 -48 159 42 29 -190 -13 105 -8 -134 -180 -13 196 142 -139
5611 -139 0 119 126 8 -170 -35 1 75 46 -67 -77 41 27 -137 -141 -182 199 80 0 6 2 39 13 -116 -18 -30
5637 -30 173 -16 -84 -150 66 165 -74 -118 -93 111 105 90 -59 -17 163 3 1 -164 10 190 -64 -146 -136 99 71
5662 71 50 -45 -142 49 126 46 -89 -36 179 80 56 1 10 22 113 -112 -212 -22 192 23 -229 -102 16 156 17
5687 17 -140 -33 104 213 -38 -68 -40 73 46 -75 -116 62 70 139 -81 -5 70 41 -9 -87 -79 62 68 113 -158 7
5713 7 122 81 -39 -20 -72 71 28 -72 -144 -78 68 50 -46 -25 35 129 129 -206 -63 145 151 -11 -68 -45 127 44 -24
5740 -24 -131 -1 -3 108 -85 -160 -55 88 151 0 -42 58 165 49 -18 -82 -114 123 -74 -133 -7 99 57 -49
5764d9p1O3J43k6k53J14J59Q1j24j14M1J12R3k45P0K2L0J3j89oK9J76J03k31J10
5789E1j29K26n8j30O8q1J35j94L1%Q3J27j13p4n4J55K1k6j35N6Q3P2r3j00J19
5814D0P8j91L7O2j7j9J1ql2J08j64L0lj2J88Pj77k7m9K66n4k60Q4R6N8q7qrK5
5843b7n0L0q8k4J83M4o6QO8KJ36l01Q0J0J33Ok18J5O3K6MJ3j61Q8J3P6L7j67Q9
5872B2Kj01Q1r0J37J9l7p1JJ4K0k3J09j57J99r9q9M5O9L3q2m9J19kN2o0j46Q1
5900cj9k5M2r4J61r6M6p0L1k5oJ58n0r9O1Q0m1j20J6l4J71j75Q8MJ20q1k8j40
5928a28J51N3n4j6qj1Q3n5j6j2jJ01Lj49L9P4k6j11P2Pl4O4m1MN3l1Lj8rQ6L2
5959A05j28j02J50q0K71l82K8M3J68J3j48l6R6O5pj15l2Q7k3j6P9n5m9M5K3j08
$$ plain form
5764 -49 -120 -57 86 60 -193 -79 80 161 37 -77 -36 76 169 -76 -6 16 46 59 -130 -136 -107 69 172 -59 51
5789 51 -78 148 90 -40 28 -53 82 -112 -81 -81 2 129 16 -58 -112 43 64 38 -97 -41 42 114 21 -79 40
5814 40 118 -73 -36 26 9 -10 1 -7 -39 69 -95 -65 -68 -80 108 115 -62 -89 -138 128 74 -186 -102 -6 52 -35 -43 -52 -27
5843 -27 -77 -47 -135 -159 24 68 2 10 78 80 216 -85 -5 5 138 144 -74 -59 4 30 34 47 -114 -26 -13 63 100 -67 22
5872 22 24 -77 4 -86 51 70 33 -38 -37 -23 -3 -26 83 -74 125 26 -63 -18 51 84 2 -47 72 70 122 62 -84 -3
5900 -3 -22 -47 -5 -99 62 -34 12 -58 -27 -52 -58 100 50 -49 12 92 51 -69 -53 -87 84 -91 -3 1 121 40 12 -128
5928 -128 23 76 22 6 -2 -13 70 15 -1 -13 -14 87 90 -59 -20 54 28 -83 -11 -4 -38 26 -15 -11 42 11 14 -4 -13 73 105
5959 105 -23 -125 25 -55 216 -166 -138 -95 73 86 -62 -98 -2 63 56 -59 -91 -4 -27 -43 36 -19 -68 -23 0 -108
5985a08O1k0O4L3j27J46k9n3P4p2N2j17Q2p3P0q3J03Q6k70O2J12m3N4k8j04J05
6011b3m4R9J1N1J1m5j01J8j1J08j4j03j1J38l0j6r7J42j26K4r4K50n6o3K9j0k2
6038A5j50J58j3m5Nj3J03j41K0PmJ58j61l1Q7J00J7r1J9j3Lk5l1n9J7J33N2q4
6066C3K4n5o2K9m1M2jP7j15J02m5J6l2L9r0R3k7M8m0j6o1J41j7N8l6j7L9r6p0
6095h0P0J6kN6r5r8R0N4J1K5j35L8N4ln3R4n4P4m0n7J2R2k8n3n2J30k3k8O4M2
6125A21k76K93j58O5j11J43q1j3p0R6jj9m1Q4J19j23o1lo7J29J00j84k2j7J31
6150C4L9q9j2j01J36J01m7r0L6n4J30j29n9R4q0M7j1M7J0Qk5l3N7M2o5O7K2n8
6178A7l2J02q5j5j8Q7M7n5o6mkO9L5r0k6J29K1j00n4j2Q9j17M9p9P9J24o9l9J12
$$ plain form
5985 -108 -47 -67 -3 30 -97 49 20 -33 41 -31 21 -96 -14 -87 -17 -100 3 89 -181 -119 -7 -50 4 -24 -128 -23
6011 -23 -67 32 43 94 105 60 -41 -23 -34 74 60 -43 -54 84 54 38 -59 83 -43 -19 -113 137 81 18 47 37 15
6038 15 -135 23 10 -35 -30 -43 60 -81 -61 -54 -58 100 -61 -92 -5 95 112 21 40 27 30 5 -26 -85 -68 65 117 33
6066 33 57 2 -60 -31 -72 -30 -31 46 -69 33 -12 4 -28 11 -79 14 -13 35 -5 -21 -82 59 42 100 64 47 86 -10 -80
6095 -80 -10 6 4 60 -35 -133 -43 11 22 47 -88 -50 4 1 -52 42 -12 62 22 -35 -23 69 41 -12 -64 66 43 15 79 121
6125 121 -155 138 -20 45 -66 77 -4 -17 -87 9 8 -11 -52 32 151 28 -33 -36 -103 26 126 -58 -80 -97 34
6150 34 73 -16 -28 -129 7 108 61 -29 7 -47 83 -46 -105 -11 -91 -44 -55 -8 2 10 -15 -48 9 51 -14 53 75 17
6178 17 -15 87 2 -13 -31 56 103 48 -18 -22 -24 45 80 -10 -36 93 114 14 -40 -52 37 -80 -31 -110 -31 93 24 -15 97
6207I7r0L3r7J19N5o7l7j12J27Jn4J59k00%J57n6l4j3oJ01K3j52M7Jl8j8K7k9
6235e6R4l6m2J5l4OP5J8j00J3J42rj02J5j11K69n2j59M0j8L0K6q2M8j3O2Nk6K01
6264B19k49K4l8K7j7R5q9QnnJ35j02L2L9j57J73j68K2k8P7Q0n9j7Q3p0j1j01O6
6292c6J2N4lJ00j05k6J37j53M2p7J0Q3M7p0l7J09lj14Rk8r1O8J60q6j08Q8J4l2
6320c6K5q6lJ05o2Pj6P7q3L2J8lQ3p9k0O1N8lr2l5JJ07o8L8O4j61P7O7j23N6m5
6351c9M4O9r0o2J39j11m1J63p4q7J37K0o0M2o9j5J11n8n8jn6J05L7j3k3j2k6q
6379c6J1K7n7J25o9K8j0J2Mp8L8m3P7J0K3k4O1r5Q2j26Q0O1j11p9J23mL2j18k0
6408g6J04M9q0lL9j41R8n2j5L5J9J71j93N2m0N7J1j52Q8pP5r6O8p1N8l9R9j19
$$ plain form
6207 97 7 40 -57 62 117 50 13 -99 28 29 -25 134 -66 -66 91 35 1 -12 -18 83 106 -46 1 2 -36 -54 -27 -56
6235 -56 38 2 -40 -25 -59 -53 22 40 -60 -47 95 86 -16 -1 -112 157 105 -54 -14 -32 -2 24 -58 -10 -23 39 44 18 219
6264 219 -30 -6 -44 -17 -34 61 -28 -20 -25 -30 105 3 35 74 -83 90 -78 -56 -84 -7 73 14 -3 80 10 -1 -102 -36
6292 -36 -24 30 27 127 22 -4 133 -20 22 -55 -45 38 85 15 -22 87 84 -30 -21 -49 -140 -72 88 2 -106 -18 -4 -36
6320 -36 -11 -97 -100 5 -57 -50 -66 11 -72 -40 -22 -25 58 -21 -41 20 78 75 -17 -52 -51 56 -12 26 90 -71 6 73 -50 6 -39
6351 -39 5 74 -16 -78 61 -50 -91 72 -2 -89 48 68 8 50 -19 -34 77 19 -39 -40 -96 9 46 33 10 -2 -28 -36
6379 -36 -25 2 -55 70 1 29 19 31 35 -43 -5 -48 29 39 62 38 99 4 86 -40 40 101 -10 -89 34 30 62 -56 -76
6408 -76 28 77 -3 -6 33 -108 -10 -62 -77 -42 -23 148 -45 7 -33 24 35 -117 -29 -36 39 -57 11 -60 -2 -41 58 -61
6436f1O1pk7J33q8j40K42j35n5O6P0n3l3P3k8o0L9R8n8q7Q4K5r8q3J48N3l5k1
6464B3j06J19n2j4L0o3J37l7O0j50K19j03jK1j20M4K1p1L9n9M0J22j23L4p0K9
6490c1R9p8L5mm2l0R3r6L0l1J14k5p7K2J4N0r9R4o1O5o9J19J5j00p6J27j0o1Q
6519eM0k6j3K0m5k8k8P8Q1p8P0J3j03Q0j70M0K06j16r5J01K0j07J64l3j4j46K2
6546g2J89j26j2k1O1j31J31O4j05j67K34r7L0j8M3j4oJ04j48R4q6J35%L9r4m3
6572a6O9j87J76o0Q1o8o0N8j2j6J16Jj22O2j1r1M0J40r3J5o7n9j03J46j1n6N4
6599g4n7J09N0j5lj62Q9k4J49j78J45n0p3M8l5N2qN5j5K0J7j81R8N3j9P5j03P2
6627C5j03K2N3L7O0j77J21p7N1J23k23L3J44m3q0j5J6N6j0j11J99j05n2KP9r0
$$ plain form
6436 -61 0 -7 -34 99 11 -129 113 -22 -77 -11 59 6 -27 46 18 -42 -3 95 37 -50 34 59 -39 -122 26 79 44 23
6464 23 -83 36 -16 -30 0 -63 74 37 97 -53 166 63 62 83 -37 7 28 -43 -4 -63 -23 99 -24 10 -60 -31
6490 -31 68 -10 25 21 -21 -51 42 -54 -24 -55 59 34 -43 -21 -7 43 -56 38 -23 42 -27 92 107 7 -69 58 48 -13 -5
6519 -5 35 9 -4 16 -29 -57 -85 -7 74 -4 66 79 -24 56 -114 -74 132 16 -79 22 42 -65 99 66 52 -94 -72
6546 -72 117 -9 -21 -42 19 -112 19 83 -22 -189 45 -52 -22 -40 3 -11 -17 87 -61 33 -53 82 82 121 27 -16
6572 -16 53 -134 42 -18 63 -5 -65 -7 -19 -35 81 82 -40 22 11 -80 -40 100 7 22 -45 -104 -207 -61 -72 -128 -74
6599 -74 -131 -22 28 13 10 -152 -63 -87 62 -116 29 -21 -94 -46 -81 -29 -37 18 3 23 40 -141 -43 10 -9 66 -37 35
6627 35 -68 -46 7 44 104 -73 48 -29 22 145 -78 -45 99 56 -24 -39 -23 33 23 -88 111 6 -46 -44 35 -55
6653e5R2l6q0P1R0j73N0J0J6l3J05l1J0l9R2n0j34J62p8r8m3J66l4N5j3L3o0K4
6681A9NrO2J7q0L1J1j60J21N2L9j23R4j07m1J26k2o5R6ml9nl1J5o0L7O9k5j1P9
6711I1j92R1L5n5K5qj03Q6K5M8p6m6K5Q7p3M0Lj3n8N0%L8Qp7k3J02K5j14J13j8
6741C6qK2J1k7O3n8oN0J7r8q6J49j01o4J39j28J58M1p8l0K6NK5J5o3l6L7K8j48
6770a09jQ6P7j42J02N8j41j3J35r1M7k3M6p8j2Q5r9N0K2Mn9J16j7O4j39K8P4r0
6798b0L8N1m3J3n3m3L6o3N1O7m4L4JL5j51LJ40k3j2N8o4n4KM0kj12J28N1m3j1
6828A0M2j86O2P4Q4j00QR3p5n2N0p5m8P3J12J0l1q0J02j04j04P8M5QJ20j47M4
6855A3l5k9j1M1J45j19j2R7k01J70Qn4RnQ5k55J30M7J04m6m3k7p0N3N9j24MO9
$$ plain form
6653 -55 37 1 -79 -8 82 -91 -41 -31 -15 -48 57 26 36 -3 89 39 -95 67 -11 -109 -152 14 -20 35 22 55 -5 19
6681 19 24 15 77 94 14 45 56 -104 17 69 108 -15 79 -28 -69 57 35 -30 66 62 23 18 -13 2 -58 -21 48 23 12 91
6711 91 -101 -10 25 -30 -5 -13 -116 -30 -5 43 -33 -79 -54 33 -40 0 3 -10 -68 -18 -18 20 28 -49 -72 30 55 -59 54 36
6741 36 28 50 61 34 97 39 33 83 100 2 -84 65 -36 -100 39 -89 69 110 32 2 28 33 58 73 10 -26 11 39 -109
6770 -109 -110 -24 53 -89 13 71 -70 -83 52 -39 8 -15 31 -47 -59 26 -73 -23 -1 3 -56 60 43 107 -32 -4 70 -20
6798 -20 18 69 26 39 -14 -57 -21 -84 -33 34 -10 24 25 60 -91 -88 52 29 17 75 11 -43 -41 -1 -3 -115 13 64 21 10
6828 10 52 -134 -72 2 86 -14 -6 87 12 -40 10 -65 -113 -40 72 82 51 -29 73 -31 -135 -57 -12 -4 116 -31 13
6855 13 -22 -51 -62 -21 124 5 -7 90 -111 59 67 13 22 17 102 -153 -23 24 128 82 39 12 -58 -5 54 -70 -66 3
6883CK3k3k9Pj7J07j38Q8k7J99j70o9N7O7jJ9j8p5M7n8O3j04l0Q9L6o6p4PL0P3
6913A6j33N4R2l8K5o7J26r6R5M6j42Q7p0L0%O8l2r2p1J05n2J05n8mk9J9j0J35
6941A09j13J63k29K5L7o5M1p7R0J06r3j9Q0j15J11j14J28n0r3J06j19rmJ05l3
6966c2J39qj11K8r5O1Q1P1j07j05R0N1o0K3j9QK3l6l1%l0LJ16o1l0K6N7p5K0K7
6996B4j0K0kj1Po9J19p3j1J15k20lJ52K0j22P5Q2j4p0l2j4J6R8j19J38j03r3L8
7024f2M9j31J32r7J61l5r6J39m2n3pm0J32m7Q0l3j6N1j33qJ41r5n5J78j40n2J54
7051G5j17J09j14k8J42M4r5l3L3M0r3M0j1NP8p2Lk1J63j83P4k7J2J5ln9M2o5J13
7080F7j15oO9K3p6N5r8J19J1j14P5l1J2n4J10k7l7KJ03j07J63q5j10J17n4k5q5
$$ plain form
6883 3 26 3 -26 -19 -36 71 -67 21 -6 193 23 -46 11 78 77 96 78 3 50 -8 55 -49 -79 10 46 -20 -94 -87 -57 16
6913 16 -117 -63 29 -9 16 -51 75 -21 74 120 -22 65 -5 25 25 93 61 -31 -102 3 -49 56 -2 -6 -35 -16 -26 109
6941 109 -4 159 -70 -45 -8 -73 -32 -109 -19 87 -6 -25 55 -60 51 -63 65 15 -78 28 -91 -100 -104 1 -32
6966 -32 107 99 -12 16 -79 -18 63 134 27 -78 12 63 3 26 7 15 38 2 -29 -29 -59 -56 60 -1 -31 -5 52 -23 -3 24
6996 24 14 34 32 21 28 -41 78 5 -6 109 -111 -114 38 58 -64 11 93 79 9 -23 -37 -21 77 -42 96 -7 -100 -62
7024 -62 -13 -144 -12 -109 52 17 -79 60 18 -35 -42 -82 50 3 83 50 34 85 -48 -56 85 -10 -65 113 -27 -79 75
7051 75 -42 67 -47 -75 67 111 16 -17 16 56 -37 3 -8 -3 75 3 6 -15 148 -35 39 12 24 39 36 -23 19 -46 67
7080 67 -48 -54 15 38 -38 17 -81 38 49 -65 10 -21 -9 -63 47 20 -17 -15 88 -19 144 59 -51 66 12 -13 -98
7107i8J11n7J53j27J40q7K3Nm9L2j5l3q9N0O1oj5J5K9k8J01q8Mj14R5m7O2J0j18
7136h0K3J08j4n0L0n2l1nP9K6j29J74o6k%l1O6n0qN4k6J5pl0q8P1L0K0j5j8k8
7167c4J8L9Q9l1Lp8k8M4J2p3J7O1j12J12r9J59j43N7m5J7R2j37R0N4j27oK8Pp4
7196h8J58j2j38J10l2lkn3P2n1l8J08q5R8j5p7mR2o2L2NK5j1N2j01N1l4O2q6r5
7226a22K0J44Rn7j5P8ok4o6J4M6J0N2M8j76k5N8n1J08l9p5O8J40j77M0L9k8j0
7254CO4j20R4J8j12P8J29k28K0M3j6K7M6j46P3K3P2p0J3N6r5m0K1k2l6J26J7j44
7282a06M5k8R9j3O6j0O0k03J8L4q1J94j12J1J2J19j56N9P1o8J1LJ51j76L1P0j00
7309Ao7J42o0n5J5jM1p4m6J78j66K26q5r9J33l9n2N1p5O0k0pKj9J52rj72o6J21
$$ plain form
7107 -98 13 -44 109 -18 122 35 58 63 14 46 31 -2 -91 -41 20 14 -1 14 43 15 116 28 32 -82 13 -34 28 38 -80
7136 -80 -57 51 37 -13 17 -35 -66 -71 8 34 -95 79 13 11 11 -20 46 -4 -12 42 16 31 24 -6 -94 -23 7 27 12 -6 -34
7167 -34 -16 23 112 81 84 6 -22 22 34 -39 -22 39 -73 39 -60 99 -44 13 -32 -15 77 -60 30 84 -43 -49 -21 -14 -88
7196 -88 70 58 -80 30 -2 -5 -7 -60 12 -39 -77 31 -54 44 29 -48 -52 40 -22 10 15 40 29 81 -20 31 -3 59 -27 -122
7226 -122 -102 42 51 -6 -21 57 51 27 -39 -25 21 31 83 131 -45 -70 -12 -63 45 6 -69 -1 139 -38 2 41 13 3
7254 3 67 -53 41 59 -53 25 154 -74 -54 -11 -27 0 46 -100 -27 -4 68 -2 11 67 -28 -68 -47 -69 -105 21 38 -106
7282 -106 -61 -89 10 -3 63 53 113 -90 -72 -38 -119 75 -37 -26 -14 105 -51 8 79 11 22 25 176 0 31 101 1
7309 1 -66 76 16 -39 -24 -25 16 -58 -104 74 -92 134 49 -50 83 44 -8 43 -32 28 8 1 3 -16 136 127 -45 -111 10
7338A0l6j9N8O0r5r0Q9O7kJ2j12j8O1k6j4J24qJ2j80J7M0n9K01m1j80L3L6N0O6
7367E6j51J41K5o7j09J38j12P0k4%OO9N1j70J68m7L7m4O5rj0p4R8j31K8n4j2K7
7395c5M2RrnQ3o0r3k6Q8O9j29N7o9L4N1j1L5r7J09k3j3k8p2N9P5o6j5Q6j18J59
7425H7j22N1K8q0J7P2K0Rj69K02p7J2m0kK6m6KL1k9m2J99k42M8k0J33m0Kk7P4
7454G7j7q0M8lk6M5m5k5P4K6n4j16J54o4oj32K11p7M2jo1o7J42oj00J26r9K2p7
7483h9Q6n0k6L2K5k2P6j4Ml7r5J02O4K7j30J5R2p3N0j30J49Rj56M6R9p1J5nk0
7512b7Q1n5Q8j05J9O6r7O1j09J21J9n2O2q3j8j04J26o2M4RJ54l1j46j5L5P5P1
7539A27j14J5KJ1m2l1QP6K0p2m4O9k6L7qJ3j08J54j17K5k1J1K6o1l3L9o1k5P5
$$ plain form
7338 10 -26 -45 13 73 -22 -112 -23 44 42 54 -58 -76 -15 -41 -55 69 61 73 -107 -90 -50 -109 92 51 -129 -96 -60 -10 56
7367 56 -95 46 71 4 -105 33 -79 -9 -33 -33 -27 42 93 -77 91 44 81 37 102 93 83 9 107 -24 4 -50 -62 -35
7395 -35 7 16 7 2 85 25 -68 -94 -6 63 -66 -9 -78 -44 7 -4 31 -66 43 20 7 -21 -93 -34 41 -25 -40 46 -72 87
7425 87 -35 16 44 -36 -19 53 73 82 -87 115 38 50 10 8 34 -12 -10 21 -8 -50 149 -93 -45 -65 68 28 30 3 77
7454 77 60 -20 28 25 -1 44 -1 -26 48 74 20 -96 58 -6 -12 -144 67 -10 32 31 -30 -97 45 39 -61 65 -34 -12 -89
7483 -89 -3 -53 -79 -47 -22 -44 32 18 22 -15 -110 -8 56 83 -47 -32 60 -13 37 -93 56 65 -91 -45 54 -17 -2 -7 -27
7512 -27 54 -1 87 -18 1 67 -30 31 -78 43 62 10 72 -11 -29 -133 -7 -69 -25 -16 138 107 -39 -54 -19 56 127
7539 127 13 28 30 41 -1 -32 -24 52 72 0 -44 25 -1 36 28 41 -67 87 -30 -5 -26 -15 11 -50 -83 -44 -105 -130 -55
7568e5Q6o3J27j35K3O1k9Pj39J27O8j42R2j05P6k7j8k1N0P3k7Qq2M6p6N8M3L0
7596E6o4K7o9P6L0p3K5j62J48k4O1o3M4O6n5r1J11J9o9K5m8K9oN1q8J25q7q2Q8
7625@j18R4k5%R0j6J1K8q2jN1j7K9r7J10M3o5m0J2n6j5K7N1m2%OP9l1j07J43p1
7656im2j4J7M9l8MK9o2J44k8n1j4M8L8N4m5o6P3j63J36J3p7O6l6m2l0R0p1l2J37
7686G8j54N7K7j16J22p6M0j9J06j26l6J10k4k0N2o2l4R8l2r0J66j25N2M4j5J1
7712C4qq3M1L0r6Q1l6O0K3N2r0j28P4N3r8P5J17p7K0o9L9M3ql5M2j15J34j67J64
7741G2j24M9q5K8L9M9p9L1kJ27j30l4R0o1Q6M8J0j27J8j13J28N2l0j1l1j7L5O6
7769H4r6j4l4kO1L8kj19K2k9J58k3o1l5M9K7o6P2o6l6P4K9r0Q9j07K14p6k9p0
$$ plain form
7568 -55 31 -32 95 -40 -17 44 15 22 -117 10 78 -64 28 -77 -1 -28 -46 -67 -17 56 29 37 -45 1 -75 -17 26 56
7596 56 -8 19 -50 26 56 -17 8 -154 -6 -30 31 -32 12 78 23 -68 43 62 -7 18 -30 -1 -7 44 -44 81 -6 -88 0
7625 0 -118 -24 -49 -49 41 25 36 64 -18 -19 32 15 44 -53 57 100 35 -5 7 -49 -64 -37 14 -28 -28 -22 57 26 -81 62 -9
7656 -9 -51 -65 -48 1 -37 -33 -4 -66 78 50 -1 -15 33 71 125 80 14 87 -76 60 73 -4 62 26 -16 -46 44 -27 -59 78
7686 78 -76 -19 8 -108 14 -62 -22 -41 65 -61 -97 13 -11 -31 21 -41 -75 23 -9 -99 67 -58 -6 38 23 34
7712 34 26 -57 -16 14 -82 -1 -37 23 46 98 8 -120 -46 7 -91 -16 101 24 44 -25 14 57 49 14 56 -59 75 -92 72
7741 72 -52 -3 -88 -60 -21 28 -51 -20 -22 105 -25 -59 31 -30 56 104 114 -13 5 -108 20 72 42 31 0 -17 18 84
7769 84 -12 -26 -60 -62 -1 37 35 -84 -62 -91 67 44 -17 -52 -3 24 -42 30 -36 -72 2 31 -59 30 -77 137 61 32 -38
7798c8J54o3k8J5j17K6L7m3J12n0K3j14M7n2J06n1J9Q6r3K3l6Q0r1R1j06P2J2
7825B1M5Rl6l1j2%j58J20p5Q1O4K4m2p3R7m7j3R5k8k7o6J13J4l0P2k64J81o5J53
7854A22j49R4p3N6k6j48K76p8p6L2j23N4Kp8R7m6K0J25p9K9p4J9L0n8J06k3j06
7881g5J17l7p7Q1L7M2j05JJ91j29p9M9j22R6PJ34k13J44j64J41l5j0Q3m8m6rP1
7908D5l2Q7m9l5P4k6k51J89K3l4K4P7j12L8n2K7O4k4n7Onk0J42q3j00K3J83q4
7936C8K2j12J48j24K8l7M7J9K8ml1k0J9J62j58l5J06n6l7RL1m0L7k2j22O1N0L3
7964D0m2on2J59q3o6J25p6JM5j57J17j0n5N2R3m3o9o1j0O8Q4p5l4J3oJ33j1j38
7993f4oJ83j21l0R9M6j08n1O0J03q1n2L5j17K25p6m1j09J57N0r3l3J08j39M2K1
$$ plain form
7798 -38 116 53 25 40 -77 -51 -14 -57 55 5 28 -86 -39 -91 15 -36 -17 69 -24 -1 -37 43 -48 43 -63 9 21
7825 21 66 75 39 8 -4 -4 -162 -42 -117 -36 28 52 10 -63 34 -13 -26 69 41 14 -52 61 75 45 117 -147 34 -31 122
7854 122 -27 67 -6 50 24 -124 152 74 -2 30 -93 -39 -37 -115 -18 -64 -44 81 2 31 -43 -24 6 -52 54 31 -75
7881 -75 42 5 -72 9 46 88 -17 -16 175 46 -33 16 -106 -10 -3 131 -82 62 -102 39 4 -6 77 29 -17 -26 45
7908 45 13 100 51 16 90 64 -187 2 25 -9 15 92 -20 18 -34 -7 57 33 -24 -18 -23 -43 99 16 -84 -61 122 38
7936 38 60 -52 96 -28 0 -37 10 29 57 53 22 2 21 183 25 -10 96 40 3 12 43 3 40 18 -104 -43 7 40
7964 40 -2 -8 -60 99 16 -50 75 -1 0 45 -112 5 -5 -60 -8 85 42 -27 -88 -98 -30 54 -21 -55 -42 -48 85 74 -64
7993 -64 -70 113 -8 -38 61 107 -1 -52 8 111 30 -22 13 -104 121 45 4 -105 52 102 9 -24 84 -55 -13 8
8019Hj13J82q9P6j02j5JO6N1p2M7j09j0J3P9j7L8Po8J25r0m5l0k5J74n6m0m8O3
8048Al4J53j52P3m1j4J6qq8j3O7q7J58p7L5lq5J08l7N3P5j60J05n7j9j7q1K12
8076H3r7n4k7P9J14j12O4o3K6J50j57l7L5Kj7l0P6nj27j3J45m4q1R3J48j33M9
8103F7k6n8j02J95j78J23j13k2K9J77j15P2j00Q3q3P4k4J3l0K1K5j52J95j96K46
8128A21q7j20J15o5N9J5k4K3l4L6M0p1J3lj02J59k36J49K5l7P2m4%o6L8MK7j4
8156gk4Q1o6q0J57J3n6LRRl5O6p1l8rj7J9l0J09P8j89lR2Np8Q4k5M2q8o4N8N9
8188DRj1m1
$$ plain form
8019 8 -105 77 -12 64 -38 -53 -52 14 65 -7 40 -69 -79 -66 13 -4 34 41 -27 98 8 -37 -67 -92 82 26 -14 -62 1
8048 1 -33 120 -32 41 0 -14 2 -6 -94 -107 -40 -127 31 -46 -11 -14 -99 9 -28 25 100 -60 45 -12 -31 -48 -129 83
8076 83 -14 -68 -95 -16 98 -14 50 -13 13 163 6 -31 4 6 -11 -41 35 30 -97 -110 35 -9 -90 3 151 18 67
8103 67 41 -17 -119 76 -102 21 -92 -114 -85 92 -23 49 -51 32 -51 23 -1 12 -18 3 28 -124 71 -125 121
8128 121 34 -86 29 -36 23 38 14 37 3 39 79 8 21 18 -84 75 -161 -12 13 -24 48 4 4 -62 -24 -20 7 -7
8156 -7 -31 50 -16 -96 61 74 18 21 30 39 4 70 -1 -39 -48 -65 -46 -76 33 111 -78 -81 11 16 -62 22 -3 39 -49 -113 -55 4
8188 4 13 2 -39
8191c9
$$ Imaginary data points
##PAGE= N=2
##DATA TABLE= (X++(I..I)), XYDATA
0@%%%%%%%%%%qJ6j6K4l2L2m0N6o5P4r2J15j36J59j90K18k52K97l40L88m47N13
32B74n83O59p46Q42r42J056j184J321j474J639j819K015k231K467k721L000l309
49a736L649m018M426m878N380n943O574p289Q109r058J0169j1492J3107j5125
63h125J7719k1210K6191l3916M7646p9416K90832J12780m77537K7201K81699J31866
75C15730l65997l55904O5832L64637M1970l18861k16133K60925L92904L4266l11576
86i2207q8595L24744L18882j24515l53688q2434K87895J66384k69601l81315j430
97b95880K93576J02919k83082k65909J54844L76644Q1805k57505j39732K58198
107B5878L46848j8953l20315j19242K51424K14887j83556l71654q6804K55722
$$ plain form
0 0 0 0 0 0 0 0 0 0 0 0 -8 8 -8 16 -16 16 -24 32 -33 41 -51 64 -72 87 -103 115 -137 160 -180 208 -239 274
32 274 -309 350 -396 446 -496 560 -624 697 -777 862 -957 1058 -1173 1294 -1427 1573 -1736
49 -1736 1913 -2105 2321 -2557 2823 -3120 3454 -3835 4274 -4784 5385 -6107 7000 -8125
63 -8125 9594 -11616 14575 -19341 28305 -51111 239721 352501 -125036 -97835 183864 315730
75 315730 -50267 -406171 -340339 24298 66268 -252593 -468726 -207801 185103 219369 -92207
86 -92207 -180802 143942 462824 338309 -15379 -97813 190082 356466 86865 -294450 -295880
97 -295880 -2304 100615 -182467 -448376 -293532 83112 164917 -92588 -232320 25878
107 25878 372726 353773 33458 -85784 165640 380527 196971 -174683 -261487 -5765
117e765J45726k43051l05721O5022L35722J38725k17860j92875J94134L62693
127B76750N6326k68767j54121K03447K60688r2920l53272j40707K10555J73338
137A71317j80155l20828k9827K87254J75570j77973k19604J17375L38013J29587
147B90729k06091j83014J55661K81503j2750l00265j80393J49102J98564j13782
157G9264l22441j01463K26724J91587j24584k38377L4463L10781J83941j53848
167H6047j95441J04406K84928O9643k47009k15546J05860K18721n4190l02522
177a45103j62945J63191K11859p8139k57186l4567K67946K15125r6227k05693
187a21739M4757K82440J36411j90698k23158N9083K19564J4565k65746k10453
$$ plain form
117 -5765 139961 -103090 -408811 -343789 -8067 130658 -87202 -280077 -85943 276750
127 276750 333076 64309 -89812 113635 374323 281403 -71869 -212576 -2021 171317
137 171317 -8838 -329666 -359493 -72239 103331 -74642 -294246 -176871 161142 290729
147 290729 84638 -98376 57285 338788 326038 25773 -154620 -5518 193046 79264
157 79264 -243177 -344640 -117916 73671 -50913 -289290 -254827 55954 239895 86047
167 86047 -109394 -4988 279940 349583 102574 -112972 -7112 211609 157419 -145103
177 -145103 -308048 -144857 67002 -11137 -268323 -302890 -34944 180181 83954 -121739
187 -121739 -76982 205458 341869 151171 -71987 -12904 206660 221225 -44521 -254974
197b54974J04221K09828l5912k44812r8227K02664K33900m1625k03698k819K53174
208A21720J79398j17081k17207R668K14802P0899k18838k27957M3766J93781J2326
219F5277k26544j53334J43566K33064J97j89847n2584K12472K17753n6603k10619
230a7202k3806K02645J18334j60154k38833r647J86650N2102k05387j89270Q0669
241b03899K19550M3358j77459j00717J72384K33750l276j85267n8744J76094J62012
252B77786j00657k33273m8528J61433Q3113j61015k11754J5328J97787P3324j54490
263a00946j29083J14920K26897N1079j55682q8824J47332J84316m2162k04986
273B861q4318J30779J15900j17618k20916l4128J65105R5044j22954j57857N7655
$$ plain form
197 -254974 -150753 59075 23163 -221649 -319876 -117212 116688 75063 -128635 -131454 121720
208 121720 301118 184037 -33170 -23502 191300 262199 43361 -184596 -140830 52951 65277
219 65277 -161267 -314601 -171035 62029 62226 -127621 -180205 32267 250020 193417 -17202
230 -17202 -41008 161637 279971 119817 -119016 -128663 57987 110089 -95298 -284568 -203899
241 -203899 15651 59009 -118450 -219167 -46783 186967 183691 -1576 -60320 115774 277786
252 277786 177129 -56144 -104672 56761 139874 -21141 -232895 -217567 -19780 53544 -100946
263 -100946 -230029 -115109 111788 162867 7185 -81639 65693 250009 207847 2861
273 2861 -81457 49322 165222 47604 -173312 -207440 -42335 52709 -70245 -228102 -170447
284a70447K18327Q8312j29994j07766J11528J97833J7261j80326j11968J09999
294D2759J38194p4450k13123q0721J31008J17757r6344j78017R322J92565J14524
305A03474r5021j26239P0647K03193O3033j45828j22533P7970J48667k2175j94609
316c9421j15536R6801J23682o4452j75976m1333J53474J34765o3664j34889L3658
327i2891J86875R9829j00744j30644M5521J56773K1146j66693j34075N8600J26328
338G0025k6716j73513q4677J19378J41523l5663j36243q548J66147J32778o5414
349I9077j35014K0602J55004O1157j29888j49650K5205J31189L971j61968j14347
360a94662P7147J40745m725j36275m6480J40199J47144k8710j25192r281J42430
$$ plain form
284 -170447 47880 136192 6198 -101568 9960 207793 225054 44728 -67240 42759
294 42759 180953 106503 -106620 -187341 -56333 61424 -34920 -212937 -203615 -11050 103474
305 103474 8453 -117786 -47139 156054 219087 73259 -49274 28696 177363 155188 -39421
316 -39421 -154957 -58156 65526 1074 -174902 -216235 -62761 72004 8340 -126549 -92891
327 -92891 93984 193813 93069 -37575 7946 164719 185865 19172 -114903 -56303 70025
338 70025 43309 -130204 -214881 -95503 46020 10357 -125886 -134434 31713 164491 99077
349 99077 -35937 -15335 139669 200826 70938 -78712 -53507 77682 81653 -80315 -194662
360 -194662 -117515 23230 18505 -117770 -164250 -24051 123093 94383 -30809 -40090 102340
371A02340R7455r1205j50227j937J19948L3498j33460j36911L4396J33027J8352
382B5276j25437p3806J00501J50004Q604j15170l4979J26528J18970n0666j38872
393i047k9409J08666O3709j06838j48477R96J18083L9120j09961j02259O3417
404a12000J50196L3538j03706n4839J03268J35744j0234j28804n0013R9096Q4752
415A46998p5254j48256l3247J01702N9683r4401j20221K7843J35542N5604q4316
426b8323p5146P5148J42975K2663j07765o2952P7701J00127l6840j40134n8695
437i1241Q2159P0252o9749j25240j0977J14639P3455o7147q7804M6540J35679
448G0566N2285q2707p5978N8613J12709n235j23938p5423N9637Q1152m4000j30289
$$ plain form
371 102340 199795 108590 -41637 -43574 76374 109872 -23588 -160499 -126103 6924 25276
382 25276 -100161 -173967 -73466 76538 85142 -30028 -65007 61521 180491 129825 -9047
393 -9047 -38456 70210 133919 27081 -121396 -120400 -2317 36803 -73158 -175417 -112000
404 -112000 38196 71734 -31972 -86811 16457 152201 141967 13163 -36850 62246 146998
415 146998 71744 -76512 -109759 -8057 51626 -42775 -162996 -135153 389 55993 -28323
426 -28323 -103469 -28321 114654 137317 29552 -33400 44301 144428 107588 -32546 -91241
437 -91241 -9082 61170 -8579 -133819 -144796 -30157 43298 -23849 -111653 -65113 70566
448 70566 122851 40144 -35834 22779 135488 130253 6315 -69108 -9471 71681 27681 -102608
460a02608m1948R4992Q1961m9237r6541J4447J27250P6611o3185q3068M1015J15662
472A15351K6740j02166r0004M0962Q9573k1141j23600o5688O7457Q7235k8751
483d032j02355j3935J10035Q8681l8543q2843J6783J12019N4931p7923r3074K2102
495h154Q7588N009j07033q5846M1373Q7271j2223r9111l8537Q4226R6666j4725
507C6504q3616k723J04295P3995n0496r1708K022Q7474K9765r1861r6846J9142
519f4053Q2639O230r3126o3434O1059J00469J450q0265k1719Q8978R0352k3770
531H4810q9992j2701Q3854M8561o8343j00003n070P6990K3744q3960p8669L4863
543h5916R2777J9609p1120m1615P0304R8237p59p7976k5849P0981O5851m1480
$$ plain form
460 -102608 -144556 -49564 32397 -16840 -113381 -98934 28316 104927 41742 -41326 -311 115351
472 115351 142091 39925 -50079 -9117 80456 59315 -64285 -129973 -62516 24719 -4032
483 -4032 -106387 -120322 -10287 78394 39851 -42992 -26209 85810 140741 62818 -30256 -8154
495 -8154 79434 84443 -22590 -108436 -67063 20208 7985 -91126 -129663 -45437 51229 36504
507 36504 -47112 -49835 54460 128455 77959 -13749 -11727 75747 105512 13651 -83195 -64053
519 -64053 18586 24816 -68310 -131744 -70685 29784 31234 -49031 -70750 18228 108580 84810
531 84810 -5182 -17883 65971 114532 46189 -53814 -58884 18106 41850 -42110 -120779 -85916
543 -85916 6861 26470 -44650 -86265 -15961 82276 81517 3541 -22308 48673 114524 73044
555G3044r8598k3144O7071L5514o6778q7770O477Q3932L4024o3300n4831M9483
567d4876R6798K1929o6165l9569O0552P8729j9025q9952l7062N5586M9304m9353
579A6896r4892j4697P3263M2405n2181o6303K5705R3917L9094n6013m7672M7598
591G120Q3722N723p7497m9311M5185N8816l2020r1222l3683N5862N0267l8665
603a5703p4258M085Q3224M9561l9664n2539K9069Q4783K7411o2841n4313L2005
615A0820O2282j0215q2833n0092M0859N4544k6305p5395j6507O7349N8999k6038
627G468n8592J3889Q1655M2602m5141n7876J8661O7403Q915p3871n9311K6420
639b7778N5747j1714p4820l6066N3134O3353j5229n9236k573P2462N6949k8495
$$ plain form
555 73044 -25554 -48698 18373 53887 -12891 -100661 -94184 -10252 23772 -39528 -94359 -44876
567 -44876 51922 73851 7686 -31883 28669 107398 88373 -1579 -38641 16945 66249 16896
579 16896 -77996 -92693 -19430 22975 -29206 -95509 -69804 24113 63207 7194 -40478 7120
591 7120 90842 96565 19068 -30243 14942 73758 41738 -49484 -83167 -27305 22962 -15703
603 -15703 -89961 -85876 -2652 46909 7245 -45294 -16225 68558 95969 33128 -21185 10820
615 10820 73102 62887 -19946 -70038 -29179 25365 -940 -76335 -92842 -25493 33506 7468
627 7468 -51124 -37235 44420 87022 41881 -15995 2666 70069 78984 5113 -54198 -27778
639 -27778 27969 16255 -58565 -94631 -41497 21856 6627 -52609 -55182 17280 74229 45734
651D5734n9228P877O6765K5041n7515o4814J0236N5909K054o9323m8886L4394
663e1756O1261j151n7161j9451O0408O4083j2383n4547m329O0245M1038l9780
675D6477o6407j779N2190J4300n8323n8759J5453N9060R400n4706l1913M5537
687b9470O6400L389n0931j5950N5384N2282k3982o2655j3189M7578K7652m7346
699I162o5958R45N3558J7522m7851m3679K8617O6547J5604m5476k4470M5301N8447
712F8269n116n6728k3241M2002L6791l3407o4620j4435M4098K6524l9451n1772
724g1086J2627O0033K4848l6064l2435L2073O2168J0128m8211k8641L3564M3151
736F2155j6824o1768k6632L6591L1803l0796n5030l779N1661L3365k9414l9169
$$ plain form
651 45734 -13494 -5617 61148 86189 28674 -36140 -25904 30005 32059 -37264 -86150 -51756
663 -51756 9505 8354 -48807 -68258 -7850 56233 43850 -10697 -15026 45219 86257 46477
675 46477 -19930 -21709 30481 44781 -13542 -72301 -56848 2212 11612 -43094 -75007 -29470
687 -29470 36930 40319 -10612 -26562 28822 81104 57122 -5533 -18722 28856 56508 9162
699 9162 -56796 -55851 -2293 15229 -32622 -76301 -47684 18863 34467 -11009 -35479 9822 68269
712 68269 63153 6425 -16816 25186 61977 28570 -36050 -50485 -6387 20137 -19314 -71086
724 -71086 -58459 1574 26422 -9642 -42077 -10004 52164 62292 14081 -14560 19004 62155
736 62155 45331 -16437 -43069 -6478 25325 -5471 -60501 -64280 -12619 20746 -8668 -47837
748d7837K1043O1209K2484l8000l4031K5284M9739k780n6713l3800K7246L5816
760B9660j9496n7220j8227M3233L7453k1807m2138P362N5906L3919k7777l7364
772a6496J7339N0422J0816m5447l9944J6732L9248q668n4379k8655L0316L8714
784I998j1491m3997o294M8910M0000j6988l6964P007M8748K4122l4856m3031R259
797e577L9032K004m7799l8206J8526M0337m254m4497j6943L8871M3767o334l7704
810a8777k258M6806L3293k3927m2215N55L8613J3308m1224m3989Q893L7823L188
823A0089m0887k7778K7462M5635J956l5939r981L9497L9770j0626m0391p173L6532
836B8166K1830l0956m4774k694L3884J1650l6419l5490J5963M2612R478l1193
$$ plain form
748 -47837 -26794 34415 56899 18899 -15132 10152 59891 57111 398 -33402 -6156 29660
760 29660 10164 -47056 -65283 -22050 15403 -6404 -48542 -41180 14726 48645 20868 -16496
772 -16496 843 51265 62081 16634 -23310 -6578 32670 24002 -30377 -59032 -28716 9998
784 9998 -1493 -45490 -51784 -2874 37126 20138 -16826 -9819 38929 63051 28195 -14836 -5577
797 -5577 33455 35459 -12340 -50546 -32020 8317 4063 -40434 -57377 -18506 25261 18927 -18777
810 -18777 -21035 25771 59064 35137 -7078 -6523 32090 45398 4174 -39815 -30922 6901 10089
823 10089 -30798 -58576 -31114 14521 16477 -19462 -29443 10054 49824 39198 -1193 -8366 28166
836 28166 49996 19040 -25734 -28428 5456 17106 -19313 -54803 -38840 3772 13250 -17943
848a7943j8703L1109M4406o8l6335j2482L1679K9251j9068m5131j1382L0978J6866
861B3177l0531l9662L769L8901J6521k8348k5648K2939M5021R574l0750j8651
873a3688K6764L5817q888m2278j7327K5343K2331k1966m2960o876L4084K0452
885A0808k3305k9692J1892M2542J8605k5103k2656K0921L7809K266l5647k3196
897a4756J9330K6944j3902m1816j5561K5812K3726j6404l3626J602L8667K3981
909B3997j8416k4720J2837L8809J2796k9710k6561J4508K9032m874l8655k3658
921c4615J9101K6730j1703l5177p269L2226K8079j1849k7595N696L8515J9942
933D2081k2023k7748Q116L0970M351l4647k8410J2530K6403n008l4067j6702K4875
$$ plain form
848 -17943 -36646 -5537 38869 38801 2466 -10016 21663 50914 31846 -13285 -24667 6311 23177
861 23177 -7354 -47016 -43247 -4346 12175 -16173 -41821 -18882 26139 35713 4963 -13688
873 -13688 13076 48893 40005 -2273 -19600 5743 28074 6108 -36852 -43728 -9644 10808
885 10808 -12497 -42189 -30297 12245 30850 5747 -16909 4012 41821 44087 8440 -14756
897 -14756 4574 31518 17616 -24200 -39761 -13949 9777 -6627 -40253 -38651 16 23997
909 23997 5581 -19139 -6302 32507 45303 15593 -10968 3540 32572 27698 -10957 -34615
921 -34615 -15514 11216 -487 -35664 -42933 -10707 17372 5523 -22072 -16376 22139 42081
933 42081 20058 -7690 426 31396 35747 1100 -27310 -14780 11623 6615 -27452 -44154 -19279
946a9279L0346o241k7642j378L3536K6604j3083k8199K411L0749J1706k7179l0693
959a8342M319K6198J960l2428k3141J6887K9488l2k6588r353K8630L0968o174
972B2392k6938k365K8533J9353j9591l2536j047K5555P082k8320k7925P923K9073
985A189N248k6288j5447K2680L2110J375k4669q258K6179K5152j1858l1002o401
998i990K2523J3104k2348l1607L12K6342Q909k2720k0414J3826L2127Q039k2145
1011d042j2109K1771K7909l030k7444j1988K0039J8095j6440l1675o637K1906
1023c645J2966j8848k5247O615L0293J1991j7997j5796J5862L0544M654k4799
1035F593j4453J6977K1081r243l0582j2775J8486J6118j5465k7461p85K6261J6402
$$ plain form
946 -19279 11067 4826 -22816 -24194 9342 35946 22863 -5336 -2925 27824 39530 12351 -18342
959 -18342 -14023 12175 14135 -18293 -41434 -24547 4941 4909 -21679 -31032 -2402 28566 22392
972 22392 -4546 -6911 21622 40975 21384 -11152 -12199 13356 20438 -7882 -35807 -27884 1189
985 1189 6437 -19851 -35298 -12618 19492 20867 -3802 -12060 14119 39271 27413 -3589 -9990
998 -9990 12533 25637 3289 -28318 -28006 -1664 7245 -15475 -35889 -22063 10064 18103 -4042
1011 -4042 -16151 5620 33529 30499 3055 -8933 11106 29201 12761 -18914 -25551 -3645
1023 -3645 9321 -9527 -34774 -28159 2134 14125 -3872 -19668 -3806 26738 31392 6593
1035 6593 -7860 9117 30198 20955 -9627 -22402 -3916 12202 -3263 -30724 -31509 -5248 11154
1048A1154j4496j9579J0732L0660J0457j9508j6909J2592K4175j797k8356j6861
1060a7736J4031J7584r856k7867q584K1796J8807j0846k0920M263K7982J6370
1072B5024j4101j8891Q541K5419M656k3573j9583Q643J9534m481k7495j4118J6339
1085a4086J9665o203k2160k702K5393K0155r592j9010M239K4848J1410j8675k1823
1098h541N278K0187J35k4779j8586J0331K0595k592k2762p998K0857K1727m013
1111I839j9191n73K3958J6352j3189k1576J063J9555O020k1366k1958N164J9627
1124C725Q70k0957j3193J4692K3079L18j8614m366K0770J9750o602k0576l132
1137d236J9021J0552j6908k2841j27J7693N125j9200j7581R349K2318L792j6705
$$ plain form
1048 11154 -3342 -22921 -12189 18471 28928 9420 -7489 5103 29278 27481 -875 -17736
1060 -17736 -3705 13879 4023 -23844 -32428 -10632 8175 -2671 -23591 -19328 8654 25024
1072 25024 10923 -7968 573 25992 30648 7075 -12508 -3865 15669 11188 -16307 -30425 -14086
1085 -14086 5579 -624 -22784 -25486 -93 20062 10470 -8540 -4301 20547 31957 13282 -8541
1098 -8541 -3263 16924 17059 -7720 -26306 -15975 4620 2028 -20734 -28732 -7875 13852 9839
1111 9839 -9352 -9925 14033 30385 17196 -4380 -3317 16238 22258 892 -21066 -15902 3725
1124 3725 4595 -16362 -29555 -14863 8216 8534 -10080 -14446 6324 26074 19472 -1104 -4236
1137 -4236 14785 25337 8429 -14412 -14539 3154 8279 -10921 -28502 -19153 3165 6957 -9748
1150i748q795J7012K2551j229j9373n814J7294J4375j1142k3338m793J6614Q289
1163A1903j6732k0174L420K0365P514j5092j2631J2845K3173L712j6417q709J4363
1176G540J7870n620k1902q174J3880J0762j2405k1654k627J8137R926j2913j4736
1189b1916P292K2042Q663j3601j1220J1661J9606k49j9193j0966J0842J3699q334
1202H326k2193o818J4683J1361r654j7286K152K0767J1463j0968j2346Q201K0272
1215A7960N150j6308j2988Q830J5131m337k0580j0978J1098J3370p417j8490k228
1228b1787J7592J3447p299j3902M247K0216R289j2554j3648N498J5836R64j8509
1241f10j3812P681J3391m120j7889p252J3657J5212m387j4580P84J8247J2487
$$ plain form
1150 -9748 -18543 -1531 21020 19791 418 -5396 11898 26273 15131 -8207 -13000 3614 11903
1163 11903 -4829 -25003 -21583 -1218 6296 -8796 -21427 -8582 14591 18303 1886 -6823 7540
1176 7540 25410 19790 -2112 -10286 3594 14356 1951 -19703 -22330 -4193 5733 -7180 -21916
1189 -21916 -14624 7418 16081 2480 -8740 2921 22527 22278 3085 -7881 2961 16660 8326
1202 8326 -13867 -20685 -6002 5359 -4295 -21581 -19429 1338 12801 1833 -10513 -2312 17960
1215 17960 23110 6802 -6186 2644 17775 13438 -7142 -18120 -7022 6348 -1069 -19559 -21787
1228 -21787 -4195 9252 1953 -11949 -7702 12514 21803 9249 -4399 1099 16935 17899 -610
1241 -610 -14422 -6741 6650 2530 -15359 -22611 -8954 6258 1871 -12709 -11925 6322 18809
1254A8809p940j4337K464J6590M799j5350j5192L850J3480l35j7523j1204J0256
1267a1633J5291j807j4236l509J5758J5521m609j4235L58J5672Q742j1445j6260
1280f392P32J3565K430j5783j3449N578J4702J396j4012p184J3002J6208j042
1293I751j2949k617J4248J2170p478j5893j819J2246N505j2630j5678J474J3879
1306B09L379j2850r656Q857J6082K608j1889n191J2508J4175l396j4493m583J1352
1320G112Q473r995j6424j603J1952N354j0987j2339M729J5970M806j0617o988
1333a0557R733J5356Q82j3094o505J0197J0259o381j5898n119J0475P204r247
1346b695j3894J088J3876P000q425r200O695J5882L988j0798p436P745J2046k210
$$ plain form
1254 18809 10869 -3468 -1004 15586 20385 5035 -10157 -6307 7173 6838 -10685 -21889 -11633
1267 -11633 3658 1851 -12385 -15894 -136 15385 10776 -3459 -3101 12571 21313 9868 -6392
1280 -6392 -5660 7905 10335 -5448 -18897 -13319 1383 2779 -11233 -18417 -5415 10793 9751
1293 9751 -3198 -5815 8433 20603 13125 -2768 -4587 7659 13164 534 -15144 -13670 209
1306 209 3588 -9262 -18918 -10061 6021 8629 -3260 -8451 4057 18232 14836 343 -4240 7112
1320 7112 15585 5590 -10834 -12437 -485 4869 -6118 -18457 -13728 2242 7048 -3569 -10557
1333 -10557 -824 14532 15414 2320 -4185 6012 16271 9890 -6008 -11127 -652 6552 -2695
1346 -2695 -16589 -15501 -1625 5375 -3050 -12250 -5555 10327 14315 3517 -3919 3826 15872 13662
1360A3662j5072p461Q280Q379o664j4328k985J1840Q647o858j0471L674J4800
1373E443P070q242q820N830J3198R00j2957r010O110R510l899j4651n886R559
1387e845R246n052j1099J93J3608R115o087r456M085J2983M490j0537j0346M167
1401e35J0346j404j3516q264O498R722k672j2011k722J1538J0291l654r383J195
1415d571J2848P279p944j0378K143J0351J525j1729j0366L949R869j221j1488
1428i733n537Q763J1221j596r581r05J1846R234n002j0283J67J0468M188r926
1442C324j1305J812R274Q78j0932q057O371J1046K03r351k930R967J0627j902
1456I025r929j405R983O188p103j1419p73Q762K821r742r757L425J0304K175q548
$$ plain form
1360 13662 -1410 -8871 -591 7788 1124 -13204 -16189 -4349 4298 -2560 -13031 -9357 5443
1373 5443 12513 4271 -4549 1281 14479 15379 2422 -6588 -478 9032 5133 -9518 -15404 -5845
1387 -5845 3401 -1651 -12750 -12557 1051 10166 4079 -5377 -1292 11691 16181 5644 -4702 -535
1401 -535 9811 8407 -5109 -13373 -6875 2847 175 -11836 -14558 -3020 7271 3617 -5766 -4571
1415 -4571 8277 15556 7612 -2766 -623 9728 11253 -476 -10842 -6893 2976 1755 -9733
1428 -9733 -15270 -6507 4714 3118 -6463 -7368 4478 13712 8710 -1573 -1406 9062 13250 3324
1442 3324 -7981 -6169 3105 3983 -6949 -15006 -8635 2411 2614 -6737 -9667 300 10927 9025
1456 9025 -904 -2309 7674 13862 6759 -4660 -5433 3329 6150 -3592 -13349 -9924 380 2555 -5993
1471e993n345P801J1597K11q785k979Q644Q366m192j1294k461P946M318p914j0604
1486a0684K56R456L601p895o935N438J1322K693p682m550P628R725j804j0243
1500C26l779O841O121n996j1492j766Q287M406o720q194K803J0742M247o695n387
1515f256O119J0234J027q801n343O058P226l813j0962l834O499N485n293r427
1529a1081L81R657N360n122o394L888J0668L207p367n795M768P972j224j0146
1543a228n625N276O103m087r597k061P888O521m043p380K252J0172N090n633o328
1558b680L382Q724J025r041o429L732O664k470r677m187O516O814k907p561q7
1573h182R144O745l933o713K157Q789K995p085p208K107O985l96r279n774M448
$$ plain form
1471 -5993 -11338 -3537 8060 8271 -514 -3493 5151 13517 9325 -1969 -4430 3516 7834 -80 -10684
1486 -10684 -10428 -972 2629 -5266 -12201 -6763 4559 7252 -430 -4980 2648 12373 10569 326
1500 326 -3453 3388 9509 3513 -7979 -9745 -1458 2948 -3772 -11966 -9163 1579 5826 -869 -6256
1515 -6256 -137 10097 11124 2323 -3020 3038 10264 6451 -4511 -8345 -1846 3639 -1654 -11081
1529 -11081 -10700 -1043 4317 -805 -7199 -3311 7357 10564 3197 -2598 2170 10142 8918 -1228
1543 -1228 -6853 -1577 4526 439 -9158 -11219 -3331 3190 -853 -8233 -5981 4191 9281 3648 -2680
1558 -2680 702 9426 10451 1410 -5019 -1287 5377 2907 -6770 -10957 -4441 2373 -534 -8095 -8182
1573 -8182 962 7707 3774 -2939 -782 8007 11002 3917 -3291 -1184 5801 5405 -3874 -9648 -5200
1588e200O901j442p831k172P834P439k357o487N46Q380N142n304p562J145P103
1603F135J015p895p133K541O811k80p778l714O204P500o00o534r18P964O326l406
1619F238p181k07O933L006o896p920J355O296P35p044n484M219P723M75o338k031
1635f121O636P329j339o913j167O612M263n038p815o23N960K038o507o530K243
1650f972P311J421n597l605N381P925J45o168j963N923N335l008p624j936N596
1665B164K941n593p266N04O548K645n317m792L933P919J535n274l027N230O538
1680H688j434p241k620M757L915m098p651j176N673L245m642n621K178P274L077
1695D324m656l737M260O953L56o102l486L946N074k939p569k450M679L704l665
$$ plain form
1588 -5200 1701 259 -7572 -9744 -1910 5529 3172 -3315 -2769 5611 10753 5449 -2113 -968 6135
1603 6135 7150 -745 -7878 -5337 1474 1194 -6584 -10298 -4094 3406 2806 -3728 -4646 3318 9644 6238
1619 6238 -943 -1150 5783 8789 1893 -6027 -4672 1624 2359 -4685 -10169 -5950 1773 2248 -4090 -6121
1635 -6121 515 7844 6505 -408 -1575 5037 9300 4262 -3553 -4176 1784 3822 -2685 -9215 -6972
1650 -6972 339 1760 -3837 -7442 -2061 5864 6009 -159 -2122 3801 9136 6128 -1496 -3432 2164
1665 2164 5105 -488 -7754 -7250 -702 1943 -3374 -8166 -4233 3686 5221 -53 -3080 2150 8688
1680 8688 7254 13 -2607 2150 6065 1967 -5684 -6860 -1187 2058 -2584 -8205 -6027 1247 4324
1695 4324 -332 -4069 191 7144 7500 1398 -2088 1858 6932 3993 -3576 -6026 -1347 2357 -1308
1710a308o257L29O690L699l825m153L011P107K064n249l968L540N193j178o894
1725a199l714L845M068k905o584j123N606M220k801m882J670P127L131l984m302
1740a827K549N808M24o259m369K928M345j856o629k573M479M721k335n081M52
1755e223O386M180k936m469J639O134J668m928m916J688M763m99o523l834L581
1770c289M510j285n319j124N481N123k058m541R15N903L109l874n194J084N084
1785D525K30n731m595K032M724n38n430k263M464N330r69m444k38N514M223k755
1801D079n013L26M874J505m828n148J064M439R1n121l435L325N272k2m469j081
1817d142N021M745j342m742n03M649K799l830n463J39M190J007m806m361K035
$$ plain form
1710 -1308 -7565 -7236 -546 3153 -672 -4825 -1814 5293 7357 2108 -1860 1680 6873 5695 -1199
1725 -1199 -4913 -1068 3000 95 -6489 -7612 -2006 2214 -587 -5469 -3799 3328 6459 2475 -1827
1740 -1827 722 6530 6954 695 -3674 -746 3599 1743 -4886 -7459 -2980 1741 -594 -5675 -5223
1755 -5223 1163 5343 2407 -2062 -423 5711 7379 2451 -2465 -777 3986 3487 -3036 -6870 -3289
1770 -3289 1221 -64 -5383 -6507 -1026 4097 2039 -2502 -1587 4316 7425 3551 -1643 -559 4525
1785 4525 4755 -976 -5571 -3539 1185 647 -4783 -7046 -2582 2748 1779 -2665 -2903 2611 6834 4079
1801 4079 -934 -608 4266 5771 943 -4205 -3141 1298 1389 -3732 -7167 -3842 1430 1408 -3061 -4142
1817 -4142 879 5624 4282 -460 -963 3686 6485 2655 -2808 -2669 1521 2528 -2278 -6639 -4604
1832d604N071O67m250j950M025N430l19m499r75M318L689k616n338r49M089J850
1848C639m289n049Q83M566J468m020k942L216N354P70m005j660L978M328j469
1863D768n040j505L569K515l213n336m54M176K049l760l670J832N305J731l474
1878e07k554L521M896l09m371k085L042L459k487n446j296L545K364l115m312
1893e655N98N038K355l079k879K615N115R91l939k525K877L691j253n241k200
1908c491K987K780k418m879l88M425K608k382l240J483N260K022l333k801K173
1923H06M168j00m705k845K451L016j788m851j652L722L219k107l771P07M941K708
1939C919k387l056J382M669Q58m044l225J750L317r23m754k500K738L377j431
$$ plain form
1832 -4604 467 1134 -3116 -5066 -1041 4389 4070 -429 -1404 2914 6603 3987 -1351 -2300 1789 3639
1848 3639 -650 -5699 -4816 -250 1218 -2802 -5744 -2528 2826 3596 -409 -2069 1909 6237 4768
1863 4768 -272 -1777 1792 4307 1094 -4242 -4696 -520 1529 -2231 -5901 -4069 1236 2967 -507
1878 -507 -3061 460 5356 5047 676 -1409 1633 5092 2605 -2841 -4137 -592 1772 -1343 -5655
1893 -5655 -5057 -19 2336 -743 -3622 -1007 4108 5099 1160 -1365 1512 5203 3950 -1291 -3491
1908 -3491 -504 2276 -142 -5021 -5409 -984 1624 -758 -3998 -2515 2745 4767 1434 -1367 806
1923 806 4974 4874 169 -2676 -225 2791 1003 -3848 -5500 -1778 1441 -666 -4437 -3730 1211 3919
1939 3919 1532 -1524 -142 4527 5385 1341 -1884 -134 3183 2260 -2494 -4994 -2256 1121 -310
1954c10l932m40M380L451j800l331R98M608J770l013l765J117L644P6m662l063
1970d272J942L363o45m240j458L693L739r54l421J34M356K951k400l738P29L633
1986C412R25l910l700R79L463j01m177k158K549L983l72l364p21M131L583j519
2002C003l472j41L745J816l182m136L49L358M52l929l049J888M048O8l376j428
2018c986L442M068m60l527o18L675K461k239m041m79L148J317l659l652R09L741
2034A00P28l096k200K593M336J87l077j226L365L182j204m023j242L160J844k835
2050E92m012j79L280J551l166k681J739M206R15k664j992K973L955n30l639j541
2066a193K624K410j937m298j024L076J656k420l527Q08L987J865k583k262K169
$$ plain form
1954 -310 -4242 -4682 -302 3149 1349 -1982 -984 3624 5394 2381 -1384 -267 3377 3453 -1209 -4272
1970 -4272 -2330 1033 388 -3852 -5310 -1617 2122 1168 -2253 -2119 2237 5188 2788 -950 -221 3412
1986 3412 4337 427 -3273 -2294 1169 1068 -3109 -5267 -2718 1265 893 -2471 -3192 939 4522 3003
2002 3003 -469 -610 3135 4951 1769 -2367 -2018 1340 1792 -2137 -5186 -3298 750 818 -2558 -3986
2018 -3986 -544 3524 3064 -463 -1081 2594 5055 2816 -1225 -1704 1444 2761 -898 -4550 -3641 100
2034 100 828 -2268 -4468 -1875 2461 2648 -429 -1655 1710 4892 3688 -335 -1577 1583 3427 592
2050 592 -3420 -3599 -319 1232 -1934 -4615 -2876 1330 2245 -419 -2411 562 4517 3987 348 -1193
2066 -1193 1431 3841 1904 -2394 -3418 -342 1314 -1106 -4633 -3825 162 2027 -556 -2818 -649
2081f49M035P77l296k020K219L067j194m190j639K440K255k016l841j02L452K130
2097A428k004k666J463M145J521k675k382J821L341j30l944k298J930K619j465
2112G04l926j232L032K615j577l249P78M042K107k008k670J423L635O42l275k887
2128a846J620K664p22l906k025K396K853j351l250KL336K880j431k870P98L872
2144C020J434k590l080R38L037l8l780k591J626K866n72l427r83K952L170r02
2160A080k839J37L593K255j838l165M22L058P33l275l041R67K811k4l418j873
2176d417K213L407j31k878p07L350K956j157l057j72K996J609k704l367K11K819
2192I71M31l083k587J459L331M09k830j053K651L362l29k883p71K968K236k103
$$ plain form
2081 -649 3386 4163 867 -1153 1066 4133 2939 -1251 -2890 -450 1805 -211 -4052 -4154 -702 1428
2097 1428 -576 -3242 -1779 2366 3887 1212 -1170 651 3992 3862 -82 -2380 -450 2169 704
2112 704 -3222 -4454 -1422 1193 -384 -3633 -2855 1187 3294 1286 -1384 39 3674 4316 1041 -1846
2128 -1846 -226 2438 1716 -2190 -4215 -1819 1034 -317 -3567 -3565 -229 2651 1220 -1650 -852 3020
2144 3020 4454 1864 -1216 -278 2759 2721 -1059 -3650 -2024 842 270 -3157 -4140 -1188 1982 1080
2160 1080 -1759 -1622 1971 4226 2388 -777 -355 2703 3436 161 -2880 -1913 898 874 -2544 -4417
2176 -4417 -2204 1203 1072 -1806 -2513 837 3793 2636 -421 -593 2403 4012 1308 -2059 -1848 971
2192 971 1402 -1681 -4268 -2809 522 931 -1899 -2952 -301 3061 2732 -151 -922 2046 4282 2179
2208B179l371m74K733J001k713l228P88L087Q19k558j773K048L635M72k885j080
2224a320K679K567r30l379j134K720J518k334l332k39K691J439k381k371J373
2239b433L642R54k372j595K190L171j08l076j557K176J974j592l439r56K572J614
2255A165k046k695M49L341J692k102j887J578L393O27k729j873J738K496q89l446
2271a188j536K149J902j412l233k24L001K043j641k310R34L476J369k166k028
2286h64J265K772j38l090k027J410K248r46l347q78K390K253r91k612L14L338
2302A097J828j599k282R77K777P80k824k448J100K445m34l318j625J821K490o74
2318A11k688l59K984K318r97k364L35K964J445k233k597M14K522K24l001k302
$$ plain form
2208 2179 -1192 -1666 1067 2068 -645 -3873 -3085 2 821 -1737 -3510 -1462 2173 2645 -240 -1320
2224 -1320 1359 3926 2996 -383 -1517 1203 2721 387 -2945 -3184 -493 946 -1435 -3806 -2433
2239 -2433 1209 2163 -209 -1804 386 3557 3449 373 -1184 992 2966 1374 -2065 -3021 -449 1165
2255 1165 -881 -3576 -3127 214 1906 -196 -2083 -505 2888 3515 786 -1087 651 3147 2258 -1188
2271 -1188 -2724 -575 1327 -85 -3318 -3542 -541 1502 -139 -2449 -1515 1961 3330 1164 -864
2286 -864 401 3173 3035 -55 -2082 -672 1576 630 -2717 -3595 -1205 1048 57 -2555 -2241 1097
2302 1097 2925 1326 -956 21 2798 3578 754 -1694 -594 1851 1417 -1901 -3526 -1705 785 111
2318 111 -2577 -2936 48 2366 1369 -995 -660 2304 3749 1516 -1081 -667 1855 2079 -922 -3224
2334c224J276K537l60k492j186K415K810m61k399k02K837J896j356k733%K493
2350A851P30k550k516N73K283L27k481j671J627K991jk279o62K360K666q61k618
2367b31m55K263J423j882k955j74K320Q36k311k232J109K758O55k087j314K010
2383b67K931q6k486q61K003K014j352k991p32K103J193j960k550K28K524J245
2399I56j854j712J379K969Q04k194j241J805K163n19k858j181J593J749j493k833
2415b467l16K140J446j431k117P61L052J046j597j620J370K525J92k580j664J393
2431A33J945r88k913r59J907J752j277k310K11K790J651j365j875Q18K904N89
2447C013k108j838J033K052k99k799j517J427J793p15k324o20K411J853p96k072
$$ plain form
2334 -3224 -1948 589 229 -2263 -3449 -1034 1776 1315 -1084 -1286 1551 3447 2091 -642 -642 1851
2350 1851 2581 31 -2485 -1912 371 698 -1783 -3454 -1827 1164 1163 -1116 -1778 582 3248 2387 -231
2367 -231 -686 1577 3000 1118 -1837 -2011 309 1145 -1166 -3398 -2289 469 1124 -963 -2277 -267
2383 -267 2664 2578 92 -769 1234 3248 1896 -1095 -1827 276 1469 -491 -3041 -2813 -289 956
2399 956 -898 -2610 -1231 1738 2542 348 -893 912 3075 2556 -302 -1483 110 1859 366 -2467
2415 -2467 -2783 -643 803 -628 -2745 -1984 1068 2114 517 -1103 267 2792 2984 404 -1260 133
2431 133 2078 1090 -1823 -2782 -875 877 -400 -2710 -2499 291 1942 577 -1298 -480 2424 3013
2447 3013 905 -933 100 2152 1853 -946 -2463 -1036 757 42 -2282 -2902 -491 1362 566 -1506
2463a506M82K721J174j438k186N15K390K31k356k140R65K076m84k326j180J813
2479a249K232m66j994l08K473K057j165k070J91K148R68k078k390N01K040M1k251
2496a320j718J302K343m2k063o02K054K319n85j978l45K178J353j399k512p2J822
2513G35O32j882k322Q40K267K99j973j159J698K463J01j990o98K132J719r21k421
2530d80n70J740J196j773k283l4K186O79j772j544J161K460O38j785j039J629
2546D09K180k45k223r18J550J373j149k617m84J913J019j407j937L37K414R79
2562A194j356j280J135K403L52j888j324J223J888q05k465j011J544J278j120
2577b32k038k17K051J543j157j626Q06K393R72j756j435R66J928j39k226j423
$$ plain form
2463 -1506 -1024 1697 2871 1433 -753 -238 2152 2383 27 -2113 -1148 928 444 -1882 -3062 -1249
2479 -1249 983 517 -1477 -1785 688 2745 1580 -490 -299 1849 2817 739 -1651 -1150 890 931 -1320
2496 -1320 -3038 -1736 607 565 -1498 -2100 -46 2273 1688 -290 -635 1543 2896 1497 -1015 -1087 735
2513 735 1367 -515 -2837 -1997 270 569 -1404 -2563 -865 1598 1699 -291 -989 1143 2862 1941 -480
2530 -480 -1050 690 1886 113 -2170 -2204 -18 661 -1111 -2655 -1494 966 1604 -181 -1220 409
2546 409 2589 2344 121 -797 753 2126 977 -1640 -2124 -211 808 -599 -2536 -2199 215 1194
2562 1194 -162 -1442 -307 2096 2448 560 -764 459 2347 1542 -923 -1934 -390 888 -232
2577 -232 -2270 -2487 -436 1107 -50 -1676 -870 1523 2495 739 -696 270 2198 2059 -167 -1590
2593a590J176J579o96k368p45J952J432p49j719J95K370J388j342j598P27J988
2609B000M08j859j734P24J645k10k265j166J281J815n24j825l03K002J712o65
2625A036j757L20K008J032j622j820L69J734J36k100j618Q59J815j09j809p50
2641b276J704J893m37j650l5J941J365j067j972NJ769N57j784j818M19J744J95
2658E53j859j128J294K143n8j739m62J725J770o40j809k47J613J001j530j988
2674a361n6J681N08j681j516Q28J915N05j667q17J628J847j03j651p11J664J223
2691B236r54k129l58J411Q46j412j847K40K035N79j334j131J089J988M29j457
2707B31j124J556J452l92k065p86J265J242j168j906k46J647R69j108j464O69
$$ plain form
2593 -1590 -414 1165 469 -1899 -2644 -692 740 -9 -1728 -1533 837 2225 883 -715 12 2000
2609 2000 2408 549 -1185 -461 1184 974 -1291 -2457 -1176 639 115 -1710 -2013 -11 1701 1036
2625 1036 -721 -401 1607 2639 1017 -803 -434 1300 1436 -664 -2282 -1423 392 283 -1526 -2276
2641 -2276 -572 1321 884 -766 -801 1140 2505 1438 -534 -529 1240 1797 13 -1805 -1386 358 553
2658 553 -1306 -2434 -1140 1003 945 -794 -1256 469 2239 1599 -210 -457 1156 2157 627 -1361
2674 -1361 -1417 264 772 -909 -2425 -1597 318 823 -844 -1661 -33 1814 1711 60 -651 1013 2236
2691 2236 1282 -847 -1205 206 1052 -360 -2207 -1967 68 647 -687 -1818 -729 1259 1688 231
2707 231 -893 663 2115 1723 -342 -1128 137 1379 211 -1695 -1941 -294 675 -433 -1897 -1228
2723a228K007P94j296j096J003J810K5j806j058J082J109n84j947p37J352J138
2739E68r03j589J97J951J106j056j313P05J986M54j544j243P08J472k55k051q32
2756a639R87J259n90j755k35J617J429o87j462L54J900Q17j017j446M33J569R6
2773A630j770j438Q44J352k96j727p66J379J411l80j276j22J665J426q91j505
2789d64L93J391O12j458j588L72J397M4j736j043J046J460Rj538l18J545J518
2806A642n48j381j72J514J039j222j726J74J375J77j332j423M92J593M9j267o73
2823a689J219J514N8j329m14J509J036n56j757j66J098P07j247j588K80J354M97
2840E26j253j194R56J687J58j272m84J288J393l48j503m56J048R57j071j642k32
$$ plain form
2723 -1228 779 1573 277 -819 184 1994 2019 213 -845 237 1346 762 -1185 -1922 -570 568
2739 568 -335 -1924 -1727 224 1330 274 -1039 -334 1652 2106 562 -681 27 1499 1244 -807 -1639
2756 -1639 -652 607 17 -1738 -1973 -356 1073 386 -1076 -722 1178 1995 978 -468 -35 1534 1630
2773 1630 -140 -1578 -734 618 322 -1405 -2171 -792 619 239 -1037 -1159 506 1932 1041 -464
2789 -464 -71 1320 1932 474 -1114 -742 655 699 -1037 -2080 -1034 426 435 -1103 -1421 124 1642
2806 1642 1094 -287 -459 1055 2094 872 -854 -680 695 872 -460 -1883 -1391 202 251 -1016 -1689
2823 -1689 -470 1044 1102 -227 -641 868 1904 1348 -409 -575 523 1230 -17 -1605 -1325 29 526
2840 526 -727 -1921 -965 722 880 -392 -876 412 1805 1457 -46 -502 546 1503 432 -1210 -1442
2857a442J447N47j150j135M21J656N20j166o83Q99J591J2j363o83J039J177p16
2874I71j667n48J154P58q02j559L9J635P81j048r98P14J574N62j277p89P13J411
2892A624k16j613r17Q51J201o81j637l43J440R18q00j045J43J617R31r61j072
2909e60N58J443K18j354j146O63J143l92j471q49J088J112m67j172k13J474J110
2926A185o00j170L24J495N92j221j210L83J212j10j420r56O62J206j74j446l02
2943a550J266J223l87j188R0J262Q81p01j378R2J318K44j330j093M01J182J15
2960D47j326p36R35J371j64j271j81J342J129m20j470M7J132O58j244j305J17
2977i39J269L28j311r29O13J285J52j181k71J020J336k25j159l90J093R01q05
$$ plain form
2857 -1442 5 552 -598 -1733 -1312 344 864 -302 -985 -86 1505 1517 154 -529 510 1687 971
2874 971 -696 -1244 -90 668 -134 -1693 -1654 -19 762 -286 -1284 -570 1004 1566 289 -500 213 1624
2892 1624 1408 -205 -1122 -271 930 249 -1388 -1731 -291 627 -173 -1218 -1075 542 1473 512 -560
2909 -560 -2 1441 1659 305 -841 -178 965 573 -898 -1747 -659 453 -14 -1186 -1399 75 1185
2926 1185 585 -585 -261 1234 1826 605 -605 -222 990 880 -540 -1496 -834 372 198 -1248 -1550
2943 -1550 -284 939 552 -636 -546 716 1597 896 -482 -390 928 1172 -158 -1251 -850 332 447
2960 447 -879 -1615 -680 691 527 -744 -925 417 1546 1126 -344 -297 835 1493 249 -1056 -939
2977 -939 330 658 -653 -1582 -969 316 468 -713 -984 36 1372 1147 -12 -402 691 1592 787
2994G87j410j85J019N59j004j335L68J289M38r26q76Q75J435J28j166n11J040
3011E25R66l66j376n37R94O53p42j423o3J250N06q34q30N19J305M49p99q98R64
3030B63J141j40j186o11P48Q41o32j265l54P83P89n82j113J31J418O51p39q49
3048g06N51J357J90j200o97P32Q70l32j378n96P90R07m32j175k76J200J050p31
3066A24p85K32J310N44r21r36M38J148o4j190r00O70Q27k63j318l35R85J106n63
3085A09r99O5J309P52o20j055L82R93M57j042j194M28R34o2j172o94P58J096k66
3104A79j028j91J108J097m26j169J92J135N24r50j030K01Q02J79r43r39L73J091
3122B05N6j078l48Q94J073q3j006j51J001Q42n63j133n3R45L51r32j129K87J080
$$ plain form
2994 787 -623 -808 211 770 -234 -1569 -1201 88 526 -400 -1276 -401 1034 1162 -4 -515 525
3011 525 1491 1125 -251 -788 206 859 117 -1306 -1369 -119 387 -447 -1277 -758 547 996 197 -701 263
3030 263 1404 1264 78 -533 215 1056 424 -841 -1195 -412 377 -205 -1318 -1187 231 882 143 -706
3048 -706 -155 1202 1392 192 -505 227 1097 765 -613 -1209 -419 488 56 -1119 -1395 -195 855 124
3066 124 -661 -429 881 1425 504 -432 6 1154 1090 -100 -1000 -330 497 234 -1084 -1419 -434 672 109
3085 109 -890 -825 484 1236 616 -439 -57 936 1393 351 -843 -415 519 457 -715 -1409 -651 445 179
3104 179 -849 -1040 68 1165 739 -430 -238 897 1421 471 -559 -358 444 623 -320 -1259 -886 205
3122 205 261 -817 -1165 -271 802 719 -287 -438 563 1405 842 -291 -344 601 952 20 -1109 -822 258
3141B58R2r53o34O92J093J7q71k01P95J045l53j019l12R82N34q80j031j26R72
3160A00L02r30p85M16J096K03o36n77P27J165Mj037m61Q89O42n03j151k28P90
3179B6N70q42q80N0J205M14p86p79Q35R43K43p70o37P00Q80l02j236m02O46P47
3199F25m94j138r9R40M93m58q03L61J028M78p67n58M81R85J8r80n59M37Q78m30
3219D38j131m94R24O21l26r41l2J080P35o21p49L41J009L77r48o88L31P55j40
3238E41r79o17P14P26n82p90j25R76O90l89p04J08J113L67o21p02K57Q14M9j045
3258a99p06M94O97j06r91k39P52O99j70o96j35J021O18n19q15P2R66K60q74q33
3278g04K28Q85j8q74p04O07Q79l5r17r3Q03Q50j53r39K2Q05M23o31q80Q3P52k9
$$ plain form
3141 258 350 -603 -1237 -545 548 565 -306 -507 288 1333 980 -39 -351 631 1165 285 -746 -872 100
3160 100 402 -528 -1313 -897 199 402 -234 -811 -84 1081 1085 48 -413 476 1118 615 -536 -764 26
3179 26 596 -246 -1126 -1076 129 543 -243 -1022 -187 756 999 229 -408 292 1172 870 -366 -768 -122 625
3199 625 131 -1007 -1106 -166 327 -131 -934 -573 455 933 166 -392 89 1074 1092 112 -447 -10 868 438
3219 438 -693 -1187 -263 358 32 -909 -941 139 874 253 -496 -155 854 1231 283 -405 -74 681 541
3238 541 -438 -1055 -341 385 -197 -987 -1112 -136 554 165 -539 -431 682 1049 428 -274 -17 797 846 -199
3258 -199 -905 -411 286 180 -811 -1050 -298 401 231 -465 -600 421 1039 520 -295 -223 743 1003 129 -704
3278 -704 -476 409 391 -483 -1187 -580 299 264 -653 -746 57 907 754 -185 -163 642 1065 434 -446 -363 389 360
3300C60o95o88K43Q85J68p08l80N01R26%o97k79P81O20m57q87n2O05M37o85r37
3321i39J56R55J53p03o80M73R88K16p28l56P10O36q7q58k26N37N19n66q99q7O99
3342h7M78o54o78K92Q18K23n72k32L57Q69N7p70m37O07M58k79q48k35N29M40n32
3363a96p28R9R60L49n93n84M86Q82J53o60m25M13O96j75r14m94O94N55m17r39
3383h38j10P76N24m18p08L38Q20L61m93n32M51N14O7p26m12M29M21k15p94l20
3403h65N70N42k33o29K0P32N34l12o30J64P40K73p37m33J26N97ro71n67L48O62
3424B22q5q67j02P75O59k96n66l3Q03L75n24n74P0P63o2o90n52L32N33q9n57l90
3446h55O57O46j19o24j39O87M57k29n84J0O72J22n96p14K00N26P2o36l86M37O41
$$ plain form
3300 360 -335 -1023 -780 105 273 -435 -815 -314 612 612 -85 -364 417 1037 580 -307 -359 246 683 -2 -939
3321 -939 -783 172 325 -378 -1058 -585 403 619 -109 -465 245 881 794 -64 -290 247 766 200 -699 -786 -87
3342 -87 391 -263 -941 -649 169 392 -180 -412 -55 814 871 101 -336 271 729 450 -398 -633 -104 336 -196
3363 -196 -924 -825 135 484 -109 -693 -207 675 828 168 -257 156 852 677 -237 -731 -37 518 101 -838
3383 -838 -948 -172 352 -66 -774 -436 384 745 252 -280 171 685 752 26 -386 43 464 249 -545 -865
3403 -865 -295 247 14 -615 -595 137 671 359 -271 -107 633 906 169 -264 -138 459 450 -221 -788 -440 222
3424 222 137 -730 -832 -57 602 306 -260 -293 510 885 361 -213 -143 620 558 -132 -684 -352 181 92 -465 -855
3446 -855 -198 448 329 -295 -434 253 710 481 -103 -93 579 701 105 -609 -409 117 189 -447 -833 -396 245
3467B45j10n44j51O11O19j22o45j4O33L00n25o88K2O03J70o25o28L06O74O8m97
3488b98l77N47O82lo39j37M67N55k20q58q4N65K86n80o30J49O21K78o09l38L33
3509b90P08J57n70k97O66L39k00n04l49M46M96k67r13O8L67K89l01n05K14P40
3529B94O7l16n01N29O44j4o91k30L90M11l37o12k05N08L18k87o09rP16K46l19
3550gm78L49O19J49n76k96L08M47l7o10l09L82L16l06n93n6N85L52l00m30J46
3571c45O53L33m59l45K80M56P7o58m12L32L61jp95j74M98L57j35n43J55N77K76
3592D88m10k72K83L40J29l67m42L14L00j44m75l03M23K70r1n19n4M99M22k17l45
3613a71O5N80J64n22k50j8M90Pl69l81J68L67j02l51k81M02M75k09l47M8N33K64
$$ plain form
3467 245 135 -409 -560 51 670 548 -97 -111 522 822 297 -391 -369 234 404 -221 -849 -543 131 199 -298
3488 -298 -675 -128 554 551 -88 -225 242 797 577 -281 -365 200 486 -94 -724 -575 46 324 -285 -623 -290
3509 -290 418 575 5 -292 374 713 513 9 -340 106 602 335 -578 -510 -143 146 -155 -660 -446 294
3529 294 361 45 -456 73 717 703 12 -218 172 583 246 -366 -571 -63 255 -32 -641 -650 66 312 -7
3550 -7 -485 -136 483 632 56 -240 68 515 478 -132 -441 -59 257 -49 -642 -698 -113 239 -61 -491 -345
3571 -345 308 641 182 -163 117 573 650 -8 -420 -88 273 272 -523 -697 -199 158 23 -520 -365 212 488
3592 488 78 -194 89 429 558 191 -251 63 363 219 -256 -559 -136 134 43 -476 -530 -31 391 174 -171
3613 -171 -106 474 638 116 -134 -152 338 345 -24 -405 -237 130 28 -323 -604 -202 273 64 -283 -235 298 562
3635E62j96m10lM00J76n70m06J29M42N0n11k53K58O55j42l85j42L63N24k09m29
3656i7n6N52Q5m66l60J52L14P0l59m57K82M11J16m51j75L07M84N9n09k2M67J90
3678E37j72n51p6N18N1l15n23J43M92Ql91k32L66M43J0l81j21M26N23l53o07L
3700b02M19M6k60m02N3L31J94m30k38K00L90K54m99j63M22L79k22k34k44M00J76
3721C70j18n58m2M29J31l34l49R8M88J91l69j78J21M91J57m89j72K32L61k19m19
3742a78j55L79J10j99m05J3M47K12k34l54J34M81J14k84l58M14L32k25k73j49
3762a78J35J64j27m61R0K44K98k09k79K20L69m0j18l18J00N30Jl98j28K3L86k70
3784C4l98m3L48J91l16l13J45M03J78j51k88KM95K12k75l58J75J53j1l09r3J27
$$ plain form
3635 562 366 -44 -47 353 529 -41 -447 -318 124 174 -337 -590 -332 323 181 -204 -346 17 541 332 -97
3656 -97 -153 399 484 18 -342 -190 124 194 -165 -622 -340 71 187 -264 -439 -132 352 411 -98 -120 347 537
3678 537 365 -186 -262 256 307 -8 -531 -388 104 112 -279 -511 -145 298 308 -73 -194 232 755 402 -205 -202
3700 -202 217 263 3 -399 -346 -15 179 -251 -489 -289 101 355 -144 -307 115 494 272 38 -206 194 370
3721 370 252 -306 -348 81 212 -122 -471 -373 115 306 -63 -241 -120 371 528 39 -133 99 460 241 -178
3742 -178 -333 46 156 -43 -448 -435 12 224 -10 -364 -230 251 365 81 -277 137 469 244 -29 -178
3762 -178 -43 121 -6 -467 -377 -133 165 -44 -323 -103 266 226 108 -210 -110 420 421 23 -105 -82 304 34
3784 34 -364 -407 -59 132 -184 -497 -352 51 229 78 -210 -208 287 499 224 -134 41 194 183 -126 -219 -92
3806i2K88j41m12rM03J54j93j56L0L77K17l42k57M7L58N0m04k32K17J63R9k89
3828a24l04K43L38j27k55J21K29J97m0m20O5K65J04j35m23J07K70K4l04j94J38
3849b25K75O2l51n1L39J27Ok76J6L25J23k16l36N3K00J29l35j51R5K53R0l00k37
3872c85K58M22q2k74j2K62J37n9m13OK63O0j97k29J36J90l3k25j28J55K02J05
3894A59k38j35L06K14j02k63OJ46R1j43k53o1K75J59k64j99J40L18l6k01j39J91
3916b9K89j4j33j74J84J84j62k05p7K31J1o6l17M1K45o0j0j46J90K50p4j57o6
3939f5R7L16j14k66l1J39P8k03j89L8J36J79k15j32O6K25J31k26j75J85L20p0
3961B24k12j94J81K57k57k42kK39R1j96j49J2J84K56j43k62R3L80q8k01j16J27
$$ plain form
3806 -92 196 55 -357 -366 37 191 -2 -158 -128 249 466 124 -133 -86 272 322 -82 -314 -97 66 165 -124
3828 -124 -428 -185 153 26 -229 -108 121 318 278 -142 -77 188 292 157 -266 -159 111 135 -169 -363 -225
3849 -225 50 112 -239 -290 49 176 182 -94 -78 247 370 154 -182 -129 71 200 -135 -286 -191 62 152 -148 -385
3872 -385 -127 295 213 -61 -73 189 326 267 -146 -140 123 183 -14 -243 -107 83 50 -175 -303 -148 54 159
3894 159 -79 -214 92 306 204 -59 -53 93 184 41 -212 -273 2 161 -103 -302 -162 156 120 -81 -220 -29
3916 -29 260 246 113 -61 123 307 145 -60 -137 94 105 39 -278 -237 8 -52 -62 -208 -18 232 158 1 -65
3939 -65 32 348 234 -32 -63 76 154 -49 -238 -200 -64 115 -100 -232 -166 59 190 -36 -211 -26 294 224
3961 224 12 -182 -1 256 -1 -243 -245 -6 85 -111 -260 -248 -64 192 49 -213 -120 260 172 -29 -145 -18
3983a8J75J4m35N1J24J68j21k89L3K07L19k75k33K00K64L1j68k39K93O3j03j6
4005D5k58K21J86k01j77J5P4K27k04j48M7K77J67j80k6kK30j20j40k27J76J55
4027A37o7j76j02J17J10Q0l54J1K19K57q4j87qK41R1k45j25O7J49O8k51j81J05
4050a28K01o8j27P6J6J56j00j55k2L23O9k31K1KJ77k07j20n8lL53j59j71j34K78
4074a1P6N0k07q2J86J56k6j77R6N1M2j18k57J92J76r1j71n9J64J97m9k10k0R0
4098bK32k30p7J14L0J31o4k15r1K58q5Lj18J01J68j30j39RO8L30j97j82l9K16
4122I1M5j03q9M7N6L4j22j65J64M0O5j77J7J53K4n2p6m8J76N8m7j12k2K38l9j52
4148Dq0l0J78j36N2k06L9L18j7k02j71L62J04l0l33L8K75j28o9l2k9R8J9k9j61
$$ plain form
3983 -18 157 171 -264 -213 -89 79 -42 -331 -298 -91 228 -47 -280 -80 184 215 47 -192 101 164 61 45
4005 45 -213 8 194 -7 -184 -169 -95 132 -72 -220 -173 104 271 91 65 63 293 173 33 -194 -18 137
4027 137 70 -106 -208 -91 19 99 -255 -244 -25 232 148 -39 -47 194 285 40 -85 -18 131 199 -52 -233 -128
4050 -128 73 5 -122 -46 -30 126 26 -129 -151 172 241 10 31 33 210 3 -117 -175 -178 175 16 -155 -289 -11
4074 -11 65 115 -92 -174 12 168 142 -35 61 112 154 36 -221 -29 147 56 -115 -174 -10 187 138 -72 -92 -2
4098 -2 230 0 -77 37 67 198 134 -81 -172 86 1 4 -114 -13 155 25 -114 -105 -37 293 96 -86 -125 91
4122 91 136 33 -56 -9 47 81 -41 -206 -42 -2 63 -114 -97 56 80 28 -48 -96 80 138 91 -21 -43 195 156 4
4148 4 -76 -106 72 -64 -12 -218 -179 139 122 -80 -251 111 215 185 -148 -110 165 37 -32 -64 -93 5 24 -5 -166
4173a66O5K08k2j57k6j5K46j3j65j0J95Q7j33j87Q3n5K14k02n5RJ50P8j97j69
4197b37J68J26Op7j16J22K16M7k87K8J3J81j74p4o7J46M3j49pj8J99nr9p1J60
4222G4J77r9k05j14K45J4Kk40j5J89J39j90j10K7M4N2j60L9J87N8o9m7m9J44R0
4247A83j2k73M6J24K9j11j09L6R4N3j59o3R5J69N5k25l4O0J52k4j11m5K3J76j68
4272c9j13j4J41j7O4j34k9K07o7j36P8JK75j64k7j43J18M6N7j46j55K07J6n7j38
4297a69J07Q1P6j02p7P3J43Q5k56N8m3J42j3j21j51J25J01j21j82P8Q1K60j61
4320A4j77J17O4J15j75OM6J21L7q4j96J17MJ20k55j11K31L1mj06o7J68Q3o5q3
4345d9j2K08Oq2k50Q3L19j70j75o6K2J91j3r1k30L65O0l2j24R5P7N5j21j38J04
$$ plain form
4173 -166 -101 107 85 -72 -98 -113 133 120 -45 -55 140 227 94 -93 -10 -65 149 -53 -108 -99 51 129 -68 -237
4197 -237 -69 57 63 -14 -130 -8 208 255 -32 -4 9 190 16 -58 -125 21 64 -85 -92 -110 89 84 -15 -86 74
4222 74 251 152 -53 -167 78 92 94 -146 -161 28 167 -23 -133 -106 -62 -10 -170 -131 56 114 45 -2 -51 93 183
4247 183 171 -102 -56 68 97 -14 -123 -87 7 60 -99 -162 -67 102 157 -68 -102 -42 110 86 -25 -70 -47 129 -39
4272 -39 -152 -166 -25 -42 22 -112 -141 66 -1 -137 -59 -58 217 53 26 -117 1 47 104 -42 -197 10 26 -31 -169
4297 -169 -62 19 95 -7 -84 -11 132 217 -39 19 -24 118 105 -16 -167 -42 59 -62 -244 -166 -85 175 14
4320 14 -163 -46 18 133 -42 -36 10 131 168 84 -112 5 9 129 -126 -237 -6 25 21 -85 -152 16 99 34 -49
4345 -49 -61 147 153 71 -179 -96 223 53 -122 -188 -166 25 12 -79 -309 56 116 84 -40 55 132 187 66 -72 32
4370C2J46q7j05r9K8J40j5j71k0J56K06j11o7j73K18J00j69j11L3J50K3Pk63J27
4394b5L9l7l1j82O8J57L6j05n7J51Q7J2j99j9L04m9j42m4M0Q5L3k36j76J33K32
4419G5L5j60j40K29P9j41k0j5L4K17j15j26k2J76O2j98j15j3K47l8k73M1J08K08
4443A35m2j25n0J02L17j90j07K7J31q2r9j81R6M6m0n5q7J29R7J06p7j06MM92l14
4468A27k38J23K0J65l8l43k0J65Q9r0k02J58J64K9j75p3J30J38K6j09n1J42K0
4491A57l9j76q9K00K2j23j42o4J95J37j33p9Q7J31J31j97j13N3J91n8j62jj4J90
4515A04j4j98k2J17Ll3l2k9J94P9j06j05O9K18p7k43r7J31J40L5l31J8N4J62j8
4540A9j89K7J34N4q4j4j11L04J0j06k40K33Q3Q6k78j46J22J93L4k80QQ1K20J7
$$ plain form
4370 32 178 91 -14 -113 -85 55 40 -131 -151 5 211 100 33 -140 78 178 9 -102 -69 81 104 111 -152 -25
4394 -25 14 -23 -54 -236 -168 -11 25 -80 -137 14 101 113 -86 -105 199 150 8 -36 4 89 122 -114 -290 -157 75
4419 75 110 -50 -190 39 118 -23 -43 -58 -24 193 78 -48 -70 106 168 -30 -145 -158 89 51 -222 -181 -73 135
4443 135 93 -32 -82 20 337 147 40 67 198 116 17 -164 -68 -22 -62 -117 -204 -75 22 128 51 -55 -51 441 127
4468 127 -111 12 32 197 159 -184 -204 -39 50 -40 -242 -84 80 109 -66 -139 -9 129 155 46 -5 137 157
4491 157 118 -58 -147 53 75 -48 -190 -254 -59 78 -55 -134 -47 84 215 18 -95 -42 149 91 -71 -72 -86 104
4515 104 90 -108 -130 -13 -10 -43 -75 -104 90 169 63 -42 27 245 168 -75 -172 -41 99 134 -197 -179 -125 37 19
4540 19 -170 -143 -9 45 -39 -53 -164 140 150 44 -196 37 120 206 -72 -218 -96 97 131 -149 -141 -60 160 177
4564A77l37L1K48K18j91k79J48O1K0j25j48K52Q6j53j51j20J72J87k3j65L6P3
4586A7J62n6j85j29L40R0j84k88J26K86Pl20j67K02J31K5j72j20J21K57l5k75
4608a67Q7J54K00k22l03K03K35K7j94k69M8K35L3j01j92R1K61k5k12Q5L7K29O2
4631C02l39j19J96J03k34r7k6K83oj59j39R3J19J65j69PJ69J17k07o3j43K95J05
4654B53k33j05o8P9K07j51k64O8K26K59l38j49J32K85J0j37k99K69J79q8k69m6
$$ plain form
4564 177 -160 -129 119 337 146 -133 15 76 96 -29 -177 75 161 8 -143 -263 -91 96 73 -92 -56 17
4586 17 179 123 -62 -191 149 239 55 -233 -107 179 186 -134 -301 -99 32 57 -115 -235 -114 143 108 -167
4608 -167 -80 74 274 52 -251 -48 187 214 20 -249 -201 34 67 -34 -226 -135 126 101 -111 -26 11 240 302
4631 302 -37 -156 40 143 -91 -188 -214 69 63 -96 -235 -142 -23 142 -27 -20 149 266 59 -4 -147 148 253
4654 253 20 -85 -153 -74 133 -18 -282 -214 12 271 -67 -216 -84 201 211 74 -225 44 223 135 -134 -180
$$ [...]
8191F0
##END NTUPLES=NMR FID
##END=
