##TITLE=1H_Pr C6-m-400
 200.13Hz, CDCl3.
 8 sc
 
16.3.2026
##JCAMPDX= 6.0         $$ Bruker NMR JCAMP-DX V2.0
##DATA TYPE= NMR FID
##DATA CLASS= NTUPLES
##ORIGIN= UXNMR, Bruker Analytische Messtechnik GmbH
##OWNER= pz
$$ XWIN-NMR		Version 3.5
$$ Mon Mar 16 15:44:43 2026 Russian Standard Time (UT+4h)  she@DPX200
##.OBSERVE FREQUENCY= 200.1313
##.OBSERVE NUCLEUS= ^1H
##.DELAY= (6, 6)
##.ACQUISITION MODE= SIMULTANEOUS
##.ACQUISITION SCHEME= undefined
##.AVERAGES= 8
##.DIGITISER RES= 18
##SPECTROMETER/DATA SYSTEM= spect
##.PULSE SEQUENCE= zg30
##.SOLVENT NAME= CDCl3
##.SHIFT REFERENCE= (INTERNAL, CDCl3, 0, 14.3821)
##AUDIT TRAIL= $$ (NUMBER, WHEN, WHO, WHERE, WHAT)
$$ ##TITLE= Audit trail, XWIN-NMR		Version 3.5
$$ ##JCAMPDX= 5.01
$$ ##ORIGIN= Bruker BioSpin GmbH
$$ ##OWNER= she
$$ F:/spectra/data/she/nmr/H-C/1/audita.txt
$$ ##AUDIT TRAIL=  $$ (NUMBER, WHEN, WHO, WHERE, WHAT)
(   1,<2026-03-16 15:43:24.23 +0400>,<she>,<DPX200>,
      <created by zg, POWCHK disabled, PULCHK disabled
       configuration hash MD5:
       00 E9 B6 7A A2 85 ED C7 34 08 36 98 17 FE 4E 26
       data hash MD5: 16K
       18 CC 97 97 52 EC 6E 58 D3 BF AA A4 B8 52 4A 35>)
$$ ##END=
$$ 
$$ hash MD5
$$ 80 53 44 8B 0A 73 5B 87 E9 B8 D8 A7 BE 85 33 66
##$RELAX= 
##$RELAX= 
##$RELAX= 
##$RELAX= 
##$RELAX= 
##$RELAX= 
$$ Bruker specific parameters
$$ --------------------------
##$DU= <F:/spectra>
##$EXPNO= 1
##$NAME= <H-C>
##$PROCNO= 1
##$TYPE= <nmr>
##$USER= <she>
##$AMP= (0..31)
100 100 100 100 100 100 100 100 100 100 100 100 100 100 100 100 100 100 
100 100 100 100 100 100 100 100 100 100 100 100 100 100 
##$AQSEQ= 0
##$AQ_mod= 1
##$AUNM= <au_zg>
##$AUTOPOS= <>
##$BF1= 200.13
##$BF2= 200.13
##$BF3= 200.13
##$BF4= 200.13
##$BF5= 200.13
##$BF6= 200.13
##$BF7= 200.13
##$BF8= 200.13
##$BYTORDA= 1
##$CFDGTYP= 0
##$CFRGTYP= 5
##$CHEMSTR= <none>
##$CNST= (0..31)
1 1 145 1 1 1 1 1 1 1 1 1 1 1 1 1 1 1 1 1 1 1 1 1 1 1 1 1 1 1 1 1 
##$CPDPRG= <>
##$CPDPRG1= <>
##$CPDPRG2= <>
##$CPDPRG3= <>
##$CPDPRG4= <mlev>
##$CPDPRG5= <mlev>
##$CPDPRG6= <mlev>
##$CPDPRG7= <mlev>
##$CPDPRG8= <mlev>
##$CPDPRGB= <>
##$CPDPRGT= <>
##$D= (0..31)
0 0.7 0 0 0 0 0 0 0 0 0 0.03 0 0 0 0 0 0 0 0 0 0 0 0 0 0 0 0 0 0 0 0 
##$DATE= 1773661403
##$DBL= (0..7)
120 120 120 120 120 120 120 120 
##$DBP= (0..7)
150 150 150 150 150 150 150 150 
##$DBP07= 0
##$DBPNAM0= <>
##$DBPNAM1= <>
##$DBPNAM2= <>
##$DBPNAM3= <>
##$DBPNAM4= <>
##$DBPNAM5= <>
##$DBPNAM6= <>
##$DBPNAM7= <>
##$DBPOAL= (0..7)
0.5 0.5 0.5 0.5 0.5 0.5 0.5 0.5 
##$DBPOFFS= (0..7)
0 0 0 0 0 0 0 0 
##$DE= 6
##$DECBNUC= <off>
##$DECIM= 32
##$DECNUC= <off>
##$DECSTAT= 4
##$DIGMOD= 1
##$DIGTYP= 9
##$DL= (0..7)
0 120 120 120 120 120 120 120 
##$DP= (0..7)
150 150 150 150 150 150 150 150 
##$DP07= 0
##$DPNAME0= <>
##$DPNAME1= <>
##$DPNAME2= <>
##$DPNAME3= <>
##$DPNAME4= <>
##$DPNAME5= <>
##$DPNAME6= <>
##$DPNAME7= <>
##$DPOAL= (0..7)
0.5 0.5 0.5 0.5 0.5 0.5 0.5 0.5 
##$DPOFFS= (0..7)
0 0 0 0 0 0 0 0 
##$DQDMODE= 0
##$DR= 18
##$DS= 0
##$DSLIST= <SSSSSSSSSSSSSSS>
$$ [...]
##$SUBNAM0= <"">
##$SUBNAM1= <"">
##$SUBNAM2= <"">
##$SUBNAM3= <"">
##$SUBNAM4= <"">
##$SUBNAM5= <"">
##$SUBNAM6= <"">
##$SUBNAM7= <"">
##$SUBNAM8= <"">
##$SUBNAM9= <"">
##$SW= 18.0517328524113
##$SWIBOX= (0..15)
0 0 2 0 0 0 0 0 0 0 0 0 0 0 0 0 
##$SW_h= 3612.71676300578
##$TD= 16384
##$TD0= 1
##$TE= 0
##$TE2= 300
##$TE3= 300
##$TEG= 300
##$TL= (0..7)
0 120 120 120 120 120 120 120 
##$TP= (0..7)
150 150 150 150 150 150 150 150 
##$TP07= 0
##$TPNAME0= <>
##$TPNAME1= <>
##$TPNAME2= <>
##$TPNAME3= <>
##$TPNAME4= <>
##$TPNAME5= <>
##$TPNAME6= <>
##$TPNAME7= <>
##$TPOAL= (0..7)
0.5 0.5 0.5 0.5 0.5 0.5 0.5 0.5 
##$TPOFFS= (0..7)
0 0 0 0 0 0 0 0 
##$TUNHIN= 0
##$TUNHOUT= 0
##$TUNXOUT= 0
##$USERA1= <user>
##$USERA2= <user>
##$USERA3= <user>
##$USERA4= <user>
##$USERA5= <user>
##$V9= 5
##$VALIST= <valist>
##$VCLIST= <CCCCCCCCCCCCCCC>
##$VD= 0
##$VDLIST= <DDDDDDDDDDDDDDD>
##$VPLIST= <PPPPPPPPPPPPPPP>
##$VTLIST= <TTTTTTTTTTTTTTT>
##$WBST= 1024
##$WBSW= 4
##$XGAIN= (0..3)
0 0 0 0 
##$XL= 0
##$YL= 0
##$YMAX_a= 173399
##$YMIN_a= -190588
##$ZGOPTNS= <>
##$ZL1= 120
##$ZL2= 120
##$ZL3= 120
##$ZL4= 120
##$ABSF1= 10
##$ABSF2= 0
##$ABSG= 5
##$ABSL= 3
##$ALPHA= 0
##$AQORDER= 0
##$ASSFAC= 0
##$ASSFACI= 0
##$ASSFACX= 0
##$ASSWID= 0
##$AUNMP= <proc_1d>
##$AZFE= 0.1
##$AZFW= 0.1
##$BCFW= 1
##$BC_mod= 2
##$BYTORDP= 1
##$COROFFS= 0
##$CY= -3
##$DATMOD= 1
##$DC= 2
##$DFILT= <>
##$DTYPP= 0
##$F1P= 0
##$F2P= 0
##$FCOR= 0.5
##$FTSIZE= 0
##$FT_mod= 4
##$GAMMA= 1
##$GB= 0.15
##$INTBC= 1
##$INTSCL= 1
##$ISEN= 128
##$LB= 0.25
##$LEV0= 0
##$LPBIN= 0
##$MAXI= 10000
##$MC2= 0
##$MEAN= 0
##$ME_mod= 0
##$MI= 1.114404
##$NCOEF= 0
##$NC_proc= 0
##$NLEV= 6
##$NOISF1= 3.799351
##$NOISF2= 2.8
##$NSP= 1
##$NTH_PI= 0
##$NZP= 0
##$OFFSET= 14.38212
##$PC= 1
##$PHC0= -3707.276
##$PHC1= 12.1923
##$PH_mod= 1
##$PKNL= yes
##$PPARMOD= 0
##$PSCAL= 0
##$PSIGN= 0
##$REVERSE= no
##$SF= 200.129724274929
##$SI= 16384
##$SIGF1= 3
##$SIGF2= 2
##$SINO= 400
##$SIOLD= 16384
##$SREGLST= <1H.CDCl3>
##$SSB= 0
##$STSI= 0
##$STSR= 0
##$SW_p= 3205.1282051282
##$SYMM= 0
##$S_DEV= 0
##$TDeff= 0
##$TDoff= 0
##$TI= <>
##$TILT= no
##$TM1= 0
##$TM2= 0
##$TOPLEV= 0
##$USERP1= <user>
##$USERP2= <user>
##$USERP3= <user>
##$USERP4= <user>
##$USERP5= <user>
##$WDW= 1
##$XDIM= 8192
##$YMAX_p= 0
##$YMIN_p= 0
$$ End of Bruker specific parameters
$$ ---------------------------------
##NTUPLES= NMR FID
##VAR_NAME=  TIME,          FID/REAL,        FID/IMAG
##SYMBOL=    X,             R,               I
##VAR_TYPE=  INDEPENDENT,   DEPENDENT,       DEPENDENT
##VAR_FORM=  AFFN,          ASDF,            ASDF
##VAR_DIM=   8192,          8192,            8192
##UNITS=     SECONDS,       ARBITRARY UNITS, ARBITRARY UNITS
##FACTOR=    0.0002768,     1,               1
##FIRST=     0,             0,               0
##LAST=      2.2672688,     0,               0
##MIN=       0,             -190588,         0
##MAX=       2.2672688,     173399,          0
$$ Real data points
##PAGE= N=1
##DATA TABLE= (X++(R..R)), XYDATA
0 0 0 0 0 0 0 0 0 0 0 0 0 0 0 0 0 0 0 0 0 0 0 0 0 0 0 0 1 -3 4 -4 4 -5 8 -8 8 -8 9 -11 12 -12 12 -13 15 -15 16 -20 23 -24
48 -24 26 -27 32 -36 39 -40 48 -55 61 -72 86 -102 125 -155 199 -266 374 -559 924 -1803 4725 -34213
70 -34213 -190588 -62882 125366 83230 -37272 -46498 -26 -7009 985 51748 29210 -57773
82 -57773 -63809 18437 62072 16373 -36595 -19263 4298 -12798 -5232 30534 18526 -30362 -29043
95 -29043 24546 35394 -10256 -7683 21291 -14957 -41170 23914 65914 -10130 -73687 -2388
107 -2388 71879 1892 -71693 -9831 57161 7568 -55133 -13279 52189 20844 -39456 -16595
119 -16595 21260 652 -11319 22776 26240 -29316 -41581 26539 49035 -18418 -46830 2769
131 2769 30818 1650 -18754 -292 6596 -9078 266 16326 -4920 -17037 16452 34928 -9362
144 -9362 -50186 -3686 60696 25888 -49907 -38231 27237 33733 -12678 -19362 4495 -12423 -25857
157 -25857 21126 45853 -10303 -52208 -9544 40759 18802 -17518 -4392 6892 -12580 -7256
169 -7256 28531 28238 -20476 -43629 -2387 33790 15484 -11439 -15594 -14912 -7816 19773 35221
182 35221 -3076 -50422 -21307 45870 41065 -19712 -36745 3857 25853 2034 -10037 4158
194 4158 -1700 -16062 106 18530 1453 -24287 -10145 19601 6148 -20546 -2056 22837
206 22837 4473 -19955 -5434 20772 9748 -12621 -2268 10501 -304 -3706 5336 1658 -11340
219 -11340 -8511 10755 10179 -14012 -14771 9673 14615 -5432 -15646 1581 15287 568 -8764
232 -8764 4621 7439 -4118 -2758 8219 4184 -11692 -7556 10661 2601 -13388 -2524 10754
245 10754 -594 -13863 -3989 14380 7075 -11337 -5886 7833 7712 2477 597 281 -3872 -3876 10380
260 10380 11363 -11291 -17771 2872 14748 815 -14841 -5865 7099 -186 -3357 4348 759 -6125
274 -6125 -1043 8718 7978 -4987 -5429 7513 5185 -5535 -3171 4690 3697 -7545 -8831 6833 7723
289 7723 -7849 -7977 2192 4153 -362 -1146 3859 165 -6041 5861 12856 -1866 -9705 -632 8661
304 8661 4821 -7367 -6236 2988 50 -3401 -463 -500 -2134 -4673 -1109 6289 296 -5460 2836
319 2836 5288 -28 -550 3279 5512 -1941 -6346 4139 6227 -3421 -4458 -1422 508 957 -2279
334 -2279 -1988 -1224 -3718 1174 4767 -383 -2436 -397 4165 6515 -1604 -3668 3169 1911 -981 -174
350 -174 -868 -1019 -2776 -1781 1973 -2211 -4706 883 -294 -2386 1551 2326 2135 -493 -2065 4025 5782
367 5782 655 -1292 -2092 145 3481 637 -436 -1491 -6353 -2294 4479 1566 -4343 -6331 -1359
382 -1359 4449 2555 1225 1245 -3537 -1273 5756 4920 133 -3337 -2213 2468 1517 -323 61 -2896
398 -2896 -4147 -1838 -91 2441 93 -4654 -1142 2929 1803 650 1009 3362 1633 -3110 334
413 334 5577 3089 -1436 -4308 -3069 1151 1926 652 -1497 -5969 -5725 624 5027 4301 -2746 -7278
429 -7278 -1475 6467 9090 3298 -7262 -6775 3646 8530 3868 -3248 -5323 -1611 562 1638 1866
444 1866 -3263 -5747 -3201 113 4933 5101 -1463 -4535 -461 3907 2427 -1862 2428 6102 -1563
459 -1563 -5312 515 5050 2441 -5303 -8614 -2544 3627 5256 457 -6025 -4738 -1880 -9 8005
474 8005 9179 -3688 -12260 -2915 14079 14856 -3953 -14318 -5271 6411 10270 1836 -8700 -7452
488 -7452 -1869 1919 5224 2609 -4449 -8910 -4902 9252 13323 -929 -10304 -3900 6545 8180
502 8180 -1580 -4754 3387 3897 -3017 -5314 -1832 3961 852 -6670 -4425 2277 4237 1474 -3532
517 -3532 -1494 1358 -3658 -243 11873 9628 -6082 -14030 -427 16021 8094 -9538 -11850 -2467
531 -2467 7634 7434 -3524 -7648 -3902 -2650 654 6986 7635 -3280 -13642 -1538 16503 8827
545 8827 -8017 -8578 1317 8575 4370 -4156 -4089 -175 588 -2588 -5867 1585 6587 -3017 -6856 1004
561 1004 4219 1176 -1007 1183 2770 -2903 -2876 6396 9299 2398 -8486 -11292 2550 11819 1202
576 1202 -9853 -7607 2118 6218 572 -2246 -3133 -6538 -2085 7017 9331 4525 -5615 -9350 2056
591 2056 10459 5141 -5254 -8268 1216 7071 1359 -3638 -4750 -3459 844 262 -618 3011 298
606 298 -4254 -1123 4606 4983 -1535 -3177 4747 3574 -4703 -1800 4395 4164 -1228 -7073 -4699 1981
622 1981 3457 810 -4272 -5045 1677 3149 367 721 -1984 -3069 2682 6728 5036 -640 -4869 -2461
638 -2461 1007 3690 4430 -3722 -7113 1144 4060 -1803 -4354 -1880 1224 -478 -1012 4209 3182 -2590
654 -2590 -1860 1916 3228 1872 -1327 249 2313 -223 -1909 -1500 -258 891 -1964 -3711 -755 396
670 396 907 1615 -1137 -2801 -630 3119 5004 649 -2719 286 2571 2140 1521 -1513 -3446 -2269
686 -2269 1454 3436 -1102 -5667 -2059 1497 3 -1251 -1137 325 584 351 2764 2607 -576 -551 551
703 551 1173 1236 -250 -25 482 -1632 -1402 -267 -1287 -2026 -1994 167 1754 -508 -1014 1084 855 345
721 345 816 1331 1880 383 325 2038 -254 -1830 1 358 -715 -2244 -1780 1018 -918 -3138 41
738 41 1454 -279 -663 385 2327 1126 -832 2084 2447 -1051 -96 1411 816 -610 -2024 -518 937
755 937 -2017 -2017 -367 -1013 -337 -481 -204 1860 -298 -1033 2735 1964 -553 159 1506 2419 -319 -2267
773 -2267 1535 594 -2920 -902 55 -1359 -1070 -1295 353 217 -1829 826 1913 -493 604 1046 1392
790 1392 2239 -600 -290 2317 220 -1248 -294 -903 -430 -1463 -1431 824 -1648 -2414 1018 475 -741
807 -741 300 245 1698 1051 -492 1779 1809 -62 730 -114 210 633 -1790 -1203 -312 -1979 -485 165
825 165 -1392 -773 -385 180 1088 -809 799 2716 -78 -11 1906 1094 1041 -130 -892 569 -882 -1097
843 -1097 416 -1447 -2063 -925 -617 784 -452 -1866 706 1385 -3 1289 1242 966 213 -378 2247
860 2247 1754 -1758 -496 307 -1011 -1097 -892 -71 -159 -2762 -1137 1446 -43 -181 -219 200 1244 490
878 490 1100 2741 140 -1522 201 1194 1407 -576 -2387 -819 -985 -932 1139 -731 -2984 -1763 517
895 517 2219 1059 -1807 401 1667 102 1399 2657 1064 -1273 -2271 1435 3158 -1675 -3160 -692
911 -692 98 -195 -1228 -1270 499 -653 -1543 709 1425 1749 944 -680 628 1467 467 1361 654 -922
929 -922 -686 -1002 -44 1027 -292 -1982 -3366 -1877 3154 2446 -2832 -2852 1150 3099 1525 -367 1261
946 1261 1096 -1451 176 3371 2204 -1679 -4082 -1005 2761 729 -3005 -2686 -853 856 69 -413
962 -413 382 -258 -314 773 546 1428 3030 538 -1410 -682 1507 1901 -1798 -2097 1372 143 -3019 -1517
980 -1517 1797 1514 -3713 -5045 2604 5940 409 -3701 -928 3593 2402 -1732 1221 3296 -2211
995 -2211 -3684 1300 4180 389 -5251 -3404 2022 1249 -832 -1531 -2095 192 1837 965 547 -166 -142
1012 -142 1054 -29 922 3247 991 -1653 -2399 -621 2207 -486 -3661 45 2240 -1188 -3427 -891
1028 -891 3590 386 -5066 -40 6168 2198 -2310 -1322 1290 1460 -1060 860 3143 -1410 -3265 -814
1044 -814 476 1236 -1152 -3646 -1292 1053 1539 1363 -1543 -1280 2085 1638 753 -73 -395 2269 633
1061 633 -1855 1603 2722 -1818 -4074 -1631 2526 874 -3959 -424 3373 -948 -3157 -349 2295
1076 2295 1642 -1890 59 3882 1190 -713 408 53 -787 -1479 -19 2824 -600 -3458 -370 280
1092 280 -1445 -817 -94 79 -1126 140 4572 1745 -3474 -515 2808 1450 -629 -399 1951 788
1108 788 -3057 -799 1766 -468 -2813 -2376 1360 2502 -2536 -2850 2406 1965 -1914 -750 2943 2328
1124 2328 -2057 -692 3812 623 -2712 727 1665 -1606 -2476 -166 1348 -1110 -2223 553 46 -1812
1140 -1812 -189 511 818 919 -26 1202 1790 -14 -985 478 1609 630 -1390 207 1278 -2729 -2847
1157 -2847 1158 772 -2212 -1200 1699 1274 -2318 -772 2569 434 -905 1793 2210 32 -830 423
1173 423 1502 -1186 -1793 917 610 -1369 -1461 -579 639 -499 -1904 584 1381 -926 -401 1462 1838
1190 1838 239 -747 1826 1702 -1759 -848 1816 662 -1650 -1567 799 761 -2994 -1896 1596 479 -1768
1207 -1768 -509 1824 1529 -1322 -528 2932 1186 -1434 635 2381 569 -1663 -494 1815 -584
1222 -584 -3028 -40 1219 -919 -1926 -290 1123 -37 -1616 454 2119 121 -295 728 1507 720
1238 720 -1006 318 1801 -1108 -1820 507 748 -1187 -2141 -203 1213 -1327 -1764 1353 909 -786
1254 -786 -63 1399 1657 -174 -471 1629 888 -878 228 234 -482 -673 -1022 211 -151 -1957 -580 326
1272 326 -618 -404 -81 643 758 -582 866 1676 27 339 1198 437 16 -632 148 615 -1574 -1013 660
1291 660 -510 -1539 -751 95 738 -1107 -710 1797 799 -831 630 1510 887 150 -684 1523 479
1308 479 -1714 -50 504 -1063 -1217 -616 325 4 -2000 -230 1513 -519 -405 634 793 974 -185
1325 -185 298 2078 -197 -892 959 529 -502 -1122 -632 661 -1102 -2173 685 449 -1356 -687 416
1342 416 1198 553 -1064 880 1788 -325 217 986 603 166 -943 -179 767 -1212 -908 -78 -969 -619
1360 -619 -266 -46 236 -759 -296 1582 593 -96 690 359 731 390 -415 897 229 -929 -247 -256 -466 -299
1380 -299 -1024 -488 -100 -845 203 491 -446 493 715 398 837 783 559 305 -376 529 772 -703 -559 -5
1400 -5 -389 -744 -1166 -358 282 -896 -1065 579 862 383 -652 -39 1648 982 -45 493 689 305 -19
1419 -19 -271 475 -218 -959 -251 -430 -740 -193 -312 -352 -410 98 1049 559 -350 304 1090 601 -68 36 1244
1440 1244 728 -1525 -609 1071 -100 -1473 -1280 122 317 -1416 -690 1118 106 -698 -66 580 1362
1457 1362 340 -1031 724 1689 612 -466 -504 551 -93 -1526 -338 424 -900 -684 -446 -773 7
1474 7 305 99 -132 0 1684 1089 -937 399 1588 -16 -419 -150 405 224 -1178 -879 89 -318 -566
1493 -566 -737 -700 666 277 -629 464 880 233 -10 75 1348 895 -345 110 284 -270 149 -595 -892
1512 -892 -66 -388 -499 -676 -628 459 14 -1232 300 1471 318 -475 -201 1731 1716 -1046 -617 1389
1530 1389 238 -1191 -982 424 631 -1184 -1411 103 -398 -868 -64 148 922 556 -194 417 621 -92
1548 -92 185 506 1258 662 -691 296 185 -1442 -768 523 -293 -919 -196 333 -222 -1304 368 1426
1566 1426 -567 -404 1482 1252 -42 -521 742 1550 -533 -1215 294 -227 -818 -850 -508 475 -241 -1323
1584 -1323 -361 -227 -252 236 270 1021 1233 -199 143 911 -486 -276 420 489 189 -1016 -277 199 -1572
1603 -1572 -1061 673 -380 -841 118 791 33 -571 683 1808 -596 -405 1775 720 -703 14 459
1620 459 147 -682 -896 -145 -500 -720 -136 -546 -52 438 -717 -57 1058 -42 -14 933 1109 237 -420
1639 -420 862 1146 -1314 -515 1166 -423 -1511 -562 434 -334 -1294 -282 827 -539 -766 815 679
1656 679 -2 -30 234 1327 391 -593 478 763 -212 -1111 -501 340 -493 -1712 120 778 -780 -870 332
1675 332 396 -189 -276 794 1134 57 174 832 268 42 -173 100 619 -551 -1085 0 173 -943 -1198
1694 -1198 -15 833 -617 -654 1177 639 -504 621 1305 284 -451 393 1245 -289 -792 464 332
1711 332 -640 -773 -584 -306 -451 -779 -348 351 70 -43 -50 599 866 -264 574 1357 -165 -226 685 210
1731 210 -371 -636 118 419 -1375 -946 709 -337 -892 -329 215 234 -392 94 1238 373 -287 643 688
1750 688 111 -301 -140 787 23 -1292 4 518 -752 -1007 -258 299 -62 -956 77 983 -105 -84 748
1769 748 613 320 -54 204 981 -483 -843 477 64 -765 -703 -268 439 -737 -955 629 354 -756 -124
1788 -124 645 527 124 -65 1013 590 -418 293 891 -143 -471 -512 218 23 -1398 -541 550 -406 -780
1807 -780 -136 335 505 -432 -34 1240 476 -47 522 529 218 -46 -181 501 -397 -881 164 -53 -807 -428
1827 -428 -358 239 -221 -817 604 715 -462 312 677 589 242 -150 652 665 -614 -257 530 -505 -581 -449
1847 -449 -411 0 -818 -688 412 -145 -334 65 437 460 251 140 944 235 -37 594 137 -68 -412 -200
1867 -200 160 -542 -1289 207 220 -851 -291 233 122 74 -431 516 852 -169 60 682 216 184 -102 -38
1887 -38 203 -672 -511 223 -532 -531 -241 -368 -80 -340 -224 859 249 -359 629 725 271 71 302 849 21
1908 21 -596 256 416 -387 -685 -372 52 -34 -943 -234 427 -238 -379 379 462 360 -63 314 924 -3 -203
1929 -203 460 -207 -241 69 -116 -269 -490 -331 -140 -563 -428 205 -22 227 81 -134 644 594 4 147 536
1950 536 742 111 -465 344 376 -966 -326 235 -272 -711 -362 -37 56 -386 61 432 -46 368 516 133
1970 133 560 597 270 288 189 30 -224 -732 -115 85 -274 -272 -586 -459 235 -105 -377 198 599 519 -19 84
1992 84 962 428 -131 288 315 -75 -225 -391 -104 -185 -856 -244 -36 -586 -409 -326 -152 221 20 238 711
2013 711 -165 236 562 247 246 160 119 388 -368 -376 234 -707 -602 53 -143 -184 -258 -343 390 433 -178 239 445
2036 445 697 395 -491 456 850 -517 -213 428 -161 -288 -646 -366 116 -935 -288 158 -192 70 389
2055 389 -150 174 174 -1 689 144 273 621 21 158 191 -469 -261 -77 -595 -38 -216 -633 -10 -175 -14
2076 -14 202 -91 353 603 -22 237 325 229 289 -109 -101 311 -547 -549 66 -228 -78 -214 -271 -368 -504 -143 391
2099 391 -221 52 1076 313 -131 66 46 210 45 -115 432 -102 -672 -389 -304 -486 -201 -449 135 431
2119 431 -408 -11 295 267 141 66 444 577 -364 -60 477 98 -124 -104 -110 -44 -692 -551 266 -269 -244 45
2141 45 3 35 -132 -205 865 338 -220 560 615 80 -138 -200 638 17 -738 30 -14 -589 -463 -361 -177 194
2163 194 -369 -84 263 -3 110 107 209 471 31 145 810 61 -609 83 -11 -228 -590 -221 301 -385 -467
2184 -467 248 21 -353 150 210 61 414 397 468 76 -41 404 44 -246 240 -72 -178 -38 -383 -402 -175
2205 -175 -322 -187 -149 -153 140 -75 291 656 -183 85 689 288 -113 86 385 348 -242 -470 -29 -307 -555
2226 -555 -306 -261 -213 -464 -225 72 -119 -153 314 397 194 94 330 747 131 -575 283 78 -306 -245 -191 39
2248 39 -397 -565 -219 291 -366 -62 120 134 185 -149 209 624 44 -74 393 364 -66 -303 -182 327 -391
2269 -391 -762 271 74 -479 -333 -64 175 87 -292 573 224 -68 326 216 188 290 -104 153 160 -349 -66
2290 -66 89 -117 -232 -205 -185 326 -240 -132 432 -19 18 364 125 435 266 46 365 128 -338 446 -133
2311 -133 -223 -53 -403 -166 -176 -365 95 -251 -318 266 -28 -155 342 323 385 357 -199 399 519 -302 -146 36
2333 36 25 -156 -540 -328 402 -460 -354 -86 -33 57 -9 31 408 241 34 623 151 12 164 5 296 -48
2355 -48 -608 218 -89 -537 -414 -37 -145 -255 -421 48 367 -211 148 492 287 206 -59 374 715 -114 -248
2376 -248 204 77 -308 -83 -135 128 -372 -528 130 56 -272 -45 -14 151 295 -158 323 403 124 334 42
2397 42 -11 62 -151 -380 -170 -470 -156 -49 -441 -203 -162 -55 40 -109 68 334 29 75 249 81 180 160 5
2420 5 204 -43 -14 -11 -219 -133 -157 -289 20 -40 -407 116 85 17 269 37 101 227 231 258 40 -293 339 206 -371
2445 -371 -165 -110 -273 -267 -356 144 57 -372 -114 227 62 110 58 296 584 25 206 203 312 100 74 -377 -97
2468 -97 -353 -340 227 -41 -434 -99 -109 -87 -276 -222 311 171 -7 301 305 327 209 -85 101 311 -289 -47 127
2491 127 -65 -208 -382 -202 -24 -474 -140 456 -4 -76 308 308 499 78 91 371 252 38 32 -171 -80 197
2513 197 -409 -120 -149 -361 -150 -199 -127 11 -284 157 322 43 53 422 116 56 273 88 15 -14 66 6 -378
2536 -378 63 111 -268 -86 -76 -270 -145 68 92 248 108 288 194 9 164 303 -125 144 123 -96 58 -124
2558 -124 -517 -85 -138 -18 -150 -303 274 129 -476 88 195 -36 169 158 417 241 -258 42 159 -244 -74
2579 -74 -160 -194 72 -296 -234 229 -251 -425 10 31 152 -68 206 477 12 -232 234 228 122 0 -39 5 50
2602 50 -352 -43 -114 -377 -74 -46 -54 43 -290 90 391 61 -85 196 150 -37 25 57 409 -3 -200 -42 -55
2625 -55 -289 -39 -321 28 39 -118 75 -9 -19 271 265 55 349 -11 305 105 -6 174 56 -243 116 -263
2647 -263 -216 -137 -45 -229 -79 -285 -104 -53 -4 -26 221 100 384 -30 -7 235 117 97 217 187 -95 -173 -93 220
2671 220 -448 -286 131 -56 -271 -134 -36 269 -125 108 283 275 283 37 -19 197 105 -155 -82 351 -208 -239 -156
2694 -156 -103 -56 -279 18 196 -301 -50 235 344 60 138 412 273 44 69 224 -7 24 -40 -58 -87 -50 -195
2717 -195 -102 -194 -245 -60 159 135 27 -62 196 488 -175 79 387 207 88 -116 -93 91 -147 -152 10 -170 -156
2740 -156 88 -301 -104 -112 19 148 100 111 309 37 116 213 65 140 9 -241 107 85 -218 -26 -290 -134 -120
2763 -120 -252 120 -81 -24 156 129 -101 250 20 394 208 -117 107 85 -60 -30 28 -192 -124 -319 -162 41
2785 41 -222 -16 161 57 -41 -136 -16 326 -17 -33 414 137 -127 45 -5 186 -240 -186 19 -90 -522 -219
2807 -219 -46 -143 60 -183 -7 215 -112 -11 247 165 165 32 177 257 -37 -87 115 -165 -240 -71 -193 -186 -383
2830 -383 -147 181 69 -137 166 70 129 121 132 178 94 -85 204 232 -21 -45 -29 99 -15 -315 -204 132 -211
2853 -211 26 -99 -31 240 116 -64 167 -19 202 261 12 -67 106 89 73 -119 -276 31 -271 -234 -28 -63
2875 -63 -265 66 -140 143 27 20 323 180 120 134 122 133 166 6 32 14 -304 -146 -210 -36 -105 -217 -256 160
2899 160 2 47 279 149 127 64 28 177 -114 -83 45 -19 -150 107 -99 -117 -212 -355 135 -288 -314 -97 52
2922 52 257 148 258 106 251 -5 171 367 -8 97 -6 -80 -213 -104 -100 -51 -309 -269 41 -144 -78 -124 -104
2945 -104 237 -352 -88 81 97 150 115 62 94 160 2 144 10 -123 -21 65 -148 -299 -344 -102 -47 -85 72
2968 72 52 193 134 6 21 143 -33 270 258 -177 -36 -105 -214 -93 -232 -35 58 -121 -123 99 77 -13 -125 54
2992 54 293 -78 249 269 16 127 234 -45 -193 11 -83 77 -33 -141 -137 -153 -21 -158 -22 118 201 -19
3014 -19 212 198 -108 108 97 161 140 -225 -14 24 -124 60 -49 -113 -104 -226 -177 -104 -222 -143 150 90 184 125 86
3039 86 201 246 19 18 -12 -51 55 32 139 -230 -89 241 10 -254 -49 -17 -153 99 46 -20 215 36 188
3062 188 -33 127 66 95 57 164 3 -51 24 -271 -169 -53 43 -132 -156 -140 224 22 -40 150 81 53 221 -45
3086 -45 122 116 -33 -59 -89 -109 -70 -94 -54 10 -230 -39 231 -344 5 246 -65 100 74 184 175 -116 112 1
3110 1 -105 105 185 -89 -32 -121 -142 -70 -228 -8 -141 -122 169 139 -43 12 185 -104 319 173 242 154 -26 156
3134 156 60 -148 32 -97 -399 122 -16 -144 -64 -33 -17 22 -67 219 246 36 -47 -11 98 135 203 -206 -60 -81
3158 -81 -72 -238 -133 -60 16 -143 88 -103 -310 88 116 -84 46 104 217 120 41 -123 110 61 71 -106 147 -180
3182 -180 -20 -25 80 -213 -31 37 -93 143 20 -42 239 242 -36 276 31 -113 78 -21 -79 162 -119 -52 -86
3205 -86 -223 -41 -142 -18 -69 81 -44 40 86 89 84 165 131 139 320 151 88 15 -14 -96 67 -6 -191 -51 5 -30
3231 -30 -7 -11 -8 76 -27 0 23 -40 320 69 94 38 37 -72 101 33 -88 -14 -77 -9 -164 -142 -126 -83 -63 -107 8 25
3259 25 156 -66 166 130 245 -79 -15 63 72 -32 -28 172 -115 28 36 -49 -93 49 -5 53 -310 59 232 -29 -42
3284 -42 -7 142 220 -130 48 109 -66 -222 -34 -65 -87 -19 -145 -27 100 -235 -70 33 91 -66 -95 217 105
3307 105 53 44 105 73 -11 -51 -60 64 -63 -122 -6 -17 -171 -42 21 45 40 -9 -35 48 -96 21 56 -11 93 -42 126
3334 126 109 -119 -22 -2 -175 -92 34 -153 145 -79 82 92 -184 -71 205 -25 12 187 4 140 -24 -107
3356 -107 242 -167 -184 -123 -71 -34 54 1 9 -67 -120 -33 62 -109 -55 -6 87 44 2 167 -10 -1 26 -20 46 -29 -265 -59
3384 -59 28 -167 -53 125 193 38 133 -106 6 82 93 289 21 61 99 56 107 77 -178 -77 -24 -114 -65 5 -166
3409 -166 143 -142 59 13 98 36 126 -65 293 72 38 11 80 -6 66 53 93 18 -219 95 -27 35 55 -39 -47 63
3435 63 197 18 165 -36 53 116 -2 172 180 0 372 -30 58 -33 -183 -37 -68 -86 -115 -109 -55 7 -29 -9 90 94
3461 94 111 56 71 37 30 77 34 48 -9 -122 -43 44 -209 85 -95 -108 -96 -20 -182 127 178 -124 122 245 1 182
3487 182 -51 61 199 24 -6 3 -239 95 -8 -264 -127 -117 -110 100 11 -10 12 40 32 96 185 -3 -32 -117 21
3512 21 86 29 96 -21 60 60 -88 -120 -51 -130 82 -51 112 -51 51 -77 76 5 5 47 24 29 13 -57 -68 -113 0
3539 0 24 -80 -133 -97 -63 -211 82 9 -20 -1 286 23 40 118 107 75 46 -142 -69 29 7 8 85 -6 -169 143 -29
3566 -29 -213 177 91 104 235 -127 -50 191 156 59 234 53 92 -193 32 31 -66 12 173 -36 -14 33 -190 120
3590 120 -29 109 -22 -185 -34 182 133 -124 42 39 127 -36 -119 43 -72 -223 91 -69 51 -107 -98 -18 -96
3613 -96 -101 50 134 97 102 56 -4 32 -117 -37 127 -46 -32 -31 -33 -133 -59 -113 37 -23 -9 -215 -80 -44 93 177 55
3640 55 159 -80 206 -7 72 26 65 102 -115 -87 -63 5 -62 107 -63 42 -30 48 -99 68 -7 -45 69 146 169
3665 169 -24 7 -48 -167 117 35 -31 -142 -59 -92 -151 27 -12 -113 -13 178 -70 91 -87 -31 23 77 -29 164
3689 164 -8 -79 -61 71 149 -32 217 78 32 -48 -60 -60 34 38 -50 189 123 9 -52 -10 153 -92 -98 -51 -48 -94 -128
3716 -128 11 53 -364 -67 62 98 84 -5 -103 50 -95 69 107 -26 37 -86 60 62 -27 -169 -85 -29 194 76
3740 76 -105 -34 72 -132 30 -55 -23 -9 180 50 46 -34 -45 58 55 45 -22 -51 -99 34 -9 -16 -38 -40 -12 -22 21 70
3768 70 -154 -23 75 -175 226 -28 -137 51 151 -12 82 -43 81 -150 -5 -59 -34 -12 -202 -32 -97 166
3790 166 36 132 -104 143 -33 28 86 -5 161 9 -189 70 -124 -189 -105 106 -8 72 81 -28 -136 3 10 -79
3814 -79 66 33 160 106 109 22 -71 -64 132 268 56 237 74 -3 -115 -139 112 50 105 70 36 -30 30 -10 35 87 36
3841 36 19 129 27 -25 -88 -50 -65 -61 -61 112 -111 -173 0 -51 43 -106 -141 -20 76 -47 77 136 153 -15 -169 53
3867 53 94 10 -16 28 -74 -41 197 -58 -7 -88 -50 41 137 -48 13 -86 -39 147 -109 136 -42 74 -150 35 136
3892 136 110 -115 -133 -42 30 -3 -5 6 86 19 127 -81 -13 53 240 -58 189 34 -102 124 -128 -65 -29 -133 -82
3917 -82 21 8 9 -11 -6 -78 -91 100 -27 26 -108 52 89 -166 72 -42 76 -2 163 27 -10 2 -78 96 34
3942 34 -76 -133 16 -70 99 -4 96 -85 187 77 -42 36 138 108 44 66 -246 30 8 -104 -100 54 -62
3965 -62 49 27 96 -2 144 114 48 -120 -141 110 12 32 -2 18 5 10 -36 -41 125 -111 -75 -155 36 95 19 -27 -19 154
3993 154 -55 -2 79 37 -172 114 -158 -95 -33 -40 165 -48 27 -22 -7 121 21 44 -45 36 66 129 113 122 -87 160
4019 160 87 -12 37 -130 -69 -23 17 45 40 84 -132 37 15 -87 -54 86 -67 138 -35 -9 -12 -187 -68 91 -108
4044 -108 -62 172 -54 206 -2 -77 -18 -13 -42 74 -24 -76 -145 -344 -96 73 -222 -11 60 4 122 16 72 157
4068 157 93 -8 -10 131 127 209 27 127 -94 34 200 -19 -15 82 138 -18 -77 101 84 95 207 -20 76 139 -120
4093 -120 -31 238 -101 -43 -74 113 -140 124 8 63 -150 -39 48 -5 -130 132 -120 -120 -6 23 39 -29 -54 78
4117 78 74 -102 134 9 -134 -105 70 117 67 15 -30 -108 51 61 12 -1 115 123 179 157 -68 -86 92 -44 -139 72
4143 72 82 -2 -83 -29 54 47 178 -37 -45 94 72 160 5 131 -31 73 -146 92 127 22 -98 62 -162 84
4167 84 159 9 -106 246 -27 -27 98 66 121 3 20 -12 109 56 -7 -7 -4 -38 -49 18 -162 13 -15 -59 4 -89 -48
4194 -48 135 84 -25 66 80 119 -98 52 -109 -107 109 65 58 -31 109 -35 21 -61 75 -31 138 -7 53 20 2
4219 2 -152 29 -44 152 196 41 132 -103 -149 -18 -66 -39 -62 68 -4 26 -251 29 190 -34 38 -97 134 -122
4243 -122 -92 -94 7 178 -50 -106 230 -24 16 179 44 -43 1 -33 -46 32 107 67 31 202 -61 120 37 -198 29
4268 29 -68 -2 41 54 -34 -45 -76 -3 152 -70 56 -51 122 55 -42 68 -90 41 -21 4 91 201 86 -62 214
4293 214 18 -54 151 57 -61 -83 57 -4 -39 125 -39 -32 183 78 38 5 101 40 32 73 92 -43 42 15 -82 42
4319 42 5 26 -38 76 -104 -83 -79 3 -75 -126 -51 11 271 15 30 -42 -4 42 82 29 -9 3 0 41 86 92 -257 44 -66
4348 -66 -128 101 95 -197 85 115 124 -129 0 67 116 -125 -67 35 -95 46 119 -109 -103 90 -38 90 -103 -69 -13
4373 -13 157 12 38 60 -83 163 -16 9 12 -119 -124 98 -25 -3 63 71 108 5 -40 -120 26 44 -48 -153 -63 104
4399 104 -59 92 68 -44 52 -78 -125 75 79 160 -135 -52 108 82 115 74 -194 21 -78 16 -44 181 -93 196
4423 196 -33 276 78 81 84 83 -56 82 3 99 63 -74 79 52 -35 -36 148 -89 168 89 22 -25 20 -36 187 -146
4449 -146 -117 -9 -16 27 -45 -13 -52 -190 -179 -133 21 113 73 34 4 -28 24 6 122 19 58 -33 -8 -94 -35 17 94 85
4477 85 85 70 30 30 77 -119 0 117 -23 -18 43 -167 10 -5 192 -36 -20 29 -169 -18 -50 -52 70 29 1 51 -5
4504 -5 34 87 -60 -108 22 5 49 -100 -23 62 -40 -33 47 -91 -41 32 -84 -29 7 60 -19 -28 -15 31 164 111 84 -9
4532 -9 91 37 -15 -118 -18 89 -114 128 21 -46 148 53 166 47 -175 34 -92 -88 -91 9 216 51 -1 -10
4556 -10 -144 104 -58 135 -46 -65 52 -139 31 42 -128 -39 74 41 -103 -123 -108 82 70 25 -148 -34 -125
4579 -125 -227 -132 -49 -97 100 -2 117 -35 13 -124 14 -75 -174 11 24 -28 -58 -26 -46 144 -59 -46 5 24 -20
4604 -20 231 5 -20 -44 -115 21 40 -26 77 -77 -104 -129 -11 85 82 -32 18 45 3 93 13 208 -12 29 -135 -68
4630 -68 -49 -106 -59 -17 44 9 172 63 37 -8 -60 90 15 28 2 29 12 11 -115 -174 -88 -28 50 116 69 88 -7 -8 -63
4659 -63 8 89 -228 -69 30 26 -51 117 81 30 61 -73 20 113 -41 -94 122 -98 51 -217 6 156 95 94 107 79
4685 79 -24 -27 91 -47 64 56 -7 -141 -139 -118 103 142 61 -67 -122 24 -55 91 -71 -74 -27 -105 -149 43 63 35 -37
4712 -37 97 -15 -2 87 -178 27 193 46 36 -165 154 -3 -152 37 -36 -221 -119 61 60 62 129 -115 7
4735 7 115 81 -9 178 67 -208 -166 148 -61 38 11 -47 -9 111 272 -123 -147 119 198 -88 23 39 -79 -106
4759 -106 -8 -56 261 -18 70 11 -90 -13 -31 99 169 -7 -19 65 -53 83 -74 -210 114 -28 -175 130 57
4782 57 50 -61 13 -73 43 40 -93 -45 58 -65 -24 -34 87 -35 65 -52 -116 -25 28 -34 -58 -11 -110 -75 81 20
4808 20 10 -192 120 -200 -38 -85 -57 -44 -59 -77 15 46 2 -16 71 -131 67 88 27 -13 31 -105 -76 -16 -3 3 -58
4835 -58 57 39 24 68 -26 -105 -30 42 177 -72 29 -9 -43 -102 -95 8 -26 -101 -22 -69 75 -58 51 18 -78 137
4861 137 -2 8 65 14 -8 -39 154 -94 -89 -102 -123 -61 -84 140 -129 174 -153 -45 125 -59 0 -58 50 -96
4885 -96 -14 116 -52 -65 78 -8 -82 -7 -8 47 56 17 45 -28 84 -169 -56 -77 -21 -3 125 161 -68 -34 138 249
4911 249 -54 46 41 84 -151 -11 67 -119 -76 119 96 24 -30 75 72 -46 65 80 -31 173 -123 -79 39 21
4935 21 -19 289 -32 83 -20 -151 40 -41 102 -7 110 37 97 43 120 -51 200 116 -12 -125 43 -27 27
4958 27 -113 -70 -105 54 44 20 231 28 -64 -44 -119 -95 -102 -91 24 26 -54 133 16 200 -169 37 42 -28 128 3
4984 3 -76 -160 -117 25 -96 134 158 -29 86 -110 158 77 109 -45 110 20 -55 -44 -51 121 38 35 -92 102 24 -168
5010 -168 35 15 -66 -13 69 -30 117 -57 -83 -30 -94 -123 -168 -107 -36 55 33 -9 66 173 -32 11 -26 6 9 -142 -24
5037 -24 -34 -31 -85 123 -156 -132 -57 -30 87 72 -201 -71 -101 143 94 75 160 -72 -49 30 5 269 -98 -52 14 -41
5063 -41 100 -14 119 25 -167 11 15 142 163 124 41 -195 -21 70 -136 -93 -60 -58 126 -63 -122 30 -63 71 -110
5088 -110 134 7 -23 2 3 6 199 39 -19 150 118 129 72 -67 94 10 45 91 -168 -22 86 78 -14 10 148 -81
5114 -81 -46 0 145 -97 13 -84 -123 60 -46 87 96 -37 44 -7 -73 44 -137 -294 77 -136 -127 -59 94 -107
5138 -107 -72 -52 -70 23 59 -78 -113 -43 -51 69 10 32 -172 -18 -149 55 133 -62 -53 -10 33 74 -34 -20 -74 24 -45
5165 -45 -175 114 -119 -65 204 13 -30 -66 -198 9 83 -42 -83 -60 7 20 -27 115 -12 -108 88 162 15 130
5189 130 -14 -51 -88 44 96 104 59 241 -113 65 -63 -141 203 -34 -98 -2 -48 -6 -2 32 129 -14 150 -45 -4
5214 -4 -213 -10 21 -84 52 -96 116 -76 -10 33 46 -52 -6 -33 86 116 95 187 -79 -117 -85 -8 104 -50 92
5239 92 35 85 61 -31 151 164 19 1 -70 -68 -9 79 -12 -84 -158 -120 -69 -67 -128 -18 -33 -161 -85 -53 -123 -105 -136 201 115
5268 115 -38 -167 -40 73 -2 -98 76 50 -150 -118 -57 151 -14 26 -63 -118 97 206 42 12 123 177 -174
5291 -174 -8 -54 -83 -19 106 -2 41 69 146 -47 98 135 -148 59 -125 -104 -85 126 110 -236 -64 123 -91
5314 -91 61 -69 119 85 81 -105 -35 -46 -11 46 -71 57 -118 -30 84 85 -59 -112 -102 125 -194 -74 -127 -9 39
5339 39 76 -17 -35 13 -150 -104 8 -54 -36 88 -19 -68 -41 -231 -59 59 37 -81 20 -9 -5 32 18 57 -206 -24
5365 -24 -7 -81 -59 -2 24 -129 -39 -152 187 134 -141 170 7 152 69 18 -50 23 -18 94 -125 -141 41 66 61 37
5391 37 77 80 48 25 -129 -144 -11 84 -7 3 87 61 -25 80 104 51 15 -61 -93 -1 98 127 32 13 -49 93 -1 -22 -71
5420 -71 -58 1 -125 -106 16 -29 -92 -16 32 57 -152 50 -67 -8 -21 32 -61 176 -26 -83 -101 53 -110 63 114
5445 114 37 -95 9 10 56 -22 -97 32 114 81 -44 -82 -49 25 -214 8 159 38 0 65 -21 2 -84 -47 202 -65
5471 -65 -25 -96 34 165 102 -103 -6 82 99 90 33 18 -180 148 -95 -73 -39 58 -97 -34 -72 -97 -68 88 -94 17
5497 17 105 -163 -125 31 -16 48 -121 145 32 -6 108 -24 123 -83 87 -84 -74 -33 -130 -82 16 110 -96 -121
5521 -121 -19 32 127 14 49 50 -24 -159 73 151 -120 198 -11 -118 -112 54 -12 24 -2 -76 169 98 -39 -17 91
5546 91 -117 -159 81 -168 80 101 27 -45 83 43 -187 128 -16 -234 108 -110 -106 -94 4 -7 30 175 26 143
5570 143 65 -140 62 148 87 -19 6 7 -47 -37 18 28 137 168 37 150 -152 29 -75 -33 -22 68 -92 -34 14
5595 14 116 14 27 -157 84 -25 7 40 119 -22 8 14 44 9 -216 132 -65 -95 103 140 -19 121 -123 -50
5619 -50 -5 203 -167 119 15 -81 81 -6 219 -35 139 -124 -20 -102 18 202 -31 -12 -30 69 94 -85 93
5642 93 100 -17 63 42 -6 -17 -17 2 -110 104 86 155 -105 -75 82 -103 -17 -30 209 97 -33 154 8 58 92 37
5668 37 86 4 36 -39 31 35 18 119 28 -159 -54 30 -86 -6 11 -13 14 -107 62 88 51 -110 22 325 6 60
5694 60 38 -35 -44 127 145 164 19 51 -5 120 141 -32 -56 -36 31 49 28 -4 -167 -50 -382 -28 83 116 71 -22
5720 -22 43 -64 -70 10 -156 -142 -174 -181 7 -86 -222 104 192 -32 -209 14 40 -181 -65 98 -111 172 21 -50
5744 -50 -37 -45 88 85 -19 91 92 -79 -38 -22 154 24 -175 -106 -83 -36 123 -59 48 62 -88 -47 210 -71 18
5769 18 153 23 144 -21 2 -44 29 -13 27 40 -140 -31 -36 69 10 63 -143 -33 46 -82 87 -58 -19 86
5793 86 -69 -1 128 21 -33 -30 110 57 -75 -6 -12 78 53 10 -12 -10 13 116 -112 100 -110 -75 -43 -58 -124 84 -130
5820 -130 44 -29 -137 108 100 24 34 -30 164 -43 169 56 -102 -283 -11 -56 -58 2 -89 -146 29 -18 39 173 -68
5845 -68 0 163 -170 -43 -74 -133 47 -136 21 7 -29 26 184 -18 -59 -96 4 2 102 50 47 55 -76 -24 84 67
5871 67 73 -85 122 88 -26 -130 -25 72 69 -216 21 24 112 -10 -24 -29 54 27 18 23 -192 -114 107 43 -144 -133 149
5898 149 113 50 -130 -11 -120 -133 31 -138 34 -57 -18 18 79 68 34 89 31 46 223 -271 116 99 62 -34 36
5923 36 15 32 90 -48 -32 21 -63 -140 146 67 179 -108 1 -94 33 143 55 70 -5 -62 -14 -104 -74 -111 -121 99
5949 99 133 -44 42 -52 63 31 -169 25 22 94 -87 -21 -197 41 11 -49 -76 41 -81 -71 204 39 -7 19 -32
5974 -32 -16 -27 10 15 -214 170 10 -32 22 -108 100 -23 -23 9 29 16 9 -167 -118 14 41 -55 51 -55 -69 -201
6000 -201 -109 -135 5 -133 -90 85 97 -34 -31 122 41 84 73 11 -95 -12 44 8 -18 59 -135 18 1 135 -57
6025 -57 214 -70 -99 -194 -61 -54 -94 5 -127 -124 11 -102 2 -81 -37 38 -38 74 -61 -85 -84 21 113 -55 -1 117
6051 117 -67 -78 -111 -59 -15 -160 -31 -60 3 45 197 15 8 109 -81 -20 -169 -73 -32 -91 26 -109 125 -74
6075 -74 131 61 -178 101 140 -55 -181 -4 -47 155 -25 73 -62 21 -130 -47 -36 -4 33 -10 95 231 6 -157
6099 -157 -74 -75 -5 41 -15 -118 68 135 -49 -110 -85 137 127 -45 27 105 37 78 -141 89 -118 -34 -71 189 125 59
6125 59 22 -62 -94 -110 -106 20 70 -72 145 241 132 74 -4 -67 83 24 92 19 43 107 25 -105 -80 -129 87 40 -169
6152 -169 -103 176 24 46 -220 8 66 115 5 -12 -9 -187 -114 -32 -84 -41 26 20 -40 15 -38 57 -1 -24 -90 4 63 72
6180 72 38 -26 72 266 17 19 -46 -112 -145 -11 22 74 -75 -5 -58 -79 -56 14 -224 -22 122 113 14 67 0 -57 -38 -119
6208 -119 -69 -83 -315 -79 42 -20 -45 91 -222 -61 -77 67 -41 -10 39 183 -5 -6 31 -52 -57 116 11 122
6232 122 -62 39 -40 10 75 32 -28 5 -22 -32 35 -120 33 110 -44 45 -2 -64 112 -82 83 60 95 115 -145
6257 -145 71 82 62 -8 -53 90 -122 -47 -12 -66 58 61 32 -49 44 5 -158 60 -118 -107 41 60 15 -20 77 -39
6283 -39 -101 113 44 116 -24 -80 -24 58 -181 -101 -53 -13 -89 -21 69 2 64 129 -174 124 111 163 68 -94 -89 64 94
6310 94 -30 53 87 -76 -85 -83 150 -51 132 -42 -28 61 -31 14 33 105 53 74 -226 -19 -179 -24 17 92 -127 37
6336 37 4 101 -140 46 -105 211 -119 -132 67 -95 24 -145 -110 -3 -9 27 -33 -74 -16 -64 -73 -68 95 41 100 -62
6362 -62 60 99 61 -145 15 -35 -19 -146 -118 -46 13 -39 -61 64 78 92 -79 -25 153 -86 -35 -26 -67 32 161 -102
6388 -102 77 61 -90 -88 -82 -61 73 29 -117 -30 -46 -15 -8 -72 42 -42 84 -23 -15 -159 -155 78 74 -275 -122 -43 49
6415 49 16 -34 71 -73 140 -25 113 150 -58 -113 9 -39 38 7 139 -210 -28 -116 -28 68 132 101 -13 117
6439 117 -82 24 -62 16 -83 -114 -63 -24 127 -42 15 -69 90 -46 -13 21 -1 45 58 -70 -27 101 -78 -48 -57 97
6465 97 18 -130 -64 -25 -39 0 -112 -14 -180 -59 -61 -30 -23 3 81 2 -62 -41 54 130 94 -10 137 -142 7 71 27
6492 27 -27 -21 41 -12 92 114 158 -120 -84 -178 -60 85 -69 -41 29 37 -28 131 15 -118 -85 31 120 149 36 -121
6518 -121 3 -48 12 56 6 41 -35 17 -38 56 46 -115 -136 31 -25 63 -78 60 -41 12 63 -126 -40 -81 75 12
6544 12 146 94 211 -38 70 33 -47 -61 -144 41 65 40 -146 54 -9 102 -8 32 -78 45 -122 50 88 20
6568 20 12 -119 -40 103 23 76 -64 25 -45 73 70 -76 44 24 -82 -41 -205 -181 -93 -68 -129 149 -89 -43 -13 15
6594 15 -61 104 45 28 75 6 32 -113 -106 -11 169 51 146 -3 -30 29 20 55 135 -108 4 -81 -33 -94 92 -112 -86
6621 -86 -63 57 100 -94 -185 59 -23 -64 78 -94 -142 -29 9 15 2 -9 -66 214 92 146 21 -13 74 -29 44 43
6647 43 -102 98 -182 32 -51 -157 -14 -17 114 -5 -134 73 -50 -80 204 -91 -121 -40 -61 -17 21 -111 -100 180
6671 180 108 2 13 -110 36 1 2 42 -289 -94 18 71 18 -2 0 -43 -14 -112 23 57 -17 20 136 4 16 110
6697 110 -95 -41 -85 -40 -9 -108 -130 -127 -68 -38 -43 264 -22 -119 16 -120 -94 -116 -144 -171 -21 40 75 -94 157 -61
6723 -61 40 -103 99 -21 -6 106 -75 38 -193 -54 69 1 63 107 -68 -175 -47 154 72 -138 167 116
6745 116 -116 90 -46 57 122 -97 30 20 81 38 -62 -50 21 -59 6 -25 37 -44 -141 -20 -126 -81 -90 -16 -20 -69
6771 -69 -11 260 -113 -23 64 218 67 19 34 69 41 -18 -61 158 -11 -54 -113 -31 -178 17 108 -85 15 -151 -61
6796 -61 97 69 -103 -145 -20 84 -29 50 -84 68 155 -21 -182 49 46 16 -23 4 81 -113 -71 -161 -72 52 101
6821 101 35 8 -148 -20 95 -2 56 -152 -45 106 282 -28 3 -51 -78 -24 -53 82 30 -49 3 -34 -147 -24
6845 -24 36 31 103 -79 9 -24 131 -46 -46 -13 175 -34 23 -76 -18 -17 41 87 60 14 4 6 -183 151 77 168 -80 -20
6873 -20 -46 -86 11 -230 15 32 45 -15 -25 -22 -158 -63 31 112 -65 -237 -25 -98 -37 197 -85 -233 1 -19 -54 85
6899 85 -14 1 -55 -14 1 -36 140 -51 100 53 -71 -8 9 -4 -40 -8 -129 116 -70 -34 -78 -171 -85 92 40 32 158
6926 158 -38 -42 -164 209 -39 111 -107 -46 -33 -82 64 65 -135 -58 -54 54 86 113 50 -79 215 71 -133 -66 -7
6951 -7 134 13 -45 255 -100 131 -76 -21 31 24 -3 -88 67 14 6 9 -193 4 39 -65 -236 131 100 113 -165 -14
6977 -14 -37 -98 77 -71 7 -102 60 -50 150 57 -8 -15 -81 66 -3 -87 -119 100 49 -32 5 -32 28 -97 35 87
7003 87 -115 -67 -63 9 -77 -20 225 45 7 -1 99 -3 79 84 -80 113 14 -44 -20 78 101 -61 -39 26 48 90 84 -27
7031 -27 60 -122 -37 126 -213 67 -98 -65 82 -24 48 -8 62 -159 94 43 -105 -18 53 -140 -90 -30 -3 -37 171
7056 171 13 -64 -55 127 75 -116 31 -115 -188 114 -65 30 131 -53 -105 67 67 79 69 12 -59 -85 262 -58 -89
7081 -89 -104 75 45 107 -92 225 -113 53 46 66 -84 -12 81 -173 48 -150 -113 -113 81 -77 4 -116 -75 -27 -35 -131
7107 -131 -16 -66 9 -102 117 92 -64 25 -103 64 60 -83 88 146 84 -8 176 108 -89 -2 -22 -11 74 4 5 -8
7133 -8 93 -109 58 -54 -67 -67 -82 -56 124 -62 44 11 139 7 -43 -77 43 -56 -57 28 24 119 52 -46 -117 35 -55
7160 -55 20 -183 137 36 -147 63 -52 -74 16 9 -45 -72 -9 16 -106 -98 -47 39 40 -107 129 29 -171 5 -26 -20
7186 -20 132 46 -177 5 24 57 98 -79 -133 45 25 70 -154 95 112 1 -6 -122 -77 118 16 -42 111 99 147
7211 147 -23 133 -126 -12 -87 88 112 68 -87 3 90 -31 116 -163 -44 -49 -30 26 -67 -53 41 -125 29 112
7235 112 -39 -70 40 -11 5 131 163 56 96 -109 164 -144 -78 0 100 -20 141 146 51 -33 -26 -53 -163 -123 -44
7260 -44 79 -97 -15 -16 -39 25 71 -83 42 -33 19 -118 55 -32 118 -147 -71 -28 95 47 16 -147 59 -21 94
7285 94 109 39 21 1 -31 -257 68 -29 -70 236 0 -108 106 -57 51 79 -143 -98 3 -36 -22 -115 60 -148
7309 -148 -73 69 65 23 38 -2 17 51 -75 -47 73 56 52 37 48 110 -84 -53 42 105 49 62 -21 -59 -4 -21 16 -56 88
7338 88 -264 79 40 -85 13 107 -88 28 40 104 72 18 -53 -14 -167 -46 50 -93 112 14 20 -53 -66 11 91 16
7364 16 109 -136 233 -37 13 18 -84 39 -5 19 126 86 -64 -125 94 20 -63 -28 4 -224 23 95 35 -34 -16 2
7390 2 -182 -33 -101 -50 93 -42 -143 19 43 84 -52 -21 -80 -50 85 -104 -28 48 -18 64 181 -236 -25 38 128
7415 128 85 175 -38 -26 41 54 97 8 24 -40 74 -132 -95 -69 15 -4 64 -44 59 10 -63 16 118 -80 154 168
7441 168 -65 -81 -101 -59 17 -73 16 68 -153 19 -154 181 85 84 -90 122 -148 124 -151 213 11 81 -43 80
7465 80 -89 137 -29 -153 -59 244 33 -34 47 -115 109 156 14 -96 57 92 -13 -132 -6 -92 -168 31 -115
7488 -115 -15 70 72 154 -126 -69 -7 -112 4 32 -36 -81 -32 -77 -163 -33 -105 5 74 92 27 -39 42 37 77 37 108 -44
7516 -44 -83 55 99 31 -118 -32 47 119 -37 189 22 -104 -79 12 334 130 69 -58 189 178 -185 17 -7 -186
7540 -186 171 61 12 -110 -64 -68 -15 128 110 53 91 138 19 -18 56 0 -2 9 55 59 136 47 -95 8 165 59 -90
7567 -90 7 83 67 175 -12 62 58 -65 -13 52 -3 104 -70 -32 96 12 -110 -7 17 18 -28 -52 -108 23 16 -8 77
7594 77 -11 68 -56 80 -85 -82 5 -166 -15 -2 -57 82 197 -83 18 -3 64 -94 -164 102 18 13 123 -154 -54
7619 -54 -26 -9 171 45 -1 97 6 -48 -27 79 187 -84 105 39 -44 -193 193 19 -71 -50 -42 -27 -151 -32 18
7644 18 224 -86 -95 81 -110 115 -92 -110 55 0 27 -200 62 -126 -113 31 -222 2 125 -32 82 -69
7666 -69 57 -13 -1 9 -155 85 -67 -34 180 -33 68 115 -42 94 -58 34 17 49 -69 44 32 -67 -44 13
7690 13 119 136 28 -231 0 26 34 23 -81 -172 33 220 101 27 -28 -32 -39 89 44 60 -36 19 158 -12 102 196
7716 196 -85 -24 222 79 28 -64 -71 -180 -47 402 71 0 -204 -38 26 -29 -12 -100 99 -85 -53 -123 -240 34
7740 34 8 -24 -83 29 57 153 -28 -7 47 19 -30 -69 -36 -38 -121 -1 109 64 -98 154 86 65 -126 -177 -6 -56 48
7767 48 -41 -63 -122 -239 53 -16 -33 198 -108 93 -54 34 -5 12 11 78 120 -3 -37 -87 54 -52 5 0 74 -123
7793 -123 17 41 178 110 119 72 -22 -9 195 27 -67 -23 -48 68 42 -14 -105 33 -232 -67 -76 -74 -74 -9 66 -10 -34 28
7821 28 -112 -18 17 63 -20 -75 -74 -57 59 -22 -93 31 39 -156 -84 -194 -31 178 237 81 8 92 -45 -97 39 -44
7847 -44 250 30 20 -63 -82 -11 121 -75 -22 168 -30 232 -3 57 12 27 241 -2 139 109 36 89 -32 59
7871 59 -31 176 -53 88 68 38 -43 -94 17 69 -49 45 71 13 41 7 -99 114 -2 -62 -49 92 50 99 -26
7896 -26 106 -12 -224 136 -168 -53 -30 62 21 -30 38 31 199 -110 -10 -182 41 -118 45 24 -73 -30 -227 -147
7920 -147 -70 -111 -27 26 -28 -27 131 -89 -16 -72 71 -26 -52 165 -185 0 -258 -6 166 27 0 -8 116 11 181
7945 181 24 52 -21 0 -99 149 -8 15 20 -53 149 -128 92 -110 13 -13 -4 59 -25 166 24 5 -27 23 77 37
7971 37 68 55 -90 -94 17 72 13 -4 -105 -8 -14 -33 87 13 161 7 2 73 49 180 125 -67 -63 -162 -33 -83 -1 -137
7999 -137 -2 -115 -29 29 -125 59 -119 0 -11 4 69 -13 -154 15 -112 59 -79 -33 55 120 23 93 17 -45
8023 -45 -78 27 -137 -21 49 113 -33 -106 -42 -43 62 66 -2 -69 -93 -21 49 194 -1 65 -23 -18 33 40 205 -174 -3
8050 -3 -62 -48 -2 -52 -24 158 -240 77 216 -55 53 42 -109 101 53 120 114 16 76 -37 -38 25 68 -95 89 163
8076 163 -44 3 5 -35 76 28 53 21 -43 -130 34 135 103 -208 -4 23 -58 -40 -81 16 -224 28 -154 -51 -216
8101 -216 0 -126 -30 124 149 87 92 40 83 56 72 7 -44 -96 -69 182 -84 -17 -100 -68 -37 -95 15 -8 11 -24 -181
8128 -181 -84 -211 -85 -54 -58 -7 27 92 109 -76 -1 45 161 -106 75 6 158 37 123 61 100 -31 26 -26 68 38
8154 38 17 62 4 73 29 -19 83 193 -35 -17 41 -38 -4 -98 -25 98 -27 -56 -12 -153 34 -84 8 11 -9 18 -31
8181 -31 -56 -3 58 -61 -64 58 -16 121 -219 105
8191A05
$$ Imaginary data points
##PAGE= N=2
##DATA TABLE= (X++(I..I)), XYDATA
0 0 0 0 0 0 0 0 0 0 0 0 0 0 8 -8 8 -8 8 -16 16 -16 24 -25 32 -40 48 -56 64 -72 81 -96 106 -121 138 -159
34 -159 177 -201 225 -252 281 -314 351 -390 432 -479 530 -584 644 -711 784 -862 950 -1048
52 -1048 1155 -1275 1409 -1558 1732 -1928 2157 -2428 2753 -3152 3654 -4312 5208 -6515 8595
67 8595 -12444 21948 -99458 -52691 173399 70074 -73381 -76025 17623 17863 10725 30683
79 30683 16390 -60992 -43237 42631 72361 3869 -47709 -22498 18977 2456 -3202 21564
91 21564 8488 -35996 -26928 25937 34708 -16963 -23180 12950 -3167 -29314 24861 55981 -16065
104 -16065 -69238 5556 75473 3606 -72238 -6440 63472 5968 -58809 -13813 50805 14764
116 14764 -49874 -22180 29482 11093 -12830 13075 17937 -25805 -32298 31635 49796 -19805
128 -19805 -45647 13176 41185 514 -25589 -3988 9566 -7857 -6003 11039 -3845 -17404
140 -17404 9735 23808 -15256 -42874 4310 58287 16515 -55141 -30845 41640 40195 -17126
152 -17126 -27488 5643 2073 -15178 17694 34568 -20535 -53802 -1829 47666 15931 -29330
164 -29330 -13812 10814 -3083 -3168 24730 19336 -24233 -34763 12557 43846 11745 -23914 -18787
177 -18787 -5066 3342 17847 19270 -15894 -47485 -10933 49279 31992 -34667 -41687 10120 32879
190 32879 2671 -15241 3071 5709 -7521 4250 19029 76 -22852 -7340 21015 7486
202 7486 -21730 -5293 20426 1288 -23329 -6486 19724 8091 -16406 -5230 13616 3509
214 3509 -3981 5351 4028 -6984 -3763 11328 8674 -13947 -14109 10790 12912 -9827 -17224 1088
228 1088 13763 -1625 -13789 1106 8246 -3248 -2570 8431 5855 -7209 -3502 13402 6652
241 6652 -11570 -2375 11721 -33 -13215 -2918 12787 3791 -15292 -8859 8165 5679 -2901
254 -2901 -3805 -1300 -547 549 9653 9654 -9717 -13691 8647 17033 -980 -15571 -4855 10144 1806
269 1806 -6665 571 -525 -7855 -2432 6305 4053 -6468 -6329 7810 7773 -4029 -1459 7056 4647
284 4647 -4396 -5317 7864 8756 -7946 -8922 3824 4441 -2887 -4626 -936 -1601 -6654 2073 9569 -3781
300 -3781 -10589 2469 11059 4978 -6237 -4578 6551 4325 -2546 367 1062 -1576 -2745 -1245 3841
315 3841 -1075 -8473 -614 4155 -2119 -2728 2290 3812 -808 -4123 4948 8258 -2619 -3794 2394
330 2394 3071 2129 -1253 -2293 -274 -2816 -966 2434 -3609 -5974 -1597 2062 3442 -2510 -4606 3972
346 3972 4584 -379 1013 1248 819 909 843 3322 404 -4118 969 959 -3616 -826 166 -1799 -2700 -3054
364 -3054 2236 4803 -1362 -2843 -141 2125 4964 1893 -855 308 -1992 795 6704 1577 -5858
379 -5858 -5690 -702 3703 360 -3948 -2361 -3822 -1607 5191 3682 -2036 -3059 -54 4834 4027 252
395 252 822 -185 -1147 1591 2440 1295 -1267 -5808 -2742 2147 -307 -2503 -1448 270 -173 -2902
411 -2902 -166 5599 2595 -2423 -2591 508 4752 4700 726 -1486 -3929 -3018 2559 4137 -170 -6246
427 -6246 -7978 -444 6723 4951 -2073 -8917 -5301 6829 9645 2022 -4421 -3386 2651 4818 3115
442 3115 1472 -3108 -5158 -930 1837 3000 950 -5539 -7065 -1310 3247 1347 -2854 72 4474
457 4474 -1450 -4535 3135 7135 2374 -3940 -4534 2570 7211 3938 -2709 -7831 -5309 841 1775 4196
473 4196 3437 -7693 -11981 642 14092 9820 -9016 -14590 1112 13175 10814 -310 -9166 -4857
487 -4857 3701 5068 3548 -1126 -7437 -7769 -1518 8406 8454 -6863 -13801 -2544 8260 6950 -2693
502 -2693 -5214 4123 5987 -1587 -2736 1949 5219 2046 -5565 -3163 4056 3294 -1726 -5704 -3713
517 -3713 690 -1854 -949 7779 4171 -9905 -11396 4410 17792 6749 -11682 -9078 4844 11041
531 11041 6304 -5920 -9248 -1454 1386 2028 4473 1602 -7507 -12675 -495 15323 4967 -12769
545 -12769 -8239 5718 10637 4087 -4563 -2978 2865 2934 -390 -2637 1842 6084 -3331 -8272 565
560 565 3999 -1494 -4077 -1754 719 -2581 -2260 6357 7335 -1519 -7822 -5637 7706 14030 505
575 505 -10287 -4164 6023 6931 -1375 -6236 -3853 -3978 -373 6663 5112 -2590 -8980 -8018 4326
590 4326 11495 3316 -6314 -5226 4533 9748 1212 -5095 -3031 -250 2822 2012 -1472 185 -1337
605 -1337 -5853 -2357 3268 2110 -3446 -4294 3190 4398 -3630 -934 6428 4181 -1615 -4970 -1099
620 -1099 5843 5114 -676 -4355 -4268 1947 3169 -2648 -2981 -2743 -3163 2387 5512 1187 -3480 -4716 -159
637 -159 4916 4989 3358 -2414 -5397 2999 6109 -1725 -4729 -1000 1417 -261 -2645 837 757 -5055
653 -5055 -3556 2198 2679 783 -1269 132 3312 955 -892 888 1870 2201 -424 -2281 600 1817
669 1817 -83 -743 -3076 -4306 -1024 2088 2237 -1625 -4176 189 3734 1805 564 -729 -1714 1052
685 1052 4035 4120 -384 -4789 -838 3010 -30 -2448 -2222 -811 -432 -1082 294 589 -2129 -1616 1048
702 1048 1798 1775 738 843 1537 359 164 1609 262 -931 -745 383 801 -1642 -3034 -609 -493
719 -493 -1201 -642 189 768 48 -299 1754 1063 -447 1704 2465 809 -172 -98 1710 255 -2970 -703
737 -703 1085 -1724 -2335 -1109 318 -294 -2040 371 1939 -1263 -257 2779 1424 298 144 1282
753 1282 2601 -75 -1434 514 -294 -970 -880 -1361 -332 -1368 -2711 954 899 -2195 -659 1351 1841
770 1841 367 -1146 2293 2856 -1074 206 2274 -97 -565 -641 -334 -28 -2348 -1174 732 -1861 -1634
787 -1634 -9 -11 651 -789 -782 2867 1468 -441 1274 1257 1020 356 -304 1169 -417 -2547 245 374
805 374 -2138 -1118 -980 -338 -205 -1857 351 1474 -608 267 1327 1151 2121 235 -71 1730 -140
822 -140 66 916 -1303 -1254 -328 -770 -546 -1826 -1450 806 -1258 -1581 1379 1008 582 683 320 1823 1203
841 1203 166 1456 115 -1078 542 265 187 -712 -2839 -665 563 -1461 -711 -30 -738 -485 -330
858 -330 1760 2287 -981 42 2490 791 371 713 480 200 -1669 -1232 1471 -613 -2220 -1264 -1132
875 -1132 -297 -303 -518 1076 -283 -1762 1363 2680 1781 349 -1076 526 1575 435 1144 -74 -2960
892 -2960 -1232 753 829 -798 -3320 -1461 911 -702 -20 1817 193 -1138 -443 2446 4235 -572
908 -572 -2386 1299 1860 661 -620 -1321 53 -769 -2177 -310 119 -653 -869 -1884 -275 1563 400
925 400 766 870 -291 517 1104 1669 2065 304 -1568 -1344 -207 2878 1327 -4356 -4016 951 1981
942 1981 -554 -2343 -495 724 -1007 486 3672 1920 -1510 -2176 1011 4616 1706 -2418 -1721 743
958 743 1283 -119 -1809 -1201 -1286 -1583 -513 -104 175 1255 -369 -1998 -50 2651 2278 -504 -1175 2433
976 2433 1693 -1608 -389 2213 742 -3653 -4447 2325 4832 -2395 -5945 -1671 3300 1841 -2155 -120
992 -120 2947 -1037 -2426 3257 5087 433 -4184 -1607 3898 2450 -1852 -2224 -1761 -190 1227 -658
1008 -658 -1709 -1436 -1119 290 228 458 2486 797 -1777 -772 1424 3251 1285 -2396 622 3117
1024 3117 -1275 -3482 -740 2232 -397 -5229 -992 5307 291 -4670 -1927 1513 2086 -137 724
1039 724 3237 -189 -2414 1250 2408 1587 -627 -3003 -527 1827 546 -998 -2632 -2512 1310 837
1055 837 -941 -565 -583 1421 1395 -1216 1506 3298 -1279 -2635 622 3863 1898 -3507 -1138 3122
1071 3122 -1434 -4533 -546 1831 165 -2713 -1277 3086 600 -2447 43 1206 227 740 1530 3105
1087 3105 508 -2931 261 1781 -884 -1136 -208 -488 -1413 -877 2111 27 -5059 -1513 3244 1135
1103 1135 -856 -53 2118 1827 -1476 -4 3153 532 -2105 -931 1760 2092 -2630 -3935 1637 1271
1119 1271 -3087 -1798 1810 1155 -2284 -1305 3607 1678 -2480 1257 3291 -548 -1298 1536 2464 -275
1135 -275 -2073 540 499 -2055 -942 149 -429 -294 -922 -371 798 -815 -1061 953 2171 1230 -516
1152 -516 751 1917 -1044 -1915 2333 1959 -1939 -1384 1166 246 -2981 -2044 1652 -101 -2150 662
1168 662 1677 -476 -881 925 1876 54 -919 1787 1949 -649 -663 214 651 -485 -2085 -393 948
1185 948 -1678 -1647 523 488 -694 -1215 966 1867 -1204 -443 2634 1822 -776 -170 1671 1295 -1817 -1568
1203 -1568 2044 504 -2592 -1192 858 197 -2503 -1853 2015 992 -2174 421 2501 697 -1116
1218 -1116 282 2517 892 -1909 783 2333 -573 -1570 -302 715 -662 -2473 -507 1323 -669
1233 -669 -1504 201 948 344 -882 363 2476 157 -960 1494 1722 -234 -1166 238 1391 -966
1249 -966 -2380 637 475 -1971 -1025 296 585 -791 -989 1187 1159 -645 455 1399 370 313 232 776
1267 776 699 -1077 -238 952 -851 -1311 -666 -323 -306 -1515 -624 1076 -502 -613 1116 533 115 345
1285 345 816 1464 -210 -476 1345 340 -1326 -294 16 -52 -1141 -1554 580 177 -1898 -352 1108
1302 1108 129 -380 -377 1713 1446 -1038 458 1974 -24 -477 303 379 23 -1582 -626 1155 -1112 -1508
1320 -1508 -6 -35 -225 -764 -405 1394 256 -980 1735 1473 12 218 396 1244 119 -1395 722
1337 722 744 -1775 -1144 -7 160 -410 -1806 -171 1289 -793 -433 1064 690 273 3 447 1676 158
1355 158 -704 850 219 -616 -1 -470 -243 -955 -1421 429 -216 -1434 -169 52 169 494 -136 736 781
1374 781 -16 662 1076 264 248 -270 -127 127 -899 -484 85 -1027 -733 39 -672 -216 157 -97 366 -139
1394 -139 813 1476 -38 93 1094 398 82 -1 24 343 -709 -1336 146 94 -711 -1292 -830 1026 638
1413 638 -859 -164 808 252 290 418 1072 743 -220 460 433 -265 32 -212 -647 -614 -463 -59 -230 -1190 -526
1434 -526 641 -3 -346 -64 1059 1131 -610 201 2151 960 -841 -398 898 697 -1156 -1019 531
1451 531 -72 -1652 -867 -70 251 -62 -1316 157 1706 430 -328 62 1159 1031 -559 290 1561
1468 1561 -115 -772 -29 -511 -345 -263 -750 -837 -655 408 287 -1455 -201 1440 103 -417 791 1246
1486 1246 899 -189 29 729 363 -496 -372 -520 16 29 -1338 -503 318 -601 -724 -270 596 582 -534
1505 -534 184 1021 381 629 619 -204 506 473 -322 -229 -443 90 -167 -1595 -745 559 -629 -1518 -532 948
1525 948 1140 -932 -760 1865 1056 -538 322 1372 1335 -564 -1178 618 -5 -1067 -335 -145 -103 -169 -1311
1544 -1311 -541 222 -519 101 656 873 680 -399 143 1006 -223 -181 1294 166 -557 -270 -52 -580 -1536
1563 -1536 -509 896 -1222 -1327 756 618 -678 -517 674 1596 57 -805 1012 907 -128 279 286
1580 286 461 40 -1119 -702 -136 -798 -279 -183 -66 262 -887 -780 714 136 -21 1182 1033 607 -167
1599 -167 34 930 -522 -668 1173 126 -1263 -5 190 -968 -1222 -436 892 -843 -1316 1458 891
1616 891 -960 377 1127 690 88 0 690 500 -503 151 -277 -487 -43 -922 -733 308 -512 -969 252
1635 252 381 -129 -470 601 1405 -333 -257 1834 708 -828 319 1144 2 -993 -393 473 -749 -1214
1653 -1214 105 135 -877 -719 -239 692 256 -588 467 1374 -44 -569 406 1128 345 -1019 368 1131
1671 1131 -857 -1403 38 79 -821 -744 139 387 -501 -431 549 67 19 440 579 1098 227 -386 707 726
1691 726 -475 -630 184 500 -937 -1297 491 113 -1550 -316 789 -259 -850 224 1272 394 -458
1708 -458 1037 1154 -247 5 398 199 -5 -679 -344 115 -443 -723 -627 -484 37 -440 -286 976 -40
1727 -40 -401 636 724 95 -27 876 982 -218 -557 781 231 -1137 -322 -14 -344 -873 -651 206 -46
1746 -46 -882 333 740 -1 -63 150 1016 705 -554 291 1086 -372 -748 111 441 -159 -1236 -544 550
1765 550 -631 -1003 174 24 -117 -290 187 1130 30 -317 732 972 -289 -188 421 610 -394 -1081
1783 -1081 245 337 -1351 -651 240 -93 -595 -514 579 541 -538 261 1367 408 -83 233 865 520 -459
1802 -459 -358 748 7 -1052 -109 48 -198 -844 -810 450 45 -675 247 435 -6 -128 185 683 385
1821 385 -449 663 753 -476 -127 -19 -157 -424 -1031 -80 305 -1068 -535 393 199 -179 -157 354 955 -146
1841 -146 76 1001 157 -59 176 238 192 -186 -529 279 -419 -839 -268 -37 -338 -284 -390 313 276 -360 606
1862 606 871 58 238 495 591 220 -626 345 542 -878 -506 130 -178 -705 -879 -112 410 -542 -549 538
1882 538 222 138 105 277 686 98 80 849 133 -316 77 -160 -242 -607 -692 113 -461 -1135 21 145 -266
1903 -266 -186 -129 564 441 -356 476 1025 -16 -84 465 475 277 -788 -342 385 -466 -1088 -208 86 -96 -495
1924 -495 -129 532 56 -112 469 325 214 714 329 219 -14 98 259 -280 -371 306 -238 -475 -404 -549 -114
1945 -114 -69 -422 -217 315 327 -8 -202 744 807 -228 -198 791 204 -376 -128 81 -90 -536 -407 -187 -539
1966 -539 -489 -124 -258 -23 191 11 97 191 499 270 -74 478 678 192 -52 -122 -414 78 -304 -706 -147
1987 -147 206 -274 -618 -554 388 170 -561 296 702 233 292 230 379 338 -138 -34 443 -374 -193 5 -449
2008 -449 -76 -539 -403 95 -588 -461 448 74 207 352 163 559 165 -4 530 -52 -328 478 140 -101
2028 -101 -375 -588 -92 -146 -687 -240 136 -65 -152 -514 244 787 -114 -160 869 543 96 18 138 266 -402
2049 -402 -372 335 -235 -673 -13 -456 -349 -85 -388 311 101 9 423 237 163 425 76 203 575 20 287
2070 287 65 -728 -141 -266 -456 -89 -421 -531 217 -737 -429 412 65 271 89 12 769 233 -105 795
2090 795 470 0 307 -96 -336 -303 -247 49 -282 -758 361 -134 -753 -104 244 410 368 27 741 352 -190
2111 -190 163 280 -53 57 -59 -58 67 -963 -583 16 -290 -390 -313 327 322 -235 -17 820 351 24 176
2132 176 403 427 53 -255 500 -108 -296 -66 -71 -379 -416 -531 88 -14 -707 -72 456 -138 -42 224 752 475
2154 475 -231 332 645 -109 -209 -58 -51 46 -304 -177 -142 -442 -481 -186 67 84 26 -54 564 298 -419 450 554
2177 554 -146 7 209 464 119 -430 274 -164 -649 -175 117 -288 -84 145 7 -206 -240 531 465 73 401
2198 401 286 134 374 -37 -45 294 -118 -251 -73 -221 -279 -396 -498 109 -492 -394 434 -84 -286 223 517
2219 517 362 -87 -135 659 152 -486 17 255 -140 -191 -353 -123 -268 -583 -125 196 -137 -72 122 307 205
2240 205 -183 330 792 -74 119 303 500 -1 -459 -35 385 -249 -467 -72 -258 -301 -429 -7 399 -136
2260 -136 -410 481 427 185 24 375 691 263 -312 453 314 -376 -108 -52 190 -28 -509 -198 95 -474 -55
2281 -55 369 -28 23 96 147 358 54 140 679 -43 66 4 14 340 -269 -602 122 -190 -378 -50 -142 -225 28
2304 28 -295 215 319 -54 449 287 -28 539 119 113 113 -119 21 -10 -409 -29 -53 -510 -150 -30 63 -112 -96
2327 -96 208 508 -162 23 586 319 335 -143 -4 630 -189 -542 109 -61 -408 -305 -353 152 16 -414 186
2348 186 316 -310 164 111 256 190 -34 322 422 -293 -69 285 -314 -132 -408 -121 63 -554 -518 205 -126
2369 -126 -439 -228 212 364 188 -72 530 232 -12 290 168 281 24 -386 -22 298 -384 -313 -86 -282
2389 -282 -252 -433 -248 83 -149 90 173 162 167 140 178 321 193 209 311 -171 -91 -132 -406 -364 -370 -143 -7 -176
2413 -176 -323 78 -97 183 264 36 270 331 55 252 -27 103 173 -123 -176 -93 -416 -34 53 -265 -318 -183
2435 -183 -289 8 93 28 136 -84 428 523 -43 147 423 211 -7 -66 70 -44 -507 -398 69 -217 -221 -184
2457 -184 -142 152 95 -300 302 269 123 333 365 360 222 -64 350 116 -339 -58 139 -40 -368 -299 152 -121
2479 -121 -437 -142 74 -229 137 215 177 257 35 123 401 301 142 75 105 87 -413 -336 103 -149 -594 -129 -34
2502 -34 -107 -64 -40 242 19 -167 212 117 122 410 119 104 182 -18 -41 -152 -122 -133 -328 -156 -11 -388 -144 215
2526 215 -171 -26 482 152 166 41 156 342 27 229 367 -138 -273 232 -339 -413 -51 -46 -261 -193 -108 -63
2548 -63 -171 12 382 -3 223 100 -46 297 205 -33 265 224 -42 -156 -151 -186 15 -703 -179 173 -337 -283
2570 -283 6 145 159 -220 -18 508 153 138 309 74 384 -67 -94 288 -240 -301 -29 -152 -151 -216 -300 108 188
2593 188 -450 54 361 2 201 53 256 461 -110 -136 158 -185 -110 -29 -322 -162 -351 -279 130 -356 -369 16
2615 16 -12 78 -22 172 354 139 -83 158 385 191 145 -83 78 -4 -178 -302 -73 -231 41 -86 -296 -68
2637 -68 -74 -235 -18 181 404 211 -9 370 280 -74 81 212 -131 139 -302 -216 5 -287 -254 -125 -83 102
2659 102 -7 24 204 172 11 159 323 299 69 132 165 130 -271 277 31 -224 -116 -196 -124 -219 -299 33 141
2682 141 -321 -55 -36 181 167 18 131 257 157 -32 84 104 8 -285 -47 198 -386 -415 106 139 -457 -66
2704 -66 112 121 -177 -180 455 197 20 45 113 20 214 -147 -42 65 -116 -62 -95 -45 -116 -331 -96 152 -199 -50
2728 -50 360 64 93 123 227 265 -42 87 384 36 -10 -57 -360 78 4 -203 -32 -274 -236 157 -27 -87 179
2751 179 180 -29 201 -101 403 421 -71 138 295 99 -183 -216 -73 -70 -435 -117 -108 -382 -160 -64 52 27 -47 170
2775 170 363 20 161 341 294 221 -41 -288 197 36 -135 226 -112 -212 -144 -113 36 -282 -215 285 167 -29
2797 -29 144 383 146 -30 -285 303 316 19 -66 66 -149 -18 -188 -107 53 -279 -183 46 -162 -94 176 74
2819 74 180 92 -28 260 239 -76 75 58 28 -151 -317 66 46 -458 -154 -131 -350 15 -64 171 24 -108 163
2842 163 235 16 156 110 -1 128 6 -200 325 -30 -169 -54 -190 13 -144 -137 -11 -102 -198 34 50 167
2864 167 210 206 131 95 23 246 103 27 -71 -6 -35 -118 -275 -86 2 -240 -10 75 -341 -49 155 -43 146 164 212
2889 212 300 118 -96 122 101 249 -94 -175 -1 -37 -413 -115 -45 -120 111 0 11 35 2 383 88 -96 253
2912 253 228 248 211 -68 114 69 -249 -148 -64 -151 -110 -66 -82 -120 -159 -62 370 -112 141 128 0 291 205 -61 159
2937 159 184 -76 151 -26 -30 -145 -172 -50 37 -64 36 -110 -23 48 142 170 220 138 162 -74 -31 159 131 6 57
2962 57 -22 206 6 -129 -77 -109 -146 7 -315 -47 286 -120 101 118 15 106 121 -100 207 -29 -57 137 -136
2985 -136 -163 91 -114 -271 -72 -111 63 -194 -120 172 116 40 213 -189 140 158 -50 -21 276 -4 49 0 -102
3008 -102 -67 -224 -4 158 -602 -212 183 -140 -7 -15 26 -33 -123 -63 125 -6 19 209 24 -112 62 -120 19
3031 19 88 -216 44 5 -4 -140 -194 -130 -13 -175 304 269 -95 45 87 94 159 130 156 281 -366 -91 49 -326 -154
3056 -154 -5 -53 -49 -106 -30 70 207 164 244 67 318 116 -78 64 130 -196 86 -45 12 69 -349 20 -25 -261
3080 -261 -67 -107 -162 37 33 167 154 192 99 185 222 -53 11 -61 42 61 -21 6 -189 -255 145 -76 -62 -116 -143 -72
3106 -72 -63 38 -4 -104 159 235 -57 257 43 63 14 -19 -113 -79 -110 -119 -42 -177 -227 -115 -91 -73 -144 59 -107 168
3132 168 250 63 -86 38 327 28 -65 161 -48 -183 -29 -61 -23 -246 -267 20 -186 -48 141 -40 252 133
3154 133 -1 222 150 -52 305 67 65 215 -66 -30 -69 -269 -229 -96 -97 -22 -163 -117 47 -191 85 247 -25
3177 -25 29 207 19 40 -41 127 207 48 -23 75 -190 -207 43 -94 161 10 -5 43 155 -62 -65 37 88 225
3201 225 -2 106 151 -22 -78 33 -45 86 -45 21 -46 -176 -166 16 -257 118 11 -66 52 -59 12 124 115
3224 115 119 67 120 -11 105 -15 33 -226 -201 -47 -252 109 -159 -183 -81 103 -257 171 13 -107 131 87 -22
3247 -22 106 44 -2 2 -30 7 -37 -12 -17 37 -195 54 -49 -198 238 24 53 56 -33 -1 43 6 284 60 -68 94
3273 94 -29 -104 50 -5 10 -130 -141 -129 -127 -289 -22 71 -84 -35 -73 -2 85 99 143 92 -35 61 -8 14 65 -20 -97
3300 -97 132 31 -116 -187 -23 106 13 123 208 125 3 66 -18 133 169 -82 48 3 -121 -108 -35 -79 13 -157
3324 -157 -78 136 -98 -106 56 -152 13 162 -53 221 -17 -53 -22 -13 -20 33 -71 -32 17 26 -4 17 -209 117 139 -122
3350 -122 154 35 49 -42 152 133 67 87 198 15 18 99 -26 -142 -35 -350 -97 141 -133 31 12 -91 -19
3373 -19 -25 154 314 -82 37 157 -46 66 125 50 86 77 -167 1 -211 -100 -48 -155 34 25 -46 147 52 -40 172
3398 172 -29 212 -32 -1 165 -82 57 139 -224 -64 -28 -167 -78 -117 26 -7 105 -34 54 -17 -45 12 -3 84
3422 84 164 -70 176 43 188 181 -6 83 51 6 -157 -203 169 -168 14 10 -59 208 124 -23 115 -130 55 91
3446 91 24 181 -75 20 -2 -279 -34 -185 -208 -116 94 -88 24 -15 -11 -3 -35 -60 11 145 32 297 189 123 121 81
3472 81 157 71 -112 -58 -67 45 56 129 -58 16 69 7 -148 89 -22 -38 -134 -89 56 -40 72 53 93 -30 -7 -21
3498 -21 -134 -169 2 -46 31 -223 -101 -51 -15 86 -8 1 18 -33 65 111 69 2 171 -85 -23 68 -131 10 42 -133
3524 -133 271 -20 -38 -99 201 -48 -41 -95 -99 100 195 11 37 -37 50 161 -31 175 -136 108 106 -42 -36 18 0 49
3550 49 -22 22 12 69 30 -39 91 3 21 -80 218 -134 -127 154 138 -77 144 79 83 -20 -319 -52 22 -12 31 81
3576 81 -179 133 -135 -74 -60 14 251 -12 73 37 -63 18 -37 88 8 -55 -7 -55 69 -37 124 215 8 69 112
3601 112 82 78 -24 -131 13 -144 -133 70 -123 -74 -61 -165 -82 82 -97 -110 -183 41 -19 -16 16 10 -42 -7 -17 -50
3627 -50 -8 113 30 -47 -9 -63 86 94 62 18 -33 122 88 127 -47 80 21 184 106 141 185 -117 56 26 -40 39 -124
3654 -124 99 10 -245 -73 -59 -199 -87 -163 5 -20 -180 -15 209 137 -20 -97 30 85 107 100 116 -78 -40 -67
3678 -67 -124 79 34 -71 -149 22 -3 -26 8 41 109 170 -125 162 125 63 107 -218 68 177 -95 12 -23 97 -129
3703 -129 89 -17 -95 -89 -72 57 -66 206 137 25 43 -23 109 155 -91 128 58 5 -53 -168 -51 -126 -87 -122 -129
3728 -129 -66 -10 95 -56 -51 102 157 -87 -121 99 16 -1 -11 87 -19 76 100 -91 144 -1 -51 -124 -124 -67 53 -83
3754 -83 19 97 -50 102 18 -146 -12 93 -71 -92 -102 -258 151 -6 32 -77 -172 20 -55 20 -7 -96 -20 127
3778 127 -27 30 83 -201 33 33 -163 141 -94 128 121 -114 -33 -97 -18 29 46 -35 53 -5 -29 -54 9 5 110 127 47
3805 47 32 -18 40 -235 104 5 -125 -82 -2 -60 202 148 -119 -85 -17 91 -4 117 11 25 181 -243 95 77 13
3830 13 -84 51 -140 -290 5 -164 -74 60 -23 -4 -248 108 -116 19 18 36 -33 1 -2 0 152 -40 102 19 68
3855 68 2 -58 -2 75 -36 208 -117 -2 17 9 -33 -53 -13 40 -29 -65 -2 26 73 277 -74 -111 40 63 -8 45 -23
3882 -23 -99 24 -44 35 92 -21 19 51 -39 -48 71 61 20 -162 -89 62 -57 -40 66 -53 -80 6 -106 -170 -75 -4
3908 -4 38 25 106 12 103 48 -5 -94 -39 163 112 73 23 55 2 -106 24 94 -117 -100 -41 -26 -17 -58 -32 147 38 225
3936 225 79 -110 180 -184 93 16 51 29 -158 -34 -118 -53 -276 25 -32 1 150 -79 91 -110 44 -38 53
3959 53 -76 -71 -110 -69 60 90 -132 -186 14 -162 84 -47 -81 81 70 10 130 -18 104 -66 50 -23 96 -78
3983 -78 82 -145 -134 87 87 -10 -70 -19 -35 -53 -176 -95 -53 -161 58 -147 35 -36 -2 110 -159 -55 9 95 40
4008 40 -72 172 -81 -92 -83 32 136 -41 84 -96 68 5 -13 62 8 242 -63 168 -106 128 -10 -109 84
4031 84 -24 78 31 68 47 -179 -277 44 51 -155 114 -185 -23 85 -70 -43 79 138 -2 -20 13 -70 81 -131
4055 -131 -184 261 -91 -101 -4 -159 -139 -188 -211 -166 76 149 -37 63 71 -82 -40 -42 108 103 -30 -40 -107 132 81 0
4081 0 132 -53 88 143 -44 -70 56 -187 16 -145 -69 -39 28 -27 -25 40 -181 -170 187 -2 13 -3 -99 -16 -102 -111
4107 -111 45 89 44 5 -11 -90 -80 16 213 91 61 24 -68 1 -2 38 54 54 -54 -79 56 45 -72 -179 -58 -95 -56
4134 -56 -75 7 46 22 66 -66 -16 51 28 -77 7 -84 -59 64 -45 159 -72 100 146 30 40 60 -115 116 192
4159 192 151 -132 2 -188 -227 -89 -51 -12 -75 -21 1 -15 -106 -168 -35 -6 -56 -201 2 -26 -62 71 8 -54 106
4184 106 -31 -177 177 -52 114 10 77 -151 -68 -153 -47 57 108 125 -127 -1 140 -153 -65 -20 17 -11 72
4207 72 94 -20 -139 0 -113 17 15 -63 25 42 19 105 -42 32 -3 -36 -163 26 42 128 161 -51 157 89 -239
4232 -239 -131 48 18 20 -175 107 66 -8 34 29 78 13 -149 -78 -39 -2 -46 -83 173 152 -51 -65 116 -89 -207 84
4258 84 4 8 -119 -10 53 -84 31 27 -33 -68 -56 220 -156 38 94 72 120 -27 -78 115 116 -12 124 -96 54
4283 54 -303 54 -122 -12 65 39 34 -125 63 14 -84 224 53 -151 -20 135 67 68 -80 -120 -98 4 -13 -43 40
4308 40 43 -27 0 50 20 112 78 6 -108 -75 168 171 -126 125 6 -161 20 151 -31 -84 79 4 107 -10 84
4333 84 144 147 52 82 -54 45 40 -26 66 105 150 -156 -18 -72 -74 -84 20 17 76 47 -61 164 117 -49 -24 169 16 21
4361 21 226 0 -14 11 -116 -161 -5 -23 -276 -110 86 22 -74 157 11 -30 141 -100 125 -3 -44 87 103
4384 103 37 -63 -123 29 25 -227 15 -121 -100 -22 -51 -76 34 -27 -24 -8 79 49 -30 -102 -28 58 178 118 197 -22 -26
4411 -26 86 -15 -178 -68 64 -31 -20 62 -107 20 -57 101 113 5 -90 -35 294 -90 -61 80 91 -11 -109 -252
4435 -252 -202 57 204 -129 98 23 28 16 33 11 -20 82 140 11 127 47 0 7 -34 13 157 48 -4 100 72 165
4461 165 -121 -90 101 72 -145 52 -30 -111 -57 52 114 60 73 -33 -15 -91 -10 -82 167 242 -52 57 -161 -120 124
4486 124 -156 32 21 76 235 131 73 -87 12 -88 -49 57 10 55 -111 29 83 -20 -136 -10 44 -92 80
4509 80 6 -30 101 40 41 23 100 -173 -275 95 -39 -84 -109 83 -47 -43 -51 -28 -86 -10 -76 -87 -53 -4 -61 26 -129 -78
4537 -78 54 44 14 -261 43 38 -55 70 98 -18 21 95 128 -36 -33 -47 -136 -175 -26 69 5 21 66 1 181 -10 95
4564 95 21 -73 29 29 51 -55 -112 82 17 -50 -7 -45 210 -57 4 156 164 28 -30 -104 17 90 28 75 -107 9
4590 9 -113 183 -33 -50 -59 91 -41 19 -103 50 15 41 105 -67 -172 -96 -64 44 76 -14 -59 -110 -231 -74 -136
4615 -136 36 -44 -193 -118 -150 37 -52 41 -107 -138 -248 -95 155 -38 55 59 143 29 -4 -173 -97 -20 -47 -123 60
4640 60 64 -43 76 36 12 33 -263 49 129 13 -46 -163 -78 -132 43 -87 -41 -153 -45 36 51 107 44 91 21 33
4666 33 -12 -125 -74 89 14 -78 41 113 -101 14 176 -217 22 82 -40 -59 131 65 -20 -136 -233 -92 73 -85
4690 -85 -117 107 -122 35 -133 234 -100 -189 61 -44 -148 -135 178 -39 9 74 -6 112 29 -32 -47 -103 -1 29
4714 29 75 52 -30 56 -143 -38 54 10 12 -128 97 65 -34 -15 -115 -29 -18 -39 -49 32 122 -127 -85 141 -162 51
4740 51 71 43 138 -79 197 -55 -120 -59 -143 182 -25 133 -28 -38 1 -28 -37 114 104 -33 -79 11 128 -85 -58
4765 -58 -73 -69 -45 -54 9 -115 9 56 74 20 -44 95 135 -8 -280 -57 127 7 46 8 -135 17 -30 -79 20 9
4791 9 -96 11 -131 25 68 89 42 182 -21 -98 -84 36 -39 101 -81 105 -218 -5 8 -81 -20 -88 83 91 -3
4816 -3 -178 16 46 -209 78 98 -50 114 -73 -44 -96 78 -44 85 52 -45 19 -81 -34 -94 54 57 -236 -123
4840 -123 -67 22 -2 53 -105 -10 -62 50 -37 117 109 -19 20 7 22 -78 19 79 -5 -83 12 14 -94 43 14 -38 -125
4867 -125 -231 44 246 -113 20 150 -31 54 58 160 3 -45 121 -50 10 -1 -117 -106 -140 71 -16 109 69
4890 69 -140 -46 -62 -58 -132 144 5 31 -253 -145 -8 -17 -4 91 62 33 -162 2 -96 -83 -80 50 73 69 -192 -51 21
4917 21 -263 -36 24 107 112 -71 -32 -88 -122 -18 -134 -1 71 46 -43 -61 -126 6 32 100 -19 157 103 59 4 -63
4943 -63 158 -90 29 27 146 -27 112 127 -95 42 -137 -61 214 -135 -70 39 -62 -23 -49 105 7 122 101
4966 101 84 84 189 -203 1 -51 -18 -55 -35 -43 -50 121 -38 -81 132 -132 13 -42 60 155 2 98 -105 62 -14
4991 -14 19 -24 47 25 -102 -147 -56 -21 -53 -54 -28 -12 -48 7 52 23 -142 -123 137 42 112 118 -3 -94 154 56 127 -86
5019 -86 29 -112 -18 -11 14 -59 81 5 -267 -19 -25 -24 -212 -42 -57 -67 34 -10 1 -68 89 28 -237 -122 -123 9
5045 9 112 97 -100 155 127 102 -24 2 -26 43 -51 64 -50 -21 43 28 110 -51 -15 -20 3 63 -14 71 189 79 72
5072 72 6 72 -62 115 77 -184 -13 -73 36 105 -132 60 -89 -59 43 89 27 -3 109 -74 67 -41 -294
5095 -294 -7 30 -92 173 -45 48 0 52 93 -61 147 -2 -38 -70 33 -9 200 179 -54 29 -13 109 -65 -64
5119 -64 5 -21 3 87 29 -30 -27 16 37 37 23 176 -52 -71 55 -21 33 82 56 -159 -128 78 -8 -72 -206 133 52 79
5147 79 125 -94 60 -135 -39 -92 49 53 -128 109 107 -54 -104 -1 -21 11 -50 94 -52 -35 -93 -26 -47 192 -162
5172 -162 24 65 -10 79 214 -94 -114 -35 -10 189 29 14 59 33 22 104 -37 84 245 -79 -75 -128 -78 39 -18
5197 -18 -138 -91 -107 -2 7 -58 -65 -138 83 154 90 -20 63 3 114 156 40 -22 -127 -80 -141 89 -20 91 20 73
5223 73 -45 -58 95 -61 41 -199 97 46 18 38 -66 -22 -87 -166 47 -69 -23 108 -6 -63 171 104 30 -293
5247 -293 -39 -40 65 20 -80 11 72 158 -75 -65 90 -152 56 57 -150 73 119 42 53 79 -115 85 -122 16
5271 16 19 -133 136 -47 -69 -182 -76 -90 40 74 -15 -56 -98 -205 -96 -174 79 84 27 110 2 96 118 13 -103
5296 -103 154 -52 33 29 -82 175 50 17 173 74 -174 -123 25 203 40 7 158 -12 -40 -31 112 -29 19 106
5320 106 53 14 -16 25 16 -114 -37 35 29 -61 -116 67 27 -90 -47 34 -157 -59 -125 -52 -98 18 138 125 -11 23 123
5347 123 16 -97 -79 -186 -60 139 -99 13 29 -47 50 -47 48 1 -214 -32 -105 -18 -32 130 -68 -108 84 -227
5371 -227 77 -78 -245 168 8 46 -41 24 -99 71 -127 98 101 -4 -174 107 10 -3 163 -29 -15 179 33
5394 33 77 57 -58 116 -123 -47 1 8 -40 82 86 42 -24 131 -107 -86 109 132 -89 -8 142 177 76 42 -62 86
5420 86 102 195 44 41 35 115 -78 -129 43 -132 104 9 -4 162 -161 -51 84 218 -4 65 -69 -40 -161 3
5444 3 79 -92 -86 79 -48 -67 -16 -124 28 40 86 47 21 -52 31 -1 21 -150 -59 81 -99 -31 -10 145 149 125 43
5471 43 227 17 -118 69 -42 25 -48 133 144 36 -129 -25 73 -98 -120 180 64 45 -162 12 -132 -42 225
5494 225 -1 -23 -74 -155 42 129 13 -19 -60 74 -1 -31 -122 -118 -56 -41 -104 17 -204 -81 -18 -73 27 -173 81
5519 81 82 -7 -10 110 92 -131 -65 60 -18 44 22 154 -64 -2 88 36 96 52 -119 -5 158 -38 17 96 92 163 54
5546 54 -55 145 11 40 18 124 44 -38 -14 64 -20 54 -190 -119 -97 -38 87 66 -5 80 -27 121 -109 100 -110
5571 -110 -127 67 -30 106 3 38 2 39 -9 28 -29 -46 71 57 94 -84 41 2 -11 23 38 -44 79 -92 -150 50
5597 50 -96 -66 -209 4 21 8 -188 -19 59 76 -67 -4 37 -6 107 70 73 150 -26 23 -88 89 -13 -61 30
5622 30 55 1 -64 87 36 39 29 35 4 -251 91 -91 -243 66 -1 -154 -93 -21 -29 -42 28 -80 -64 72 172 -90
5648 -90 -201 54 111 160 -63 133 77 -224 -142 125 -127 62 -59 33 -198 -40 160 74 -119 104 81 79 18 41
5672 41 32 -5 182 -68 -9 73 40 53 107 -189 147 -8 81 -49 48 157 -134 -101 63 2 121 192 -40 112 -30
5697 -30 -24 0 19 127 180 -91 19 10 82 112 179 36 71 -90 -1 -251 124 -301 -1 35 38 -35 -1 76 -74 -164 -40
5724 -40 76 -76 157 134 180 46 36 18 74 144 32 -35 -114 102 65 -38 138 53 -149 89 -6 26 60 -75 8
5749 8 165 -69 135 7 115 -24 -67 69 95 30 106 11 -41 -57 -127 129 2 4 37 -20 -44 -129 -126 -124 62 -55 -144
5776 -144 120 -127 73 76 -9 -126 -24 41 -139 114 51 7 -48 -5 -63 11 -8 136 11 1 -59 70 98 -85 19
5801 19 86 -140 -97 86 -64 -63 170 3 78 97 68 47 20 46 26 -76 136 -53 -115 71 66 3 33 234 11 -231
5827 -231 -82 -42 -11 90 -8 182 -90 -52 -74 60 -75 -22 -15 -55 -15 -52 -5 -114 61 116 33 -60 -141 151 -54
5852 -54 47 -163 24 53 -82 151 4 -54 24 78 57 -31 -32 -64 33 -93 14 -93 27 26 107 -26 88 104 -116
5877 -116 -80 65 60 -89 -65 -1 49 68 26 23 -134 -200 -132 54 -73 -226 11 107 -141 -7 -60 -64 63 57 -222 -48
5903 -48 108 -41 250 69 -17 -13 -36 90 59 241 34 121 173 -17 146 173 -107 -43 75 -73 -35 40 105 -45
5927 -45 175 5 -40 21 56 76 48 77 16 22 -51 -59 -4 67 -60 15 4 -2 53 30 44 38 106 96 -190 -41 -114 151 58
5956 58 -88 -80 75 14 -45 106 -31 -130 115 -204 108 7 -64 -46 -33 69 -85 -23 43 95 19 121 48 -58 -63
5981 -63 -31 -65 68 55 147 138 41 -42 23 -111 -87 -64 111 128 36 -37 -63 -88 138 -208 -101 -30 89 146 -71 90
6007 90 -137 21 50 -97 16 84 99 -180 38 19 36 8 -159 -40 -63 -122 18 57 -15 -83 31 -41 -142 -182 114
6032 114 24 84 -24 -80 79 -147 -141 -66 -161 -112 -27 71 238 -64 67 12 23 19 -74 -102 3 -88 -121 -94 -83 -35 239
6059 239 121 44 158 62 -52 -154 31 12 -18 -28 132 -14 16 34 -47 12 100 -28 -2 -70 -75 25 -1 185 -16
6084 -16 147 -138 -130 -27 -46 -121 64 9 -101 -59 75 -30 136 -38 180 -26 -26 34 160 61 36 -64 -27 -101 105
6109 105 -91 -172 -45 -67 108 -68 -133 12 34 -79 113 192 -46 15 -3 28 -4 148 89 -105 193 101 61 32
6133 32 80 54 51 -9 89 163 70 -50 67 116 -24 73 108 31 29 135 -5 145 208 -49 -108 -109 59 65 81 -27 109
6160 109 -213 155 43 41 -14 27 -104 56 206 104 143 89 -85 74 49 -61 12 -91 81 -24 -81 -122 -122 148
6184 148 156 -43 -69 -95 49 -85 -66 -183 127 -48 -62 -79 -16 -5 -14 60 -127 -80 -63 -15 -72 -60 -31 -36 0 -73 40
6211 40 116 98 43 10 -66 47 -27 -53 92 -32 -1 -165 37 -32 76 165 -104 46 -18 -97 36 30 -69 43 10 -110
6237 -110 74 118 130 -22 190 55 -10 -67 -73 64 26 25 -161 -49 -47 43 -23 204 81 12 -46 -99 -52 -35 -99 -69 -81
6264 -81 34 -212 74 17 -189 15 54 84 81 235 -151 -189 57 -80 26 79 -12 -114 21 15 87 -163 24 29 -217
6289 -217 -66 -18 178 -14 -87 120 -77 51 -71 43 -96 2 43 -77 32 -22 120 116 -17 -147 54 -62
6311 -62 -59 41 20 77 -21 -106 112 -35 14 -59 39 61 19 35 76 -159 100 -6 -68 -34 -65 -1 45 66 -65 -83 -35
6338 -35 37 16 105 139 138 -55 73 -58 13 183 -105 -52 105 11 15 -4 -32 -34 131 -68 -202 -16 27 137 -53 72
6364 72 26 39 -6 -221 37 -66 34 -36 126 54 15 -52 52 62 -88 11 100 6 -128 44 54 29 -26 -19 -41 142
6390 142 25 48 12 193 11 -26 66 -146 85 92 -25 3 17 -52 148 -8 34 -168 72 -1 28 72 128 187 4
6415 4 -98 -203 -157 -19 35 156 62 -43 -84 37 108 -80 196 -9 89 -14 -73 92 41 -169 54 -84 -60 234
6439 234 -195 -69 -87 -123 1 -65 -261 93 198 101 54 -55 -35 29 8 -34 -150 -214 -178 -10 96 8 -138 -64
6463 -64 72 45 65 -91 -55 -79 -116 -7 93 -144 -116 9 1 27 28 147 -36 62 86 -54 -43 246 79 226 -96
6488 -96 -6 -72 55 89 -35 -106 28 12 -2 -54 -6 -22 -70 -38 -14 103 -173 140 -143 84 189 -1 -27 11 131
6513 131 -131 -79 12 83 -141 -125 112 -73 -73 -114 -56 -82 201 -60 -18 4 67 3 -28 86 41 -142 -45 12 -57 -26
6539 -26 23 -9 47 14 -42 6 -7 -43 107 77 -67 75 133 90 16 156 2 -109 -7 169 60 46 137 -61 7
6564 7 -16 -111 -29 45 7 -64 -71 18 -20 32 81 -105 29 -221 -93 30 70 70 172 83 68 -61 4 -5 119 -2 -8 52
6592 52 -96 41 181 100 9 -9 -121 91 120 -101 -24 111 61 -27 13 -28 22 99 32 119 4 -146 -72 88 152
6617 152 -148 -3 -14 12 -6 -6 48 -99 79 79 146 106 124 -29 -26 -65 -27 179 -135 176 120 64 -31 102 169 -49
6643 -49 -117 99 100 -54 149 122 318 -16 84 106 -136 -86 14 -22 -259 82 18 44 73 -16 -93 -54 -23 2 16 -32
6669 -32 -70 -142 56 -2 -48 -23 -33 12 -70 -190 10 -81 92 -20 -129 18 -102 130 -42 78 38 49 38 -65
6693 -65 -91 -65 92 -27 -200 -14 -158 -75 94 -153 87 3 66 -177 152 -3 -1 38 0 -89 -20 -65 144 84 -158
6718 -158 50 129 -5 46 127 4 -11 -48 59 50 -69 22 -132 185 76 46 46 -47 92 120 100 45 -63 -234 -113
6743 -113 -81 32 78 -47 -16 71 -12 32 47 -35 40 -151 7 -87 -32 -139 -103 17 156 -15 7 94 -13 34 46
6768 46 144 36 -121 -4 85 65 -167 -48 112 -29 94 -32 63 -59 14 154 -121 58 -18 -12 49 -73 -42 -53
6792 -53 64 3 -131 89 -30 172 61 -79 -119 40 -7 -16 -117 -94 119 3 -39 76 13 -23 89 63 61 -92
6816 -92 128 -9 42 137 -74 -62 -20 -78 131 -169 142 160 43 71 96 -124 -143 -29 -45 32 -17 -143 87 -143
6840 -143 20 -64 -36 51 -169 135 77 43 21 -39 -1 -39 12 32 169 35 -64 74 102 119 183 -126 -52 -3 18 -104
6866 -104 55 108 -24 3 54 164 -28 -41 88 12 33 105 112 57 -152 133 -83 15 24 -161 146 35 21 -69 127
6891 127 -61 -31 -70 20 -162 -53 37 91 23 -113 -8 3 -273 -179 -5 109 26 25 -40 31 -109 -187 -108 -115 41 80
6917 80 -45 -4 -107 -8 -12 -41 121 66 3 -60 -12 -25 -77 8 -2 16 175 -1 23 -108 -94 -8 30 -72 29 -141
6943 -141 -41 50 -176 -39 -136 107 -173 -30 34 129 129 -21 -57 121 10 -170 -57 41 69 -123 -34 -86 19 0
6967 0 4 -68 162 -208 10 133 62 -127 -100 108 26 101 -50 102 -3 83 -206 17 48 42 78 -116 63 65 247
6992 247 -125 -59 130 26 -158 -40 -32 -20 144 86 -49 4 141 54 66 -25 184 -77 -90 56 -36 -223 13 -150
7016 -150 23 54 85 -13 -115 -18 -177 132 42 17 -100 -2 -78 -1 -150 59 -80 112 165 -75 -109 -48 -150 -60
7040 -60 56 -34 76 -69 330 -123 -8 14 -117 64 80 209 -59 -40 -35 30 -34 -56 -81 47 -173 95 113 37
7064 37 23 -61 -18 58 -9 -104 54 -26 -66 -152 175 156 -68 -40 -140 -64 -149 -67 10 -12 24 -112 103 46 38 88 -68
7091 -68 -7 96 3 -72 -118 130 6 151 173 -25 207 72 4 -137 73 110 1 -12 55 103 31 -1 31 -51 63
7116 63 38 28 -110 -62 36 -35 10 -30 183 89 -48 -4 -16 -151 -132 -22 93 -11 -145 -80 31 -105 -197 5 -213
7141 -213 14 -10 -17 40 222 107 -99 182 -76 -165 4 -145 -27 -25 10 163 7 -174 -10 85 -37 -23 61 79
7165 79 -14 -57 57 22 17 11 -66 -132 -25 -59 -105 60 -151 52 63 -13 -87 40 -171 267 8 0 -53 -105 137 50 38
7192 38 194 96 -118 74 95 37 73 -61 59 -131 9 50 -39 133 -162 139 -3 186 -90 165 97 -99 77
7215 77 -113 10 52 91 31 -22 151 133 65 74 -65 114 -173 -39 -73 5 65 93 -109 -164 113 60 190 -126 54
7240 54 -22 -58 -103 47 36 -1 78 -174 74 123 -70 117 -25 -147 -27 -48 -2 -187 8 -69 -116 25 124 -40
7264 -40 100 117 99 -26 -32 -15 125 23 -78 72 69 -20 5 63 -16 -49 -44 153 185 -66 -204 -121 92 25 -36 219
7290 219 107 -55 -61 -25 14 69 -37 130 -29 -114 223 0 16 -163 85 -6 -34 124 -3 -113 89 -154 112
7313 112 113 141 236 -116 126 -53 106 33 -13 -12 182 13 218 -99 3 -7 8 9 -109 -83 -54 -216 -61 84 -96
7338 -96 114 -30 27 -32 52 9 -64 18 -81 147 -37 -44 -112 87 -46 -153 -1 -4 -120 -41 59 54 162 -179 -275 -157
7364 -157 -23 52 -41 15 170 56 -2 34 -106 -24 -139 -33 21 114 -54 245 142 70 -117 -59 188 169 -61 42
7388 42 -48 -65 219 58 42 -61 92 -176 44 22 12 12 70 -148 57 137 20 -47 220 63 90 -305 -174 83
7412 83 -8 53 -145 27 -13 -19 -63 10 -255 -6 -120 -32 102 -70 -15 -14 -29 -94 -90 51 25 31 27 44 61 -74 -197 -17
7440 -17 -50 -75 115 -57 63 34 -9 -102 152 22 -6 -105 -43 -67 21 -32 4 99 13 53 64 48 39 70 -71 -181 20
7467 20 -16 225 -120 -53 -34 17 79 79 -8 -104 -17 -91 81 86 -33 14 107 20 -59 -3 -16 -75 144 -12 -7 10 80 4 -70
7496 -70 -150 -33 -135 28 18 -37 188 114 378 130 -64 -34 -54 -8 -70 53 7 78 118 86 135 29 32 -5 62 -155
7522 -155 -174 -18 80 -8 -62 -69 -233 10 21 94 60 -70 56 98 90 27 71 -46 -3 -124 -51 27 -147 -100 -15 -85 -142
7549 -142 -4 5 45 -225 12 -208 -239 -38 -98 6 -41 -119 1 144 -73 -28 -94 23 -24 125 54 284 -120 -19
7573 -19 207 151 -1 -41 28 -6 -8 -66 -2 -83 159 16 45 98 97 47 5 58 -110 54 -87 -178 -67 -30 -1 -26 26
7600 26 5 33 -33 -66 -132 -1 -66 -42 -83 18 182 -98 79 -96 -12 0 100 -194 -127 -93 -109 -7 42 -19 114
7625 114 19 178 -29 56 60 66 -104 -224 117 -73 -54 11 -6 21 -20 -183 -21 33 -132 -48 -47 65 0 45 53 -79
7651 -79 -92 -98 42 68 10 -68 43 121 60 -44 -62 -17 -83 28 -3 -46 -50 -28 15 84 -40 5 -80 -102 -84 -65 -98 2
7679 2 43 87 36 -123 12 6 182 -10 125 8 122 -5 46 -26 11 -9 -9 113 32 -97 119 40 49 60 27 87 9
7706 9 91 -32 259 -125 80 -90 20 56 80 -57 -40 -63 -91 -95 -50 138 -64 -43 108 72 71 59 5 29 16 99 -30
7733 -30 29 132 -81 -135 -32 30 -30 24 5 9 111 69 -91 120 40 82 -70 65 96 -2 86 99 4 -79 33 -109
7759 -109 -21 117 -121 64 97 -95 22 5 93 -93 2 -139 29 -101 59 -48 -83 -141 34 17 -97 -58 -176
7782 -176 38 28 -31 25 57 32 165 -62 -157 114 -66 174 78 -49 -87 112 -72 -27 78 -24 -106 59 -35 -36
7806 -36 71 -70 154 107 -24 -91 -5 -99 -82 6 84 44 117 13 -54 -50 27 -155 171 28 183 -12 37 -22 136
7831 136 167 8 96 -139 -22 38 66 -57 101 -59 -81 -75 62 130 59 11 42 87 -2 38 63 119 -29 -59 17 -201
7857 -201 74 82 -18 -141 118 -14 -129 44 -79 45 51 -63 19 23 114 -27 -72 7 -74 43 -83 -104 0 46
7881 46 -116 -36 -72 120 157 -91 69 49 -37 -75 47 86 -18 -7 14 -59 -50 -76 42 -44 -39 71 22 -36 -35 -2 2 -50
7909 -50 -21 -39 -20 42 -80 28 66 -49 131 19 -107 58 23 38 114 2 -48 24 67 8 41 87 135 119 4 -41
7935 -41 21 -80 -67 137 -183 31 149 -109 72 53 11 -110 -94 -49 -65 96 -31 -53 -95 -30 -37 -22 119 105 29
7960 29 -226 29 79 133 3 -68 22 -2 86 -188 -37 50 -44 -34 182 115 -38 49 1 -35 -44 -55 68 -87 -155 135
7986 135 172 -176 181 -175 -74 100 -81 -15 -25 24 -52 -185 100 -59 37 70 27 44 72 120 -86 41 -140 -76
8010 -76 -46 42 88 -89 -95 -21 -130 17 31 127 -41 101 85 34 98 -59 15 95 -47 76 -212 39 -191 -148 -11
8035 -11 -63 135 -97 -53 25 19 28 123 -62 -43 -171 -22 162 114 -57 21 82 -46 21 -13 21 89 -9 47 -198 30
8061 30 -67 -107 -121 0 11 204 96 -116 102 -137 134 -25 27 -157 -58 60 82 -198 -116 79 -51 -78 131
8084 131 61 -115 124 -53 73 -1 -49 9 20 25 59 106 47 143 139 124 -43 -21 147 30 -28 -44 36 122 -48 -42 142
8111 142 -101 78 183 -68 58 -189 -70 1 9 -215 -24 33 124 -39 57 -65 -38 245 -50 -74 24 -127 41
8134 41 -166 113 -50 -136 -76 -25 -81 62 148 6 -79 -146 -24 48 -28 -131 74 -79 62 -57 -158 84 110 -34
8158 -34 -135 -64 -101 32 -77 -18 20 -75 150 15 52 31 -96 -24 59 -19 -6 -79 60 91 4 85 124 -33 50 -81
8184 -81 1 -60 36 -181 149 -72 -166
8191a66
##END NTUPLES=NMR FID
##END=
