##TITLE=1H_Pr C6-dep
 CDCl3
 8 sc, 
 6.12.2021
##JCAMPDX= 6.0         $$ Bruker NMR JCAMP-DX V2.0
##DATA TYPE= NMR FID
##DATA CLASS= NTUPLES
##ORIGIN= UXNMR, Bruker Analytische Messtechnik GmbH
##OWNER= root
$$ XWIN-NMR		Version 3.5
$$ Mon Dec  6 11:18:48 2021 Russian Standard Time (UT+4h)  she@DPX200
##.OBSERVE FREQUENCY= 200.131346
##.OBSERVE NUCLEUS= ^1H
##.DELAY= (6, 6)
##.ACQUISITION MODE= SIMULTANEOUS
##.ACQUISITION SCHEME= undefined
##.AVERAGES= 8
##.DIGITISER RES= 18
##SPECTROMETER/DATA SYSTEM= spect
##.PULSE SEQUENCE= zg30
##.SOLVENT NAME= D2O
##.SHIFT REFERENCE= (INTERNAL, D2O, 0, 15.7039)
##AUDIT TRAIL= $$ (NUMBER, WHEN, WHO, WHERE, WHAT)
$$ ##TITLE= Audit trail, XWIN-NMR		Version 3.5
$$ ##JCAMPDX= 5.01
$$ ##ORIGIN= Bruker BioSpin GmbH
$$ ##OWNER= she
$$ F:/spectra/data/she/nmr/H-F/1/audita.txt
$$ ##AUDIT TRAIL=  $$ (NUMBER, WHEN, WHO, WHERE, WHAT)
(   1,<2021-12-06 11:16:58.43 +0400>,<she>,<DPX200>,
      <created by zg, POWCHK disabled, PULCHK disabled
       configuration hash MD5:
       00 E9 B6 7A A2 85 ED C7 34 08 36 98 17 FE 4E 26
       data hash MD5: 16K
       0D 41 40 E3 88 83 0B AB E7 A9 A4 B0 7C A7 26 51>)
$$ ##END=
$$ 
$$ hash MD5
$$ 0A 1B 47 8D F6 0B 57 CD 80 AE 6E 59 DA 87 6A 62
##$RELAX= 
##$RELAX= 
##$RELAX= 
##$RELAX= 
##$RELAX= 
##$RELAX= 
$$ Bruker specific parameters
$$ --------------------------
##$DU= <F:/spectra>
##$EXPNO= 1
##$NAME= <H-F>
##$PROCNO= 1
##$TYPE= <nmr>
##$USER= <she>
##$AMP= (0..31)
100 100 100 100 100 100 100 100 100 100 100 100 100 100 100 100 100 100 
100 100 100 100 100 100 100 100 100 100 100 100 100 100 
##$AQSEQ= 0
##$AQ_mod= 1
##$AUNM= <au_zg>
##$AUTOPOS= <>
##$BF1= 200.13
##$BF2= 200.13
##$BF3= 200.13
##$BF4= 200.13
##$BF5= 200.13
##$BF6= 200.13
##$BF7= 200.13
##$BF8= 200.13
##$BYTORDA= 1
##$CFDGTYP= 0
##$CFRGTYP= 5
##$CHEMSTR= <none>
##$CNST= (0..31)
1 1 145 1 1 1 1 1 1 1 1 1 1 1 1 1 1 1 1 1 1 1 1 1 1 1 1 1 1 1 1 1 
##$CPDPRG= <>
##$CPDPRG1= <>
##$CPDPRG2= <>
##$CPDPRG3= <>
##$CPDPRG4= <mlev>
##$CPDPRG5= <mlev>
##$CPDPRG6= <mlev>
##$CPDPRG7= <mlev>
##$CPDPRG8= <mlev>
##$CPDPRGB= <>
##$CPDPRGT= <>
##$D= (0..31)
0 1.2 0 0 0 0 0 0 0 0.06 0 0.03 0 0 0 0 0.0002 0 0 0 0 0 0 0 0 0 0 0 0 
0 0 0 
##$DATE= 1638775017
##$DBL= (0..7)
120 120 120 120 120 120 120 120 
##$DBP= (0..7)
150 150 150 150 150 150 150 150 
##$DBP07= 0
##$DBPNAM0= <>
##$DBPNAM1= <>
##$DBPNAM2= <>
##$DBPNAM3= <>
##$DBPNAM4= <>
##$DBPNAM5= <>
##$DBPNAM6= <>
##$DBPNAM7= <>
##$DBPOAL= (0..7)
0.5 0.5 0.5 0.5 0.5 0.5 0.5 0.5 
##$DBPOFFS= (0..7)
0 0 0 0 0 0 0 0 
##$DE= 6
##$DECBNUC= <off>
##$DECIM= 32
##$DECNUC= <off>
##$DECSTAT= 4
##$DIGMOD= 1
##$DIGTYP= 9
##$DL= (0..7)
0 120 120 120 120 120 120 120 
##$DP= (0..7)
150 150 150 150 150 150 150 150 
##$DP07= 0
##$DPNAME0= <>
##$DPNAME1= <>
##$DPNAME2= <>
##$DPNAME3= <>
##$DPNAME4= <>
##$DPNAME5= <>
##$DPNAME6= <>
##$DPNAME7= <>
##$DPOAL= (0..7)
0.5 0.5 0.5 0.5 0.5 0.5 0.5 0.5 
##$DPOFFS= (0..7)
0 0 0 0 0 0 0 0 
##$DQDMODE= 0
##$DR= 18
##$DS= 0
##$DSLIST= <SSSSSSSSSSSSSSS>
$$ [...]
##$SUBNAM2= <"">
##$SUBNAM3= <"">
##$SUBNAM4= <"">
##$SUBNAM5= <"">
##$SUBNAM6= <"">
##$SUBNAM7= <"">
##$SUBNAM8= <"">
##$SUBNAM9= <"">
##$SW= 18.0517287032376
##$SWIBOX= (0..15)
0 0 2 0 0 0 0 0 0 0 0 0 0 0 0 0 
##$SW_h= 3612.71676300578
##$TD= 16384
##$TD0= 1
##$TE= 0
##$TE2= 300
##$TE3= 300
##$TEG= 300
##$TL= (0..7)
0 120 120 120 120 120 120 120 
##$TP= (0..7)
150 150 150 150 150 150 150 150 
##$TP07= 0
##$TPNAME0= <>
##$TPNAME1= <>
##$TPNAME2= <>
##$TPNAME3= <>
##$TPNAME4= <>
##$TPNAME5= <>
##$TPNAME6= <>
##$TPNAME7= <>
##$TPOAL= (0..7)
0.5 0.5 0.5 0.5 0.5 0.5 0.5 0.5 
##$TPOFFS= (0..7)
0 0 0 0 0 0 0 0 
##$TUNHIN= 0
##$TUNHOUT= 0
##$TUNXOUT= 0
##$USERA1= <user>
##$USERA2= <user>
##$USERA3= <user>
##$USERA4= <user>
##$USERA5= <user>
##$V9= 5
##$VALIST= <valist>
##$VCLIST= <CCCCCCCCCCCCCCC>
##$VD= 0
##$VDLIST= <DDDDDDDDDDDDDDD>
##$VPLIST= <PPPPPPPPPPPPPPP>
##$VTLIST= <TTTTTTTTTTTTTTT>
##$WBST= 1024
##$WBSW= 4
##$XGAIN= (0..3)
0 0 0 0 
##$XL= 0
##$YL= 0
##$YMAX_a= 90760
##$YMIN_a= -120669
##$ZGOPTNS= <>
##$ZL1= 120
##$ZL2= 120
##$ZL3= 120
##$ZL4= 120
##$ABSF1= 10
##$ABSF2= 0
##$ABSG= 5
##$ABSL= 3
##$ALPHA= 0
##$AQORDER= 0
##$ASSFAC= 0
##$ASSFACI= 0
##$ASSFACX= 0
##$ASSWID= 0
##$AUNMP= <proc_1d>
##$AZFE= 0.1
##$AZFW= 0.1
##$BCFW= 1
##$BC_mod= 2
##$BYTORDP= 1
##$COROFFS= 0
##$CY= 11.3945322036743
##$DATMOD= 1
##$DC= 2
##$DFILT= <>
##$DTYPP= 0
##$F1P= 2.36226072786647
##$F2P= -0.459571619588291
##$FCOR= 0.5
##$FTSIZE= 0
##$FT_mod= 4
##$GAMMA= 1
##$GB= 0.15
##$INTBC= 1
##$INTSCL= 1
##$ISEN= 128
##$LB= 0.24
##$LEV0= 0
##$LPBIN= 0
##$MAXI= 10000
##$MC2= 0
##$MEAN= 0
##$ME_mod= 0
##$MI= 1.114404
##$NCOEF= 0
##$NC_proc= 0
##$NLEV= 6
##$NOISF1= 3.799351
##$NOISF2= 2.8
##$NSP= 1
##$NTH_PI= 0
##$NZP= 0
##$OFFSET= 15.70392
##$PC= 1
##$PHC0= -15524.36
##$PHC1= 22.4008
##$PH_mod= 1
##$PKNL= yes
##$PPARMOD= 0
##$PSCAL= 0
##$PSIGN= 0
##$REVERSE= no
##$SF= 200.130013532006
##$SI= 16384
##$SIGF1= 3
##$SIGF2= 2
##$SINO= 400
##$SIOLD= 16384
##$SREGLST= <1H.CDCl3>
##$SSB= 0
##$STSI= 0
##$STSR= 0
##$SW_p= 3612.71676300578
##$SYMM= 0
##$S_DEV= 0
##$TDeff= 0
##$TDoff= 0
##$TI= <>
##$TILT= no
##$TM1= 0
##$TM2= 0
##$TOPLEV= 0
##$USERP1= <user>
##$USERP2= <user>
##$USERP3= <user>
##$USERP4= <user>
##$USERP5= <user>
##$WDW= 1
##$XDIM= 8192
##$YMAX_p= 0
##$YMIN_p= 0
$$ End of Bruker specific parameters
$$ ---------------------------------
##NTUPLES= NMR FID
##VAR_NAME=  TIME,          FID/REAL,        FID/IMAG
##SYMBOL=    X,             R,               I
##VAR_TYPE=  INDEPENDENT,   DEPENDENT,       DEPENDENT
##VAR_FORM=  AFFN,          ASDF,            ASDF
##VAR_DIM=   8192,          8192,            8192
##UNITS=     SECONDS,       ARBITRARY UNITS, ARBITRARY UNITS
##FACTOR=    0.0002768,     1,               1
##FIRST=     0,             0,               0
##LAST=      2.2672688,     0,               0
##MIN=       0,             -120669,         0
##MAX=       2.2672688,     90760,           0
$$ Real data points
##PAGE= N=1
##DATA TABLE= (X++(R..R)), XYDATA
$$ [...]
1948C1J06L35j76M7R4k6r5P2n1Q3Q1k34k13r6j16o9r8K7l9jq7P5rJ77N4j08M7
$$ 31 137 472 296 343 437 411 316 388 337 420 501 267 54 -42 -158 -227 -325 -298 -337 -338 -425 -350 -359 -182 -128 -236 -189
1975a89K10p2J2L9m6L32j36K74m7nK54l07J28j69k26j96M22k99j44j15o3J26k84
$$ -189 21 -51 -39 0 -46 286 150 424 377 372 626 319 447 278 52 -144 278 -21 -165 -280 -343 -217 -501
1998e01J52m0R6j25o5J03K14J0L43k00q1J43M3L85k66q5J83NK8j0J58l7l70L1
$$ -501 -349 -389 -293 -418 -483 -380 -166 -156 187 -13 -94 49 92 477 211 126 309 314 342 332 490 453 83 114
2022A14J43k78k27j17m2J51k77L48r5r8J92O7p5Q0P7J7j65J81J02R6Q2l1K38m2
$$ 114 257 -21 -248 -365 -407 -256 -533 -185 -280 -378 -186 -119 -194 -114 -37 -20 -185 -4 98 194 276 245 483 441
2046D41j73N0j27J7J18j90r4K2rk20j03q1K21ol2k75J33J65j12k40L11OJ42P9
$$ 441 268 318 191 208 326 136 42 64 55 -165 -268 -349 -128 -134 -166 -441 -308 -143 -255 -495 -184 -178 -36 43
2070D3k2J44K14M8j85J11k98L12r7j92J27j32J51j71n5o2k13j48k7L1j02K97N8
$$ 43 21 165 379 427 242 353 55 367 270 78 205 73 224 53 -2 -64 -277 -425 -452 -421 -523 -226 -168
2093a68m3J2j01J74j22J55K2J46J78k12M48l44J91q1j19M52k72j52K17j10j82
$$ -168 -211 -199 -300 -126 -248 -93 -71 75 253 41 489 145 336 255 136 588 316 164 381 271 89
2114H9j00j02o5j73J34p5j5K06j19j34%R5K36p1K67k95L85j59L8J15O3o5j62K71
$$ 89 -11 -113 -178 -351 -217 -292 -307 -101 -220 -354 -354 -259 -23 -94 173 -122 263 104 142 257 320 255 93 364
2138C64j65K37j38j90M8p7K01l97j89J31j23L6L1J50k82m3J72J11l44L64N9r8
$$ 364 199 436 298 108 156 79 280 -117 -306 -175 -298 -262 -231 -81 -363 -406 -234 -123 -467 -103 -44 -142
2160a42J70J19J00J27j51j8J40k01P6j39J65k4j91K4k1r1q3j2J34k87J74j34j83
$$ -142 28 147 247 374 223 205 345 144 220 81 246 222 31 55 34 -57 -140 -152 -18 -305 -131 -265 -448
2183d48P9R6J63l28L95N2J1k9n7L08J53k3j73N6j2J23r0J15l10K6r3r9J82k31
$$ -448 -369 -273 -110 -438 -43 9 20 -9 -66 242 395 372 199 255 243 366 276 391 81 107 14 -85 97 -134
2207a34lP7K2k76J17k08J69o8J31M4j61J33p2J20L18p7q6r9K30L8K4j04J87j76
$$ -134 -137 -60 -38 -314 -197 -405 -236 -304 -173 -129 -290 -157 -229 -109 209 132 46 -53 177 215 239 135 322 146
2231A46J46J29j98k21m7K9r1q0J90k88r8j59L3K74l07L20n1j57N12j02L7qq8J99
$$ 146 292 421 223 2 -45 -16 -107 -187 3 -285 -383 -542 -509 -235 -542 -222 -273 -430 82 -20 17 9 -79 120
2255A20J96r0k96J32J29n9K06j55J88l01J24j48m4L2j76J3j68m0L6n5NK46l52
$$ 120 316 226 -70 62 191 132 338 183 371 70 194 46 2 34 -142 -129 -297 -337 -301 -356 -351 -105 -457
2278d57M89m59K97J39J24J13n4j02J62l1K90k82R5J11k44n7L8j31M9j9k33J69
$$ -457 32 -427 -130 9 133 246 192 90 252 221 511 229 324 435 191 134 172 41 90 71 -162 7
2300Gl00o2J40k86Q1L3j06K09L5J47j14J15K08n6J50k80J39L3J20l7K23o5m0%
$$ 7 -293 -355 -215 -501 -420 -387 -493 -284 -249 -102 -216 -101 107 51 201 -79 60 93 213 176 399 334 294 294
2324B94k33J04m4j1k04K4j53q2M9J58j11j81K72l69J23J70pJ79j80L06r4K31J9
$$ 294 61 165 121 110 -94 -70 -223 -305 -256 -98 -209 -390 -118 -487 -364 -194 -201 -22 -202 104 10 241 260
2347B60j39K52k2qj93N2p1r1J71J33k35o1k15J4p1M9J61l51K5L10j21j6mO8K04
$$ 260 121 373 351 343 150 202 131 40 211 344 109 48 -167 -153 -224 -175 -14 -365 -340 -30 -151 -167 -171 -103 101
2372A01k50J81P9L9n0J32o4L23K2l49K8K59k66J17k47j29o9J84o6j7k04K27k67
$$ 101 -149 32 111 150 100 232 168 491 513 164 192 451 185 302 55 -74 -143 41 -25 -42 -246 -19 -286
2395b86J13j15Q1K5j37N1K11j07J14R8K19m5k33K17j55J78o7L53l71K8k5j15J79
$$ -286 -173 -288 -207 -182 -319 -268 -57 -164 -50 48 267 222 -11 206 51 229 162 515 144 172 147 32 211
2418B11j90K53j44l07J45j72j42nj0j94L24l44K22Q7J36P3j28J76j02M19j15K16
$$ 211 21 274 130 -177 -32 -204 -346 -351 -361 -555 -231 -575 -353 -266 -130 -57 -185 -9 -111 308 193 409
2440D09k13K80k21j01l9mJ11r8k10J62jj76J94j25%p0j52q8J57L4K8j69J80m1
$$ 409 196 476 255 154 115 111 222 124 -86 76 75 -101 93 -32 -32 -102 -254 -342 -185 -151 -123 -292 -112 -153
2464a53J30K10j61R8k5MR2j25O3K50O4j70R5j76r9J42j76j25j06J26j66p4QJ19
$$ -153 -23 187 26 124 99 103 195 70 133 383 447 277 372 196 97 239 63 -62 -168 -42 -208 -282 -274 -155
2488a55k85J55L1J37j32N2k04K23K78k88J74J14K86l15K31J58l14L70l25J35j75
$$ -155 -440 -285 -254 -117 -249 -197 -401 -178 100 -188 -14 100 386 71 302 460 146 516 191 326 151
2509A51p2lj31q0O4K41l12p7k75K07j82K19q7L73j97K41j3j58L00j13R5J92n8
$$ 151 79 76 -55 -135 -71 170 -142 -219 -494 -287 -469 -250 -337 36 -161 80 67 -91 209 96 191 383 325
2532C25p5J35j50R5p9l5P5k37J95j01j6j2j79k1k61rRJ90J83m04J00j4K64O1j08
$$ 325 250 385 235 330 251 216 291 54 249 148 132 120 -59 -80 -341 -350 -341 -151 32 -372 -272 -286 -22 39 -69
2557f9J33m9J87j16J66j23J60Q5j73K36k40p8l2J46J14l51l3l03Q9p6k9K4r0J24
$$ -69 64 15 202 86 252 129 289 374 201 437 197 119 87 233 347 -4 -37 -340 -251 -327 -356 -332 -422 -298
2581b98J7P7j28j6l8K11K59jK18j83o7O0J69j04J06j6K6j65M9o3J06j52J33j05
$$ -298 -281 -204 -332 -348 -386 -175 84 83 301 118 51 111 280 176 282 266 292 127 176 113 219 67 200 95
2605I5o8l97Q5o1K84k36Q9k5P7k1p0J06j0R5P8O2r5L16k00J32j17M33j22j17k7
$$ 95 27 -370 -285 -346 -62 -298 -209 -234 -157 -178 -248 -142 -152 -57 21 83 -12 304 104 236 119 552 430 313 286
2630B86om0k78K66lj22j41j36rl9j09L0o7RK78M0j73J59q8K83k19K23J50j22K3
$$ 286 280 240 -38 228 225 103 -38 -174 -183 -222 -331 -301 -368 -359 -81 -41 -214 -55 -143 140 -79 144 294 172 195
2655A95QJ74R1m7K9k73m0K45k85j1k33N4j16P9j53j21P2m4Q2j11J01J1J83j40
$$ 195 203 377 468 421 450 177 137 382 97 86 -147 -93 -209 -130 -283 -404 -332 -376 -294 -405 -304 -293 -110 -250
2679b50J45K24q2K15k62N8o7K64M1Lk63J63L1j33J3N0J54k29J31k52q7j20R7o3
$$ -250 -105 119 37 252 -10 48 -19 245 286 289 26 189 220 87 100 150 304 75 206 -46 -133 -253 -156 -219
2703b19n5K0Q9r9R6k49M45k35L27J3J03R4J0m8j9J39N5j09j84L45l65m2l4p3k02
$$ -219 -274 -254 -165 -264 -168 -417 28 -207 120 133 236 330 340 292 273 412 467 358 174 519 154 112 78 5 -197
2728a97l6K61n1k03K12k87l5J71r5k62K25lK60O7k28K99n3r3J75K33n1J71m32
$$ -197 -233 28 -23 -226 -14 -301 -336 -165 -260 -522 -297 -300 -40 27 -201 98 45 -48 127 360 309 480 48
2751D8O6j77L68k92K80j02k29J65k09L2j25M3k36K38Rn9rN9J23l08J40K3J55N3
$$ 48 114 -63 305 13 293 191 -38 127 -82 -50 -175 -132 -368 -130 -121 -180 -189 -130 -7 -315 -175 -152 3 56
2775E6k21L12mPL9O2n2p1LL5N8P7j92l73K52J7k54K29k99J5j64K44J76o3k10K
$$ 56 -165 147 143 150 189 251 199 128 131 166 224 301 109 -264 -12 5 -249 -20 -319 -304 -468 -224 -48 -111 -321 -319
2801c19L33m2j47N04j07k48K8O1J32J99l61K19J99n4N0k95k3j17K13r3j06l3k94
$$ -319 14 -28 -175 329 222 -26 2 63 195 394 33 252 451 397 447 152 129 12 225 132 26 -7 -301
2824c01p1J85j67M3q1J6R8K05Jln9J72J87n0N5l94L14J25K9pMJ14J45n40j11L23
$$ -301 -372 -187 -354 -311 -392 -376 -278 -73 -72 -75 -134 38 225 175 230 -164 150 275 304 297 301 415 560 20 -91 232
2850B32r2l16J07l9k18M4p3J00j03J59l1Pp2L6J53J20o8P4K45n7o4J82L3o9j45
$$ 232 140 -176 -69 -108 -326 -282 -355 -255 -358 -199 -230 -223 -295 -259 -106 14 -54 20 265 208 144 326 359 290 145
2875A45J61l6j0K02l61O2k97L25l04n4pm2N1j38j02J31j06K28q9LO2J91l5K12
$$ 145 306 270 260 462 101 163 -134 191 -113 -167 -174 -216 -165 -303 -405 -274 -380 -152 -241 -238 -176 15 -20 192
2899A92q3M82j27k36J74k44K38l36J47Q4M9p8l92J14k80K52k05k03K15k7j07J18
$$ 192 109 591 464 228 402 158 396 60 207 291 340 262 -130 -16 -296 -44 -249 -452 -237 -264 -371 -253
2921b53q7L01k17J96k2q8K83j46K70j57J03j71J68l6M5K09j02j38J53k98q3J05
$$ -253 -340 -39 -256 -60 -82 -170 113 -33 237 80 183 12 180 144 189 398 296 158 311 13 -70 35
2943C5M5l75J90q2k6j54J11j01K61j93J31M2J39j78j6K14j42j04M71j1k90K83
$$ 35 80 -295 -105 -187 -213 -367 -256 -357 -96 -289 -158 -116 23 -155 -171 43 -99 -203 268 257 -33 250
2965B50k29K44k70J97M1j6j64QM3l11k6j97K47j5j19Jj18p5K82k36K30K27J29
$$ 250 21 265 -5 192 233 217 53 61 104 -207 -233 -430 -183 -198 -317 -316 -434 -509 -227 -463 -233 -6 123
2988A23k01n0J76K35J40k70J22j04J33nJ09l01k4N9J84j50l87L06j01k68j4k0
$$ 123 -78 -128 48 283 423 153 275 171 304 299 408 107 83 142 326 176 -211 95 -6 -274 -288 -308
3010c08j78K61j2M4K7n0JJ22M5l7J1J56M5J20j43L32j42P6q1O4k44j66L65k99
$$ -308 -486 -225 -237 -193 -166 -216 -215 -93 -48 -85 -74 82 127 247 104 436 294 370 289 353 109 -57 308 9
3034In8J11N9k77K69k80j80k47K37L15m21J52Q7J86k01J75j27L43o4J45L03l32
$$ 9 -49 62 121 -156 113 -167 -347 -594 -357 -42 -463 -311 -224 -38 -239 -64 -191 152 88 233 536 204
3056B04l5K74j54Q6r0k07K57k04O3k34l71L66n1j11J16L0k16j60r4K29Q4K60l24
$$ 204 169 443 289 375 285 78 335 131 194 -40 -411 -45 -96 -207 -91 -61 -277 -437 -531 -302 -218 42 -282
3079b82J44p7J95P6r5L23L4j7Nj1p3J40Q2k43j62J60j48m3j35J09ok62j00K7J92
$$ -282 -138 -215 -20 56 -39 284 318 301 306 295 222 362 444 201 39 199 51 8 -127 -18 -24 -286 -386 -359 -167
3104a67k43J85P8J29j38jK68Q2r6qk48K44K07l1O7J20j66j00M5J6J48p5k90o3
$$ -167 -410 -225 -147 -18 -156 -157 111 193 97 89 -159 85 292 261 328 448 282 182 227 243 391 316 26 -37
3128c7R9j13j22r4j44Oj09J28r6L15K17k55Q6m0N6o2L87k7j81M0K72K32l44j9
$$ -37 62 -51 -173 -267 -411 -405 -514 -386 -482 -167 50 -205 -119 -159 -103 -165 222 195 14 54 326 558 214 195
3152A95K70j60J93j86m22J86m8Q3j77o1J06j48O0j98q6K82j30p9P4K80kK2J60
$$ 195 465 305 498 312 -110 76 28 111 -66 -127 -21 -169 -109 -307 -393 -111 -241 -320 -246 34 32 54 214
3175B14j92j04J01L39J11m9o1k32L04O8l20J10j32j57j47J79r5j16J39j94k05
$$ 214 22 -82 19 358 469 420 359 127 431 499 179 289 157 0 -147 32 -63 -179 -40 -234 -439
3196d39J25o1J06n3K06N5j69l8L22p6o0L67n5J58k76J2K8K16j21P6Oj73p2j82
$$ -439 -314 -375 -269 -322 -116 -61 -230 -268 54 -22 -82 285 230 388 112 124 152 368 247 323 329 156 84 -98
3220i8L5p8K47l33O2k0k14J2Jm6K93JlJ11O5R2j55J95J53N3k26K14or7J87k50
$$ -98 -63 -141 106 -227 -165 -185 -399 -387 -386 -432 -139 -138 -141 -30 35 127 -28 167 320 373 147 361 355 258 445 195
3246A95Q5nk22m3O9m66L31l08k4K27k09q2j5K14R0k30J20kQ8J91k3K8J47q8N8
$$ 195 280 275 53 10 79 -387 -56 -364 -388 -161 -370 -452 -467 -253 -163 -393 -273 -275 -187 4 -19 9 156 68 126
3271A26J52J05q4m3K45K6o0m07K97m94J59J77k28j04j85q2J62r6L3J29k11M35
$$ 126 278 383 299 256 501 527 467 60 357 -137 22 199 -29 -133 -318 -400 -238 -334 -301 -172 -383 52
3293E2j53L1L03k12j01J21j32J25kJ68J72J2j28k76K68l9J60j85k86J90j56j32
$$ 52 -101 -70 233 21 -80 41 -91 34 32 200 372 384 256 -20 248 209 369 184 -102 88 -68 -200
3315b00M4l6n3j08P1l6q2p8J93R5n8J10K8m0K67oJ57j25K06OJ18J35n28L2K28
$$ -200 -156 -192 -245 -353 -282 -318 -400 -478 -285 -190 -248 -138 -110 -150 117 111 268 143 349 355 473 608 80 112 340
3340C40k84K11j71l3m6Lm7k75L1Q6J45m09K30l66K34Q5K10j70K45J92j29J73K24
$$ 340 56 267 96 63 17 20 -27 -302 -271 -185 -40 -449 -219 -585 -351 -266 -56 -226 19 211 82 255 479
3363D79l44k3l2L53j51l0Q4M1j25k21R9q7q9q9m7l68M65n8k36K4Q2L2j1J61Q1
$$ 479 135 112 80 433 282 252 336 377 252 31 130 43 -46 -135 -182 -550 -85 -143 -379 -355 -273 -241 -252 -91 -10
3388a0j25M4K17l8j6J60j3Q2r6O3P6K48l87j7j20M5K46l06l8p8j67R7j65K0K5
$$ -10 -135 -91 126 88 72 232 219 301 205 268 344 592 205 188 68 113 359 53 15 -63 -230 -133 -298 -278 -253
3413b53j72qJ42j92L52k18O8J12M5P3J70J21L6J8J79J10l05K16j55j45K20j53
$$ -253 -425 -433 -291 -483 -131 -349 -281 -169 -124 -51 119 240 276 294 473 583 278 494 339 194 414 261
3435B61L3k98M9j87m3J77j80j53J13K2m3O0n9m5j09K01J24K27j16J00K70k78J83
$$ 261 294 -4 45 -142 -185 -8 -188 -341 -228 -206 -249 -189 -248 -293 -402 -201 -77 150 34 134 404 126 309
3458C09q1J28l36K33J25k31K16k41nj53j72k3j03J76n2M4j75j97J94L24J03l36
$$ 309 228 356 20 253 378 147 363 122 117 -36 -208 -231 -334 -158 -210 -166 -341 -538 -344 -20 83 -253
3480b53M2R9j20K91J51k77L10p2L13k08K38j01p5J3m4j39k72K16l09K93m41K5
$$ -253 -211 -112 -232 59 210 -67 243 171 484 276 514 413 338 351 307 168 -104 112 -197 96 -345 -320
3502c20j49J24k7k06K19M0O5o6K99j70K52k75J26M9K39J51o2j31P9K21J4j13n5
$$ -320 -469 -345 -372 -578 -359 -319 -254 -320 -21 -191 61 -214 -88 -39 200 351 289 158 237 458 472 359 304
3525C04k36R4p7q2J15k03J0Mj93k6l7K7l32L01K34q4k4k4J69J39L8p2J82R2p4
$$ 304 68 162 85 3 118 -85 -75 -71 -264 -290 -327 -300 -632 -331 -97 -181 -205 -229 -60 79 117 45 227 319 245
3550B45L0J15j62J2P7j38k27K52l0o9j75M8l8j19j76J84l8r6J3P1j40L9K09l6
$$ 245 275 390 228 240 317 179 -48 204 174 105 -70 -22 -60 -179 -355 -171 -209 -305 -292 -221 -361 -322 -113 -149
3574a49M0J33nQ7P6m1L0P5n6R6n5k1o8l2J07l9j6j66J56k96J33k96Rn8J60plm5
$$ -149 -109 24 19 106 182 141 171 246 190 286 231 210 142 110 217 178 162 -4 152 -144 -11 -307 -298 -356 -196 -203 -206 -251
3602b51k60L73j51jM54N4r4n5J65n6J30J16J92l29j22q9J22l3j48NJ20l60R0o3
$$ -251 -511 -138 -289 -290 164 218 124 69 234 178 308 424 616 287 165 76 198 165 17 22 142 -218 -128 -191
3626a91K06m62P9P6m8P1o4J38j49L89j58L56l62J45K96r4M3P4J28l96J95j3r2
$$ -191 15 -447 -368 -292 -340 -269 -333 -195 -344 45 -113 243 -119 26 322 228 271 345 473 77 272 259 167
3649A67N8N4j28o8o0j42j00k12M10k80o7j1J94o6pN1n8K71J02n0J3P9N5K52l17
$$ 167 225 279 151 83 23 -119 -219 -431 -21 -301 -368 -379 -185 -251 -258 -207 -265 6 108 58 71 150 205 457 140
3674A40P5M0L8pR8k55R5J15N3l20j09r9k31J99j7j46q2J19p9J20L4p2O4R0N5N0
$$ 140 215 255 293 286 384 129 224 339 392 72 -37 -136 -367 -168 -185 -331 -413 -294 -373 -253 -219 -291 -227 -137 -82 -32
3700c2J17M5L6J09j38K59j44J4K5Lq6J07k84J15j52J2L5M6l18M2r0j11K25j71
$$ -32 85 130 166 275 137 396 252 266 291 294 208 315 31 146 -6 6 41 87 -231 -189 -279 -390 -165 -336
3724c36O0P4j04R0L16k02J78j9l1L07q3q5N6k1K19j37J1j46J42j59p9k7j28L1
$$ -336 -276 -202 -306 -216 100 -102 76 57 26 333 250 165 221 200 419 282 293 147 289 130 51 24 -104 -73
3748g3k09Q7r8K16k13Nn0k1K03o0P5P2j19K86J45l1K2p7mQ5K3jQ2k2j98n9J89
$$ -73 -282 -195 -293 -77 -290 -285 -335 -356 -153 -213 -138 -66 -185 101 246 215 237 160 156 241 264 263 345 323 125 66 255
3775B55j83N0k15p3j87K05o8P8l33J95J91j61P4j37L21o9r0J20k05M97q0k0J71
$$ 255 72 122 -93 -166 -353 -148 -216 -138 -471 -276 -85 -246 -172 -309 12 -57 -147 -27 -232 265 185 165 336
3798C36J33m6k64L47k97J7L1j13j14J00o3j80L2l36J72j77K00L7j76J2Q9Q2m3
$$ 336 469 423 159 506 209 226 257 144 30 130 67 -113 -81 -417 -245 -422 -222 -185 -361 -349 -260 -178 -221
3821b21P3k5J81J63l9P5j65K23j02L80l76J00J00r5Mk08R2j59j08J18q8j61J32
$$ -221 -148 -173 8 171 132 207 42 265 163 543 167 267 367 272 276 68 160 1 -107 11 -77 -238 -106
3844a06j33L7M6j85L14j25l11L59L2m3N7J08M1Q9O3j61RK76k53K98k40R3J43j4
$$ -106 -239 -202 -156 -341 -27 -152 -463 -104 -72 -115 -58 50 91 180 243 82 91 367 114 412 172 265 408 394
3868C94k58l05N2K34m67J04j47K87k28J30k2q1K97k88K38K8J89j29N5k0m0L95
$$ 394 136 -169 -117 117 -350 -246 -393 -106 -334 -204 -226 -307 -10 -298 -60 -32 157 28 83 63 23 418
3890D18Oo6p6j00KJ14k00l9M1j2K1l24N3L1J26J0j48j13O0L2j28L24j94J6K37
$$ 418 424 358 282 182 184 298 98 59 100 88 109 -215 -162 -131 -5 5 -143 -256 -196 -164 -292 32 -162 -146 91
3915I1n8j3J45j23K4J11O3Q3K2M9k30J98p8l52J35J4k84L9N0J34j2j97r6Q5p8
$$ 91 33 20 165 42 66 177 240 323 345 394 164 362 284 -68 67 81 -203 -164 -114 20 8 -189 -285 -200 -278
3940b78j26K48Nr2K0M00o2L1j00O5J09j2JK17J99j85k24k15L22j73m9Q7j91k05
$$ -278 -404 -156 -151 -243 -223 177 115 146 46 111 220 208 209 426 625 440 216 1 323 150 101 188 -3 -208
3964b08K05q1q2j22o6J32O5m0N2J40j43l01K63J87k1K1O6M75l21J00J18k09j67
$$ -208 -3 -84 -166 -288 -354 -222 -157 -197 -145 -5 -148 -449 -186 1 -20 1 67 542 221 321 439 230 63
3987F3R3L69l47pL6q5j28l8m3j38R5j26n7j79K60q3K0J02J89o6j99K34Q5m4J73
$$ 63 156 525 178 171 207 122 -6 -44 -87 -225 -130 -256 -313 -492 -232 -315 -295 -193 -4 -70 -269 -35 50 6 179
4012A79R6p5J55J33m6k59M4o0J31j54J98l50R9k40K14k64K3J2j59j64M87k12j21
$$ 179 275 200 355 488 442 183 227 167 298 144 342 -8 91 -149 65 -199 -176 -164 -323 -487 0 -212 -333
4035c33K42k07M62j48q7QJ46K34P9k08L13k76n3m4q8J69l4m0j40J03l29N0K72
$$ -333 -91 -298 164 16 -71 -63 83 317 396 188 501 225 172 128 40 209 175 135 -5 98 -231 -181 91
4058I1k72N0j37l35K35P1M7O5j46L29J73l82L92q0J25j73J48k6O1J35j04Q2n6
$$ 91 -181 -131 -268 -603 -368 -297 -250 -185 -331 -2 171 -211 181 101 226 53 201 175 236 371 267 349 293
4081B93j32J28k71N1k70k1R9m7l3j12J97j88J52l8O8p3M2J60j70JL4J26o5K78
$$ 293 161 289 18 69 -201 -222 -123 -170 -203 -315 -118 -306 -154 -192 -124 -197 -155 5 -165 -164 -130 -4 -69 209
4105B09q1o5K90K1k04J58j15k1K04j80k69j4l80K81J60j41R8j49R5j25q1M2J10
$$ 209 128 63 353 374 170 328 213 192 396 216 -53 -67 -447 -166 -6 -147 -49 -198 -103 -228 -309 -267 -157
4128a57k34L17J33k18K73MLJ1k7K23j32P7j10K50k9j19j75J32j29l67J01J32k01
$$ -157 -391 -74 59 -159 114 118 121 132 105 328 196 273 163 413 384 265 90 222 93 -274 -173 -41 -242
4151b42j25J36j07K09j56J3m2k1J19J14L86l13K00j03o1K61J07j40MQ2L7J03j71
$$ -242 -367 -231 -338 -129 -285 -272 -314 -335 -216 -102 284 -29 171 68 7 268 375 235 239 321 358 461 290
4174B90j53N5j95k03J93J29m87J51k2l9J74o4r2j7J59O7j33L6J41Q7j62K64j91
$$ 290 137 192 -3 -206 -13 116 -371 -220 -242 -281 -107 -171 -263 -280 -121 -54 -187 -151 -10 77 -85 179 -12
4197a2K69J56m4L8o5J7k8j14n3N3M5j82n5P3k74o0L5k53K41j50K58J7R1j98K4
$$ -12 257 413 369 407 342 359 331 217 164 217 262 80 25 98 -176 -236 -201 -454 -213 -363 -105 -88 3 -195 -171
4222a71K08r0K24P0J35l37J42J56OJ64r1R9m25Q0N3J45j92l04J26o2j95K15j43
$$ -171 37 -53 171 241 376 39 181 337 343 507 416 515 90 170 223 368 176 -128 -2 -64 -259 -44 -187
4245a87k41L78j59j42J17j52L12K83l15M6o3J9K34l9K72j64J99k29P3No0J5K05
$$ -187 -428 -50 -209 -351 -234 -386 -74 209 -106 -60 -123 -104 130 91 363 199 398 169 242 247 187 202 407
4268D07l90j0q5J85q3j77p3j01K11n0q8l8J86j56K36q8J94j73J75k20K01p0J15
$$ 407 17 7 -78 107 24 -153 -226 -327 -116 -166 -254 -292 -106 -262 -26 -114 80 -93 82 -138 63 -7 108
4291A08O5j30J8K09j6p9J21k5J41l67J69m21P6j46m8J02J55j31J2N1j82J49P0
$$ 108 173 43 61 270 254 175 296 271 412 45 214 -207 -131 -277 -325 -223 -68 -199 -187 -136 -318 -169 -99
4314i9m9P4m4N3J67J34K1r4J79q2j52R7Lj56K71j48j34O6oM3l34J44j79N1L4l65
$$ -99 -148 -74 -118 -65 102 236 257 163 342 260 108 205 208 52 323 175 41 107 101 144 -190 -46 -225 -174 -140 -505
4340e05N9J44R6J05j4qJ2r4Q6M1J20Q3J20nj84J16R5j02O0M3Jq7q7J5j89k76L91
$$ -505 -446 -302 -206 -101 -115 -123 -111 -205 -119 -78 42 125 245 240 56 172 267 165 225 268 269 182 95 110 -79 -355 36
4367C6q3j45k41j14L40l17L08p3K02j16J33K98j22K8j52KJ98M9j43J36o5Q7r5
$$ 36 -47 -192 -433 -547 -207 -524 -216 -289 -87 -203 -70 228 106 134 -18 -16 182 231 88 224 159 246 151
4390A51p3k05J85o9j52J34j49Rj12J64NJ4j13R6K73n13J07J51qJ4K1K54K9P0j22
$$ 151 78 -127 58 -11 -163 -29 -178 -169 -281 -117 -112 -98 -211 -115 158 -355 -248 -97 -105 -91 -70 184 213 283 161
4415A61O1Q1K1j4L2j59q2K08k40k40J95j85J57k59L17k56p5r2J5R7l3K18j03J4
$$ 161 222 303 324 310 342 183 101 309 69 -171 24 -161 -4 -263 54 -202 -277 -369 -354 -257 -290 -72 -175 -161
4439a61j3KJ86J90j96K08K6K5P1k10j11L32K2k44R2k44j57L10j66Q4K7k55J8j66
$$ -161 -174 -172 14 204 8 216 242 267 338 128 17 349 371 127 219 -25 -182 128 -38 46 73 -182 -164 -330
4463c30M2K05J2l60K84N7J46m19L72J3J0J9J93J14j65J11j0o2j04J80l58L34n77
$$ -330 -288 -83 -71 -431 -147 -90 56 -363 9 22 32 51 244 358 193 304 294 232 128 308 -50 284 -293
4486b93J27J1J05j37N0O3l28M12l32J57P7l78M32j87K48j57Om5K27J02qJ01n8
$$ -293 -166 -155 -50 -187 -137 -74 -402 10 -322 -165 -88 -466 -34 -221 27 -130 -124 -169 58 160 152 253 195
4509A95J41k12J60q7l7k73J95j13J29r2k05j83L16j57k5K40m57J68K03q0J0j17
$$ 195 336 124 284 197 160 -113 82 -31 98 6 -199 -382 -66 -223 -248 -8 -465 -297 -94 -174 -164 -281
4531b81K77N1q9R6Q3j70L1L19j71J07O4k07Q7%j12L0j3k13K29k83J47%l03J10
$$ -281 -4 47 -42 54 137 -33 -2 317 146 253 317 110 197 197 85 115 102 -111 118 -165 -18 -18 -321 -211
4555b11R0j87L09l43M65j88o0M18n13K54k50L79j14J72R0O4k14M9j50K48k17q
$$ -211 -121 -308 1 -342 123 -65 -125 293 -220 34 -216 163 49 221 311 375 161 210 60 308 91 83
4577H3J46j25j92N0r1kj24JO2o7J09k03M5K11K31j75j24J80J10K28k35K36m15
$$ 83 229 104 -88 -38 -129 -131 -255 -254 -192 -259 -150 -353 -308 -97 134 -41 -165 15 125 353 118 354 -61
4600f1L80j22R1K5Lj21K24k21k08Q7Kl3j47O4j22J69j94m4J94k74o4L06P5p2r2
$$ -61 319 197 288 313 316 195 419 198 -10 77 79 46 -101 -37 -159 10 -184 -228 -34 -308 -372 -66 9 -63 -155
4625a55K03k6R0j04J10J48n9n4LJ3k54K86J7j90l1L2L1j07q9O3j13K91l22j0m3
$$ -155 48 22 112 8 118 266 207 153 156 169 -85 201 218 28 -3 29 60 -47 -136 -73 -186 105 -217 -227 -270
4650b70P9j44N4k6l1L99p1K20j4k56K35J29r9O6J35j91j25K8P6j7j69J26q0k50
$$ -270 -191 -335 -281 -307 -338 61 -10 210 196 -60 175 304 205 271 406 215 90 118 194 177 8 134 54 -196
4674a96J12n8p0L1K5k40K93l2Q9o0k06K97j83K74j10K67k52K9K12k35K11q6K28
$$ -196 -84 -142 -212 -181 -156 -396 -103 -135 -46 -106 -312 -15 -198 76 -34 233 -19 10 222 -13 198 112 340
4697C40J7k08N2Lm4k70J66p1k06K44l16M8K10l9j18j13J52j95K00J27k90K31J87
$$ 340 357 149 201 204 160 -110 56 -15 -221 23 -293 -245 -35 -74 -192 -305 -153 -348 -148 -21 -311 -80 107
4720A07J82Km11M23nJ08k06l69K66J41j21J92k70m4j10l7J09j25q1Q6J70r6J27
$$ 107 289 291 -120 303 298 406 200 -169 97 238 117 309 39 -5 -115 -152 -43 -168 -249 -163 7 -89 38
4743C8k39j54R2M18k02N8j28l67P13J67k88J10k31K66l8J43l52K59j80P5k54l6
$$ 38 -201 -355 -263 155 -47 11 -117 -484 229 396 108 218 -13 253 215 358 6 265 85 160 -94 -130
4765a30J06OLj59K8N3j05r0K63j99R0M4p5K25mj14k46M77l70L04J10l6J86j17
$$ -130 -24 -18 -15 -174 -146 -93 -198 -288 -25 -224 -134 -90 -165 60 56 -58 -304 173 -197 107 217 181 367 250
4789B50kl1r1j18N0P8k05K29q9r8R1k71O3k5M2j31J14n9kK20j1m2p4Q6J63J22
$$ 250 248 217 126 8 58 136 -69 160 71 -27 64 -207 -144 -169 -127 -258 -144 -203 -205 15 4 -38 -112 -26 137 259
4815B59q3m9L1P8j94K09Lj86J31l69M05j61j76j49J72p6j22K5J87J74j90J56j39
$$ 259 176 127 158 236 42 251 254 68 199 -170 235 74 -102 -251 -79 -155 -277 -252 -65 109 -81 75 -64
4838f4L1l67L62k44L64qo7K34j35k7J36o7l61L67o5k4j43M46j72j50r9p8L0q4
$$ -64 -33 -400 -38 -282 82 74 7 241 106 79 215 148 -213 154 89 65 -78 368 196 46 -53 -131 -101 -185
4862a85J32j01j21Q3j40L25j49k0qK66J43k88K30J00J3l02J73n5L62l22L5j9J11
$$ -185 -53 -154 -275 -192 -332 -7 -156 -176 -184 82 225 -63 167 267 280 -22 151 96 458 136 171 152 263
4885B63J12j50m00L48k46j20K73k39k49J67K48j60J51j46n2J32J63j93J53j64
$$ 263 375 225 -175 173 -73 -193 80 -159 -408 -241 7 -153 -2 -148 -200 -68 95 -98 55 -109
4905a09L5J61j77M65k30k93K91J38k19r6L01j90R0k31K9J64l23J56q4l5Q1r2j35
$$ -109 -74 87 -90 375 145 -148 143 281 62 -34 267 77 167 -64 -35 129 -194 -38 -122 -157 -76 -168 -303
4928c03R9Jj46L19L8M9n9l4J30m0l4qJ08j00LJ12l7P1N0j68q2K11J3k12p3J68
$$ -303 -204 -203 -349 -30 8 57 -2 -36 94 54 20 12 120 20 23 135 98 169 219 51 -31 180 193 -19 -92 76
4954G6j83m5K19r5n0Q3r9r5R3R9k69K83J1j53O3J69oj7k11L25q1m7k7K6K88l36
$$ 76 -107 -152 67 -28 -78 5 -94 -189 -96 3 -266 17 28 -125 -62 107 101 84 -127 198 117 70 43 69 357 21
4980B1l1o5p7L71j64l12K3L8l5j9j7K69k01K79l37L03J05k05N8N6M8K29j15P5
$$ 21 -10 -75 -152 219 55 -257 -234 -196 -231 -250 -267 2 -199 80 -257 46 151 -54 4 60 108 337 222 297
5004B97j23j48K10l78J82j41J29Lk13K92J11k01j83Q7j17M6J20k50J79j87K31
$$ 297 174 26 236 -142 40 -101 28 31 -182 110 221 20 -163 -76 -193 -147 -27 -277 -98 -285 -54
5025e4KQ1L2p5Q3j46l8J34l5J19J16J4P1k94N3k32K10o5m3J25J14m82L34m2Nl06
$$ -54 -52 29 61 -14 69 -77 -115 19 -16 103 219 233 304 10 63 -169 41 -24 -67 58 172 -310 24 -18 -13 -319
5051c19J10R3%M3J03n0M9J32k56J75K6k61J66K24l4r3Pj66O8J08j87j7J27o8Q8
$$ -319 -209 -116 -116 -73 30 -20 29 161 -95 80 106 -155 11 235 201 108 115 -51 17 125 -62 -79 48 -20 68
5076F8r3K2j10J35j53j69J48J14LM2k77M77l22K10k8Nl8m9L46q6p1j33q0J56j83
$$ 68 -25 -3 -113 22 -131 -300 -152 -38 -35 7 -270 207 -115 95 67 72 34 -15 331 245 174 41 -39 117 -66
5101f6O1P5N3q5O0j04o4J83j30L0j72J9R7o1N0M8J96k75k49M27j15J28q7J13K25
$$ -66 -5 70 123 38 98 -6 -70 113 -17 13 -159 -140 -43 -104 -54 -6 190 -85 -334 93 -22 106 19 132 357
5126C57j94o1l15N86o56L70j90kJ53q4K26k87J19o4k0M2mk11J20K1k85K73K32
$$ 357 163 102 -213 373 -283 87 -103 -105 48 -36 190 -97 22 -42 -62 -20 -24 -235 -115 -94 -379 -106 126
5149A26k44P1o1J99k32L28j26P9q8o9L18k11j47K5j91N54k19j54k88J26J3j02
$$ 126 -118 -47 -108 91 -141 187 61 140 52 -17 301 90 -57 -32 -223 331 112 -42 -330 -204 -191 -293
5171b93j08J88K6K40j01n6O1K7j27k4p2J43K30M6k50J41Q5q0O3j88J83k73Q7n1
$$ -293 -401 -213 -187 53 -48 -104 -43 -16 -143 -167 -239 -96 134 180 -70 71 156 76 139 -49 134 -139 -52 -103
5195a03M65n04J32M4j45J8J99k89J58Ml09K99n3N2N0k5R9j9j7j78N24k40J4k23
$$ -103 362 -142 -10 34 -111 -93 106 -183 -25 -21 -330 -31 -84 -32 18 -7 92 73 56 -122 402 162 176 -47
5219d7Q8J08mk06O8nJ01l7j37K2M0j99J29k65K66j06N1rQ8m7J4J67k43L37O6j87
$$ -47 41 149 145 -61 7 2 103 66 -71 -49 -9 -208 -79 -344 -78 -184 -133 -142 -54 -101 -87 80 -163 174 240 53
5245E3j7Q2k04K12j50M01l04p0j6J37J15k94M1l3o6R1J0n2Q5j6k05R7R0kj31O5
$$ 53 36 118 -86 126 -24 377 73 3 -13 124 239 -55 -14 -47 -113 -22 -12 -64 21 5 -200 -103 -13 -15 -146 -81
5271h1lM0Q0J04j81r3K67j13J15j14N7Q2L4l5j61Q1l90K09j0j38J29K5J5j43N0
$$ -81 -84 -44 36 140 -41 -134 133 20 135 21 78 160 194 159 -2 79 -311 -102 -112 -250 -121 -96 -81 -224 -174
5296a74J58k46L18Q5k99NJ11J4k41K47l4L50l37R6P7k20j72M01P7k1k47j1J08
$$ -174 -16 -262 56 141 -158 -153 -42 -28 -269 -22 -56 294 -43 53 130 -90 -262 139 216 195 -52 -63 45
5319D5K08k11n8l7L8k08J9Q2J48q0o7J89j03Nk81M45J4o7j21O6j99J72J71k50
$$ 45 253 42 -16 -53 -15 -223 -204 -122 26 -54 -121 68 -35 -30 -311 134 148 81 -40 26 -173 -1 170 -80
5343h0K05j9q8J69M6k85J93%k74O0pN0j61J41j83K10j04L04l17l1L27k13L2j50
$$ -80 125 106 18 187 233 -52 141 141 -133 -73 -80 -30 -191 -50 -233 -23 -127 177 -140 -171 156 -57 -25 -175
5367a75K97J72Rk19P8kq9L30l96k31M30j39J97k13J9k78K00M6m0o9k70L05j3l29
$$ -175 122 294 303 84 162 160 71 401 5 -226 204 65 262 49 68 -210 -10 36 -4 -73 -343 -38 -51 -380
5391c80L99j39j10L02j05m6K07j66J50N2j19j5K33k63O7j84K19J93j05j52n5n7
$$ -380 19 -120 -230 72 -33 -79 128 -38 112 164 45 30 263 0 67 -117 102 295 190 38 -17 -74
5413g4k39M41k10rJ42j58K72m6k07j65M32j87j8p0J31J7j03J53j78M82k60q2m4
$$ -74 -313 128 -82 -91 51 -107 165 119 -88 -253 179 -8 -26 -96 35 52 -51 102 -76 406 146 64 20
5436B0j01J21%m0L5J34k79J64J26k53l1J14R9l9j3Pq3J85k33J8j34K44j2J55k60
$$ 20 -81 40 40 0 35 169 -110 54 180 -73 -104 10 109 70 57 64 -19 166 -67 -49 -183 61 49 204 -56
5461e6K26k9k98J42M74n10J17r1P3r5K27o2l4O5r6j59J41n2j53K24Pm5q7J08j21
$$ -56 170 141 -157 -15 459 -51 66 -25 48 -47 180 118 84 149 53 -106 35 -17 -170 54 61 16 -71 37 -84
5486h4L03j86j34o4J46J35j31K03j0k67L18o1l05L40L7k50p1k69K10J59J1P8j37
$$ -84 219 33 -101 -165 -19 116 -15 188 178 -89 229 168 -137 203 240 -10 -81 -350 -140 19 30 108 -29
5509b9k52L02k61L79j51j02J29J70p3m25J56J58rk1L9p2J60n4r3R3K00Rj31j10
$$ -29 -281 21 -240 139 -12 -114 15 185 112 -313 -157 1 -8 -29 10 -62 98 44 -49 44 244 253 122 12
5533A2K75k88j97l7K79J70l06l7j49L41L8j64P3k55L36j93%J47J19r4j06m5J85
$$ 12 287 -1 -198 -235 44 214 -92 -129 -278 63 101 -63 10 -245 91 -102 -102 45 164 70 -36 -81 104
5556A04J8J09k29O3j64J01K84l01NO5l71M50m98M36j16j03L96q3k98J29l67L74
$$ 104 122 231 2 65 -99 2 286 -15 -10 55 -316 134 -364 72 -44 -147 249 166 -132 -3 -370 4
5578Dl13M82j54M2Qj42%K66j65m1J12N8p6p8j21J19p2j55N22k28j13j90Q8K8J47
$$ 4 -309 173 19 61 69 -73 -73 193 28 -13 99 157 81 3 -118 1 -71 -226 296 68 -45 -235 -147 -119 28
5603B8l9j19k12N78l04k5N0R7J92m08K47k26K02L5J03k70J67J84k14k81K26o2
$$ 28 -11 -130 -342 236 -68 -93 -43 54 246 -162 85 -141 61 96 199 -71 96 280 66 -215 11 -51
5625e1J05p5J89k06m8J32j12J97r1K1J46j75P5l43L6J24J72j83pJ10J32J03l39
$$ -51 54 -21 168 -38 -86 46 -66 131 40 61 207 32 107 -236 -200 -76 96 -87 -94 16 148 251 -88
5648h8J92J34j15p6r6J52j46M8K01l36J75j9j18J8j08K99k04K15l4j65nJ39j31
$$ -88 104 238 123 47 -49 103 -43 5 206 -130 45 26 -92 -74 -182 117 -87 128 94 -71 -76 63 -68
5671f8m6J41O5j28Q4j38J22J23k31K87l58K41q0j04J0P6r9Q1K2P7j61j42P4O7
$$ -68 -114 27 92 -36 48 -90 32 155 -76 211 -147 94 14 -90 -80 -4 -103 -22 0 77 -84 -226 -152 -85
5695h5O9j33k1NK39k04J35n1K27l22L84n95J91J45J48j08m5n7k3O2J14k50p3L21
$$ -85 -16 -149 -170 -165 74 -130 5 -46 181 -141 243 -352 -161 -16 132 24 -21 -78 -101 -39 75 -175 -248 73
5719G3J20j18k06k4J51km6n9o9K93o1j40m0l6K87l37L23j83k5L90k25m8j67J16
$$ 73 193 75 -131 -155 -4 -6 -52 -111 -180 113 52 -88 -128 -164 123 -214 109 -74 -99 291 66 18 -149 -33
5743c3NK21k83J11o9J1m0O6J32j27r4J05Q4k82J93j1R2k72J65q5J25k75J57O7
$$ -33 -28 193 -90 21 -48 -37 -77 -11 121 -6 -100 5 89 -193 0 -11 81 -191 -26 -111 14 -261 -104 -37
5767c7o1J50l5p9j22K87J32k93K39k45J63J67k85m8R4J50j98J67l52L51j91j74
$$ -37 -98 52 17 -62 -184 103 235 -58 181 -64 99 266 -19 -67 27 177 -21 146 -206 145 -46 -220
5789b20K22j49J23K1K59l22M2j72K41J10k97J60P4J06j53q8K03J66l35l2J04k13
$$ -220 2 -147 -24 -3 256 -66 -24 -196 45 155 -142 18 92 198 45 -43 160 326 -9 -41 63 -150
5811a50L09Lm12O0K40R1j55K6Mr1N8Q2k66J02j88K82K18k64m3p4K30j28m3R4m8
$$ -150 159 162 -250 -190 50 141 -14 12 16 -75 -17 65 -201 -99 -287 -5 213 -51 -94 -168 62 -66 -109 -15 -63
5836f3M3J65O2l24J02R6j26J37j02p3m9j38L89k44N0R7Q0j00j38J63O7l02J75
$$ -63 -20 145 207 -117 -15 81 -45 92 -10 -83 -132 -270 119 -125 -75 22 102 2 -136 27 94 -208 -33
5859c3R8J06J1p7J3N4pk45L38r2l39L24l78J44M1m7K30jk63k51K15Q2J15q3o7
$$ -33 65 171 182 105 118 172 165 -80 258 166 -173 151 -227 -83 -42 -89 141 140 -123 -374 -159 -77 38 -45 -112
5884a12J10L7l31J49K28l36K03J44J5j53J91l7j62M46j54l23J00j4ok3N2j22J12
$$ -112 -2 35 -296 -147 81 -255 -52 92 107 -46 145 108 -54 392 238 -85 15 1 -5 -28 24 -98 14
5907A4P7j5J38k31p3J52k61J74K02j34J1J19m14J60P7l7L19l22J07r5K30k45Q1
$$ 14 91 76 214 -17 -90 62 -199 -25 177 43 54 173 -241 -81 -4 -41 278 -44 63 -32 198 -47 34
5930C4J3RK25l75K74m37J34J60j93p5Q1J93J01k63N2L0M0J44j19k6j43L29j83
$$ 34 47 56 281 -94 180 -257 -123 37 -156 -231 -150 43 144 -119 -67 -37 3 147 28 2 -141 188 5
5953EJ58q7j19K46m53L26J12nj60j0kj1lj05p3O0j1K28r1j5L4R0j90J30pr7R0
$$ 5 163 76 -43 203 -250 76 188 183 23 13 11 0 -3 -108 -181 -121 -132 96 5 -10 24 114 -76 54 47 -50 40
5980D0r0M6L0r1P8J19k24J41N5J34k05J11k18J00j45L02m36J87lPP7j24j01O4
$$ 40 -50 -4 26 -65 13 132 -92 49 104 238 33 144 -74 26 -119 183 -253 -66 -69 -62 15 -109 -210 -146
6004a46M78o04r1K06J66K19k57r9J05n6K23Ol64K42o1Q1N6Qo9l8j99J24L86m49
$$ -146 332 -272 -363 -157 9 228 -29 -128 -23 -79 144 150 -214 28 -33 48 104 112 43 5 -194 -70 316 -133
6028a33kL12n55L24J59k7j35M1j28K79l12J84j9l3J31J80k73lJ47k01J38J9j97
$$ -133 -135 177 -378 -54 105 78 -57 -16 -144 135 -177 7 -12 -45 86 266 -7 -10 137 -64 74 93 -104
6051a04k67M67j8j24K2o0L1J02K6J06j73j6p4L6J90l08K65m9k27K98J8k20J56
$$ -104 -371 96 78 -46 -24 -84 -53 49 75 181 8 -8 -82 -46 144 -164 101 52 -175 123 141 -79 77
6074G7L11m65J71j93K60n1p1L5J55k46r0K41m32J79j72L49q2K79m22J90k04K53
$$ 77 388 -77 94 -99 161 110 39 74 229 -17 -107 134 -298 -119 -291 58 -24 255 -167 23 -181 72
6096G2j20J12o6n6J00j55J49R5k02o6k5J62K47O5q8k48Q5P1K22k49nl32M09j51
$$ 72 -48 64 -2 -58 42 -113 36 131 -71 -137 -162 0 247 312 224 -24 61 132 354 105 100 -232 177 26
6120B6L1j28J8R8q8L02l84K38p5k62J55K87k83J91j40J9o3J31J26n9j65J78J17
$$ 26 57 -71 -53 45 -43 259 -125 113 38 -224 -69 218 -65 126 -14 5 -58 73 199 140 -25 153 270
6143B70l62L26k21n1M6J56j49k16K35p3p2%p7K98q1k59K86J16J39m27J54M9q6
$$ 270 -92 234 13 -38 8 164 15 -201 34 -39 -111 -111 -188 110 29 -230 56 172 311 -116 38 87 1
6166Aq4L90k61l27O12n09N29m93K36K77l01J11m92N2M4L66j17m1j15k18L48k20
$$ 1 -83 307 46 -281 331 -178 351 -142 94 371 70 181 -311 -259 -215 151 34 -7 -122 -340 8 -212
6188b12L04j69k03M32k38L22l06q9L17j72j72L48j70o5M2K9K86l84K46k1L1o1
$$ -212 92 -77 -280 152 -86 236 -70 -159 158 -14 -186 162 -8 -73 -31 -2 284 -100 146 125 156 95
6210I5j5l67J14J88n0O1j20P0N6J5j48P3n7J23P1M1m1k30K74j82K5j15K01j60
$$ 95 80 -287 -173 15 -35 26 -94 -24 32 47 -101 -28 -85 38 109 150 109 -121 153 -29 -4 -119 82 -78
6234g8J18J25k40K95k02kK26l54J53KK5n5J00k5m62L40j00m2J74p9J12j8jj04
$$ -78 40 165 -75 220 18 16 242 -112 41 43 68 13 113 88 -374 -34 -134 -176 -2 -81 31 13 12 -92
6258i2N3L90l21o0J75J86k48j24P2R1J74l08j06L3Q3J09q5l99M82l3k65J66oO5
$$ -92 -39 351 30 -30 145 331 83 -41 31 122 296 -12 -118 -85 -2 107 22 -377 105 72 -193 -27 -33 32
6282C2lj08p0K80o6J29j09j11N7m4j95J66L5j48L40k16j01K05K32j94j35J1o5
$$ 32 29 -79 -149 131 65 194 85 -26 31 -13 -208 -42 -7 -155 185 -31 -132 73 305 111 -24 -13 -78
6305g8n8j8K23k65J32rk24K14J99k09p4J83k13m8M10k9l18K67j83M05k08j46J87
$$ -78 -136 -154 69 -196 -64 -73 -297 -83 116 -93 -167 16 -197 -245 165 136 -182 85 -98 307 99 -47 140
6328A40n6j19L3j7K97k11j93J39O9k20J91k34k3j8J56j7J18j81J37n6K41J1k10
$$ 140 84 -35 -2 -19 278 67 -126 13 82 -138 53 -181 -204 -222 -66 -83 35 -146 -9 -65 176 187 -23
6351b3J69k44J66J00q6n9K13o8M8m02M09k14K09j41r9j93J07J85k41K20j13l5
$$ -23 146 -98 68 168 82 23 236 168 216 -186 223 9 218 77 -22 -215 -108 77 -164 56 -57 -92
6373i2R2K6O3J89l00j55L07k40n2O5J15o8N9P8J74n3l24M09m11l8J29J12j93P3
$$ -92 0 26 89 278 -22 -177 130 -110 -162 -97 18 -50 9 87 261 208 -116 293 -118 -156 -27 85 -108 -35
6397c5q9R7M2j63P6r4O8Q1P6j34P7j43L5K21M8j22qJ91l97L58j07MNj39j42J04
$$ -35 -124 -27 15 -148 -72 -166 -98 -17 59 -75 2 -141 -106 115 163 41 33 224 -173 185 78 82 87 -52 -194 -90
6423i0P8P7j20J12l17L49j90J39N2mk96K55j0k17J42kj4r4J16L68n32K68p7K45
$$ -90 -12 65 -55 57 -260 89 -101 38 90 86 -210 45 35 -182 -40 -42 -56 -150 -34 334 -198 70 -7 238
6447B38k03m6K23k3k5n7j7o9k49K19J45k49K18j82J91m29L92j69m1J68p0J1J55
$$ 238 35 -11 212 189 164 107 90 21 -228 -9 136 -113 105 -77 114 -315 77 -92 -133 35 -35 -24 131
6470A31j02k46K73J44k24J46L38l69k22K4M63l27j11J69j7Rm3J31l45K32j08j17
$$ 131 29 -217 56 200 -24 122 460 91 -131 -107 356 29 -82 87 70 79 36 167 -178 54 -54 -171
6492a71N1N1J70k20K22l58M16j77j02J60j47P2j3p5K71l02K67K21k38P8Q4j5N
$$ -171 -120 -69 101 -119 103 -255 161 -16 -118 42 -105 -33 -46 -121 150 -152 115 336 98 176 260 245 250
6515B50jk31K38j41j86J2q3J83O7j31l9j4J29j76K38L2r2k19J08R6j62j2K07J44
$$ 250 249 18 256 115 -71 -59 -142 41 108 -23 -62 -76 53 -123 115 147 55 -164 -56 40 -122 -134 73 217
6539B17j73K5J73q5k42K2K66r2n6k66O1L63m15J33J21J7j14OM5N4K9j44l3J02
$$ 217 44 69 242 157 -85 -63 203 111 55 -211 -150 213 -202 -69 52 69 -45 -39 6 60 89 -55 -88 14
6563A4j09P7K4K58l99L67j82j01K1p5J69j10m7J76j70J71L0l04J39j19R7J89k94
$$ 14 -95 -18 6 264 -135 232 50 -51 -30 -105 64 -46 -93 83 -87 84 114 -190 -51 -170 -73 116 -178
6586a78J21pr1L50k42J19j46q4L54j86Q7j06k2P4j62O5K59r6P2J12m03M48l96
$$ -178 -57 -64 -155 195 -47 72 -74 -158 196 10 97 -9 -31 43 -119 -54 205 109 181 293 -110 338 -58
6609e8RJ50k22J65k81K16k28M12l24J25j19J47j02R3j28J56l1lL19m41L09p7R
$$ -58 -49 101 -121 44 -237 -21 -249 163 -161 -36 -155 -8 -110 -17 -145 11 -20 -23 296 -145 164 87 96
6632I6k10K89k94J49J11k07M03l39n8q6J14j3J90l02j3j85M15l21J90n1P9J9p6
$$ 96 -114 175 -119 30 141 -66 337 -2 -60 -146 -32 -45 145 -157 -170 -355 60 -261 -71 -122 -43 -24 -100
6655a00K21j65j76M27j56m2rl4K98p8j2j88n4J32K55j20l13P1kP7q3j36K33o2
$$ -100 121 -44 -220 207 51 9 0 -34 264 186 174 -14 -68 64 319 199 -114 -43 -45 32 -51 -187 46 -16
6679a6J8j66J68l02K14l5Q5P1m9L53m52N0J11J04j85j95K14J52k0l07L3N3K04
$$ -16 2 -164 4 -298 -84 -119 -34 37 -12 341 -111 -61 50 154 -31 -226 -12 140 120 -187 -154 -101 103
6702A03O3J2o1m91K93P4m5q7OJ87m75N03P3m3j89L0K30k75J14j29L43l91L33j23
$$ 103 166 178 117 -374 -81 -7 -52 -139 -133 54 -421 82 155 112 -77 -47 183 -92 22 -107 236 -155 178 55
6726E5k43K64P3k35N5PJ94j29o8N5j08k16M18o3J86m01n2L29m16J68l0L71Lj40
$$ 55 -188 76 149 -86 -31 -24 170 41 -27 28 -80 -296 122 59 245 -156 -208 121 -295 -127 -157 214 217 77
6750G7Q4j08l7R0k42L37j84n5J52k8j56J66J09J67j91l51K88k74J31R6k25M4N2
$$ 77 161 53 16 106 -136 201 17 -38 114 86 -70 96 205 372 181 -170 118 -156 -25 71 -154 -110 -58
6773e8j35Q9K08j59J05k30M02r3k0n0o6L7j17J14JJ20m3J12k5j64L34m81O4J5
$$ -58 -193 -104 104 -55 50 -180 222 129 109 59 -7 30 -87 27 28 148 105 217 192 28 362 -119 -55 -40
6797d0r5J11k05L10k56L03k69k7R9L7M7j35J65j55L7j12L60j37J16J5j91PJ69
$$ -40 -135 -24 -229 81 -175 128 -141 -168 -69 -32 15 -120 45 -110 -73 -185 175 38 154 169 -22 -15 154
6820A54k21k4L22k98K46k4k16J60J72l74N7p7r1K28J42j74p7R1o5J9l5M0J23N2
$$ 154 -67 -91 231 -67 179 155 -61 99 271 -103 -46 -123 -214 14 156 -18 -95 -4 -69 -50 -85 -45 78 130
6844A30J6p4n8J10j26J70k07J38K9r0j10k8N4J01K68k90J78k71N3N6pr9K4r6K29
$$ 130 146 72 14 124 -2 168 -39 99 128 38 -72 -100 -46 55 323 33 211 -60 -7 49 42 -57 -33 -129 100
6869A00j96J79J68Qk24j4Q7m7J06k39L24J6j95p5j8R4M7m1J55j6k30k42J13J73
$$ 100 -96 83 251 259 35 21 108 61 167 -72 252 268 73 -2 -20 74 121 80 235 219 -11 -253 -140 33
6893C3rj1N9o4R0K4Q1l29P2J82o2j84Q2J35Q5O4l53m4J66j69M73k77k99L83j14
$$ 33 24 13 72 8 98 122 203 -126 -54 128 66 -118 -36 99 184 248 -105 -149 17 -152 321 44 -255 128 14
6918A4O0J3k33K33L0l58K22k5r7j65J90j0O9k2k34L13K63k66l4J52Q7q3k47J31
$$ 14 74 87 -146 87 117 -241 -19 -44 -141 -306 -116 -126 -57 -79 -313 0 263 -3 -37 115 202 119 -128 3
6942CkJ40j98J15j75K19j55J47O7Lk36p0L30k05J87r1j32J61j89M0l9l9J08J61
$$ 3 1 141 -57 58 -117 102 -53 94 161 164 -72 -142 188 -17 170 79 -53 108 -81 -41 -80 -119 -11 150
6966A50M4k67o8J94k5l8Pj06K03k12J56k3k38K41k01J15K28k47PL3L1N9r5j01
$$ 150 194 -73 -141 53 28 -10 -3 -109 94 -118 38 15 -223 18 -183 -68 160 -87 -80 -47 -16 43 -52 -153
6990a53J67j85R2J49J00l77L28J17l14R2l29K32J59jn7j81L00l04K73p5j9J54
$$ -153 14 -171 -79 70 170 -207 121 238 -76 16 -313 -81 78 77 20 -161 139 -165 108 33 14 168
7012A68j94j49J30M9j26jp6J80J13j63k07J07k2P2r1J67L02l47K42j83J51o8k3
$$ 168 -26 -175 -45 4 -122 -123 -199 -19 94 -69 -276 -169 -191 -119 -210 -43 259 -88 154 -29 122 54 31
7035C1O4m9n9P2m8n7J34m8K26l54J69O8j71L22l46L2K4k52L03j29N8J99P4l05
$$ 31 95 46 -13 59 11 -46 88 40 266 -88 81 149 -22 300 -46 -14 10 -242 61 -68 -10 189 263 -42
7059d2j5K38r2L0k20K78k25J43o3k9J27n5K10k39j13n8N2M1p2J15j69R1J76j33
$$ -42 -57 181 89 119 -101 177 -48 95 32 3 130 75 285 46 -67 -125 -73 -32 -104 11 -158 -67 109 -24
7083b4J55m4k36JJ77j35j43K49M3j4J92KK7j92K0j5m8N1P9m5j94m0l7K10p6J58
$$ -24 131 87 -149 -148 29 -106 -249 0 43 29 221 223 250 58 78 63 15 66 145 100 -94 -134 -171 39 -37 121
7109A21l32K29j13L84m82L7J52N5p1J11j32o1m3K46R5l65M05l20L98k28r8L02
$$ 121 -211 18 -95 289 -193 -156 -4 51 -20 91 -41 -102 -145 101 196 -169 236 -84 314 86 -12 290
7131B90K7n3k83K6M0j47J21p4o7R0rJ2p2K25k86K45j67q1R4m3J24J72k55jJ12
$$ 290 317 264 -19 7 47 -100 21 -53 -120 -30 -39 -27 -99 126 -160 85 -82 -163 -69 -112 12 184 -71 -72 40
7156D0j62L48j99j20n3K62j12j71j0L19l0m21K66j38K90o5j67N8J09m01L75J99
$$ 40 -122 226 27 -93 -146 116 4 -167 -177 142 112 -309 -43 -181 109 44 -123 -65 44 -357 18 217
7178B17l65J75r%k45K77J62k27l3L22j82j36L9J20K07j35j23k29L9J83Or9j00
$$ 217 -148 27 18 18 -227 50 212 -15 -48 274 92 -44 -5 115 322 187 64 -165 -126 57 63 -36 -136
7201a36N5R3j4j10pJ01j54P7o0R4J63k10J47J7j18K93j57j02K80j81J15P0k30
$$ -136 -81 12 -2 -112 -119 -18 -172 -95 -155 -61 102 -108 39 56 -62 231 74 -28 252 71 186 256 26
7224B6J62j76q1j97J98J27k80N67l95n1J15l3j46J71j09KJ60j38Q0o0L03l92L44
$$ 26 188 12 -69 -266 -68 59 -221 346 -49 -100 15 -18 -164 7 -102 -100 60 -78 2 -58 245 -147 197
7247A97k75O9N2L9r6J60J35j79J22l40L43j26L4j36j38J28Mk9oJ16o6M0k78R0
$$ 197 -78 -9 43 82 -14 146 281 102 224 -116 227 101 135 -1 -139 -11 -7 -36 -42 74 8 48 -230 -140
7271a40N4qR4j07J46j31q4L08Nl05L11l42K40J24j66p3P2m7J1r0J10J19m23N34
$$ -140 -86 -94 0 -107 39 -92 -176 132 137 -168 143 -199 41 165 -1 -74 -2 -49 -38 -128 -18 101 -322 212
7295B12k23R1j44K61l52J97K78m79K25p7N6j00J29N2k4m0N5j14J35MJ36m39J28
$$ 212 -11 80 -64 197 -155 42 320 -159 66 -11 45 -55 74 126 102 62 117 3 138 142 278 -161 -33
7318c3j42P2K90j62L02l81j24R8j2j5J64j26K5j76J3J14q4L06J18j97J14K3j53
$$ -33 -175 -103 187 25 327 -54 -178 -80 -92 -107 57 -69 -44 -220 -207 -93 -177 129 247 50 164 187 34
7341C4Q4j55q1O8N7Q4j50r0K67l4rk73P7J20R5Qo0j89N5O2p3N2J23o5lj46J25
$$ 34 118 -37 -118 -50 7 91 -59 -149 118 84 75 -198 -121 -1 94 102 42 -147 -92 -30 -103 -51 72 7 4 -142 -17
7368a7o4L59k41oj29K70j82K69l05J53J57j84J64k09l1N9l8j62K22l3q9J86k58
$$ -17 -81 278 37 31 -98 172 -10 259 -46 107 264 80 244 35 4 63 25 -137 85 52 -37 149 -109
7391a09J34j16l9l5K58j96jK65j52J26m9k45J95O5Nj95j39J48j45K70j66K51k3
$$ -109 25 -91 -130 -165 93 -103 -104 161 9 135 86 -159 36 101 106 -89 -228 -80 -225 45 -121 130 107
7414A07P0j83j58J46K48j22k96J85k85L60j15m8P0j12K39k1m5j25K15j12J68j15
$$ 107 177 -6 -164 -18 230 108 -188 -3 -288 72 -43 -91 -21 -133 106 85 40 -85 130 18 186 71
7436G1n3M6N0n3k12M73k01j42J94k01P7k37J77P5j87O6O7j14J14n7j3K14j85J61
$$ 71 18 64 114 61 -151 322 121 -21 173 -28 49 -188 -11 64 -123 -57 10 -104 10 -47 -60 154 -31 130
7460A30k1P6l55J92j54L0J87K39j92Nk02K06o6K1k26K72Q7j63k32J68p3j11K86
$$ 130 109 185 -170 22 -132 -102 85 324 132 137 -65 141 75 96 -130 142 229 66 -166 2 -71 -182 104
7483A04R9k78Pk40K41N0K19k40L9L8P4l72J32j6L32j33k1J29M9r5k72L46j83M1
$$ 104 203 -75 -68 -308 -67 -17 202 -38 1 39 113 -259 -127 -143 189 56 35 164 213 118 -154 192 9 50
7507E0j58P7K81k67m1r5J21lj36K53j32K52k57p5J92O8O2p1J44j16l0q9q8K00
$$ 50 -108 -31 250 -17 -58 -153 -32 -35 -171 82 -50 202 -55 -130 62 130 192 121 265 149 119 30 -58 142
7531A42p9k1R7j02J3K2j39l1O6J01q1L12k29k85L81k62J4J6J16j71J20J61o4j18
$$ 142 63 42 139 37 50 72 -67 -98 -32 69 -12 300 71 -214 167 -95 -81 -65 51 -120 0 161 97 -21
7555b1N3OO5R7k41O7m7J12M2J47l51Q8rO5p0j13j98J79J90j02J26k03R2n5oK84
$$ -21 32 38 103 200 -41 26 -21 91 133 280 -71 17 8 73 3 -110 -308 -129 61 -41 85 -118 -26 -81 -87 197
7581A97j29j94K87k07m4P3J75j5j62J47j35K54j96l4J61j04j12JjQjk94K61K05
$$ 197 68 -126 161 -46 -90 -17 158 143 -19 128 -7 247 51 17 178 74 -38 -37 -38 -30 -31 -325 -64 141
7605A41k0l40O4J68j30j17L35k72J65K84q5l80L91q%j16K5J5J79k29k12J79P7
$$ 141 121 -219 -155 13 -117 -234 101 -171 -6 278 193 -187 204 196 196 80 105 120 299 70 -142 37 114
7628A14kj76J19J21K9k71L7l92M97k86L01r4n0m4K50j14q0M9j03M5K9J37M6r7
$$ 114 112 -64 55 176 205 -66 -29 -421 76 -210 91 -3 -53 -97 153 39 -41 8 -95 -50 -21 116 162 65
7652F5j06K87j99J80m02K37Q4%k3k95J87K0j89R3J66Qk84J39N5m1J54p0J33k23
$$ 65 -41 246 47 227 -175 62 146 146 123 -172 15 35 -154 -61 105 113 -171 -32 23 -18 136 66 199 -24
7676b4L0J92l20J18o1J18o6N6q6p9J89q8K01k86J13j01K25Kk63K13j74P6M4J30
$$ -24 6 198 -122 -4 -65 53 -13 43 -43 -122 67 -21 180 -106 7 -94 131 133 -130 83 -91 -15 29 159
7700A59k65J26k7M4o2m0L6M4M1J68n9k51K49k42N2K19j40J36j48o2m3L00l30R2
$$ 159 -106 20 -7 37 -25 -65 -29 15 56 224 165 -86 163 -79 -27 192 52 188 40 -22 -65 235 -95 -3
7724cO2k36J56K02N5l45OK11l82J07J67j44K10k41R3RQ3N8j0j73J88j42L17j32
$$ -3 59 -177 -21 181 236 -109 -103 108 -274 -167 0 -144 66 -175 -82 -73 10 68 58 -115 73 -69 248 116
7748A16j13l2j28J96r2Q5j0J22o9l27L22M3j85J19l00J81k75L85k05J09J32p8
$$ 116 3 -29 -157 39 -53 32 22 144 75 -252 70 113 -72 47 -253 -72 -347 38 -167 -58 74 -4
7770dKR7k15K27j30NO4j46K08k07M4r8L48k83J54k8l4J73k55j24M09j63l3r4J55
$$ -4 -2 95 -120 107 -23 -18 46 -100 108 -99 -55 -153 195 -88 66 38 4 177 -78 -202 207 44 11 -83 72
7795G2r2n7J95pj91k8r3M7J67m7J1J6J93m01J42J4Q5k14J96J47r6J29k2j5J6M1
$$ 72 -20 -77 118 111 -80 -108 -201 -154 13 -34 -23 -7 186 -215 -73 -59 26 -188 8 155 59 188 166 151 167 208
7821B08k64O1j27K0J38J92k64J11j8k22J40l1J00k93L77j52r4J76l8N1mk97J70
$$ 208 -56 5 -122 -102 36 228 -36 75 57 -165 -25 -56 44 -249 128 -24 -118 58 20 71 67 -230 -60
7844f0J11M3k26l9J59l7p3K14j8m2k29L57j96K2R7K3J23l12L2K69j82K76j90K70
$$ -60 51 94 -132 -171 -12 -49 -122 92 74 32 -197 160 -36 -14 83 106 229 -83 -51 218 36 312 122 392
7868C92m16j28L07jj74j98K80J7mj36k8J39k5N5j17N9J64j80m4K38k55J80k03
$$ 392 -24 -152 155 154 -20 -218 62 79 75 -61 -89 50 25 80 -37 22 186 6 -38 200 -55 125 -78
7891g8J20k00k9K39r8J18q8J23M9j58R1J2j83M8j11K12n3j44O4KO9K13l2k62M5
$$ -78 42 -158 -187 52 -46 72 -16 107 156 -2 89 101 -82 -34 -145 67 14 -130 -66 -64 5 218 186 -76 -31
7916c1J28R2m40L75k9o1L5k67L91l9m43J96k5K92j47J18M3j89M7k7J48K81l85
$$ -31 97 189 -251 124 95 34 69 -198 193 154 -289 -93 -118 174 27 145 188 -1 46 19 167 448 63
7939F3l8j48K58l66J84P0k62K06J51p8q5k9J52K17l52Q2k0j4n7J50M0j67O0k65
$$ 63 25 -123 135 -231 -47 23 -239 -33 118 40 -45 -74 78 295 -57 25 5 -9 -66 84 124 -43 17 -248
7963b48L32O3n7j84P5j69K82j07O4J33n0q8m6m2J18Q6l76J87K45j65J32j79l6
$$ -248 84 147 90 -94 -19 -188 94 -13 51 184 134 46 0 -42 76 162 -214 -27 218 53 185 6 -30
7986c0O4n9J0J14J64l69J76j61K07j98P9m5J22l70J87Q3p8J42l33M17j95K20k59
$$ -30 34 -25 -15 99 263 -106 70 -91 116 -82 -3 -48 74 -296 -109 -26 -104 38 -295 122 -73 147 -112
8009a12rK93o6l10J33j93M24l25P2j04M3K46o8o2q7J62j1J4j69j09J25L5L82r8
$$ -112 -121 172 106 -204 -71 -264 160 -165 -93 -197 -154 92 24 -38 -125 37 26 40 -129 -238 -113 -78 304 206
8033B06j55j15n3N8K17K5l29J26k26L63j51Q9k3N3j53l6M3O3j13K98j98J7m2O2
$$ 206 51 -64 -117 -59 158 183 -146 -20 -246 117 -34 55 32 85 -68 -104 -61 2 -111 187 -11 6 -36 26
8057B6m0K98l28Q4oj00Kp6K23k23nK07K38k86p4N0k2M0j44N8J74p9m4K54k09k5
$$ 26 -14 284 -44 40 34 -66 -64 -140 83 -140 -145 62 300 14 -60 -10 -32 8 -136 -78 96 17 -27 227 18 -7
8083gK26n1l1o3K1K22m15J44K7nr6p8K50k00M2J59j37J73j38k74Q3K73q6K22l9
$$ -7 219 168 137 74 95 317 -98 46 73 68 -28 -106 144 -56 -14 145 8 181 43 -231 -148 125 39 261 222
8108B22k59J25k14M80l55r5l1J59p1j31J44J18j50q0N3j32J18Q8K25m12J90j12
$$ 222 -37 88 -126 354 -1 -96 -127 32 -39 -170 -26 92 -58 -138 -85 -217 -99 -11 214 -198 -8 -120
8130a20O7O7j18N0j4M1l55K08K68j14K45l34L35k51K63o0j0j06o1k1Q4j7j32J53
$$ -120 -53 14 -104 -54 -68 -27 -382 -174 94 -20 225 -109 226 -25 238 178 168 62 1 -20 64 47 -85 68
8154F8n0ol4r3J12L5P2j20J25On0j95J36K3Q4j34J18k28m7O6J87M8j31k6L29j92
$$ 68 18 12 -22 -115 -3 32 104 -16 109 115 65 -130 6 29 113 -21 97 -131 -178 -112 75 123 -8 -34 295 103
8180A03p6J26j96K14m37L96n0k60jK01j90
$$ 103 27 153 -43 171 -266 130 80 -180 -181 20 -170
8191a70
$$ Imaginary data points
##PAGE= N=2
##DATA TABLE= (X++(I..I)), XYDATA
0@%%%%%%%%%%%%%%%%JrJ6j6J6j6J9k7L2l2M0m8N5o3P1q0Q9j03J18j34J50j66J83
$$ 0 0 0 0 0 0 0 0 0 0 0 0 0 0 0 0 0 1 -8 8 -8 8 -8 11 -16 16 -16 24 -24 31 -32 39 -41 48 -55 63 -71 79 -87 96
39I6k04K28k54K81l09L43l80M19m61N07n59O16o80P48q24R13j014J128j258J409
$$ 96 -108 120 -134 147 -162 181 -199 220 -241 266 -293 323 -357 391 -433 480 -534 594 -664 745
59G45j587J804k073K413k860L477m385N853q590J5302n9997p0771J81180J4600
$$ 745 -842 962 -1111 1302 -1558 1919 -2466 3387 -5203 10099 -49898 -120669 60511 75111
73G5111j20487K0557P2145j9432j0995q173m554M0991n0o2617J6051M9125l6761
$$ 75111 -45376 -24819 47326 27894 16899 8726 4172 45163 45113 -17504 -1453 47672 10911
86A0911l8052L5797J2056m0886j5508L2480J0790l6510j7292L5055J1164k8534
$$ 10911 -27141 8656 20712 -20174 -35682 -3202 7588 -28922 -46214 -11159 5 -28529
98b8529R3J9997K04L665J293q891J5715K0395j4673o296J3196m95O949P061k6594
$$ -28529 -28436 -8439 -8235 -4570 -3277 -12168 3547 23942 9269 2973 16169 15674 22623 29684 3090
113C090k298L4560j5176l9017K2121K2166l3483j4647K1299l544j5498N121K626
$$ 3090 792 35352 20176 -18841 3280 25446 -8037 -22684 -1385 -4929 -20427 -15306 -12680
126a2680m272J125l784J892J8053j026k1787J2209L2595j1693k7182K4206K9806
$$ -12680 -16952 -15827 -19611 -17719 334 -692 -22479 -10270 22325 10632 -16550 7656 37462
139C7462k3820k0120K5975J2337k0355m596P641n779l054J554q196k746J007r278
$$ 37462 13642 -6478 19497 31834 11479 6883 14524 8745 5691 7245 -951 -3697 -2690 -11968
153a1968j556R403r516j1275J5052N793j7878J679K1434j125j3131O662J3075
$$ -11968 -13524 -4121 -13637 -24912 -9860 -4067 -21945 -20266 1168 43 -13088 -6426 6649
166F649Q93k343L081M879M54j450K640J778m281j959J500k145n931l798R63M09
$$ 6649 7542 5199 8280 13159 13613 12163 14803 16581 12300 10341 11841 9696 3765 -33 930 1339
182A339p431q306M930M861r773m469Q415P91n209L499M379K43L800K115Q2N082
$$ 1339 -6092 -14398 -9468 -4607 -14380 -18849 -10434 -9643 -14852 -11353 -6974 -6731 -2931 -816 -734 4348
198D348L476p09M564K197n389K554O562n838n564M728q64q804j096K396m334m943
$$ 4348 7824 7115 11679 13876 8487 11041 17603 11765 6201 10929 10065 1261 165 2561 -1773 -6716
214f716j059j346k371k85J138o82j707J036L735K349N02P53L815M997n04j728
$$ -6716 -7775 -9121 -11492 -11777 -10639 -11321 -13028 -11992 -8257 -5908 -5406 -4653 -838 4159 3655 1927
230A927O273O616m292m275N460L464m540k553K76k389k672j375j805k879l037
$$ 1927 8200 14816 10524 6249 11709 15173 10633 8080 8356 5967 3295 1920 115 -2764 -5801
245e801j298j06k366l228J519L736k116l605L738O923m2l017L785N880M22J40
$$ -5801 -7099 -7205 -9571 -12799 -11280 -7544 -9660 -13265 -9527 -2604 -2646 -5663 -1878 4002 4424 4564
261D564L181J894n52J656J327j921k291M00J541k595o623k093M011j363r104k500
$$ 4564 7745 9639 9087 10743 12070 10149 7858 8258 9799 7204 581 -1512 2499 1136 -7968 -10468
277a0468M985k4o679j244M558J406j945O94K859J382K265L209J440j73J508M474
$$ -10468 -5483 -5507 -12186 -13430 -8872 -7466 -9411 -8717 -5858 -4476 -2211 998 2438 2265 3773 8247
293H247K856k334k541L525L872m134n468J821K570m606m866p63l7k171j945j721
$$ 8247 11103 8769 6228 9753 13625 9491 4023 5844 8414 3808 -1058 -1821 -1858 -4029 -5974 -7695
309g695k375J10J741N67k245r26M120M273q28j658L501O033P13k833J947N313
$$ -7695 -10070 -9960 -8219 -7652 -9897 -10823 -6703 -2430 -3258 -4916 -1415 4618 5331 2498 4445 9758
325I758O97k741J72J144n23q36j033k803k843q3K97k794n131r17K913o98m897
$$ 9758 10455 7714 7886 9030 8507 7671 6638 3835 992 909 1206 -1588 -6719 -7636 -4723 -5421 -10318
342a0318j442M015K307k495q02L749L513N0L98K167K213J711K104j1q78J328K550
$$ -10318 -11760 -7745 -5438 -7933 -8735 -4986 -1473 -1423 -1025 1142 3355 5066 7170 7159 6281 7609 10159
359A0159o65l529j453J617L94l750m528M66J148l479l200q8K42j081n24M52l67
$$ 10159 9494 5965 4512 6129 6523 2773 -1755 -1289 -141 -3620 -6820 -6908 -6666 -7747 -8271 -7819 -8186
376h186P52K029J834P5R1M006L196m96j179K837L754pk623j85K690j48l124j873
$$ -8186 -7434 -5405 -3571 -3496 -3405 601 3797 3301 2122 4959 8713 8706 6083 5898 8588 8440 5316 3443
394C443M79r49k322j729j536j557m55o71j571j672Q04J522J54j250N79L360J778
$$ 3443 3922 2973 651 -1078 -2614 -4171 -4626 -5297 -6868 -8540 -7736 -6214 -6060 -7310 -6731 -3371 -1593
411a593n05Q39L120J659M40R18J369Q12J09K17k97j514m33J85j611k444j372j42
$$ -1593 -2098 -1259 1861 3520 3960 4878 6247 7059 7168 7385 7088 5574 5141 5326 3715 1271 -101 -243
429b43j118k336j956k53O25n56k594P66K301K07n75J122K355J729M83J156J395
$$ -243 -1361 -3697 -5653 -5906 -5281 -5837 -8431 -7665 -5364 -5157 -5732 -4610 -2255 -526 -43 1113 2508
446B508J480J425Q56n34O97N51j85j665n89k12j254j129j525j560j391n12p75
$$ 2508 3988 5413 6269 5735 6432 6983 6798 5133 4544 4332 3078 1949 424 -1136 -2527 -3039 -3814
463c814j324j743O81R26l83j481J380K238J185o45N38L142K335m33n73K235K602
$$ -3814 -5138 -6881 -6200 -5274 -5657 -7138 -5758 -3520 -2335 -2980 -2442 700 3035 2602 2029 4264 6866
480F866p32j188P64J280j362j597m01n8k353j459R4j226k171r10K45q38j054n13
$$ 6866 6134 4946 5710 6990 5628 4031 3630 3572 1219 -240 -146 -1372 -3543 -4453 -4208 -5046 -6100 -6613
498f613P89K089o54j457J996L639M17j521J447L123J534j067j94J932R65l16j313
$$ -6613 -5824 -3735 -4389 -5846 -3850 -211 206 -1315 132 3255 4789 3722 3528 5460 6425 6109 4796
515D796q52P23j29k342k166L59L59k731k011K16J65j842q1J059m43j208J495K086
$$ 4796 3944 4667 4538 2196 30 389 748 -1983 -3994 -3778 -3613 -5455 -5536 -4477 -4920 -6128 -4633 -2547
533b547K26p40J626K581J153o3m3J665K134l37k135L45K980q70m061r7J979j200
$$ -2547 -2321 -3061 -1435 1146 2299 2236 2193 3858 5992 5655 3520 3865 6845 5975 1914 1817 3796 2596
551B596l575m86L1j130j030l33p29p37Q64O24j015N25J928K44K82J649O56N61
$$ 2596 -979 -1465 -1434 -2564 -3594 -3927 -4656 -5393 -4529 -3905 -4920 -4395 -2467 -2223 -1941 -292 364 925
569I25J321J344j54K10J028P93q59o59k36l5p75q30j739j030L11k09k385j644
$$ 925 2246 3590 3436 3646 4674 5467 4608 3949 3713 3678 2903 2073 334 -696 -385 -594 -2979 -4623
587d623R21P12j655j256J594J416k49m59R35J644J084N07N36J016J107P91k52
$$ -4623 -3702 -2990 -4645 -5901 -4307 -2891 -3140 -3599 -2664 -1020 64 571 1107 2123 3230 4021 3769
604C769J70N37l39j60k8n73j456o40K53j344j769k46J8j125j223l64M41N11l25
$$ 3769 3939 4476 4137 3977 3949 3376 1920 1280 1533 189 -1580 -1826 -1808 -2933 -4156 -4520 -4079 -3568 -3893
623c893l83O01J659P05l33P64J431J369N6N62Q12L37K66J47P3n01N8o92o08j385
$$ -3893 -4276 -3675 -2016 -1311 -1644 -880 551 1920 1976 2538 3350 3687 3953 4100 4173 3672 3730 3038 2430 1045
643A045l73l00j376r35q65m6k24q05j82L15K10L75j05Q36P70Q08O49L67J036J029
$$ 1045 672 372 -1004 -1939 -2804 -2850 -3074 -3879 -4061 -3746 -3536 -3161 -3266 -2430 -1660 -852 -203 164 1200 2229
663B229M86L25M99J12L18j01n33m12j17m72j104o53m43j217n23l11r74n22l9M0
$$ 2229 2715 3040 3539 3651 3969 3868 3335 2923 2806 2334 1230 577 134 -1083 -1606 -1917 -2891 -3413 -3452 -3412
683c412r5q0M65N17O21L39O38J141N55K41L85J183P25J55k96J46M79n25o80m4
$$ -3412 -3507 -3587 -3122 -2605 -1984 -1645 -1007 134 689 930 1315 2498 3223 3378 3082 3228 3707 3182 2502 2458
703B458o89p05m59q50q07k80p79p39l83l50j51O36J91l18M59J404Q24l05M12J028
$$ 2458 1769 1064 605 -245 -1052 -1332 -2111 -2850 -3233 -3583 -3734 -3098 -2907 -3225 -2766 -1362 -538 -843 -431 597
723E97R98L43R6L35P23K02M4l16m10K29o46p70n41q27n20k69p08r30m24M49o39
$$ 597 1595 1938 2034 2369 3092 3294 3338 3022 2612 2841 2195 1425 884 57 -463 -732 -1440 -2370 -2794 -2345 -2984
744b984n85M09P64K92j15K24J072Q28J69L37O12P05R91Q9JJ69j68L45m89n80n69
$$ -2984 -3569 -3160 -2396 -2104 -2219 -1995 -923 -95 74 411 1023 1728 2719 2808 2809 2978 2810 3155 2666 2086 1517
765A517j9k93j164j008j75k7o70p41k05K8K68j34k29L46O33M00N97K50N07J063
$$ 1517 1498 1205 41 -967 -1142 -1169 -1839 -2580 -2785 -2757 -2489 -2623 -2852 -2506 -1873 -1473 -876 -626 -119 944
785I44P12K03O3N11P00j11n28k88K09l3m66j046o68K00n09j202k88k58l32l40
$$ 944 1656 1859 1922 2433 3133 3022 2494 2206 2415 2382 1916 870 202 402 -107 -1309 -1597 -1855 -2187 -2527
805b527l19J0K25M63L80o4M38P02P89P9L91M59J148mJ29J76K7L45j83q98k95k17
$$ -2527 -2846 -2836 -2611 -2148 -1768 -1832 -1394 -692 97 176 567 1026 2174 2170 2299 2475 2502 2847 2664 1766 1471 1254
827A254J1q79o30l69k37l78p56l07k19J70J0j95J20P62L96J85K87N36O10P93N5
$$ 1254 1265 386 -244 -613 -850 -1228 -1984 -2291 -2510 -2340 -2330 -2525 -2405 -1643 -1247 -1062 -775 -239 371 1164 1219
848A219J72M57O86n6J89m46k09P9l50o13l00m47k75o35p58j2l92j90m59j62J76
$$ 1219 1391 1848 2534 2478 2667 2221 2012 2091 1741 1128 828 381 106 -529 -1287 -1299 -1691 -1881 -2340 -2502 -2326
869b326L06K25J27R3P06K74N04J74P59N21M79p1K95J96Q7j30l45J90n44m80j15
$$ -2326 -2020 -1795 -1668 -1575 -869 -595 -91 83 842 1363 1842 1771 2066 2262 2349 2219 1874 2064 1520 1040 925
890I25n63o44m85m11k54m99Qj36r4K3m0L57M72J59K33M86M70O43J83O64J40K24
$$ 925 362 -282 -767 -1178 -1432 -1931 -1923 -2059 -2153 -2130 -2170 -1813 -1341 -1182 -949 -463 7 650 833 1497 1637 1861
912A861m1K7K55M8o6l28p04j07m95m78l26k27n12j15n67l73J74K06j28j23M46
$$ 1861 1820 1847 2102 2150 2084 1756 1052 945 450 -28 -354 -581 -1093 -1208 -1775 -2148 -1974 -1768 -1896 -2019 -1573
933a573NN99K51M72M63M09L65L33j03M00L51J15k37Mk28l84R8m38m86k46m45k52
$$ -1573 -1568 -969 -718 -246 217 626 991 1324 1221 1621 1972 2087 1850 1854 1626 1242 1340 902 416 170 -275 -527
955e27o94o5k37k41k29n7L62P5Q1J08N13J85N88K40K33N60L97L28j04J0K21L17
$$ -527 -1221 -1286 -1523 -1764 -1993 -2050 -1688 -1613 -1532 -1424 -911 -726 -138 102 335 895 1292 1620 1516 1526 1747 2064
977B064k92k34l41N6m48m99m23l42l9l07m41l72j65J19k5O4M7J47M15L31L39o3
$$ 2064 1772 1538 1197 1253 805 306 -117 -459 -498 -805 -1246 -1618 -1783 -1664 -1689 -1625 -1578 -1431 -1016 -685 -346 -409
999d09Q20K43J93J82L41K53nO8j34R4j79q3n53j96k86l01l09m47j84m31M4j48
$$ -409 411 654 847 1029 1370 1623 1618 1686 1552 1646 1467 1384 831 635 349 48 -261 -708 -892 -1323 -1279 -1427
1021a427j08m05M87J05j4K12M97L58J46L80M10J49K92M95j69j98O27l03r1l56
$$ -1427 -1535 -1940 -1453 -1348 -1362 -1150 -653 -295 -149 231 641 790 1082 1577 1408 1210 1837 1534 1443 1087
1041A087j49K8l28o28j44l21l42Q7m11m24R9M9R9l83J71L19K97L12M33M8L82Q08
$$ 1087 938 966 638 10 -134 -455 -797 -710 -1121 -1545 -1446 -1397 -1298 -1681 -1510 -1191 -894 -582 -149 -101 281 1089
1063A089m07O4P28K19j22k78M72j72o07Jk52l93k59j58m14l41j62J19o67L7j23
$$ 1089 682 746 1474 1693 1571 1293 1765 1593 986 987 735 342 83 -75 -489 -830 -992 -873 -1540 -1503 -1626
1084a626K08P8k90N63J23N86K80K03J38J60M60K71J54J01J20jj10L7k72l24l37
$$ -1626 -1418 -1340 -1630 -1067 -944 -358 -78 125 263 423 883 1154 1308 1409 1529 1528 1418 1455 1183 859 522
1105E22j96l42l35k66k13k8l93L8j20k28k13N68K37j20K32K65N81K40K2L71N84
$$ 522 326 -16 -351 -617 -830 -858 -1251 -1213 -1333 -1561 -1774 -1206 -969 -1089 -857 -592 -11 229 251 622 1206
1126A206j96K53r7L21j18l57K78m14M6o14q3k95j79l61j23k69m02Q2p4R4K73j69
$$ 1206 1010 1263 1166 1487 1369 1012 1290 876 922 308 225 -70 -249 -610 -733 -1002 -1404 -1322 -1396 -1302 -1029 -1198
1148a198L3J83K87J72O03RL88J42L42K78k73L56o6Q0j34Jj37l23k53k72l54j05
$$ -1198 -1165 -982 -695 -523 80 89 477 619 961 1239 966 1322 1256 1336 1202 1203 1066 743 490 218 -136 -241
1170b41l49k19k36Lk76k16L39Pr8j30M84J89L33M45J60L90J00K90J21j7K48J03
$$ -241 -590 -809 -1045 -1042 -1318 -1534 -1195 -1188 -1286 -1416 -932 -743 -410 35 195 585 685 975 1096 1079 1327 1430
1192A430j07k84j28j61j7j66l73m48k39m3j69l27o5m3P0k63O3J37L24jL66ML02
$$ 1430 1323 1039 911 750 733 567 194 -254 -493 -536 -705 -1032 -1097 -1140 -1070 -1333 -1270 -1133 -809 -810 -444 -440 -138
1215a38O01J24J35J40N4L60L1j55j35J38rk68p16J56j0m22l69l48k21K76k4n51
$$ -138 463 587 722 862 916 1276 1307 1152 1017 1155 1146 878 162 318 308 -114 -483 -831 -1052 -776 -800 -1351
1237a351l9K54Q1j25J70J16O35Q7OK69J86M33K61L8K03N1J16j28j76k92L62m65
$$ -1351 -1390 -1136 -1055 -1180 -1010 -894 -259 -172 -166 103 289 722 983 1021 1224 1275 1391 1263 1087 795 1157 692
1259F92k31m66m08r3r9l05n8p8o5j69J01q5J96M27L7k6M00J23N11L8L24j34M70
$$ 692 461 -5 -413 -506 -605 -910 -968 -1046 -1111 -1280 -1179 -1264 -1068 -641 -604 -630 -230 -107 404 442 766 632 1102
1282A102L5rJ53k11J00j70k22m68j29K96n61m70k58m6o3l48J36N8R7q6M55k73
$$ 1102 1137 1128 1281 1070 1170 1000 778 310 181 477 -84 -554 -812 -858 -921 -1269 -1133 -1075 -978 -1064 -609 -882
1304h82K19M08M19j42M22N5J88K33L9J73K8J38j31l95J06Lm06j9m99o4n44K11
$$ -882 -663 -255 164 22 444 499 687 920 959 1132 1160 1298 1167 772 878 881 475 456 -43 -107 -651 -440
1326d40m59N7l46J80o1j20o2M39J23J65J17RM12M29L62p5K31J05R4J03j80j89
$$ -440 -899 -842 -1188 -1008 -1069 -1189 -1251 -812 -689 -524 -407 -398 14 443 805 730 961 1066 1160 1263 1083 894
1348H94J43l15j72K91o03j44m13k05j4j10l38k6q8L2j31J57J76m8O47j61M49K30
$$ 894 1037 722 550 841 238 94 -319 -524 -538 -648 -986 -1012 -1100 -1068 -1199 -1042 -866 -914 -267 -428 21 251
1370B51N0J76J80R5J00J71K00k42k25K87j47k09l72r4k34j31q9k03l97j25K8q9
$$ 251 301 477 657 752 852 1023 1223 981 756 1043 896 687 315 221 -13 -144 -233 -436 -833 -958 -930 -1019
1392a019M8K51k54J16J50K63K00P6M43k95O43J40Q6M6K85l53K36j89J15J5k19
$$ -1019 -971 -720 -974 -858 -708 -445 -245 -169 274 -21 622 762 848 894 1179 826 1062 873 988 1003 784
1413G84n52j36J12o16J88l08r9k79q1j56J11p1l2K08K81q7M38R1O6N32J10J90
$$ 784 232 96 208 -408 -220 -528 -627 -906 -987 -1143 -1032 -1103 -1135 -927 -646 -733 -295 -204 -138 394 504 694
1435F94LQ8K62k7L1j46m9J30n02J4k09l66j27j41l63N1j94q6J14r1p0J44q0K43
$$ 694 697 785 1047 1020 1051 905 856 986 484 498 289 -77 -204 -345 -708 -657 -851 -937 -823 -914 -984 -840 -920 -677
1459f77J94K45J04M79P4L1K57r0K44K66lk82Q3j31J00l84k47j98L1m25j97J72
$$ -677 -483 -238 -134 345 419 450 707 617 861 1127 1124 842 925 794 894 510 263 65 96 -329 -526 -354
1481c54o93J61Ml1k45J29K79R8j75M59J67J76O6K32J51K93p2J66j5o3L18l24J13
$$ -354 -1047 -886 -882 -913 -1158 -1029 -750 -652 -827 -368 -201 -25 41 273 424 717 645 811 796 733 1051 727 840
1504H40n03N1j20k02l87j3k55j49L43n97J31o1JJ28K5o7N15k61L37P1L67K96k5
$$ 840 337 388 268 66 -321 -334 -589 -738 -395 -992 -861 -922 -921 -793 -768 -835 -320 -581 -244 -173 194 490 465
1527D65J07M5L38k78K84k0o9k33n1k22L7l94k57m8k08k65jJ0k17J21J33k8N6l
$$ 465 572 617 955 677 961 941 872 639 588 366 403 9 -248 -296 -504 -769 -770 -760 -977 -856 -723 -751 -695 -698
1551f98N8L92j33M26N0J99K39Q3J59K5r0L02P1m44J80k4m76lm62j75J62l57J71
$$ -698 -640 -248 -381 45 95 294 533 616 775 800 710 1012 1083 639 819 795 319 316 -146 -321 -159 -516 -345
1574c45l93j11J2P0J00j01J94j03K52K69j08K24L33K00j64L46J5r8K14K78j63
$$ -345 -738 -849 -837 -767 -667 -768 -574 -677 -425 -156 -264 -40 293 493 329 675 690 592 806 1084 921
1595I21k6l75o1k7O1m82n3k33p5k74p7rj67j8K05q4K29j12M17j62R8L38L22M2
$$ 921 895 520 459 432 493 11 -42 -275 -350 -624 -701 -710 -877 -895 -690 -774 -545 -657 -240 -402 -304 34 356 398
1619C98O8K26K40r8n1q1P7j27j78j11l7j11j25l50m8j41l64P0%k2j03J80qJ36
$$ 398 466 692 932 834 783 702 779 652 474 363 326 215 90 -260 -308 -449 -813 -743 -743 -765 -868 -688 -696 -560
1643e60nL51nK52K77N1R1r7L78J15k03j6q9J60Kk81n6j45J9l47k66R8k37N3k32
$$ -560 -565 -214 -219 33 310 361 452 355 733 848 645 629 540 700 702 421 365 220 239 -108 -374 -276 -513 -460 -692
1668f92p3k6R2j00OL24M9K05J77m3J58K19j7J43r4M12r5J9K12k76L04m10k20J0
$$ -692 -765 -791 -699 -799 -793 -469 -420 -215 -38 -81 77 296 279 422 328 740 645 664 876 600 904 494 274 284
1692B84k13q1j77J15l16j10J01m06R0j18O4K69l4J38K07J05J24j07M19J23j1m9
$$ 284 71 -10 -187 -72 -388 -498 -397 -803 -713 -831 -767 -498 -532 -394 -187 -82 42 -65 354 477 466 417
1714D17L11j38J97j51k01N05n01q7K97m67j27p6k93j8l25q8J06N7j02J45K34k28
$$ 417 728 590 787 636 435 940 439 352 649 182 55 -21 -314 -332 -657 -745 -639 -582 -684 -539 -305 -533
1736e33J11L01J36Q5K01J58j41K97n7n6K05n4j78K26k56r9k77K03k33k02j34K05
$$ -533 -422 -121 15 100 301 459 318 615 558 502 707 653 475 701 445 346 69 272 39 -163 -297 -92
1758i2l72k42K58j60K96m87O2N15j54M7O2J80O2J45M93j85O9K9J02lO1j20R2j58
$$ -92 -464 -706 -448 -608 -312 -799 -737 -222 -376 -329 -267 -87 -25 120 613 428 497 526 628 625 686 566 658 500
1782E00j44k38J51m44O1N8j14m19L45k73J34j46m2J88j33K95k31L74P5K91j43
$$ 500 356 118 269 -175 -114 -56 -170 -589 -244 -517 -383 -529 -571 -383 -516 -221 -452 -78 -3 288 145
1803A45K20n8K77J30l83J30j62N8Q9J97k49r5l22R3m71J4K44l61L5n2p9J3LK58
$$ 145 365 307 584 714 331 461 299 357 446 643 394 299 -23 70 -401 -387 -143 -504 -469 -521 -600 -587 -584 -326
1827c26M1Q4l6L39R3j39L59j43L67j70J8K60k5n95M05jj91j21m7%k92O2k30j14
$$ -326 -285 -201 -237 102 195 56 415 272 639 469 487 747 722 127 532 531 340 219 172 172 -120 -58 -288 -402
1851d02l4j48J62J34l86K17j30J52K37q5J63K60q9J19J3P6J61K4L6J6J7j37L8
$$ -402 -436 -584 -422 -288 -674 -457 -587 -435 -198 -283 -120 140 51 170 183 259 420 444 480 496 513 376 414
1874D14jm44J27k0j54L5l42J36o1J6k29J56l53M23rk1O9p9K43L11l46L27j16J3
$$ 414 413 -31 96 76 -78 -43 -385 -249 -310 -294 -523 -367 -720 -297 -306 -327 -258 -337 -94 217 -129 198 82 95
1898I5L73p2J05J9l2r8J0j09l09N1k1j32j69p0kk08J28O4n3J36k09mM00j90K10
$$ 95 468 396 501 520 488 390 400 291 -18 33 12 -120 -289 -359 -361 -569 -441 -377 -430 -294 -503 -507 -107 -297 -87
1923h7p1M88j85m6J18L68k7k14J25J17K0l69M9M2l14j20j4L02l28m01M42l36j40
$$ -87 -158 330 145 99 217 585 558 344 469 586 606 237 286 328 14 -106 -120 182 -146 -547 -105 -441 -581
1946e81J61J16N7j83L26J06j23J27j13M73p7k84L07l9J30k04J49K83l31j54L20
$$ -581 -420 -304 -247 -430 -104 2 -121 6 -107 366 289 5 312 273 403 199 348 631 300 146 466
1967D66n9j36m9m02k01J19Qj33j36K4L09j84p0O3Q8J04J74k2K17j05O9M6J00q0
$$ 466 407 271 222 -180 -381 -262 -254 -387 -523 -499 -190 -374 -444 -381 -293 -189 -15 -37 180 75 144 190 290 210
1991B10R0K96k23Jq5k59K52m7j58p2k77J75j35J6p2l6Q4M6k49R0K87j08J2PK88
$$ 210 300 596 373 374 289 30 282 235 77 5 -272 -97 -232 -216 -288 -324 -240 -194 -443 -353 -66 -174 -162 -155 133
2016A33k1K98j41l43N83k67L61j54l5j30M4k74j43K31j29j39q0R6j73Oj72J87
$$ 133 112 410 269 -74 509 242 603 449 414 284 328 54 -89 142 13 -126 -206 -110 -283 -277 -449 -262
2038b62J67l18J41m9M8m5L12o7L24k58J06K91k81K6K58o2k5J96k56j5o4j49j81
$$ -262 -95 -413 -272 -321 -273 -318 -6 -73 251 -7 99 390 109 135 393 331 306 502 246 231 167 18 -163
2061a63K22j24j55j40j9qQ0p4K29o7K6j01jQ0LL44M7j53K89j72K00K8lr8p3j68
$$ -163 59 -65 -220 -360 -379 -387 -307 -381 -152 -219 -193 -294 -295 -215 -212 132 179 26 315 143 343 371 368 270 197 29
2087B9K93k50J55m5k08J0k64J02j51L6J22J03k63R6O4k87L61j49J74%K31o7p1
$$ 29 322 72 227 182 -26 -16 -280 -178 -329 -293 -171 -68 -331 -235 -171 -458 -97 -246 -72 -72 159 92 21
2110B1J41m5P9n4R3R1Kj38K8J40j13j80l97M37k30k03M4l5Q8J3K2k37R8J00n5
$$ 21 162 117 196 142 235 326 328 190 218 358 245 65 -332 105 -125 -328 -284 -319 -231 -218 -196 -433 -335 -235 -290
2135b90K36J88j33p6K66PJ62j9NLr0J67l00K8k4n3o5k08J80r1k38lK09j31j0R2
$$ -290 -54 134 1 -75 191 198 360 341 346 349 259 426 126 154 130 77 12 -196 -16 -107 -345 -348 -139 -270 -280 -188
2161a88k49K00q2K08k0K31m0j45K37M2j33pL17N7l47J82O0ml9J4j14j22k55M3
$$ -188 -437 -237 -319 -111 -131 100 60 -85 152 194 61 54 371 428 81 263 323 319 280 294 180 58 -197 -154
2185a54Lkj98J9J99j35j07m3K18j00K40o7j41J51p0L19Q3L1K6K5j14P0J57p0k77
$$ -154 -151 -153 -351 -332 -133 -268 -375 -418 -200 -300 -60 -127 -268 -117 -187 132 215 246 272 297 183 253 410 340 63
2210F3L5M6k29J9j55L21k85M5l25n6K62n8j28K26K19k91J15M3J45K20j69R9J78
$$ 63 98 144 -85 -66 -221 100 -185 -140 -465 -521 -259 -317 -445 -219 0 -291 -176 -133 12 232 63 162 340
2233C40j51k72N89L9j57k9j98J93K2j53k39K74m06m6K0R3j21j77L51k46k5Q4K52
$$ 340 189 -83 506 545 388 359 161 354 376 223 -16 258 -148 -194 -174 -81 -202 -379 -28 -274 -299 -215 37
2256C7k14J1K30n5J20j15L49q8Pk65J69J59k4j25r0m1P2k20L8O4j82k64M00j03
$$ 37 -177 -166 64 9 129 14 363 275 282 17 186 345 321 196 106 65 137 -83 -45 19 -163 -427 -27 -130
2280a30k97J83l30J61K09J14k24N66m25O8M22k16R5q3Q0O7P2q9r9J13j24k7J28
$$ -130 -427 -244 -574 -413 -204 -90 -314 252 -173 -105 317 101 196 113 193 260 332 243 144 257 133 106 234
2303B34j36l99L29J3q4m03L8J45j8J53k30J93J23j85J73k26J42J47J7K03p7K67
$$ 234 98 -301 28 41 -43 -446 -408 -263 -281 -128 -358 -165 -42 -227 -54 -280 -138 9 26 229 152 419
2325D19j77K06j60M5k77J40K88m46J94k19Q1N7kl37p6o8J2L7j59K13k23K47n4
$$ 419 242 448 288 333 56 196 484 38 232 13 94 151 149 -188 -264 -332 -320 -283 -442 -229 -452 -205 -259
2348b59K70r8J66j40L19j46L9P4l6O5M2j40K48k68K55k71J79l55M6j43kk17P9
$$ -259 11 -87 79 -61 258 112 151 225 189 254 296 156 404 136 391 120 299 -56 -10 -153 -155 -372 -293
2371b93K21J4j30j13J74l05K66j54L16J54k13J84j81L21j43L9L65o2k24K7j43
$$ -293 -72 -58 -188 -301 -127 -432 -166 -320 -4 150 -63 121 -60 261 118 157 522 460 236 263 120
2392A20K06j39J20l55J90j92o5J00k31P2L1j20J41r1O2q0R7No1K55j33R2J15K91
$$ 120 326 187 307 -48 142 -50 -115 -15 -246 -174 -143 -263 -122 -213 -151 -231 -134 -129 -190 65 -68 24 139 430
2416D30l48P2J77j05k53K16R8j67J15o5r1l53K05K4m6q1j15J95r7k75pL78l8M3
$$ 430 82 154 331 226 -27 189 287 120 235 170 79 -274 -69 -45 -91 -172 -287 -92 -189 -464 -471 -93 -131 -88
2440h8k69L70j58J99K00J42j92m8J41j16K50j87N3J22j03m08R7Lk02P7p0R1k18
$$ -88 -357 13 -145 54 254 396 204 156 297 181 431 244 297 419 316 -92 5 8 -194 -117 -187 -96 -314
2463c14k9n3R4j50J52P4K37m81M99j48M9J60j19j26J87K44j19L58r7k88L25k04
$$ -314 -343 -396 -302 -452 -300 -226 11 -470 29 -119 -70 90 -29 -155 32 276 157 515 418 130 455 251
2485B51n7o3J86j80J62m25j62l5O3J4j80J51o4K10k26k2J40L50j50R8j46L14J72
$$ 251 194 131 317 137 299 -126 -288 -323 -260 -246 -426 -275 -339 -129 -355 -377 -237 113 -37 61 -85 229 401
2508D01N0j21Q8m16K78P6k23L28l70k08J89N8j31o2P6k08j96J67Q3M3m03O0K60
$$ 401 451 330 418 2 280 356 133 461 91 -117 72 130 -1 -63 13 -195 -391 -224 -141 -98 -501 -441 -181
2531a81K56k77J03J89R5k38p5L01k7K25j60q6J85O7k12Q8j50%M1q1Mk36Lj5J4
$$ -181 75 -202 -99 90 185 -53 -128 173 146 371 211 125 310 377 165 253 103 103 144 63 67 -169 -166 -181 -167
2556a67q2k62L21j12J20k07K64n7J87j59K06J7J80j39M2O5NK50m5Mk28rJ46m91
$$ -167 -249 -511 -190 -302 -182 -389 -125 -182 5 -154 52 69 249 110 152 217 222 472 427 431 203 194 340 -151
2580a51J51m0l25J99o9n9L15k80nmR7j28j01K85j6q0o2L01k4J23K04L8Rj72L9
$$ -151 0 -40 -365 -166 -235 -294 21 -259 -264 -268 -171 -299 -400 -115 -131 -211 -273 28 4 127 331 369 378 206 245
2605B45N3J01m4k7j90j23P0j21P9l57J44LJ12j53p6Nj67L48N4n2j25R2J53N3q8
$$ 245 298 399 355 328 138 15 85 -36 43 -314 -170 -167 -55 -208 -284 -279 -446 -98 -44 -96 -221 -129 24 77 -11
2630a1K26L3j83L88j87j08J75k6Q0j34j24Rj09j75k15J72J87l96J5J58q1J28j05
$$ -11 215 248 65 453 266 158 333 307 387 253 129 138 29 -146 -361 -189 -2 -398 -383 -225 -306 -178 -283
2653b83q1O4K7K37P5m4J91k43J44J93l22K56k7O4M7R2Q6j39m66J80j7m1O7J3j58
$$ -283 -364 -300 -273 -36 39 -5 186 -57 87 280 -42 214 187 251 298 390 476 337 -129 51 34 -7 60 73 -85
2678h5m0P6l83L59k47M2o5J18M2K7K19m1J17j59M67k36j02ML17j53R0j96l37L86
$$ -85 -125 -49 -432 -73 -320 -278 -343 -225 -183 -156 63 22 139 -20 447 211 109 113 430 277 367 171 -166 220
2702B20k66J29k09K03j41r4k60K73J32j3l04P5K8k06L53L1M9J68J08j52K6n5K71
$$ 220 -46 83 -126 77 -64 -158 -418 -145 -13 -26 -330 -255 -227 -433 -80 -49 0 168 276 124 150 95 366
2725C66J6r4r5J21M5q2j73kJ04k94J05k21K54m99M20k84O2j30k9K77o2k78L75
$$ 366 382 288 193 314 359 277 104 102 206 -88 17 -204 50 -449 -29 -313 -251 -381 -410 -133 -195 -473 -98
2748i8j41Q1N8J94M9k4K78j57Q6j20J66P9J31l92l9M1k53j2J13L2j07l26K2K67
$$ -98 -239 -158 -100 94 143 119 397 240 326 206 372 451 582 190 151 192 -61 -73 40 72 -35 -361 -339 -72
2772g2k37J2k1J17j00J33N7L8N2j1K14k11L85m68K38M8R6m8J85l3k21r0J62k09
$$ -72 -309 -297 -318 -201 -301 -168 -111 -73 -21 -32 182 -29 356 -112 126 174 270 222 407 374 153 63 225 16
2796A6k40K77j27j10K15m48K53k89J66j50K89j20l12L82Q6Q4k3J52O0K3K11l60
$$ 16 -224 53 -74 -184 31 -417 -164 -453 -287 -437 -148 -268 -580 -198 -112 -28 -51 101 161 184 395 35
2818C5L90o2j61J46j27Q4q2p9K5n30K39J26k05mk40K08k20K58K0k3P4K9J09j93
$$ 35 425 363 202 348 221 305 223 144 169 -361 -122 4 -201 -205 -445 -237 -457 -199 -179 -202 -128 -99 10 -183
2842a83K61q6O9K7Q9O2j42J67J6Qj5q9J44qj50k50M0R3j74k7L4k09m3N2j3Q3K6
$$ -183 78 -8 61 88 177 239 97 264 280 288 273 184 328 320 170 -80 -40 53 -121 -148 -114 -323 -366 -314 -327 -244 -218
2869b18J88oQ9l03K28J68j41R6Q5Nj41K78J05j46J03j02l83j02K04K97j86k43
$$ -218 -30 -36 53 -250 -22 146 5 101 186 191 50 328 433 287 390 288 -95 -197 7 304 118 -125
2891a25NJ4n1o3m9Jj04J72J68j10ML33j62JJ40p4M3L34j57J37p5o3j73J45J01
$$ -125 -120 -106 -157 -220 -269 -268 -372 -200 -32 -142 -138 195 33 34 174 100 143 477 320 457 382 319 146 291 392
2916C92k95Q0p3k73R9J26j38l3j13l9L00m47L3J65k1j36L14j09Q9k3M4P8K06J75
$$ 392 97 177 104 -169 -70 56 -82 -115 -228 -267 33 -414 -381 -216 -237 -373 -59 -168 -79 -102 -58 20 226 401
2940D01k33K27j43J09j46J70m38J45J24m40J78k36J80j32j9J59l63L15l37L66
$$ 401 168 395 252 361 215 385 -53 92 216 -224 -46 -282 -102 -234 -253 -94 -457 -142 -479 -113
2960a13j30k17N10j46m1J44Lj65L68j75J21O1J54n8j31J7k23R7J26rk06k41L83
$$ -113 -243 -460 50 -96 -137 7 10 -155 213 38 159 220 374 316 185 202 -21 76 202 193 -13 -254 129
2983A29k19r6J93q3l30p7J3R2R7K16j9j09L35m63L95M1J68J1k00L03Oj69J86j06
$$ 129 -90 -186 7 -76 -406 -483 -470 -378 -281 -65 -84 -193 142 -321 74 115 283 294 94 397 403 234 420 314
3007C14j8p3Ol11J61k27j3k1j96J86l6r8q7NJ69J07k57K09n6K66j30k02N11q3
$$ 314 296 223 229 -82 79 -148 -161 -182 -378 -192 -228 -326 -413 -408 -239 -132 -389 -180 -236 30 -100 -302 209 126
3031A26J98j60K63j52r8K50J45k89j8j61J73l41m0k24J40j7J27m24J46n9o8M60
$$ 126 324 164 427 275 177 427 572 283 265 104 277 -64 -104 -328 -188 -205 -78 -502 -356 -415 -483 -23
3053b3j63q8M9J20rM82j56m8R6m6L6M4j06q1J19o7K04j80j8p5q1N3l42K08r5l9
$$ -23 -186 -274 -225 -105 -114 368 212 164 260 214 250 294 188 107 226 159 363 183 165 90 9 62 -280 -72 -167 -206
3079b06p9l9K19k84LL13j0k60K61k8K36j90J0O9k7L6J63L62j46o0r5O7l3j6k18
$$ -206 -285 -324 -105 -389 -386 -73 -83 -343 -82 -110 126 -64 -54 15 -12 24 187 549 403 343 248 315 282 266 48
3104D8j3j56J42k20Q5j18q2j10Q7q2L19l30K59J53k10J27m4J02J49q9K34l1j50
$$ 48 35 -121 21 -199 -114 -232 -314 -424 -337 -419 -100 -430 -171 -18 -228 -101 -145 -43 106 17 251 220 70
3127G0K01j84K92j1J6j74Q2r2j70j65j62K71l07Qp8pL35k99k5M66j63L5R2n6o3
$$ 70 271 87 379 368 384 210 292 200 30 -135 -297 -26 -333 -325 -403 -410 -75 -374 -399 67 -96 -61 31 -25 -88
3152h8K49r3J37J79L8l0k01K42j64J19rj20j29r4k9j17J76k30j03R9j58J84o3
$$ -88 161 68 205 384 422 392 191 433 269 388 379 259 130 36 7 -110 66 -164 -267 -168 -326 -142 -205
3175b05N7j03P9k0J2K15K08j48J82j62J19j28Q9Q3j66K90j30j33K4J31l52K00
$$ -205 -148 -251 -172 -192 -180 35 243 95 277 115 234 106 195 278 112 402 272 139 163 294 -58 142
3197A42R0l13j64J49k9k42N4J44k15J64q0J5P8J69k02L54n4j50J66P7P9L22k23
$$ 142 232 -81 -245 -96 -125 -367 -313 -169 -384 -220 -300 -285 -207 -38 -240 114 60 -90 76 153 232 554 331
3220C31p4m1M3j01J37n7o4k23K48q1j96K4k57j56K14Oj89L3Q8J2J55K14J60k51
$$ 331 257 216 259 158 295 238 174 -49 199 118 -78 -54 -311 -467 -253 -247 -436 -403 -315 -303 -148 66 226 -25
3244b5n5J80j7J43O1L20m05K85j77R4r0mj85m0n2l5p8m8j23j30jk0J37Nk9K3O7
$$ -25 -80 100 83 226 287 607 202 487 310 404 314 310 125 85 33 -2 -80 -128 -251 -381 -382 -402 -265 -260 -289 -266 -199
3271a99k09M75k03M14j86j3J90j25J88J07j37L1K95k10k41n5L2K2k91r2R4j52
$$ -199 -408 67 -136 278 92 79 269 144 332 439 302 333 628 418 177 122 154 176 -115 -207 -113 -265
3293b65j1m0K52j23L0q8k2Pk4J89j96L11j54K7L33j57m0K77j44L65l75K32j83
$$ -265 -276 -316 -64 -187 -157 -245 -267 -260 -284 -95 -291 20 -134 -107 226 69 29 306 162 527 152 384 201
3316B01K19j94j53J99l81j06Q2K7M1k58J74l47J77l0r9J91j42L64r2O5N6r7K22
$$ 201 420 226 73 272 -109 -215 -133 -106 -65 -323 -149 -496 -319 -349 -448 -257 -399 -35 -127 -62 -6 -103 119
3339A19L15l06J45J4J4k7j9m3n7K16m87K83l23n7n6o7J20M4k62P6M4r6NJ34J53
$$ 119 434 128 273 287 301 274 255 212 155 371 -116 167 -156 -213 -269 -336 -216 -172 -434 -358 -314 -410 -405 -271 -118
3364a18k9K68j30K46k29j09J83q3K60L7Q3J85k94L8o9J8Ok95m2k14Ol06L86Q0
$$ -118 -147 121 -9 237 8 -101 82 -1 259 296 379 564 270 308 239 257 263 -32 -74 -288 -282 -588 -202 -122
3388a22k1j58q2K65j45J90j72Q5J18J7OO0N1R7j17K71J2K2q4K29k06j88K32l56
$$ -122 -143 -301 -383 -118 -263 -73 -245 -160 -42 -25 -19 41 92 189 72 343 355 377 293 522 316 128 360 4
3412DJ71r7J8J9l15k84J78j22r3J68j90J82K63j27J74J08j47J62J90J1j14L36
$$ 4 175 78 96 115 -200 -484 -306 -428 -521 -353 -543 -361 -98 -225 -51 57 -90 72 262 273 159 495
3434D95k90J33J65l43J92k3j37J23j57k36j32K29j2k19k5J5%j73j25M50j93L3
$$ 495 205 338 503 160 352 329 192 315 158 -78 -210 19 7 -212 -237 -222 -222 -395 -520 -70 -263 -230
3456b30R5J8j4J95K37k79qJ4K17K6J31ql9q8O4k94L08l12p8j7o6J7q8k39L56k07
$$ -230 -135 -117 -131 64 301 22 14 28 245 271 402 394 355 267 331 37 345 33 -45 -62 -128 -111 -199 -438 -82 -289
3482b89m9n2J26k9L4R0M2J47Mj58Q0L1M04k03J37K12m17L06R9j80m3R6k01l8m5
$$ -289 -338 -390 -264 -293 -259 -169 -127 20 24 -134 -54 -23 381 178 315 527 110 416 515 335 292 388 187 149 104
3507A04j91o4k61J10m4K17j54j41L25J20m40Q6J02l3N28m7p9k8N5j24K52J07R1
$$ 104 -87 -151 -412 -302 -346 -129 -283 -424 -99 21 -419 -333 -231 -264 264 217 138 110 165 41 293 400 491
3530D91j97J51k44m5j76L7J24kk22l8J09k72q6l3J57n5l9q0L27PO1P6J18j89n
$$ 491 294 445 201 156 -20 17 141 139 -83 -121 -12 -284 -370 -403 -246 -301 -340 -420 -93 -86 -25 51 169 -20 -25
3555b5K47p8n6J48n6K80k20P8Pl3O4k84j84K55j26K6j60Pk41j69P6K92r5N7L6
$$ -25 222 144 88 236 180 460 240 318 325 292 356 72 -112 143 17 43 -117 -110 -351 -520 -444 -152 -247 -190 -154
3580a54m9q1J26L73k97P1J14Q4j33J59J79J3P5l95L13j89j66K68k13lk16J37k18
$$ -154 -203 -284 -158 215 -82 -11 103 187 54 213 392 405 480 85 398 209 43 311 98 95 -121 16 -202
3603b02n8K20l48k8j14J98M40k07k82M93j70p5N56k85J46J97l41J09K01q9l3J5
$$ -202 -260 -40 -388 -416 -530 -332 108 -99 -381 112 -58 -133 423 138 284 481 140 249 450 361 328 343
3625C43j68L41n60K66k79j48Q5j30nJ65j70l28RL04m8mJ75m7JQ7J11p0K55L9J51
$$ 343 175 516 -44 222 -57 -205 -120 -250 -255 -90 -260 -588 -579 -275 -323 -327 -152 -199 -198 -111 0 -70 185 224 375
3650C75M8j21L9J27j13j35P7K22n18K26k6j07Ml38R6K45m37J35o2j20L2L8J92
$$ 375 423 302 341 468 355 220 297 519 1 227 201 94 98 -240 -144 101 -336 -201 -263 -383 -351 -313 -121
3673a21J6j72J49J36J85j39N6j56M39m47K66N5L0J53l12J49l38J94j04n5j01O6
$$ -121 -105 -277 -128 8 193 54 110 -46 393 -54 212 267 297 450 138 287 -51 143 39 -16 -117 -51
3695e1o5J4k99K30m4Ql48K73J65k22J31R6J06l3J55PN0J36P0j04J66k35j16K79
$$ -51 -116 -102 -401 -171 -215 -207 -555 -282 -117 -339 -208 -112 -6 -39 116 123 173 309 379 275 441 206 90 369
3719C69k81R2j85j56L37l75O3k31J94O6l37K7l04M53mJ36K05j90j33L53n0J28
$$ 369 88 180 -5 -161 176 -199 -136 -367 -173 -107 -444 -417 -721 -268 -272 -136 69 -121 -254 99 49 177
3741A77n6m9L04j50J31k6P8k54K5J4L2p1j29k26j54n8q3K64J7n9l7O5n7J9j48
$$ 177 121 72 376 226 357 331 409 155 180 194 226 155 26 -200 -354 -412 -495 -231 -214 -273 -310 -245 -302 -283 -431
3766d31L69k1k9K13J14K28k28KJ98l13L41q7k49L7J47k09J27k51O7m0k15r8J13
$$ -431 -62 -83 -112 101 215 443 215 217 415 102 443 356 107 144 291 82 209 -42 25 -15 -230 -328 -215
3789b15l9o4J01j4L5j01j8k1J61J53m4m6L8K00K37m08K81K0K16l30k2J34k7O9
$$ -215 -254 -318 -217 -231 -196 -297 -315 -336 -175 -22 -66 -112 -74 126 363 -45 236 256 472 142 120 254 227 296
3813B96l48N3R7r4J14m14J0R6j76k1K29n6l4O7l6J82j68J4M89j50J03J20r8M1
$$ 296 -52 1 98 4 118 -296 -286 -190 -366 -387 -158 -214 -248 -181 -217 -35 -203 -189 300 150 253 373 275 316
3837C16l28L28J01k43r5J34k00K60l07j48O7J8kj20k26P7j6K27k80K44l9J14J78
$$ 316 -12 316 417 174 79 213 13 273 -34 -182 -115 -97 -99 -219 -445 -368 -384 -157 -437 -193 -232 -118 60
3860F0p2J47k17J29j31K69J94j09n2j2J39l3q4l70J77jl0j18K00o0k39J24j73
$$ 60 -12 135 -82 47 -84 185 379 270 218 206 345 312 228 -142 35 34 4 -114 86 26 -213 -89 -262
3883b62J08j84L3P6j20J58q8J21k0J21J55k9rK88p8j01o7j24L16J85q6j12O2j6
$$ -262 -154 -338 -305 -229 -349 -191 -279 -158 -178 -57 98 69 60 348 270 169 102 -22 294 479 393 281 343 327
3907C27k36j22k05o8N4P2J26j98O0r2jP1J64o6J52j62J73n4R1J35p8N5J11M9J18
$$ 327 91 -31 -236 -304 -250 -178 -52 -250 -190 -282 -283 -212 -48 -114 38 -124 49 -5 86 221 143 198 309 358 476
3932D76j52L3p2q1j90J0Q0k16P0j00q3P3ol24J43M4O4O8J03k77K14J98r2J74j28
$$ 476 324 357 285 204 14 24 104 -112 -42 -142 -225 -152 -158 -482 -339 -295 -231 -163 -60 -337 -123 75 -17 157 29
3957B9L27j29P9j6o3J64K2J79j95k87j28j55J73P1P0l70J13k46R8j6l4J96o3k21
$$ 29 356 227 306 290 227 391 413 592 397 110 -18 -173 0 71 141 -229 -116 -362 -264 -280 -314 -118 -181 -402
3981d02J02J48J5k04K16Q3J00J05n1J13J08K12k66l31J84J14k43J12J38j14R7
$$ -402 -300 -152 -137 -341 -125 -42 58 163 112 225 333 545 279 -52 132 246 3 115 253 139 236
4002B36l68k2l7Q2p0L7r1k23M53m68L12o6J10J35J89j95m3j74K96o9M44n9Kj29
$$ 236 -132 -154 -191 -109 -179 -142 -233 -456 -3 -471 -159 -225 -115 20 209 14 -29 -203 93 24 468 409 411 282
4026B82J01j31r4J14J49j63l32j17RJ51L5n55K00J38p6k86L57J73j40M7K97k95
$$ 282 383 252 158 272 421 258 -74 -191 -182 -31 4 -551 -351 -213 -289 -575 -218 -45 -185 -138 159 -136
4048a36K6L02j95J59P4j87M08j30j66J51q4K1J21k52m28K57k9r4K6l44O1K59L0
$$ -136 -110 192 -3 156 230 43 451 321 155 306 222 243 364 112 -316 -59 -88 -182 -156 -500 -439 -180 -150
4071a50P2k88M2P4N4O0J74J59l13M94m83M27n6j11K22j14O3J1l73J34J25l59J22
$$ -150 -78 -366 -324 -250 -196 -136 38 197 -116 378 -105 322 266 155 377 263 326 337 -36 98 223 -136 -14
4094a4Jj10j43k22M34r8k35k14K16j55L75j90K70NL5RJ44r3J63r7K17k57L04k1
$$ -14 -13 -123 -266 -488 -54 -152 -387 -601 -385 -540 -165 -355 -85 -80 -45 -36 108 15 178 81 298 41 345 324
4118C24j40O3q4k55J33R9j90N7k95K43j05P8o4J13k45J25k78K59p8K22J09N6J7
$$ 324 184 247 163 -92 41 140 -50 7 -288 -45 -150 -72 -136 -23 -268 -143 -421 -162 -240 -18 91 147 164
4141A64k31J63P4O0j96K96j1j05n9l6r7R4MM6k48j06L15k88k30J63L09k56n7J72
$$ 164 -67 96 170 230 34 330 319 214 155 119 22 116 120 166 -82 -188 127 -161 -391 -228 81 -175 -232 -60
4165f0j00k2K57l40K73j08P7m7L5L20P3j68n7K31j93M4n4J14j82Mq1J45l75M8
$$ -60 -160 -182 75 -265 8 -100 -23 -70 -35 285 358 190 133 364 171 215 161 275 93 97 16 161 -214 -166
4189a66j9m2p7L1K4J74j62J5J19k70J85K26K5j18P9J52j7J35J4q5n4j9O5j24q7
$$ -166 -185 -227 -304 -273 -249 -75 -237 -222 -103 -373 -188 38 63 -55 24 176 159 294 308 223 169 150 215 91 4
4214DJ09Q4m38K57k25k6M5J43o3N5L7l07J69J75l04K94LL8k64K02m9J45P7q4Q8
$$ 4 113 197 -241 16 -209 -235 -190 -47 -110 -55 -18 -325 -156 19 -285 9 12 50 -214 -12 -61 84 161 77 165
4239A65K15o0k15J51j96l9Jk01L31j33kk11K0J90k48j06n6l6K68q3k6R3K78j54
$$ 165 380 320 105 256 60 21 22 -179 152 19 17 -194 -174 16 -232 -338 -394 -430 -162 -245 -271 -178 100 -54
4263e4n9L2K28j57J07J96m06K74P1p0J14k07K05p2j19MK4j60n4j02q8lJ46m7K78
$$ -54 -113 -81 147 -10 97 293 -113 161 232 162 276 69 274 202 83 87 111 -49 -103 -205 -293 -296 -150 -197 81
4288H1l77n7L05R7k3Q3j53J21R5K33k11j38K16J50k86j17L49j05m61J14J29k19
$$ 81 -296 -353 -48 49 26 109 -44 77 172 405 194 56 272 422 136 19 368 263 -198 -84 45 -174
4310a74K45k13L1P6j87P8l61K86j32K76j24N6j76L0K60%J7J23R9j0j18K76j69
$$ -174 71 -142 -111 -35 -222 -144 -505 -219 -351 -75 -199 -143 -319 -289 -29 -29 -12 111 210 200 82 358 189
4333A89O0j37k71L46n3k1k1n1l7k05J2J17k59j0P8J19j32j18J74q5J72r1J10J31
$$ 189 249 112 -159 187 134 113 92 41 4 -201 -189 -72 -331 -341 -263 -144 -276 -394 -220 -305 -133 -224 -114 17
4357A7p9N9J08P4j11j4J09r7J91R6k83n2M8k7n6J6l26K08J5jk96L4K88j8j22N2
$$ 17 -62 -3 105 179 68 54 163 66 257 353 70 18 66 39 -17 -1 -327 -119 -104 -105 -401 -367 -79 -97 -219 -167
4383a67j23K78l04J73K2J06J80j29j01L40k5k89L04Nk00J32j06j9j98QL13l17
$$ -167 -290 -12 -316 -143 -121 -15 165 36 -65 275 250 -39 265 270 70 202 96 77 -121 -113 200 -117
4405a17K4o6Q6k57K91l60J0J13o0R2K89p7m9K18M8j44K86l05K36J0k95L39L0j17
$$ -117 -93 -159 -73 -330 -39 -399 -389 -276 -336 -244 45 -32 -81 137 185 41 327 22 258 268 -27 312 342 225
4429B25J44j55n1l71J10K49k59j39j0k4K43l38M84n45j3K78k09N4L13j74K03J7
$$ 225 369 214 163 -208 -98 151 -108 -247 -257 -281 -38 -376 108 -437 -450 -172 -381 -327 -14 -188 15 32
4451C2K61l3j22J27O0j14r8J42Pj47q2j08n6K54j85j53K27k82N8J14r6l3J36r6
$$ 32 293 260 138 265 325 211 113 255 262 115 33 -75 -131 123 -62 -215 12 -270 -212 -98 -194 -227 -91 -187
4475a87p3o7J30KM8L57L1l56K08K25n4j13m7K2J95j79j00J8n3O6j69O6k21P7j40
$$ -187 -260 -327 -197 -195 -147 210 241 -115 93 318 264 151 104 126 321 142 42 60 7 73 -96 -30 -251 -174 -314
4500c14J81j38M9p1N2p2K55J29k16K3M4P5m7K96j34r8L15o4L1k24J07R2Q8l46
$$ -314 -133 -271 -222 -293 -241 -313 -58 71 -145 -122 -78 -3 -50 246 112 14 329 265 296 72 179 271 359 13
4524A3q8R2K8k17LJ11j63Q1j51J95q5P8j56J25J5J07PK50m05J84J45J27J06l96
$$ 13 -75 17 45 -172 -169 -58 -221 -140 -291 -96 -181 -103 -259 -134 -119 -12 -5 245 -160 24 169 296 402 6
4548FK38J36k05L09j88j54M0J34j50j81o2j73N2n4J12J30k40m8K45J13q9J75k44
$$ 6 244 380 175 484 296 142 182 316 166 -15 -77 -250 -198 -252 -140 -10 -250 -298 -53 60 -29 146 -98
4571i8J93r3j13N42k43M0r9J76j48R8j6J54k53r1J28j62K77l55R9j42P1O4j78
$$ -98 95 2 -111 431 188 228 129 305 157 255 239 393 140 49 177 15 292 -63 36 -106 -35 29 -149
4594a49q3j01K00j6K7j8r6m3L84j95J24R2%K00k92M5J62j38K59n3m7j16l40J80
$$ -149 -232 -333 -133 -149 -122 -140 -236 -279 105 -90 34 126 126 326 34 79 241 103 362 309 262 146 -194 -14
4618a4n3P6l33K69r8j56K57k03nJ78k31J77q2J82N2j88Q0R6R9j04J59K70j62j43
$$ -14 -67 9 -324 -55 -153 -309 -52 -255 -260 -82 -313 -136 -218 -36 16 -172 -92 4 103 -1 158 428 266 123
4642A23r8K66j98R3J47m04K17j12J21l55J58k57P2R1n6k36L4J28K33j8l69L39
$$ 123 25 291 93 186 333 -71 146 34 155 -200 -42 -299 -227 -136 -192 -428 -394 -266 -33 -51 -420 -81
4664h1J24J42J6r7j17J29J95k98K86K5l65K68j1j7j25k5R2l32L19k86j45K92m06
$$ -81 43 185 201 104 -13 116 311 13 299 324 -41 227 216 199 74 49 141 -191 128 -158 -303 -11 -417
4687d17J93k07J45N0l8J53m6L06Q6l35L78j79j22J64q4P2k2K4J03l24K32j02K32
$$ -417 -224 -431 -286 -236 -274 -121 -167 139 225 -110 268 89 -33 131 47 119 97 121 224 -100 132 30 262
4710B62j02k45J65j60j26J35j08l7j2K03k64J01o1Q6K46n3N7N0m4N3j39J29K7
$$ 262 160 -85 80 -80 -206 -71 -179 -216 -228 -25 -289 -188 -249 -163 83 30 87 137 93 146 7 136 163
4733A63j42M11k47l17L32m5K5j67M6p7j99L26p8o1j62Q0k82J48J65P3j05m5L3
$$ 163 21 432 185 -132 200 155 180 13 59 -18 -217 109 31 -30 -192 -112 -394 -246 -81 -8 -113 -158 -125
4756a25J88j45J93Mm9K58q4m1M7L2r5m9j12m7O2L3k70L30J72l17P9j24j0j22L8
$$ -125 63 -82 111 115 66 324 240 199 246 278 183 134 22 -25 37 70 -200 130 302 -15 64 -60 -70 -192 -154
4781a54k29K40J05j10J28l8K01r5k47L47J5q4j83K92R7l25M34j77k1qk30K5j1
$$ -154 -383 -143 -38 -148 -20 -58 143 48 -199 148 163 79 -104 188 285 -40 394 217 196 188 -42 -17 -28
4804b8J02l03NR4p8J13k24K51k98K87J4J98j30j23P9L3L4J54k33L2P9q6N94k07
$$ -28 74 -229 -224 -130 -208 -95 -319 -68 -366 -79 -65 133 3 -120 -41 -8 26 180 -53 -21 58 -28 566 359
4828C59K2k18m5K3O6j11j8j01k80L02J47k66j41m0K2L9J48N6q2k68L53K69q6n
$$ 359 381 163 118 141 207 96 78 -23 -303 -1 146 -120 -261 -301 -279 -240 -92 -36 -118 -386 -33 236 150 145
4852A45k7R9r0J2Q1n2J07m3k07n6P7K0k5J68m00J12P4k46J99k34K28j31l44O29
$$ 145 118 217 127 139 220 168 275 232 25 -31 46 66 41 209 -191 -79 -5 -251 -52 -286 -58 -189 -533 96
4876I6n35M16oJ6r5J54j63P7J90m3Q6m9q2m5K39j26j84L6k2R3r4P4k5o8j46Q5
$$ 96 -439 -23 -29 -13 -108 46 -117 -40 150 107 193 144 62 17 256 130 -54 -18 -40 53 -41 33 8 -60 -206 -121
4902a21J33j98J16L7P0j75K08k54K8K03L2r4J05j01J79R1j7q3K31j15k85q0L45
$$ -121 12 -186 -70 -33 37 -138 70 -184 -156 47 79 -15 90 -11 168 259 242 159 390 275 -10 -90 255
4925B55j52K0o3j02k09O3J1j14R4M5O2k59J48j34K60J1n4J04M8J69K3P3j83j6
$$ 255 103 123 60 -42 -251 -188 -177 -291 -197 -152 -90 -349 -201 -335 -75 -64 -118 -14 34 203 226 299 116 100
4949A00q9R4q9J3J01K0j13K30k88r2J99p7j45L6J52J0j04J07k66P7J35M9l3l52
$$ 100 11 105 16 29 130 150 37 267 -21 -113 86 9 -136 -100 52 62 -42 65 -201 -124 11 60 27 -325
4973c25K22M42l69L04k00R4l36K02K36k85O8J84j83lp6J51j44N8j09%K1k96L67
$$ -325 -103 339 -30 274 74 168 -168 34 270 -15 53 237 54 51 -25 126 -18 40 -69 -69 -48 -344 23
4996B3J57o0l32m9P9L20l98K28q7L3J90Kj03J26J6j8J28k45O8P9j1l78L02j59
$$ 23 180 120 -212 -261 -182 138 -260 -32 -119 -86 104 106 3 129 145 127 255 10 78 157 146 -232 70 -89
5020h9K12j93NL3Pm0q4J95k4o8L8Q9j14O7j50O3j6K56o9q6O6JK28k33p7Q6J72
$$ -89 123 -70 -65 -32 -25 -65 -149 46 22 -46 -8 81 -33 34 -116 -53 -69 187 118 32 98 99 327 94 17 103 275
5047B75k20Q4n3j33P1l74K53J97j19k59K85q4L3q1M2j6J11l49L09N8J34j46Kj19
$$ 275 55 139 86 -47 24 -350 -97 100 -19 -278 7 -77 -44 -125 -83 -99 12 -337 -28 30 164 18 20 -99
5071i9L60J5k23j00L64k31j34l5J44K4J17k53j51M6M53l50J74n15L60lj36K64
$$ -99 261 276 53 -47 317 86 -48 -83 61 85 202 -51 -202 -156 297 -53 121 -394 -34 -37 -173 91
5093I1k14l4k9P4L08j90o8J02M9J59j43M2kq3M4N5l29K69k78L34k94J77o2J13
$$ 91 -123 -157 -186 -112 196 6 -62 40 89 248 105 147 145 62 106 161 -168 101 -177 157 -137 40 -22 91
5117I1j36J12o7J81p57M68P3j99J4J35N5J17mK9J09k41P8J92j8N0qk87R7j20o3
$$ 91 -45 67 0 181 -576 -108 -35 -234 -220 -85 -30 87 83 112 221 -20 58 250 232 282 274 -13 84 -36 -99
5142i9kR3J16l57K19k5q6n4R9q9K61l3n0Oo1K79j88m8l5J24J15k34K34J29k90
$$ -99 -101 -8 108 -249 -30 -55 -141 -195 -96 -185 76 43 -7 -1 -62 217 29 -19 -54 70 185 -49 185 314 24
5167B4r5Q2J39m7J25k34J09J15k44l6J9oP9l3j92n2K19l48K69J74L46n39L3k45
$$ 24 -71 11 150 103 228 -6 103 218 -26 -62 -43 -49 30 -3 -195 -247 -28 -376 -107 67 413 -126 -93 -338
5191c38K90O4j17K32j15m43O12j72m9P7KN9P0k99J73n6M1q8K3l8p7J77k18K20
$$ -338 -48 16 -101 131 16 -427 185 13 -36 41 43 102 172 -127 46 -10 31 -57 -34 -72 -149 28 -190 30
5215C0p1j20K23j42J31K4k24L45K76l10l60K29Qk3J51l1K26m87j03L19j78n8J91
$$ 30 -41 -161 62 -80 51 75 -149 196 472 162 -198 31 39 16 167 136 362 -125 -228 91 -87 -145 46
5238D6q3Q0L9j99K79l88j27L36k00J74Q9m9k04K48M5J49k10J04m3k43K29N4l0
$$ 46 -37 43 82 -117 162 -226 -353 -17 -217 -43 46 -3 -207 41 86 235 25 129 86 -157 72 126 96
5261I6j76j28J40K62k10j67J62j40J85j65q2M36m63J45l7O5j4MR1o1M2K38k45
$$ 96 -80 -208 -68 194 -16 -183 -21 -161 24 -141 -223 213 -250 -105 -142 -77 -91 -87 4 -57 -15 223 -22
5284b2J08q6k61L89r0J8j3j73K98j59JK0j82J95l24L38r8K8K83k14p3k02L0J4
$$ -22 86 0 -261 128 38 56 43 -130 168 9 10 30 -152 43 -281 57 -41 -13 270 56 -17 -219 -189 -175
5308a75J49J85k37L3o2j2L40m20L08J21j78J10j18K7J82l5q2r9Q9N8k67j83K63
$$ -175 -26 159 -78 -45 -107 -119 221 -199 109 230 52 162 44 71 253 218 136 37 126 184 -83 -266 -3
5331cj36R7J83o8j61j06lK37l28L27j99K9K58j52J23j42J95K27l83K63m13M08
$$ -3 -139 -42 141 73 -88 -194 -197 40 -288 39 -160 -131 127 -25 98 -44 151 378 -5 258 -155 253
5353B53j82j5k36K35L27n92J54J64J5l66j4K35j8Q5r1J09o9L3r5J41p5j7j5n9
$$ 253 71 56 -180 55 382 -210 -56 108 123 -243 -257 -22 -40 45 -46 63 -6 27 -68 73 -2 -19 -34 -93
5377i3P4K4J51K3j31j47K84n1l01L34j0l00k4K52m1n8r1n8L86m24KL3j1J02J92
$$ -93 -19 5 156 179 48 -99 185 134 -167 167 157 -143 -167 85 44 -14 -105 -163 223 -201 -199 -166 -177 -75 117
5402A17r9j64%L39oj35j09J39q9l9k29N51j77n5K8J16k65j48K37j51M1Q5j37J07
$$ 117 18 -146 -146 193 187 52 -57 82 -7 -46 -275 276 99 44 72 188 -77 -225 12 -139 -98 -13 -150 -43
5426d3O0j50L4o7J84k26J03j33N3O6J38J34j03M6J60n6j55O8J9m1j1j06J79n3
$$ -43 17 -133 -99 -166 18 -208 -105 -238 -185 -119 19 153 50 96 256 200 45 113 132 91 80 -26 153 100
5450A00mJ3k48M2K4rk9J79j49m6o%L15k61p8K00j5n2J52j9j40K15j95Rl4J47k77
$$ 100 96 109 -139 -97 -73 -82 -111 68 -81 -127 -133 -133 182 -79 -157 43 28 -24 128 109 -31 184 -11 -2 -36 111 -166
5477a66K25k3R4l98K86OJ34k19K30k89pJ91q8O0j01K59k52O0m3j74K49K0l2K22
$$ -166 59 36 130 -268 18 24 158 -61 169 -120 -127 64 -24 36 -65 194 -58 2 -41 -215 34 54 22 244
5501B44R7m86L98k28j10J96O9j3o0k37K16M1M9l45j1K05p7jk22J55l6J6J23M0
$$ 244 341 -145 253 25 -85 111 180 167 107 -130 86 127 176 -169 -180 25 -52 -53 -275 -120 -156 -140 -17 23
5525B3JK6k2L4o4J26Kj32k6J70o6J18j26Q2j85M0n3K00j11j43R0j12P7k01L33
$$ 23 24 50 28 62 -2 124 126 -6 -32 138 72 190 64 146 -39 1 -52 148 37 -106 -16 -128 -51 -252 81
5550H1j32k56M02n25R5K40J44k21K25L2J1n8J44l01M9j74K97j46Q3M1j78M00k98
$$ 81 -51 -307 95 -430 -335 -95 49 -172 53 85 96 38 182 -119 -70 -244 53 -93 -10 31 -147 253 -45
5573d5J08m0Q6j14j35n1J5k32L09K35l59K21p4J67n1r9O7m9L0K99j30m4J90l67
$$ -45 63 23 109 -5 -140 -191 -176 -408 -99 136 -223 -2 -76 91 40 -59 8 -41 -11 288 158 114 304 -63
5597f3N7K01j22m3P9J8o4j72m8j2J89K04j99J48k95K05q8l5R9J16q%k09O6K2L
$$ -63 -6 195 73 30 109 127 63 -109 -157 -169 20 224 25 173 -122 83 -5 -40 59 175 167 167 -42 24 46 49
5623D9j83J56j41L05J71m15L0J11K44k00N2k85M7Q7n1J20k63m1pJ11K28l20M22
$$ 49 -134 22 -119 186 357 -58 -28 83 327 127 179 -106 -59 28 -23 97 -166 -207 -214 -103 125 -195 227
5646B27o8l14Q0K13k08R0J66l70J30K21j29K02m58L04k3L2l4j12J06K8j53o1J63
$$ 227 159 -155 -75 138 -70 20 186 -184 -54 167 38 240 -218 86 63 95 61 -51 55 83 -70 -131 32
5669C2J32l47O3J33k9L5l38J00K14J76l79M58k87K4J26p9M1J0j39K41j64P4j75
$$ 32 164 -183 -120 13 -16 19 -319 -219 -5 171 -208 250 -37 -13 113 34 75 85 -54 187 23 97 -78
5692g8n8R0J2K87l07L0Q1j23J82K6o1l30L32k23q1L52j91j31K00r6J02m8Q1J7
$$ -78 -136 -46 -34 253 -54 -24 57 -66 116 142 81 -249 83 -140 -221 131 -60 -191 9 -87 15 -33 48 65
5716F5j61J82o3P1k4j1N2l0l8k08K31j33L02k69R7m27L25J5J13o4l0j59Q7J03
$$ 65 -96 86 23 94 70 59 111 81 43 -165 66 -67 235 -34 63 -364 -39 -24 89 25 -5 -164 -77 26
5740B6j53O6n6J30j96K19oj65J46L19k92q5P0P2j57Q8j05K56nk94J36p4l9J53
$$ 26 -127 -61 -117 13 -183 36 30 -135 11 330 38 -47 23 95 -62 26 -79 177 172 -122 14 -60 -99 54
5764E4o0k22M66l65J25j25J49k7J75r3j23L02l40R0KK02j30LOK64l06N6j3j76
$$ 54 -6 -228 238 -127 -2 -127 22 -5 170 77 -46 256 -84 6 8 210 80 83 89 353 47 103 90 -86
5788h6K09l9k0K89m11O0q9J66J6rk42J08M5O1J29l76L01j24Q8j71J57J10j95j5
$$ -86 123 84 64 353 -58 2 -87 79 95 86 -156 -48 -3 58 187 -189 112 -12 76 -95 62 172 -23 -38
5812c8K17j47j68Q0M6J69j38M4j2N0j27K80k35k7j00L5K02k16R1k02J50J60n4
$$ -38 179 32 -136 -56 -10 159 21 65 53 103 -24 256 21 -6 -106 -71 131 -85 6 -196 -46 114 60
5835F0N9k24J19j96L81n9j61PJ0N0P3n9j10L63k7l38K39K1j33m3q5lL58j99j04
$$ 60 119 -105 14 -182 199 140 -21 -14 -4 46 119 60 -50 313 286 -52 187 208 75 32 -53 -56 302 103 -1
5860al10K12j16J97mK5L0j0o1K8k44K63K67l71P7r3M4nnJ73Kj32j7J76K7n29J14
$$ -1 -311 -99 -215 -18 -22 3 33 23 -38 -10 -254 9 276 -95 -18 -111 -67 -72 -77 96 98 -34 -51 125 152 -377 -263
5887b63J85J08l00K11j08P8Q4L1j04M6K1P0j41L16r4P4k24N8O7J11k7l6N7j90
$$ -263 -78 30 -270 -59 -167 -89 -5 26 -78 -32 -11 59 -82 234 140 214 -10 48 115 226 199 163 220 30
5911C0P5Oj59l7K39l64N2K5P9J08j81J98m0p2p0jQ0J5J4K60j65j10k3q3L95j38
$$ 30 105 111 -48 -85 154 -210 -158 -133 -54 54 -127 71 31 -41 -111 -112 -32 -17 -3 257 92 -18 -41 -124 271 133
5937A33k15L04j42j97L9l3K6O9J30k6j24k2M8J06k37R5j0J87j49l49M38m6n6J47
$$ 133 -82 222 80 -117 -78 -111 -85 -16 114 88 -36 -58 -10 96 -141 -46 -56 131 -18 -367 71 25 -31 116
5961A16j64J48n9m5l0Q4J05J01k08m7p1J14J0j26j94L46O3M9l8k95j3q1K51Q0
$$ 116 -48 100 41 -4 -34 50 155 256 48 1 -70 44 54 -72 -266 80 143 192 154 -141 -154 -235 16 96
5985I6k4j39J91k52K09jl28L88k37J76J8J97j42n2Jk11Ql5J12k18L35j83J97r
$$ 96 72 -67 124 -128 81 80 -248 140 -97 79 97 294 152 100 101 -110 -102 -137 -25 -243 92 -91 106 97
6009I7k46L9M2K88l46j9J82k74L12j10O4k37K83j84N7R1K76k97R2m9R6K7j21k93
$$ 97 -149 -110 -68 220 -126 -145 37 -237 75 -35 29 -208 75 -109 -52 39 315 18 110 61 157 184 63 -230
6033b30K69j04R4r2j43L61l82J98K3O0Rp6j08R2O8j1l7J11q6Q4j69K15n4j14J39
$$ -230 39 -65 29 -63 -206 155 -227 -29 -6 54 63 -13 -121 -29 39 28 -9 102 16 100 -69 146 92 -22 117
6058A17pp8J24k25M8P3K56k66J86o02M62j07ko2j11O0K31k72K54k76O9J83j56
$$ 117 110 32 156 -69 -21 52 308 42 228 -374 88 -19 -21 -83 -194 -134 97 -175 79 -197 -128 55 -101
6081a01J44J79%j97P2M9j22q8M3K74j54j76O7J48j79K2j07J65k10J49m6r3J18
$$ -101 43 222 222 25 97 146 24 -64 -21 253 99 -77 -10 138 -41 -19 -126 39 -171 -22 -68 -161 -43
6104d3q8J73j43L0M4J0qj02J91K39j86j3k06L14p5NJ21r9j19j45K90k95j88J20
$$ -43 -131 42 -101 -71 -27 -17 -25 -127 64 303 117 104 -102 212 137 142 263 164 45 -100 190 -105 -293 -173
6128a73r3M64l00K9K0J14q0j20J49k76L61k62N8k4K37o6k10J27K01k49K44q3J12
$$ -173 -266 198 -102 -73 -53 61 -19 -139 10 -266 95 -167 -109 -133 104 38 -172 -45 156 -93 151 68 180
6151A80p2j33L25l13Rj86L0q2M63j46l15K45rLj83Q6K48n5j70Q0R9j41J32j04
$$ 180 108 -25 300 -13 -4 -190 -160 -242 221 75 -240 5 -4 -1 -184 -98 150 95 -75 5 104 -37 95 -9
6175iJ74rk96L44l4j97j57P5P3j31J75K03k32n4J94j61q0J92n7j85K53k20K38
$$ -9 165 156 -140 204 170 -27 -184 -109 -36 -167 8 211 -21 -75 119 -42 -122 70 13 -172 81 -139 99
$$ [...]
8191i8
##END NTUPLES=NMR FID
##END=
