##TITLE=1H_Pr C6-Q
 200.13Hz, CDCl3.
 8 sc
 24.8.2026
##JCAMPDX= 6.0         $$ Bruker NMR JCAMP-DX V2.0
##DATA TYPE= NMR FID
##DATA CLASS= NTUPLES
##ORIGIN= UXNMR, Bruker Analytische Messtechnik GmbH
##OWNER= pz
$$ XWIN-NMR		Version 3.5
$$ Mon Aug 24 15:05:19 2026 Russian Standard Time (UT+4h)  she@DPX200
##.OBSERVE FREQUENCY= 200.1313
##.OBSERVE NUCLEUS= ^1H
##.DELAY= (6, 6)
##.ACQUISITION MODE= SIMULTANEOUS
##.ACQUISITION SCHEME= undefined
##.AVERAGES= 8
##.DIGITISER RES= 18
##SPECTROMETER/DATA SYSTEM= spect
##.PULSE SEQUENCE= zg30
##.SOLVENT NAME= DMSO
##.SHIFT REFERENCE= (INTERNAL, DMSO, 0, 14.3821)
##AUDIT TRAIL= $$ (NUMBER, WHEN, WHO, WHERE, WHAT)
$$ ##TITLE= Audit trail, XWIN-NMR		Version 3.5
$$ ##JCAMPDX= 5.01
$$ ##ORIGIN= Bruker BioSpin GmbH
$$ ##OWNER= she
$$ F:/spectra/data/she/nmr/H-C/1/audita.txt
$$ ##AUDIT TRAIL=  $$ (NUMBER, WHEN, WHO, WHERE, WHAT)
(   1,<2026-08-24 15:03:55.34 +0400>,<she>,<DPX200>,
      <created by zg, POWCHK disabled, PULCHK disabled
       configuration hash MD5:
       00 E9 B6 7A A2 85 ED C7 34 08 36 98 17 FE 4E 26
       data hash MD5: 16K
       5E A6 E6 68 FB 3A ED D8 B8 97 01 B4 30 27 6B 0B>)
$$ ##END=
$$ 
$$ hash MD5
$$ F5 38 16 86 D6 F2 07 E1 F4 DD 9B 0B 40 AC 74 A6
##$RELAX= 
##$RELAX= 
##$RELAX= 
##$RELAX= 
##$RELAX= 
##$RELAX= 
$$ Bruker specific parameters
$$ --------------------------
##$DU= <F:/spectra>
##$EXPNO= 1
##$NAME= <H-C>
##$PROCNO= 1
##$TYPE= <nmr>
##$USER= <she>
##$AMP= (0..31)
100 100 100 100 100 100 100 100 100 100 100 100 100 100 100 100 100 100 
100 100 100 100 100 100 100 100 100 100 100 100 100 100 
##$AQSEQ= 0
##$AQ_mod= 1
##$AUNM= <au_zg>
##$AUTOPOS= <>
##$BF1= 200.13
##$BF2= 200.13
##$BF3= 200.13
##$BF4= 200.13
##$BF5= 200.13
##$BF6= 200.13
##$BF7= 200.13
##$BF8= 200.13
##$BYTORDA= 1
##$CFDGTYP= 0
##$CFRGTYP= 5
##$CHEMSTR= <none>
##$CNST= (0..31)
1 1 145 1 1 1 1 1 1 1 1 1 1 1 1 1 1 1 1 1 1 1 1 1 1 1 1 1 1 1 1 1 
##$CPDPRG= <>
##$CPDPRG1= <>
##$CPDPRG2= <>
##$CPDPRG3= <>
##$CPDPRG4= <mlev>
##$CPDPRG5= <mlev>
##$CPDPRG6= <mlev>
##$CPDPRG7= <mlev>
##$CPDPRG8= <mlev>
##$CPDPRGB= <>
##$CPDPRGT= <>
##$D= (0..31)
0 0.7 0 0 0 0 0 0 0 0 0 0.03 0 0 0 0 0 0 0 0 0 0 0 0 0 0 0 0 0 0 0 0 
##$DATE= 1787569434
##$DBL= (0..7)
120 120 120 120 120 120 120 120 
##$DBP= (0..7)
150 150 150 150 150 150 150 150 
##$DBP07= 0
##$DBPNAM0= <>
##$DBPNAM1= <>
##$DBPNAM2= <>
##$DBPNAM3= <>
##$DBPNAM4= <>
##$DBPNAM5= <>
##$DBPNAM6= <>
##$DBPNAM7= <>
##$DBPOAL= (0..7)
0.5 0.5 0.5 0.5 0.5 0.5 0.5 0.5 
##$DBPOFFS= (0..7)
0 0 0 0 0 0 0 0 
##$DE= 6
##$DECBNUC= <off>
##$DECIM= 32
##$DECNUC= <off>
##$DECSTAT= 4
##$DIGMOD= 1
##$DIGTYP= 9
##$DL= (0..7)
0 120 120 120 120 120 120 120 
##$DP= (0..7)
150 150 150 150 150 150 150 150 
##$DP07= 0
##$DPNAME0= <>
##$DPNAME1= <>
##$DPNAME2= <>
##$DPNAME3= <>
##$DPNAME4= <>
##$DPNAME5= <>
##$DPNAME6= <>
##$DPNAME7= <>
##$DPOAL= (0..7)
0.5 0.5 0.5 0.5 0.5 0.5 0.5 0.5 
##$DPOFFS= (0..7)
0 0 0 0 0 0 0 0 
##$DQDMODE= 0
##$DR= 18
##$DS= 0
##$DSLIST= <SSSSSSSSSSSSSSS>
##$DSPFIRM= 0
$$ [...]
##$SUBNAM0= <"">
##$SUBNAM1= <"">
##$SUBNAM2= <"">
##$SUBNAM3= <"">
##$SUBNAM4= <"">
##$SUBNAM5= <"">
##$SUBNAM6= <"">
##$SUBNAM7= <"">
##$SUBNAM8= <"">
##$SUBNAM9= <"">
##$SW= 18.0517328524113
##$SWIBOX= (0..15)
0 0 2 0 0 0 0 0 0 0 0 0 0 0 0 0 
##$SW_h= 3612.71676300578
##$TD= 16384
##$TD0= 1
##$TE= 0
##$TE2= 300
##$TE3= 300
##$TEG= 300
##$TL= (0..7)
0 120 120 120 120 120 120 120 
##$TP= (0..7)
150 150 150 150 150 150 150 150 
##$TP07= 0
##$TPNAME0= <>
##$TPNAME1= <>
##$TPNAME2= <>
##$TPNAME3= <>
##$TPNAME4= <>
##$TPNAME5= <>
##$TPNAME6= <>
##$TPNAME7= <>
##$TPOAL= (0..7)
0.5 0.5 0.5 0.5 0.5 0.5 0.5 0.5 
##$TPOFFS= (0..7)
0 0 0 0 0 0 0 0 
##$TUNHIN= 0
##$TUNHOUT= 0
##$TUNXOUT= 0
##$USERA1= <user>
##$USERA2= <user>
##$USERA3= <user>
##$USERA4= <user>
##$USERA5= <user>
##$V9= 5
##$VALIST= <valist>
##$VCLIST= <CCCCCCCCCCCCCCC>
##$VD= 0
##$VDLIST= <DDDDDDDDDDDDDDD>
##$VPLIST= <PPPPPPPPPPPPPPP>
##$VTLIST= <TTTTTTTTTTTTTTT>
##$WBST= 1024
##$WBSW= 4
##$XGAIN= (0..3)
0 0 0 0 
##$XL= 0
##$YL= 0
##$YMAX_a= 154877
##$YMIN_a= -142127
##$ZGOPTNS= <>
##$ZL1= 120
##$ZL2= 120
##$ZL3= 120
##$ZL4= 120
##$ABSF1= 10
##$ABSF2= 0
##$ABSG= 5
##$ABSL= 3
##$ALPHA= 0
##$AQORDER= 0
##$ASSFAC= 0
##$ASSFACI= 0
##$ASSFACX= 0
##$ASSWID= 0
##$AUNMP= <proc_1d>
##$AZFE= 0.1
##$AZFW= 0.1
##$BCFW= 1
##$BC_mod= 2
##$BYTORDP= 1
##$COROFFS= 0
##$CY= -3
##$DATMOD= 1
##$DC= 2
##$DFILT= <>
##$DTYPP= 0
##$F1P= 0
##$F2P= 0
##$FCOR= 0.5
##$FTSIZE= 0
##$FT_mod= 4
##$GAMMA= 1
##$GB= 0.15
##$INTBC= 1
##$INTSCL= 1
##$ISEN= 128
##$LB= 0.25
##$LEV0= 0
##$LPBIN= 0
##$MAXI= 10000
##$MC2= 0
##$MEAN= 0
##$ME_mod= 0
##$MI= 1.114404
##$NCOEF= 0
##$NC_proc= 0
##$NLEV= 6
##$NOISF1= 3.799351
##$NOISF2= 2.8
##$NSP= 1
##$NTH_PI= 0
##$NZP= 0
##$OFFSET= 14.38212
##$PC= 1
##$PHC0= -4574.355
##$PHC1= 4.7923
##$PH_mod= 1
##$PKNL= yes
##$PPARMOD= 0
##$PSCAL= 0
##$PSIGN= 0
##$REVERSE= no
##$SF= 200.129724274929
##$SI= 16384
##$SIGF1= 3
##$SIGF2= 2
##$SINO= 400
##$SIOLD= 16384
##$SREGLST= <1H.CDCl3>
##$SSB= 0
##$STSI= 0
##$STSR= 0
##$SW_p= 3205.1282051282
##$SYMM= 0
##$S_DEV= 0
##$TDeff= 0
##$TDoff= 0
##$TI= <>
##$TILT= no
##$TM1= 0
##$TM2= 0
##$TOPLEV= 0
##$USERP1= <user>
##$USERP2= <user>
##$USERP3= <user>
##$USERP4= <user>
##$USERP5= <user>
##$WDW= 1
##$XDIM= 8192
##$YMAX_p= 0
##$YMIN_p= 0
$$ End of Bruker specific parameters
$$ ---------------------------------
##NTUPLES= NMR FID
##VAR_NAME=  TIME,          FID/REAL,        FID/IMAG
##SYMBOL=    X,             R,               I
##VAR_TYPE=  INDEPENDENT,   DEPENDENT,       DEPENDENT
##VAR_FORM=  AFFN,          ASDF,            ASDF
##VAR_DIM=   8192,          8192,            8192
##UNITS=     SECONDS,       ARBITRARY UNITS, ARBITRARY UNITS
##FACTOR=    0.0002768,     1,               1
##FIRST=     0,             0,               0
##LAST=      2.2672688,     0,               0
##MIN=       0,             -142127,         0
##MAX=       2.2672688,     154877,          0
$$ Real data points
##PAGE= N=1
##DATA TABLE= (X++(R..R)), XYDATA
0 0 0 0 0 0 0 0 0 0 0 0 0 0 0 0 0 0 0 0 8 -8 8 -8 8 -9 16 -16 16 -24 24 -28 32 -37 41 -48 55 -61 68 -77 88
39 88 -97 109 -120 133 -149 165 -181 200 -222 245 -269 296 -327 359 -397 437 -483 534 -592 660
59 660 -738 829 -938 1071 -1237 1448 -1730 2119 -2668 3373 -4552 154877 121253 -104611
73 -104611 -108122 39948 76708 -29945 -61520 3422 42662 25923 6022 -26301 -41597 -8462
85 -8462 46985 51903 -8207 -47939 -5898 28588 116 -24088 500 24093 4966 -18618 -5640
98 -5640 -10508 -32169 7729 61390 18768 -57780 -40694 39188 42342 -23395 -24035 30350 27021
111 27021 -14107 -23271 -9525 2854 15446 23130 -991 -40460 -23006 27804 15032 -29269
123 -29269 -8635 40297 17929 -48829 -34099 48518 43772 -36077 -30851 45115 38731 -47513 -57303
136 -57303 36664 66789 -16800 -56122 -1097 29505 -4648 -26119 286 19909 3261 -4286
148 -4286 -1704 -16169 -10312 25673 30897 -6255 -27170 835 24473 -4820 -25291 9952 29266
161 29266 -5419 -30737 -8623 14939 -2639 -15620 12736 19817 -14221 -22332 5051 16748
173 16748 2060 -3220 12068 9520 -13916 -9445 9000 3946 -1764 6447 4850 -12944 -19358 4526
187 4526 15396 -11173 -14544 18815 18105 -23111 -31025 16458 43020 -1530 -34799 3152 32554
200 32554 1975 -28563 -9413 24924 18455 -13050 -18121 -7120 -1216 8018 8355 -7607 -13985
213 -13985 1405 16374 115 -23138 -1214 31004 13912 -17689 -13741 9020 10726 -4379
225 -4379 -644 10212 -4580 -14879 936 7186 -6631 -12314 3723 16690 -2404 -21627 -5162
238 -5162 14120 10940 1319 -2957 1 1603 1210 5511 -13 -8349 5109 14109 -5349 -21943
252 -21943 -8285 16093 11141 -15063 -11055 9889 3948 -9796 -3573 9502 9612 -1995 -2166 5668
266 5668 -871 -5407 5340 8726 926 -6454 -5416 650 -2020 -5397 2380 2551 -5629 -3108 1675
281 1675 -424 -4727 339 13342 8274 -11121 -6430 10729 8007 -4342 -4905 5835 7272 -7742
295 -7742 -9946 463 1237 -395 488 -2425 -3914 -3977 715 5638 -294 -2431 6594 5889 -2344 -4045
311 -4045 1774 8741 3143 -4565 851 952 -6636 -4006 2380 1484 -3637 -5344 1544 1630 -6765 -2252
327 -2252 7453 5493 227 -1971 867 4202 721 874 4883 354 -2245 -463 -2014 -3217 -2696 119
343 119 3221 -3544 -8069 -199 2390 -1163 -535 2359 4962 1375 -3330 2265 4669 626 2511 2561
359 2561 -652 -2276 -3390 -333 1308 -3768 -2476 561 -2129 -3073 -2874 -606 4347 2125 75 1911
375 1911 -463 443 5241 3111 124 -573 606 3350 -2323 -7083 -763 2728 273 -2463 -6270 -3736
391 -3736 2022 2035 1028 -1515 -2098 4939 5471 -982 -2549 850 6921 6671 -4031 -7014 3 3303
407 3303 1679 -3870 -6134 -750 550 -1558 -1420 -3664 -1194 5553 3674 -855 -2619 -692 6157
422 6157 6167 -708 -1610 -254 1963 2416 -3413 -3958 728 -287 -1576 -2413 -3930 -1435 -571 417 3865
439 3865 566 -3193 -34 3308 5690 2857 -3609 -458 5355 2613 -1942 -5067 -2236 3348 944
454 944 -2823 -4150 -6652 -1195 6283 2843 -4628 -6722 1394 12687 4516 -9990 -5469 9927 13625
469 13625 -658 -14346 -4100 10837 6335 -5342 -9783 -3661 5010 2553 -4888 -5513 -3594 3084
483 3084 8350 1468 -7131 -5199 5741 13606 2612 -11288 -3330 9633 7808 -4071 -11110 -1278
497 -1278 8465 1289 -7313 -6804 -480 3949 -209 -3113 823 -63 -1435 3768 4904 49 -2774 765
513 765 7608 3177 -6186 -2259 4132 1574 -3334 -5030 579 1776 -6879 -4498 6372 3835 -7236
528 -7236 -7926 6681 14403 -2321 -13285 2529 15267 5512 -9392 -8411 6561 9659 -2684 -7190
542 -7190 -3865 -787 2323 1385 -3001 -5423 -4643 4581 9322 -2600 -10492 -697 12711 11055 -6680
557 -6680 -12121 4673 13201 2561 -8632 -7841 3529 7621 -2297 -8741 -4835 1270 4605 465
571 465 -4212 -2768 -1579 3452 8201 552 -6562 2 9023 6877 -5981 -8685 5109 9101 -2377
586 -2377 -8410 -2923 4404 486 -8141 -2189 6532 -347 -6903 -802 7720 4016 -6987 -3004 10069
601 10069 6904 -4608 -4110 1764 4621 1452 -3761 -2263 -1338 -1453 1316 -625 -5293 -4025 750
616 750 5704 2303 -7278 -3745 6929 7643 192 -5484 -1562 7240 5786 -2324 -5143 -3284 3516
631 3516 4877 -3773 -7383 -2648 2220 3664 -1909 -5970 -1680 3447 5599 2224 -5519 -3053 7207
646 7207 7910 -706 -6895 -1491 8670 4007 -7562 -6122 1645 4202 -824 -6555 -2493 2182 -238
661 -238 -949 219 -49 999 1644 2204 2142 -1694 -310 4514 1617 -1596 -1018 -433 425 -1315 -2282 -316
679 -316 -1799 -2111 896 -614 -1843 -476 604 2355 1608 -1143 1852 2857 581 716 492 730 1164
696 1164 -1336 -1258 -277 -2224 -1041 -673 -2241 -595 -188 -1012 -152 -340 861 2381 -283 350 3090
713 3090 1515 204 117 1015 2106 -997 -2603 591 -117 -2414 -2069 -1597 299 -329 -2568 -493 1097
730 1097 402 1296 243 156 2617 1848 868 558 -456 1777 1489 -1959 -2012 -702 -120 -31 -3078 -2621 964
749 964 -380 -1502 -71 181 1036 1248 297 1719 1308 489 1896 590 20 867 -985 -976 -88 -1335
767 -1335 -1076 -1405 -2038 -56 -120 -1508 -123 214 933 1859 -368 726 2723 923 805 860 292 1024
785 1024 -359 -913 283 -1551 -2120 -70 -1370 -1274 -877 -1591 539 429 -671 864 1084 1011 2379 888
803 888 29 1207 531 1011 250 -2161 -264 351 -1283 -1598 -2065 -692 916 -1374 -1775 805 555 887
821 887 782 -242 1415 1956 1119 1241 -249 -211 2020 -120 -1508 -1140 -1045 129 -957 -2916 -673 138
839 138 -773 56 -334 -64 1345 500 1406 1729 -165 1221 2107 53 -5 -588 -472 652 -1375 -1782 -446
858 -446 -1801 -946 87 -1193 -577 -148 133 1752 186 -46 2298 1476 609 887 321 654 -71 -1063
876 -1063 834 -375 -2716 -1180 163 -388 -1434 -2345 185 1776 -581 -85 1080 551 2007 1559
892 1559 349 613 187 1258 2165 -1364 -2235 121 220 -341 -2095 -2408 499 18 -1034 410 -523 -535
910 -535 1854 1603 903 -335 -30 3021 2135 -1598 -512 1105 47 -1042 -1505 -212 -600 -2691 -475
927 -475 1737 -1469 -2602 -123 2206 1749 -1764 -686 3410 2149 -87 369 311 576 344 -102 795
944 795 -1688 -3200 656 1555 -1830 -3086 -1894 2297 2116 -2217 -1804 1343 2080 2804 225 -1723 907
961 907 2546 2063 -608 -3290 -161 2315 -588 -2591 -1792 -1044 398 -56 -621 -971 -2293 825 4453
978 4453 457 -2903 -55 4402 3967 -2509 -3576 3000 3379 -2297 -2772 403 1124 -1888 -3161 1160
994 1160 1073 -3843 -1448 3299 1476 -2099 -2099 3047 4270 -1077 -1581 2574 2004 -672 -1079 539 1087
1011 1087 -1614 -2288 1221 415 -2870 -2351 -37 1793 68 -2061 -242 2033 1328 1234 -336 -667 2304
1028 2304 2518 -256 -1658 -802 1614 396 -2528 -795 152 -2217 -700 1107 -550 -2411 -1643 3439
1044 3439 3443 -3139 -2989 3930 4836 -422 -3699 754 5307 -168 -4424 103 2025 -1257 -2637 -205
1060 -205 1300 -2166 -3534 2280 2897 -2749 -2334 2597 3585 -211 -2635 1273 4049 -327 -1701 779
1076 779 1071 -467 -1796 -674 777 -1421 -1794 499 -110 -1192 -183 371 449 344 617 1867 43
1093 43 -798 2026 1594 -778 -373 788 539 -1100 -1650 824 -526 -2680 346 1604 -1590 -2420 215
1110 215 2978 660 -2902 514 4208 918 -1869 -320 2271 1793 -2060 -1237 1931 -534 -2753 -45
1126 -45 1027 -1581 -2659 245 2792 -965 -3265 1560 2863 -396 -1078 1061 2619 416 -1293 1072
1142 1072 1481 -1547 -723 925 -224 -1782 -1696 690 596 -2218 -1094 1917 170 -1200 -74 1582
1158 1582 1468 -515 349 2256 275 -1184 1076 941 -968 -1425 -79 1055 -1338 -2466 871 1067
1174 1067 -1919 -1303 1083 1529 -634 -923 2086 1994 -1058 266 2059 531 -611 -678 1095 372 -2234
1191 -2234 -960 1419 -898 -2276 -486 636 -130 -1643 -239 2283 307 -1326 1471 1827 144
1206 144 -709 758 1870 -410 -2018 851 968 -1809 -1468 249 315 -1006 -1786 696 1059 -1551 -432
1223 -432 1606 653 -50 -47 1524 1099 -1036 -137 1837 -52 -1484 -97 231 -551 -1849 -794 1160
1240 1160 -674 -2096 576 1036 -397 -280 482 1624 216 -644 1287 1516 -850 -159 934 266 -813
1257 -813 -1357 348 529 -2123 -1068 723 -220 -1033 -89 936 724 -934 -29 2345 536 -788 686
1274 686 1336 486 -970 -573 1230 -453 -1679 67 76 -1091 -734 -135 295 -420 -1209 1049 1494 -409
1292 -409 149 1216 1035 293 -302 756 1140 -955 -572 778 -354 -1149 -693 -63 -128 -1263 -967 1102
1310 1102 53 -846 477 1179 821 67 71 1255 414 -585 767 478 -556 -297 -34 14 -530 -1333 106
1329 106 98 -1354 -509 603 75 45 49 842 1289 -121 334 1481 318 -255 297 310 58 -728 -888 707
1349 707 -582 -1224 -162 266 -238 -461 -214 617 159 -539 884 1233 216 125 205 479 341 -803 -235
1368 -235 477 -850 -779 -223 -415 -222 -493 -312 221 -496 -149 939 133 70 507 407 680 413 314 550
1388 550 -167 -427 305 -240 -769 -439 -508 -55 -509 -1017 113 457 -326 95 370 527 518 -9 478 894 -244
1409 -244 210 438 47 -199 -503 -612 344 -590 -1213 -118 -161 -259 -115 -342 248 671 89 628 354 133
1429 133 576 264 428 781 -443 -267 121 -382 -354 -520 -826 -101 -212 -777 -155 -1 218 523 -169 308
1449 308 1004 115 385 411 258 322 77 -1 236 -817 -687 -199 -124 -62 -450 -913 357 560 -656 -17 556
1470 556 554 519 -202 338 1188 -103 -94 411 117 15 -641 -288 269 -621 -1030 4 21 -57 -256 -414 812
1491 812 656 -333 447 915 407 274 -53 664 499 -799 -546 368 -127 -438 -737 -298 340 -558 -857 117
1511 117 286 33 130 -101 593 930 417 316 309 213 240 19 78 390 -513 -656 73 -179 -583 -687 -216 508
1533 508 226 -569 286 678 379 238 -125 656 1152 -310 -132 450 247 -144 -457 -2 172 -944 -759
1552 -759 458 -146 -638 -148 120 698 87 -195 429 804 75 183 646 534 265 -666 -51 305 -567 -652
1572 -652 -37 -298 -316 -730 -333 -14 -140 -116 331 -159 241 386 78 367 554 -4 134 -50 -102 -209 -599
1593 -599 -429 129 -413 -447 -9 -291 75 -318 -303 501 483 294 236 274 572 411 -172 312 577 -487 -298
1614 -298 -177 -257 -408 -844 -196 394 -736 -681 -37 255 44 216 41 676 438 40 590 465 124 -16
1634 -16 -229 219 88 -655 -422 -53 -619 -216 -96 -13 117 -106 128 457 -167 87 722 226 257 213 10
1655 10 -48 117 27 42 -416 -446 40 -493 -429 -289 -73 151 -215 -158 579 348 103 275 518 403 222 -142
1677 -142 197 152 -488 -37 255 -307 -387 -538 -287 89 -494 -141 243 23 -122 255 222 639 401 -56 532
1698 532 244 -162 174 -77 -22 -134 -459 -115 -240 -430 -47 -25 -194 230 48 171 246 96 346 386 -32
1719 -32 334 487 6 -79 95 -84 -114 -522 -435 25 -467 -258 50 -87 23 131 -21 547 390 91 456
1740 456 291 160 396 349 459 -141 -467 128 -207 -427 -282 -148 -327 -63 -198 -65 148 -52 52 369
1760 369 187 293 114 11 579 8 172 165 -99 -27 -52 -587 -427 -204 -219 42 -309 -355 221 -49 -78 250
1782 250 15 284 420 115 335 417 -57 38 142 -105 -80 -364 -453 -16 -474 -391 150 -180 -12 -22 146 406
1804 406 108 13 446 175 46 18 -153 169 134 -128 -208 59 -357 -121 -329 -320 -146 -248 -278 -164 -86 283 372
1827 372 12 363 299 -73 374 182 82 236 -158 -43 -47 -409 -296 -197 -412 -164 -172 -156 185 301 -42 210
1849 210 584 348 239 30 262 346 -26 100 233 -159 -233 -337 -221 43 -483 -254 -144 -389 55 -31 7
1870 7 413 125 -144 109 429 227 296 72 198 357 -64 -208 -2 -348 -94 -392 -627 -151 -110 -305 12
1891 12 170 250 284 23 378 469 -8 289 120 271 140 -378 153 -4 -288 -479 -206 -193 -122 -411 -270 302
1913 302 -62 -15 303 258 281 162 196 442 459 -42 20 187 -17 -214 -353 -63 99 -356 -326 -97 -292 -256 68
1936 68 -141 404 242 -26 411 149 290 302 122 128 149 -272 -57 -241 -386 -61 -387 -299 300 -217 -279 200
1958 200 35 74 169 -42 381 334 -47 96 128 130 -66 -323 -58 149 -388 -373 80 -271 -206 -106 -402 293 45
1981 45 -179 260 175 298 244 135 510 338 -374 97 251 -151 -257 -409 -186 -104 -455 -96 318 -86 -139 127
2003 127 -127 210 46 -8 420 467 176 -39 -133 316 28 -114 -72 90 -185 -65 -287 -123 -18 -52 -57 171
2025 171 -3 198 209 201 343 448 -101 349 140 -96 157 -161 -168 242 -504 -403 -107 -347 -259 -266 -186 47 180
2048 180 -3 388 143 107 274 154 445 110 -438 154 230 -454 -182 25 -170 19 -239 -96 -12 -150 -161
2069 -161 186 107 241 359 176 510 79 86 325 3 -6 10 38 -48 -55 -248 83 -337 -390 42 19 -133 67 137
2093 137 285 190 3 433 371 -332 244 345 -17 -171 -192 8 91 -528 -233 131 -218 -384 -139 -53 30 -364
2115 -364 -206 580 162 41 53 269 97 14 -16 345 88 -243 -262 -14 -443 -220 12 60 -4 -553 133 96
2137 96 15 -100 362 310 295 237 59 92 -169 45 376 -202 -112 -183 -183 -150 -414 -335 315 -51 -215 159 -20 -34
2161 -34 15 217 486 100 -189 213 189 -257 -17 95 -69 -364 -525 50 31 -494 -342 121 10 -43 -27 55
2183 55 412 55 166 371 6 63 167 308 355 -75 -146 126 -286 -139 -61 80 -420 -235 -77 165 157 -240
2205 -240 415 180 6 295 196 415 -190 -201 147 206 -437 -177 197 -133 -235 -294 -44 203 -235 -102 180
2226 180 91 -208 190 314 62 -22 200 282 31 -446 261 68 -284 -111 -346 -160 -4 -199 -128 186 -120
2247 -120 36 67 85 230 -5 -40 381 -96 99 315 134 -56 92 48 -341 -224 -321 148 -271 -398 -7 87
2269 87 -45 -147 -53 411 43 26 316 275 -142 79 -21 157 125 -402 25 -27 -367 -303 -8 -128 -294 -290 28
2292 28 170 -133 -44 372 120 -15 107 305 269 -6 34 293 87 -269 150 -50 -79 -81 89 125 -48 -142 -153
2315 -153 185 -181 40 66 409 136 175 351 44 -72 111 252 -12 -171 -322 -46 54 -159 -269 446 -70
2336 -70 -169 -119 168 328 -37 -1 178 256 92 362 349 83 -160 -273 136 -170 -358 -193 139 -310 -262 -119
2358 -119 90 44 -43 79 241 -35 202 326 146 -53 241 207 -79 -183 59 156 -418 -139 -100 -92 -214 -234 -205
2381 -205 334 -4 -66 370 199 -22 305 112 79 68 -138 251 -69 -332 61 -57 -80 -332 -272 -33 90 -127
2403 -127 184 160 23 79 -39 77 142 348 -64 126 227 -25 -149 -29 -14 4 -95 -162 -230 -231 -65 -144 -8 48
2427 48 106 82 139 -97 54 237 -1 191 -43 110 -79 -2 -104 10 -227 6 24 -250 -99 94 116 -150
2449 -150 -109 -21 225 68 243 141 158 219 -16 -14 125 -73 -219 -1 -169 -228 -291 116 -236 124 -208 112 67
2472 67 81 256 42 107 185 -19 -83 139 29 -40 148 -266 157 -116 -135 -81 19 82 -211 -262 95 302 21
2495 21 23 284 304 76 200 65 58 75 4 130 -114 -126 30 -220 58 21 40 -129 -15 -236 -228 -85 212 132 208
2520 208 229 299 117 -87 155 88 87 8 -78 93 -104 -5 -195 -91 -10 -146 -208 -6 302 16 111 169 128 -93
2544 -93 179 -2 202 -82 -43 -177 -155 -163 -72 45 -95 -93 -179 180 -139 196 -85 -136 162 202 17 229 140 13
2568 13 206 -23 135 187 -204 16 21 -262 -230 64 -211 -66 -42 -54 52 49 -67 95 64 95 333 -100 368 64
2592 64 -31 181 137 -126 -98 -75 -44 -132 -180 5 121 -136 41 398 18 81 95 168 108 -44 177 280 77 -106
2616 -106 152 154 17 0 -177 -112 -134 -150 -45 -99 173 29 196 228 263 -89 184 136 -120 63 58 83 14 53 69
2641 69 132 -53 -95 17 -63 -131 24 111 151 -140 -31 244 21 -111 243 60 -38 -19 46 -105 134 -326 -84
2664 -84 -154 -255 -200 17 16 -120 -69 8 181 68 44 172 226 178 152 -21 139 -117 -98 54 -15 -103 -8 145 -3
2689 -3 -99 -264 113 13 85 -61 -45 48 -13 -8 97 235 212 66 13 -185 77 -52 175 1 -168 126 -15 -150
2713 -150 -6 -176 -160 66 139 219 50 68 -139 266 110 61 123 86 21 227 -178 -134 -117 -178 41 -221 -88 -109
2737 -109 138 1 165 -73 48 63 -23 240 22 12 54 -132 -70 -134 -42 -210 35 -252 -56 1 -185 -76 36
2760 36 -77 241 -164 92 77 75 -136 -78 -131 104 20 -152 -40 -28 27 -50 -103 60 66 -171 -27 -134 -166 110 124
2785 124 171 -75 -61 43 219 100 214 204 76 -14 40 -303 19 -212 -201 -109 140 0 -32 125 -190 7 -124
2808 -124 76 182 78 141 94 -130 48 -130 -92 59 -226 -41 -53 -12 -167 -268 30 -6 -39 116 80 -383 -41
2831 -41 169 204 -201 -58 -93 211 -61 -29 195 78 -126 -161 -90 -106 -140 110 227 162 -221 -72 283 19 81
2854 81 -3 -52 47 27 93 200 38 -168 -183 0 -2 -298 129 -1 -176 -165 138 -116 -88 82 -77 175 169 88 33
2879 33 -268 -68 27 -16 -235 -140 72 68 31 -277 -174 -37 -191 -46 -13 105 -123 -109 -16 70 216 -38 126 179
2903 179 -8 -257 -26 97 -128 -214 -223 -134 -273 38 -145 -4 -119 35 55 73 83 97 -73 119 43 -155 25
2926 25 68 141 -55 94 -313 -162 -84 -111 137 123 28 -130 -74 76 -50 29 -3 153 -35 148 -79 -15 67 -68
2950 -68 -122 -156 -45 -127 -99 -100 8 14 -190 -165 -75 230 258 84 76 59 121 75 -17 -54 -22 60 -78 79 -238 -141 -37
2977 -37 -142 -38 -126 -190 -61 -6 9 200 183 65 24 141 134 49 -1 -79 4 -113 11 247 -173 22 -150 -44
3001 -44 -55 -176 -173 72 -122 -64 -115 -66 29 123 -78 120 77 73 43 -19 -78 -36 25 -63 100 -102 56 -49 -224 117
3027 117 -58 -69 216 -47 -1 13 95 180 52 222 -206 -40 -31 -243 108 -223 19 -263 -4 189 101 -97 2
3050 2 -43 -84 149 -199 -109 98 -231 43 -127 11 7 -101 -115 -32 -47 12 60 -258 162 -76 121 180 -50 69
3074 69 117 155 112 218 -70 172 85 -52 -179 -20 -164 -92 -73 -174 31 -7 25 -56 15 42 47 25 93 83 -245 112
3100 112 -17 -107 -7 -32 -80 -33 -83 137 -84 -11 -66 -23 -364 -4 28 -195 -12 81 204 90 59 -48 48 -98
3124 -98 -75 -34 49 -164 -244 -129 108 -133 -122 -79 -128 -132 82 -41 -2 -60 -34 144 131 24 3 172 284 98 -104
3149 -104 -109 -28 -113 5 -44 -57 83 -235 47 65 -198 -144 -90 -44 69 -36 -70 116 19 -144 125 32 -99 -115 -143
3174 -143 -144 -246 26 15 55 -478 63 179 -159 74 139 170 20 -29 170 80 -97 162 -12 -113 -105 156 -19
3197 -19 -40 -215 -170 100 -170 -96 -129 -41 -70 -45 143 196 128 80 245 62 -48 42 -157 106 201 -3 38 11 184
3222 184 -209 -234 -189 147 -133 -58 62 -27 -115 231 -18 -29 17 -55 168 3 -45 6 -79 -54 42 155 -27 13 49
3247 49 -108 -254 -8 127 202 -111 82 -17 71 55 56 186 95 151 70 -27 -117 28 -152 -23 -23 -228 -266 39 196
3272 196 34 -96 -13 71 36 111 184 222 44 56 76 99 148 -5 136 31 -259 22 133 36 100 49 151 63 -148
3297 -148 170 -12 -97 168 40 94 105 -174 1 36 -18 -13 39 -224 -238 -209 -195 -43 -94 -130 390 -115 104 74 64
3322 64 113 116 90 119 -119 68 74 -44 39 52 -227 -235 83 -463 -84 225 -114 -73 203 86 233 98 104 224 -103
3347 -103 30 186 -101 -23 13 201 28 -212 96 286 -188 76 -111 19 -80 -143 48 33 42 92 216 130 -32
3370 -32 -55 80 -9 -45 -6 -88 -146 -111 158 -55 -131 -40 51 136 57 -181 32 106 17 217 48 95 261 5 -245
3395 -245 111 23 -418 -42 -43 -69 175 -89 7 -165 -90 -29 -48 64 179 -26 243 31 -149 45 219 110 -32
3418 -32 -143 -86 85 -117 -2 -90 178 -28 116 -130 -124 54 54 180 218 82 298 -44 263 234 145 160 112 -70
3442 -70 -72 -123 -103 78 -116 -115 110 -84 -35 -144 -61 -32 67 0 13 276 0 -47 39 16 180 -130 -39 116 113 1
3468 1 -107 -36 -25 -114 -253 -65 237 101 4 -114 235 -52 -107 137 23 35 112 -59 -136 42 -182 -138 29 -135
3492 -135 -22 -115 -147 128 223 97 49 276 128 9 53 57 279 158 -25 110 -130 80 -12 -253 -29 -62 -226
3515 -226 30 -118 -28 -147 -178 234 98 20 138 293 114 -81 -81 52 64 -87 -165 -15 -44 -74 -166 -155 57 -55
3539 -55 -131 -95 46 99 15 -95 143 226 214 214 18 144 -153 19 -18 -49 -54 88 -115 -96 -143 -30 -79 -137 68 38
3565 38 13 36 12 -63 -27 5 168 159 -135 91 -136 -33 49 -101 -178 -344 -116 -71 -161 -114 218 176 128 200 25 46
3591 46 147 -44 136 -34 75 80 -54 -24 -100 -79 -92 69 -70 -41 -41 -57 150 75 -83 172 84 92 112 28 47 -41
3617 -41 52 -50 -34 -34 -229 -224 -32 -148 -191 -153 29 -190 85 -79 11 107 293 52 63 81 194 106 207 65 60
3642 60 -220 161 18 -187 -326 -141 -341 -18 210 -107 33 -237 -30 197 133 157 48 -56 25 -81 -109 73
3664 73 203 -165 78 -85 -60 -309 -66 -29 -22 -118 39 45 102 157 78 -15 211 -31 105 66 -142 103 88 -49 133
3689 133 -58 -37 138 -181 -17 -4 -55 16 95 68 112 12 143 208 -39 17 319 9 -24 146 69 -32 -218 -188
3713 -188 86 14 74 -8 -101 122 21 -6 111 221 -11 135 -244 -61 254 43 -80 145 -143 -114 -223 -384
3735 -384 -57 -68 -229 203 254 71 -116 -86 106 157 71 123 99 -76 96 -2 -87 20 40 -158 96 -127 -186 -307
3759 -307 -168 -25 -6 -273 0 -12 -92 55 96 -19 120 52 30 231 -9 -127 -72 94 -48 162 5 -37 69
3782 69 18 47 -81 9 29 -83 12 214 193 369 175 125 114 -31 25 -96 -25 -44 90 -355 -41 166 164 -93 -260
3807 -260 -136 1 -69 -6 -1 -86 97 19 20 150 133 14 -48 -166 -145 45 -203 -146 169 -48 -43 -38 -54 -36 48 197
3833 197 149 28 -15 207 134 161 20 71 -21 25 11 -115 -76 -317 192 4 -111 -95 -295 -236 93 -164 -33 44
3857 44 64 21 78 -2 -17 138 -153 -14 -268 -144 -142 -115 -81 -59 -199 5 8 -96 103 -138 184 54 34 181 166
3882 166 77 94 112 32 48 132 -8 194 -162 -20 48 -390 -104 -6 -62 91 -68 -120 -88 158 -7 -88 -14 -139
3906 -139 248 -13 200 162 -124 -87 -298 -171 25 -43 21 -3 76 9 112 22 33 79 -36 287 -7 135 244
3929 244 79 -105 21 -21 -100 73 135 89 57 -33 43 -32 -91 196 136 -30 -82 68 3 153 -156 9 -122 -216
3953 -216 26 449 7 197 -78 10 -88 58 -221 -164 145 -84 55 11 214 183 99 203 173 153 201 -48 101
3976 101 -57 -90 -192 -217 90 -229 -88 -255 9 -84 -152 151 31 15 -51 -148 0 3 -1 76 43 -98 -114 -116 46
4001 46 285 -92 -325 -148 -48 94 -135 56 148 95 -131 43 193 49 199 -87 19 33 -101 135 -46
4022 -46 -40 -74 128 -148 47 82 -99 30 -283 -51 11 -45 -5 -40 76 208 106 125 108 -126 12 -54 84 -93
4046 -93 113 -147 40 106 -303 -15 -5 -123 142 -67 -41 93 33 127 276 47 -1 242 -26 15 -107 35 44
4069 44 -195 -118 -236 -82 10 114 65 -22 -90 -86 154 96 -99 355 74 186 14 -65 243 207 -172 103 25 -32
4093 -32 -182 2 -136 -170 -136 66 -133 -146 127 161 181 82 117 33 146 -40 159 -140 -137 -92 -69 -295 62 -127
4117 -127 -405 -46 -55 -91 -153 -115 26 81 -241 -139 148 10 152 -74 -88 -171 170 35 136 79 -109 109 -115
4140 -115 -68 -127 -114 -22 -309 -69 63 118 -112 160 18 48 91 128 126 -104 -231 38 27 -90 -85 -63 -58 80 96 -7
4166 -7 164 1 31 100 15 77 78 70 288 32 144 43 -1 49 -66 -111 165 -57 -19 -142 -34 -117 194 175 179 -79
4192 -79 79 130 78 93 37 32 -17 33 -100 -13 -95 -148 -200 49 99 -84 -40 -31 14 13 128 184 15 31 51 -41 -47 201 -68
4221 -68 232 -6 -333 -121 -89 -196 108 -235 -94 -265 -99 -62 12 -71 106 45 8 23 -19 -31 29 -45 116 279
4245 279 -49 0 126 -263 -83 -427 36 334 -22 -134 -63 84 123 34 52 60 -51 48 -35 19 -153 120 13
4268 13 36 -42 -205 -64 272 -333 -193 44 30 51 198 6 280 98 1 133 43 142 292 46 123 -84 -31
4291 -31 79 -2 -124 63 -42 0 -89 -131 26 315 31 222 59 96 102 -107 9 249 90 134 -146 -88 -66 104
4315 104 -75 14 -261 -13 -168 -271 -56 -25 166 23 -128 -4 67 146 -58 181 -112 -8 165 49 -150
4336 -150 -287 -236 97 104 112 9 5 -14 118 152 -33 53 99 -26 148 -39 142 170 66 49 -9 20 -59 -82 -63 -103
4362 -103 -125 -121 -61 -162 -67 35 107 203 101 -108 100 -80 270 78 16 8 24 -45 170 -170 -192 -31 -125 -14 32
4387 32 99 -108 -20 -79 30 -33 136 63 13 -93 99 -148 204 10 239 74 175 -310 27 -307 -105 -91 -48
4410 -48 -118 39 13 156 -109 104 180 100 92 125 112 -93 68 -171 -9 15 10 30 -61 -35 -76 82 -145 -150 133 -74
4436 -74 -18 -52 -81 137 -84 -177 -64 -50 30 102 -195 3 -55 -137 162 -200 -229 42 -23 102 -24 -13 -114 -37 -83
4461 -83 132 30 55 81 80 -58 6 -169 -210 -13 125 -3 -46 -184 -138 -30 -223 -23 -44 -248 54 160 48
4484 48 430 98 88 81 44 43 -124 63 -94 -217 -174 -85 -96 -129 3 -45 -216 5 -109 -24 48 -2 205 126 164 299
4510 299 160 132 96 -65 190 -24 6 156 -194 -3 -49 -154 -112 209 63 107 -83 135 118 119 28 71 -70 84
4534 84 158 14 -53 46 -29 -15 -160 -151 39 -270 -47 -85 19 -95 -43 72 51 190 58 21 125 -12 132 -130
4558 -130 -2 -65 167 -104 69 -133 -106 189 -149 -50 157 -268 -191 -110 47 27 172 35 114 -118 66 53 -165
4581 -165 152 -115 -215 -34 -92 -102 87 -124 40 46 -25 -69 311 135 97 -103 88 67 47 -204 -34 -198 -57
4604 -57 -19 -29 51 -207 8 8 63 -65 65 10 137 32 153 -248 215 -14 -98 144 30 -69 30 -18 78 190
4628 190 -140 85 -197 -154 171 -4 14 108 -79 243 -22 1 265 -78 146 58 -45 -62 -20 -202 -129 -44 -162
4651 -162 98 2 129 -118 -8 -250 115 8 30 173 145 127 167 32 -143 8 202 158 56 -96 -132 -243
4673 -243 -93 -151 -161 -110 -51 -71 -36 111 -53 101 15 5 75 203 148 182 -179 -16 -169 -143 -175 -152 -65 48 -22
4698 -22 -231 258 -130 99 105 63 -50 -27 92 25 222 186 255 151 19 40 -20 198 -125 0 -34 -253 -90 180
4722 180 164 5 -25 25 -203 -81 -32 8 88 -44 -38 -146 205 257 -135 -81 -84 -102 43 77 -23 -145 90 31 -89
4747 -89 36 29 126 136 246 -28 110 81 -33 -239 225 65 98 58 193 13 -104 7 -25 10 12 -105 38 -177
4771 -177 110 -2 17 127 -120 324 91 -92 -54 -46 125 -93 -81 -76 58 41 -208 -67 77 -7 349 266 197 150
4795 150 -196 111 148 53 -25 84 61 -6 -53 86 -66 -128 -128 -40 -263 -94 116 -87 83 95 178 240 -105 77
4819 77 43 -67 7 105 -187 -28 151 123 -37 265 -37 38 64 -36 -76 -110 170 -209 -92 45 128 -202 86
4842 86 73 -103 -19 4 57 81 32 -25 -75 31 -185 146 66 8 22 168 12 68 42 137 -86 227 -6 -68 -60 91
4868 91 -9 42 67 18 -145 -51 84 10 -202 31 -56 -43 66 -36 -307 39 112 186 145 -28 -56 51 -52 -132
4892 -132 24 -31 -62 6 -222 -64 168 -122 192 69 -105 -7 -72 126 -98 112 270 105 241 95 58 -1
4914 -1 79 -147 149 -224 -106 102 -108 -148 114 -100 -62 228 -139 -31 23 161 69 -104 -14 -55 191 85 -249
4937 -249 -233 132 88 27 31 -41 -305 -221 219 -91 -67 340 143 131 -77 27 166 63 61 -59 95 -127 -94 6
4961 6 51 27 3 -34 -108 39 93 -155 44 154 -41 -12 50 256 65 -104 39 -126 -82 42 136 -23 69 37 -135
4986 -135 -24 50 -138 -70 181 11 -120 12 -90 67 38 73 153 75 153 70 -229 320 -20 -38 14 87 -151 -61
5010 -61 -99 -92 -27 -87 40 -3 -88 111 -49 -88 38 74 105 -97 -4 -157 92 -162 106 39 -7 -121 162 -80 -198
5035 -198 13 154 -47 101 156 25 12 64 -11 4 67 74 -139 -25 -72 -165 -188 -38 7 -127 47 -92 -223 -198
5059 -198 210 -62 46 113 20 113 129 -23 139 23 -130 -104 -147 -211 -158 -248 -218 -2 9 14 -13 -9 -41 -146 64 211
5085 211 51 210 -23 -71 -6 171 -75 89 91 89 -225 -54 9 -133 88 -129 29 -29 -132 -94 -46 12 -60 -21
5109 -21 138 -222 16 46 11 62 182 -13 -59 -205 96 -62 -69 188 -117 70 -72 104 -50 54 49 159 164 145
5133 145 -27 22 65 -185 -122 -134 37 -45 -253 293 -130 -106 67 13 88 137 234 81 -178 -139 84 62 175 121
5157 121 -24 38 121 70 139 -90 2 -69 -206 -74 -95 20 -16 -101 -50 34 48 168 67 116 154 221 234 -31 29 73
5183 73 89 -261 34 -140 143 118 -149 160 -124 -208 166 -5 -98 277 -134 -77 137 145 144 65 -39 -2 32 15 254
5208 254 246 -155 104 -82 -27 -92 24 97 86 -94 -32 -36 130 104 116 69 55 -93 -119 215 -79 177 -65 36 -19
5233 -19 -91 -25 -199 -50 -95 233 -75 126 42 12 242 -203 18 -30 -31 -16 208 -331 -5 -69 11 -24 -138 101
5257 101 -109 -99 -62 -177 97 115 -204 113 -27 20 166 -84 15 38 -168 124 17 -55 110 48 205 -84 52
5280 52 134 -400 7 23 -91 -100 23 76 180 31 -215 11 -114 -36 -61 64 -8 122 -202 85 -227 228 -35
5303 -35 -40 -94 -162 15 -104 24 28 209 -38 -46 -28 70 110 20 68 78 163 -52 -107 44 66 112 -157 -90 -249 108 -86
5330 -86 340 -25 99 3 -98 134 -54 89 -82 141 -48 -49 38 -113 55 -94 17 9 -1 25 -21 -215 -25
5353 -25 -136 178 19 169 -15 -3 -35 -25 55 14 -33 -88 -28 30 54 -140 -39 -60 -8 -76 -168 95 95 69 85 59 2
5380 2 -194 25 21 121 8 -121 98 -265 293 62 117 180 -114 50 -23 59 22 57 -60 77 43 -156 241 -16
5404 -16 -92 141 15 -41 156 -249 44 -24 -147 -133 -75 -2 133 -2 -39 222 -135 115 -78 -63 153 -7 -184
5427 -184 46 -170 -116 95 61 38 -43 -11 -178 -318 -267 -123 119 -12 33 1 -97 -106 103 -86 197 -21 -100 -98 -163
5452 -163 19 -54 4 -87 -145 -28 -8 22 157 8 169 -63 38 -40 56 -24 104 65 -41 -55 -28 -125 -132 -13 -25
5477 -25 -105 -173 -136 173 40 -105 -22 12 -18 80 -55 131 -13 -205 226 23 -80 -188 180 83 -67 -32 -123 54
5501 54 -175 -27 -137 13 1 46 -4 102 167 -56 102 33 1 164 -140 40 -7 -76 50 -71 -219 41 46 -134
5525 -134 -32 47 -172 -113 -76 128 180 -22 -30 -91 -83 204 36 144 -143 -93 87 83 -8 -199 49 -15 -93 -142 -98 62
5551 62 4 154 52 -32 -132 -17 91 58 -80 37 34 -45 -156 133 -136 -54 189 -86 10 -46 -134 -13 -202 214
5575 214 148 71 158 269 77 97 -89 62 48 -87 283 -72 -57 -14 -39 79 30 -38 27 114 102 87 -109 1 -111
5600 -111 -29 -14 11 -98 89 -73 -210 158 -32 43 -1 150 192 72 23 47 -16 15 30 -186 15 -112 171 133
5624 133 75 44 33 124 67 22 -38 133 -34 -68 -92 -64 -8 47 104 17 -32 -22 -223 191 -73 76 266 12 100 7
5650 7 42 -40 -34 80 -16 172 -150 -202 6 -274 17 124 61 -14 89 68 -142 101 233 30 -5 23 -38 66 -26
5675 -26 139 -10 41 186 -191 -233 -68 -23 -199 31 -76 26 76 -150 181 93 157 -44 21 57 -42 86 -112
5698 -112 234 36 -63 22 -31 -92 15 -64 -111 -152 -12 211 -96 -57 100 138 28 -109 -80 -6 189 -75 131 -12
5722 -12 13 129 26 82 -68 10 6 -137 -30 -345 209 109 -17 42 -73 -132 -142 161 -148 86 5 136 69 162
5746 162 -64 -127 -41 -165 -62 -34 75 82 85 -77 -106 -168 -4 -176 -26 8 93 -121 -34 -68 -132 -11 -53 78 40
5771 40 -165 -86 -74 -47 -42 28 -34 -45 178 97 136 13 -148 97 58 23 119 -40 13 217 -20 -236 -23 177 259
5796 259 -43 4 121 125 10 -213 87 -14 -53 -3 -29 155 40 49 194 59 26 -10 174 24 -125 231 -91
5819 -91 -55 180 -37 49 -83 -83 -25 -145 -54 -121 47 3 -82 -45 197 66 -35 -25 104 115 99 -14 -192 -48 -40
5844 -40 -9 -145 -87 -86 97 -26 118 -185 -121 -83 -7 -38 56 -47 -216 218 4 144 -130 10 94 118 -14 13
5868 13 7 -70 96 -41 171 144 66 25 183 66 -87 -114 86 -130 57 -143 -247 31 50 2 -17 36 48 89 -4
5893 -4 118 61 -48 142 -113 -99 40 44 18 -13 -10 -7 116 37 31 59 13 -170 -17 -41 56 -60 106 -106 -172 105 36
5920 36 79 -194 -113 -75 97 -109 -131 223 9 48 -30 -110 -75 115 32 172 -76 -103 103 -30 107 63 255 -71
5944 -71 -5 147 -66 -132 86 -116 -8 -2 -97 19 6 119 84 -4 -275 -268 128 159 126 -52 -51 -72 47 7 76 60
5970 60 -87 -41 -100 64 -125 -11 114 3 -68 -187 -212 196 -7 -53 -33 56 263 -77 24 93 -35 47 -112
5993 -112 102 -73 -143 50 -156 82 -127 176 56 -204 111 -140 81 32 -63 23 115 -99 -60 26 180 -190
6015 -190 60 52 -38 11 30 -218 -54 -2 -40 -62 26 -99 -71 38 47 140 57 -41 123 135 22 -111 -47 -123 131 11
6041 11 27 104 -91 90 85 18 -6 71 53 -39 139 22 -20 -118 26 22 44 29 -152 24 50 -12 -60 18 8 103 -14
6068 -14 57 -4 -92 38 -9 49 8 66 45 10 72 -38 -53 34 -10 -178 160 134 -23 -11 -107 55 63 -83 53 93 -32
6095 -32 20 133 143 -212 -79 -36 25 25 -93 -74 46 -31 -50 -81 -57 -40 197 -68 70 13 -106 -6 -91 53 159
6120 159 132 96 22 105 92 201 35 -88 83 134 62 -25 -114 -114 32 -102 -54 -7 94 -77 61 -90 28 -91
6144 -91 37 -227 136 204 -87 138 -40 56 -124 -127 141 -60 5 -46 112 -112 58 -8 -105 -73 2 -3 9 102 -44
6169 -44 -181 -117 88 -30 88 28 -6 -98 -31 -362 90 -214 197 170 -22 -44 -17 3 36 156 -144 -47 -205 87
6193 87 -149 20 -19 27 -58 -152 -94 285 5 90 -115 18 -1 -122 2 147 111 -211 -158 -196 -19 25 22 -70 95
6218 95 6 -154 -7 154 5 99 89 -243 104 3 157 15 -159 -25 57 -179 99 43 -90 -88 -40 115 -55
6241 -55 -46 71 10 -223 -109 6 -27 -149 -9 95 -144 32 73 -27 59 -37 89 -90 -24 -41 -40 11 47 26 -142
6266 -142 12 -77 9 86 -18 -7 38 9 -68 -47 109 -147 125 18 323 52 38 -172 -2 -51 -134 -186 81 -100
6290 -100 20 30 21 81 -19 140 63 -5 194 34 -6 16 79 59 -161 -128 14 -58 -130 60 83 150 -82 -40 -123 79
6316 79 -99 -90 -33 127 65 -95 -153 -157 143 69 21 7 16 7 107 -60 30 69 -171 -33 -39 -129 -134 151 238 -24 -118 16
6344 16 108 -138 217 -44 84 -76 -65 -20 -78 -52 39 21 52 -139 22 193 -138 -70 108 133 40 141 163 24
6368 24 51 130 88 83 -67 -60 -1 138 5 -154 97 94 19 32 82 141 -13 -21 -76 6 -86 33 170 1 40 -135 205
6395 205 -55 -155 -69 97 206 84 -53 -37 -175 39 18 63 -75 164 11 138 -140 247 -46 140 95 -108
6417 -108 -27 -261 -18 25 133 -268 17 -90 -121 -53 -61 193 105 -21 -21 14 -151 -138 -53 -55 73 -130 6 -88 -216
6442 -216 -30 -46 211 38 75 -143 30 -41 151 -25 24 8 -96 160 -94 -18 -5 94 33 13 123 -106 -112 136
6466 136 22 257 -110 108 -73 174 79 34 -93 -76 48 124 218 -104 -50 -18 192 210 -75 143 282 -117 48
6489 48 81 183 -6 9 -80 -103 151 152 143 -45 -25 -131 28 -16 -79 182 122 -8 7 5 49 231 96 73 -163 -74
6515 -74 -89 80 -139 35 50 12 -13 208 -66 -102 74 -102 117 -8 -84 21 -160 115 -99 205 149 5 84
6538 84 -75 1 -96 -26 18 -152 99 -40 166 -167 -119 81 72 -71 50 117 49 -1 0 -103 -201 -1 236 93 -31
6563 -31 -27 91 126 67 15 -44 21 -17 192 4 6 -2 8 51 78 -118 -198 -113 2 -105 39 53 -66 72 60 -174 -45
6590 -45 -15 -86 -134 81 116 109 137 -54 51 56 200 90 228 119 -81 66 -10 -67 -190 -10 233 -38 -2 86 -56
6615 -56 33 31 5 20 37 83 88 10 157 -3 -239 2 -243 -66 -97 -25 -4 -31 -1 -21 96 230 105 -118 -145 92
6641 92 45 -20 -45 -9 -30 -2 26 -86 114 22 -24 35 -177 -64 91 40 -82 58 -195 -84 37 -153 131 56
6665 56 113 -197 233 -48 38 -79 -100 16 -153 -60 -1 91 168 -93 161 -81 47 86 99 24 -139 161 -131 172
6689 172 121 56 5 -197 161 110 31 148 -53 92 -50 100 252 -154 -94 127 50 80 171 122 100 113 -47 18
6713 18 -284 177 -67 -102 63 -9 107 -10 -60 39 6 -144 -82 66 43 -106 -64 46 -45 -165 -19 98 -18
6736 -18 -39 -102 -57 -59 42 7 199 56 95 -15 -145 148 -183 118 99 153 -67 65 129 31 -47 -82 -115 126 17
6761 17 33 32 98 174 -36 38 91 -89 -85 100 -72 -56 13 -70 -5 -199 -118 8 -200 230 -71 -147 -216 35 -96 -36
6787 -36 164 -75 -83 178 189 -95 3 -248 185 95 -245 -19 64 220 1 81 -168 -221 118 298 -170 -112 -97 -48
6811 -48 111 81 47 46 6 -55 105 247 139 171 -166 12 -334 -97 -27 -65 95 -134 98 19 73 4 107 94 186
6836 186 71 65 22 125 6 -6 -244 -14 5 -66 161 -5 -2 38 81 263 -233 78 -111 -68 66 41 -147 37
6860 37 224 53 156 -76 24 -61 54 -3 162 -106 -32 83 -16 -75 -48 24 -106 -65 88 -97 46 -21 -98 199
6884 199 99 -50 87 -69 -25 -9 18 -5 -32 302 -57 -46 290 50 223 -9 56 128 46 167 158 -24 -143 22
6908 22 -31 -106 124 -121 -46 -43 189 -29 177 -154 10 20 -313 30 111 -30 55 -1 33 -74 67 -36 7 58
6932 58 -63 159 -66 27 43 -6 -85 41 85 -23 -214 -175 -33 123 43 -73 -193 -21 106 -4 -97 150 -87
6955 -87 -60 -83 139 -94 -199 -83 -52 -93 57 274 128 -53 86 46 40 -251 22 -29 90 -61 69 -205 -73
6978 -73 92 -30 156 3 -5 -100 52 24 -93 -39 -15 -60 41 -10 -34 -38 229 -152 -30 50 -28 80 64 -88 47
7003 47 134 -61 37 -42 118 -45 -48 -56 -311 -102 6 243 129 7 -214 -65 2 74 67 185 4 49 -93 -39 143
7028 143 -187 -121 86 278 -9 43 154 57 -49 -142 107 -112 154 -54 10 20 -109 232 -44 147 37 -126
7050 -126 203 -71 -19 -137 132 68 -272 30 82 -84 21 -141 32 195 31 265 128 201 -93 -48 -7 -152
7072 -152 -110 -216 -121 95 34 -15 284 -73 -82 -47 41 159 -245 76 6 -313 154 -64 -158 54 158 -42 -125 -121
7096 -121 74 -39 132 -177 -62 68 -139 -32 -118 -52 107 -87 101 175 -22 66 -88 104 205 104 138 214
7118 214 -110 24 122 36 -88 -19 -233 -41 -30 35 109 -55 54 -8 34 82 46 -97 -179 -1 -14 21 75 17 -117
7143 -117 -37 -137 -162 85 -73 -133 23 -188 -20 -232 -97 -76 -78 115 -139 189 -63 85 -130 -161 -45 52 214
7166 214 -21 20 99 141 -54 -59 56 -63 -161 82 -66 -89 -64 -105 113 -118 -18 -77 -77 -21 95 27 166 62 100
7191 100 24 211 21 -2 76 -117 177 76 142 130 111 289 135 -131 88 -191 -88 154 -91 84 120 149 -65
7214 -65 -74 25 -14 143 4 -127 -33 61 -112 -110 214 -88 -11 -61 79 348 171 72 62 132 -141 59 114 -12 9
7239 9 99 -3 -29 82 54 -143 57 -46 18 -19 184 -76 90 -63 -28 121 -267 -209 58 -158 143 -116 160
7262 160 -109 -10 151 -35 -6 -29 -27 -18 -13 -49 81 186 -6 -50 100 159 -82 88 -76 11 -81 2 7 39 178 -28
7288 -28 191 124 -87 -37 -74 225 58 -80 -209 30 -9 148 -53 -303 -48 -21 194 -69 -20 146 210 -58 -129
7311 -129 156 30 72 22 78 -34 26 254 138 40 13 -103 -136 147 -130 -44 121 -110 48 40 -89 97 2 24
7335 24 128 21 50 30 88 -47 -18 31 178 58 209 -2 -61 68 -66 109 -61 139 112 119 -150 -121 17 -24
7359 -24 158 50 25 61 -19 -41 111 86 -117 9 -74 -8 -68 129 -103 64 128 14 -38 143 20 4 67 -6 -294
7384 -294 25 134 -150 74 -28 -92 -70 101 -48 144 295 222 -127 -141 31 205 -118 -18 29 -53 20 -64 -60
7407 -60 128 240 146 99 -58 -219 -62 11 21 128 184 21 -8 20 -56 -261 -174 -43 -14 52 -7 155 62 -135 113
7432 113 -165 -97 46 -70 154 98 -251 107 128 32 64 -199 87 -209 -60 -23 0 -36 -3 183 57 -136 153
7455 153 -6 -32 16 -88 61 87 219 -31 176 -2 -104 65 175 76 -87 86 -6 56 99 -62 88 75 99
7478 99 206 -154 214 -199 -25 -6 1 205 -60 -105 -7 -14 -96 -132 135 -61 107 59 154 52 273 91 -131 -180
7502 -180 106 33 -213 10 -161 218 -123 0 31 -48 -197 120 9 125 -23 -162 8 25 -35 154 -90 90
7524 90 41 -18 22 117 -95 -39 -58 -63 -68 -86 67 -92 60 -38 12 -110 -58 127 73 -216 27 144 127 107 38 72 77
7551 77 -22 32 51 -63 -30 36 14 -127 -317 -100 -133 188 82 104 -20 129 55 -284 56 -21 -127 127 -152 -35
7575 -35 -10 -162 -22 137 -39 -217 80 129 25 -30 -145 -77 -45 -55 -29 -148 -65 124 125 -140 18 -271 -56 53
7599 53 148 12 -161 305 -58 -64 -215 -57 57 -18 35 -89 52 -4 118 -7 4 17 -158 161 -33 268 -141
7622 -141 3 26 -65 131 -55 -49 -174 -10 78 -13 -139 14 -5 -77 -54 215 -47 159 53 36 141 -95 -141 -15
7646 -15 89 61 152 124 -10 1 99 81 26 36 12 99 -27 27 -95 -59 -208 32 -8 -100 -50 97 -69 -208 95
7671 95 61 99 -90 -66 91 -125 177 -43 -27 176 -59 18 -14 -80 -97 133 69 -50 172 201 -19 -44 -146 -64
7695 -64 -55 -12 -11 97 177 71 36 58 65 127 -51 101 15 43 -62 -32 53 -25 130 58 -235 -123 22 43 -22 30 -174
7722 -174 63 -67 130 280 -65 121 -142 256 124 -43 114 15 49 192 223 216 -87 -63 207 260 -168 -70 -155
7745 -155 -119 -28 99 85 -78 -113 -6 1 60 4 187 0 92 -1 35 223 -34 57 100 -202 25 -34 -144 229 -160
7770 -160 4 24 153 44 79 25 -3 -88 -72 53 -140 -49 -41 -132 51 90 227 31 -18 27 -91 132 -174 -11
7794 -11 -139 2 173 187 -78 -129 30 -19 -102 -190 18 -10 11 -214 -38 36 67 -89 -161 -58 -67 -70 112 221 18
7819 18 -44 31 -50 115 -208 136 -69 65 -33 -68 142 -61 -173 49 -68 -148 -27 147 22 -168 77 -68
7841 -68 134 16 204 -33 -62 -49 -86 34 27 150 78 -14 90 127 204 -105 76 77 -133 -93 -81 55 94 130 -12
7866 -12 -144 111 -49 -125 12 -138 232 15 147 -105 11 -72 143 10 -126 -135 -68 -55 61 7 21 55 54 57 -48
7891 -48 145 -25 -7 -130 -187 124 98 156 152 -26 -3 -51 45 -157 -44 -56 -65 22 62 -138 -31 -109 -22 -182 -28 -55
7917 -55 -167 -98 50 -60 -16 211 -49 10 -44 25 123 65 -148 -143 36 61 -127 59 30 -86 -43 81 182 67
7941 67 110 76 -127 -14 -28 -42 -213 -23 -31 -151 22 4 30 92 5 25 -52 76 -343 -117 189 59 83 -55 232
7966 232 -167 -24 116 121 -7 61 84 -38 49 57 -171 -44 27 -40 255 46 316 -119 -87 16 42 -42 47 116 11
7991 11 -119 -101 14 -71 -80 -51 101 83 10 -55 -26 160 -99 -65 91 -23 -49 -312 72 183 -152 4 12 -195 153
8016 153 -149 -69 -176 118 88 -15 61 -13 66 -43 108 214 126 59 127 -345 52 -62 111 -39 50 -105 25
8039 25 -18 166 -91 -204 -85 -174 82 83 50 235 26 226 -79 56 -73 33 3 146 -40 -156 -7 3 -38
8062 -38 -103 -72 74 93 -89 -18 -27 24 52 69 -61 -54 11 24 -187 33 -123 -22 -2 -121 101 88 -65 -11 -57 22
8088 22 98 41 1 55 -92 -71 -15 19 -111 146 90 -140 111 19 -25 21 -48 72 -19 82 37 -36 107 67 3 106
8114 106 84 71 153 -68 -31 110 -13 -149 -133 -123 -121 70 -67 184 114 -70 79 27 15 36 -188 -52 133 58
8138 58 123 -50 -157 -130 37 -21 -96 -66 -14 -30 -200 48 6 -61 23 95 -107 -124 121 15 -32 61 -215 28 -50
8163 -50 38 -64 -124 53 -46 -153 -89 -21 -30 71 -61 -213 -39 -111 35 36 68 -16 52 -20 -93 84 124 39 -154 -83
8189 -83 33 -141
8191a41
$$ Imaginary data points
##PAGE= N=2
##DATA TABLE= (X++(I..I)), XYDATA
0 0 0 0 0 0 0 0 0 0 0 0 0 0 0 8 -8 8 -8 16 -16 16 -24 24 -32 40 -40 48 -56 68 -79 88 -103 116 -132 149 -169
35 -169 189 -213 239 -267 299 -331 368 -409 452 -499 553 -609 673 -741 815 -899 989 -1092
53 -1092 1204 -1331 1474 -1637 1823 -2041 2301 -2611 2995 -3478 4114 -4988 6270 -8338 12230
68 12230 -22109 103576 126741 -142127 -108793 61513 96109 -39258 -67342 11590 53084
79 53084 5211 -22778 -37343 -28465 9491 51047 32841 -25807 -53645 1551 41092 9500
91 9500 -20205 6366 26926 4238 -23948 -8791 1885 -12603 10199 46747 -440 -67559
103 -67559 -36182 46182 42475 -29697 -32766 28128 25940 -22008 -23285 6082 19454 20001 13704
116 13704 -8347 -33475 -12894 34567 20197 -29279 -13637 29883 6679 -49548 -29266 48066
128 48066 39863 -41782 -36893 40544 34313 -44359 -44026 47977 68324 -23955 -61831 7634 42736
141 42736 -1160 -27143 1628 21172 -1852 -17206 -7723 -9778 -5430 22125 20888 -16945 -30044
154 -30044 3429 28336 1768 -20320 12079 30691 -6812 -29659 -1909 23018 4466 -15226
166 -15226 5730 14381 -19126 -25820 6975 18063 -1615 -10029 4017 5561 -13394 -8115 15273
179 15273 11258 -1153 4607 4538 -9229 -11304 9362 18662 -7548 -16315 12115 11465 -25929 -27314
193 -27314 18417 36334 -9583 -40546 1666 34224 351 -27711 -1746 30798 17941 -17634
205 -17634 -17986 3811 10148 9291 4759 -10125 -14222 1362 11307 -3504 -22312 -2250 26899 6480
219 6480 -25817 -14429 14388 15264 -2698 -2504 10057 -143 -11290 4945 12397 -3121 -8974
232 -8974 4328 12144 -6282 -23116 -4240 15911 6696 -7570 -8867 -2406 2482 1899 3992 2549
246 2549 -3864 5736 13617 -3917 -16589 312 20415 10521 -16617 -13702 9571 4486 -12507
259 -12507 -5799 7296 4834 -7064 -7461 3389 1463 -3997 6418 10245 149 -5157 -1454 5307
273 5307 4108 -1800 2885 3638 -6172 -5409 1005 -1798 -4937 -1636 7036 2223 -14197 -8159 11913
288 11913 8914 -5162 -3753 7244 8555 -4635 -7027 6287 7448 319 -657 -3112 -4803 -3144
302 -3144 -434 2559 -2436 -6401 1406 2655 -5797 -4794 3393 8263 3509 -4428 1076 5448 -1669
317 -1669 2 6474 3164 -2927 -4551 345 1559 -6721 -4407 5301 1352 -5908 -5257 -1198 3147
332 3147 956 -17 4416 2010 -1492 2193 2337 706 1969 2555 3254 -2500 -7742 -238 3312 -2709
348 -2709 -3657 -702 211 -2163 -5539 -167 4689 385 720 3286 226 -99 1238 2981 4798 -489
364 -489 -1598 2129 -1405 -3698 -2324 -909 1368 -1025 -4781 -1930 -1829 -1741 3569 2616 -1434 156
380 156 2136 4270 1122 -3083 3294 6735 1186 -2645 -4257 -2095 2898 827 -3013 -3826 -4091 1299
396 1299 2394 -4387 -4063 1955 5816 4990 -3645 -5173 4820 7824 3208 -1899 -3336 1862 3208 -1454
412 -1454 -2768 -3318 -2171 2653 -67 -5991 -4958 -1206 4575 4193 -2956 -2880 2080 3910 4027 -212
428 -212 -1436 3990 3112 -571 -1244 -2389 -1017 423 -1142 -43 -2426 -6267 -2031 1981 2037 148
444 148 -4518 -761 6474 3381 -1536 -1448 2113 6469 3556 -2781 -2677 -2162 539 5238 -49 -7991
460 -7991 -7228 882 8065 128 -12717 -4949 10937 10414 -3941 -12707 176 15901 8123 -6276
474 -6276 -6691 1400 8091 3230 -6200 -5565 -1149 2635 3951 -3551 -10252 -4655 5503 9218 -1692
489 -1692 -12471 -1580 12644 7576 -4756 -7599 3566 12021 2731 -7700 -4062 2728 4483 -874
503 -874 -5845 -1709 -771 -3456 499 2035 -3225 -3971 858 6353 2831 -5254 -577 7626 4240 -1689
519 -1689 -1928 2583 3866 -3852 -4103 5410 2073 -9232 -7929 4925 9082 -6111 -15381 2244 14995
534 14995 2018 -11047 -5429 10318 11664 -2857 -6918 580 4113 4284 1250 -3876 -4872 -2184
548 -2184 3028 5086 -6087 -12148 -56 10609 5357 -10219 -11688 7077 14889 630 -8846 -3233
562 -3233 7757 9953 -1938 -7934 -1355 4576 4446 -1501 -6823 -3974 -541 1314 3423 -2863 -8527
577 -8527 -328 8209 4383 -6236 -6470 7856 11544 -1884 -7235 1254 7032 2505 -5886 -2237 5825
592 5825 -869 -8611 -2111 5544 480 -8345 -4544 8179 4842 -7106 -4229 4875 6439 2187 -2547
607 -2547 -409 2519 1582 1962 342 -4443 -2779 1693 3265 -858 -8635 -5078 6010 4693 -4175
622 -4175 -6856 -621 7789 5312 -3395 -3674 1533 6335 6012 -2743 -5850 906 4703 2294 -3281 -6757
638 -6757 -1496 3159 1727 -2146 -7233 -3609 6290 5703 -3510 -6408 962 9718 5014 -6514 -3464
653 -3464 5920 6198 -554 -5716 -1718 3306 -366 -3158 -1469 -1639 -1226 -460 -500 -114 -2116 -769 4596
670 4596 2333 -1501 636 1999 2452 1274 -479 1105 590 -1584 608 -614 -3179 -1569 -300 -440
686 -440 -985 -3060 -585 1806 -328 -421 1054 1537 2131 787 648 2242 753 504 1205 -1049 -652 -4
704 -4 -1871 -1334 -1362 -1280 173 -1988 -2122 1287 539 -621 367 1747 2579 832 -860 2518 2822 -591
722 -591 -383 291 486 -228 -2950 -1688 551 -1316 -1608 -1440 -2009 980 889 -837 98 452 1895 2641
740 2641 -268 -241 2328 1798 1171 -1279 -1760 1522 184 -2896 -1357 -801 -1252 -763 -1730 -489 251 -613
758 -613 1041 1271 154 1577 1231 667 1906 1094 279 513 -748 160 369 -2112 -1436 -815 -1129 -547
776 -547 -1838 -1585 992 -48 -402 1156 677 1482 1214 575 1991 1225 -404 1308 639 -1023 -582 -1258
794 -1258 -642 -293 -2203 -1468 -616 -1070 266 -314 -1154 1239 1253 1279 1500 -296 1206 2936 455 -545
812 -545 30 104 887 -1598 -2726 -227 -413 -1397 -1074 -1775 -355 975 -395 388 406 397 2724 1705 -320
831 -320 1056 1416 1578 583 -1915 -172 907 -1189 -1483 -1175 -1700 -357 -863 -791 271 -1077 409 2121
849 2121 350 197 1125 1214 2057 587 -592 1201 226 -496 316 -1153 -1757 -436 -1205 -376 -1250 -2167
867 -2167 322 767 -722 490 436 786 1360 171 1742 1684 -1074 231 1943 -89 -1251 -1935 -504
884 -504 898 -1773 -2364 -422 -513 -393 101 -984 -178 756 1336 2604 38 -992 2193 2424 367 -527
902 -527 -1251 836 583 -2008 -931 -826 -2014 -17 -223 -1161 -1309 -829 1875 2001 -1541 21 2767
919 2767 1543 414 210 1144 1096 -1137 -275 1777 -1449 -3037 -326 1009 -190 -2974 -2549 2162 1254
936 1254 -1836 -300 859 1261 1341 712 1508 358 -1015 1910 2795 -1442 -2744 -789 1541 870 -3286
953 -3286 -3308 820 780 72 -1397 -2412 717 2673 1474 -379 -1465 1513 4014 406 -1798 -165
969 -165 657 837 263 -1564 -1670 -2084 -237 2337 -1457 -4780 -384 3598 2308 -2908 -3181 3850 4920
986 4920 -1335 -2044 1963 2542 -131 -1807 1274 1500 -3314 -2281 2633 226 -4025 -2930 1720 2689
1002 2689 -2494 -2906 2509 2594 -656 -304 1682 2362 119 -1224 2161 1749 -2264 -1593 872 1075 -1010
1019 -1010 -3395 -1428 1127 -500 -1042 -1100 -1133 1780 2148 -669 -1188 747 2619 1961 -1087 -88 1604
1036 1604 -698 -158 1180 -907 -2567 -1310 1777 1413 -4202 -3997 3028 3759 -2141 -3850 1051 5615
1052 5615 866 -3843 874 4319 93 -1607 746 1825 -1398 -3367 1282 2404 -3475 -3569 1771
1067 1771 2103 -1940 -3533 804 3762 -435 -2263 1737 2263 239 -363 684 1941 -60 -1378 936
1083 936 304 -1635 -1043 -475 -462 -723 -907 315 -509 -1698 1121 1687 -849 86 1667 1348 104 -639
1101 -639 1487 975 -1525 541 1924 -1550 -2779 -150 1519 -621 -3723 -738 3261 135 -3019
1116 -3019 -136 2577 1760 -950 -208 3018 1114 -1700 1020 2280 -927 -2076 168 2011 -1291
1131 -1291 -4162 254 2273 -1888 -2652 487 1576 116 -1654 792 2272 -322 -128 2238 640
1146 640 -570 -460 1152 1144 -1924 -1541 1488 -239 -2447 -966 309 318 -1305 -804 1564 386 -1236
1163 -1236 1159 1845 84 54 1059 1656 -416 -1406 1211 1279 -2248 -1682 913 252 -1782 -2168 389
1180 389 1102 -1685 -929 1565 842 -712 370 1574 1101 -810 -167 2558 392 -1973 -47 1020
1196 1020 -415 -1837 -1038 1088 -780 -2648 426 1416 -786 -898 915 1810 188 -1367 1574 2489
1212 2489 -631 -615 1129 758 -796 -1339 358 857 -1687 -1458 1050 7 -1423 -819 594 796 -825
1229 -825 -313 2149 761 -790 896 1585 24 -991 -140 1514 -275 -2100 -167 889 -1160 -1229
1245 -1229 -249 349 -531 -1339 694 1405 -634 -132 1815 1147 169 -171 1148 1423 -795 -770 1198 -323
1263 -323 -1339 -639 99 -298 -1704 -1136 1162 5 -1519 333 1528 352 -282 358 1754 906 -822
1280 -822 625 1343 -653 -735 223 122 -849 -1604 -63 595 -1728 -1134 600 450 -472 -384 886 1349 -293
1299 -293 -280 1456 556 -379 73 757 128 -798 -801 636 -427 -1781 -285 315 -545 -715 -369 662 207
1318 207 -650 861 1367 -185 477 963 353 161 -307 300 603 -1005 -896 365 -436 -924 -769 -177 451
1337 451 -886 -442 996 460 -405 496 891 727 149 -64 1171 438 -844 394 400 -748 -880 -660 144
1356 144 -205 -1236 -271 774 -604 -441 398 734 648 -169 457 1345 371 -153 568 161 107 -50 -423 -44
1376 -44 -843 -934 70 -335 -787 -227 -274 -82 167 -200 622 721 116 659 519 -68 29 320 81 -39 -918
1397 -918 -308 295 -856 -725 -120 -429 -256 -424 -273 700 -71 -24 990 444 254 587 500 1005 47 -700
1417 -700 296 26 -546 -350 -648 -225 -284 -630 -318 2 -225 148 379 260 627 88 62 912 681 111 281
1438 281 -164 358 -99 -759 -384 92 -602 -62 -564 -300 414 -192 -98 227 254 542 467 262 860 299 -95
1459 -95 507 398 -96 -4 -570 -101 58 -1286 -640 -49 88 -207 -482 -473 860 126 -379 780 763 254 277
1480 277 238 833 135 -703 55 250 -445 -584 -498 -59 23 -1009 -647 468 -167 -323 -263 561 666 54 -182
1501 -182 958 497 -258 -7 7 621 -233 -941 -203 125 -601 -539 -464 -197 308 -251 -161 492 230 132 345
1522 345 234 738 47 -268 688 57 -810 -218 -91 189 -522 -1118 -458 398 -139 -542 -207 149 618 -405
1542 -405 -16 767 665 -41 275 646 564 -392 -391 523 63 -975 -456 318 -349 -648 -984 64 571 -386
1562 -386 -47 264 499 372 -62 120 1067 462 -153 383 57 -100 -391 -231 137 -478 -467 -58 -226 -355
1582 -355 10 -198 24 555 181 289 360 316 225 58 -71 495 50 -430 -10 -333 -360 -321 -672 -42 6 -643
1604 -643 -249 39 12 294 -144 270 854 126 20 307 401 76 -251 64 481 -476 -846 -18 -297 -761 -434
1625 -434 -269 20 -57 -571 327 498 108 318 198 361 533 -23 -2 316 -125 -422 -112 -279 -276 -403 -371 -65
1647 -65 -703 -397 222 -189 -311 268 187 120 426 537 392 307 -9 459 105 -427 -106 -112 -331 -273 -522 32
1669 32 -31 -594 -164 186 113 -34 -21 333 555 18 380 640 330 -10 135 113 -76 -342 -432 -76 -309 -557
1691 -557 -259 -212 -176 -184 -249 556 106 -11 199 446 458 411 31 240 439 -337 -214 -25 -468 -151 -223 -522 -128
1714 -128 -565 -338 130 -388 36 444 -59 176 385 191 443 97 221 475 -169 -470 241 72 -412 -318
1734 -318 -478 -55 -78 -411 -165 181 -125 80 -154 504 337 27 440 557 34 58 104 -16 -147 -136 -417
1755 -417 -350 -395 -451 118 -297 -143 105 9 419 157 -51 483 402 179 355 119 -56 308 -133 1 -135 -482
1777 -482 -290 -77 -665 -93 -24 -143 2 -260 42 436 224 83 389 76 213 95 -12 333 3 -320
1797 -320 149 -184 -425 -265 -353 -139 -91 -257 130 168 -46 245 72 330 605 18 80 412 -39 -187 21
1818 21 -171 47 -84 -258 -38 -381 -163 82 -213 -111 302 -163 155 90 157 399 291 63 520 89 180
1839 180 168 -211 -14 -164 -481 85 -126 -667 -237 -303 -135 -81 1 -67 480 -18 38 517 190 284 -35 -130 386
1862 386 -67 -160 159 -118 -401 -116 -342 -41 -192 -413 -22 147 -191 87 33 104 382 231 79 522 76
1883 76 81 121 -207 -133 -228 -298 -58 -105 -186 -404 -380 92 402 -281 104 378 241 283 237 139 548 303 -52 96
1907 96 16 -228 -235 -45 107 -275 -424 -123 128 -183 -155 -155 272 244 -129 273 286 189 44 6 -28 211 33 -321
1931 -321 -71 -62 -327 -18 -519 -66 21 -298 -18 195 -179 217 29 266 550 -21 21 410 210 122 223 -129
1953 -129 130 -165 -626 -171 -94 -232 -128 -154 40 85 -343 -36 416 147 296 205 86 282 -17 -240 334
1974 334 8 -274 7 -366 -43 -255 -553 -74 15 -229 12 -29 25 174 -183 113 523 94 187 174 87 429
1996 429 -29 -386 444 77 -325 -332 -271 78 -45 -387 106 105 -210 -38 -1 47 411 156 156 301 86 235 41
2019 41 -253 -88 0 -374 -123 -94 -365 -197 -482 -46 43 -379 -56 471 95 218 31 307 438 -217 112
2040 112 262 -192 -37 95 -271 -51 -282 -610 -102 -109 -222 23 -78 243 76 -134 169 388 -166 34 255
2061 255 176 194 -133 -165 122 -253 -283 -168 -94 -202 -312 -263 281 114 -181 311 18 28 209 51 311 240 -17
2084 -17 317 70 -201 -75 -19 -515 9 34 -283 -164 -472 -72 346 -236 3 471 33 63 -80 273 555
2105 555 -125 -101 304 179 -289 -155 -148 -50 -97 -201 228 -137 -450 150 163 -22 -75 -10 251 278 -18 211 431
2128 431 52 52 93 93 0 -385 -87 197 -153 -289 23 -270 26 64 -185 181 -36 202 381 164 138 448 71
2151 71 128 -69 -301 102 -70 -460 -94 -144 -485 -108 62 36 -51 -173 456 358 -276 -25 289 447 212 -227
2173 -227 117 520 -243 49 198 -171 -13 -203 -292 65 -272 -327 101 -19 -246 27 348 118 307 24 463
2194 463 249 -320 76 142 -227 -86 -43 -3 -266 -425 -91 54 -283 -228 428 182 243 64 129 93 70 -175 441
2217 441 84 -123 -43 -23 178 -236 -261 56 -188 -365 52 166 13 -158 48 399 225 -214 217 314 46
2238 46 -78 65 241 137 -219 -134 159 -170 -404 -70 -308 -88 -232 -6 193 -280 -247 469 80 -72 216
2259 216 47 428 -190 -35 422 52 -285 60 -6 -127 -377 -133 87 -86 -471 -49 346 -89 -63 59 -28
2280 -28 216 -67 273 260 -28 103 285 141 -94 9 -254 57 -261 -188 295 -75 -174 35 113 209 -167 138
2302 138 367 119 112 145 204 -33 80 74 -126 -45 -482 -1 -118 -390 -275 -9 64 180 -124 279 111 -119 95
2325 95 303 205 -7 170 196 175 -183 -188 311 -31 -444 4 -493 -88 -252 -254 189 187 -153 209 226 12 124 148
2349 148 199 204 -102 -67 271 -98 -110 -59 -74 -124 -103 -258 -74 -125 -3 86 -26 -117 158 30 262 -45 31 296
2373 296 211 -74 -52 56 -275 -97 -107 -305 -80 -253 6 36 -250 -69 22 131 -142 -195 249 532 -16 -35
2395 -35 196 153 -155 -95 25 54 -179 -242 130 2 -302 -74 -36 115 -53 -245 331 429 -68 -16 111 134 45
2418 45 -137 24 129 -120 -176 146 -327 -196 -314 -176 -185 -189 120 153 -313 130 170 74 45 111 19 47 -93 -2 95
2443 95 -345 -164 -18 -35 -51 -69 -465 -145 83 -214 185 205 -67 141 -96 318 -64 27 81 342 -39 111
2465 111 98 45 60 -91 -208 7 -208 -161 -96 -18 -128 215 -201 81 146 24 240 43 202 89 0 87 -155
2488 -155 15 20 -130 -87 139 -197 -210 -86 256 -81 115 308 11 217 19 65 142 52 278 70 51 202 68
2511 68 97 -26 -336 -208 -75 -291 -26 130 121 -24 139 -211 306 -26 -177 378 -7 110 57 -63 152 -7
2533 -7 -126 124 -128 -26 -234 -51 -102 201 -92 -79 -32 -52 304 -208 -104 78 77 258 278 -39 41 77 -118 128
2557 128 -62 -185 -131 -354 -128 -15 -114 -100 128 -96 7 47 -109 213 187 122 51 109 -23 158 148 -256 -89
2580 -89 -111 -23 -1 -251 68 -27 82 86 -94 166 225 233 -84 139 40 89 -7 47 179 -183 76 74 -128 -188 -174 13
2606 13 -71 70 -153 86 -74 187 207 0 115 272 198 82 385 25 -63 73 -98 265 -59 -219 -12 -2
2628 -2 -106 80 -26 -183 -26 83 -119 228 5 -2 307 280 128 122 -49 80 -4 -115 -11 111 36 -149 -105
2651 -105 223 -13 -179 4 -40 167 170 91 100 234 -152 101 109 69 47 92 -104 -212 -222 -55 -277 -110 -203 88
2675 88 159 -226 -153 -208 -116 88 40 48 -11 90 166 84 -44 141 -78 -129 -87 -140 -53 6 -181 -62 83 46 214 81
2701 81 287 184 112 166 209 -57 403 195 156 106 -286 -42 12 6 -187 34 76 -74 54 -117 -80 38 -52 70
2725 70 55 83 -82 94 82 -63 -146 157 62 45 -279 -7 -152 -229 -57 -268 132 -144 -119 160 120 158 197 41
2749 41 150 -7 95 109 45 -24 -114 39 89 -137 -321 78 -76 -91 13 46 -119 58 -30 -74 130 46 30 154
2773 154 -16 -225 26 44 -133 -217 0 28 -142 -170 -139 -221 103 100 -214 -13 -30 61 70 207 25 217 -95 181
2797 181 -74 39 -51 205 162 -228 -69 10 78 -131 -3 121 126 90 133 -16 78 112 112 337 226 105 -82 130
2821 130 -33 198 -100 -50 -111 -151 35 -149 -85 19 6 83 128 337 73 222 12 158 119 104 -42 181 -51
2844 -51 -133 25 -125 155 -297 22 -32 -59 -237 47 -172 -18 -79 -99 -126 -102 -200 -2 -37 18 175 100 -93 55
2868 55 -13 89 -191 -174 -50 -48 -32 -67 56 57 16 -172 -14 -18 97 30 170 -195 161 -207 6 224 -50 -154
2892 -154 -110 120 -159 -39 -249 75 25 -98 217 -5 -73 2 19 64 -98 -135 173 160 -12 -39 -19 3 -134 -61
2916 -61 -133 -132 -220 -2 -121 33 -30 31 84 174 50 30 -99 14 188 29 -142 -158 -5 -72 121 -66 -112 -39 -297
2941 -297 -70 -205 -110 226 216 -123 -108 3 178 132 77 132 -67 132 240 -70 61 3 -91 -300 11 71 185
2964 185 19 -1 95 186 -29 63 245 -6 35 136 152 145 136 -35 44 225 -226 -126 -51 65 -163 -138 -132 76 15
2989 15 73 -39 -32 49 -79 64 -217 23 -45 12 192 368 -6 -41 -80 -88 -142 4 -18 -112 7 -45 87 141 99 205
3015 205 -5 16 55 102 -204 228 32 -59 203 -24 -93 92 -190 -118 52 19 -74 32 20 -49 -104 78 65 31
3039 31 -50 -16 -60 49 55 -183 177 102 -93 23 -193 -170 121 -254 -157 7 110 72 98 269 58 -5 -163 11
3063 11 234 -9 111 -217 -19 -10 -35 121 -245 -78 102 -54 184 74 -17 107 -64 -93 236 121 51 205
3085 205 -44 181 -17 -5 -215 281 -160 161 -200 -101 -45 -226 -15 133 197 -141 -172 29 -24 228 26 144
3107 144 53 -104 117 228 -41 -28 -4 -190 -8 -70 -86 240 -129 -47 242 -65 -8 51 39 205 22 -252 36
3130 36 66 57 119 -127 -18 -96 43 151 -156 -37 -16 -117 -179 -226 172 102 90 36 -4 130 195 135 247 14 265
3155 265 -136 -79 105 -22 -7 133 -176 -148 -3 1 -52 -176 -137 173 -34 -98 26 82 -7 -25 17 -132 9 122
3179 122 -19 -28 -123 24 -98 -91 -179 -213 -13 78 94 -276 -63 -137 23 319 28 -49 95 143 115 47 16 -3 -90 190
3205 190 -201 90 195 39 -179 18 89 52 155 183 33 -24 50 34 98 -184 -81 -46 90 44 -11 141 -8
3228 -8 -258 3 -67 14 -181 -120 -74 82 -38 15 241 13 50 122 40 -54 -109 -85 -106 52 -81 -34 89 54 -78
3253 -78 27 60 39 3 136 199 -81 49 71 84 -2 -91 51 52 -81 -78 -100 -186 -362 -359 -154 -126 -38 30 137 -140 -169
3280 -169 115 43 115 -35 7 91 42 -40 -269 178 10 18 -91 -57 -2 6 -181 126 -103 -78 -70 82 74 -30 135 184
3306 184 84 100 217 -177 33 135 37 221 -73 71 59 -108 -126 190 39 37 4 33 122 -74 26 111 57 -59
3330 -59 180 -47 3 -3 -44 -23 67 -326 -226 -212 212 -144 -84 -34 268 -7 37 207 36 -51 -26 60 116 120 -204 327
3356 327 -137 75 36 -115 -32 -60 -351 48 64 39 -108 -112 -52 -27 159 55 182 54 111 109 -94 37 277 -196
3380 -196 -91 -7 -57 -155 -142 -109 231 -59 -103 59 232 32 -123 -30 168 67 -10 230 -144 -14 -236 -68 110
3403 110 92 -16 -57 -28 -195 -208 -36 285 -100 -136 -9 59 -86 -173 255 -103 101 -43 134 -160 -109 -190 29
3426 29 -75 -92 -169 -21 -37 -38 -213 141 154 49 282 90 181 237 276 156 -25 -15 80 191 -145 -32 313 -148
3450 -148 -236 -279 -68 -22 -15 -96 236 151 21 15 -49 -39 55 -118 172 224 130 -97 -106 -18 -88 -116 92 9 -99 -107 -43 -82
3478 -82 -111 -69 -18 -37 -5 118 274 167 148 143 -106 99 145 109 31 -278 11 -75 -180 -12 67 -41 85 -115 -66
3503 -66 250 -98 -217 304 110 -56 118 89 129 242 -94 47 131 -303 -133 8 32 -148 -149 -104 -23 -146 34
3526 34 230 89 -102 46 87 180 114 -18 183 -13 24 -6 -203 -251 -172 -51 -32 -88 29 -97 -1 -16 65 105 -51
3551 -51 23 77 85 -194 -27 198 132 51 189 -106 -207 -90 -236 -86 105 -213 -111 15 193 22 59 79 232
3574 232 -62 14 345 32 41 -96 1 66 -63 -281 -189 -309 -215 -76 -73 -202 -181 -150 -40 -3 11 -19 24 152 198
3599 198 58 -73 -116 -86 0 -56 -184 -67 17 -10 -142 61 -202 -81 0 -26 153 34 -5 -43 -42 104 -43 136
3623 136 106 -41 50 -97 10 -261 -171 13 14 -264 -92 139 77 -135 88 78 166 177 -100 163 163 -215 134 104
3647 104 -219 -60 -97 -153 39 -86 -83 -6 -83 -115 -38 91 -13 295 53 128 14 199 205 22 -143 76 -223 -47
3671 -47 73 -187 -28 -275 -184 -38 -291 -35 142 -91 173 61 164 73 97 -44 283 0 38 -44 50 -39 -186
3694 -186 36 -190 37 -157 -44 -71 -46 92 207 -158 83 2 88 51 267 7 353 -11 -9 61 -111 -118 -288
3717 -288 -293 -136 -119 -101 6 -218 -95 47 94 29 223 160 18 143 62 53 109 42 76 -78 -88 50 22 -120 -140
3742 -140 -177 94 -25 -78 161 -109 40 53 -108 62 12 60 194 174 -129 41 -94 -98 -21 -128 -254 -54 -241
3765 -241 128 -206 -45 64 17 -12 17 96 68 46 189 127 179 92 12 60 -163 -100 31 -13 44 -152 -184 232 -89
3790 -89 -85 65 141 102 -50 128 105 47 151 -41 -49 60 77 -170 140 7 151 -135 -12 -130 115 -170 -54
3813 -54 149 -8 -79 145 128 -135 103 -2 -116 -65 14 -41 -28 57 22 -116 6 -290 -57 -7 -39 13 214 195
3837 195 23 -38 -8 82 211 -91 111 -66 -54 -277 110 66 166 -223 -216 137 -70 -31 -223 -76 170 62 36
3860 36 141 -139 14 205 159 115 290 -53 95 64 -141 105 -96 -231 -229 50 -18 -16 74 -60 -94 -267 165 111
3884 111 -53 140 189 14 -41 -11 -2 -23 20 -132 184 -36 -16 -130 -141 69 -66 -168 3 183 118 119 -127 18
3908 18 246 -38 175 -86 1 -167 75 -119 168 11 -79 -38 -76 -88 -29 -96 -49 231 -23 45 53 134 86 107 -84
3933 -84 -40 -125 -81 83 103 -99 -19 -206 -74 55 -206 58 -50 -11 -14 -169 150 319 -124 63 5 26 195 123
3957 123 -101 112 -26 -72 78 24 152 -96 -174 -18 -65 66 -118 -33 149 7 -64 -83 -103 -171 45 230 -183
3980 -183 17 124 -177 72 -10 4 6 -24 65 208 -157 -12 -57 76 22 -65 41 125 -75 -13 129 158 -162 89
4004 89 -36 -4 -18 -214 143 -45 -42 -60 -189 -122 112 -22 135 -153 -24 292 162 172 35 14 -55 197 67
4027 67 -243 41 -86 -66 -31 -179 -125 153 -138 108 -156 -275 -31 -86 43 84 180 102 95 -62 106 70 -105 -73
4051 -73 42 -8 160 -206 -220 45 -199 195 49 -201 -160 -37 11 153 257 183 139 172 -21 66 -1 -175 135
4074 135 41 142 21 -184 -242 -95 7 75 32 1 153 102 155 156 11 95 158 -19 256 19 -77 76 -29 55
4098 55 -55 -148 94 35 -170 78 104 146 14 19 136 170 53 34 38 66 8 116 82 47 250 -130 -40 -133 -40 69
4124 69 -205 142 90 -19 -56 -83 -160 55 137 7 158 100 58 165 -11 156 -55 -233 -73 -152 -47 -80 3 28
4148 28 53 -110 -13 96 -59 52 234 -113 122 -121 -91 51 97 -158 -38 -25 -175 -72 189 -53 -12 -99 -50
4171 -50 -82 -97 152 181 25 -80 -74 98 160 91 -14 20 -177 -50 -45 -89 -82 23 -94 -143 -187 -22 11 -57 -67 126
4197 126 -73 139 31 81 160 -226 -187 -26 1 -109 36 -228 55 -73 -67 -51 67 -59 -113 -100 57 51 -4 174
4221 174 247 36 -76 208 12 90 16 -39 -54 -76 -119 217 -91 -39 68 14 -168 -8 -123 41 -264 123 76
4244 76 79 -72 57 239 -77 253 -209 -77 -143 -214 4 -173 -251 -15 -61 -146 57 5 81 51 -52 150 68 18
4268 18 11 -76 -26 212 -75 -1 56 35 29 65 -144 170 -123 -272 -74 -139 45 105 3 111 12 -164 83 153 -43
4293 -43 -43 15 21 -27 -244 116 86 -186 -6 -114 -22 9 -165 42 -26 50 -156 -37 137 -88 -29 -91 -95 -98 -61 66
4319 66 135 -188 -136 -49 -180 63 -42 161 -69 -195 -253 108 -50 -3 37 26 -16 -37 97 -121 -197 -32 -153 -88
4343 -88 54 -105 -155 -203 -58 -170 -79 106 79 31 -107 103 111 -144 243 -14 -17 104 35 156 -73 81 176 -254
4367 -254 -18 54 48 -31 169 -50 70 26 -50 193 86 -136 -27 135 3 118 -42 56 -169 -91 -144 -108 133
4390 133 119 -58 -132 -26 -25 -88 101 253 -73 97 296 140 123 -54 48 46 -98 270 -85 -109 20 -290 -53
4413 -53 131 150 -196 54 -133 28 37 -151 -46 130 122 -3 -125 68 -97 -42 -238 84 39 -224 112 -90 269
4436 269 169 -125 164 38 -148 -131 -184 176 201 -60 64 141 -122 82 83 227 26 168 -163 -13 -41 -94 -164
4459 -164 -260 90 -80 -66 3 26 36 -21 -12 125 122 -43 25 -2 -231 -49 36 -117 -41 68 -66 149 79 114 -110
4484 -110 3 175 -66 106 112 131 -266 -23 -22 -50 96 37 130 -148 48 78 23 27 285 -79 23 -37 216 -17
4508 -17 -157 -50 76 -43 -115 218 214 93 -25 -55 -51 -90 98 -90 46 -102 -98 -54 -2 -130 -100 68 158 -63 134
4533 134 -145 139 192 16 124 -18 -99 -22 -8 98 -126 -114 -309 -387 -103 157 -120 37 66 -14 103 100 27 78
4557 78 -7 -113 21 -29 173 78 61 85 -77 -89 107 -153 -77 -80 101 -64 -81 -311 19 185 -74 224 54 -135
4581 -135 -240 -155 1 101 -77 -234 -15 -159 -137 -1 -175 -142 -140 70 90 150 -28 35 67 83 -32 -134 -103 37
4605 37 40 -8 145 12 -107 -28 -34 39 -108 -150 -121 -106 104 -201 39 201 68 -49 200 -166 213 49 -110 4
4629 4 -139 -80 43 -323 -72 31 -110 285 -222 -43 -110 -78 -113 -126 63 -106 162 -176 26 54 120 7 192
4652 192 -113 208 130 -90 146 -174 -42 -44 -128 -16 73 -15 154 158 -94 152 -127 227 128 -68 54 -20 65 132
4676 132 -111 -194 -70 -39 -152 -231 133 27 -110 22 -41 275 -74 -191 -53 78 -116 139 25 -23 19 -289
4698 -289 77 21 -200 164 18 -47 124 -24 108 -80 -45 35 16 25 91 204 -95 -30 4 -74 -30 -222 31 -20
4722 -20 90 -56 172 89 -94 -165 24 -112 -223 32 5 -196 -112 -96 68 90 -86 239 -3 -141 31 -80
4744 -80 -90 -185 -53 -29 71 -31 -16 -22 -14 -54 -54 -170 -116 104 196 -95 166 -48 -94 66 -57 -5 -74 -64 52 -27
4770 -27 -66 122 83 4 102 100 96 0 69 137 53 119 -45 -29 132 -155 261 33 -50 10 -138 50 14 68 3 183 75
4797 75 21 90 -75 77 -23 109 128 174 -125 -11 61 -12 40 -111 -15 -146 -130 -120 -57 32 -115 202 60 -90
4821 -90 -101 -151 106 -37 268 19 118 -22 15 68 20 67 -79 -106 -51 -287 -234 200 -98 -10 91 50 -46 66 120
4846 120 174 82 71 146 -14 70 -95 219 109 93 -18 -93 -89 -165 -103 70 39 -87 -11 33 142 -31 -217 -60 38
4871 38 226 96 8 -118 -56 -119 -139 131 -113 33 -188 10 19 167 -80 209 137 -8 -16 84 30 -20 28 -155
4895 -155 -175 147 55 143 -174 78 22 -4 77 -127 -117 9 112 5 -82 122 68 164 25 129 69 107 -88 108
4919 108 -23 91 134 158 -84 -276 -2 -141 -45 27 -159 166 23 77 32 95 142 43 -141 139 -68 45 -9
4942 -9 179 -91 241 62 -84 -200 67 27 -136 -83 -95 131 -92 54 -141 -26 246 -111 151 -138 -70 213
4964 213 -55 16 136 4 -222 23 -210 -61 9 -87 33 -59 -90 27 205 2 -104 13 75 206 -37 80
4986 80 10 -62 -16 31 33 -125 -118 -99 -125 -55 92 206 -62 -147 61 -14 177 64 -52 -93 180 94 51 69 -81 150
5012 150 70 160 172 -17 -1 38 -28 13 -5 11 2 3 91 197 -171 -121 51 138 217 -146 -47 232 -7 -188 -66 -53
5038 -53 23 172 -80 98 -61 44 148 -33 -201 8 92 124 -63 27 131 65 -31 -36 131 -104 49 27 -48 30
5062 30 -201 -165 -129 108 26 -28 -119 105 167 -23 39 195 -90 40 -119 89 -37 -253 -3 -206 -124 -98 78
5085 78 -127 -94 -39 19 -62 110 138 170 99 8 217 5 61 -32 49 33 69 19 -5 -268 -292 -195 -262 173 -115 5
5111 5 118 -16 164 13 -148 160 98 25 121 70 -92 62 -56 -35 -97 32 35 -59 99 124 -333 -242 237 47
5135 47 85 111 130 51 182 -101 -78 18 -33 -39 30 -105 13 -128 -239 26 -129 -141 -201 -61 131 423 109 79 -1
5160 -1 -160 -96 42 88 191 -42 -26 -101 2 -67 -204 -110 -65 98 39 -81 112 74 90 -96 -160 142 93 197 46
5185 46 73 8 59 64 63 -19 -87 -12 31 -15 45 -77 -104 -100 -52 -12 -161 -134 122 -33 62 145 73 117 211 -19 -62 29 -109
5214 -109 29 94 -142 -60 -2 -66 -74 15 -22 -31 164 65 -29 27 194 96 51 91 308 -104 83 -122 3 -236 -214 17
5240 17 76 -27 -314 132 -264 -25 -21 93 213 -129 161 48 -6 78 -60 80 60 -143 70 126 -106 -8 107
5263 107 -137 108 5 -4 116 -78 57 -47 74 158 12 33 -217 -114 53 -92 -219 -93 28 -159 133
5284 133 57 -191 -86 42 113 173 45 -265 94 -78 95 50 116 302 -3 75 67 -50 -122 93 172 -163 -53
5307 -53 -17 -166 225 -163 -139 193 218 167 203 -48 73 73 171 35 -110 14 74 -4 -49 8 54 -150 25 137 -168
5332 -168 -83 -34 226 179 214 -24 324 -187 144 52 72 163 11 -44 40 -12 -190 18 -314 49 -173 133 26
5355 26 -46 -65 -49 26 61 292 -23 156 -74 -98 72 147 106 1 -124 -48 53 -261 -252 -71 216 -189 -124 -46 48
5380 48 57 -59 105 61 124 124 228 -51 230 65 -49 142 -88 128 5 -134 -115 -99 -52 223 20 -71 -21 -105
5404 -105 100 -8 154 -21 89 -148 38 -122 -134 -46 -213 41 -167 -25 -112 -178 45 64 -49 -134 29 -260
5426 -260 -53 84 -32 31 297 19 156 -53 21 -75 52 40 52 -50 -23 -83 14 132 49 -103 69 -1 152
5449 152 50 112 112 216 -35 -65 69 6 -27 39 90 -111 -222 -121 -264 -159 -267 55 -49 21 -94 209 167
5472 167 -54 67 -48 -235 41 -67 -14 237 94 -29 -56 -70 -12 66 -9 -63 -101 -42 161 341 -166 105 72
5495 72 27 -72 -72 64 71 -72 -26 -51 1 -77 -43 237 -204 50 -22 -35 -75 52 57 -60 1 39 121 13 108 -185 136
5522 136 124 171 -55 7 -40 -36 -20 -132 64 -112 69 175 63 -41 -30 -56 -143 138 79 133 107 82 60 -23 53 412
5548 412 -2 -71 -58 -95 267 -265 176 -165 -129 -15 34 80 -60 -17 -154 -84 -145 25 54 138 105 119 49 -110 81
5573 81 223 -89 94 -119 13 -147 -131 155 -149 69 230 -104 -185 94 -2 -111 -53 -1 -214 174 -310 22
5595 22 -73 -120 -51 138 -85 -66 160 -17 -124 -255 228 40 81 -40 99 122 171 94 93 -108 13 -124 25 -73
5619 -73 -121 19 111 91 105 -104 121 -76 67 -38 100 99 52 -30 -59 -95 -44 -131 -85 -134 -156 -194 -97 107 -6 -11 95
5646 95 -63 138 -52 -169 -138 1 14 18 -42 121 -98 -190 133 -25 -6 -132 -78 -22 -94 61 -102 -17 -18 292 47
5671 47 76 98 -83 178 -65 -58 -81 -17 16 43 187 -310 -91 160 -291 42 142 38 81 -99 -41 -166 -233 -43
5695 -43 -105 -28 -211 22 90 -82 -194 -77 59 -52 -122 4 -119 -24 -92 -211 64 96 -251 164 44 17 -59
5718 -59 -95 -105 -128 110 -152 82 -22 -22 152 -99 40 -108 40 -120 -1 -158 9 -149 92 23 2 251 50
5741 50 40 157 -24 -81 174 -171 -32 115 -90 12 -102 -141 29 -121 -89 -91 122 -60 -18 -76 207 -46 -61
5764 -61 118 -21 65 108 -16 93 -74 -36 -44 -111 24 228 77 -86 68 -38 -84 169 -46 64 89 -35 -101
5787 -101 -188 -33 -29 -121 73 -29 123 -108 -146 -121 94 60 -74 27 147 -77 -142 121 -87 -5 114 71 248
5810 248 -42 -8 14 -148 -22 -27 -127 -91 68 30 25 -140 -74 81 52 -46 -126 -79 127 -57 -53 45 -21 -78 -94 28
5836 28 -9 -72 130 -74 3 225 148 24 -41 -6 9 102 51 -1 103 176 -132 55 80 -44 99 -54 -12 -9 -24 -149
5862 -149 46 -22 -78 -103 -6 21 -116 -22 37 157 -22 23 -76 137 128 -24 -111 78 -139 152 -31 25 -53 71 155
5887 155 -115 -62 -248 -19 71 225 -33 119 -83 -82 87 97 45 143 17 -81 -129 -198 -65 -11 -1 -91 57 45 -2
5912 -2 171 13 -68 -56 -90 -1 157 -3 95 93 182 111 39 -11 -126 -91 128 13 -14 -167 53 -114 113 56 58 4
5938 4 170 -217 -67 -15 54 71 -178 59 -106 19 -38 -70 -42 -132 -104 -18 109 -65 117 107 79 45 127 47 19 -195
5964 -195 103 -192 -78 -86 -76 -118 69 -153 49 127 -33 -32 -137 109 79 -34 45 -37 -56 -29 -49 184 26 -58 74
5989 74 -164 19 173 -18 134 262 3 -19 234 -157 -19 -23 -235 -24 126 -32 -36 -188 -42 173 -6 -100
6011 -100 -69 126 -73 23 -148 -239 -69 -96 -56 14 32 110 -84 47 -142 239 71 -1 121 44 99 -139 57 -47
6035 -47 45 -37 -13 54 7 -42 238 101 -154 -2 143 -222 128 57 93 -34 -28 16 -55 27 -37 -35 239 143 -97 168
6061 168 15 131 -110 56 135 80 102 14 -17 30 173 23 -23 -35 34 113 -85 -74 -5 43 -104 -258 -153 100
6085 100 -50 -258 -187 80 63 -65 41 179 -43 -86 12 16 1 -86 -133 122 -225 58 113 -286 -1 15 8 -132
6109 -132 -5 199 189 -22 118 -94 -34 -50 228 -76 18 2 -81 -218 270 198 45 -80 119 54 97 -6 -25
6132 -25 46 37 -61 0 55 -226 -128 242 -200 30 146 130 2 -149 17 -35 36 60 -76 48 148 -61 43 76
6156 76 -110 -80 -91 148 -41 100 30 -119 0 123 216 -46 31 -53 64 -26 -11 -131 29 45 -34 114 -64 -178
6180 -178 48 61 -77 -207 -116 61 -7 51 163 145 -36 3 31 -54 34 142 121 37 -2 31 70 236 -88 -52 148
6205 148 64 -81 18 245 -14 -142 116 26 137 -72 -101 -156 17 -30 -114 13 -174 181 -56 -71 -105 -171 -39
6228 -39 -162 -100 109 109 104 -69 71 -143 -56 -56 -165 -6 4 6 -260 4 103 -166 -9 29 -63 -182 19 69 -44
6253 -44 -180 -66 100 -3 -168 -37 -142 144 -76 -48 -22 153 240 31 -43 -132 17 7 78 -48 -124 -81 -91 118
6277 118 -27 -14 -140 158 -25 -62 87 -25 -197 122 -103 -68 -83 -135 -106 -6 114 5 106 -168 121 -36
6299 -36 -64 58 -33 90 89 195 122 -24 144 -158 126 107 31 100 -66 -52 -62 -75 210 -12 -179 -75 13 -106
6323 -106 -391 -37 -202 3 116 163 -136 29 -105 -120 21 -43 69 183 -53 -18 78 17 41 31 -5 -59 -19 -134
6347 -134 82 301 -142 104 14 -58 -30 9 139 -51 -91 -39 5 86 36 145 11 -29 -5 15 -80 -73 193 36 27 -57
6373 -57 129 80 15 -86 -56 82 -191 25 -56 38 -186 -75 65 98 237 -83 -246 144 72 75 162 -151 -72 7
6397 7 -15 75 182 3 -210 158 80 -19 -102 -22 208 26 -120 -217 -125 -81 -11 87 99 76 200 7 -72 68 12 42
6423 42 -96 39 -22 13 -108 -148 -135 -246 118 -46 -14 172 -62 29 -77 56 -126 -18 -62 8 -31 13 4 -103
6447 -103 21 122 -159 -67 55 -30 -64 -79 -82 -108 -28 -82 -292 -12 -73 47 -150 -41 -87 -99 205 0 -48 90
6471 90 -237 132 22 58 249 134 -113 -72 152 -49 -38 106 34 -94 -135 -56 138 -105 217 27 9 52 35
6494 35 -37 -35 -75 66 56 -72 -4 37 22 -36 124 65 86 -170 116 20 -351 -26 137 -83 244 -146 -133 -36 -183
6519 -183 24 87 -27 36 112 -3 79 -22 -94 102 -68 9 -157 -234 16 -25 -31 -63 48 164 -156 -16 71 -112
6543 -112 19 -217 42 -96 -108 -87 -13 51 -95 -230 -13 -126 -77 -47 -55 -34 66 -303 119 -47 -88 63 -19 -33
6567 -33 181 -74 -2 159 37 114 -61 -40 13 94 -92 6 -36 24 -36 64 -113 269 -31 72 -87 284 -246
6590 -246 99 18 -181 181 53 -104 -107 113 -94 -65 17 78 -102 11 -162 57 52 -57 -160 -126 -190 121 -66
6613 -66 174 69 -42 156 -247 20 -5 -132 -81 -34 -134 -127 -45 -64 -88 152 -51 -106 -118 -245 37 181 151 74
6637 74 9 217 67 -137 21 -23 210 -31 -131 -53 232 -48 64 -55 -91 -204 171 156 -106 -236 -55 75
6659 75 -170 122 -82 -55 -67 169 -127 82 128 -108 187 82 -146 16 -67 -5 -116 19 104 175 79 -29 -150
6682 -150 171 160 -189 56 -152 78 51 52 14 3 38 61 -207 131 -33 -43 -103 102 -59 106 111 -70 -137 -70 45
6707 45 -82 156 209 3 126 110 -14 65 76 -111 -25 -88 -43 3 -169 -122 167 -13 44 81 43 178 -39 -76 -2
6732 -2 161 34 -105 -81 164 58 99 120 -66 83 -214 -145 55 150 30 -5 -62 70 36 54 43 -20 -5 21 63
6757 63 85 -134 -80 -25 0 -87 -58 16 -1 -48 -44 66 27 -90 -187 8 -16 88 -13 -68 21 97 100 74 150 -63 -81 69
6785 69 78 -90 -90 -123 -19 124 -113 -35 -90 51 13 -108 33 -70 -17 47 99 -115 -67 66 230 69 -75 140
6809 140 -162 -174 30 -106 39 -89 71 80 -21 24 -153 108 62 -182 66 151 -137 48 -139 -98 -95 -3 -59 68
6833 68 94 2 34 -48 -33 -194 120 -270 147 -179 -42 69 -130 -107 -61 1 -124 147 124 203 50 3 52 -17 -145
6858 -145 2 62 143 256 -58 25 -55 -55 53 -85 322 -41 33 38 23 17 28 87 -30 22 -100 275 -64 -19 49 -43
6884 -43 -59 -165 -10 -101 86 96 -70 18 26 71 -63 119 78 70 -45 54 72 59 -12 250 0 -38 -57 -264 10 25
6910 25 54 -247 -7 55 78 105 60 -112 -45 21 -30 -32 -105 114 -105 64 135 90 -124 -7 99 -79 87 -176 3
6935 3 -8 117 -86 -30 186 23 23 -40 -12 -168 39 14 -95 17 128 -106 97 68 7 -99 1 -15 -130 -205
6959 -205 -85 16 73 38 101 -37 -134 -12 -172 59 91 -73 100 -72 46 -19 104 -99 -135 44 25 22 62 -134
6983 -134 -101 -112 -7 -145 11 -20 219 55 66 -62 5 -34 -82 25 -42 5 -14 217 44 115 -107 249 -52 90
7007 90 -107 -39 -169 -52 -181 -66 71 92 112 61 -71 -56 -56 63 -61 21 128 -102 33 2 200 197 -21 57
7031 57 79 -137 45 163 -117 -25 160 -102 -65 65 54 23 130 138 98 108 27 77 -154 -102 175 -68 -64 169 -29
7056 -29 -114 -7 -70 31 -125 -100 -71 -76 77 175 175 66 -82 -93 38 -74 29 34 48 5 -10 -126 196 -49 107
7081 107 -24 -95 10 -107 -29 58 -160 95 68 59 -169 61 -103 81 2 -21 125 5 194 209 178 129 113 1
7105 1 -72 -196 -165 141 28 -30 -24 -94 -126 20 83 84 83 -36 -32 -195 224 -51 41 -34 -141 -58 69 -44 40 -24 -106
7132 -106 -22 -201 -34 204 -131 84 -27 -51 -223 67 160 -94 -94 -35 -64 42 47 -168 12 99 -20 45 -13 167
7156 167 -24 42 51 -117 -140 -108 26 -113 23 65 -31 -35 -98 14 97 62 -120 17 -102 -157 -144 -110 -61 2 17 11 13
7183 13 -158 68 68 -132 -115 150 -5 50 136 -60 27 108 -196 -18 20 118 4 31 83 -26 -151 -77 54 57 140
7208 140 -6 129 139 -7 -27 -177 -41 3 52 95 -75 10 38 -17 19 161 -202 -79 18 -25 -230 -71 -45 73
7232 73 -87 -56 -151 14 48 41 -63 160 -183 -11 25 -44 67 7 253 -115 24 -51 70 36 70 -155 -21 128
7256 128 -42 -86 -248 -148 224 52 -82 76 -25 -10 -65 9 -102 94 -33 -141 78 81 -50 180 80 -120
7278 -120 253 -171 57 -62 -46 -61 -165 27 23 -1 83 18 -24 -4 -132 84 136 96 258 -63 -181 -101 117 73
7302 73 -38 69 60 -67 -67 173 -147 78 47 -44 -160 169 -155 55 10 -13 98 -74 -272 22 149 -29 5
7325 5 104 35 105 39 203 65 -80 80 46 169 -2 117 -148 -41 -143 -27 -92 20 -43 91 -144 79 2
7348 2 103 66 -69 -11 -81 -61 36 326 76 62 -129 -138 -114 -103 121 23 6 -51 75 -77 -22 -210 7 -63 -31 91
7374 91 98 74 229 131 129 -69 -5 -61 15 22 59 -48 -94 -236 -191 -110 49 43 -138 76 5 78 239 13 269 25 -166
7401 -166 -42 74 -70 -78 29 127 85 42 257 27 -123 -1 161 -94 -18 91 141 53 179 126 -42 -38 -180 20
7425 20 -1 115 144 68 -29 121 -202 -20 30 -107 -17 13 8 -79 50 46 -174 -198 118 -12 -6 5 60 2 -156 82
7451 82 -27 60 -28 -171 -132 -74 95 49 -6 -23 51 -248 -202 -54 34 -114 8 -130 -98 2 -204 -132 -20 -39 -99
7476 -99 -225 197 44 -96 147 80 -184 184 3 -83 -136 61 -83 20 -60 140 -80 -136 66 113 266 -227
7498 -227 -105 85 -53 107 -37 146 7 -143 -215 -93 131 77 6 -48 64 -163 -2 155 -91 -23 105 -2
7520 -2 87 -94 -46 -73 44 -16 51 38 -114 -114 -77 5 74 -90 -69 60 189 31 -43 145 -125 1 -111 7 66
7545 66 -100 -176 -37 -73 57 70 21 110 40 -69 -150 -51 12 -92 -29 -66 45 167 -172 227 -88 61 228 -105
7569 -105 190 -98 -261 97 184 -139 -165 -40 169 33 49 80 111 -41 16 144 -93 73 -101 -204 337 -141
7591 -141 90 -38 28 63 196 30 84 51 -166 5 -2 -67 3 -105 102 -83 -5 111 107 179 -85 -57 124 99 53
7616 53 112 25 -130 77 156 -135 -70 51 23 95 -67 -82 72 51 61 -26 61 162 8 -35 42 29 -57 -106 219 -26
7642 -26 -47 12 67 -49 0 131 -27 126 -15 24 -29 -44 10 -7 -36 -133 -105 27 64 3 5 25 -57 -78 -99 214 -99
7669 -99 86 -120 59 13 47 68 -68 -96 159 -218 -41 58 191 143 98 -177 -45 179 35 67 -48 179 -99
7692 -99 -134 41 128 153 135 58 -133 80 65 89 -91 -199 83 -92 -26 143 -123 57 9 -75 -57 67 -18 -205
7716 -205 -62 -92 -130 -148 -96 27 83 -164 -114 92 -11 -83 -132 27 -194 122 -138 22 -96 -217 60 222 -51
7739 -51 145 -96 48 5 226 84 -122 -201 -245 8 113 226 -52 29 -1 -81 -111 83 59 133 -11 106 179 37
7763 37 147 -40 176 104 -152 -31 -239 -41 52 75 160 107 -25 76 -87 138 -48 -115 -74 126 12 -62 -150
7786 -150 57 -208 36 -86 94 -33 89 -75 -75 164 -141 125 192 -5 194 -84 -137 -1 77 73 -92 123
7808 123 36 -45 -253 44 225 -19 219 25 14 83 -66 21 18 108 78 9 -35 -122 -122 105 -32 -36 -94 -192 -114 -78 94
7835 94 28 53 -68 109 125 100 -6 -140 -14 -72 -47 16 155 57 -49 -66 -31 30 83 -11 -26 -75 -67 17 -38 40 -186
7862 -186 146 172 -72 -133 124 -161 -103 78 -142 -22 -26 -264 -104 -22 112 95 -379 -99 -24 -70 79 -118 93
7885 93 144 5 44 94 39 56 -219 -145 161 -128 -256 -11 17 302 -3 -119 44 101 70 -267 -53 -111 -68 -195
7909 -195 101 80 96 -84 -225 -101 39 106 -150 -157 157 23 18 -86 -13 206 -262 144 -3 191 -130 -44 -107
7932 -107 -160 3 -5 -260 -49 -193 175 35 107 -43 39 30 64 121 -168 -24 13 57 -160 -4 -10 85 -70 -118 -133
7957 -133 86 -43 154 -82 62 129 28 186 22 -310 141 -152 130 -146 126 96 -62 5 -344 -141 -47
7978 -47 16 -110 25 -216 26 -56 55 107 -74 -84 -95 -153 75 -32 18 181 132 -31 118 55 -76 188 66
8001 66 -44 -15 95 13 -27 125 -42 -84 28 46 -17 -69 -28 -37 -46 43 148 -278 116 -83 -12 -52 -184 90 -16
8026 -16 60 80 118 -108 154 -47 72 11 -172 222 -18 109 -50 89 32 -145 16 -10 9 -19 -5 -6 -87 38
8050 38 -17 35 41 8 128 -45 -94 -59 128 35 77 158 -9 -140 -87 25 44 -120 -121 -53 -16 22 24 210 96 36 -31
8077 -31 79 144 28 69 117 -100 -235 36 -34 -102 -50 74 -117 -3 -26 104 -51 -82 45 -1 -12 -228 1 167
8101 167 204 215 31 133 114 -208 -59 -18 -47 22 -77 -143 65 -157 54 -127 88 -11 17 -71 -13 84 -34 82
8125 82 -70 6 30 -178 -137 98 -96 55 -8 181 14 -104 118 -82 69 -89 -50 -53 87 -6 -127 91 93 -342
8149 -342 -65 211 -103 -54 28 6 -151 -139 -209 -151 156 23 31 22 220 -54 -185 -54 159 -23 -45 -33 -33 129 125
8174 125 123 38 -138 58 -110 -80 85 76 -135 -116 211 28 -26 -55 106 44 -125
8191a25
##END NTUPLES=NMR FID
##END=
