##TITLE=1H_Pr-C6-HCl
 D2O, 8 sc, 
 9.7.2020
##JCAMPDX= 6.0         $$ Bruker NMR JCAMP-DX V2.0
##DATA TYPE= NMR FID
##DATA CLASS= NTUPLES
##ORIGIN= UXNMR, Bruker Analytische Messtechnik GmbH
##OWNER= root
$$ XWIN-NMR		Version 3.5
$$ Thu Jul  9 10:40:43 2020 Russian Standard Time (UT+4h)  she@DPX200
##.OBSERVE FREQUENCY= 200.1315
##.OBSERVE NUCLEUS= ^1H
##.DELAY= (6, 6)
##.ACQUISITION MODE= SIMULTANEOUS
##.ACQUISITION SCHEME= undefined
##.AVERAGES= 8
##.DIGITISER RES= 18
##SPECTROMETER/DATA SYSTEM= spect
##.PULSE SEQUENCE= zg30
##.SOLVENT NAME= CDCl3
##.SHIFT REFERENCE= (INTERNAL, CDCl3, 0, 15.7039)
##AUDIT TRAIL= $$ (NUMBER, WHEN, WHO, WHERE, WHAT)
$$ ##TITLE= Audit trail, XWIN-NMR		Version 3.5
$$ ##JCAMPDX= 5.01
$$ ##ORIGIN= Bruker BioSpin GmbH
$$ ##OWNER= she
$$ F:/spectra/data/she/nmr/H-F/1/audita.txt
$$ ##AUDIT TRAIL=  $$ (NUMBER, WHEN, WHO, WHERE, WHAT)
(   1,<2020-07-09 10:39:03.68 +0400>,<she>,<DPX200>,
      <created by zg, POWCHK disabled, PULCHK disabled
       configuration hash MD5:
       00 E9 B6 7A A2 85 ED C7 34 08 36 98 17 FE 4E 26
       data hash MD5: 16K
       6F 36 21 AA 30 BD 0F 86 2F 36 21 51 14 FD 32 17>)
$$ ##END=
$$ 
$$ hash MD5
$$ D7 1A 3C 97 9A A2 27 E4 EF CD 51 F9 19 74 C5 87
##$RELAX= 
##$RELAX= 
##$RELAX= 
##$RELAX= 
##$RELAX= 
##$RELAX= 
$$ Bruker specific parameters
$$ --------------------------
##$DU= <F:/spectra>
##$EXPNO= 1
##$NAME= <H-F>
##$PROCNO= 1
##$TYPE= <nmr>
##$USER= <she>
##$AMP= (0..31)
100 100 100 100 100 100 100 100 100 100 100 100 100 100 100 100 100 100 
100 100 100 100 100 100 100 100 100 100 100 100 100 100 
##$AQSEQ= 0
##$AQ_mod= 1
##$AUNM= <au_zg>
##$AUTOPOS= <>
##$BF1= 200.13
##$BF2= 200.13
##$BF3= 200.13
##$BF4= 200.13
##$BF5= 200.13
##$BF6= 200.13
##$BF7= 200.13
##$BF8= 200.13
##$BYTORDA= 1
##$CFDGTYP= 0
##$CFRGTYP= 5
##$CHEMSTR= <none>
##$CNST= (0..31)
1 1 145 1 1 1 1 1 1 1 1 1 1 1 1 1 1 1 1 1 1 1 1 1 1 1 1 1 1 1 1 1 
##$CPDPRG= <>
##$CPDPRG1= <>
##$CPDPRG2= <>
##$CPDPRG3= <>
##$CPDPRG4= <mlev>
##$CPDPRG5= <mlev>
##$CPDPRG6= <mlev>
##$CPDPRG7= <mlev>
##$CPDPRG8= <mlev>
##$CPDPRGB= <>
##$CPDPRGT= <>
##$D= (0..31)
0 1.2 0 0 0 0 0 0 0 0.06 0 0.03 0 0 0 0 0.0002 0 0 0 0 0 0 0 0 0 0 0 0 
0 0 0 
##$DATE= 1594276743
##$DBL= (0..7)
120 120 120 120 120 120 120 120 
##$DBP= (0..7)
150 150 150 150 150 150 150 150 
##$DBP07= 0
##$DBPNAM0= <>
##$DBPNAM1= <>
##$DBPNAM2= <>
##$DBPNAM3= <>
##$DBPNAM4= <>
##$DBPNAM5= <>
##$DBPNAM6= <>
##$DBPNAM7= <>
##$DBPOAL= (0..7)
0.5 0.5 0.5 0.5 0.5 0.5 0.5 0.5 
##$DBPOFFS= (0..7)
0 0 0 0 0 0 0 0 
##$DE= 6
##$DECBNUC= <off>
##$DECIM= 24
##$DECNUC= <off>
##$DECSTAT= 4
##$DIGMOD= 1
##$DIGTYP= 9
##$DL= (0..7)
0 120 120 120 120 120 120 120 
##$DP= (0..7)
150 150 150 150 150 150 150 150 
##$DP07= 0
##$DPNAME0= <>
##$DPNAME1= <>
##$DPNAME2= <>
##$DPNAME3= <>
##$DPNAME4= <>
##$DPNAME5= <>
##$DPNAME6= <>
##$DPNAME7= <>
##$DPOAL= (0..7)
0.5 0.5 0.5 0.5 0.5 0.5 0.5 0.5 
##$DPOFFS= (0..7)
0 0 0 0 0 0 0 0 
##$DQDMODE= 0
##$DR= 18
##$DS= 0
##$DSLIST= <SSSSSSSSSSSSSSS>
$$ [...]
##$SUBNAM2= <"">
##$SUBNAM3= <"">
##$SUBNAM4= <"">
##$SUBNAM5= <"">
##$SUBNAM6= <"">
##$SUBNAM7= <"">
##$SUBNAM8= <"">
##$SUBNAM9= <"">
##$SW= 24.9337058887773
##$SWIBOX= (0..15)
0 0 2 0 0 0 0 0 0 0 0 0 0 0 0 0 
##$SW_h= 4990.01996007984
##$TD= 16384
##$TD0= 1
##$TE= 0
##$TE2= 300
##$TE3= 300
##$TEG= 300
##$TL= (0..7)
0 120 120 120 120 120 120 120 
##$TP= (0..7)
150 150 150 150 150 150 150 150 
##$TP07= 0
##$TPNAME0= <>
##$TPNAME1= <>
##$TPNAME2= <>
##$TPNAME3= <>
##$TPNAME4= <>
##$TPNAME5= <>
##$TPNAME6= <>
##$TPNAME7= <>
##$TPOAL= (0..7)
0.5 0.5 0.5 0.5 0.5 0.5 0.5 0.5 
##$TPOFFS= (0..7)
0 0 0 0 0 0 0 0 
##$TUNHIN= 0
##$TUNHOUT= 0
##$TUNXOUT= 0
##$USERA1= <user>
##$USERA2= <user>
##$USERA3= <user>
##$USERA4= <user>
##$USERA5= <user>
##$V9= 5
##$VALIST= <valist>
##$VCLIST= <CCCCCCCCCCCCCCC>
##$VD= 0
##$VDLIST= <DDDDDDDDDDDDDDD>
##$VPLIST= <PPPPPPPPPPPPPPP>
##$VTLIST= <TTTTTTTTTTTTTTT>
##$WBST= 1024
##$WBSW= 4
##$XGAIN= (0..3)
0 0 0 0 
##$XL= 0
##$YL= 0
##$YMAX_a= 136282
##$YMIN_a= -122496
##$ZGOPTNS= <>
##$ZL1= 120
##$ZL2= 120
##$ZL3= 120
##$ZL4= 120
##$ABSF1= 10
##$ABSF2= 0
##$ABSG= 5
##$ABSL= 3
##$ALPHA= 0
##$AQORDER= 0
##$ASSFAC= 0
##$ASSFACI= 0
##$ASSFACX= 0
##$ASSWID= 0
##$AUNMP= <proc_1d>
##$AZFE= 0.1
##$AZFW= 0.1
##$BCFW= 1
##$BC_mod= 2
##$BYTORDP= 1
##$COROFFS= 0
##$CY= 11.3945322036743
##$DATMOD= 1
##$DC= 2
##$DFILT= <>
##$DTYPP= 0
##$F1P= 16.9975609425685
##$F2P= -3.02152046262296
##$FCOR= 0.5
##$FTSIZE= 0
##$FT_mod= 4
##$GAMMA= 1
##$GB= 0.15
##$INTBC= 1
##$INTSCL= 1
##$ISEN= 128
##$LB= 0.24
##$LEV0= 0
##$LPBIN= 0
##$MAXI= 10000
##$MC2= 0
##$MEAN= 0
##$ME_mod= 0
##$MI= 1.114404
##$NCOEF= 0
##$NC_proc= 0
##$NLEV= 6
##$NOISF1= 3.799351
##$NOISF2= 2.8
##$NSP= 1
##$NTH_PI= 0
##$NZP= 0
##$OFFSET= 15.70392
##$PC= 1
##$PHC0= -9883.285
##$PHC1= 29.40092
##$PH_mod= 1
##$PKNL= yes
##$PPARMOD= 0
##$PSCAL= 0
##$PSIGN= 0
##$REVERSE= no
##$SF= 200.130013532006
##$SI= 16384
##$SIGF1= 3
##$SIGF2= 2
##$SINO= 400
##$SIOLD= 16384
##$SREGLST= <1H.CDCl3>
##$SSB= 0
##$STSI= 0
##$STSR= 0
##$SW_p= 3612.71676300578
##$SYMM= 0
##$S_DEV= 0
##$TDeff= 0
##$TDoff= 0
##$TI= <>
##$TILT= no
##$TM1= 0
##$TM2= 0
##$TOPLEV= 0
##$USERP1= <user>
##$USERP2= <user>
##$USERP3= <user>
##$USERP4= <user>
##$USERP5= <user>
##$WDW= 1
##$XDIM= 8192
##$YMAX_p= 0
##$YMIN_p= 0
$$ End of Bruker specific parameters
$$ ---------------------------------
##NTUPLES= NMR FID
##VAR_NAME=  TIME,          FID/REAL,        FID/IMAG
##SYMBOL=    X,             R,               I
##VAR_TYPE=  INDEPENDENT,   DEPENDENT,       DEPENDENT
##VAR_FORM=  AFFN,          ASDF,            ASDF
##VAR_DIM=   8192,          8192,            8192
##UNITS=     SECONDS,       ARBITRARY UNITS, ARBITRARY UNITS
##FACTOR=    0.0002004,     1,               1
##FIRST=     0,             0,               0
##LAST=      1.6414764,     0,               0
##MIN=       0,             -122496,         0
##MAX=       1.6414764,     136282,          0
$$ Real data points
##PAGE= N=1
##DATA TABLE= (X++(R..R)), XYDATA
0@%%%%%%%%%jKrJ6j6J6j8K6l2L5m3N0n8P2q2R2j07J22j39J57j80K04k29K58k87
34a51L20l57L97m42M92n46O04o66P38q20R09j008J118j244J388j554J751j987
52a058K275k634L098l727M631o054Q638j4850N7221Q8742m6370o8924q8982m8176
66a16170j367N9957Q2648P4396K3050l1199p6373q0885n2166O206N7539Q4017
78B9653O7597K2932l4654p3605p9790m6444O776N7956Q0407O6137J9322l5340
90H0947p3326p5809m3771R344N7574P8675O1814J6491l6105p1202p3349m0620
102a09337J1437N7694P5740N8366J4083l6605p0221p0461l7178J3436N6911P3214
114C7079N5310J1717l7208o8376o7435l4709J4443N6458P1240N2424R554l7460
$$ plain form
0 0 0 0 0 0 0 0 0 0 0 -1 1 -8 8 -8 8 -10 16 -16 19 -24 26 -32 40 -42 50 -57 65 -74 83 -97 107 -122 136 -151
34 -151 169 -188 209 -233 259 -287 317 -349 389 -431 478 -530 588 -656 732 -822 929 -1058
52 -1058 1217 -1417 1681 -2046 2585 -3469 5169 -9681 47540 136282 89912 20988 -67994 -116170
66 -116170 -117537 -57580 25068 99464 122514 91315 14942 -65943 -118109 -111903 -54364 29653
78 29653 97250 120182 85528 11923 -67867 -114311 -107535 -49579 30828 96965 116287 80947
90 80947 7621 -68188 -111959 -102615 -45041 33634 95448 111939 75834 4632 -68717 -109337
102 -109337 -97900 -40206 35534 93900 107983 71378 1157 -69304 -106482 -93046 -36135 37079
114 37079 92389 104106 66898 -1478 -68913 -103622 -89179 -32721 38519 90943 100497 63037
126F3037o6981o5090l2057J6159N5832O8583M9690P934l7729o5774o2319k9319
138i8034J6908N4571O6753M7785O068l8436o4172n9505k7294J7448N4025O5055
150D1172M5244M259l8285o2564n7565k5429J8768N3547O2712M2699K949l8177
162D9330o1291n5241k3188J9309N2307O0971M1083J549l8599n9874n2831k1472
174h7947J9691N1736N9427L8891jl8330n8302n1093k0011K0531N1259N7583L6869
187H0303j051l8383n7407m9201j7873K1409N0316N5691L5016k282l8381n5981
199a7824m7195j6539K1819M9917N4357L2929l761l8151n4479m5505j5177K2499
211e7110M9312N2629L1279m596l8270n3801m3793j3134K3285M8415N0910K9693
$$ plain form
126 63037 -3944 -69034 -101091 -84932 -29100 39483 89173 97107 59378 -6396 -68715 -98034
138 -98034 -81126 -26555 40198 87983 94051 55615 -8557 -68062 -95356 -77908 -23883 41172
150 41172 86416 90675 52390 -10174 -67739 -93168 -74400 -20853 41859 84558 87507 49330
162 49330 -11961 -67202 -90390 -71081 -18774 42197 83280 84829 46230 -13644 -66475 -87947
174 -87947 -68256 -16520 42907 81798 81797 43467 -14835 -65928 -85939 -65408 -14149 43434 80303
187 80303 79252 40869 -16538 -65739 -83612 -62203 -11887 43804 78820 76538 38157 -17824
199 -17824 -65019 -81558 -59739 -9822 44535 77464 73703 35552 -18927 -64432 -79609 -57110
211 -57110 -7798 44831 76110 71514 33244 -20557 -64350 -77484 -54199 -5784 45126 74819
223G4819n701l8358n2556m1952j1855K3702M8073M9669K7733p046l8104n1189
235b2765m0477j0629K4397M7606M8004K6062p810l7961n0374l8935r013K4854
247d7041M6625M6628K4890q673l8148m9294l7175p852K5021M6116M5507K3316
259F9920r764l7884m8035l5886o849K5552M5681M4060K1869j0387l7727m7362
271b6812l4568n402K6026M4856M2741K0786j1165l7840m6388l3029m308K6208
283c8895M4378M1717J9324j2166l7586m5187l1779l470K6624M3990M0443J7956
295F5349j2799l7407m4441l0523k156K7015M3175L9163J6911j3407l7425m3557
307c0102k9141j176K7135M2685L8243J5677j4322l7235m2478k7970l52K7535M2285
$$ plain form
223 74819 69118 30760 -21796 -63748 -75603 -51901 -3828 45841 73574 66528 28424 -22765
235 -22765 -63242 -73871 -49474 -1868 46136 72198 64388 26427 -23947 -62882 -71895 -47041
247 -47041 -416 46212 71102 62429 24281 -25013 -62188 -70040 -45019 1097 46604 69920
259 69920 60156 22272 -25763 -61649 -68498 -42946 2735 46795 68664 58277 20550 -26812
271 -26812 -61380 -66782 -40756 4100 46841 67627 56462 18622 -27766 -60795 -65103 -38895
283 -38895 5483 47200 66524 54358 16772 -28415 -60194 -63664 -37040 6950 47393 65349
295 65349 52550 15143 -29298 -59821 -61977 -34962 8213 47376 64287 50880 13455 -30102
307 -30102 -59243 -60419 -33284 9401 47644 63321 48999 11764 -30714 -58684 -59036 -31501 10784
320A0784L6993J4311j4908l6917m1675k6836P76K7839M1548L5777J3327j5445
332D5574l6907m0827k5502J740K7967M0987L4817J2155j6245l6728l9770k4296
344e7035K549K8230M0477L3612J0943j6711l6397l8966k3269L534K8540L9854
356A5361L2459R924j7286l6298l8152k1990M517K8655L9252L1452Q797j8015l6066
369B610l7096k0781N250K8796L8709L0342P691j8434l5741l6281j9775O133K9014
382a9563L7987K9202O739j8832l5521l5392j8611O914K8953L7342K8239N819j9330
395C3946l5214l4436j7579P560K9065L6799K7194M793j9793l4862l3573j6517
407e2617Q355K9152L6110K6085L855k0109l4561l2672j5441R053K9094L5400K5130
$$ plain form
320 10784 47777 62088 47180 10263 -31412 -58248 -57472 -29633 11915 47692 61019 45574
332 45574 8667 -32160 -57662 -55922 -27955 13032 47849 60004 43759 7031 -32739 -57035
344 -57035 -54486 -26256 14221 47833 58776 42065 5668 -33298 -56567 -53033 -24493 15361
356 15361 47820 57744 40458 4160 -33992 -55982 -51465 -22810 16442 47894 56691 38676 2610
369 2610 -34486 -55267 -50017 -21221 17488 47830 55521 37087 1346 -34935 -54710 -48577 -19563
382 -19563 18424 47626 54365 35533 12 -35380 -53991 -47077 -18124 19218 47457 53276 33946
395 33946 -1268 -35704 -53283 -45723 -16658 20141 47335 52128 32335 -2527 -36100 -52617
407 -52617 -44262 -15110 21000 47085 50940 30831 -3730 -36402 -51843 -42790 -13696 21704 46834
420D6834L018k0501l4200l1768j4441R641K9088L4750K4117K134k0780l3776l0895
433c6779j3523J0266K9040L4074K3131J332k1048l3418l0049j2561J0841K8972
445i722L3420K2197M87k1339l3007k9162j1584J1374K8880L2744K1211l00k1561
458B3638l2601k8273j0664J1948K8804L2014K0255j083k1820l2162k7365r739
470d7048J2471K8668L1317J9275j841k1985l1683k6510q871J2971K8534L0629
482B5927J8358k567k2216l1275k5620p950J3475K8350K9930J7437l295k2367l0781
495a2594k4770p125J3889K8232K9233J6497l996k2481l0307k3939o262J4333K8041
508a249K8485J5601m617k2583k9857k3067n422J4714K7754K7766J4805n234k2683
$$ plain form
420 46834 49852 29351 -4849 -36617 -51058 -41417 -12329 22421 46538 48672 27892 -5884 -36779
433 -36779 -50302 -40036 -10996 23078 46209 47541 26493 -6925 -36974 -49535 -38694 -9722
445 -9722 23698 45895 46382 25043 -7964 -37126 -48710 -37336 -8456 24288 45499 45199 23638
458 23638 -8963 -37236 -47900 -35952 -7148 24866 45121 44038 22218 -9944 -37309 -47048
470 -47048 -34577 -5909 25408 44683 42842 20857 -10826 -37336 -46207 -33236 -4702 25927
482 25927 44285 41718 19502 -11773 -37393 -45343 -31868 -3518 26412 43849 40554 18187 -12594
495 -12594 -37364 -44489 -30600 -2368 26865 43362 39366 16885 -13422 -37361 -43623 -29290 -1249
508 -1249 27236 42837 38220 15637 -14220 -37287 -42709 -27995 -241 27525 42330 37096 14413
521A4413k9327k2245m708J5009K7616K7172J3925n875k2732k8846k1469l953J5443
534b5577K7377K6384J3064o368k2752k8409k0637l162J5733K7038K5733J2323
546D0747o943k2855k7851j9794k475J5957K6842K5043J1470p489k2772k7284j9091
559c6495j846J6268K6574K4315J0709p898k2734k6888j8328j138J6498K6208K3686
572B8931J0077q377k2834k6322j7510n29J6649K5949K3058R262q848k2640k5759
585a8893j6892PJ6918K5714K2350Q547r218k2584k5351j6169P40J7104K5267K1672
599B9212P955r614k2569k4816j5359J231J7171K5029K1124P205j0108k2427k4216
612b0182j4735J746J7449K4777K0369O445j0389k2328k3789j4033K429J7607K4308
$$ plain form
521 14413 -14914 -37159 -41867 -26858 758 27930 41855 35980 13248 -15598 -37067 -41020 -25577
534 -25577 1800 28184 41248 34880 12128 -16281 -36918 -40080 -24347 2691 28424 40747
546 40747 33804 10949 -16902 -36696 -39171 -23214 3628 28671 40141 32652 9880 -17404 -36495
559 -36495 -38341 -22073 4501 28816 39525 31627 8893 -17995 -36323 -37461 -20963 5245 28931
572 28931 39008 30631 7797 -18525 -36035 -36564 -19915 6034 29092 38354 29506 6866 -18893
585 -18893 -35785 -35778 -18860 6854 29204 37751 28533 5949 -19402 -35571 -34831 -17727 7540 29212
599 29212 37167 27553 4984 -19832 -35191 -33960 -16789 8240 29364 36569 26461 4034 -20182
612 -20182 -34917 -33171 -15722 9055 29424 35869 25480 3152 -20637 -34670 -32241 -14634 9674
625I674J9703N903j0781k2271k3225j3263K880J7600K4042J9197N212j1186k2104
638A381k2619j2657L318J7752K3725J8437M576j1337k1875k2195j2073L838J7836
651a1893K3260J7883M150j1679k1873k1670j1298M290J7779K2945J7376L486j2014
664B0742k1618k1072j0800M641J7941K2643J6670K857j2124k1385k0682j0208
676c2395N178J7954K2141J6058K487j2382k1368k0132r452N571J7846K1817J5570
689B8893J858j2676k1065j9531q969N843J7963K1538J4887J298j2788k0821j9169
702b2739q437O415J8012K0980J4254R00j2947k0703j8632p717O691J7847K0691
715A4615J3824L52j3312k0446j7944p230O964J7922K0359J3137k46j3336k0105
$$ plain form
625 9674 29377 35280 24499 2228 -20997 -34260 -31380 -13780 10262 29459 34671 23485 1381
638 1381 -21238 -33895 -30577 -12825 10900 29337 33913 22576 701 -21494 -33567 -29729 -11893
651 -11893 11367 29250 33400 21721 -152 -21822 -33120 -28830 -11051 11894 29270 32756 20742
664 20742 -876 -21948 -32748 -28107 -10166 12477 29147 32004 19880 -1505 -22187 -32395
676 -32395 -27217 -9263 12878 28936 31423 19041 -2327 -22459 -31911 -26340 -8494 13323 28893
689 28893 30751 18075 -2990 -22521 -31490 -25647 -7684 13854 28741 30039 17251 -3570 -22739
702 -22739 -31176 -24761 -6749 14231 28485 29385 16438 -4265 -22897 -30614 -23923 -6076 14615
715 14615 28439 28791 15479 -4967 -22911 -30141 -23177 -5255 15104 28241 27995 14659 -5446
728e446j7626o732P475J7949J9803J2517n78j3463k0030j7092o012P774J7744
741c717J9448J2116j108j3792j9713j6406n549P934J7768J9170J1463j677j3783
754A2154j9350j6045n119Q374J7774J8621J0860j916j3886j9308j5556m373Q715
767a9055J7485J8195J0456k382j4093j8945j4876l989Q759J7469J7970R875k919
780B3950j4121j8559j4507l596R181J7459J7397R260l134j4093j8454j4085k966
793b6268R447J7165J6993Q920l532j4330j8131j3403k551R490J7100J6733Q346
806B5979m033j4267j7720j3073k197R835J7086J6171P741m212j4160j7562j2695
819b3107j672J0045J6828J5762P453m538j4381j7275j2042j240J0068J6657J5515
$$ plain form
728 -5446 -23072 -29804 -22329 -4380 15423 27940 27362 13899 -6131 -23223 -29235 -21461 -3717
741 -3717 15731 27847 26739 12947 -6766 -23172 -28721 -20787 -3019 16151 27614 25937 12154
754 12154 -7196 -23241 -28360 -19986 -2212 16409 27269 25353 11467 -7841 -23397 -27770 -19055
767 -19055 -1570 16625 27081 24699 10606 -8339 -23215 -27204 -18445 -976 16994 26869 23950
780 23950 9829 -8730 -23237 -26833 -17652 -193 17204 26464 23330 9237 -9217 -23302 -26268
793 -26268 -16821 344 17337 26257 22725 8395 -9736 -23139 -25690 -16200 900 17633 25979
806 25979 21946 7679 -10041 -23114 -25311 -15476 1610 17781 25522 21310 7150 -10412 -23107
819 -23107 -24779 -14734 2094 17856 25309 20771 6390 -10885 -22927 -24167 -14099 2558 18073
832A8073O929m981j4292j6817j1676j000J0312J6633J5011O374n123j4208j6701
845a1466j1326m52J0553J6371J4566O055n439j4357j6420j0675k4J0543J6200
858D129J4310N535n863j4291j5944j0310K48J0741J6127J3840N001o024j4170
871C329j5786r925P32J0955J5811J3379M732o259j4291j5477r359J116J0930J5640
885E527J3125M279o667j4225j5056q950J378J1122J5576J2595L726o787j4053
898A590j4831q612J805J1254J5253J2183L474o963j4146j4555q066K134J1224
911h256J5048J1942L057p328j4041j4111p711K344J1375J4950J1452K557p417
924A3861j3848j3881p396K726J1490J4611J1044K350p563j3903j3621o857L047
$$ plain form
832 18073 25002 20021 5729 -11088 -22764 -23764 -13452 3181 18192 24566 19443 5235 -11466
845 -11466 -22792 -23244 -12691 3680 18246 24301 18862 4505 -11915 -22590 -22614 -12071 4129
858 4129 18439 23974 18111 3820 -12124 -22434 -22186 -11445 4682 18522 23523 17499 3329
871 3329 -12457 -22382 -21650 -10695 5116 18495 23227 16968 2677 -12800 -22159 -21043 -10113 5527
885 5527 18652 22931 16264 2039 -13017 -21967 -20589 -9467 6109 18704 22430 15643 1590
898 1590 -13241 -21853 -20048 -8794 6459 18642 22116 15153 1007 -13548 -21614 -19480 -8256
911 -8256 6792 18734 21791 14463 422 -13689 -21400 -19056 -7681 7269 18721 21278 13861
924 13861 13 -13868 -21264 -18538 -7048 7563 18607 20957 13394 -509 -14130 -20987 -17940
937a7940J1365J4440J0796J939p858j3768j3165o512L184J1482J4315J0358J469
950B0105p939j3537j2936o222L554J1574J3961R911J268q019j3579j2668n716
963b0243L854J1452J3720R689R39q321j3450j2229n372L978J1539J3641R239M39
977A8875q398j3201j1953n107M358J1606J3268Q764K35q437j3185j1689m588M619
991a4833J1480J2996Q550p9q727j3059j1232m213M742J1504J2880Q109n32q761
1005H825j2797j0971l981N054J1580J2543P674p49q791j2769j0699l504N315J1425
1019a845J2236P437j012r019j2597j0235l173N385J1397J2082P062j405r073j2340
1033e100r952k920N626J1457J1760O603j611r041j2258r700k506N863J1284J1439
$$ plain form
937 -17940 -6575 7865 18661 20600 12742 -1026 -14191 -20703 -17519 -6037 8278 18636 20105
950 20105 12166 -1371 -14307 -20529 -16975 -5401 8560 18471 19739 11720 -1859 -14527 -20243
963 -20243 -16389 -4937 8783 18472 19411 11090 -2360 -14589 -19961 -15983 -4444 9197 18436 18875
977 18875 10477 -2724 -14677 -19784 -15426 -3820 9448 18212 18447 10010 -3175 -14864 -19452 -14833
991 -14833 -3353 9643 18193 18114 9387 -3672 -14904 -19117 -14375 -2871 10009 18118 17586 8825
1005 8825 -3972 -14943 -18924 -13870 -2290 10253 17927 17178 8387 -4382 -15081 -18585 -13270 -1845
1019 -1845 10391 17828 16816 7797 -4800 -15035 -18208 -12823 -1426 10656 17718 16313 7240 -5100
1033 -5100 -15052 -17972 -12346 -889 10871 17474 15863 6822 -5436 -15136 -17642 -11779 -495 10944
1047A0944O363j812r175j2111r293k184N909J1208J1300O047k157r229j1825r018
1061a5033j969O098J1231J0982N625k342r164j1698q760j618O277J1054J0678
1074A1361N398k517r263j1553q393j310O322J0971J0500N086k840r267j1286q089
1088a4880j110O450J0946J0216M695k973r206j1153p872p89O625J0815R904M465
1102A6133l174r289j0989p477m77O676J0663R689M172l432r252j0720p197l13
1116a4987O781J0611R452L816l565r234j0563o956KO941J0469R139L550l731r266
1131B459j0363o606K58O958J0341Q934L280l977r253j0133o317M66P071J0285
1145C403Q651K922m134r201r946o068P74P178J0125Q331K696m252r211r761n741
$$ plain form
1047 10944 17307 15495 6320 -5791 -15084 -17268 -11359 -151 11149 17196 15039 5810 -6015 -15033
1061 -15033 -17002 -10904 327 11309 16934 14592 5428 -6270 -15030 -16648 -10371 683 11361
1074 11361 16759 14242 4979 -6574 -14967 -16277 -9955 1016 11516 16602 13762 4495 -6791 -14880
1088 -14880 -15990 -9540 1406 11622 16317 13344 4138 -7015 -14887 -15676 -9051 1764 11668 16133
1102 16133 12959 3670 -7319 -14796 -15273 -8597 2066 11755 15927 12495 3243 -7477 -14674 -14987
1116 -14987 -8206 2405 11857 15673 12108 2874 -7689 -14645 -14643 -7702 2767 11906 15456 11725 2459
1131 2459 -7904 -14510 -14252 -7294 3047 11981 15261 11284 2031 -8102 -14419 -13953 -6882 3403
1145 3403 12054 14976 10842 1641 -8305 -14373 -13599 -6421 3704 12035 14731 10479 1268 -8493 -14234
1160a4234J007P190R997Q148K427m483r177r515n461J190P268R902P862K112m589
1175I644r079r325n230J408P351R729P612J908m705r076r165m927J634P373R598
1190D750P371J669m876r032q900m663J799P396R479P119J392m971q938q703m459
1205a3567J990P460R334O868J173n082q910q533m146K190P454R197O634R43n210
1220G795q843q319l902K362P482R053O412P00n307q770q120l666K549P516Q898
1235E840O136N00n386q703p911l425K703P518Q734N935K88n485q620p724l183
1250a2783K860P527Q600N688P7n577q555p492k947L012P525Q453N446j51n652
1265F031q459p296k713L177P505Q308N213l52n740q373p086k478L323P507Q137
$$ plain form
1160 -14234 -13227 -6037 3960 12108 14535 10052 875 -8640 -14101 -12911 -5643 4259 12121 14233 9644
1175 9644 565 -8760 -13990 -12582 -5231 4498 12110 14018 9313 237 -8928 -13855 -12221 -4848 4750
1190 4750 12121 13790 8914 -118 -9018 -13681 -11882 -4486 4993 12112 13504 8533 -405 -9108 -13567
1205 -13567 -11577 -4117 5217 12085 13258 8176 -734 -9267 -13413 -11223 -3769 5428 12062 13005 7795
1220 7795 -1048 -9367 -13269 -10907 -3425 5628 12040 12740 7433 -1337 -9457 -13123 -10574 -3058 5840
1235 5840 11976 12476 7090 -1613 -9524 -12949 -10246 -2728 6006 11941 12229 6744 -1876 -9600 -12783
1250 -12783 -9923 -2396 6204 11892 11969 6392 -2163 -9655 -12602 -9590 -2065 6388 11834 11683 6031
1265 6031 -2428 -9724 -12437 -9260 -1755 6553 11766 11414 5674 -2699 -9785 -12263 -8940 -1433 6704
1280F704M989n57n801q279o880k258L470P481P986M765p27n877q190o688k025
1295a1887L585P482P819M545r33n921q066o484j836L706P449P660M330j091n947
1310D411p994o287j641L829P408P503M123j251o019p876o081j435L916P359P373
1325G338L901j422o021p754n926j253M027P341P199L691j548o055p693n716j036
1340a0927M122P282P015L513j700o092p557n502q74M173P241O901L317j860o113
1355B939p444n340o86M301P210O699L082j977o112p356n146m78M379P121O565
1370G757K911k132o166p234m923l12M462P079O412K704k333o166p082m735j49
1385i907M570P037O206K471k418o149o998m557O1M652O930O040K331k562o202
$$ plain form
1280 6704 11693 11136 5335 -2944 -9824 -12082 -8612 -1131 6855 11620 10893 5016 -3174 -9862 -11887
1295 -11887 -8302 -820 6999 11544 10611 4690 -3376 -9860 -11696 -7990 -541 7119 11449 10358 4411
1310 4411 -3583 -9870 -11511 -7682 -274 7229 11352 10101 4082 -3794 -9875 -11310 -7394 -35 7338
1325 7338 11239 9817 3796 -3958 -9884 -11137 -7110 231 7430 11121 9573 3518 -4175 -9891 -10927
1340 -10927 -6805 477 7492 11005 9305 3213 -4344 -9846 -10720 -6547 694 7595 10912 9052 2939
1355 2939 -4505 -9845 -10531 -6230 980 7679 10761 8784 2672 -4684 -9830 -10308 -5929 1192 7757
1370 7757 10668 8536 2370 -4864 -9787 -10099 -5637 1442 7854 10558 8225 2059 -5023 -9758 -9907
1385 -9907 -5337 1700 7906 10377 7959 1810 -5188 -9745 -9684 -5032 1898 7938 10269 7707 1505
1400A505o876m321K50M662O908N911K094k725o161o709m160L61M773O844N705
1415H061J897k788o127o634m011N62M857O733N539J752k899o174o493l768P20
1430h773M822O680N407J577l053o140o318l631Q11M910O639N225J347l106o084
1445C13o256l462J018M979O505N012J263l196o114o121l235J142M957O423M937
1460H165J082l345o075n942l083J220N025O404M742Q35l370n990n843k972J408
1475g739N069O224M566P80l430o017n740k740J536N019O152M483O11l584n976
1490g86n537k588J595N068O142M260L94l619n869n460k472J774N120N983M065
1505H070L20l645n908n351k239J906N074N869L983J73l785n845n140k086J914
$$ plain form
1400 1505 -5371 -9692 -9442 -4780 2128 8039 10133 7408 1247 -5462 -9622 -9261 -4488 2356 8061
1415 8061 9958 7170 1043 -5591 -9602 -9040 -4183 2550 8089 9841 6942 768 -5725 -9493 -8773
1430 -8773 -3951 2729 8136 9713 6660 520 -5798 -9429 -8618 -3708 2931 8156 9503 6397 313
1445 313 -5943 -9405 -8387 -3408 3097 8109 9372 6176 62 -6059 -9294 -8152 -3195 3228 8165
1460 8165 9247 5902 -173 -6115 -9198 -7978 -2953 3451 8193 9028 5658 -332 -6175 -9147 -7739
1475 -7739 -2670 3554 8120 8900 5470 -547 -6287 -9027 -7491 -2472 3680 8163 8774 5190 -786
1490 -786 -6323 -8911 -7316 -2248 3894 8154 8548 4929 -940 -6400 -8872 -7098 -1978 4005 8070
1505 8070 8390 4745 -1163 -6514 -8753 -6847 -1773 4096 8079 8252 4467 -1378 -6518 -8604 -6690
1520f690N103N861L802m7l810n743n038j988K089N157N690L607j24l821n734m960
1536f646j764K206N083N575L539k32l942n707m760j622K228N076N575L368m47
1551G530l959n578m645j546K350N140N416L147n02l950n590m547j335K472N071
1566e26N288L070o07m080n523m353j188K482N072N238K926q10m073n394m246j125
1582g849K609N101N104K730q57m061n402m158r16K726N015M968K640r49m164n320
1598b783l951p84K689N008M929K498j122m137n205l870p28K822N046M783K313
1613G508j205m126n211l757n20K934M945M637K238j289m222n137l553l88K917
1628d229M921M628K080j462m227m994l459l23L039M953M470J871j500m198m966
$$ plain form
1520 -6690 -1587 4274 8076 8029 4219 -1524 -6562 -8550 -6461 -1304 4386 7993 7869 4048 -1686 -6646
1536 -6646 -8410 -6204 -1121 4454 7993 7761 3819 -1888 -6648 -8270 -6042 -966 4609 7977 7530
1551 7530 3571 -2007 -6652 -8198 -5848 -708 4708 7855 7353 3403 -2187 -6734 -8069 -5597 -526
1566 -526 4762 7832 7225 3145 -2378 -6731 -7919 -5437 -365 4873 7799 6989 2916 -2478 -6724 -7849
1582 -7849 -5240 -139 4965 7695 6838 2777 -2625 -6783 -7699 -4973 42 5010 7650 6701 2537 -2783
1598 -2783 -6734 -7518 -4829 179 5108 7606 6484 2347 -2858 -6728 -7456 -4634 412 5195 7508
1613 7508 6303 2177 -3034 -6791 -7311 -4377 568 5205 7443 6154 1932 -3205 -6758 -7146 -4229
1628 -4229 692 5320 7400 5938 1711 -3283 -6742 -7065 -4026 927 5397 7268 5768 1570 -3396
1643c396l375j48L137M852M331J813j561m312m901l147j2L101M830M304J651j749
1659E418m276m756l047L7L198M849M121J478j777m219m746k999K13L304M771L977
1675E546J419j859m315m674k768L54L258M688L956J281j989m294m517k685L76
1690f223L314M735L834J105k039m227m492k639N34L429M640L659J046k064m296
1705C16m441k427O59L370M566L647R43k205m289m285k325O66L425M585L521P68
1721F494k255m204m250k261Q03L507M513L344P02k256m254m203k109R31L485M394
1737B381L342O16k408m264m052j970R65L500M437L192M37k441m175l981j920J076
1753e265L576M358L042L74k445m210l987j743J215L567M269K990K90k586m218
$$ plain form
1643 -3396 -6771 -6919 -3782 1070 5401 7214 5653 1341 -3560 -6707 -6719 -3618 1212 5516 7167 5418
1659 5418 1142 -3614 -6661 -6624 -3426 1423 5544 7022 5245 1026 -3720 -6719 -6506 -3202 1569 5546
1675 5546 6965 5106 791 -3883 -6651 -6297 -3039 1649 5605 6886 4897 603 -3914 -6599 -6223
1690 -6223 -2909 1826 5660 6765 4726 499 -3993 -6632 -6098 -2669 1971 5630 6676 4612 316
1705 316 -4125 -6552 -5893 -2523 2043 5690 6633 4428 139 -4146 -6471 -5805 -2380 2205 5726 6494
1721 6494 4239 35 -4215 -6476 -5673 -2166 2347 5691 6393 4137 -117 -4320 -6429 -5498 -2013 2381
1737 2381 5723 6339 3931 -333 -4385 -6355 -5390 -1890 2547 5739 6176 3735 -440 -4421 -6341 -5265
1753 -5265 -1689 2669 5711 6085 3640 -570 -4557 -6300 -5085 -1518 2751 5741 6031 3445 -773
1768g73l794j618J226L564M289K881J09k620m137l724j573J341L640M207K712
1783E730M7k644m143l688j393J443L620M088K654k1k722m161l529j289J461L618
1799i29M114K553j86k778m072l451j224J565L678M001K396k44k764m070l406j105
1815e922J680L651L907K350l08k842m065l293r66J702L630L895K260m42k899l962
1831a624l203r21J753L685L813K106m98k863l977l163p99J858L636L743K040n64
1847E022k938l960l014o94J875L630L688J955o89k954l857k940o70J942L660L626
1863C682J826p61k933l859k887n41K038L627L520J747p81l016l842k747m13K026
1879c314L601L491J676r05l041l743k676l69K102L649L402J509r69l019l720k590
$$ plain form
1768 -773 -4567 -6185 -4959 -1395 2894 5775 5884 3264 -873 -4597 -6170 -4829 -1189 3018 5730
1783 5730 5777 3133 -1010 -4698 -6091 -4648 -1028 3060 5714 5693 2971 -1190 -4719 -6008 -4547 -929
1799 -929 3185 5738 5552 2774 -1298 -4749 -5973 -4408 -730 3271 5667 5423 2659 -1411 -4817 -5922
1815 -5922 -4242 -591 3316 5666 5358 2516 -1549 -4842 -5808 -4106 -476 3419 5679 5237 2338 -1624
1831 -1624 -4827 -5748 -3995 -310 3503 5609 5111 2248 -1729 -4892 -5691 -3833 -197 3546 5586 5022
1847 5022 2084 -1876 -4890 -5584 -3709 -79 3609 5564 4875 1921 -1936 -4876 -5546 -3604 56 3682
1863 3682 5508 4747 1814 -2045 -4932 -5473 -3435 192 3712 5459 4678 1662 -2180 -4927 -5340 -3314
1879 -3314 287 3778 5454 4549 1508 -2235 -4911 -5280 -3178 471 3873 5382 4413 1394 -2326 -4916
1895d916k69K179L602L274J476j012l079l703k481j39K190L559L268J376j138
1910D187l101l616k371r3K227L586L173J235j204l061l577k321J1K315L552L065
1926D007J173j228l122l564k187J09K334L510L037J069j329l138l453k103J81
1941d704K341L527K948R62j390l110l412k045K57K423L479K851Q88j434l126l385
1957b930j927L56K433L434K770Q17j494l137l312j832L95K449L439K722P10j562
1973C331l133l234j792M85K511L383K627O21j580l134l190j689N56K509L347K551
1989D169N83j636l140l135j588N97K540L351K476M69j710l109l062j535O88K577
2005a465L298K405L75j734l130l017j424P56K596L271K296L18j794l123k943j330
$$ plain form
1895 -4916 -5185 -3006 596 3870 5346 4334 1255 -2448 -4929 -5068 -2878 681 3949 5325 4187
1910 4187 1086 -2530 -4901 -4994 -2767 819 3992 5227 4023 962 -2615 -4936 -4925 -2610 942 4007
1926 4007 5180 3952 830 -2734 -4921 -4812 -2478 1032 4069 5138 3809 671 -2782 -4885 -4704
1941 -4704 -2363 1164 4112 5074 3684 574 -2838 -4883 -4626 -2203 1276 4127 5015 3581 455 -2930
1957 -2930 -4857 -4501 -2068 1366 4136 4953 3459 322 -2990 -4822 -4427 -1978 1461 4183 4893 3331
1973 3331 198 -3036 -4828 -4343 -1832 1551 4178 4799 3219 85 -3105 -4794 -4238 -1729 1618 4169
1989 4169 4752 3116 -24 -3159 -4747 -4150 -1610 1741 4217 4686 2976 -133 -3195 -4730 -4042 -1465
2005 -1465 1833 4238 4613 2879 -251 -3268 -4692 -3936 -1340 1931 4227 4545 2751 -372 -3315 -4645
2021d645Q23K611L218K226K23j830l081k896j264Q75K635L191K155J37j866l088
2037e76k841j182R71K640L150K073P7j933l078k751j101J014K665L104K007qj955
2054B276l070k694j002J064K677L058J920o5k008l043k615r35J130K676L007J859
2070D235j41k084l020k496q54J156K686K961J773k23k047l024k498p67J240K698
2086d05K919J676k77k084k999k410p12J265K715K881J601l48k111k971k368o27
2102d255J334K721K817J529m05k137k937k304n56J374K702K777J481m64k162k937
2118a422k225m97J440K704K715J410n34k197k877k158m47J478K719K654J334n74
2134C523k214k866k109l57J522K693K617J260o45k243k830k018k81J535K692K567
$$ plain form
2021 -4645 -3822 -1211 2007 4233 4456 2626 -455 -3351 -4615 -3740 -1105 2086 4241 4378 2512 -576
2037 -576 -3417 -4599 -3628 -988 2162 4235 4312 2379 -699 -3450 -4551 -3537 -872 2232 4239 4231 2276
2054 2276 -794 -3488 -4490 -3426 -749 2309 4229 4164 2156 -887 -3502 -4437 -3307 -631 2376 4235
2070 4235 4094 2010 -1010 -3506 -4360 -3204 -518 2443 4216 3993 1946 -1078 -3576 -4343 -3103 -405
2086 -405 2514 4190 3913 1829 -1170 -3580 -4292 -3027 -312 2569 4170 3822 1711 -1260 -3628 -4255
2102 -4255 -2921 -200 2617 4146 3741 1604 -1333 -3637 -4193 -2819 -117 2660 4141 3677 1515 -1422
2118 -1422 -3647 -4144 -2704 0 2715 4125 3591 1394 -1483 -3641 -4088 -2610 109 2763 4097 3523
2134 3523 1309 -1557 -3666 -4023 -2501 192 2809 4069 3424 1181 -1649 -3667 -3948 -2413 279 2846
2150B846J191o98k274k772j965k34J596K687K511J116p59k265k768j911j31J631
2166b199K678K435J055q17k296k728j801q6J657K649K417R89q84k311k677j737
2182c656m0J692K665K327R16r29k292k654j707L5J741K634K277Q58r49k323k615
2199b020j635Q7J743K616K246P99j023k341k561j559J26J772K637K179O89j051
2215B704k323k514j533J99J823K605K082O84j085k342k485j446K79J810K542K085
2231C085O25j145k346k420j404L01J847K551K016N27j159k315k412j359L70J895
2247a343K520J934M88j184k353k374j254M31J880K472J921M22j264k340k305j195
2263c544M43J903K502J849L46j295k308k294j151N09J954K457J752L21j300k346
$$ plain form
2150 2846 4037 3339 1065 -1707 -3672 -3906 -2310 377 2888 4004 3245 980 -1788 -3699 -3830 -2199
2166 -2199 479 2914 3969 3152 856 -1872 -3673 -3759 -2102 547 2964 3953 3069 758 -1919 -3656
2182 -3656 -3696 -2004 661 2988 3904 2975 683 -1971 -3678 -3643 -1902 732 3009 3867 2918 595 -2020
2199 -2020 -3655 -3568 -1825 791 3037 3836 2813 472 -2089 -3648 -3522 -1750 887 3066 3755 2704
2215 2704 381 -2133 -3666 -3467 -1644 961 3043 3727 2642 300 -2185 -3631 -3352 -1542 1000 3085
2231 3085 3710 2565 219 -2201 -3605 -3304 -1457 1094 3110 3637 2478 163 -2249 -3608 -3238 -1343
2247 -1343 1177 3111 3599 2415 62 -2312 -3566 -3135 -1255 1217 3138 3560 2296 -44 -2349 -3544
2263 -3544 -3101 -1198 1304 3153 3499 2204 -104 -2398 -3549 -3040 -1086 1371 3123 3444 2144 -202
2279b02k252j061N77J923K416J756K55j371k333k190r88N94J937K430J690J47
2295C328j379k287k153r69O50J997K383J588J37j393k309k128q81P14J975K319
2311A592J587Q1j407k352k055q35P44J979K322J520qj476k276j993q01P93K030
2328e55K261J431k2j485k273j983p24Q56K003K231J406n9j566k258j896o68Q77
2345b424J994K229J362j54j554k231j844o58R12K058K181J260j87j540k240j846
2361b682n43R73K006K128J258k14j615k234j756m94R66K027K122J194l08j635
2377A193k171j717m74J029K052K086J098l57j587k179j711l83J084K008K018J086
2393C075l55j667k166j623l18J075K022K018J027m58j684k101j563l14J112K083
$$ plain form
2279 -202 -2454 -3515 -2938 -1015 1401 3157 3412 2041 -292 -2482 -3470 -2876 -939 1491 3181 3328
2295 3328 1949 -338 -2491 -3460 -2810 -813 1570 3158 3295 1902 -407 -2535 -3416 -2702 -727 1592
2311 1592 3179 3260 1853 -499 -2554 -3389 -2645 -666 1656 3176 3168 1692 -584 -2577 -3378 -2585 -555
2328 -555 1706 3137 3115 1630 -643 -2626 -3350 -2494 -491 1740 3146 3087 1521 -737 -2633 -3301 -2424
2345 -2424 -430 1799 3161 3007 1453 -778 -2622 -3280 -2368 -310 1871 3131 2944 1404 -836 -2682
2361 -2682 -3225 -2252 -246 1882 3140 2926 1311 -923 -2679 -3173 -2207 -180 1942 3136 2828 1193
2377 1193 -978 -2695 -3169 -2140 -88 1998 3096 2739 1152 -1027 -2738 -3121 -2037 -29 1989 3075
2393 3075 2720 1053 -1113 -2736 -3054 -1979 43 2061 3088 2630 946 -1155 -2718 -3032 -1920 163
2409A63J944R31m67j657k105j554k48J193K020J900R15m96j720k104j455j64J169
2426a735J998J893Q76n89j731k033j403j67J211K029J858P75o19j701k041j394
2442b773p4J274K002J773P38o20j730k034j312j6J250J981J764P17o90j766j953
2459a469j277%J295K003J725O14p25j725j941j259O3J349J965J643O06p31j742
2476C94j964j157J21J315J929J646N78p91j772j886j125J28J347J955J608M91
2492B817q42j727j856j107J65J396J913J538M54q17j752j862j051K53J376J884
2508G82J525M17q68j770j788r68K46J379J900J476L63r07j743j766r71K99J448
2525i46J873J403L28r09j750j764q88L76J406J817J400K96r60j769j679q52L62
$$ plain form
2409 163 2107 3038 2571 914 -1191 -2745 -2993 -1800 220 2120 3035 2539 819 -1285 -2740 -2904 -1735
2426 -1735 263 2156 3032 2443 712 -1321 -2724 -2891 -1680 349 2207 2982 2363 662 -1379 -2773
2442 -2773 -2847 -1573 429 2202 2940 2320 590 -1444 -2756 -2772 -1522 459 2223 2940 2250 484 -1469
2459 -1469 -2746 -2746 -1451 552 2277 2891 2166 441 -1500 -2759 -2696 -1347 618 2261 2867 2136 394
2476 394 -1570 -2727 -2606 -1291 638 2284 2862 2071 299 -1587 -2712 -2584 -1237 718 2326 2817
2492 2817 1975 248 -1608 -2715 -2550 -1154 759 2297 2751 1934 182 -1680 -2731 -2478 -1102 782
2508 782 2307 2724 1856 86 -1702 -2670 -2424 -1045 855 2331 2694 1787 44 -1722 -2693 -2394 -946
2525 -946 927 2330 2658 1749 -1 -1765 -2653 -2277 -871 946 2346 2642 1682 -87 -1766 -2618 -2256
2542b256J422J847J359K07r92j707j667q31M11J453J830J259J94r73j746j662
2558a852p64M75J465J760J255J77j049j739j600o93M69J452J781J231R0j080j695
2575c17j560o82N07J499J759J146N1j052j697j564o27N72J490J679J154M2j120
2592A280j721j469n72N71J478J702J101l6j117j677j460n68N95J532J681J025
2608B345p1j102j681j453n05O65J499J619J013q5j133j707j392m25O62J469J631
2625A349R82j39j191j628j344m37O82J516J611R05j72j160j633j337l81P38J502
2642a37J552Q92j83j185j663j280l23P43J501J531Q69k44j223j608j208l37P66
2659a537J508J525P96k87j196j575j244k71Q17J498J465P64k80j231j609j167
$$ plain form
2542 -2256 -834 1013 2372 2579 1587 -120 -1787 -2618 -2207 -754 1076 2335 2529 1556 -190 -1852
2558 -1852 -2616 -2141 -676 1084 2339 2516 1467 -272 -1872 -2565 -2096 -644 1137 2368 2458 1378 -317
2575 -317 -1877 -2559 -2052 -553 1206 2352 2403 1351 -346 -1910 -2537 -1965 -475 1204 2358 2400 1280
2592 1280 -441 -1910 -2482 -1911 -433 1269 2370 2334 1217 -460 -1920 -2488 -1893 -361 1320 2345
2608 2345 2274 1172 -509 -1962 -2467 -1802 -303 1316 2329 2244 1111 -596 -1988 -2413 -1751 -282 1349
2625 1349 2331 2192 1001 -627 -1971 -2408 -1726 -210 1401 2306 2134 974 -659 -1996 -2377 -1639 -137
2642 -137 1415 2307 2124 939 -724 -2004 -2327 -1584 -83 1448 2317 2073 850 -758 -1966 -2303 -1537
2659 -1537 -29 1496 2292 2005 809 -766 -2010 -2281 -1464 34 1499 2263 1983 752 -857 -2024
2675b024k04Q20J478J451P33l34j260j552j124j94Q31J502J438O74l68j246j543
2692i22j110j55Q85J502J379O32l80j254j547j059r7Q94J449J374O26m33j261
2709E23j508j019q2Q86J479J348N58m57j268j474j005m5R36J469J299N23m71j274
2727D18j465r68MR23J448J289N08n24j288j437r22K8R34J458J261M52n41j269
2745C09j428q87M5R72J441J193M35n35j283j413q51Q3R84J422J179M28n87j298
2763B09j392q10J17R89J420J173L55o13j273j373p78J36J006J421J128L10o21
2780A404j292j341p46J71J031J389J086L03o51j284j333p05K01J031J390J060
2796A714K50o64j297j296o82K33J048J382J023K11o85j276j274o41K64J057J358
$$ plain form
2675 -2024 -2228 -1408 70 1521 2254 1920 660 -892 -2016 -2210 -1379 123 1561 2235 1867 621 -922
2692 -922 -2032 -2187 -1302 200 1579 2211 1831 577 -970 -2029 -2126 -1232 217 1591 2217 1784 523
2709 523 -985 -2004 -2086 -1200 279 1627 2185 1728 460 -1014 -2019 -2064 -1128 341 1640 2163 1692 418
2727 418 -1047 -2015 -2011 -1088 360 1649 2157 1633 345 -1092 -2014 -1986 -1052 406 1667 2119 1578 309
2745 309 -1119 -2006 -1961 -989 452 1645 2080 1545 262 -1151 -2002 -1919 -935 487 1666 2094 1507 209
2763 209 -1183 -1993 -1876 -887 533 1706 2061 1448 175 -1198 -1976 -1840 -834 587 1715 2025 1404
2780 1404 112 -1229 -1975 -1804 -773 616 1702 2005 1354 70 -1263 -1968 -1767 -736 654 1714
2796 1714 1964 1300 3 -1293 -1975 -1742 -694 688 1711 1922 1237 -39 -1313 -1954 -1690 -633 725
2813G25R86K12p19j284j245o13K93J064J351R63J58p36j282j217n77L31J062J337
2831H09R41J15p52j278j193n42L55J081J296R01R8p64j276j187m98L69J098J296
2849H69Q75N4p98j262j134m82L99J095J271Q41K8p98j268j116m42M35J099J251
2867I17Q10j1q02j258j090m01M44J096J260P62k5q37j243j061l76M80J104J222
2885I91P47o5q55j249j023l31M92J115J195P18r3q75j210j026l04N19J116J171
2903A033O81j31q76j205r83k74N25J129J158O45j38q99j210r42k43N57J112J134
2921A073O30j82r08j183r25k23N99J100J119N83k02q95j188q87j85N89J111J092
2939A118N61k26q97j201q49j67O27J103J085N21k50r25j149q48j27O38J110J039
$$ plain form
2813 725 1711 1923 1204 -80 -1325 -1938 -1645 -581 770 1733 1891 1155 -127 -1344 -1921 -1590 -528 809
2831 809 1750 1865 1113 -165 -1358 -1900 -1545 -464 832 1733 1831 1067 -209 -1396 -1894 -1525 -427 869
2849 869 1744 1798 1000 -262 -1396 -1878 -1479 -384 887 1728 1756 958 -310 -1426 -1868 -1433 -334 917
2867 917 1727 1716 914 -344 -1434 -1835 -1391 -295 965 1727 1702 865 -378 -1439 -1815 -1335 -231 991
2885 991 1738 1673 818 -431 -1454 -1785 -1293 -178 1017 1735 1642 767 -443 -1469 -1773 -1254 -138 1033
2903 1033 1714 1583 707 -498 -1481 -1755 -1230 -101 1057 1702 1564 665 -545 -1487 -1730 -1173 -61 1073
2921 1073 1703 1521 613 -570 -1495 -1718 -1119 -19 1100 1683 1481 586 -602 -1489 -1674 -1085 26 1118
2939 1118 1679 1453 556 -645 -1494 -1661 -1034 69 1154 1675 1425 500 -649 -1497 -1624 -986 124 1163
2957A163M88k69r20j144q19j02O48J108J023M62k99r35j145p68o2O55J096J003
2975A183M43l40r42j107p45n4O75J084R91M09l40r31j112p30j7P08J082R63L81
2994A601l74r37j108o84J2P01J086R38L56l91r63j062o58K5P16J068R24L21m15
3013A156r41j054o52M7P38J070Q83L00m17r63j020o29Q6P38J036Q89K68m59r69
3032A07j007n87R6P47J072Q48K27m74r48r98n84J35P69J048Q13K07m58r51j004
3051i42n31J68P47J031Q08J90m98r63r72m89J58P81J035P68J70n36r21r65n00
3070a461J97Q02J006P38J46n05r79r42m45K30P87R91P33J24n46r78r02m12K12
3089a204P95R98P10Q6n58r46q89m24K46Q23R67O75Q0n58r61q92l69K93P98R44
$$ plain form
2957 1163 1651 1382 462 -682 -1501 -1603 -955 153 1176 1638 1339 404 -741 -1509 -1571 -916 180 1183
2975 1183 1626 1286 344 -763 -1508 -1562 -887 197 1188 1597 1257 326 -786 -1516 -1533 -825 257 1220 1601
2994 1601 1227 290 -818 -1502 -1490 -789 297 1235 1591 1200 237 -825 -1483 -1458 -742 326 1250 1571 1156
3013 1156 215 -839 -1491 -1444 -706 364 1247 1547 1130 167 -853 -1482 -1396 -658 378 1267 1535 1076 107
3032 107 -900 -1487 -1391 -644 428 1276 1503 1029 81 -917 -1501 -1366 -597 451 1264 1471 1013 62 -942
3051 -942 -1473 -1305 -558 473 1281 1471 973 10 -962 -1451 -1293 -512 523 1291 1461 925 4 -961 -1461
3070 -1461 -1264 -462 544 1282 1428 923 -56 -998 -1443 -1213 -426 565 1298 1422 876 -102 -1004 -1416 -1204
3089 -1204 -409 589 1299 1385 827 -119 -1008 -1432 -1186 -363 604 1279 1359 801 -160 -1052 -1421 -1128 -330 614
3109F14O60P4n87r56q50l44K81Q02R73O46J7n95r37q41l46L09Q28R45N98Jn83
3130G09r29q35l24L48Q04R15N90J1o13r40p95k88L23Q06R27N90m9o17r28p70k92
3151a357L37Q36R16N36m3o13r19p82k63L79Q16Q93N34m9o46r24p43k09L53Q14
3171a34Q90N21q9o44r11p06k39L98Q31Q74M89j16o36q86p49j76M14Q20Q49M69
3191A269j22o44r11o84j68M19Q09Q45M47j49o77q71o54j60M17Q39Q28L92j58o55
3211D12q58o65j40M61Q11P99M01j65o63q91o34p9M51P98Q22L85k00o93q48o02
3231a098j01M61Q17P97L57k23o72q40o02q3M79Q30P43L55k12p02q48n75m9N06
3251f60P95P42L41k52p18q08n57l4M84Q30P41K88k73o76q14n55j5N03Q20P06K85
$$ plain form
3109 614 1274 1348 761 -195 -1045 -1389 -1108 -306 667 1313 1330 735 -202 -1043 -1389 -1080 -252 693 1291 1292 709
3130 709 -220 -1055 -1379 -1031 -227 688 1278 1289 676 -264 -1059 -1347 -1024 -218 709 1299 1250 633 -295 -1065 -1357
3151 -1357 -1020 -184 732 1268 1225 612 -307 -1089 -1352 -973 -157 736 1270 1221 575 -349 -1092 -1301 -948 -134
3171 -134 756 1277 1188 544 -367 -1073 -1312 -914 -83 791 1280 1164 528 -358 -1107 -1283 -869 -49 800 1269
3191 1269 1147 503 -408 -1092 -1260 -841 -32 813 1260 1111 434 -437 -1091 -1251 -834 5 833 1225 1067 412
3211 412 -446 -1111 -1251 -790 21 820 1221 1056 393 -498 -1132 -1211 -760 38 860 1245 1045 352 -496 -1098
3231 -1098 -1199 -738 79 876 1233 1010 338 -502 -1104 -1187 -708 122 865 1220 1008 306 -542 -1117 -1166 -660
3251 -660 135 877 1218 966 248 -560 -1117 -1151 -667 163 904 1192 919 243 -571 -1126 -1141 -638 182 888 1173
3272A173k68p11p92n30J2N14P84P13K94k82p27p94m95J8N24Q12O98K29l24o99
3292A49p69m92L6N54Q17O37K27l14p04p74m82Q5N31P90O51K11l24p30p50m54P1
3313a034N49Q01O40J74l61p01p42m36Q0N88P80O05J58l53o97p58m17J26N90P53
3333C45O10J52l81p44o95l77J07N75P78N95J24m10p13o87l72J51N96P68N45R9
3353A066l81p11p01l55J81N92P34N31J18m08p24o93l25J94N75P50N31Q2m30p20
3373i4o57l20J88O13P37N14L6m27p05o67k99K33N96P13M90N5m32p31o35k61K28
3394h25N95P21M84J8m58p04o09k71K29O22P14M45Lm41o95o19k45K55O27O81M35
3415I62Km52p18n99k07K63O08O83M37j9n09o68n84j99K53O37O70M16n6m75o79
$$ plain form
3272 1173 905 194 -598 -1128 -1116 -602 182 895 1189 907 180 -614 -1109 -1091 -567 245 943 1172 848 149
3292 149 -620 -1112 -1076 -522 295 932 1159 845 141 -633 -1115 -1030 -499 291 942 1153 829 99 -651 -1105 -1034
3313 -1034 -485 316 956 1130 769 68 -674 -1110 -1030 -442 338 943 1101 748 51 -707 -1124 -998 -408 345
3333 345 955 1107 726 -18 -713 -1090 -983 -408 370 965 1089 679 -34 -721 -1093 -942 -346 422 967 1066
3353 1066 685 -26 -727 -1082 -901 -309 425 956 1074 666 -58 -751 -1076 -882 -307 443 974 1056 626 -94
3373 -94 -751 -1071 -883 -270 467 981 1017 590 -115 -782 -1081 -848 -252 461 951 1006 574 -157 -792 -1053 -825
3394 -825 -230 491 975 993 535 -169 -778 -1049 -820 -198 516 961 964 523 -172 -791 -1036 -781 -154 527 962
3415 962 964 512 -206 -805 -1012 -749 -141 542 979 960 451 -217 -801 -1000 -747 -110 560 976 920 445 -234
3436b34n90j90K91O33O57L93n2m95o96n54j57K99O19O63L68o6n09o87n27j58K89
3457g03O48O68L49r7m96o77n25j46L39O14O50L26q7n06o74n22j17L31O17O40L33
3478I65j10n28o70n02r2L29O33O21K98j19n18o56n01q0L49O29O10K63j07n34o61
3499c81m81n6L56O17O01K76j59n23o60m46n3L65O29N89K56j71n30o29m49n5L88
3520e16O26N63K60j73n43o28m34k2L73O16N60K47j85n43o34m14j5L79O26N57K12
3541I12k07n39o07m20rM21O04N58J78j94n52o21l89J9M21N99N20K15k50n43n99
3562d83l80K5M16O09N08J93k47n51n64l81M1M22O03M97J68k52n52n74l57N2M37
3583c70O01M82J63k55n53n68l47Q8M17O01M89J14k68n54n56l11P1M32N86M80J08
$$ plain form
3436 -234 -824 -1014 -723 -90 567 960 908 413 -283 -837 -994 -695 -76 587 955 889 380 -307 -834 -992 -703
3457 -703 -55 613 962 865 369 -308 -833 -979 -640 -26 624 950 863 357 -317 -839 -956 -625 -8 632 965
3478 965 855 327 -343 -845 -937 -608 25 646 944 825 307 -349 -850 -930 -581 48 658 921 814 280 -381
3499 -381 -862 -918 -562 55 656 932 773 250 -410 -856 -909 -544 85 674 930 759 229 -400 -849 -904 -516
3520 -516 110 673 933 760 217 -411 -845 -867 -494 122 682 929 744 201 -433 -847 -862 -483 143 700 912
3541 912 705 166 -441 -861 -870 -449 155 713 891 697 145 -476 -865 -846 -425 174 694 909 659 116 -483
3562 -483 -863 -838 -422 187 695 888 641 90 -474 -855 -814 -392 211 708 876 624 72 -502 -859 -807 -370
3583 -370 231 713 876 621 68 -500 -847 -759 -342 259 748 862 594 40 -516 -827 -756 -324 262 742 850
3604H50k68n62n51l03R1M55N65M45J26k98n57n38k94J01M40N91M28R9l09n36n48
3625e73k61J28M41N73M32O6k98n49n29k58J23M58N81M16O5l18n51n27k41J39M56
3646b27N77L99M6l18n50n05k29J46M64N58L87K8l21n33n13k11J56M57N59L76K9
3667G75l41n27m97k23J64M64N58L68K4l56n37m79j98J72M80N20L86j6l39n41m79
3688f22j65J79M71N32L48pl53n27m64j79J96M93N09L22ml52n41m41j74K10M75
3709i4N30L18l5l67n19m49j55K23M73N18K98m2l77n16m36j23K18M66N17K91o6
3730F73l71n31m18j33K61M77N01K66p2l77n25l96r9K33M76N00K64q5l72n20m03
3751f51r8K48M88M99K44q2m01n02l92p7K65M86M71K45r9m08n09l68o9K64M81M60
$$ plain form
3604 850 582 20 -531 -834 -743 -288 277 722 848 550 -7 -545 -839 -738 -298 293 721 820 511 -25 -573
3625 -573 -834 -706 -265 308 740 806 508 -41 -570 -828 -705 -247 334 750 815 497 -54 -581 -822 -683 -227
3646 -227 350 749 795 477 -73 -578 -807 -661 -197 361 748 776 455 -78 -591 -802 -646 -189 370 746 775
3667 775 434 -93 -590 -813 -649 -185 373 741 765 409 -128 -607 -805 -633 -153 367 753 737 398 -143 -622
3688 -622 -787 -608 -137 395 743 736 383 -144 -608 -787 -591 -98 411 733 729 377 -164 -605 -779 -569 -94
3709 -94 436 754 719 352 -167 -616 -771 -548 -75 443 741 699 322 -194 -630 -753 -535 -69 448 739 673
3730 673 302 -229 -647 -780 -519 -42 459 725 653 276 -249 -645 -744 -511 -35 465 729 644 272 -248 -651
3751 -651 -749 -501 -13 486 730 648 247 -255 -647 -724 -459 27 498 743 644 236 -273 -641 -710 -446 35 495
3773D95K52j12m27m98l59o7K80M84M67K12j27l99n01l64m3K88M96M36K02j23m15
3794A77n10l33l1L00M60M46K12j63m09m88l17k9K93M86M31J74j39m22m77l31j8
3815f88L17M94M16J68j53m17m93l07J4L09M77M10J61j62m34m62l08J1L18M68M17
3836E56J43j88m07m69k91RL46M71L93J18j86m28m67k74L6L47M52M03J13k00m38
3857C9m47k62N3L28M70L98R7k23m32m35k50N3L61M63L66Q0k16m19m48k38P1L54
3879b37M48L79Q3k37m35m28k13O8L53M55L53O8k27m36m09k38R7L62M52L15O2k30
3901D05m33m14k29J04L79M27L43O1k61m40l96k04J14L50M53L16N1k70m19l98j89
3922f50J08L83M42L16J3k73m07m00j71J34L76M10L01L1k65m42l74j57J30L75M18
$$ plain form
3773 495 747 635 208 -290 -649 -716 -436 48 515 727 600 201 -300 -664 -707 -419 77 513 715 592 177
3794 177 -333 -666 -697 -397 63 509 721 558 149 -339 -656 -685 -392 94 525 699 560 138 -339 -670 -688
3815 -688 -371 123 539 707 554 137 -356 -663 -649 -340 137 547 708 546 112 -350 -658 -647 -329 139 556
3836 556 699 511 104 -365 -656 -647 -301 170 563 681 495 67 -400 -674 -638 -291 161 564 677 477 39
3857 39 -408 -670 -617 -289 181 579 676 453 21 -414 -664 -611 -250 213 579 659 443 24 -424 -662 -591 -237
3879 -237 211 590 673 436 1 -427 -640 -572 -219 236 589 657 430 -6 -415 -653 -556 -194 258 573 635 405
3901 405 -28 -442 -671 -567 -188 239 582 643 382 -58 -454 -658 -544 -194 259 575 626 356 -63 -461 -650
3922 -650 -542 -159 283 599 612 339 -68 -468 -639 -505 -129 281 582 613 348 -94 -468 -625 -495 -120 298
3943B98L06Mk86m22l66j65J51L79M29K70k1k63m25l70j62J77L82M00K81j4k88
3964B95m41l43j39J69L71M24K65l8k97m33l30j22J71L78M11K48m4k87m15l54j10
3985f21J94L84L97K31m8k98m05l45r1J99L82L70K51n8l17m09l18r2J98L99L81
4006C84K11o7l17m00l26r1K25L93L74K13q5l25m10l12m3K11L72L88J99r0l45l97
4028b38k93n9K04M13L74J71j05l10l94l05l6K32L84L61J67r3l16m15k91oK31L73
4050D9L56J75j13l46l79k65k1K35L86L57J47j29l20l90k63k5K62L77L27J48j14
4071D54l43l84k58PK61L58L32J51j41l57l88k10j1K44L86L38J24j41l46l74k42
4092e40%K73L90L16J13j54l30l93k25M7K55L77L09J25j65l55l56k07K0K73L71
$$ plain form
3943 298 604 608 322 -100 -466 -631 -480 -101 328 598 577 314 -111 -481 -643 -466 -84 316 597 583 295
3964 295 -146 -489 -628 -459 -88 336 601 563 266 -167 -497 -619 -448 -70 341 589 545 258 -157 -511 -621
3985 -621 -427 -43 354 585 537 239 -166 -511 -602 -403 -21 349 600 542 225 -184 -502 -594 -396 3 384
4006 384 595 528 211 -189 -515 -606 -381 12 386 599 514 189 -221 -533 -576 -365 7 395 594 504 159 -238
4028 -238 -531 -590 -386 27 401 572 467 157 -237 -542 -578 -346 38 399 566 473 157 -258 -549 -555 -324 49
4050 49 405 580 467 121 -258 -523 -544 -309 77 434 581 452 132 -258 -521 -546 -284 93 420 568 454
4071 454 111 -273 -531 -524 -263 95 427 578 437 80 -308 -518 -529 -285 101 439 563 422 76 -298 -540
4092 -540 -540 -267 123 439 552 398 68 -325 -550 -503 -248 129 438 563 398 43 -313 -520 -500 -227 144
4113A44L32Q5j80l45l40k18L1K86L72L06P1j64l33l72k16O8K83L52K91R3j89l53
4135Dl43j89O5K69L70K86O2j90l54l24j94O7K97L55K72O1j99l39l36j78Q5K83
4157a70L52K74O8k03l51l42j58R4K80L42K97L1k13l41l17j52P7L07L58K49J0j91
4179C01l38l29j56J16K89L49K47L2k36l31l12j53J20K83L48K45J2k20l44k98j35
4200e10R3L16L42K27ok06l38l02j41J33K89L34K33kk10l50l01j14J27K94L33K37
4222D78j8k43l24k76j25J59K93L36J92k4k33l28k96q7J60L01L18J94k1k48l30
4243a22k87o5J45L07L17J85l7k60l35k45q9J57L13K96J91n7k49l19k66p5J79L08
4265hK99J68o0k30l41k59m5J72K96L04J86p8k61l33k30n5J66L20L02J61q4k60
$$ plain form
4113 144 476 561 381 36 -304 -522 -491 -205 167 473 544 380 47 -325 -541 -473 -190 162 453 546 357 4
4135 4 -339 -528 -463 -194 176 462 524 334 -20 -344 -538 -471 -174 181 453 514 315 -24 -360 -538 -453 -170
4157 -170 182 456 524 321 -30 -372 -530 -436 -156 186 483 514 301 -40 -357 -509 -432 -125 233 482 492 301
4179 301 -37 -366 -522 -406 -117 232 479 511 275 -56 -368 -521 -401 -118 230 475 487 267 -77 -375 -510
4200 -510 -417 -101 241 468 462 256 -82 -384 -525 -392 -103 231 464 462 252 -98 -399 -513 -386 -92 241 478
4222 478 460 217 -107 -383 -508 -349 -56 280 472 448 215 -113 -409 -496 -336 -35 283 477 456 208 -122
4243 -122 -409 -474 -329 -22 295 480 443 183 -152 -397 -486 -329 -16 280 471 414 165 -154 -420 -495 -316 -8
4265 -8 291 459 399 169 -172 -431 -476 -304 -8 296 482 404 143 -190 -420 -475 -309 11 313 474 390 130
4287A30k95k41n1J76L17K83J38p4k39l26k28l6J77L08K81J59r5k65l16k09k6J83
4309b49K85K97J27j03k63l01k15j1J80L07K68J26r3k60l08k12j3K05K89K74J25
4330D55j14k80k94j91kK03K91K72J03j10k62k86j95oK06K92K58J16j25k57l11
4351b37j84J6K17K92K51R3j26k78k84j67J2K22K80K63O8j25k71k80j78J8K19L02
4373A23K30O9j22k73k83j80M3K29K84K27P7j47k60k93j52N1K17K80K35P2j64k59
4395Dk68j64N0K31K89K24M1j44k67k60j48P4K14K77K12N1j56k64k53j48P2K24
4417a09K80K02M7j80k56k48j35N9K33K70K09K1j59k67k66j11O9K44K70J85K0j65
4439B13k70k42j11Q2K27K72J96J0j66k64k46j16Q8K42K70J81J9j85k60k46r9R6
$$ plain form
4287 130 -165 -406 -457 -281 36 319 457 383 144 -182 -410 -446 -269 39 320 479 384 119 -197 -406 -432 -249
4309 -249 36 333 460 357 94 -207 -422 -433 -253 54 322 448 355 95 -213 -425 -438 -233 56 330 455
4330 455 341 61 -233 -424 -426 -223 68 340 443 333 71 -215 -410 -416 -210 82 340 456 331 74 -237
4351 -237 -421 -405 -188 104 355 448 322 44 -240 -407 -395 -173 107 370 438 313 42 -238 -416 -398 -179 123
4373 123 353 422 300 27 -256 -436 -393 -164 120 347 424 277 17 -276 -428 -377 -160 120 355 427 263 4
4395 4 -264 -428 -378 -147 142 366 407 263 -4 -264 -412 -338 -124 153 365 416 260 -4 -257 -405 -333 -109
4417 -109 171 373 420 240 -16 -264 -399 -340 -107 163 372 393 234 -33 -299 -410 -341 -97 173 358 378 213
4439 213 -57 -299 -410 -328 -101 171 367 377 211 -53 -299 -415 -327 -85 185 366 385 200 -60 -306 -405 -309
4461c09K33K70J79Lj76k72k20q3Q0K35K61J73J1j96k76k11q8J17K33K62J39%j91
4484A74k63k28o7J12K35K53J57k9j89k54k08q8J16K54K35J53m2j81k55k14m7J19
4506b57K31K57J30l8j83k62k07n0J27K35K49J30m9j86k45j98m8J18K56K32J28
4527C70m6k04k49j79n0J40K36K22J22n0k02k49j83m0J38K46K27J10n0k17k39j85
4549c32l0J38K40K30R5n9k09k32j72k1J47K39K22P8m9k15k35j72%J39K36K05J06
4572C49p4k10k36j59j6J49K51K10R6q1k01k51j42j3J52K40K10P7p5k08k43j43
4594c18RJ49K23K04P3q3k14k22j65L2J42K46K01O3j01k09k28j41K6J70K31J78
4616B66N9r9k04k21j37L1J70K19J98N0j11k13k14j26K2J72K29J87L9j03k02k22
$$ plain form
4461 -309 -76 194 373 376 200 -72 -292 -375 -295 -60 201 374 385 189 -87 -298 -386 -269 -36 226 365 365 174
4484 174 -89 -317 -384 -272 -37 216 373 344 155 -99 -307 -395 -279 -25 210 363 321 140 -115 -329 -376 -257
4506 -257 -26 231 361 323 140 -122 -329 -379 -252 -17 232 362 313 127 -118 -316 -364 -246 10 242 370
4527 370 324 120 -129 -308 -358 -218 18 240 362 312 110 -139 -322 -362 -224 22 249 359 309 92 -147 -332
4549 -332 -362 -224 16 246 341 282 73 -159 -331 -352 -205 34 256 334 285 70 -165 -337 -337 -198 38 243 349
4572 349 275 65 -171 -330 -346 -197 54 264 360 279 78 -173 -315 -328 -176 64 274 351 276 68 -175 -318
4594 -318 -309 -160 63 267 340 257 43 -179 -344 -312 -170 76 277 340 239 30 -198 -339 -313 -143 88 266
4616 266 325 226 22 -199 -336 -305 -135 84 282 332 221 8 -206 -332 -310 -138 91 278 317 214 12 -210
4638b10j17M0J78K14J76M0j06k00k20j10L2J87K04J87M7j41k03k11j15N7J70K18
4660A17J81J2j07k08k33r0N2J74K18J67J1j12k09k05j02O0J84K12J53L0j30k21
4682d6j80j09O4J90K03J78rj21k09j98p5O6J71K26J42Qj51j91j83r7Q2J89J99
4705A49J52jj37k12j98o4Q4J79K07J47j2j56k17j70n1N9J95K06J35k9j37j97j82
4728b50o3Q9J76K09J25j1j49k17j67o1Q9J92K03J12j1j58k00j63m8Q3J96J98J10
4751B84k7j59k00j61m1J09J88J93J03j8j60k06j63l0J08J88J81J15n3j62k04j46
4773b61l8J17J87K04Q8m8j55k01j59k7J05J97J91Q5l4j71k05j47k7J21J87J74
4795A83J03n6j63k04j36j5J04J94K01P5n8j65j92j40j3J21K02J61Q9n5j78j97
$$ plain form
4638 -210 -327 -287 -109 105 281 321 215 15 -205 -315 -283 -96 108 295 342 201 -2 -213 -328 -271 -101 117
4660 117 298 310 203 -5 -238 -328 -276 -102 116 283 294 182 -27 -232 -334 -274 -90 122 275 305 175 -46
4682 -46 -226 -335 -271 -81 122 300 291 170 -39 -237 -312 -246 -75 151 293 301 150 -41 -224 -321 -239 -50 149
4705 149 301 300 163 -49 -247 -311 -227 -48 159 306 294 138 -79 -249 -300 -241 -46 160 295 266 129 -68 -250
4728 -250 -313 -224 -48 161 286 275 126 -91 -258 -319 -230 -38 165 277 266 108 -92 -255 -303 -220 -24 174 284
4751 284 257 98 -102 -263 -304 -195 -7 186 289 271 111 -95 -258 -288 -180 8 189 304 251 89 -115 -261
4773 -261 -299 -182 5 209 297 249 94 -107 -266 -293 -188 9 200 285 251 80 -125 -272 -299 -178 9 183
4795 183 286 230 67 -137 -273 -288 -184 10 211 286 228 63 -129 -269 -282 -161 41 202 291 236 58 -139
4817a39j20j4J39J78J77P4p1j73j93j20jJ28J85J77M8n6j78j91j01j0J30J90J78
4840B37M4p9j64j90j26J2J49J77J50O9q3j76j85j11K0J25J81J82M0q1j71j90j03
4863b73K4J28K00J49M2r4j59j80j12M1J35J83J52L5q1j68j92q8J9J47J80J56L3
4886B77j15j53j76r3L5J28K00J47J3r6j67j82j05N8J51J84J15L9j01j78j75q5
4908b79M0J51J81J31J7j07j66j53r4N0J42J92J27J1j01j68j65o7M9J47J86J20
4930B44Oj07j71j59p1N9J52J68J26lr9k00j16o6M4J57J74J11j1j07j63j50p5M7
4954b10J80J67J04Rj38j63j59m6O6J46J60J14Nj30j70j44m5P3J32J76J03j7j10
4977A03j70j42l6O5J48J73Q8kj23j85j31j8O4J48J71Q1j5j36j52j32l5R0J38J67
$$ plain form
4817 -139 -259 -273 -134 44 221 295 224 51 -142 -262 -263 -135 50 227 275 219 41 -150 -251 -261 -131 59 237
4840 237 281 202 38 -152 -278 -266 -117 60 210 279 196 20 -165 -276 -256 -131 50 232 272 191 20 -170 -273
4863 -273 -249 -121 79 228 270 176 17 -163 -275 -234 -99 84 236 271 190 22 -170 -258 -239 -92 88 244 277
4886 277 162 9 -167 -260 -225 -97 103 250 263 167 0 -182 -287 -229 -78 106 221 260 159 -19 -194 -279
4908 -279 -239 -88 93 224 241 134 -32 -185 -279 -229 -87 105 232 243 142 -26 -191 -258 -209 -62 124 244
4930 244 250 143 -28 -187 -258 -199 -47 121 247 244 145 -55 -171 -237 -193 -36 138 249 238 131 -32 -182 -257 -210
4954 -210 -30 137 241 250 112 -51 -210 -256 -190 -44 116 230 235 105 -65 -209 -254 -181 -49 127 230 213 103
4977 103 -67 -209 -245 -180 -32 141 229 227 104 -81 -212 -230 -166 -18 153 234 219 83 -69 -201 -236 -146 -8 159
5001A59Q6l4j18j53j49k7Q8J45J62P7l8j08j80j10l2R5J31J54R1m1j38j61j06
5024b07k7R1J43J53P3m2j28j57j09l7J01J57J51O0n1j20j57j11j3R2J58J49N4
5047B23l2j33j74r1kR9J26J55N9n1j32j36j09pQ7J58J21O1m0j21j57j23J4R0J54
5072C9J29N0m6j46j45q3kQ0J56J47L7o5j25j45r1KJ02J62J15L1n3j30j47p4lJ08
5098i7J35J23M5m7j51j35p0MJ11J43J20L1o5j28j42p4J7R1J54J24K1p3j23j38
5122a24p3J6J01J49J16K1p0j26j28q7L5J06J35J05L2p7j39j30p3L0J10J37J13
5145A79ln9j34j18q6M9J03J45R3K0o3j32j43n8L0J30J32J07Rq3j23j27n8L0J13
5170d7J32J04Op1j31j26o4M1J21J34Q1J2o9j49j12m1L1J14J28R0Mq4j39j06n1
$$ plain form
5001 159 245 211 93 -60 -209 -236 -148 -3 159 236 198 90 -90 -200 -232 -137 -6 148 239 198 60 -101 -207
5024 -207 -234 -143 0 153 226 184 56 -101 -210 -247 -146 11 162 222 171 51 -106 -217 -230 -138 20 169 223
5047 223 191 58 -116 -207 -209 -110 16 171 230 179 47 -89 -198 -205 -118 40 161 222 182 61 -96 -219 -205 -115 39
5072 39 168 218 172 26 -119 -202 -204 -124 32 179 216 151 26 -119 -210 -208 -106 56 171 202 149 19 -128 -202 -205 -97
5098 -97 38 161 206 159 8 -127 -197 -193 -82 61 181 212 147 19 -123 -197 -180 -89 65 189 210 137 14 -124
5122 -124 -197 -181 -80 69 185 206 136 10 -118 -205 -170 -64 71 176 208 131 -8 -138 -211 -181 -71 66 179
5145 179 176 117 -17 -135 -221 -172 -69 76 169 189 126 -6 -149 -207 -177 -47 85 192 201 118 -5 -132 -190 -160 -47
5170 -47 85 189 195 124 -7 -133 -197 -156 -35 99 180 192 123 -26 -138 -179 -148 -34 94 184 188 104 -35 -141 -192
5195a92L0J26J24Q4Nq0j33j15m0L6J18J25Q2rp5j21j24l9M8J19J15Q3J1r0j36
5220d8r7m0N5J11J27O7j1q3j09j23k8M4J25J20O9lj01j09j14l1N4J25J12O9kj01
5246G8j37r5j6L8J20J19O5j4j04j10j15j9P2J13J13N6j5j05j02r1k2N2J03J20
5270A04O2j7j12j03r5j4O1J21J14N1j9r5j26r1j0O2J27J05O3l8r8j22q7j1P7J00
5296IJ19M5l3q8j27q3j0O9J22R2N1m1q1j20q5KO7R4J11N3l6r0j32n6rO8J07J05
5324A23M3l5r4j27q2J0O6J21J07L7n3r3j17o7J1O8J18Q6O5n3j05j15p4J5Q5R9
5350C9R6M7o0r8j01p6RQ0J08R2L1m3j06j16o7L0O3J10Q9K9n5j02r5p2J5P7J27
5377E1P9K2n2j07r9o4J0Q6J16R0K7n7r8j17n1QJ02R9Q1J4l8r7j14m5K3P7J09R6
$$ plain form
5195 -192 -162 -36 88 172 177 97 -36 -151 -191 -155 -37 88 170 161 86 -35 -159 -198 -150 -31 84 167 178 88 -48
5220 -48 -145 -185 -130 -19 108 175 164 81 -28 -151 -179 -135 -10 110 179 176 75 -34 -148 -179 -125 0 112 181 179 78
5246 78 -59 -154 -170 -132 -12 107 172 158 54 -56 -171 -190 -118 -5 108 164 149 44 -58 -149 -171 -119 -16 104
5270 104 166 149 37 -66 -161 -175 -114 7 121 172 153 58 -68 -159 -169 -107 20 125 188 150 52 -70 -157 -168 -91 9
5296 9 128 173 140 52 -75 -158 -168 -99 23 115 166 125 44 -76 -161 -159 -92 2 113 166 130 40 -92 -148 -157 -89 18 123
5324 123 166 131 37 -90 -172 -162 -96 25 132 169 116 23 -94 -161 -150 -82 36 122 187 134 29 -86 -160 -145 -60 39
5350 39 135 182 122 24 -77 -153 -144 -64 44 136 167 124 18 -98 -165 -135 -72 38 127 156 101 -1 -96 -168 -153 -76 51
5377 51 130 152 100 -7 -106 -170 -160 -74 42 132 159 102 4 -113 -164 -156 -54 45 126 140 102 5 -109 -154 -131 -54 55 151
5405A51Ln4r8j00m6J6R5J11O8J1n8r3j29l5L2R1Q5R1Qm5j19j00l9K7R4R0P5Po6
5434G3j09r3l4M7P4J13O5j4n3r9q6l8M2P9R7O9Mn6j12q9l1M1Q8R1P5ko7j05q7
5463a17l1M3R4R8O9k3n0j05r7k0L4Q6J15M2j1n2j05q6j7J5R8J01N7np9r1p1l4
5491a42L1R5Q2O7j3p3q8p7k8M1Q8J03M1Mo5r9q8l2N0R6R2O2k4o9r9o5j6M9P7Q8
5521H8O1k5o6r7q4j8O4Q4Q7N4j7p5j09n8k3N2Q2R0N3k3q0j03n3j3M7R1Q5M0j9
5550A15q9p5p3j3M3J00Q0M6k9p2r7p2qO6R1P8M4k9o6r7o8j4P1R6Q1K4j1r4p3o7
5580a12k5Q9P6P5K9k4o2r9n7lM9R1P0K7k3p9r2o6J3O1Q4Q1L2l7q2q4m4k1O8Q6
5610B1P2K6k8p5r0n7J1N7Q7O9K9k6r1q9n4J3O9Q7P8K0m3p8p1n5pO5Q9O9K2k2q2
$$ plain form
5405 151 154 100 2 -98 -144 -128 -33 78 146 157 99 6 -123 -158 -126 -35 50 141 149 104 -15 -115 -154 -127 -33 57 132 139 73
5434 73 -36 -129 -163 -116 -42 71 136 122 69 -30 -116 -154 -112 -33 64 133 137 81 -31 -120 -151 -110 -22 69 144 142 75 -30 -117
5463 -117 -148 -105 -11 87 156 133 83 -22 -119 -139 -105 -19 96 138 127 75 -30 -116 -133 -118 -20 81 138 133 54 -37 -108 -142
5491 -142 -111 -16 66 133 120 47 -41 -118 -146 -105 -17 86 127 131 66 -33 -121 -153 -103 -7 85 147 123 54 -45 -110 -126 -77 0 88
5521 88 149 124 58 -39 -123 -141 -77 7 94 148 131 56 -53 -111 -134 -82 0 90 143 120 40 -63 -116 -129 -82 9 94 134 115
5550 115 26 -49 -122 -135 -92 8 88 134 105 33 -64 -136 -144 -78 13 91 135 106 40 -57 -125 -139 -68 28 109 133 122 28 -45 -112
5580 -112 -137 -48 28 103 132 108 46 -53 -110 -113 -64 27 97 124 101 22 -70 -136 -123 -62 22 103 135 98 16 -68 -112 -133 -65 21
5610 21 93 119 91 16 -74 -131 -120 -63 24 93 122 96 5 -84 -138 -125 -56 31 109 129 86 8 -63 -118 -125 -60 29 98 120 98 16
5641A6q7n5J4P0Q1P0K2m0q9p0m5K0N3P7P2K0l6q5p8n1J4M8J07N9K8n0r2p6n0K5
5671a08P0O4O0L6o0p8q9l2K0P4O9P0K7m3j02p0k8J4O6J01M3J4m4p6r0l2K5P1P8
5700E0N4K1m9r8n8l5J6P2Q7N8No0p9o1l8J2P0R7N2%n4p6q7l2K4Q0P2O4Jn0r1q0
5732a13k3L2P6P7M4K0n4r6o9j8J9P8R4M2ln5p7p9j5L1O8P9N4K0o5q2p6k3K8P1
5762a5P3O2rn2p1p3l6L0P0Q8N0j4m9q8p0k1L8Q0P8M4j0p1o5p9mL7O5O9M8%p0r0
5794e5m5k0K8Q3Q0L0pn3q3o8jL0P5Q8K8po1p9o6j3M4Q5O4M6k7o1p6o6PM0P8N5
5826G3N0rn9r6n7k4N7P5P0L0j3p8p0n4k0N8P2P7K9j2r1o6o2oN2P7P9K1j3p5p9
5857f4m9KN6O6P4K3l3m2p9m9j6M6R2O4K8l6n6p5o1J1M9P5O4L0k5o0r1m0QM8O8
$$ plain form
5641 16 -71 -126 -112 -42 39 109 131 91 2 -68 -113 -93 -40 37 109 129 93 8 -70 -121 -107 -59 48 107 135 85 -7 -83 -133 -108
5671 -108 -38 26 86 122 62 -16 -105 -137 -117 -43 26 96 123 80 -22 -92 -120 -106 -40 61 104 118 74 -2 -92 -124 -99 -28 50
5700 50 104 125 76 -22 -80 -115 -99 -27 60 118 123 63 -16 -77 -115 -103 -33 64 116 116 62 -14 -101 -133 -109 -29 43 107 108 58 -33 -113
5732 -113 -136 -104 -28 49 93 113 59 -37 -106 -124 -105 -27 67 109 106 51 -26 -105 -120 -89 -21 58 112 132 67 -15 -91 -114 -86 -15
5762 -15 58 120 111 59 -12 -85 -121 -91 -21 67 117 103 54 -34 -104 -125 -87 -7 71 115 105 34 -31 -110 -114 -77 -12 57 105 105 35 -55
5794 -55 -100 -120 -92 -9 71 101 94 41 -42 -110 -111 -81 -6 82 110 103 42 -37 -103 -116 -72 13 77 123 96 35 -41 -107 -100 -60 18 73
5826 73 123 114 55 -41 -98 -122 -65 10 80 110 97 19 -51 -105 -125 -67 5 82 111 99 8 -58 -120 -126 -74 3 82 103 90 15 -64
5857 -64 -113 -111 -55 11 85 108 75 33 -46 -95 -111 -65 27 91 119 83 27 -48 -109 -98 -49 26 90 120 95 35 -56 -96 -88 -40 28
5888B8P3K6l0n6j04l5MM0P2M9L6k6q0o4l1pM8O9O4K6l2o5p3n3K8M0Q2M9L1k4p3
5919A2q3l5LO2P7N4K7l9o2q9k7MN3P1O4K1m4n4p5m4OM5Q0O7K3m1p2o7l8kP1P7
5951D5M3K0l4q2o5l0J0M8P4N6J1l1o8p2m3J7N8P8N7nm0n7o6k9J6L9P5O6J7m7q3
5982b2n4k4J9M7Q8M1Nl2o9p1l3K2O1P6L4K8m6p9o0l1L1N2O8M0Ml6o9n7l8J2P5
6013a8N8L7J2l4p9o0njO4P4M2Nn6o7m4l3K5N5O5N2pm3p0n8j9J9O8P2L3Om6p4m9
6046g6j9K1N9Q2L2j2l6o2o2k4L5N6O3M9nm8p4m9k3L3N4N9M5rm4p4p0jK7P5M6M7
6078I5j9m4o4n9k0M2N6O6M5qo4o1n4k4M3M8Q0L3rn0p5m9j9M4O3O8L0mn7n9o4p
6110i7L5N9O8L3mn9p6l8oK3P5N6L0j9n3n8n3JJ0P9O8J7j5m1q1n6KM1P1M0N6l9
$$ plain form
5888 28 101 127 97 41 -63 -98 -94 -54 18 67 103 77 -3 -67 -98 -105 -57 12 76 102 70 5 -68 -121 -93 -53 29 78 109 85 12
5919 12 -71 -106 -103 -41 36 90 117 78 16 -73 -100 -96 -43 28 92 113 69 15 -60 -104 -98 -53 27 94 117 76 4 -63 -101 -103 -32 45
5951 45 88 108 74 -8 -73 -103 -93 -45 29 85 96 65 -3 -75 -118 -101 -43 35 92 87 47 -10 -76 -105 -89 -50 25 91 108 61 -22
5982 -22 -76 -100 -81 -34 54 95 100 68 -1 -72 -105 -83 -22 54 88 116 70 -9 -69 -100 -69 -17 51 91 95 59 -10 -67 -105 -93 -18
6013 -18 40 77 89 55 -24 -84 -89 -90 -26 48 90 95 39 -28 -72 -105 -80 -25 40 92 85 42 -28 -86 -105 -86 -18 54 87 93 47 -27 -76
6046 -76 -95 -74 -15 67 99 87 51 -11 -73 -97 -62 -6 57 106 101 53 -21 -70 -93 -60 -6 53 98 89 45 -29 -99 -100 -73 2 48 95
6078 95 76 32 -32 -91 -111 -69 -13 53 98 90 26 -35 -89 -113 -70 -22 58 91 82 32 -43 -92 -111 -67 -4 64 94 90 33 -26 -90 -97
6110 -97 -62 -3 65 98 94 35 -41 -79 -85 -62 13 69 99 80 27 -31 -84 -83 -73 6 74 91 76 35 -46 -102 -100 -59 12 52 108 69
6142F9m2p4m9rL7P6N7K8k7m2o9m9mM0P6L9M0k3n4o5m2LL5Q3L9K5l4m2o1n4J1L8
6174d4P4M7L2l6n1p2m1JM4P5M1J8j6o3n7l8lL9N7P2J9l9m3q5l4LN5O8L8K2j1p0
6206Bp0l6K0L5O3O9Mk0o3n8l9LM2Q2N0Rk3o3p6j8MN1P1M9K5l8p6m8l8RL7P2N8
6239H9Jk8o2m8m9J9M6N9N5jk3o2p4k2J7M3P4N1J8m7q2n2k2J4M6P9M1Rl1p7n3k9
6271a01J8N7O9L8J0m9m6n9l4K7N1P4M2Nn1n9n4l6L1N9N5M8j0k9p4m8k1J5N9N8
6301D5M7nl4p2o0j7J7O4N5L9J1o9l8p4kJ0O0P6L1Nm9o1o7jJ8N5O6M2pn6m4n8k2
6334i5K3O4O8K6rk8n2o1k6M9M1O7L1lm4q0m0j5L2O3M6L4rm5p0m6j6L4M2P9L7j2
6366H5n5o8m5qK9N7O6J1Mn6p1l2j4L2O4N6K7jn1o8n4kL6N0O5L0j1n1o7m2LK8O1
$$ plain form
6142 69 27 -47 -96 -105 -68 8 65 93 66 24 -45 -94 -98 -58 18 57 97 74 20 -45 -87 -84 -49 34 73 98 64 22 -39 -93 -82 -44
6174 -44 30 77 109 73 22 -50 -91 -90 -46 29 70 88 72 9 -48 -86 -89 -50 7 79 98 59 16 -69 -103 -100 -45 23 61 83 72 2
6206 2 -68 -104 -84 -49 14 83 87 67 4 -54 -93 -90 -48 34 84 93 70 7 -69 -87 -83 -32 39 88 113 75 -1 -49 -87 -78 -41 31 89
6239 89 90 62 0 -48 -97 -78 -32 27 82 81 58 -4 -78 -100 -83 -40 34 85 103 56 -26 -78 -100 -86 -40 39 80 89 58 -19 -72 -101
6271 -101 -83 -26 43 81 91 42 -4 -63 -97 -70 -19 55 97 102 51 -8 -62 -98 -67 -8 47 95 85 56 -18 -66 -87 -72 -13 45
6301 45 92 87 53 -19 -79 -96 -79 -15 40 79 90 21 -17 -91 -93 -83 -23 53 84 89 40 -21 -88 -89 -71 -16 50 92 85 29 -15 -73 -95
6334 -95 -72 -8 60 86 77 49 -3 -64 -90 -41 0 67 98 95 51 -29 -69 -84 -52 11 57 91 82 37 -33 -79 -95 -61 -19 60 97 85
6366 85 30 -38 -83 -91 -62 -5 61 72 76 20 -51 -83 -97 -65 -1 55 82 81 30 -38 -92 -94 -58 -8 57 87 76 25 -42 -84 -81 -53 8
6399HO5L0k8l8o7n7RK8N0O8J8j0m7o5m8%K7P4N1L5k9m8o3m4NK6N7N5J6j2n5o4
6431e3m7LL9P5N2Mjp7m7m1kM6O9N5Nj8m5p1m2OM7N8O1Mj1m5o9l2JK6O5O1K4k9
6465G1n1o0m6mO1N0M7L1l3n0o6l4MN1N9N4J3l9n3m6m8kN6O8L6J8k7m9q0l0J6L5
6497d8O7M7K1k4n9p2j9jO2N4M3J4k7n9m6m4J0N7O2M5K6l3p8m4l0kN3P2M5ml9n0
6529an0l3K9L4O5L9Pk3o9o3k1QO1N7M5Kl7m9o8k7J4O2M3M8J5k9o0p9j3J5N5O2
6561C9N2j2l2p0l7l6K6M8O1L5Pk8n9o1j2K3L6O8L7Mn3n3m9j4K3M6N2M3jl4o2o0
6593g3kJ7N4N9K2Rm7o0n2k1J6O3O8K3Pn0p0m6j8L6M7O3L7ol7o8n1j6K7O1O1K4
6625G7ql6n5o9lL4P0N9J7%m6o1m8j3K3N9O8L4j8m5n4m9j6L2M9N8K9ko2o1l5j0
$$ plain form
6399 8 73 103 75 37 -30 -87 -78 -50 0 68 86 76 29 -36 -84 -84 -57 17 68 103 74 26 -37 -81 -76 -50 7 62 78 66 11 -53
6431 -53 -100 -97 -58 17 69 73 72 -5 -52 -93 -95 -49 20 75 80 62 17 -54 -96 -90 -43 15 76 80 69 24 -45 -77 -76 -50 15 76 100 71
6465 71 20 -40 -86 -90 -29 21 68 99 66 16 -50 -84 -80 -29 30 84 97 58 5 -41 -89 -91 -35 33 69 87 60 11 -69 -99 -83 -48
6497 -48 19 66 87 63 4 -68 -87 -88 -26 28 71 85 58 -1 -47 -91 -81 -24 38 83 109 76 -2 -46 -76 -78 -25 47 92 88 49 -1
6529 -1 -51 -84 -55 -21 44 83 90 67 -2 -65 -86 -78 -17 40 85 87 50 1 -67 -94 -80 -18 25 73 88 59 -1 -80 -93 -78 -23 39
6561 39 91 79 47 -23 -60 -96 -70 -22 39 74 81 53 -6 -67 -79 -56 -20 48 85 89 36 -17 -66 -80 -57 -11 41 84 83 49 -13 -73
6593 -73 -75 -58 -4 55 77 86 39 -21 -73 -94 -78 -15 53 76 83 33 -37 -83 -101 -65 -18 45 82 76 39 -29 -80 -96 -69 -8 53 77
6625 77 69 33 -22 -91 -94 -60 10 69 86 86 40 -21 -69 -82 -59 0 68 102 84 39 -15 -64 -80 -48 1 59 88 86 24 -37 -72 -82
6657h2L9N6M5K3qn6o4l5j6M3O4N5J8j0m7o4m2j0L9O0N3K5ro1n5k9j5L4O9M4L2
6688I6j9m5p6m6QM5N7N3K9k7m5n7l8MK6N3N1K6l0m6n6m4J2L1O8N6Oj8n8o4l7J6
6720f9K8O4M7J5k1n4o2m9K3L0O8M3J7k4l4q0k8KM8N6O1Rl1m7o7k1kM0O9M5J4l1
6752E9m7n9k9MN9N7M2Rk5n7n8k4%M8P1L7J0m3n5n4l2J7N4N9K3L5n1n2n6l0K1N2
6784a5M1N0nl0n6n3k7J8L5P2M2Pl2m8o6j5J6M6O7L8J0m7o3m7j7J6O2N2K5J9m0
6815E5n2n5l4L6M6N3M4%m6m9o5j3J8N0O1L6ol7o7m9rJ1N9N1M1Qm4n5n4k5K4M4
6847b3O0L7pl8m6o9j1M1M7O7J4%m3n8n7rL8O8M9J0J3n1n4l3j9K7M6N9L7lm5o6
6879a9n2j0K9N6N6L5j7l9p3l8qJ9N5P0K9k3m7p0l5j0L8P1M1K8j6m4p2l5KJ8O6
$$ plain form
6657 -82 -43 13 58 81 73 17 -47 -82 -98 -55 9 64 82 72 25 -39 -81 -91 -52 8 61 86 77 16 -39 -68 -83 -49 20 64 96
6688 96 77 32 -44 -90 -82 -37 20 73 102 75 30 -27 -65 -61 -35 18 69 95 65 19 -37 -81 -69 -38 30 86 92 74 16 -48 -85 -69
6720 -69 -41 23 70 85 64 10 -52 -101 -78 -48 20 63 80 56 22 -58 -86 -84 -36 20 81 90 59 12 -55 -76 -78 -38 31 76 90 59
6752 59 12 -47 -76 -72 -13 44 86 95 70 13 -45 -69 -69 -21 50 87 97 54 -1 -55 -87 -70 -16 43 66 101 50 -2 -58 -88 -67 -15
6784 -15 26 76 71 41 -15 -68 -95 -77 -42 30 72 79 47 -1 -67 -82 -66 -20 47 85 95 48 -15 -62 -79 -63 -1 51 76 95 55
6815 55 3 -52 -86 -50 -4 49 93 93 47 -2 -67 -80 -62 -12 49 85 79 42 -25 -74 -83 -72 -13 38 79 87 43 -12 -66 -91 -67 -23
6847 -23 37 74 67 29 -17 -86 -97 -56 -9 58 72 72 29 -29 -86 -95 -57 11 60 70 83 32 -22 -55 -74 -47 -1 58 95 92 47 -19
6879 -19 -71 -81 -52 4 60 95 78 39 -34 -72 -80 -61 -6 64 93 70 23 -47 -82 -92 -54 17 58 86 70 26 -46 -81 -79 -61 5
6910EO1J9j8n2o3k8j6L3O9M9J6nl7p5m3J0M4N3L6L5k0m4o2l5oL7M9O7Rk2m5n5
6942c4l9oL9N5N8Qnn9n5l7JL5O9L6K3k8m1p7l1OL5O2N7Qk8n7m9l3RK9O8M0J8j6
6976F1m6n6m1jN3N5N3J0j6o3m7l4lM1O4N4J0l1m8n9l1PM1P4L6J5l4n4o3k7J1M7
7008b2N1N6lk9o4n7j8J7M4O2L4lqp6m3k8J0N8M2M5Ql2n7n6k2L5L6N8M0Ll0n5m3
7041d7l2RM4O4N5Pm5o3l3m1K8M7M8M3Mm5n5m5j4J9M9N0K3J4m3o3n0j1J4N1N8L8
7073G8Jl9o9m0lPM8O9L1j4l6n6m9k5L0N6N2L1ll0o2m8k5L0P2L3N0j9l5o0m1rJ8
7106e7N5N7K0Nm2n7m8j4L6N9O3J9j7m4n3n6qL6L7O8J4j3l6o2l6j3L5M5N3K7j1
7137F2m4o0l5rK8M9P3J5j9m0p7k7j2L9P2M1K4Oo1o2m4JL5N7N1M0k3n3n3n3lM0
$$ plain form
6910 5 66 85 67 15 -48 -76 -92 -59 10 59 75 70 33 -42 -85 -75 -31 22 58 93 73 29 -33 -68 -74 -37 12 79 88 66 21 -34
6942 -34 -73 -79 -40 15 73 81 76 17 -38 -75 -74 -39 30 66 89 61 20 -57 -88 -82 -47 15 72 80 52 -5 -54 -87 -78 -49 19 59 77 61
6976 61 15 -41 -82 -83 -30 25 78 88 72 9 -38 -72 -75 -34 30 84 94 63 15 -44 -75 -68 -27 47 83 98 64 10 -53 -80 -69 -22
7008 -22 29 85 82 53 -11 -68 -86 -69 -25 37 71 68 60 -16 -59 -87 -77 -19 23 68 76 44 -13 -69 -91 -56 -20 38 78 81 51 -4 -47
7041 -47 -79 -70 -26 38 93 100 55 -8 -41 -82 -54 -7 41 84 88 43 -12 -57 -71 -52 -3 47 70 84 41 -22 -72 -83 -69 -18 40 78
7073 78 79 40 -29 -69 -72 -65 -17 52 83 69 33 -23 -72 -97 -67 -11 41 72 69 39 -23 -71 -96 -66 6 39 89 70 35 -25 -66 -75 -57
7106 -57 -2 55 75 80 38 -19 -67 -81 -45 14 77 96 79 35 -18 -74 -82 -46 -9 59 73 60 24 -38 -74 -87 -52 -7 46 73 62
7137 62 18 -42 -77 -86 -58 -9 64 79 60 20 -57 -84 -96 -57 15 56 80 86 25 -37 -81 -80 -45 12 63 103 80 27 -26 -79 -82 -42
7169d2O1L4M1j5n3o7l7MK9O4N8K1l3m8o4m4LM9N0O8mk0m5o3l9PM0N0N3J6j2o0
7201Bm9m1LL0P3N4J5k6o8m1l2JL9N4N1K1j4o3n6l2LM3O6M5K5n1n4m2l0OM8M9L9
7234F8K8m7m5o3k4QM6N8M1Oj9o2m5l4J2L0O4N0J0l7m7o7k5J7L9N5N2%l1m9o1k5
7266i7J5N6N6M7Mm3l2n7m7L8M9N7L1Jl0n6l7l4J6M4O5L8%l2m2p9LOL8O6N7j9l2
7299E0n7n8k3K3M6O2K5kk4n8n9l0L0M8M8M4Om4n4m4j5J9N4N5L4nm4n0m9j3J8N0
7331a7N3L4Ml0p0m0j9K6M8M8M4ml3o4m1j7K4L7P3K5Pn7n2m1j5K1N6N7K5jm8n8
7363b5m8kJ3N3N6K0ml9n4n7%L0M5N6L1pn1m7n1OK9M5N7J7nm1o2l8j5M1M5O7K8
7396I3k0n1o0k1j5K8O2L7L1j2m6n6m5MK6N3N4J6j3l9o2l6JL0M6N9J2j5m7n7l8
$$ plain form
7169 -42 19 53 94 79 26 -41 -78 -74 -45 19 77 98 65 17 -47 -91 -88 -39 11 79 75 55 10 -53 -92 -85 -45 5 58 74 62 2
7201 2 -47 -88 -85 -55 18 72 87 61 -7 -48 -80 -79 -40 14 65 86 72 9 -47 -79 -76 -33 33 78 103 52 -2 -44 -74 -68 -20 29 68
7234 68 96 49 4 -59 -83 -75 -29 29 70 76 57 -5 -50 -84 -72 -42 22 72 82 45 -2 -69 -94 -77 -38 17 69 69 38 -11 -72 -97
7266 -97 -82 -26 30 77 81 38 6 -51 -98 -60 -11 46 77 78 48 -8 -45 -79 -63 -19 46 84 84 52 10 -69 -66 -60 -22 44 101 82 50
7299 50 -7 -65 -88 -65 -19 43 68 66 42 -16 -75 -105 -75 -27 21 65 71 27 -27 -71 -86 -67 -13 42 76 71 27 -23 -72 -85 -67 -17
7331 -17 36 70 74 44 -26 -66 -85 -59 -11 37 81 77 44 -20 -61 -78 -54 -17 56 81 88 31 -21 -62 -77 -56 0 57 82 81 33 -25
7363 -25 -73 -75 -62 -9 47 67 63 24 -30 -87 -87 -57 -12 44 75 68 17 -30 -81 -75 -46 -1 56 73 68 27 -35 -73 -88 -47 -2 65 93
7396 93 73 22 -38 -59 -74 -46 16 53 84 72 26 -30 -75 -71 -45 8 62 78 65 26 -36 -72 -71 -41 5 64 76 61 14 -43 -81
7427h1pM4M9M1J9pn4m0n4K3K8M6N4J6j1n5m8l6OL6N0M7J6k2l3n6l7RK6M5N5J3
7459H2j5m3n9k5pM0M6N3J1j6m4o4k0pM1N2M6Qk7n3m0l7NM2N3M2J6k3n3n9k8QK9
7492d6O5M7Nj5n9l9l5MM1M2N5Ql1m5m4l1QM6N6M0%k5l9m1m3J2M5M8N0Jk7n5l9
7525d1l0K4L6N4K5kj8m8l3m2QL8O8K8km1l7m0k9J8L5O0L2oqo7m7j9J6L5O6K7R
7558F9l9m2m7k2K5L0O1M0km0m3l3l3K8L1N4L9Rm5m7l6j9K9L5N5J4lk6o1k0l4K6
7590d7L0N8K7mk2o2l0k8K2M6N1K4Om7n2m0j3K9L7N4L0mm0m3l6k7L2M1N0L8j4m1
7622B5m3m7mK5N0M7L0j1m6l8l4k6K9L7N7J1lj8o6l5oK0O6L7K3j9l6m1m8rL4M4
7654EM2K4%m7m4m6kL0M1M4L3k3l6n6l3lK7M0N1L0l1l7l2m4oM6K9M4L5on4m9k6
$$ plain form
7427 -81 -88 -44 5 46 65 58 4 -36 -90 -67 -39 7 61 77 66 11 -37 -73 -67 -31 19 66 82 60 27 -29 -66 -57 -31 14 69 82
7459 82 67 24 -35 -60 -67 -27 19 72 83 67 23 -41 -61 -68 -27 25 71 79 52 -1 -41 -78 -73 -31 22 64 80 57 4 -55 -83 -75 -46
7492 -46 19 66 71 56 -3 -42 -77 -73 -32 10 65 73 42 -3 -47 -78 -70 -24 32 72 72 47 8 -33 -76 -64 -19 29 79 80 53 -2 -41
7525 -41 -71 -47 -11 43 68 66 48 0 -33 -75 -67 -29 39 67 65 24 -13 -53 -82 -64 -29 31 63 57 49 -18 -65 -84 -68 -33 33 60 69
7558 69 30 -12 -59 -81 -56 -26 35 75 73 33 -10 -43 -76 -48 -17 37 76 85 40 -7 -43 -62 -33 2 57 71 68 42 -19 -39 -73 -47
7590 -47 -17 41 68 64 42 -20 -50 -78 -56 -10 41 65 71 24 -28 -68 -81 -52 -15 39 69 65 25 -18 -54 -81 -49 -8 42 80 66 25
7622 25 -18 -65 -69 -44 6 53 83 72 26 -12 -46 -72 -43 -6 51 62 59 41 -25 -60 -66 -46 20 57 80 61 25 -16 -64 -73 -39 5
7654 5 47 71 71 24 -20 -66 -68 -38 3 47 80 57 21 -35 -68 -71 -44 -4 47 77 46 9 -23 -67 -73 -27 2 46 81 75 21 -28 -54
7687e4j3L6L4N4K4j2m7n6l0j1N9L0M4J6qm3n1j8k1K2N2N4K4l3l6m4m3J1J4M9N1
7718E4J5j4m2n2m3J9K3N9K9J3j4m0l9m8lM8M0N1J4k4m0l7l8nM8M0N2J1j8n5m1
7749c7l4J3L3N5L8%j3l9n1k5MK0O2L9Mk0o0l1k4kM7L1M7J1j5o1m4k3QL6L8M9Q
7782F4oo0m7k7%M7M7L2%j3m1l7m0J1M2L6N9jk1l3o2j6J2L7M9L9oj7n4l7k7J6L3
7815b1O0L5Ml5n4l2l2J6M8L8L7Jl2m4m0k8QO0M0L1J2l8n1m2j6J7L5N4L0Lk9o0
7847b5l0l0K3M8M9L2jk5m4m8k7L3M2L6L5ql0m2l7rQL4P0J0Ml1m5m0qJ2L7N1L4
7880G8lm3m2m1j0J7L3N7K1Kl6n9l1j5K8L4M9K5j2l0m4l3pJ0N1M1K2om4l6l2rK5
7913d0L9M5K4rk6n0l6j1K6L6N1K1j3k2m9n4LK6M1M5K5kl1n5m1%J8M0M7L1j9m0
$$ plain form
7687 -54 -67 -31 3 57 81 69 22 -34 -64 -75 -16 14 58 74 66 23 -28 -46 -67 -45 7 61 85 52 16 -28 -71 -60 -46 3 54
7718 54 69 55 13 -39 -82 -63 -40 19 48 61 47 7 -32 -80 -83 -35 5 56 70 46 6 -31 -69 -74 -26 14 66 77 59 4 -37
7749 -37 -71 -58 -25 30 68 68 55 16 -35 -60 -56 -36 26 65 69 49 -11 -42 -66 -68 -21 10 57 68 53 -8 -52 -75 -67 -31 7 56 64
7782 64 58 -2 -49 -76 -76 -29 18 50 50 37 -4 -41 -81 -70 -28 8 67 66 45 12 -50 -66 -54 -17 32 71 65 48 -6 -43 -70 -54 -21
7815 -21 39 74 78 43 -11 -43 -75 -59 -11 27 64 65 33 -11 -51 -79 -71 -11 29 60 72 34 -17 -59 -75 -58 -23 31 61 64 35 -25
7847 -25 -55 -85 -62 -14 35 67 66 41 -3 -51 -78 -45 -3 33 68 60 30 -12 -49 -58 -50 -16 54 64 68 37 -8 -48 -56 -44 -7 44 78
7880 78 75 32 -10 -51 -61 -44 -11 46 67 69 33 -26 -57 -72 -44 -10 39 64 52 22 -22 -55 -62 -52 -1 40 62 56 12 -24 -56 -65 -40
7913 -40 -1 44 68 59 33 -17 -53 -64 -38 -2 49 70 57 35 -14 -68 -65 -39 2 47 72 70 39 -16 -57 -57 -39 1 48 79 60 20
7945B0m2m2RQM5N2J2qm2m3k8kK1M7K6L0j2l5n6k9NK0M2M4K4j1m7m2k7LK5L9N3
7978E9Rrl4m7k9j1M0N3J8K6k2k4n4m1NK9M7M2J1j0l3m6m2J8K3K3N0J2j8l8l1n3
8010g7K0K8L7L6K1l1j9n6k4OL2L0N3J6l9k9m2l3J3J5O0L5K8k1n1l7l8JN1L9L3
8041E7Pmm9m4k6%N0L3K9Ok2k8n2k9J4L8L9L7Oj3m2m5k7RJ9N7K7K1m0m6k7m0L0
8074e5K8L5L9J4l0k6n3j7MN2L1K3J3j8n4k9k6RL3N6K8%qn5m0k2J7L8N3K6lj3n3
8107cm1j3LL7M2L7Ol2m4l2j4PL1M5K3J4m7k3l7k1J3K1N7J6J3k4n1l4k2J5L5N1
8139B8K6Pk9m9m2lJ5M0L6J2J2k0m3k6l6K4M3L4M3j2l1m6j7j8RL6N0K4Ml1n2k7
8171c9j1KM8M1K6j5l8k7m1j7K6L8M5OJ0l7l9l6j7K1
$$ plain form
7945 20 -22 -64 -55 -47 -2 50 62 54 12 -31 -59 -61 -40 7 33 63 51 16 -40 -69 -64 -44 -2 42 66 55 8 -34 -61 -58 -33 6 59
7978 59 68 59 25 -22 -51 -62 -22 31 49 75 53 29 -25 -66 -61 -32 15 57 68 58 25 -21 -63 -45 -22 1 51 63 45 7 -24 -77
8010 -77 -57 -29 8 44 65 34 15 -41 -65 -59 -27 3 56 72 33 4 -38 -71 -58 -43 17 52 80 59 8 -29 -67 -66 -15 24 57
8041 57 64 60 11 -33 -59 -59 -9 24 53 59 37 9 -43 -72 -58 -20 19 56 62 49 7 -38 -65 -56 -37 20 47 68 28 -18 -45 -85 -55
8074 -55 -27 8 47 61 31 5 -48 -65 -61 -9 22 45 58 40 -14 -43 -69 -60 -27 29 57 57 49 -6 -46 -68 -51 -13 40 66 63 50 -3
8107 -3 -44 -57 -54 -17 25 62 68 36 -8 -40 -54 -47 -16 29 52 66 19 -4 -41 -62 -49 -28 29 45 58 34 -17 -51 -73 -58 -23 28
8139 28 54 61 32 -17 -59 -62 -47 -7 29 41 53 33 -10 -36 -72 -48 -5 29 72 60 29 -17 -34 -52 -43 -7 43 67 71 40 -12 -39
8171 -39 -50 -48 0 41 67 52 14 -13 -54 -71 -45 -7 38 44 54 17 -22 -58 -75 -54
8191e4
$$ Imaginary data points
##PAGE= N=2
##DATA TABLE= (X++(I..I)), XYDATA
0@%%%%%%%%%%%jRj6J6j6J6k4L2l2M0m8N6o4P2q5R4j06J22j38J55j72J95k22K47
35A30k77L09l41L80m21M63n15N71o31P00p77Q62r59J069j194J344j521J733j998
54a073K339k794L433m406O096r852L2521k1593r3357l2761J3290P0481Q2199O6684
68A11207R727m4403q2884p6336l9807J9725O6589Q5341N9811R029m7546p8831
80h378p5454l4888K0461O7271Q0643N7537O306m6890p8534p1787l2004K2751O5865
93b7101P8558N3787L759m7891p5761o8306k9113K3605O5486P5934N0209J040m7636
106E6570p3719o5417k6411K5345O4713P2896M6783q35m7597p1743o2283k3650
118a05348K6009O3303P0539M4318k678m7666o9796n9512k1520K6971O2617O8022
$$ plain form
0 0 0 0 0 0 0 0 0 0 0 0 0 -1 8 -8 8 -8 8 -16 16 -16 24 -24 32 -32 40 -45 49 -57 65 -73 82 -90 105 -117 130
35 130 -147 162 -179 201 -220 243 -272 299 -332 368 -409 453 -506 563 -631 713 -808 925 -1073
54 -1073 1266 -1528 1905 -2501 3595 -6257 26264 4671 -88686 -121447 -108157 -37676 44523 111207
68 111207 120934 76531 -6353 -82689 -122496 -102771 -36182 49159 108970 117999 70453 -8378
80 -8378 -83832 -118720 -98259 -30988 49655 107192 113498 66608 -11926 -83713 -115717 -92966 -27101
93 -27101 51457 105244 109003 61112 -14649 -82955 -112068 -88463 -22977 52957 103166 104206 56570
106 56570 -17149 -82566 -108977 -83632 -18919 53977 100760 99925 52328 -19415 -81698 -105348
118 -105348 -79339 -16036 54503 98821 96143 48477 -21319 -80831 -102351 -75380 -12763 55259
130E5259M1168m339m7081o7884n7145j9206K7923O1220O5209L9008n143m7021
142D1968o6681n4551j6733K8369N9675O3153L7093o636m6960o4709n2017j5208
154i3237K8710N9015O1189L4447q121m6305o2744m9912j3455K9326N7697N8736
166E5346L2566q683m6008o1563m7782j1430K9589N6318N6885L0918r828m5902
178C0426n9784m5481j0166K9660N5535N5257K8907j0970m5384n8287m3797q632
190h2716L0443N4678N3041K6844j1789m4921n6823m1770p109L0479N3542N1558
202E5457K5337j2981m4862n5150l9610n876L0500N2685M9972K3558j3833m4329
214B0868n3884l8234m481L1374N1915M7885K1669j4499m3907n2651l6422l020
$$ plain form
130 55259 96427 92088 45007 -22877 -80022 -99228 -71305 -10085 55124 94132 88989 41968
142 41968 -24713 -79264 -95997 -67628 -7953 55200 92293 85657 38697 -26012 -78029 -93237
154 -93237 -64527 -5512 55677 90124 82003 35698 -27046 -76958 -90413 -61087 -3390 55346
166 55346 87912 79229 33221 -28342 -76124 -87554 -57965 -1647 55238 86156 76328 30426
178 30426 -29358 -74839 -85005 -55345 190 55447 84354 73384 28000 -30287 -74084 -82716
190 -82716 -52273 2405 55446 82290 70501 25580 -31243 -73013 -80122 -49643 3899 55457
202 55457 80794 67813 22951 -32199 -71809 -77685 -47185 5500 55472 79030 65197 20868
214 20868 -33016 -71250 -75731 -44357 7558 55443 77112 62613 18706 -33945 -70367 -73387
226g3387L1471N0903M6513K0259j5616m3849n1090l4456j953L1481N0216M5090
238E5582J8545j6484m3268m9746l3112p92L1955M9323M3278J7147j6828m2892
250A2708m8817l1603N45L2074M8241M1924J6000j7605m2751m7454k9902J423L2022
263c3195M7556M0730J4552j8342m2231m6258k8754K384L2424M6868L9130J3214
275F8078j8744m1809m5371k7415L578L2554M5933L7849J2144j9388m1679m4117
287c8387k5820M380L2405M5235L6806J0882k0095m1254m2971k4653N278L2721
299b5473M4551L5275R621k0401m0786m2073k3478O304L2818M3624L4128Q687k0941
312D1856m0637m1006k2038P085L2724M2988L3075P467k1632m0172l9784k0912
$$ plain form
226 -73387 -41916 8987 55500 75759 60143 16294 -34796 -69252 -71205 -39724 10492 55582
238 55582 74127 57643 14375 -35371 -68483 -69275 -37320 12003 55281 72428 55600 12708
250 12708 -36109 -67712 -67167 -35093 13148 55072 71072 53467 10716 -36738 -66640 -65217 -33195
263 -33195 14361 55091 69643 51301 9070 -37188 -65942 -63558 -31134 15734 54864 68078
275 68078 49334 7525 -37846 -65261 -61683 -29129 16804 54653 66797 47409 5730 -38387
287 -38387 -64207 -59827 -27422 17813 54619 65501 45406 4152 -38819 -63472 -58194 -25473
299 -25473 19078 54353 63974 43573 2787 -39286 -62764 -56460 -23642 19982 54110 62797 41856
312 41856 1219 -39787 -61825 -54740 -22016 20972 54047 61514 39882 -290 -40074 -60986
324f0986P826L2857M2315L1725O327k1897l9705l8923j9791Q750L2941M1444L0557
337E3440N390k2373l9488l7898j8419R553L2840M0681K9474M308k2862l8993l6754
350d1101j7377J0166L2945M0064K8259L186k3192l8574l5841j6261J1069L2995
362a3662L9219K7077K248k3626l8260l4784j4983J1796L2839L8414K6019J274
374E3571k3991l7750l3760j3960J2392L2838L7739K4847K68k4247l7217l2797
386d2067j2939J3079L2745L6858K3723m89k4450l6807l1843j1862J3637L2561
398g854L6120K2764j370k4796l6351l0805j0838J4222L2478L5384K1601k287k4980
411B3288l5784k9833r847J4807L2297L4521K0577l027k5116l5325k8904q848J5288
$$ plain form
324 -60986 -53160 -20303 22012 53737 60064 38167 -1538 -40461 -60252 -51502 -18561 22883 53440
337 53440 58830 36457 -3031 -40929 -59348 -49795 -16955 23726 53200 57508 34646 -4347 -41101
350 -41101 -58478 -48312 -15367 24697 52956 56142 32950 -5624 -41465 -57726 -46657 -13662
362 -13662 25557 52634 54882 31256 -7004 -41788 -56771 -44975 -12136 26278 52297 53571
374 53571 29580 -8170 -41930 -55890 -43498 -10660 27079 51926 52194 27947 -9270 -42067
386 -42067 -55006 -41927 -9182 27676 51399 50910 26460 -10347 -42190 -54052 -40415 -7854
398 -7854 28266 51030 49660 24864 -11487 -42292 -53130 -38908 -6430 28954 50555 48268 23288
411 23288 -12496 -42329 -52176 -37369 -5072 29449 50026 46999 21883 -13442 -42346 -51194 -35906
424c5906L2079L3739J9590l777k5302l4757k7910p960J5716L1872L2975J8585
436D8944m521k5383l4214k7001p077J6160L1649L2175J7655n212k5497l3709k6067
449d2098o144J6594L1387L1390J6661n911k5581l3136k5104n299J6979L1150L0595
462C1483J5696o591k5664l2556k4178m410J7370L0874K9763J4735p231k5696l1946
475a8351k3238l601J7703L0566K8989J3814p846k5723l1400k2347k727J8090L0247
488D176K8183J2876q452k5765l0784k1406j953J8373K9908K7403J2025r074k5738
501I772l0179k0515j197J8660K9609K6612J1110r637k5639k9589j9661m39J8948
514b2145K9227K5778J0248j0060k5570k9015j8799K73J9100K8849K5097R513j0610
$$ plain form
424 -35906 -3827 29912 49502 45725 20423 -14334 -42244 -50204 -34488 -2616 30359 48944
436 48944 44423 19040 -15174 -42175 -49252 -33092 -1443 30732 48387 43175 17678 -16031 -42098
449 -42098 -48242 -31648 -261 31129 47790 41879 16298 -16838 -41942 -47241 -30262 888 31483
462 31483 47179 40588 14924 -17632 -41810 -46220 -28850 2024 31787 46522 39291 13595 -18351
475 -18351 -41589 -45190 -27487 3079 32068 45882 38036 12313 -19087 -41434 -44161 -26071 4176
488 4176 32359 45235 36783 11018 -19766 -41172 -43125 -24752 5156 32559 44584 35510 9772
501 9772 -20407 -40922 -42119 -23459 6150 32762 43872 34235 8596 -20993 -40654 -41093 -22145
514 -22145 7082 32860 43108 33048 7478 -21537 -40336 -40063 -20963 7886 32983 42496 31886
527C1886k5548k8396j7943R48J9309K8551K4303Q621j1092k5366k7773j7151J584
540c8067J9552K8140K3483P863j1438k5283k7240j6333K327J9670K7682K2771
552C3127P139j1899k5198k6522j5480K824J9739K7351K2067O366j2301k4978k5924
565b3689j4795L388J9947K6946K1278N674j2550k4848k5450j4016M036K0034K6454
578A2409K0590N032j2940k4702k4751j3216M462K0001K6154J9957M328j3308k4466
591d50k4141j2593M980K0196K5701J9157L629j3482k4231k3648j1870N541K0200
604a1011K5207J8516L099j3832k4134k2980j1086N971K0149K4889J7884K363j4180
617B0855k3827k2352j0461O451K0306K4437J7062J729j4324k3589k1837r766O975
$$ plain form
527 31886 6338 -22058 -40001 -39053 -19744 8807 33110 41731 30639 5273 -22500 -39651 -38067
540 -38067 -18515 9625 33108 40971 29533 4250 -22990 -39323 -36996 -17326 10356 33127
552 33127 40266 28367 3169 -23353 -38833 -36009 -16270 11081 33148 39514 27213 2235 -23689
565 -23689 -38484 -35096 -15149 11797 33075 38749 26199 1351 -24099 -38115 -34079 -14045 12409
578 12409 32999 38031 25091 389 -24362 -37578 -33116 -13115 13039 32996 37324 24016 -450
591 -450 -24591 -37184 -32204 -12008 13693 32850 36479 22997 -1234 -24882 -36752 -31211 -11011
604 -11011 14196 32712 35811 21979 -2155 -25135 -36221 -30250 -10101 14788 32672 35035 20855
617 20855 -2972 -25324 -35785 -29334 -9028 15409 32471 34200 19876 -3713 -25550 -35316 -28341
630b8341K0243K3904J6479J272j4604k3482k1215r007P337K0135K3531J5882N95
643C2729j4825k3070k0564q492P622K0195K3119J5150J17j4893k2890k0121p879
656c3802Q174K0117K2549J4551k94j5099k2686j9514p171Q423J9978K2195J4028
669C1449r27j5321k2302j8864o694Q689K0013K1777J3287j408j5307k2029j8471
682b6108o086R179J9922K1185J2680j753j5488k1829j7812n427R375J9705K0867
695A8410J2206k349j5674k1446j7195n003R642J9779K0453J1418k849j5625k1069
708i302j6763m445J0032J9591J9860J0928l113j5793k0953j6130l768J0281J9352
721b23J9466J0444l705j5926k0481j5500l380J0454J9379J9080R690m158j5858
$$ plain form
630 -28341 -8098 15806 32285 33557 18953 -4529 -25744 -34751 -27414 -7279 16252 32134 32729
643 32729 17904 -5166 -25730 -34222 -26600 -6405 16714 31864 31981 17088 -5802 -25923 -33802
656 -33802 -25628 -5511 17038 31589 31295 16196 -6490 -26004 -33175 -24752 -4774 17421 31449
669 31449 30522 15201 -7101 -25965 -32659 -23970 -3957 17820 31107 29699 14392 -7637 -26108
682 -26108 -32194 -23015 -3093 18092 30772 29019 13531 -8298 -26110 -31537 -22162 -2457 18410
695 18410 30616 28267 12593 -8853 -26048 -31051 -21409 -1630 18823 30241 27392 11767 -9302
708 -9302 -26065 -30510 -20478 -887 18973 29901 26788 10995 -9958 -26088 -29856 -19575 -223
721 -223 19243 29687 25982 10056 -10425 -25925 -29305 -18851 528 19608 29298 25140 9282
734I282k0127j5097k863J0872J9215J8435R168m399j5951j9974j4493k159J1009
747a7082J8906J8057Q763m876j6123j9519j3841j784J1109J8867J7685Q079n313
760B2928j5983j9148j3498j338J1543J8749J7014P478n526j5966j8946j2891p14
773b6298J1626J8340J6638P181n912j6140j8525j2264l43J1668J8302J6299O485
786B7057o333j5954j8083j1917j4J2007J8159J5676N982o484j5908j7926j1407
799b5145O18J2100J7756J5267N664o840j6029j7479j0752R08J2101J7700J4931
812B0800N014p217j5812j7008j0421J185J2341J7519J4377M565p327j5757j6841
825a4582r946J743J2443J7131J3930M257p590j5804j6429r327K013J2353J6982
$$ plain form
734 9282 -10845 -25942 -28805 -17933 1282 19717 28885 24486 8535 -11439 -25932 -28091 -17082
747 -17082 1824 19881 28644 23768 7645 -11874 -25715 -27499 -16390 2477 20162 28241 22928
760 22928 6945 -12203 -25701 -27039 -15496 3253 20267 27745 22219 6253 -12693 -25584 -26298
773 -26298 -14672 3668 20306 27487 21575 5435 -13090 -25354 -25697 -14029 4273 20572 27057
786 27057 20724 4770 -13313 -25230 -25244 -13237 4922 20598 26580 20096 4188 -13738 -25145
799 -25145 -24527 -12427 5329 20596 26260 19420 3391 -14088 -24840 -23932 -11831 5869 20800
812 20800 25814 18597 2785 -14223 -24644 -23459 -11118 6401 20778 25343 18016 2259 -14582
825 -14582 -24528 -22785 -10342 6789 20719 24976 17386 1582 -14847 -24174 -22161 -9808 7174
838G174J3640L746p921j5626j5996r020K286J2583J6861J3093L243q043j5517
851E03j5789q560K819J2671J6460J2640K919q281j5572j5360p950L098J2594J6274
865H466J2328K430q589j5366j4908p622L319J2790J6104J1789J952q669j5194
878a170j4714p208L812J2844J5703J1362J701q869j5242j4327o644M084J2777
891e891J5526J1038J211r190j4998j3835o293M265J2862J5337J0505P99r187j4841
905b692j3624n929M680J2908J4946J0107N63r356j4870j3245n372M935J2784J4728
919A0563R815J14r607j4602j2758n069N066J2846J4549R308k64r583j4414j2559
933a6595m743N448J2875J4136Q906m52r724j4378j2184m217N629J2701J3917Q656
$$ plain form
838 7174 20814 24560 16639 1013 -14983 -24003 -21717 -9134 7727 20820 24063 16020 503
851 503 -15286 -23846 -21027 -8356 8104 20744 23663 15382 -190 -15550 -23500 -20402 -7808 8466
865 8466 20794 23224 14635 -731 -15639 -23261 -19942 -7152 8952 20741 22693 14024 -1170
878 -1170 -15884 -23092 -19280 -6436 9267 20629 22330 13461 -1781 -16108 -22752 -18668 -5891
891 -5891 9635 20673 21884 12694 -2304 -16139 -22432 -18167 -5305 10032 20537 21336 12149 -2692
905 -2692 -16316 -22245 -17565 -4657 10289 20396 20959 11603 -3267 -16512 -21884 -16949 -4165 10563
919 10563 20378 20492 10885 -3717 -16475 -21544 -16478 -3632 10917 20225 19961 10378 -4036 -16595
933 -16595 -21338 -15890 -3015 11121 20027 19575 9851 -4527 -16711 -20928 -15299 -2598 11319 19975
947A9975q29r942j4130j1716l931N736J2740J3749Q167j257r880j3883j1504l636
961b0341O083J2737J3322P767j385r981j3850j1160l143O267J2576J3088P542
974A9522j789j0219j3592j0678k817O359J2609J2884P012k153j0143j3340j0411
987a6756k543O666J2597J2464O597k295j0197j3286j0098k033O871J2377J2192
1000A2556O342k630j0365j3041r603j741O913J2364J2015N907l013j0311j2756
1013g363r345j496P186J2341J1599N485l158j0296j2650r025j036P345J2098J1292
1027A2977N249l380j0450j2413q574p69P385J2051J1098M845l758j0375j2101
1040h215q294n37P585J1992J0698M431l839j0312j1971q027j43P708J1750J0431
$$ plain form
947 19975 19146 9204 -4926 -16642 -20573 -14837 -2097 11652 19819 18562 8682 -5201 -16705 -20341
961 -20341 -14258 -1521 11801 19568 18183 8202 -5648 -16808 -19951 -13684 -1108 11980 19522
974 19522 17733 7514 -6078 -16756 -19573 -13214 -605 12279 19291 17138 6995 -6345 -16756
987 -16756 -19299 -12633 -36 12428 19025 16730 6533 -6753 -16851 -18884 -12013 364 12556
1000 12556 18898 16268 5903 -7138 -16741 -18482 -11569 795 12810 18717 15704 5393 -7363
1013 -7363 -16708 -18204 -11018 1323 12922 18407 15249 4953 -7697 -16722 -17758 -10413 1685 12977
1027 12977 18226 14846 4396 -8017 -16591 -17360 -9975 2076 13174 18019 14261 3886 -8215
1040 -8215 -16509 -17046 -9461 2531 13229 17660 13821 3509 -8462 -16489 -16632 -8924 2826 13257
1054A3257M242m055j0415j1770p581J03P722J1664J0218L865m344j0329j1438
1067h861p321K98P849J1591R831L516m421j0265j1284p058O22P965J1375R561
1081A3398L273m601j0300j1080o636Q84P928J1237R353K957m817j0233j0783o385
1095a5805J049Q038J1179R017K613m953j0141j0630o083J374Q144J0934Q693K384
1109A5813n084j0143j0375n725J574Q112J0800Q491K112n284j0082j0101n481
1122a5373J775Q204J0713Q155J781n404r967r927n187K053Q259J0478P861J552
1136A4973n510r970r701m853K264Q250J0358P606J279n712r887r399m560K434
1150a2428Q311J0213P294R51n792r749r214m307K680Q338J0017P013P50n902r728
$$ plain form
1054 13257 17499 13444 3029 -8741 -16322 -16219 -8497 3167 13385 17250 12906 2577 -8861
1067 -8861 -16182 -15884 -8035 3556 13387 16903 12482 2217 -9067 -16125 -15503 -7538 3837 13398
1081 13398 16671 12070 1770 -9310 -15946 -15062 -7134 4103 13456 16413 11596 1363 -9420 -15805
1095 -15805 -14756 -6718 4461 13478 16091 11138 997 -9633 -15716 -14342 -6198 4736 13429 15813
1109 15813 10729 586 -9789 -15514 -13940 -5828 4972 13463 15575 10291 209 -9892 -15373
1122 -15373 -13598 -5394 5319 13474 15255 9851 -116 -10043 -15230 -13177 -4918 5560 13421 14973
1136 14973 9463 -507 -10208 -15061 -12797 -4547 5811 13417 14696 8984 -903 -10302 -14862 -12428
1150 -12428 -4117 6096 13390 14341 8549 -1200 -10414 -14721 -12041 -3703 6314 13327 14077 8175 -1553
1165a553q991l990K901Q308R842O781M98o052r633q710l712L009Q336R694O515
1180A3243K28o101r501q507l500L207Q364R501O231K5o188r461q280l190L390
1195a0539Q317R300O008j82o291r351q014k975L520Q301R175N754m41o345r246
1210c009p800k736L691Q313Q965N488o22o417r154p588k459L840Q278Q801N223
1225A2814q11o507r040p348k212L970Q250Q642M985j067o535q904p124k017M115
1240h789Q215Q453M732j209o584q806o935j773M246Q182Q287M496j405o645q688
1255d223o711j534M364Q145Q085M276j616o679q564o475j309M487Q086P908M045
1270A2285j802o713q470o241j069M585Q051P728L787j962o752q316o028q78M708
$$ plain form
1165 -1553 -10544 -14534 -11633 -3325 6517 13298 13796 7744 -1889 -10599 -14311 -11302 -2966 6728 13243
1180 13243 13471 7370 -2131 -10638 -14138 -10931 -2567 6934 13165 13190 7002 -2459 -10739 -13929 -10539
1195 -10539 -2222 7078 13086 12904 6613 -2738 -10752 -13727 -10207 -1906 7269 13023 12582 6237 -3009
1210 -3009 -10809 -13545 -9854 -1541 7424 12912 12290 5873 -3281 -10869 -13328 -9488 -1210 7591 12814
1225 12814 12003 5496 -3544 -10892 -13104 -9134 -884 7758 12743 11676 5141 -3763 -10887 -12904 -8789
1240 -8789 -574 7879 12611 11402 4818 -3988 -10923 -12696 -8450 -268 8019 12515 11110 4465 -4223
1255 -4223 -10934 -12468 -8104 41 8126 12402 10786 4107 -4457 -10932 -12241 -7754 332 8240 12285
1270 12285 10483 3770 -4700 -10941 -12010 -7425 626 8354 12141 10179 3427 -4889 -10917 -11795 -7087
1285g087P999P542L551k111o770q213n809o53M799P941P352L354k299o797q082
1300e283n570m64M880P873P182L128k449o790p923n386l06M970P831O976K933
1315A1602k574o790p814n195q4N022P731O827K722k698o814p663m980O3N084P683
1331B122O661K524k860o788p532m795K48N175P596O446K322k943o787p407m582
1346a0600M36N219P489O296K138l061o781p272m384O01N250P432O137J919l213
1361G606o733p116m190P45N316P365N909J736l301o730p011l978R38N383P249
1376C188N735J558l438o744o837l746J099N409P167N567J336l558o673o681l599
1391a0217J249N489P085N358J122l632o648o564l391J451N509O955N192R75l750
$$ plain form
1285 -7087 912 8454 12005 9894 3124 -5089 -10898 -11551 -6752 1189 8541 11895 9596 2799 -5283
1300 -5283 -10853 -11317 -6437 1436 8618 11746 9297 2507 -5416 -10802 -11108 -6138 1693 8669 11602
1315 11602 9028 2238 -5576 -10771 -10855 -5833 1898 8725 11447 8749 1935 -5728 -10708 -10645 -5561 2122
1331 2122 8783 11307 8447 1659 -5873 -10668 -10420 -5245 2351 8797 11119 8176 1389 -6018 -10600
1346 -10600 -10164 -4945 2544 8840 10978 7917 1136 -6136 -10520 -9919 -4669 2763 8900 10819 7606
1361 7606 873 -6243 -10433 -9688 -4372 2993 8902 10638 7337 607 -6404 -10382 -9444 -4061 3188
1376 3188 8923 10481 7043 299 -6538 -10284 -9185 -3776 3391 8958 10294 6736 63 -6618 -10217
1391 -10217 -8968 -3479 3606 8964 10086 6454 -194 -6758 -10149 -8698 -3189 3766 8958 9933 6183
1406F183o645o395l148J558N507O870N054P68l857o552o250l008J661N600O809
1421D155M823N80l907o515o136k831J850N608O645M651M68l989o533n955k600
1436i686J956N553O578M543K76m129o441n763k478K052N633O520M276Q9m117o375
1452a513n681k300K224N637O316M142Mm195o382n521k078K330N586O249M010j78
1468H650m321o268n324j935K361N630O180L784l54m274o180n261j823K552N646
1483i37O001L634m29m345o196n101j575K649N534N922L513n96m449o089m902j458
1499h824K686N589N837L317p82m439n967m813j344K864N591N646L132q42m459
1514C192n986m646j099K922N491N557L051r76m584n887m439r94K954N546N486
$$ plain form
1406 6183 -462 -6857 -10005 -8447 -2940 3930 8984 9752 5895 -657 -6907 -9915 -8254 -2654 4155
1421 4155 8978 9558 5651 -864 -7000 -9831 -7981 -2373 4272 8923 9391 5402 -1131 -7086 -9686
1436 -9686 -7730 -2177 4401 8944 9220 5091 -1350 -7113 -9591 -7539 -1906 4614 8890 8979 4862 -1513
1452 -1513 -7194 -9494 -7270 -1633 4683 8825 8829 4634 -1748 -7269 -9347 -7017 -1431 4818 8828 8650
1468 8650 4329 -1939 -7263 -9198 -6837 -1207 4973 8757 8403 4129 -2051 -7312 -9135 -6583 -937
1483 -937 5064 8698 8269 3924 -2272 -7373 -8948 -6299 -765 5157 8670 8074 3625 -2464 -7366 -8824
1499 -8824 -6138 -549 5288 8605 7823 3384 -2583 -7396 -8740 -5876 -285 5361 8493 7651 3192
1514 3192 -2794 -7440 -8539 -5617 -126 5431 8482 7506 2922 -2965 -7404 -8398 -5444 102 5588
1529E588K810j152m539n767m353q86L076N538N319K644j184m551n770m233o56
1544h116L139N431N225K568j324m649n656m013n72L163N435N158K386j516m594
1559B065n520l929m75L299N424M956K205j532m592n522l814k42L338N330M858
1574E849K118j652m662n422l585j49L325N332M789J954j805m630n279l518p4L467
1590c942N326M593J783j852m593n269l367J14L495N196M495J707j899m693n177
1605d083l170K03L490N186M453J533k083m652n017l094K99L607N181M241J350
1620G444k109m607m980k969M67L652N065M122J289k181m699m888k758N86L621
1635b945N043M074J118k351m625m738k682O45L728N040L872R55k343m602m730
$$ plain form
1529 5588 8398 7246 2707 -3060 -7413 -8299 -5223 315 5634 8278 7094 2543 -3227 -7460 -8116
1544 -8116 -4977 454 5679 8247 6923 2274 -3382 -7395 -7967 -4804 631 5789 8175 6659 2065
1559 2065 -3455 -7384 -7859 -4560 864 5820 8025 6493 1901 -3621 -7435 -7677 -4339 991 5849
1574 5849 7967 6315 1653 -3769 -7354 -7503 -4178 1154 5943 7897 6092 1462 -3817 -7335 -7409 -3942
1590 -3942 1384 5977 7760 5908 1315 -3954 -7321 -7207 -3712 1484 5979 7686 5787 1094 -4083
1605 -4083 -7253 -7050 -3560 1626 6079 7612 5529 877 -4140 -7234 -6935 -3328 1853 6094 7444
1620 7444 5335 728 -4252 -7221 -6754 -3102 1963 6085 7374 5193 494 -4394 -7152 -6566 -2945
1635 -2945 2098 6172 7290 4939 314 -4424 -7106 -6461 -2733 2307 6179 7134 4791 189 -4541
1650d541k563Q29L789M893L760R02k460m662m583k359R28L728M855L718P19k560
1666D393m615m456k277R61L835M865L524N52k582m557m440k146J140L883M718
1681B798L374N26k630m608m336j969J228L818M669L352L83k743m561m173j887
1696f759J232L882M691L191K06k756m482m127j817J390L923M542L040J93k788
1711C561m522m051j637J482L867M485L016P2k917m488l885j528J484L921M488
1726C348K859j08k906m411l842j477J634L971M353K704j38k924m453l783j259
1741f432J725L916M266K666k48l045m395l596j164J715L925M285K518l96l049
1756B691m323l545j132J875L984M155K359m29l084m333l481r28J963L912M065
$$ plain form
1650 -4541 -7104 -6275 -2486 2407 6167 7069 4609 -53 -4636 -6995 -6067 -2339 2516 6234 6953 4393
1666 4393 -222 -4678 -6955 -5994 -2159 2706 6230 6782 4200 -357 -4797 -6943 -5803 -1920 2798
1681 2798 6172 6698 4068 -540 -4876 -6845 -5617 -1799 2870 6222 6605 3862 -699 -4872 -6759
1696 -6759 -5527 -1645 3046 6237 6443 3687 -795 -4922 -6739 -5349 -1426 3116 6156 6349 3561
1711 3561 -961 -5012 -6649 -5167 -1300 3185 6201 6273 3356 -1132 -5017 -6545 -5061 -1140 3348
1726 3348 6207 6099 3193 -1218 -5060 -6537 -4903 -932 3421 6125 5987 3063 -1390 -5173 -6432
1741 -6432 -4707 -791 3475 6141 5893 2848 -1547 -5143 -6307 -4592 -667 3618 6136 5740 2691
1756 2691 -1632 -5177 -6309 -4434 -450 3705 6064 5635 2551 -1782 -5263 -6191 -4228 -316 3749
1771C749K316n35l172m297l301q37J951L946M060K182o92l193m187l260p67K069
1787c968L983L931K033p36l188m203l180o30K181L911L831K002q22l270m173l010
1803e308n22K157L919L827J852r58l264m059k954m69K243L968L710J704r89l250
1819A607m084k875l24K334L887L611J674j055l338m022k725k48K332L881L589
1834D244J547j189l319l931k651j99K402L884L491J407j207l302l916k600m4K461
1850b922L823L371J375j268l357l863k459K6K451L816L359J268j382l362l765
1865b889k392Q2K523L820L245J129j412l335l751k300J81K586L759L147J072j450
1881D015l391l700k177K84K581L753L087R71j578l391l585k088L55K617L742K995
$$ plain form
1771 3749 6065 5530 2358 -1939 -5240 -6077 -4126 -180 3880 6062 5370 2177 -2010 -5270 -6037 -3968
1787 -3968 15 3946 5979 5243 2055 -2148 -5328 -5958 -3777 134 3965 5967 5145 1875 -2298 -5308
1803 -5308 -5830 -3673 246 4073 5925 4967 1703 -2356 -5310 -5779 -3536 432 4142 5846 4857 1607
1819 1607 -2477 -5352 -5676 -3342 545 4156 5830 4775 1437 -2585 -5310 -5558 -3226 655 4244
1834 4244 5791 4602 1283 -2648 -5299 -5498 -3096 788 4279 5686 4479 1177 -2739 -5339 -5383 -2922
1850 -2922 901 4272 5647 4379 1022 -2841 -5300 -5274 -2823 993 4352 5620 4238 876 -2889
1865 -2889 -5281 -5199 -2676 1144 4389 5518 4106 771 -2980 -5280 -5099 -2513 1246 4393 5465 4015
1881 4015 624 -3076 -5253 -4969 -2388 1365 4452 5423 3845 454 -3131 -5219 -4864 -2247 1495 4490
1897D490Q23j609l352l561k015M48K683L681K896P77j650l407l513j884N50K692
1913a951L631K843O77j766l388l391j805N88K728L643K741N53j788l352l378j726
1929e141O87K787L578K624M95j844l377l312j584P74K765L517K588M18j913l371
1945c09l196j523P98K811L525K473L05j950l331l164j460R15K846L445K374K50
1961D809j997l326l130j315R80K807L423K316J67k042l345l017j247J006K852
1976a059L396K228Q2k102l280k955j193J086K873L332K137J1k090l303k909j072
1992d818J151K866L271K081o8k144l289k820j000J199K875L247K005j69k175l252
2008a040k740r37J252K918L183J874k03k216l256k676q29J330K896L144J808k78
$$ plain form
1897 4490 5313 3704 352 -3209 -5224 -4776 -2093 1588 4484 5261 3611 204 -3309 -5193 -4643 -1951
1913 -1951 1680 4523 5200 3434 46 -3345 -5150 -4562 -1834 1809 4550 5103 3315 -37 -3415 -5141
1929 -5141 -4454 -1667 1911 4535 5030 3186 -191 -3503 -5087 -4313 -1548 1969 4557 4975 3062 -309
1945 -309 -3505 -5028 -4230 -1419 2106 4579 4884 2934 -397 -3561 -5021 -4106 -1260 2185 4559 4809
1961 4809 2812 -514 -3644 -4959 -3979 -1172 2251 4567 4734 2692 -653 -3670 -4917 -3911 -1059
1976 -1059 2337 4565 4647 2545 -735 -3690 -4883 -3797 -924 2408 4545 4556 2466 -837 -3746 -4818
1992 -4818 -3667 -801 2470 4551 4483 2339 -950 -3770 -4770 -3571 -696 2551 4556 4387 2212 -1040
2008 -1040 -3780 -4717 -3465 -547 2636 4510 4307 2091 -1165 -3841 -4670 -3340 -444 2700 4508 4230
2024D230k267l217k600p40J365K902L096J720l77k285l185k528o72J416K933L037
2040B828J636m36k316l159k469n70J478K922K964J565m99k345l141k382m92J507
2056b909K921K934J477n83k346l117k297m31J571K909K863J388o23k405l078k204
2072c930l91J629K880K861J312o97k414l038k172k70J664K907K748J246p65k431
2088A139l007k094j95J714K870K697J170q21k460k970k004j44J743K880K640J095
2104D253q81k453k925j945q7J787K874K576J013r15k475k896j884J0J819K836
2120G07K513R72r88k495k844j810N4J856K848K453R01j066k488k790j759J09J893
2137a934K826K391Q08j080k495k786j667K09J914K788K327P49j136k516k716j596
$$ plain form
2024 4230 1963 -1254 -3854 -4594 -3229 -327 2769 4489 4112 1827 -1358 -3886 -4558 -3142 -209 2828
2040 2828 4464 4028 1712 -1447 -3916 -4486 -3008 -86 2878 4443 3944 1599 -1542 -3924 -4416 -2909
2056 -2909 12 2946 4423 3840 1494 -1623 -3920 -4351 -2780 129 2992 4380 3757 1352 -1726 -3930
2072 -3930 -4321 -2692 188 3049 4361 3664 1250 -1788 -3960 -4230 -2566 341 3089 4335 3570 1139
2088 1139 -1868 -3962 -4157 -2443 427 3124 4294 3473 1013 -1957 -3961 -4105 -2362 518 3158 4253
2104 4253 3372 919 -2006 -3951 -4038 -2251 623 3199 4212 3297 822 -2074 -3958 -3948 -2129 707
2120 707 3220 4192 3204 709 -2135 -3945 -3891 -2035 813 3266 4167 3101 613 -2177 -3936 -3827 -1934
2137 -1934 892 3283 4091 3011 516 -2270 -3937 -3728 -1814 974 3301 4050 2914 398 -2318 -3914
2153c914K32J950K784K277O98j216k515k655j544K97J985K780K204O00j232k523
2169B08k637j462L58K027K729K123N70j272k546k576j373M09K044K687K092N00
2185C881j347k518k510j332M50K066K698K010M07j360k493k502j269N23K095K636
2201A435J942L78j385k540k433j186N79K082K615J921K84j446k512k352j154O18
2217c154K103K622J842K09j457k471k344j101O94K127K558J764J92j491k505k296
$$ plain form
2153 -3914 -3682 -1732 1052 3329 4027 2811 296 -2359 -3903 -3606 -1621 1159 3363 3963 2731 208
2169 208 -2429 -3891 -3533 -1506 1223 3346 3916 2644 98 -2478 -3851 -3442 -1398 1289 3381 3881
2185 3881 2534 16 -2494 -3826 -3376 -1310 1388 3398 3805 2445 -48 -2550 -3819 -3296 -1201 1435
2201 1435 3377 3755 2370 -170 -2603 -3789 -3210 -1128 1487 3408 3692 2246 -266 -2618 -3772 -3154
2217 -3154 -1051 1571 3413 3622 2165 -306 -2650 -3751 -3057 -930 1628 3392 3584 2093 -412 -2708
$$ [...]
8191C2
##END NTUPLES=NMR FID
##END=
