##TITLE=1H_Pr C6-Eth
 200.13Hz, CDcl3.
 8 sc
7.8.2026
##JCAMPDX= 6.0         $$ Bruker NMR JCAMP-DX V2.0
##DATA TYPE= NMR FID
##DATA CLASS= NTUPLES
##ORIGIN= UXNMR, Bruker Analytische Messtechnik GmbH
##OWNER= pz
$$ XWIN-NMR		Version 3.5
$$ Fri Aug  7 14:38:08 2026 Russian Standard Time (UT+4h)  she@DPX200
##.OBSERVE FREQUENCY= 200.1313
##.OBSERVE NUCLEUS= ^1H
##.DELAY= (6, 6)
##.ACQUISITION MODE= SIMULTANEOUS
##.ACQUISITION SCHEME= undefined
##.AVERAGES= 8
##.DIGITISER RES= 18
##SPECTROMETER/DATA SYSTEM= spect
##.PULSE SEQUENCE= zg30
##.SOLVENT NAME= CDCl3
##.SHIFT REFERENCE= (INTERNAL, CDCl3, 0, 14.3821)
##AUDIT TRAIL= $$ (NUMBER, WHEN, WHO, WHERE, WHAT)
$$ ##TITLE= Audit trail, XWIN-NMR		Version 3.5
$$ ##JCAMPDX= 5.01
$$ ##ORIGIN= Bruker BioSpin GmbH
$$ ##OWNER= she
$$ F:/spectra/data/she/nmr/H-C/1/audita.txt
$$ ##AUDIT TRAIL=  $$ (NUMBER, WHEN, WHO, WHERE, WHAT)
(   1,<2026-08-07 14:36:57.37 +0400>,<she>,<DPX200>,
      <created by zg, POWCHK disabled, PULCHK disabled
       configuration hash MD5:
       00 E9 B6 7A A2 85 ED C7 34 08 36 98 17 FE 4E 26
       data hash MD5: 16K
       7D 65 1F 89 68 29 C8 C0 30 EF 01 19 67 8D EE 96>)
$$ ##END=
$$ 
$$ hash MD5
$$ 9E 34 D6 7C 51 9A 72 79 70 E2 3F 13 C8 A0 A3 EA
##$RELAX= 
##$RELAX= 
##$RELAX= 
##$RELAX= 
##$RELAX= 
##$RELAX= 
$$ Bruker specific parameters
$$ --------------------------
##$DU= <F:/spectra>
##$EXPNO= 1
##$NAME= <H-C>
##$PROCNO= 1
##$TYPE= <nmr>
##$USER= <she>
##$AMP= (0..31)
100 100 100 100 100 100 100 100 100 100 100 100 100 100 100 100 100 100 
100 100 100 100 100 100 100 100 100 100 100 100 100 100 
##$AQSEQ= 0
##$AQ_mod= 1
##$AUNM= <au_zg>
##$AUTOPOS= <>
##$BF1= 200.13
##$BF2= 200.13
##$BF3= 200.13
##$BF4= 200.13
##$BF5= 200.13
##$BF6= 200.13
##$BF7= 200.13
##$BF8= 200.13
##$BYTORDA= 1
##$CFDGTYP= 0
##$CFRGTYP= 5
##$CHEMSTR= <none>
##$CNST= (0..31)
1 1 145 1 1 1 1 1 1 1 1 1 1 1 1 1 1 1 1 1 1 1 1 1 1 1 1 1 1 1 1 1 
##$CPDPRG= <>
##$CPDPRG1= <>
##$CPDPRG2= <>
##$CPDPRG3= <>
##$CPDPRG4= <mlev>
##$CPDPRG5= <mlev>
##$CPDPRG6= <mlev>
##$CPDPRG7= <mlev>
##$CPDPRG8= <mlev>
##$CPDPRGB= <>
##$CPDPRGT= <>
##$D= (0..31)
0 0.7 0 0 0 0 0 0 0 0 0 0.03 0 0 0 0 0 0 0 0 0 0 0 0 0 0 0 0 0 0 0 0 
##$DATE= 1786099016
##$DBL= (0..7)
120 120 120 120 120 120 120 120 
##$DBP= (0..7)
150 150 150 150 150 150 150 150 
##$DBP07= 0
##$DBPNAM0= <>
##$DBPNAM1= <>
##$DBPNAM2= <>
##$DBPNAM3= <>
##$DBPNAM4= <>
##$DBPNAM5= <>
##$DBPNAM6= <>
##$DBPNAM7= <>
##$DBPOAL= (0..7)
0.5 0.5 0.5 0.5 0.5 0.5 0.5 0.5 
##$DBPOFFS= (0..7)
0 0 0 0 0 0 0 0 
##$DE= 6
##$DECBNUC= <off>
##$DECIM= 32
##$DECNUC= <off>
##$DECSTAT= 4
##$DIGMOD= 1
##$DIGTYP= 9
##$DL= (0..7)
0 120 120 120 120 120 120 120 
##$DP= (0..7)
150 150 150 150 150 150 150 150 
##$DP07= 0
##$DPNAME0= <>
##$DPNAME1= <>
##$DPNAME2= <>
##$DPNAME3= <>
##$DPNAME4= <>
##$DPNAME5= <>
##$DPNAME6= <>
##$DPNAME7= <>
##$DPOAL= (0..7)
0.5 0.5 0.5 0.5 0.5 0.5 0.5 0.5 
##$DPOFFS= (0..7)
0 0 0 0 0 0 0 0 
##$DQDMODE= 0
##$DR= 18
##$DS= 0
##$DSLIST= <SSSSSSSSSSSSSSS>
$$ [...]
##$SUBNAM0= <"">
##$SUBNAM1= <"">
##$SUBNAM2= <"">
##$SUBNAM3= <"">
##$SUBNAM4= <"">
##$SUBNAM5= <"">
##$SUBNAM6= <"">
##$SUBNAM7= <"">
##$SUBNAM8= <"">
##$SUBNAM9= <"">
##$SW= 18.0517328524113
##$SWIBOX= (0..15)
0 0 2 0 0 0 0 0 0 0 0 0 0 0 0 0 
##$SW_h= 3612.71676300578
##$TD= 16384
##$TD0= 1
##$TE= 0
##$TE2= 300
##$TE3= 300
##$TEG= 300
##$TL= (0..7)
0 120 120 120 120 120 120 120 
##$TP= (0..7)
150 150 150 150 150 150 150 150 
##$TP07= 0
##$TPNAME0= <>
##$TPNAME1= <>
##$TPNAME2= <>
##$TPNAME3= <>
##$TPNAME4= <>
##$TPNAME5= <>
##$TPNAME6= <>
##$TPNAME7= <>
##$TPOAL= (0..7)
0.5 0.5 0.5 0.5 0.5 0.5 0.5 0.5 
##$TPOFFS= (0..7)
0 0 0 0 0 0 0 0 
##$TUNHIN= 0
##$TUNHOUT= 0
##$TUNXOUT= 0
##$USERA1= <user>
##$USERA2= <user>
##$USERA3= <user>
##$USERA4= <user>
##$USERA5= <user>
##$V9= 5
##$VALIST= <valist>
##$VCLIST= <CCCCCCCCCCCCCCC>
##$VD= 0
##$VDLIST= <DDDDDDDDDDDDDDD>
##$VPLIST= <PPPPPPPPPPPPPPP>
##$VTLIST= <TTTTTTTTTTTTTTT>
##$WBST= 1024
##$WBSW= 4
##$XGAIN= (0..3)
0 0 0 0 
##$XL= 0
##$YL= 0
##$YMAX_a= 631439
##$YMIN_a= -643114
##$ZGOPTNS= <>
##$ZL1= 120
##$ZL2= 120
##$ZL3= 120
##$ZL4= 120
##$ABSF1= 10
##$ABSF2= 0
##$ABSG= 5
##$ABSL= 3
##$ALPHA= 0
##$AQORDER= 0
##$ASSFAC= 0
##$ASSFACI= 0
##$ASSFACX= 0
##$ASSWID= 0
##$AUNMP= <proc_1d>
##$AZFE= 0.1
##$AZFW= 0.1
##$BCFW= 1
##$BC_mod= 2
##$BYTORDP= 1
##$COROFFS= 0
##$CY= -3
##$DATMOD= 1
##$DC= 2
##$DFILT= <>
##$DTYPP= 0
##$F1P= 0
##$F2P= 0
##$FCOR= 0.5
##$FTSIZE= 0
##$FT_mod= 4
##$GAMMA= 1
##$GB= 0.15
##$INTBC= 1
##$INTSCL= 1
##$ISEN= 128
##$LB= 0.25
##$LEV0= 0
##$LPBIN= 0
##$MAXI= 10000
##$MC2= 0
##$MEAN= 0
##$ME_mod= 0
##$MI= 1.114404
##$NCOEF= 0
##$NC_proc= 0
##$NLEV= 6
##$NOISF1= 3.799351
##$NOISF2= 2.8
##$NSP= 1
##$NTH_PI= 0
##$NZP= 0
##$OFFSET= 14.38212
##$PC= 1
##$PHC0= -4216.739
##$PHC1= 7.9923
##$PH_mod= 1
##$PKNL= yes
##$PPARMOD= 0
##$PSCAL= 0
##$PSIGN= 0
##$REVERSE= no
##$SF= 200.129724274929
##$SI= 16384
##$SIGF1= 3
##$SIGF2= 2
##$SINO= 400
##$SIOLD= 16384
##$SREGLST= <1H.CDCl3>
##$SSB= 0
##$STSI= 0
##$STSR= 0
##$SW_p= 3205.1282051282
##$SYMM= 0
##$S_DEV= 0
##$TDeff= 0
##$TDoff= 0
##$TI= <>
##$TILT= no
##$TM1= 0
##$TM2= 0
##$TOPLEV= 0
##$USERP1= <user>
##$USERP2= <user>
##$USERP3= <user>
##$USERP4= <user>
##$USERP5= <user>
##$WDW= 1
##$XDIM= 8192
##$YMAX_p= 0
##$YMIN_p= 0
$$ End of Bruker specific parameters
$$ ---------------------------------
##NTUPLES= NMR FID
##VAR_NAME=  TIME,          FID/REAL,        FID/IMAG
##SYMBOL=    X,             R,               I
##VAR_TYPE=  INDEPENDENT,   DEPENDENT,       DEPENDENT
##VAR_FORM=  AFFN,          ASDF,            ASDF
##VAR_DIM=   8192,          8192,            8192
##UNITS=     SECONDS,       ARBITRARY UNITS, ARBITRARY UNITS
##FACTOR=    0.0002768,     1,               1
##FIRST=     0,             0,               0
##LAST=      2.2672688,     0,               0
##MIN=       0,             -643114,         0
##MAX=       2.2672688,     631439,          0
$$ Real data points
##PAGE= N=1
##DATA TABLE= (X++(R..R)), XYDATA
0 0 0 0 0 0 0 0 0 0 0 0 0 0 8 -8 8 -8 14 -16 17 -24 28 -33 40 -48 56 -68 78 -92 108 -122 140 -162 185 -210
34 -210 235 -267 301 -336 377 -422 472 -526 585 -647 718 -794 878 -968 1067 -1177 1295 -1426
52 -1426 1571 -1733 1910 -2107 2333 -2585 2878 -3214 3605 -4073 4640 -5342 6231 -7394 8954
67 8954 -11041 13166 -8687 631439 269363 -547993 -27187 368963 -173683 -259838 305390
78 305390 53358 -415134 68750 456642 -139309 -361541 183748 212113 -222307 -50910
88 -50910 195271 -124425 -179165 237021 123347 -270602 -27373 253368 -109730 -233071
98 -233071 186321 141411 -275847 -64793 305341 -1779 -254451 99672 167730 -217817
108 -217817 -109022 281136 46472 -278944 53620 280302 -118782 -246928 146061 152817
118 152817 -194969 -74016 216019 293 -207800 75963 194830 -126106 -169274 139770
128 139770 113995 -134171 -24801 161392 -14192 -150559 36888 112690 -42696 -43246 50141
139 50141 -37692 -66443 101903 81484 -127902 -63273 142731 31436 -144117 -3831 106918
150 106918 -33478 -28271 125993 -4910 -184101 30940 205942 -58197 -190039 94678
160 94678 159011 -112976 -91017 132902 1615 -170672 52305 172450 -94880 -139999 132955
171 132955 90619 -156287 -28264 168275 -26422 -151413 78855 115827 -119834 -68033
181 -68033 142285 15683 -140270 35598 103037 -106396 -82174 137291 43519 -140642 3840
192 3840 112046 -65053 -73300 117650 23218 -154092 30427 172052 -70265 -149846 110854
203 110854 102670 -146628 -49971 151810 -25420 -151227 91634 129959 -148299 -100932 168805
214 168805 43818 -172386 23395 162482 -78242 -125517 127257 82877 -146855 -22617
224 -22617 147958 -36631 -124771 89978 83341 -132857 -37359 149343 -14086 -141821 56838
235 56838 101201 -101340 -49893 134749 1372 -135092 58539 124897 -101481 -90593 134604
246 134604 50757 -135310 10653 126591 -71456 -107922 113937 70973 -143718 -29510
256 -29510 147677 -20972 -136548 66602 111111 -95957 -64288 121354 18496 -123298
266 -123298 34163 117723 -69957 -88291 100815 48520 -120286 -9496 116556 -35126
276 -35126 -102597 67527 67508 -98308 -31534 108453 -11397 -103364 54651 86071 -86923
287 -86923 -52773 112124 18186 -114200 25418 104819 -66659 -84244 93022 45396 -113638
298 -113638 -7547 110492 -42531 -104456 76398 77578 -102774 -40267 118186 2013 -113190
309 -113190 41656 99957 -71557 -66141 99041 29651 -111788 8068 105837 -46843 -89806
320 -89806 72975 54469 -97422 -21265 100485 -19177 -91656 56957 72531 -82839 -40529
331 -40529 101923 9348 -97376 33214 87669 -65345 -62299 89398 27919 -102987 8092
342 8092 98240 -49440 -87859 76026 57887 -96993 -21251 105528 -15865 -97305 54638
353 54638 81788 -78110 -46205 100587 13559 -102758 24341 93681 -57944 -72106 81201
364 81201 38292 -98344 -7198 93753 -31243 -81481 61965 57368 -83797 -25340 95872
375 95872 -5277 -87883 42227 75787 -65336 -47020 83401 13170 -90883 21209 84244
386 84244 -56392 -72715 74921 41490 -91939 -12051 91045 -23239 -79487 56009 58597
397 58597 -79497 -26741 99099 -562 -96972 32542 84179 -58062 -57998 76419 21104 -89848
409 -89848 11861 84733 -48848 -74711 71346 47979 -88079 -16957 92023 -14382 -78408
420 -78408 50869 61363 -74413 -32709 92213 6413 -89072 25218 73334 -56865 -53448
431 -53448 75085 21840 -87933 7057 82846 -39672 -71848 61690 48616 -74981 -14335
442 -14335 83651 -13989 -74560 47295 61010 -70863 -37280 88376 13613 -89250 11489
453 11489 71949 -46648 -55767 69042 30607 -81532 -2555 79352 -33140 -71835 63813
464 63813 62000 -72943 -30461 79429 -3564 -73817 40845 63567 -67704 -41339 85744
475 85744 10270 -97530 14552 86338 -45074 -68281 66627 38480 -78817 -2469 79645
486 79645 -35338 -70559 70976 61164 -80782 -30105 81814 -11378 -78542 48347 67968
497 67968 -70826 -45636 77024 3490 -85741 29130 78431 -55636 -57897 74340 28952
508 28952 -83234 3030 82068 -27708 -60804 55309 38793 -68233 -9282 70089 -25429
519 -25429 -68312 49221 56549 -61785 -35780 58063 -4963 -63748 34883 66309 -45879 -49388
531 -49388 52742 22530 -58713 6065 66767 -18234 -53857 33860 34476 -51609 -21166 56724
543 56724 5244 -53371 9746 36516 -33674 -23614 50989 5819 -65599 10520 77597 -13660
555 -13660 -65473 21716 40139 -35313 -6782 59023 -11308 -67018 25378 54605 -50311 -44315
567 -44315 64946 29800 -65704 -9359 48613 -27885 -35365 61528 26194 -73075 -3319 76086
579 76086 -21878 -65282 50256 50070 -69743 -26322 80565 1250 -78529 18923 54009 -51067
591 -51067 -32063 73765 11551 -79985 6907 65594 -32906 -44700 59084 32137 -59125 -4108
603 -4108 50726 -30852 -41792 61856 36013 -73216 -22410 67017 -6377 -62916 27493 48597
615 48597 -46302 -30514 56849 9624 -58624 12268 52701 -31725 -36275 55464 28448 -60458
627 -60458 -13052 54659 -10747 -46848 31884 37040 -44345 -22784 43611 -10497 -51552 35423
639 35423 58149 -45708 -51227 47198 30342 -45867 492 49435 -20740 -39770 41348 26350
651 26350 -55442 -10066 58161 -11525 -55934 28932 43598 -46419 -30024 49301 4419 -49807
663 -49807 22711 49308 -38961 -35048 51600 14626 -58082 10285 64870 -22021 -55549 29418
675 29418 30586 -40347 -4485 47200 -20419 -50353 34613 39573 -49165 -26806 53831 11007
687 11007 -48187 10505 40627 -26786 -24304 42279 9914 -48824 7906 51220 -21217 -46301
699 -46301 27354 26718 -39323 -10586 44012 -6283 -43873 17386 32031 -30243 -15264 44169
711 44169 3717 -47019 11864 45822 -23624 -35520 35489 23672 -41133 -7796 39606 -13415
723 -13415 -37792 28017 27843 -43425 -18329 48959 4573 -47907 10483 40201 -23469 -23592 39325
736 39325 11594 -43845 5847 43584 -21288 -35645 33930 22314 -43936 -9787 41464 -10451
748 -10451 -38657 25367 27730 -38210 -13679 45234 -677 -43502 18831 39504 -29317 -25709
760 -25709 39206 12628 -41345 3958 38080 -20725 -31632 31856 18617 -41111 -7685 40472
772 40472 -8278 -37106 20999 28939 -30031 -15230 37347 3677 -35745 12915 33693 -22982
784 -22982 -24134 31761 12163 -37371 -509 34880 -15025 -32169 23477 20449 -32997 -9576
796 -9576 35866 -4072 -33790 18661 29936 -26700 -18032 35903 7745 -36124 7042 33817
808 33817 -19624 -26998 28853 14566 -36635 -3490 35680 -11456 -33432 21568 24148 -30370
820 -30370 -11648 36220 -351 -33725 16024 30728 -25040 -19970 33850 8872 -36393 3413
832 3413 33111 -17718 -28661 25586 15579 -34069 -4953 34726 -8600 -31845 20908 25442
844 25442 -27697 -12562 34544 1863 -32106 12812 29128 -22796 -20247 30221 8449 -34871
856 -34871 2539 31224 -16350 -27393 24176 16155 -31758 -5152 33791 -7066 -30402 19940
868 19940 25418 -26378 -13411 32945 3804 -31985 8860 27635 -20027 -21071 26109 9031
880 9031 -31946 591 29537 -12717 -26501 21253 18060 -26045 -6265 30200 -3741 -26754
892 -26754 16587 23304 -24243 -13869 30057 4471 -31912 5635 27387 -17700 -23045 23715
904 23715 11582 -30220 -1935 30402 -9525 -26888 18947 20796 -23821 -8098 29821 -1781
916 -1781 -28154 13402 24447 -21405 -16019 27349 4952 -31127 4009 25748 -16800 -21226 24630
929 24630 11279 -29921 -1628 30293 -7437 -24586 18826 18604 -23154 -6632 27899 -3702
941 -3702 -27466 13077 22605 -20870 -15143 24110 3945 -27752 2840 23118 -12658 -16913 21116
954 21116 10623 -25040 -3155 25961 -3380 -19194 14299 16172 -19146 -9434 21408 1494
966 1494 -21575 5983 17678 -14213 -14660 17578 5861 -22746 338 22516 -6671 -18603 15255
979 15255 15447 -19214 -8672 22360 2304 -18555 10362 17827 -20639 -17042 23220 9376 -25181
992 -25181 -302 23593 -11305 -22712 16732 14086 -21654 -1969 27014 -7386 -26006 16682
1004 16682 23071 -21533 -13246 25728 3059 -24386 9224 19633 -21842 -16662 24740 6443
1016 6443 -26609 5481 24283 -17399 -22476 21805 13917 -21150 2528 25014 -12498 -23318
1028 -23318 18870 16068 -20586 -2885 24381 -8532 -26046 13273 18760 -18909 -11466 20817
1040 20817 1081 -20858 7654 17700 -15608 -13387 20822 9569 -18930 1140 20895 -6966
1052 -6966 -20300 7785 13577 -8182 -2731 12091 -7191 -19698 6732 16046 -8879 -9096 13809
1065 13809 4077 -17448 -983 16140 -1791 -9239 11333 6406 -16835 -1838 20460 -2470
1077 -2470 -21179 5938 18101 -10803 -12537 13708 3121 -20431 1259 18844 -6578 -11963
1089 -11963 16329 7376 -23569 -4482 24812 2026 -16011 9545 11001 -19307 -8656 20466
1101 20466 1633 -17873 7294 13827 -17664 -13034 19206 6594 -19078 1420 17551 -7291
1113 -7291 -11005 14331 5875 -17362 612 18181 -5709 -13341 13568 9020 -20559 -9044 18260
1126 18260 3560 -13643 4837 8799 -15133 -9253 17754 6517 -15614 2482 16765 -7794
1138 -7794 -15981 11324 14086 -10883 -6308 12645 -1394 -14028 6645 11663 -13662 -10454 15334
1151 15334 5253 -16333 1150 15521 -7717 -14121 12242 10741 -11250 447 14716 -8791
1163 -8791 -16744 14052 15157 -15526 -7956 16659 -2026 -19361 6524 14977 -12413 -8245 16483
1176 16483 290 -20116 6323 20297 -10474 -14549 15680 9509 -16344 -192 16720 -7405
1188 -7405 -14817 11959 9107 -15703 -2991 16132 -5444 -17912 7981 14286 -9878 -6932 12464
1201 12464 287 -12774 5804 12357 -7305 -6040 12336 2091 -14537 1604 13834 -4524
1213 -4524 -11123 6606 5633 -10324 -2397 10662 -3084 -11636 6475 10741 -8582 -7079 11547
1226 11547 4528 -12210 -289 12768 -2030 -9359 6363 6005 -10575 -3814 11679 -271 -12409
1239 -12409 3495 10077 -8426 -8438 10564 4992 -10588 565 10913 -4849 -7577 10481 6045
1252 6045 -12143 -1889 13541 -2960 -12506 6442 8450 -10890 -5549 11678 -719 -12769 5473
1265 5473 10729 -10267 -7564 13962 4468 -13350 1739 13323 -6016 -10195 10643 6684 -12360
1278 -12360 -1987 12737 -3768 -12693 7328 8915 -11411 -5825 12305 937 -12288 3952
1290 3952 10787 -6989 -6788 10939 3565 -10949 1594 11337 -5441 -9300 8352 5692 -11117
1303 -11117 -2392 10477 -3190 -10327 6277 7652 -9939 -4089 11695 577 -11705 4322 11101
1316 11101 -6778 -7491 10199 4535 -11006 261 11080 -4690 -9658 7282 5995 -10629 -3495
1329 -3495 10599 -1268 -10547 4791 9021 -7537 -4651 9931 1942 -9651 2961 9930 -5640
1342 -5640 -7220 8674 4024 -10276 -639 9721 -4095 -9248 6004 5559 -9150 -2865 9691
1355 9691 -896 -9673 4985 7898 -6881 -4581 9898 2449 -9628 1965 9263 -4744 -7642
1368 -7642 7371 4243 -9810 -1836 8728 -2795 -8974 5218 6605 -7605 -3714 9625 734
1381 734 -8585 3156 8231 -4910 -5174 7722 2800 -8539 520 8261 -4030 -7776 5811 4834
1395 4834 -8574 -2833 8049 -1091 -7908 3907 6891 -6111 -3727 8777 1532 -8364 2469
1408 2469 8743 -4502 -6441 6615 3650 -8711 -1015 8495 -2678 -8532 4837 5654 -7814 -3472
1422 -3472 8709 787 -8436 3654 7624 -5298 -4645 8223 2276 -8434 1866 8588 -4809
1435 -4809 -7335 6664 3720 -9382 -1216 9412 -2276 -8472 5244 5918 -7441 -2708 9696
1448 9696 377 -8248 3691 7111 -5798 -4210 8599 1766 -8702 1303 6993 -5360 -5887 6492
1462 6492 2617 -8232 35 7701 -2685 -6262 5368 4800 -6433 -1768 8072 383 -6158 2413
1476 2413 4370 -4834 -3007 6168 1117 -6154 55 4465 -3931 -4653 4866 3336 -5041 -1445 5149
1491 5149 -861 -5055 3171 5455 -3839 -3362 5172 1995 -5861 -472 5531 -1709 -5193 3320 3596
1506 3596 -5309 -3061 4518 -808 -5787 3763 6076 -4236 -4089 5176 1016 -6378 2869 8261 -3464
1521 -3464 -6015 4809 2343 -7642 35 7901 -2927 -7587 4293 3834 -7250 -2000 8143 -439
1535 -439 -7184 4196 6236 -5222 -2937 6884 -333 -7352 3897 7699 -4703 -5819 5175 1043
1549 1043 -7288 1538 7544 -2898 -6021 3457 1860 -6198 1035 8337 -618 -6030 2593 3789 -4257
1564 -4257 -1270 5831 258 -5186 1411 4132 -3685 -3446 4674 1372 -5986 -268 6295 -1233 -5220
1579 -5220 1973 2715 -4274 -445 7277 751 -6047 788 3920 -4084 -2861 6769 2999 -6314 -1929
1594 -1929 3956 -2255 -4154 4757 3307 -6014 -1649 6011 -1032 -4971 3996 4840 -5310 -2425 6484
1609 6484 814 -5326 1480 3397 -4925 -2492 6707 1207 -6931 31 3874 -4091 -3451 6302 3189
1624 3189 -5273 -1016 3604 -2229 -2716 5569 3437 -4937 -1952 4342 -581 -4115 2283 3081 -3238
1639 -3238 -2380 2720 259 -3247 558 2459 -2135 -2424 3432 3325 -2628 -1887 2104 154 -1649 1702
1655 1702 3245 -1346 -2664 852 595 -3028 665 4407 -1018 -4972 421 2992 -2281 -1531 3855
1670 3855 936 -4356 788 4314 -2598 -2898 4575 2092 -5649 223 6116 -1768 -5267 2667 2688 -4847
1686 -4847 -556 5901 -1009 -5685 2889 3887 -4641 -1154 6867 165 -6004 1789 4492 -3653 -1975
1701 -1975 5614 163 -6470 1313 4777 -3962 -3626 5195 1364 -5708 467 5009 -1877 -3367 3935
1716 3935 1648 -4359 656 5347 -1201 -4406 2758 2868 -3711 -1010 4246 -262 -4382 901 2241
1731 2241 -3115 -1604 3854 987 -4181 -62 3586 -572 -2123 2334 2184 -2403 -708 2646 -297
1746 -297 -2632 1184 2208 -2466 -1962 2637 1104 -3366 -447 2865 -941 -2464 2427 2102 -2636 -883
1762 -883 3650 -200 -3134 1993 3451 -2669 -2488 3034 1032 -3499 365 2757 -1953 -2873 2549 1728
1778 1728 -3160 33 3582 -803 -2999 2479 2828 -2817 -931 3648 -76 -3238 1361 2979 -2717
1793 -2717 -2442 2769 461 -3770 402 3310 -1698 -2705 2354 1664 -3097 0 3400 -704 -2678
1808 -2678 2143 2326 -2904 -1064 3232 75 -3280 1013 2557 -2329 -2003 2643 689 -3126 316
1823 316 3255 -1100 -2557 2455 1841 -2707 -504 3350 -157 -2776 1613 2081 -2312 -1502 2466 231
1839 231 -3272 534 2451 -1965 -2412 2379 1025 -3057 47 2998 -625 -2468 2375 2213 -2423 -585
1855 -585 3218 -137 -2970 1323 2383 -2529 -2164 2273 472 -2984 92 2603 -1341 -2016 2512 1252
1871 1252 -2348 59 2876 -515 -2273 2151 1866 -2589 -1065 2486 -202 -3097 770 2032 -2069
1886 -2069 -1892 2138 1057 -2581 -97 2618 -754 -1794 1966 1731 -1949 -346 2669 -473 -2242
1901 -2242 1254 1615 -2322 -1204 2322 92 -2781 179 2086 -1171 -1542 1906 728 -2113 -93
1916 -93 2664 -291 -1998 1545 1765 -1551 -1038 2068 122 -2317 542 1812 -1514 -1323 1913 527
1932 527 -2855 63 2641 -908 -2234 1944 1840 -2067 -464 2570 213 -2007 1079 2196 -2180
1947 -2180 -1607 2044 614 -2812 383 2479 -1832 -2153 2219 1067 -2739 357 2875 -1041 -2352
1962 -2352 2413 2039 -2561 -696 2902 -180 -2607 1242 1816 -2487 -1532 2407 9 -2547 948 2086
1978 2086 -2048 -1814 2286 924 -1951 892 2416 -1169 -1856 1841 891 -2053 -127 2111 -463 -2210
1994 -2210 1134 1300 -1754 -1121 1473 -13 -1451 764 1600 -1437 -1175 1429 1028 -1345 837 1952
2010 1952 -703 -1828 573 1179 -761 -475 1530 -131 -2212 3 1486 -954 -725 1747 687 -1912
2026 -1912 -283 1853 25 -1314 1264 1340 -1395 -371 1795 -263 -2209 437 1429 -1306 -858 2047
2042 2047 21 -2960 -278 1845 -439 -853 1706 748 -2494 -90 2083 -139 -1089 1610 1037 -2156
2058 -2156 -951 1749 -301 -1726 615 1030 -1165 -916 1516 245 -1847 186 1459 -241 -692 1222
2074 1222 885 -1667 -736 1011 508 -520 833 651 -1640 -1743 1063 743 -1011 -131 1338 -860 -1881
2091 -1881 1050 1405 -581 -225 1539 -190 -1731 1002 1728 -1127 -1124 1887 467 -2162 93 1778
2107 1778 -1578 -2414 1843 1043 -2260 390 2063 -1538 -2794 1839 1997 -1651 35 2528 -1145 -2626
2123 -2626 1400 2042 -1778 -586 2701 -1104 -3050 1154 1984 -1986 -1109 2137 -196 -2010 1336 1840
2139 1840 -1675 -1090 2289 417 -1854 1287 2132 -1487 -1751 1426 854 -1382 772 1099 -1716 -1701 892
2156 892 826 -1003 203 1210 -507 -1350 413 1088 -83 -140 970 -299 -915 301 633 -300 -854 -35
2174 -35 549 -446 -159 339 373 -989 -335 674 419 -155 605 242 -1036 -611 1207 794 -811 156 881
2193 881 -1295 -1503 1201 829 -1163 14 1083 -1058 -1345 1322 1407 -1511 -455 2156 -209 -1365
2209 -1365 1093 1354 -1287 -776 1584 86 -1411 1033 1113 -1849 -1426 1674 186 -1288 406 1267
2225 1267 -1428 -687 1787 607 -1193 509 1714 -1201 -1097 1466 965 -1190 -463 1225 -447 -1157
2241 -1157 744 691 -1442 -510 1139 -276 -1365 481 798 -740 -852 902 921 -833 144 759 -562
2258 -562 -1009 651 780 -922 -449 707 -335 -1325 2 1032 -417 -687 711 214 -952 218 1585
2275 1585 -475 -750 1040 701 -778 -451 1260 -176 -1252 -98 985 -941 -540 990 -228 -1462
2291 -1462 450 1309 -715 -709 1257 649 -959 192 1323 -176 -840 602 519 -1066 -319 1147 -269
2308 -269 -1139 330 1125 -1044 -509 772 212 -960 394 1045 -572 -392 1173 222 -980 71 1036
2325 1036 -484 -860 405 207 -1074 -298 804 -236 -1121 636 799 -798 -415 1011 243 -1009 114
2342 114 993 -173 -858 713 238 -1006 -341 1022 -401 -858 491 706 -890 -687 1015 177 -825
2359 -825 248 772 -344 -691 937 306 -814 72 1241 -473 -595 469 461 -1105 -359 907 -182
2376 -182 -920 275 632 -774 -673 1003 172 -841 338 906 -444 -456 897 504 -787 -118 932
2393 932 -327 -1127 450 700 -1076 -210 1046 -86 -1014 302 844 -598 -623 827 111 -348 438 707
2411 707 -521 -622 765 4 -939 -130 599 -417 -715 104 291 -715 -331 845 4 -873 134 568
2429 568 -673 -375 1067 106 -534 80 918 -226 -571 580 121 -744 -329 692 -384 -1038 449 482
2447 482 -311 -188 479 285 -616 24 739 -337 -465 548 440 -760 -300 429 -371 -809 194 850 -597
2466 -597 -318 779 -88 -859 261 901 -256 -533 743 226 -900 160 966 -139 -585 644 197
2483 197 -912 -174 592 -185 -955 377 801 -851 -400 460 208 -637 566 503 -316 -470 490 294 -705
2502 -705 243 825 -208 -711 213 178 -963 -301 762 294 -456 -179 665 -518 53 832 270 -418 229
2521 229 582 -149 -495 666 540 -765 -162 749 -226 -618 321 207 -716 -488 705 208 -646 -16 404
2540 404 -690 -317 1242 632 -444 47 774 -716 -1022 569 244 -677 -272 461 -393 -877 651 566
2558 566 -856 147 814 -192 -594 561 600 -822 -194 1021 277 -719 134 405 -688 -491 757 252
2576 252 -393 132 123 -525 -400 698 348 -210 -35 390 -466 -362 397 492 77 244 7 -139 -131 66 140 -205
2598 -205 -564 -162 176 149 -480 -144 -147 -338 -89 507 514 -354 -88 436 -442 -74 451 185 -554 -294 261 -356
2620 -356 -714 487 381 -806 -13 804 -313 -701 872 667 -792 -60 1094 -11 -643 466 301
2637 301 -997 -165 1096 -10 -1024 276 237 -834 51 881 217 -998 358 511 -635 177 1203
2654 1203 86 -1013 83 532 -641 -114 680 -151 -426 107 348 -556 -247 690 -263 -615 391 535
2672 535 -139 74 409 -197 -354 237 253 55 -183 -12 -337 -534 -215 388 440 -296 -195 80 -72 -81 31
2693 31 86 19 -188 44 -129 -1 143 186 -122 -193 335 149 -247 -136 205 -3 -355 146 427 -305 -463 228
2715 228 18 -661 -8 361 6 -439 249 23 -267 264 528 -63 -387 207 158 -464 29 446 -193 -548
2735 -548 233 319 -470 195 417 101 -334 242 435 -190 -179 198 39 -419 72 183 -189 -195 252 -118 -339
2756 -339 195 420 -46 -163 -138 266 -274 -134 433 111 -99 104 173 -417 -141 373 187 -348 -226 250 -67
2777 -67 -297 2 420 -171 -289 284 55 -477 61 474 -157 -69 289 198 -144 10 426 -174 -217 119 201 -505
2799 -505 -22 373 -201 -416 420 322 -396 -195 350 98 -407 22 299 -121 -67 148 45 -224 -166 160 -46
2820 -46 -490 313 -49 -470 105 192 71 -256 271 221 -174 38 269 147 -345 176 187 -284 27 37 189 -420
2842 -420 -66 -61 -73 -182 189 -43 -359 207 249 283 -164 210 75 -424 -89 164 88 41 -143 247 -156 -111 26
2865 26 73 -205 -156 200 -195 -233 261 398 -3 -140 196 128 -247 278 197 50 -157 368 247 -109 -11 98
2887 98 105 20 -22 -152 -244 -476 308 -20 -90 298 204 -81 -271 134 40 -236 -34 285 -17 -52 248 -62 -195
2910 -195 -210 168 77 -464 33 60 -152 -298 369 522 -296 154 420 -17 -57 228 -7 -172 101 -54 -250
2931 -250 -313 158 50 -397 137 114 -142 -132 86 107 10 -83 233 231 -67 197 -102 -163 -188 374 -154 -118 1 385
2955 385 -150 63 -26 352 -193 36 294 -320 -230 -169 374 -187 116 261 -67 -113 52 167 -151 -192 240 98
2977 98 -523 -320 43 -370 -185 283 65 -44 44 88 -119 -11 432 518 -363 -126 305 105 -232 40 118 -275
2999 -275 -25 81 -5 -322 84 -128 -82 -57 475 21 -294 -164 -85 152 -351 -160 258 -96 -191 -53 -61 144
3021 144 11 192 106 -144 -121 119 -349 -157 -33 69 -14 -173 136 126 -209 -98 107 -138 -379 264 -3
3042 -3 -359 80 246 -188 -31 332 339 -144 121 98 93 -210 393 299 -430 167 446 -129 -293 234 324 -18 -157
3065 -157 341 -4 -230 83 170 -219 79 602 14 -276 115 363 -361 -91 556 86 -423 -36 194 -59
3085 -59 -134 591 11 -223 242 496 -142 -189 98 119 22 -64 251 -22 -215 217 137 -470 347 397 -265 163 -77
3108 -77 -152 -230 42 99 -86 -188 -43 -16 -165 425 132 208 423 -118 8 -192 11 88 99 123 121 -12 0 -6 135
3133 135 -237 32 -45 112 439 -157 -184 35 324 246 121 382 -100 -449 22 77 -64 -200 431 -256 -68
3154 -68 99 342 -213 -234 76 166 -100 104 188 22 -125 238 -79 -431 228 153 -28 -413 -103 232 -175 4
3176 4 472 -8 -114 -6 29 75 337 370 -14 -251 -32 223 -94 -49 270 -375 -68 94 52 11 -138 199 121
3199 121 -110 130 106 -74 0 24 224 -91 75 259 114 -191 77 194 -89 11 207 -122 -119 -381 18 75
3221 75 -251 343 28 -241 -347 50 383 -51 -146 391 175 -181 357 -226 -303 -112 145 -257 -150 189 -38
3242 -38 -287 -186 275 77 -209 256 353 -414 -65 166 35 -127 352 67 -343 -207 210 -206 -479 58 -161
3263 -161 -436 -118 89 -11 -121 382 -194 -166 36 237 133 -200 -46 -39 89 105 58 119 168 -82 -126 51 -64
3286 -64 -18 -129 -23 -333 106 61 -1 156 -33 86 13 224 103 137 -1 402 48 54 -101 86 -161 -198 327
3309 327 201 -52 -135 -34 -195 -231 -3 220 101 -70 328 71 -53 -8 -19 88 119 54 312 -206 -108 155
3331 155 -275 -253 105 292 68 -36 306 68 -420 111 146 -393 243 146 -244 -6 115 70 -177 57 273
3352 273 -69 -63 94 294 -115 -506 123 -89 -170 37 213 -95 -28 293 -140 35 -311 85 113 -29 79 38
3374 38 -120 196 126 -35 -44 166 -62 -222 28 -7 195 -32 83 5 3 -129 82 305 -59 -432 96 16 -205
3397 -205 -203 26 -94 -324 -130 86 1 195 243 110 110 -273 153 -149 -171 163 280 -243 -60 151 -115 -71 -57
3420 -57 -212 -195 66 163 135 102 107 172 -184 -65 140 124 -159 -49 243 -22 219 -9 23 -131 -51 299 194 -172
3444 -172 210 92 -127 -4 267 1 -38 181 321 -21 -224 -37 85 -226 105 384 29 -191 144 69 -244
3465 -244 16 179 68 56 12 -65 -130 -180 -6 23 -311 -32 15 -46 -212 373 95 -2 68 152 -253 -282 110 34
3489 34 168 63 325 75 -93 -2 221 -162 -86 52 -78 -351 47 124 -246 -96 216 223 -250 197 177 43
3511 43 19 387 -55 10 115 -237 -183 109 298 152 -154 -45 295 -293 18 132 -157 -125 0 -204 59 -28
3533 -28 -197 -43 -282 181 -22 89 -177 -15 -164 -110 -150 88 135 -173 -332 -194 295 146 280 -153 -56 302
3555 302 59 30 -93 -410 54 427 93 72 337 -4 -204 99 102 -124 -111 198 -291 -80 29 -197 -98 -203
3577 -203 75 21 -156 181 -60 -239 13 268 54 -212 170 222 -22 -93 157 138 -140 109 -34 -306 -379 411
3599 411 194 -46 374 -92 -622 -254 310 269 -55 175 51 -176 70 167 130 -15 82 42 -185 114 58 119
3621 119 27 139 -33 -258 148 281 86 -4 94 179 -13 236 -43 -31 60 2 40 154 55 -65 -15 -123 -123 91
3645 91 183 46 -71 -40 -229 160 -204 32 -22 -38 -13 79 -201 32 106 -50 -211 -178 8 25 -426 254 92
3668 92 -131 -128 286 92 -152 373 155 -170 -73 360 -174 -90 63 61 99 33 36 -226 -260 4 17 112 -60 122 -17
3693 -17 -166 48 -122 -167 141 438 99 -222 -78 -100 -56 158 311 44 -181 -33 99 285 87 -49 -169
3714 -169 159 31 -73 222 33 -4 -71 221 -37 -20 267 -167 -186 -294 -185 -211 -11 269 -72 -131 124 39
3736 39 -7 27 -150 -56 -27 -129 33 70 -9 40 -55 -78 173 13 -7 -9 -92 145 -344 113 256 -133 -187 134 255
3761 255 -145 135 -28 -88 -167 93 182 -271 109 333 -181 15 67 260 -281 -109 194 -128 -182 -29 53 116
3783 116 -197 -54 64 -1 144 -133 -41 -168 145 150 -180 3 60 71 107 -104 -36 -146 -71 210 102 -56 399
3806 399 -109 -98 -183 -162 35 -30 -13 126 -24 91 204 -154 205 12 118 -42 40 135 126 -193 274 -117 -30
3829 -30 -3 127 325 -61 -166 16 189 181 14 -11 -181 -219 142 -36 -1 -98 13 63 -92 -311 59 -86 233
3852 233 214 9 -10 -40 -108 49 56 -134 101 292 -239 -134 190 -38 -210 -233 -122 -192 -53 -213 -347 -10 227
3875 227 -96 -229 314 284 -235 353 1 134 -56 -53 18 10 13 416 -1 -210 151 -1 -99 68 167 23 152
3898 152 -163 -120 96 -19 80 -88 232 120 154 78 -256 -152 32 -149 121 103 -157 -29 48 302 -98 -77
3920 -77 -330 233 180 -116 -69 -182 145 -48 -117 -159 123 -162 122 2 -346 -86 -221 7 -26 -155 -82 -4 124
3943 124 216 -126 116 -69 52 284 155 81 -211 -57 -189 -110 -198 -228 -196 13 -109 -209 -267 85 124 65 49
3966 49 -72 -223 33 124 74 -229 -64 17 45 175 -7 -93 4 158 -90 -62 -87 -49 58 -36 203 -239 150 -70
3990 -70 201 55 -58 105 -183 94 271 148 117 -119 282 -273 194 -35 86 -151 234 -114 -141 69 166
4011 166 -46 -243 62 -28 -152 246 274 -157 164 -13 -122 -305 140 189 41 128 145 177 104 168 -3 -81 -14
4034 -14 -37 206 -320 60 113 -258 -285 -101 -168 36 -84 219 135 -129 242 -84 18 -180 134 -53 143 -236
4056 -236 -101 -161 -178 -99 28 123 165 164 172 246 38 15 -76 161 254 70 -224 -30 -150 -73 -93 -109 101 -97 -98 -36
4082 -36 -2 46 -221 311 17 -19 103 -120 -195 -36 -224 38 -84 26 82 -9 -92 -15 145 -177 -180 46 108 -126
4106 -126 107 128 62 -96 -166 -292 -95 -81 27 -149 151 33 -348 -137 -50 50 167 136 -185 -161 -49 53
4128 53 94 -73 68 -31 70 203 -28 -46 3 65 -170 154 160 -193 -1 -222 290 182 130 171 -29 -30 130 57
4152 57 92 106 -89 43 85 293 -68 -182 -57 -181 -161 -30 168 179 81 25 -56 -160 -84 24 113 98 117 103 -61
4177 -61 13 66 170 24 126 103 61 -159 48 3 113 -89 -152 28 128 -157 -319 -27 74 -81 94 -227
4199 -227 64 6 141 -15 35 1 -279 158 100 57 139 -274 67 137 -16 112 -187 25 -5 106 240 -89 -365
4222 -365 -99 210 -77 -97 71 143 11 -403 -12 79 9 -15 -34 -24 86 -36 -58 -10 -136 -199 9 -195 -55
4245 -55 -153 -122 -141 264 -92 64 237 231 199 282 144 21 7 -59 163 218 -83 -318 -60 127 54 -31 -118 80 -32
4270 -32 1 43 -62 2 -59 201 -51 238 294 60 9 135 -120 -53 -52 67 -156 -32 -166 -50 203 -177 -162 -73
4294 -73 126 85 -38 -49 4 -93 114 -193 -12 126 84 72 -105 -130 159 75 313 71 -35 -73 325 125 204 -82
4318 -82 -226 84 -50 -20 31 92 55 -61 -258 159 -221 33 164 -98 -181 -178 170 31 -25 -291 -212 115 -25
4341 -25 -39 417 42 -180 -89 158 -355 16 0 -60 192 -40 57 -122 210 95 218 112 -100 202 -75 24
4363 24 -188 83 101 154 -67 32 -74 -34 -32 65 286 -34 89 -233 229 -118 0 29 -210 67 -106 70 94
4386 94 -261 -134 -92 225 -2 98 -267 -26 -232 -211 -89 -23 240 -106 -51 -172 -42 186 -225 11 -24 80
4408 80 39 -103 199 23 -220 -115 38 158 146 -92 86 -122 -117 4 313 -8 8 219 26 -29 40 242 129
4431 129 111 59 154 24 -37 -295 20 -39 -18 14 -23 -154 146 42 -72 38 -85 -72 -1 -48 8 112 92 23 212
4456 212 19 -11 -205 131 105 127 -101 3 -151 49 134 75 -195 -102 62 154 346 9 -100 -78 198 150 258
4479 258 -111 102 193 16 408 -250 -117 -119 -73 -148 -28 138 173 14 170 88 -85 165 81 -79 82 196 -200
4502 -200 78 -88 6 -14 88 -112 19 140 -178 -37 -153 -316 25 -120 -337 -366 34 -99 -93 32 240 96
4524 96 -154 -45 158 -42 -143 121 234 -11 65 76 -26 34 171 261 128 -9 -43 179 77 -30 -112 76
4546 76 -32 -198 -125 -231 -5 -197 148 23 69 57 -155 120 150 18 -33 -65 -88 -384 20 24 -93 -47 140 45
4570 45 38 180 77 154 -340 309 74 149 -209 -3 147 -159 149 39 176 64 8 48 61 -9 -363 -102 148
4593 148 169 267 -60 7 79 115 26 -42 -127 71 -146 -118 -8 341 37 1 -150 -111 166 135 69 1 84 -192 242
4618 242 216 55 42 -109 188 -232 -25 56 -182 -204 127 181 170 213 -81 -2 43 -117 -248 63 -392 109 -46
4641 -46 23 -120 -28 -110 40 160 -114 -458 -5 111 -127 49 113 250 8 2 127 39 -69 -8 -190 -67 149
4664 149 69 176 114 65 -34 -103 -21 -45 116 -187 123 213 -6 77 -19 -400 166 296 -57 8 112 36 -185 -107
4688 -107 -24 -1 284 66 205 -81 -105 104 -312 98 -50 89 -2 -12 277 431 -85 101 146 -7 28 -62 105
4711 105 253 123 46 39 -81 -38 -6 92 -22 16 -50 14 32 148 -99 -45 110 -48 33 -58 -122 -88 216 155 -93
4736 -93 73 -34 -23 22 -200 -39 -146 -15 179 247 -6 -118 24 186 374 36 73 51 -213 -42 -66 -164 -135
4759 -135 62 33 -181 83 144 -79 23 282 -63 -77 -65 -122 -150 126 -54 -95 173 225 235 -29 15 -11 234 307
4783 307 -34 9 65 -112 8 0 82 26 42 -91 232 13 -4 -93 153 -224 83 217 -221 49 -97 -116 23
4806 23 -72 8 -95 -102 -25 -52 -84 8 119 -15 134 -18 -42 -26 -131 -214 147 -125 160 84 -30 18 235 -50 102
4831 102 88 -16 -104 -141 54 -64 -195 -336 99 179 -135 -72 99 28 -89 39 1 55 -249 -1 77 22 71 131
4855 131 92 176 210 126 -53 -13 108 -31 -267 -16 -92 31 54 22 172 63 -122 -6 29 115 -296 -121 -339
4878 -339 179 23 -66 120 -124 -84 71 -123 -270 -153 58 104 148 9 -26 118 -100 67 166 -47 -49 -82 -144
4901 -144 370 6 -163 -70 48 -104 144 -81 212 3 -21 -284 94 -366 -36 140 -2 -80 29 -76 151
4922 151 105 -92 -46 196 -203 -152 399 -45 57 -7 -88 47 47 -156 130 54 24 173 185 127 -235 92 62 192
4946 192 123 -198 160 -244 -203 -30 158 45 42 -158 -165 -88 18 12 -20 9 -8 121 -191 160 131 7 -368 73
4970 73 44 53 135 19 -43 -80 -191 -187 -162 453 -38 -2 -154 -122 118 60 -64 25 -53 -19 27 69 -32 451 -142 -164
4996 -164 200 -2 -61 312 -101 -117 49 22 -8 -118 24 -92 -73 -97 -160 70 -88 253 -80 167 68 64 116 -21
5020 -21 4 -293 28 64 56 -122 120 -96 222 -259 -105 -117 83 -36 -174 -183 138 -56 -146 113 -157 29 -198
5043 -198 115 -58 30 -14 195 139 252 117 -80 50 47 66 230 -103 183 5 109 18 -11 28 -17 -65 -136 -168
5067 -168 -306 39 160 -41 -224 209 -85 32 15 -149 -128 58 38 247 -31 133 122 46 -34 -19 -195 -95
5089 -95 -85 19 203 -134 191 -96 -243 -26 238 -110 105 61 -158 -75 -26 -3 26 184 -219 -102 -392 21
5111 21 -6 31 -165 -79 -191 -262 109 146 33 -95 -182 10 -125 -113 -117 -50 -53 -63 -69 -70 3 -18 -53 -99 82 -137 22
5138 22 76 215 -187 158 -29 54 78 186 -164 -19 109 -140 -82 -2 -193 202 388 -93 -6 -83 163 204 147
5161 147 25 -223 69 96 47 -108 50 -233 -187 -148 185 194 137 183 169 18 -192 -27 63 370 121 -3 -13 42
5185 42 -121 102 -106 -120 137 -122 44 -74 92 -21 93 48 198 190 182 -23 -167 -82 -127 90 281 338 -71
5208 -71 -23 316 241 -176 -37 94 -179 -124 80 -129 -7 -89 -148 -112 29 7 141 -27 98 -97 57 39 102
5231 102 64 96 312 -194 147 -169 12 -205 20 -203 -301 10 -352 2 -109 58 102 -137 -94 82 78 -60
5253 -60 91 -147 -69 8 324 114 -108 66 -62 41 226 -6 -286 -303 54 -82 213 -34 166 84 -146 29
5275 29 -121 -220 260 -111 65 226 -151 180 37 -96 -38 100 -145 -170 51 157 -62 49 -199 -185 97 154
5297 154 66 -7 285 64 33 -12 -309 229 -91 -365 149 274 148 -105 -229 199 -57 100 26 -47 29 -101
5319 -101 62 44 -92 118 -326 -262 38 -123 55 175 126 181 146 25 119 62 34 226 57 361 -23 189 2
5342 2 331 -128 -156 42 -78 181 -63 -81 161 98 -3 -51 -54 45 54 151 128 315 -205 30 -180 251 -60 -283
5366 -283 59 87 -87 13 48 28 170 260 -308 118 103 54 219 134 166 -150 216 16 225 -23 -148 -176 126
5389 126 99 162 91 174 -13 8 -117 -165 117 -210 -97 -348 207 -147 -9 -186 -4 47 -95 138 68 63 80 -75
5413 -75 33 -188 278 79 -72 301 176 195 171 272 -50 -201 45 27 -155 -92 352 -66 -81 253 433 -42
5435 -42 -103 176 110 -133 -365 96 8 -8 -40 -53 -146 -6 138 -63 65 -156 -76 -152 -164 -157 47 23 32 -21 -19 -21 80
5462 80 251 -10 -277 116 61 -45 -255 0 338 -133 193 -35 266 -163 250 38 60 35 -82 -86 40 -157
5484 -157 65 112 43 146 -127 -83 354 14 -207 96 20 195 22 -54 45 -54 -231 -31 165 178 55 -175 175
5507 175 5 224 -69 -3 -79 61 123 183 -34 25 50 43 145 -42 -8 -145 -69 32 -110 -79 288 -212 -202 -62
5531 -62 158 -118 -16 234 -75 160 -263 -113 70 -61 -120 89 -50 162 -120 -108 46 68 18 63 222 -103
5553 -103 -206 74 -13 11 78 64 62 -196 196 4 123 -15 -181 -46 55 93 -32 -83 321 113 29 -18 -68 28
5577 28 -98 102 -104 102 43 -35 112 9 187 -219 -105 -101 -332 74 100 84 168 48 98 -17 15 70 -32 159
5601 159 -178 236 -84 -134 -258 -32 150 24 157 -25 -285 -53 -107 106 -40 27 65 -153 -80 -11 11 178
5623 178 22 -28 -215 97 320 -224 -81 -25 277 55 -60 235 157 92 24 77 -74 29 -29 15 -182 215 130
5646 130 41 246 149 37 -165 -48 36 61 -133 204 -131 -96 -44 47 -520 -10 164 -119 -15 123 64 87 19
5669 19 -1 -162 -145 109 6 -24 -65 32 114 179 74 -26 -132 172 -143 -50 26 -113 23 -35 -32 186 -75 113
5693 113 437 129 -103 -8 105 -136 -178 415 -313 -69 129 133 -3 -7 90 91 -362 -23 -329 72 -204 12 -73
5716 -73 -62 226 -217 -87 107 -115 -96 165 283 88 -211 -328 64 -267 177 285 -42 -127 -259 -211 -113 340
5738 340 -89 -262 95 24 107 153 -292 -16 -19 -173 79 27 131 -184 -179 22 109 40 -56 155 106 -109 58 -84
5762 -84 161 88 40 70 -95 65 -22 106 63 221 -237 -48 148 382 149 82 -166 184 -26 109 257 -24
5784 -24 -99 35 150 -149 -155 72 -154 -114 -130 6 -13 -56 -158 -6 -107 117 -152 -170 11 -166 -162 -255 313 -62
5808 -62 -114 78 123 -99 -209 -179 -177 178 -73 2 170 124 0 14 -52 52 82 67 64 -376 133 -229 101 -74 -177
5833 -177 112 164 -30 -66 -160 -149 112 138 126 -317 -36 148 44 -149 -127 183 -227 -297 116 -51 126 -6 16
5856 16 -22 -86 9 55 6 -113 97 189 -16 -44 42 284 -18 128 78 -152 60 -168 -85 -226 -89 22 -106 -5
5880 -5 31 94 32 20 -26 52 41 -43 77 -228 15 -71 -132 30 -53 286 224 -84 85 -84 -270 -104 271 85 171
5905 171 -15 25 -74 136 -43 158 -220 -109 147 85 130 73 88 -155 316 76 68 337 -115 -34 -171 168 141
5928 141 -122 199 102 -132 -272 -107 82 183 234 44 -44 104 292 9 -38 -183 49 -79 -137 134 372 49
5950 49 -122 -75 -260 122 -60 -89 -32 26 -134 -100 -269 227 263 176 46 -49 153 156 196 153 -15 17 265 80 -341
5975 -341 110 260 16 17 -99 70 -156 41 5 74 -166 -192 -199 -32 -300 151 -77 38 -33 279 -49 -131 -25
5998 -25 -156 26 129 53 -129 120 -25 161 41 -49 -223 -287 -110 42 44 -99 -30 -42 -152 154 102 -109 24
6021 24 222 -110 -16 165 160 160 91 -5 39 28 38 -215 -320 92 -180 -39 17 104 254 73 -206 36 -37 109 -85
6046 -85 70 -39 288 -66 119 50 -217 67 -143 323 158 44 50 211 -93 95 -90 -55 154 22 22 170
6068 170 37 -1 -137 51 164 -97 201 194 -56 101 42 -343 -83 -127 -9 -65 -181 -178 -49 -97 103 59 -73
6091 -73 122 205 -95 -12 41 24 66 -319 136 68 185 89 117 95 127 -202 -148 41 -168 -254 -25 -125 -26 -4 -9 -278
6117 -278 25 -21 40 82 -211 91 -302 -96 -62 -47 -74 21 -72 62 71 -151 244 18 -39 -2 -7 155 158 255 -220 -192
6143 -192 126 -13 -271 6 37 40 59 -157 -59 -71 -33 -15 -78 -66 -107 74 -30 3 74 -121 234 40 109 80 -119
6168 -119 -146 -87 -157 83 -194 -242 100 101 -206 -2 -25 95 225 27 87 181 149 35 10 13 -166 -115 53 -47 35
6193 35 164 -25 -173 252 278 258 -25 -70 9 -8 -23 233 -90 106 108 25 -131 -91 -202 19 -18 -209 -158 -219 16
6218 16 -197 -236 -90 -53 -80 154 -96 -121 -73 21 -29 -143 -24 33 -67 -290 155 -14 -70 67 229 66 -62
6241 -62 -390 -76 115 23 111 376 46 -5 165 -271 -328 139 214 -287 244 -22 -7 -194 -10 3 -93 -38 -202
6264 -202 67 -167 171 -70 -242 8 -73 -58 -100 129 215 -10 -114 84 -211 188 -93 -87 92 91 109 -33 -212
6287 -212 1 437 174 90 -37 44 58 19 -62 -87 15 -76 16 112 -24 -148 170 3 21 -224 -108 14 -155
6310 -155 -33 316 222 -16 22 118 -128 -12 53 -134 -57 111 250 -241 49 -77 -99 -81 213 -210 109 81 -100
6333 -100 36 -83 -305 -32 -6 59 -225 -166 -129 -88 160 -203 49 -243 -102 -182 107 -175 17 145 -164 108
6355 108 130 194 17 -219 -17 -79 33 177 -40 -56 184 53 -70 -313 262 -113 53 88 41 38 140 2 -76
6378 -76 39 -45 -35 -129 -136 106 -67 -65 0 -93 4 90 259 33 -62 9 88 -31 9 165 -197 54 -102 -174 26 134
6404 134 143 78 197 -208 68 11 -76 -76 119 163 50 -225 216 13 61 -61 186 11 -73 71 -40 -90 -135 -7
6428 -7 109 -12 4 -44 26 325 183 -12 -23 -43 315 -155 82 -123 300 341 -112 -90 102 -85 -73 -50 -195 24
6452 24 218 286 -171 40 44 118 -304 172 323 -89 155 -17 68 -45 357 88 215 137 -159 126 -92 68
6474 68 93 202 212 -46 13 -40 140 87 -82 90 -124 -27 138 -91 -62 301 14 -43 71 66 -58 -67 168 -73
6498 -73 -26 33 -407 -7 159 164 -33 83 53 48 115 179 62 24 43 23 7 49 -194 -280 -202 -153 70 -162 168 36
6524 36 -95 -48 72 84 -23 -186 -77 -103 -31 168 -44 -35 -142 -109 146 -218 106 104 60 3 103 17 -94 -226
6548 -226 -70 -82 -187 -173 -141 181 -110 -327 -48 167 158 -137 119 100 -95 235 -62 -173 -157 -29 -33 260 -186
6571 -186 -1 -45 -99 -84 8 44 130 -123 -168 318 252 147 -186 -209 -79 -93 -67 -281 77 -53 26 169 111 157 277
6596 277 -25 -219 -49 44 181 -167 -193 33 -303 -41 97 230 -96 40 -130 51 -90 -212 88 -123 -15
6617 -15 -135 -473 -28 -66 49 -152 74 204 -56 -87 -193 -58 144 232 -73 -95 -332 -115 183 -16 9 -45
6639 -45 -269 -169 -280 -30 -10 200 -99 72 60 -63 199 400 119 4 -52 140 -152 81 46 -21 -35 -18 120
6662 120 -274 42 42 -148 -48 104 65 -211 -64 27 75 -20 62 299 245 161 -223 24 71 23 70 125 -107 -189 -122
6687 -122 -8 -46 47 -18 272 77 178 176 -82 147 -57 -193 -249 83 3 -55 -56 -118 -51 5 130 -5 -25 -207 -201
6712 -201 -79 -54 -310 34 85 79 -4 6 -92 10 -8 -25 -76 -128 41 -194 199 -223 13 32 -60 -163 21 -253
6736 -253 -65 168 -25 -184 -20 -174 138 124 -26 46 -206 -110 -74 -178 -80 -112 -112 282 43 86 8 109 -334
6759 -334 -151 105 -160 -203 282 156 30 -87 94 -53 91 168 -43 233 146 -63 167 12 -44 20 149 57
6781 57 -6 144 -236 -194 250 7 188 149 130 8 -309 109 120 -137 -80 -80 -242 63 93 -231 -27 120 -295
6804 -295 224 170 -119 60 -197 7 -7 -97 43 60 -92 17 -247 -53 -72 -112 66 -84 210 -8 32 -19 178
6827 178 -29 48 148 62 109 175 193 -196 -21 -84 120 53 -8 227 -79 -151 93 193 66 -37 26 -25 75 81
6851 81 268 -181 -27 -3 148 145 -38 44 -73 18 -67 146 -1 34 17 28 -35 85 112 -139 217 128 124 -110 92
6876 92 -117 324 -47 172 51 83 2 57 59 -250 -105 -127 -38 -150 168 -39 53 -147 26 166 -8 78 15 33
6900 33 -54 53 9 -8 97 72 153 -53 -38 -84 224 10 97 70 190 -97 -47 136 409 -109 22 -124 78 -37
6924 -37 -103 -114 -124 82 -21 225 -198 19 -497 88 144 169 -138 -14 -33 9 85 27 122 -131 168 29 -286 -111
6948 -111 -234 -120 -76 -2 46 -131 62 -69 104 -143 208 -133 34 105 -133 89 0 47 -10 -233 210 -43
6970 -43 84 121 -125 -106 -297 -138 -63 -53 140 -113 -104 171 4 -118 -50 1 -38 -57 7 -68 -61 167 126 30 -76 299
6996 299 76 -10 176 -383 140 72 30 99 -296 -171 -34 189 -303 -100 -4 -128 46 -169 35 4 -20 -237
7018 -237 -135 38 -96 -201 76 -30 -76 -129 -246 48 138 146 -9 59 -162 116 10 -38 111 -135 273 35
7040 35 24 -144 -132 -5 5 131 57 -158 54 -199 56 82 -75 111 -6 108 10 -264 188 -207 -30 54 -140
7063 -140 -126 255 -144 627 -43 -69 114 -81 -67 -249 82 -14 -143 -18 22 87 33 -22 1 220 121 -135 171
7086 171 116 168 118 330 70 -103 44 23 -166 36 -191 -54 -20 -43 35 146 -19 11 -16 -147 139 -39 64
7109 64 -47 -50 23 1 -54 311 311 -198 95 -239 -166 -216 -9 -32 239 116 23 40 144 -40 -109 -32 68 -45 -60
7134 -60 68 -55 -108 34 118 153 123 218 -30 -67 87 183 324 -128 131 111 -67 235 -259 143 -60 -4 60 72
7158 72 53 212 0 -154 -160 45 146 36 25 -221 -80 -43 -6 21 36 -109 54 -112 237 -148 -32 61 -187
7181 -187 99 187 -88 150 -52 189 148 -9 -173 26 245 -79 -43 -114 -331 13 -27 -123 -190 -194 48 31 43 37
7205 37 -189 -353 94 58 218 -35 29 143 -354 -177 21 231 262 242 102 -220 -65 67 70 -142 -26 -163
7227 -163 50 13 262 -237 412 30 39 -113 274 -270 -79 209 -127 -354 -28 -71 -93 -28 -231 66 105 -33
7249 -33 -66 192 187 -55 74 13 -78 35 -60 301 81 -39 201 -110 -66 -46 -32 211 -111 -73 -6 26 156 -103
7273 -103 52 298 54 -21 37 49 7 -58 113 79 184 122 -51 69 16 158 178 203 -31 51 -166 64 -40 216
7297 216 -33 -338 133 -118 -84 -74 -15 236 136 160 170 139 210 -199 -18 -29 -93 -134 -76 -42 145 -146 -80 4 -181
7322 -181 179 171 36 184 41 99 111 28 191 -33 42 -21 347 14 -89 -211 -67 115 -40 -83 -48 66 -40
7345 -40 174 60 -193 -23 -65 205 213 9 -29 -65 128 154 67 153 82 266 20 24 -23 -41 23 -21 -96 -115 136 119
7371 119 131 30 -276 -51 -43 -58 103 -49 -52 64 100 5 159 115 328 -246 160 83 -188 -192 -199 224 28 214 -267
7396 -267 150 -1 -118 -126 -37 186 -120 233 -235 -59 413 -286 165 31 40 -242 66 272 -108 -34 -85 -168 -113
7419 -113 110 166 -79 -87 142 -25 -125 130 -94 47 -61 -146 236 -116 -16 204 122 -259 -30 77 -275 139
7441 139 44 -96 50 85 104 111 -20 125 42 -170 -33 162 27 163 -49 176 1 78 -10 -109 121 44 180
7464 180 187 119 231 -49 -189 -65 53 -104 -65 139 101 174 147 -154 32 -24 47 -172 -43 -143 11 164 -165
7487 -165 -181 -13 174 -190 241 -84 133 297 -101 140 -193 -36 -156 -46 147 -144 -190 -143 -105 5 257
7508 257 39 66 -324 75 36 211 -78 -172 41 -95 54 32 -114 -38 -151 -61 45 -193 29 -51 115 26 156
7531 156 92 -68 29 136 80 -31 -190 6 -192 145 -21 313 -38 -271 24 -151 166 87 163 2 24 -37
7553 -37 127 158 192 151 210 98 180 170 -209 19 146 64 -93 -20 -107 -30 56 -124 218 -60 -78 -175 42 43 168
7578 168 -184 -99 71 -78 348 -249 84 208 -20 -149 -125 -33 32 -87 41 328 -193 -52 154 72 142 71
7600 71 -44 266 -64 53 127 -127 -233 -41 94 -60 -28 5 -289 -254 -71 -69 -153 -83 -36 142 -361 -85 -222
7623 -222 -19 192 -52 -307 200 143 123 -222 -150 294 -89 43 66 -23 293 89 197 -133 -297 97 123 90
7645 90 -27 57 16 128 -177 -7 -39 168 153 -183 171 103 -22 11 143 278 18 -166 8 54 6 -199 -109
7668 -109 -169 71 -8 -85 84 -59 -57 1 -17 136 -46 -127 -226 -170 129 61 -110 -87 231 -58 262 -84 -22 109
7692 109 127 -277 -32 -47 73 -42 165 215 -131 -72 -144 234 333 -196 120 6 -85 151 -8 223 176 319 97
7715 97 76 51 355 -6 25 -147 43 5 217 -69 154 -35 231 74 -44 132 -49 246 -196 -49 157 65
7737 65 87 131 -307 24 -128 9 179 -80 82 -161 -101 118 26 -49 -90 110 -54 33 -6 -229 425 -22 -182
7760 -182 -190 68 240 93 196 186 72 110 -67 -10 31 6 94 114 46 140 -35 -324 105 -39 -95 16 -41 -139 -308
7785 -308 -95 -86 77 -60 -70 104 172 -346 -181 -261 2 194 100 188 -136 -122 -221 -8 136 288 74 152 -197
7808 -197 -62 39 -197 -208 101 37 -144 51 159 153 -120 -107 5 5 70 146 62 11 316 62 -285 -77 -92 -214
7832 -214 187 47 -121 -51 47 71 130 -9 -123 -245 196 -92 52 125 -49 -46 221 -81 28 154 200 -157 184
7855 184 -132 -58 356 78 -59 -67 223 -291 -288 217 58 163 20 -8 5 -78 101 -312 -116 -132 88 -57 -130
7878 -130 -269 34 236 -138 64 218 147 -110 6 145 -203 64 -56 225 -182 -79 167 -177 -98 -11 96
7899 96 49 -212 -18 104 31 -2 -245 -274 91 39 47 -127 -52 159 61 -22 -48 -48 -34 225 -150 -86 4 -343 45 96
7925 96 82 -220 88 1 -50 257 -232 128 66 -67 -215 47 -30 103 145 -38 -25 -151 109 199 229 -153 -158 -79
7949 -79 187 191 -140 258 -47 133 87 16 129 31 80 108 58 -26 131 108 65 -344 -96 -149 -185 -107 149 174 -347
7974 -347 76 -72 26 55 40 -121 -70 119 7 -13 171 -90 110 144 -290 -112 -86 167 58 201 235 229 6
7997 6 92 4 -81 -80 153 -138 157 -9 -166 -6 89 80 78 18 -113 -100 181 189 120 65 -1 -70 146 80 -130 -91 53
8024 53 8 11 -72 6 195 211 -89 -37 -126 -125 89 5 -284 -179 12 -53 99 -85 126 -281 -159 -9 -136 -219 69
8049 69 58 164 172 56 -297 -244 -184 -115 -118 -13 -31 41 -93 219 81 119 121 -105 8 -135 114 -23 -267 58 56
8074 56 158 105 133 -12 -159 60 -151 39 -117 -177 -147 -90 -56 262 -1 -58 40 194 -113 -29 120 78 -110 115
8098 115 171 26 22 169 -48 109 -86 -110 0 140 -24 18 -25 -55 -35 20 -272 350 123 -138 25 66 -12 77
8122 77 131 268 119 -24 37 141 -57 76 0 -71 33 93 218 172 12 135 -218 81 6 55 -23 -234 73
8145 73 91 29 129 11 -385 -72 -173 -30 -18 73 -229 115 4 75 61 16 -27 132 340 245 -12 -165 -195 -51
8169 -51 93 60 76 -169 173 114 -23 86 128 -106 64 140 70 -43 19 149 -128 32 100 41 10 -112
8191a12
$$ Imaginary data points
##PAGE= N=2
##DATA TABLE= (X++(I..I)), XYDATA
0 0 0 0 0 0 0 0 0 8 -8 8 -8 16 -16 18 -24 32 -40 48 -56 72 -88 104 -122 144 -170 200 -232 267 -307 354
30 354 -403 459 -521 590 -667 750 -841 941 -1052 1175 -1306 1451 -1609 1782 -1970 2175
46 2175 -2401 2647 -2918 3213 -3538 3898 -4298 4744 -5244 5809 -6452 7192 -8053 9071
60 9071 -10298 11810 -13719 16227 -19677 24731 -32868 48094 -86208 381670 383750 -643114
72 -643114 -115614 430642 -61305 -337522 257310 143985 -354927 8144 457973 -117092
82 -117092 -416344 155828 295936 -211477 -126130 212199 -30991 -186454 198450 157430
92 157430 -258623 -84183 264988 -47121 -248523 147665 190019 -237420 -103017 293947
102 293947 26089 -298011 37977 201891 -166240 -139633 257543 81235 -282597 4074
112 4074 281974 -91311 -268952 133788 203862 -170022 -112272 206844 32424 -221103 30765
123 30765 193094 -113717 -192390 131658 143526 -136993 -68680 147196 636 -159768 29350
134 29350 137843 -38433 -78572 47822 4424 -55837 74553 76019 -119865 -78602 132874
145 132874 43642 -150051 -20232 129697 -11339 -68531 76532 6198 -159710 20617
155 20617 204720 -37030 -193905 84003 184539 -99986 -125866 123393 46782 -151840
165 -151840 28954 175579 -76035 -161911 112490 115265 -147342 -60074 165717 2203 -160173
176 -160173 57109 140269 -95789 -87818 138379 45837 -141927 10951 124225 -70722 -91594
187 -91594 126479 63185 -144988 -24897 125143 -38130 -97258 89855 46736 -139066 4180
198 4180 167469 -49991 -163083 93328 131192 -128050 -75188 154389 15098 -152511 58909
209 58909 139986 -126667 -122262 157499 70741 -176678 -14100 166580 -54512 -147809 104044
220 104044 105831 -139326 -51881 152316 -5123 -136814 66360 107943 -112617 -60279 143882
231 143882 10112 -151216 32814 120728 -83399 -79193 117367 22454 -140902 26494 130652
242 130652 -82017 -108460 123214 75433 -134293 -17723 135470 -38971 -116283 96767
252 96767 91983 -131490 -52278 146312 1773 -146778 41856 123031 -85013 -90649 109168
263 109168 41594 -122859 10419 125346 -50005 -101818 89819 72570 -109301 -26026 122901
274 122901 -11293 -110864 52271 85438 -86164 -52279 103201 7748 -110248 31396 94919
285 94919 -72801 -70826 101919 37754 -113184 5816 114236 -43635 -93117 84581 68448
296 68448 -103972 -26838 112881 -19164 -111299 57736 89689 -93886 -63074 109162 18879
307 18879 -119334 19530 108857 -56706 -83039 88643 50570 -104585 -8157 113142 -25952
318 -25952 -98579 61100 72773 -87844 -40297 98255 -1482 -100468 35767 80597 -73855
329 -73855 -59417 93407 25035 -101163 13169 95626 -48232 -74015 81536 48507 -95987
340 -95987 -8657 103214 -29043 -95399 62265 72174 -90260 -43326 99934 -68 -105713
351 -105713 34347 90260 -67686 -65016 91853 31963 -101145 8274 102984 -39241 -81657
362 -81657 72813 57170 -90920 -22826 97155 -13349 -90966 45044 67969 -77107 -43974
373 -43974 89926 9211 -93619 24437 84224 -53073 -60742 78306 34028 -85433 6911
384 6911 91351 -37836 -79333 67016 57863 -86036 -29112 90554 -8523 -89379 37378
395 37378 68313 -70295 -43932 90675 13492 -99092 18599 94260 -43375 -69779 70211
406 70211 42120 -82901 -3648 89180 -31159 -82651 59174 60221 -83629 -35555 89293
417 89293 -948 -88538 31655 70212 -63702 -46332 86801 21626 -90165 11584 84538
428 84538 -39219 -62259 68651 38939 -83045 -8262 85195 -26106 -81064 49502 58928
439 58928 -71743 -33891 79297 -954 -80877 31703 70270 -58048 -47122 83301 27849
450 27849 -88682 20 82932 -28001 -63766 59086 42291 -78676 -20115 79213 -17390
461 -17390 -78329 48185 66879 -70975 -48241 77558 15274 -75911 24970 72594 -52790
472 -52790 -51358 79609 27675 -92152 2738 93777 -30420 -79528 55148 51904 -76721
483 -76721 -23608 78360 -18479 -76777 54717 67436 -77390 -46562 83862 12131 -78091
494 -78091 33648 76860 -59970 -57940 75424 25414 -82698 12741 82277 -45580 -72526
505 -72526 63460 41760 -82037 -13833 83676 -15462 -71960 43354 51794 -61491 -22580
516 -22580 72561 -5692 -67801 40697 64573 -57244 -48929 58684 14689 -62127 20099 63805
528 63805 -44597 -62475 47745 35654 -55441 -6129 65021 -11756 -60355 27313 46531 -40864
540 -40864 -25156 57564 14643 -56178 1329 44598 -23410 -32276 40833 12625 -60741 1435
552 1435 71475 -14272 -75224 16839 55107 -25718 -20478 50128 -1577 -64071 19733 63970
564 63970 -35610 -48337 59330 37053 -69261 -23512 55689 -10608 -43456 44742 29453 -71086
576 -71086 -16863 75785 -8627 -70885 38201 60614 -58324 -36628 78631 15825 -80534
587 -80534 9025 67910 -34607 -42716 62447 19497 -82020 -5529 72256 -21199 -56316 46523
599 46523 38128 -62045 -19319 56725 -11509 -43412 50699 41175 -68126 -29652 72072 9377
611 9377 -65243 17381 55441 -39283 -42115 49987 18033 -61070 -225 55767 -22316 -44750
623 -44750 44770 33031 -58666 -20010 60612 4205 -48226 24002 43462 -39242 -31240 43944
635 43944 6123 -47819 22910 53615 -44605 -59070 45213 41076 -46911 -14605 48503 -10380
647 -10380 -44367 33150 35352 -46945 -16492 59912 892 -57208 20667 49977 -39518 -38830 47088
660 47088 16106 -51749 8156 48512 -33357 -44423 45400 26037 -54363 -788 63702 -15889
672 -15889 -60678 27402 45733 -33426 -15668 45076 -8420 -50437 27053 44731 -43998 -35376
684 -35376 50423 17591 -53506 -2007 43988 -19254 -32704 35832 18751 -44633 1499 52950
696 52950 -13457 -48577 25640 38128 -32851 -18679 41545 111 -47107 9996 37082 -25104
708 -25104 -25017 36651 8404 -46905 4061 47788 -16640 -39830 31376 31653 -37565 -14696 41869
721 41869 -1503 -38453 21203 33238 -37441 -24600 45468 10062 -50947 1278 43231 -17993
733 -17993 -33085 32013 17959 -42039 -1759 46221 -11794 -38260 29717 30874 -39134 -15889
745 -15889 43642 -622 -41736 16736 32175 -34241 -22800 40898 5378 -46125 9483 42124
757 42124 -24193 -32454 36162 20972 -39637 -2791 41973 -11257 -34155 27516 25978 -37156
769 -37156 -13931 40848 -1360 -40958 13718 31913 -27668 -23660 33321 9430 -37127 5226
781 5226 36108 -17124 -27906 29693 20166 -33573 -4863 37508 -6996 -34254 19221 26264 -29798
794 -29798 -17069 33255 1417 -37110 10319 31520 -23873 -24551 32301 13757 -35764 625
806 625 36954 -12255 -29456 26183 22099 -32879 -8755 36864 -4500 -36304 15484 28047 -28049
819 -28049 -19814 32764 4491 -36209 7863 32750 -20431 -24942 31270 16107 -33769 -1120
831 -1120 36741 -9556 -30474 22228 22006 -30800 -11347 33830 -3345 -35429 13792 27611 -25740
844 -25740 -19849 31121 7255 -33225 6604 32182 -16832 -23501 28398 15999 -31981 -1886
856 -1886 34106 -9524 -30346 19966 21363 -29740 -12144 31408 -2534 -34101 12378 27516
868 27516 -23773 -19741 30856 9798 -31866 3962 31822 -13195 -24113 24374 15968 -29188
880 -29188 -4499 30676 -7881 -29943 15913 21368 -25358 -13582 27747 332 -29131 10664
892 10664 25914 -19881 -17911 29134 10705 -30559 1734 30805 -11349 -24900 21037 17057
904 17057 -27972 -7747 29520 -5224 -30613 12927 23369 -22170 -14966 27253 3415 -29023
916 -29023 8579 28319 -16389 -19057 26055 11225 -28566 511 28975 -10852 -24476 19960
928 19960 14874 -29344 -7985 29388 -4178 -28506 12797 21753 -20889 -12273 26465 2064 -26797
941 -26797 9871 26580 -16328 -18471 23337 9631 -26913 -1101 25476 -8612 -21434 16022
953 16022 12362 -25023 -7710 25648 -155 -22914 9125 18078 -16309 -11865 22060 7139 -20583
966 -20583 3291 20699 -9958 -16374 15837 9458 -21165 -3860 22018 -4572 -22051 9698
978 9698 16588 -17981 -12518 21709 6923 -19473 4979 19223 -14810 -16551 23652 14608 -23786
991 -23786 -4943 23917 -6640 -24604 13329 18055 -20251 -9284 23667 -3555 -27320 11993
1003 11993 25296 -18833 -17707 24932 9642 -24133 4037 23027 -15190 -18051 24799 12131
1015 12131 -26808 -1377 24848 -13565 -25025 19111 18138 -22342 -6236 22626 -8413 -24476
1027 -24476 16960 21842 -18779 -8482 23919 -2331 -25107 11826 23647 -16378 -15564 19745
1039 19745 5441 -22314 2254 18429 -13093 -16518 18351 11521 -20068 -4268 20433 -3798
1051 -3798 -19930 8776 18776 -6623 -7680 10031 -2890 -16071 7226 17989 -7754 -13559
1063 -13559 9752 4987 -17570 -3422 16953 -204 -12779 6739 7888 -14123 -3418 19876
1075 19876 946 -19952 5271 21279 -7916 -15679 11914 7233 -17933 -1427 19597 -4380
1087 -4380 -16982 9873 8219 -21210 -6096 25535 4257 -20488 3778 13905 -13901 -8829
1099 -8829 21836 6664 -18935 2612 15888 -13339 -14267 18272 9516 -20393 -3335 17317 -5486
1112 -5486 -15140 10503 8420 -15996 -1854 19016 -2211 -15220 10469 12005 -16853 -8037 20820
1125 20820 7151 -16623 -195 9936 -11671 -9764 16576 7309 -17731 -3167 15142 -5627
1137 -5627 -16794 10424 16272 -10306 -9619 12349 2944 -12494 5058 13438 -10137 -11283 14396
1150 14396 7690 -16702 -3264 14994 -5656 -15788 9636 12351 -12105 -5500 13018 -4350
1162 -4350 -15204 12991 17601 -13818 -11008 16689 3116 -18281 4629 17895 -9828 -12879 13558
1175 13558 3199 -19603 2258 19946 -9118 -18134 13283 12584 -16034 -4091 17679 -2685
1187 -2685 -15146 10961 13221 -13583 -6166 15948 -1306 -17691 6754 15783 -10040 -11888 10043
1200 10043 2673 -13427 2461 13049 -6391 -9144 10361 4510 -12900 594 15521 -2364
1212 -2364 -11967 6166 8680 -8756 -4251 10336 -825 -11957 3910 10545 -8276 -9577 10021
1225 10021 5358 -12003 -2250 13248 93 -10528 4670 8425 -7620 -4173 12243 2162 -12053
1238 -12053 1585 11036 -6428 -10057 8969 6223 -11636 -2972 10328 -3051 -9460 7753 7384
1251 7384 -11050 -3229 13684 372 -12587 5187 11051 -8600 -6850 11434 2008 -13076 2254
1264 2254 10973 -8804 -9902 11671 5605 -14224 -1637 13819 -3622 -11480 9053 9346 -10970
1277 -10970 -3576 13787 -517 -12310 6385 10897 -9915 -8056 11565 2951 -13076 775 11231
1290 11231 -5837 -9344 8880 5350 -10857 -683 12179 -2939 -9828 8179 8321 -9418 -3578
1303 -3578 11195 -344 -10777 4278 8514 -9044 -6669 10472 1474 -12493 1612 11337 -5576
1316 -5576 -9690 8970 6186 -10078 -1383 12215 -1926 -10104 6638 8540 -8930 -4974 10502
1329 10502 545 -11272 2398 9120 -7172 -7556 8751 3165 -10359 459 10312 -3638 -8198
1342 -8198 8095 6229 -8954 -1887 10598 -1102 -9621 4968 7367 -7994 -4886 8830 362
1355 362 -10487 2262 8725 -6691 -6995 8520 3659 -9427 241 10205 -2949 -7868 6954 6500
1369 6500 -8050 -2923 9304 -820 -9373 3663 7344 -7097 -5849 8104 1853 -9356 580
1382 580 8530 -4093 -6980 6872 4572 -7846 -505 9308 -1538 -7661 5183 6117 -7525 -4178
1396 -4178 7885 466 -8801 2156 6878 -5739 -5621 7403 2534 -8681 638 8969 -2831 -6993
1410 -6993 6291 5789 -7291 -2127 8989 -669 -8414 3455 6440 -6861 -5156 8214 1569 -9476
1424 -9476 720 7843 -4287 -6182 7344 3931 -7669 83 9444 -2800 -7616 6386 6011 -7823
1438 -7823 -2432 9324 -830 -9602 3270 6794 -7031 -4873 8458 1300 -9087 1522 7897
1451 7897 -4694 -5284 7818 3583 -8170 3 8083 -2821 -6429 6060 4351 -7749 -1938 7661
1465 7661 -2114 -7985 3621 5190 -6231 -3414 7320 1204 -6815 1051 5853 -2849 -2901 6102 2623
1480 2623 -6294 -331 5416 -2033 -4644 4302 3945 -5600 -3073 4530 41 -5494 1936 5153 -3605
1495 -3605 -4442 4661 3072 -5088 -1034 6355 -139 -5095 2919 4862 -4321 -3746 4683 701 -5483
1510 -5483 2029 5523 -4338 -5994 4537 2489 -5944 1181 7735 -2720 -6983 4384 4417 -5469 -459
1525 -459 8241 -1294 -7980 3452 5512 -5933 -3350 7360 45 -8483 1827 6392 -5132 -4739
1539 -4739 6329 1679 -6687 2667 8103 -4156 -6600 5185 3572 -5798 632 7674 -2621 -7337
1553 -7337 2702 3278 -5060 -660 6882 -1155 -7799 1145 4858 -3290 -2037 5527 1172 -5340 1135
1568 1135 5303 -2427 -3712 4369 2324 -5067 -506 5861 -1153 -6340 1027 3493 -3474 -1458 5649
1583 5649 662 -6710 -108 5094 -2178 -2628 5892 3569 -6464 -2473 5607 -87 -3974 3636 3600
1598 3600 -6072 -3183 5252 -27 -5818 2702 4942 -4578 -3310 6243 2123 -5907 776 5018 -2458
1613 -2458 -2553 6418 1931 -6971 -761 5608 -2194 -4061 4779 3125 -6688 -2882 3890 -785 -3107
1628 -3107 4424 3196 -5533 -2468 4978 1155 -3604 1789 4129 -2725 -3025 2873 1362 -3250 -275
1643 -275 2385 -2039 -3051 2778 2376 -3710 -3012 2320 1386 -1378 1103 2795 -1296 -2985 1709 1950
1659 1950 -1460 403 3504 -1015 -5122 80 3435 -1598 -2364 3131 760 -4687 -309 4485 -1592
1674 -1592 -3328 4031 2646 -4675 -437 6111 -299 -5738 2348 3969 -4010 -1881 5555 -646 -6348
1689 -6348 1618 4670 -4157 -2880 6045 577 -6866 341 5536 -2317 -2635 5396 1157 -5923 881
1704 881 6095 -2624 -4414 4660 2141 -5786 -829 5010 -1632 -4344 2650 2391 -4369 -670 5320
1719 5320 -993 -4757 2076 3871 -2876 -1422 4584 802 -3970 835 3302 -1644 -2169 2961 925
1734 925 -4577 -672 3619 -932 -3221 1225 1925 -2337 -1194 3071 817 -2418 995 2619 -1566
1749 -1566 -2214 2586 1722 -3397 -960 2972 -649 -2767 1436 1951 -2883 -1734 3006 657 -2911 958
1765 958 3522 -1855 -2646 3170 2225 -2812 -405 3285 -1276 -3015 2537 1793 -3493 -1232 3451 -944
1781 -944 -3573 1608 3055 -2592 -1836 3571 693 -3121 1013 3143 -1754 -2368 3326 1665 -3672 -99
1797 -99 3519 -1208 -3139 1969 2072 -3129 -931 3281 -414 -3106 1531 2991 -2222 -1798 3248 701
1813 701 -3208 840 2939 -1463 -2484 2480 1360 -3279 -473 2764 -966 -3176 1743 1706 -2641 -1128
1829 -1128 3122 295 -2968 1258 3054 -1860 -1866 2786 1065 -2901 291 2950 -1366 -2318 2242 1553
1845 1553 -2945 -922 3087 -497 -3058 1623 2208 -2171 -1270 3170 385 -2785 1066 2834 -1488
1860 -1488 -1892 2045 1243 -2855 -184 2492 -1258 -2484 1596 1346 -2493 -894 2786 -481 -2457 1423
1876 1423 2246 -1708 -1159 2817 650 -2543 532 2511 -1472 -2073 2024 1030 -2890 -376 2551 -546
1892 -546 -2414 1330 1623 -1996 -840 2365 -152 -2029 1270 2426 -1710 -1262 2155 820 -2462 178
1908 178 2157 -1055 -2050 1365 1153 -2357 -1050 1971 -287 -2429 789 1897 -1612 -1409 2027 657
1924 657 -1699 219 2140 -878 -1529 2014 806 -2504 -444 2419 -575 -2698 1248 1961 -2135 -1285
1940 -1285 2364 181 -2107 878 2330 -1329 -1724 2467 1309 -2344 386 2809 -903 -2258 1719
1955 1719 1366 -2844 -749 2219 -649 -2773 1444 2248 -2393 -1233 2945 572 -2490 1220 2244
1970 2244 -1755 -1546 2486 749 -2230 362 1962 -2097 -2284 1951 1043 -2393 -79 2036 -1189 -2157
1986 -2157 1547 1666 -1756 -283 2490 -46 -1848 1026 2020 -1351 -1152 1604 329 -1886 264 1359
2002 1359 -1454 -1515 1219 733 -1208 83 1669 -483 -1575 818 1984 -444 -672 1546 0 -1960
2018 -1960 -231 2103 -362 -1644 820 461 -2160 -712 2135 -276 -1812 749 1560 -1408 -697 1767
2034 1767 144 -2014 458 2242 -692 -1081 1769 255 -2726 -158 2441 -394 -1321 712 405 -2280
2050 -2280 -442 2285 244 -1136 1329 1148 -1798 -837 1947 445 -1487 531 1261 -1248 -936 1105
2066 1105 112 -1771 -103 1657 -375 -1175 677 446 -1456 -215 1462 1062 -690 497 737 -1028
2082 -1028 -1078 1582 1267 -1061 -155 933 -722 -1840 974 1876 -1067 -1004 980 -74 -1782 764 2141
2099 2141 -1128 -1413 1975 1260 -1711 -61 1898 -1069 -2435 1732 1733 -1679 -587 1685 -1203 -2854
2115 -2854 1544 2518 -1478 -973 1969 -393 -2741 1395 2734 -1204 -1118 2242 -390 -2385 1048 2241
2131 2241 -1661 -1486 1837 309 -2444 268 1659 -1814 -1458 2072 1045 -1822 329 1943 -1413
2146 -1413 -1650 1709 1382 -948 93 1156 -1273 -1962 1216 1244 -954 -393 1075 -710 -1744 283
2162 283 1122 -182 -579 348 -31 -453 464 1114 -207 -798 366 912 -160 -152 477 63 -830 -557 720
2181 720 497 -528 -57 301 -998 -513 1374 907 -917 -84 974 -616 -1147 1166 1235 -1295 -649 1109
2199 1109 -416 -1416 1170 1329 -1618 -1299 1554 3 -1848 482 1699 -1448 -1135 1820 657 -1437
2215 -1437 491 1379 -1258 -1441 1916 704 -1834 -28 1013 -1243 -1585 1170 716 -1425 -100 1438
2231 1438 -592 -1305 1398 1416 -1209 -451 1566 -79 -780 895 846 -1105 -531 1345 112 -1508 123
2248 123 1036 -922 -1530 638 931 -797 -39 1032 -266 -911 671 1006 -305 -672 1024 219 -932
2265 -932 2 916 -509 -1144 559 478 -974 -198 1034 -406 -1255 782 980 -1003 -277 1187 72
2282 72 -1106 591 1041 -514 -463 1164 283 -1590 182 1144 -523 -1305 666 668 -1078 -364 1547 32
2300 32 -1143 1002 1214 -751 -303 1240 113 -1349 330 1016 -873 -875 759 -156 -1130 -72 903 -592
2318 -592 -677 1157 441 -1053 39 769 -71 -668 519 749 -756 -534 1075 96 -905 194 616 -693
2336 -693 -630 868 398 -1114 -158 1063 -254 -472 695 625 -667 37 1034 86 -908 227 771 -872
2354 -872 -835 777 236 -1254 78 812 -470 -504 549 507 -754 163 1102 91 -626 735 553 -742
2372 -742 -386 1138 -11 -1085 296 783 -665 -572 904 188 -1064 180 870 -366 -829 358 640
2389 640 -779 -154 946 53 -820 410 514 -632 -371 958 158 -1110 128 613 -284 -758 672
2406 672 167 -922 110 789 -360 -624 651 554 -745 -104 888 63 -455 454 266 -690 -432 611
2424 611 -96 -825 203 670 -739 -503 857 487 -554 115 861 -175 -372 292 692 -371 -527 784
2442 784 -20 -727 -45 654 -576 -658 364 154 -764 3 906 -252 -644 653 372 -551 -209 738 42
2461 42 -607 349 849 -620 -334 685 -20 -716 180 747 -356 -775 490 306 -723 -90 893 -240
2479 -240 -919 558 640 -390 175 858 -177 -591 146 769 -481 -488 725 62 -604 73 579 -316 -731
2498 -731 365 343 -674 -72 1134 265 -841 321 513 -202 -317 599 11 -635 185 312 -693 -524
2516 -524 359 108 -900 -13 828 -290 -451 187 753 -291 11 778 129 -623 119 90 -595 -285 974
2535 974 94 -832 -127 329 -607 -478 883 366 -1005 -223 767 -390 -473 518 748 -634 -179 746 -123
2554 -123 -986 448 648 -986 -611 603 -218 -1002 455 645 -811 -238 1010 321 -571 64 525 -254
2572 -254 -222 784 247 -743 -471 26 -700 -207 393 14 -420 -219 -33 -314 154 508 134 -346 14 430
2592 430 122 -123 338 226 88 37 114 262 260 -393 62 -71 -250 108 129 160 -439 -475 373 -76 -142 814 464
2615 464 -931 -345 459 -263 -222 427 328 -785 -500 817 -45 -823 387 641 -858 -402 1123 184 -757
2634 -757 315 594 -717 -74 1272 7 -1070 -70 695 -634 -244 1228 -17 -1256 -14 247
2650 247 -736 -141 1060 102 -1009 -35 614 -225 -185 953 484 -620 361 622 -641 -516 440 109 -896
2669 -896 190 734 -82 -664 248 -161 -362 272 424 210 -203 200 -122 -74 1 758 -74 -136 -275 21 -387
2690 -387 -183 222 216 -292 -357 270 32 -73 -11 373 261 -399 257 269 26 -200 142 297 -254 -3 577 -325
2712 -325 -418 -329 -82 -249 109 571 -169 -430 144 364 -196 7 366 -120 -507 283 330 -491 85 634 155
2733 155 -531 216 328 -345 -105 486 77 -448 245 307 42 -93 113 170 -308 -17 404 8 -226 -275 97
2754 97 -286 -154 151 -122 -431 -206 171 9 -55 173 119 -98 365 287 1 25 187 233 -161 80 267 98
2776 98 -316 -195 107 -322 -297 55 -108 -352 -264 181 -36 -327 249 252 -576 -62 391 73 -457 116 334 -202
2798 -202 -320 312 191 -604 -102 297 -476 -264 344 330 -330 57 185 -311 -42 295 72 -247 51 250
2818 250 -279 -295 341 175 -531 -117 423 -21 -46 -48 245 -442 -267 150 -297 -461 243 46 -229 -77 197
2839 197 -43 -397 32 296 -45 -132 270 95 -274 -430 222 180 -108 -53 70 -70 -62 291 362 -432 154 231
2861 231 51 -316 489 65 -149 153 67 -100 -298 88 -114 55 -243 -119 238 -355 176 470 189 -37
2881 -37 42 201 -182 25 213 -40 -302 -136 99 -424 -426 380 17 -258 40 92 -23 -199 121 1 -600 -190
2903 -190 440 127 -79 201 114 -248 146 340 61 -438 -125 365 -75 -177 181 -127 -284 -86 247 -5
2923 -5 -292 22 290 -272 123 312 -114 -443 65 355 -88 -217 410 123 -349 73 137 -386 -198 -54 154
2944 154 20 91 461 182 -247 459 65 -46 23 27 31 -288 61 -176 -3 -3 123 -257 -46 -86 203 -22 -179
2967 -179 -21 186 -268 223 260 -51 -91 261 163 -191 -2 99 -73 -227 -379 18 -67 -279 206 136 -400 59
2989 59 218 -80 -44 267 171 -202 57 -139 193 233 173 237 -382 21 -198 -226 -91 -162 367 -101 -501 227 122
3012 122 -194 -145 66 -25 -209 44 211 -37 -254 -352 -39 128 90 -271 -210 -109 31 212 84 -165 110 144
3034 144 52 132 112 150 -308 361 297 -358 48 523 -36 -294 78 10 -215 -234 165 -40 -286 -73 375 -451
3056 -451 61 521 -150 -173 97 264 -280 -242 286 -27 -264 -16 -112 -226 -120 234 43 -516 -1 191 -128
3077 -128 13 300 -50 -207 4 341 -47 -207 380 9 -241 -51 371 -54 -127 6 110 -683 137 127 -91
3098 -91 -182 162 -28 -30 161 -41 -112 -299 -94 -197 -147 266 358 -130 -231 119 -80 192 6 -11 -77 -269 -76
3121 -76 76 239 56 -36 54 268 -405 -124 225 -130 -93 69 50 200 -55 28 41 -331 -74 194 -9 -181
3143 -181 68 93 -424 198 222 -35 -315 237 -67 -481 19 88 -440 -334 126 -212 -266 -116 247 92 -412
3164 -412 23 116 -201 210 421 -230 -239 481 93 -328 134 434 77 -388 44 179 -207 381 46 -242 -240 95
3186 95 284 -129 123 135 -224 -85 -140 -99 9 -259 -30 21 -138 149 230 112 -229 -183 7 -194 -378 -8
3208 -8 106 -281 -273 34 -140 287 207 98 -21 -76 157 192 150 -41 347 -241 -168 260 21 -297 -246 58 -233
3231 -233 -197 359 -120 -231 52 325 -33 184 291 193 -136 -109 33 -287 239 12 143 -110 -271 257 -97
3252 -97 163 250 275 -19 -121 400 307 -11 94 422 -157 63 -118 51 -629 -212 16 -114 97 52 155 -204
3274 -204 28 -429 62 12 304 7 -132 -158 18 -71 -230 252 -87 -33 -247 -109 -218 51 41 57 -218 -107
3296 -107 38 192 -12 -194 -35 12 -58 -136 264 -60 -114 142 65 -139 -276 70 49 -259 -128 226 -211 -122
3318 -122 296 321 -134 122 69 -82 -106 -245 97 -193 16 160 41 -159 205 209 18 205 271 -100 -219 -56
3340 -56 267 -193 87 53 -156 -151 172 242 -400 -203 87 153 14 320 350 -203 -496 342 205 -176 -59 223
3362 223 -5 59 -50 -72 63 -141 326 215 81 15 -50 -123 -318 89 34 -8 -103 39 -77 24 110 5 -181
3385 -181 169 -146 171 -71 148 246 150 -64 80 165 -183 202 -1 -52 -136 156 -2 -124 -163 -94 77 -124
3407 -124 -46 291 -115 6 233 67 -63 145 77 155 -6 112 3 17 113 -10 -147 -212 -6 -85 3 -33 35
3430 35 117 45 11 271 196 -188 -63 -52 -307 37 401 24 88 310 292 -334 -358 357 12 -74 162 202 -204 -60
3454 -60 263 0 -173 -54 295 -139 -268 14 189 -8 -145 -37 -377 -492 -124 48 -143 22 -366 22
3474 22 -210 16 285 -128 139 173 204 -78 166 192 -88 95 267 -48 -131 -21 159 -66 -87 149 166 -80
3496 -80 111 30 -71 175 125 -65 -37 25 88 181 -55 367 9 -85 231 -43 -192 2 -47 84 -177 -133 277
3519 277 355 246 209 -10 163 -31 216 353 197 -206 36 197 218 -3 138 74 -112 -221 -98 68 325
3540 325 10 75 328 -225 -108 -70 166 -32 140 66 184 114 181 29 -123 -209 285 -122 91 180 -135 -138 -16
3563 -16 -265 -180 106 164 -23 10 -4 -224 30 -44 264 -86 -193 280 558 -162 -43 342 -65 -107 28 171
3585 171 -328 222 98 -122 -103 222 201 -132 63 36 12 -127 -27 78 -312 -69 186 -461 -198 27 334
3606 334 17 -75 -37 -272 -196 299 88 -93 61 68 206 29 128 79 -81 321 219 105 -69 17 -324 -59 125
3629 125 -52 -57 111 35 -120 -52 61 153 269 239 3 -12 -37 88 -183 -15 7 67 -168 -66 -259 -101 113
3652 113 -12 -51 -26 85 1 -118 11 165 -74 85 56 169 -88 20 -331 110 34 249 101 -57 -224 -100
3674 -100 -116 -281 313 236 107 -209 236 38 -49 156 4 -102 -45 205 110 8 154 -389 -264 73 -252 30
3696 30 140 -70 -271 -165 119 86 214 -129 4 -353 116 143 -14 8 -300 -166 -108 -245 118 138 -64 81
3718 81 -6 -67 99 -19 -148 104 210 -274 -62 60 145 208 119 126 38 107 65 -53 85 157 103 -207 163 120 9
3743 9 258 159 98 -60 180 30 48 62 -133 -66 29 391 256 -53 107 113 -264 81 -278 195 -177 -94 -206 334
3767 334 -307 -64 9 -331 28 43 72 -73 -101 -317 -99 -303 109 45 -22 -311 -59 17 -162 99 -100 25
3789 25 4 134 71 69 411 23 78 218 -139 118 -120 -48 50 -127 -23 139 9 -224 0 -64 -112 -148 184 374
3813 374 257 -118 -21 -49 54 -88 69 427 -333 9 46 -186 6 161 -231 -50 -43 28 235 -135 -64 73
3835 73 -207 59 -14 127 87 -108 52 12 67 163 355 -92 139 -199 -362 -257 13 160 -76 60 119 66 -258
3858 -258 150 -86 -215 -153 -86 147 -179 31 -205 83 191 211 -63 -58 177 32 -41 -315 -34 48 128 12 97
3881 97 -169 37 -190 88 -72 -11 -21 -1 -196 -45 197 203 -70 212 12 28 -129 176 92 50 89 -7 -202 73
3905 73 -41 -106 142 -40 34 101 -64 -87 -9 -243 -57 124 -164 -41 148 108 -83 166 163 46 -41 23 264 22
3929 22 131 -51 144 -78 -23 67 -280 -37 -30 -69 106 -145 31 -155 129 62 174 -105 -154 244 -245 -57 5
3952 5 -21 -70 16 50 154 -109 -94 -48 -229 127 -155 -71 37 71 88 336 -44 -25 100 46 -40 109 -162 -72 30
3977 30 81 -89 57 -294 -100 132 -276 -251 -131 -100 -170 -29 182 -180 -92 175 126 62 97 19 -27 -66 399 -16
4001 -16 88 46 -35 70 -75 275 52 -156 153 33 -16 64 -178 78 -60 -21 -58 -74 154 -37 -59 -177 -148
4024 -148 195 -77 198 -162 174 -12 15 -197 -81 207 145 -37 75 73 -272 -62 -23 -30 -156 289 -95 -99 -140
4047 -140 91 141 -504 17 39 65 -149 232 20 -55 22 14 84 -155 324 -158 -141 -120 -117 -130 -147 -281 62 5 -287
4072 -287 36 269 -91 -7 -143 -87 204 -60 -259 122 44 -173 -7 241 -219 -323 46 -4 14 -272 -144 -160
4094 -160 -231 166 26 -60 78 -151 -277 132 168 -133 -49 70 -67 -6 -31 -253 -53 103 31 -10 -504 -163 -57
4117 -57 63 -219 -22 -14 -203 30 -13 183 -72 36 -34 304 227 146 -146 -106 -27 125 -94 -121 15 -65 -72 -86 299
4142 299 -112 13 -167 -188 229 211 167 60 79 -42 -65 -141 208 131 96 -38 198 -51 158 -195 132 -21 -181
4165 -181 180 -270 -42 244 -6 209 -123 189 -39 -67 -210 -399 -71 -226 -93 -227 162 -121 101 -112
4185 -112 126 -47 11 32 -203 -87 49 -41 62 4 -58 19 -151 163 -62 -418 -95 -209 -175 204 1 97 -41
4208 -41 194 -62 -2 180 194 -302 -8 51 -117 -12 74 -114 -50 89 -13 134 -161 222 18 32 -98 70
4230 70 -45 286 -106 -73 -24 205 -156 100 -58 178 -144 -211 -108 -216 -184 -62 -135 6 -128 85 99 102 12
4253 12 -182 -63 9 144 39 -222 -62 104 -109 -72 230 64 -77 58 60 119 -27 -38 99 155 -66 341 78
4276 78 -212 -78 83 -49 -30 251 -133 -56 157 71 -9 -6 -7 -182 -76 140 -22 -53 -20 -29 -78 -212 -30 104 112
4301 112 76 -2 -236 -117 -25 22 28 270 169 -14 57 -172 243 75 -336 -157 89 -48 383 -152 -33 89
4323 89 -65 145 -41 102 -103 50 97 60 123 -59 97 -116 35 -59 -247 338 -76 -190 47 48 -49 189 -26
4346 -26 95 -300 20 200 -42 261 132 151 147 92 25 122 46 -34 60 42 -33 42 -59 249 -82 186 108 -51 -223
4371 -223 -83 -37 132 -38 -51 -21 10 -129 -19 174 -240 -270 -137 -144 305 0 181 -17 41 13 -92 137 108
4394 108 -188 49 -94 -355 169 338 -10 -20 -222 130 99 -168 9 -139 -122 -60 250 8 58 37 -196 -10
4416 -10 210 -93 79 -160 169 258 -49 -187 47 53 -259 18 -240 -6 320 -170 -174 15 -172 -34 127 -173
4438 -173 -169 71 -75 104 -91 40 75 21 73 -26 120 -48 -76 167 8 -4 210 -80 -315 -181 -61 -101 -207
4461 -207 14 -238 -48 -146 -157 468 9 57 125 141 -158 -166 -8 10 131 -98 163 68 -201 -15 180 -36 -40 84
4485 84 109 21 214 -176 96 91 10 -39 207 42 -135 -134 378 -115 236 28 48 -243 -45 -338 -73 -195 97
4508 97 51 -211 -19 -62 40 19 107 20 31 -1 126 372 -63 85 151 171 -100 -94 184 31 -36 1 -29 131 36
4533 36 1 -136 -4 -194 109 -58 277 -47 -256 -193 190 -41 57 -103 -257 -53 -88 -145 -47 -16 -3 10 -52 -67
4557 -67 126 11 -312 -96 -218 -177 84 92 -51 -188 -14 103 -53 43 373 197 -79 -70 150 -202 -143 -18 -250
4580 -250 49 -18 -75 -119 -199 182 1 39 -178 -107 248 185 70 169 19 103 112 -31 197 -50 6 3 -6 246 139
4605 139 119 -4 1 -76 -78 -15 -420 23 54 -125 -18 -71 -82 -24 -17 109 -128 257 1 -180 340 93 118 75 238
4630 238 -58 -112 371 -94 -195 43 -11 137 -75 -151 150 -88 -25 40 298 0 -186 -84 110 -33 -229 56
4652 56 119 143 189 84 23 -45 -224 -126 89 40 -128 -75 68 110 -174 63 45 69 20 121 -97 -279 -228 33 50
4677 50 231 -21 -169 141 -9 -8 -26 -139 -54 -72 193 139 -7 -121 -196 97 40 141 -177 173 -231 193 324
4700 324 -2 157 -247 102 188 85 273 -169 -209 -53 128 -175 98 94 23 -92 -38 128 127 -402 -46 -253 -14
4723 -14 34 -278 -132 -218 -258 -370 -41 97 135 -44 -8 -43 60 -50 -27 -86 -119 -21 45 -148 112 75 211 186 217
4748 217 33 -438 72 34 47 94 34 -133 5 8 116 63 -380 71 -99 62 -43 -94 -38 197 56 -160 174
4771 174 -41 240 -50 30 34 35 19 -28 -110 195 20 -228 -57 -274 70 -41 85 -244 -112 112 3 126 0
4794 0 25 12 307 -26 -21 -16 -173 249 -200 -157 -86 68 268 68 105 101 -41 -221 159 -226 79 14 25 14 -83 20
4820 20 133 220 -191 54 -176 -2 22 73 167 -121 23 121 43 -141 186 125 -92 123 36 -21 -43 77 48 -1
4844 -1 -233 -7 129 26 220 -77 -77 -161 193 193 -51 -7 83 -120 344 -39 -70 76 58 -124 141 -42 288 -45
4868 -45 268 133 -175 148 159 -173 -157 -185 -167 -92 -154 -93 -75 -98 123 270 -219 -24 -118 11 -138 69 403 -60
4892 -60 -131 -325 -277 -168 32 -34 197 -153 129 17 -54 55 125 318 -66 34 199 -55 -169 22 141 -58
4914 -58 -123 -67 -137 -16 -118 168 -148 -85 179 -195 -346 -32 -146 -190 -63 115 25 148 66 9 -191 -72 -131
4937 -131 79 160 231 65 51 -75 2 -78 263 126 56 286 -192 21 -95 -115 9 53 -41 -202 243 -40 61
4960 61 200 -173 -41 -165 159 -236 -58 -131 -69 -126 -253 90 -25 69 -92 -251 159 -11 41 -33 -68 -98 30
4983 30 -36 -27 -201 45 66 -149 -169 99 -34 130 77 29 -98 -138 65 129 84 -68 -29 -6 -27 164 -177 117 -237
5008 -237 122 82 -134 113 -209 178 133 133 -128 28 -219 76 -19 223 140 21 117 -94 96 85 127 -134 30
5031 30 29 155 103 83 -3 208 -60 -10 105 -142 -125 24 -128 16 -125 22 111 -10 40 135 100 47 35 12 137
5056 137 185 -87 -303 68 -15 -53 107 -73 -287 -82 25 132 -81 97 213 52 -306 -113 98 162 61
5077 61 -152 -144 144 17 130 189 -41 139 198 -222 -128 116 61 50 132 350 28 -250 -162 73 -130 -70 -31 -63
5101 -63 21 73 -40 -24 -141 -139 -40 -105 317 -35 -22 -59 -212 -75 -153 -60 -42 6 -270 -88 8 -24 -71 -181 -46 -22
5127 -22 185 -80 -16 -197 0 182 147 95 -198 6 97 -91 42 -42 214 -56 -200 -129 -52 -125 322 300 104
5150 104 -177 36 -53 106 65 127 -10 -47 -50 221 102 167 -178 81 -58 71 -87 -38 -254 51 -22 62 -58
5173 -58 123 -5 -9 -198 -77 107 -271 67 -275 11 68 4 125 -141 195 69 -28 -12 -185 -69 -175 70
5195 70 157 -137 159 -72 172 240 104 24 -39 106 -65 -90 22 -130 -113 -391 31 187 -72 508 204 -122
5217 -122 -128 -46 -170 144 -213 232 -142 253 -13 -58 177 -119 145 -6 -105 184 210 96 -40 128 -4 -99
5239 -99 42 189 -46 -23 -159 61 -226 -113 -41 -65 -73 163 -29 -73 66 26 80 162 -231 -143 -19 170 -68 -245
5263 -245 -279 172 36 89 61 -7 14 286 40 76 -196 -63 -166 142 -95 -159 17 75 154 74 -14 -154 45 -32
5287 -32 119 -59 318 -125 1 -43 303 -184 -58 175 238 24 -72 -116 -155 -169 186 -108 -174 -159 -27 -66 -110 -16
5311 -16 216 -10 -154 -89 8 123 -31 168 47 186 183 195 -45 -232 -47 207 -297 -309 -41 -23 -36 117 -85
5334 -85 -41 237 -103 283 177 -210 -102 -98 118 -41 153 43 74 82 -28 261 312 -40 -176 -116 83 -16 119
5357 119 -42 -274 -54 248 -21 226 -77 -152 -52 -8 210 -64 50 68 45 215 44 -63 -15 146 -46 -191
5379 -191 -22 102 -279 -164 42 28 54 -23 -195 -176 -19 -31 -17 -116 -81 -149 -75 240 86 146 -11 83 102 55 -277
5404 -277 321 39 -6 125 152 -66 10 103 -159 -63 -150 47 -7 34 311 -168 -141 67 52 53 -274 305 102 -82
5428 -82 -19 5 103 78 91 119 -19 121 -60 3 -172 -6 24 155 -92 134 -122 -178 207 -233 33 -52 -22 92
5452 92 44 123 152 -80 -181 0 5 232 44 56 -94 -182 -110 -93 -105 -43 17 50 210 16 -79 82 -160 198 -216
5477 -216 186 41 51 -29 -37 46 -72 55 -132 159 185 205 39 314 66 -97 -110 126 165 -82 17 6 -28 139
5501 139 -32 -13 -10 -435 28 163 -41 -25 -66 -145 -59 -119 -63 32 54 -70 -17 29 -149 163 -126 -112 93 -146 -21
5526 -21 -37 -371 167 230 -49 -91 -5 87 42 -60 35 62 -28 -63 -188 15 112 -37 -108 -258 -23 473 -128 -45 -115
5551 -115 -42 179 76 236 337 -83 36 174 -134 -118 70 126 166 95 -15 -20 -277 -125 -37 3 63 28 -75 -2
5575 -2 87 147 -259 73 18 122 -127 -139 172 -303 -217 -94 46 134 -49 -60 -76 173 -159 186 68 107 160 128
5599 128 -13 -1 -40 -201 169 149 21 -42 227 -299 -183 148 -233 224 -75 -6 89 34 17 -10 87 62 403 40
5623 40 112 75 211 153 -91 -123 0 15 -45 -149 6 -19 326 106 56 -101 -236 -127 253 -237 -47 134 -145
5646 -145 47 165 -61 -61 41 195 160 69 233 -87 5 -218 -179 123 202 193 108 -229 -155 38 -235 270 101 -71
5670 -71 -7 89 -32 76 -45 195 62 102 -20 22 -304 358 -93 333 1 -341 -149 -125 196 25 88 52 -30
5693 -30 -179 -93 -352 -32 150 73 -340 -86 -113 108 121 108 -148 233 105 -32 -263 -189 201 86 -7 -26 73
5716 73 40 10 51 157 -405 29 89 50 -58 -265 -163 -134 133 -261 148 36 -80 -110 132 -81 -53 150 -183
5739 -183 163 -28 -147 118 -19 78 66 -55 40 113 255 23 96 210 -170 55 -70 -98 127 -92 -63 40
5761 40 -84 21 -42 -3 195 223 -150 -237 -130 100 -74 105 49 155 139 -191 143 -23 51 35 157 75 116 -1
5785 -1 153 -24 -228 126 211 154 -69 17 9 -56 115 -121 53 221 -89 -36 -2 297 -228 -65 96 191 68 -128
5809 -128 190 -105 -22 -178 -58 105 108 -147 101 -86 157 -4 -120 76 66 29 139 7 -200 -175 75 -285
5831 -285 -33 -53 91 20 -145 43 -127 -246 5 -10 -57 64 -120 153 234 94 -216 12 61 235 204 -381
5853 -381 -19 -30 -171 -106 -73 -166 38 -161 148 -108 63 -75 92 76 -92 5 193 112 -178 110 329 300 68
5876 68 -41 188 -107 -85 92 -102 -92 16 -20 -205 -61 127 86 -42 209 98 -4 87 389 189 -55 43
5898 43 -89 18 70 219 -18 -163 56 24 -10 203 -83 101 150 -70 223 -16 -6 190 -31 5 -139 -182 122
5921 122 146 136 -147 -187 -167 -133 87 105 41 -8 -54 -55 128 -55 -55 60 -1 -1 -23 75 100 -113 59 122 81 63 -43
5948 -43 -203 5 -35 -23 91 68 127 -47 -45 4 95 112 -95 7 -31 -250 144 75 -23 -127 143 0 -239 -41
5972 -41 -134 -214 -153 -105 108 -129 197 -208 -239 79 94 -89 -29 213 77 9 -37 -181 -114 -75 -49 0 119 -217 -18
5997 -18 115 -52 208 -137 134 99 -198 61 85 -54 6 144 193 -58 -20 132 -112 -64 -81 -30 277 -1 -122
6020 -122 -224 -200 -55 174 -118 90 -160 -45 -190 166 -88 -141 -296 46 -156 -122 -129 -152 113 80 6 -94 79
6043 79 -57 -86 29 57 -17 246 126 162 -72 -8 153 -52 -137 89 -109 -133 -131 -11 -91 52 -39 -76 -296 -106
6067 -106 -63 -27 -202 -104 -14 69 -113 64 -173 -331 51 -36 16 -60 -226 -57 -86 334 186 156 82 50 13 -148
6091 -148 -31 -45 0 59 -74 -85 147 -5 -69 75 -54 -64 -115 254 -159 -125 -122 82 -40 58 -77 -184 89 30
6115 30 233 196 -46 -124 -92 101 45 -136 -4 21 101 -190 -88 -147 395 120 -79 -205 -62 -183 63 -91 -104
6138 -104 -268 -12 334 141 93 -24 18 232 -176 -49 97 -50 97 -158 182 -205 -84 14 96 131 -31 133
6160 133 -49 -353 -1 36 68 74 1 -261 56 -14 146 35 129 -42 44 -52 80 -25 93 118 -21 94 256
6183 256 260 71 -5 -132 -61 84 -182 9 -106 -58 -149 -28 35 312 -40 60 37 20 16 -54 202 336 -222 51
6207 51 -26 -104 150 93 -67 167 64 5 95 -45 41 -3 -389 17 176 -207 123 60 -121 186 192 143 -114 -112 15
6232 15 61 242 161 81 48 292 242 123 230 180 -244 49 -78 78 101 26 235 210 227 -20 252 56 -169 -106
6256 -106 -170 -59 -24 -124 -82 238 -24 -115 -187 83 -112 -92 -40 -211 -1 165 90 -78 109 17 -7 44 -32 48
6280 48 14 21 315 -118 -126 -123 55 -141 -114 -2 -50 -15 7 332 -84 131 229 -43 -146 -284 86 -36 -198 42
6304 42 29 20 66 -159 80 -98 -24 24 207 -23 168 -49 10 33 -59 -91 281 212 -151 144 -155 -287 -143 45
6328 45 -15 42 8 66 48 -17 44 147 68 62 307 84 -4 229 -39 -218 -109 -134 274 -165 -57 101 156 329 49
6353 49 135 -25 -226 217 120 38 -112 -51 -54 134 67 -189 139 119 12 188 255 35 242 -228 -4 -144 -27
6376 -27 -134 -93 76 -211 -57 -216 115 -20 258 242 -172 95 170 -83 86 76 142 -126 37 142 60 -36 -58
6399 -58 -50 -260 45 128 -89 6 -428 26 106 -24 144 141 161 31 305 80 34 46 -48 124 -158 152 161 126 -265
6424 -265 -224 284 -39 284 -90 135 124 -209 104 -226 -151 -51 -72 37 167 -225 -252 130 160 74 230 -30
6446 -30 -11 101 241 -173 -57 140 -188 31 -240 78 159 41 129 -40 -84 45 -219 -60 190 -96 -29 140
6468 140 -169 523 228 82 66 169 -10 -221 112 210 -63 -10 252 273 -65 -146 22 269 -213 -170 65 -84
6490 -84 -186 206 196 -196 66 -311 -92 36 234 56 -4 26 173 366 11 227 -219 328 110 73 49 131
6512 131 -116 166 -204 150 223 -80 -233 -21 7 35 106 2 110 -116 134 234 74 -33 37 -94 16 130
6534 130 -106 -87 -42 -134 -215 -335 49 168 -184 59 -45 -51 -21 14 232 7 106 175 -302 205 -40 27 104 14
6558 14 217 202 26 -145 -55 33 -146 24 -62 -7 99 -20 181 152 130 -7 -236 252 25 -133 0 65 -115
6581 -115 257 18 -33 -12 -212 -147 -17 35 115 -220 111 -17 88 -63 -197 -37 -348 168 28 16 -217 50
6603 50 129 -236 81 52 151 -23 -91 -128 -44 42 1 0 -271 -86 -46 52 -149 -180 -139 130 -57 -39 42 129 -157 306
6629 306 -223 145 415 -57 70 52 -89 2 97 -209 -219 172 78 -54 192 -172 54 -32 113 -36 -136 38
6651 38 -98 13 -12 -247 -2 -56 -221 16 18 56 -5 -7 -177 81 312 -410 192 91 92 23 89 -43 -44 129 -135
6676 -135 -71 147 1 -18 108 174 -88 -61 -52 0 -47 176 -113 -219 64 191 -64 -321 -56 -91 -126 -114 28 -213
6700 -213 -305 131 167 15 90 -37 84 124 -115 158 97 -93 342 -64 41 43 71 4 -29 117 35 59 -172 -49
6724 -49 37 80 -82 151 103 205 138 156 41 -171 71 15 97 -98 -124 58 115 193 28 298 -277 -175 -6 274
6748 274 -22 -48 90 20 111 44 107 -80 -118 21 113 -110 9 -141 31 -193 176 -73 -123 -279 91 -12 -114
6771 -114 84 99 -168 31 96 14 -80 -30 -174 -72 37 -117 -120 -73 -177 -150 156 -57 75 90 -60 -50 -121 113
6795 113 58 -25 222 41 304 -15 -174 62 271 33 -125 51 -125 193 -19 61 -31 -64 -33 -65 93 -31
6817 -31 140 87 64 -79 162 42 11 17 87 -141 55 71 -162 7 287 -14 35 -48 13 122 -95 109 -86 147
6841 147 -291 -11 -48 31 168 128 -53 193 209 94 15 -29 -225 -234 -167 -15 -22 15 -81 181 -3 213 -16 -332
6865 -332 12 16 34 78 263 54 -178 16 20 31 -31 -112 -122 -70 89 179 -143 107 -120 28 9 -69 24 -52 81
6890 81 -59 96 -56 292 -133 251 -77 -94 -56 -95 185 -104 39 -7 -90 -24 96 -337 -101 26 42 234 27
6913 27 -148 55 -49 -227 316 -66 -189 -28 -104 20 -109 174 -193 69 -146 81 207 -18 29 128 226 73
6935 73 -142 -64 95 -11 140 204 119 -123 108 28 -126 123 -7 -175 143 146 -53 -36 146 -28 190 40 -213
6958 -213 -228 -70 -46 -4 111 37 87 151 73 -110 -41 237 -104 -225 -69 -149 -56 14 -12 13 159 55 -90 49
6982 49 -230 -23 -48 -42 120 -39 57 37 207 207 230 -173 4 29 51 -224 53 68 -27 -68 -41 259 -47 6 -188
7007 -188 122 196 239 -178 -67 -144 35 25 55 -213 -49 90 108 -218 -64 10 97 35 75 -43 0 157 -190 87
7031 87 -177 119 174 87 -16 113 56 86 330 -60 -251 -29 181 -155 -17 38 -72 -162 -37 -23 182 -184 -110
7054 -110 66 -14 124 -126 -120 281 131 59 137 -77 17 150 155 7 161 7 213 -250 107 111 -37 -5 -296 -112
7078 -112 9 87 170 -101 83 -22 -39 -26 -6 -117 -260 -229 275 -181 309 -75 -38 62 -178 160 288 175
7100 175 -29 -219 24 0 342 -202 -5 -23 -166 50 -158 5 21 23 -131 12 234 68 -48 10 4 -123 155
7123 155 12 79 -159 144 254 14 47 3 -286 110 234 29 -189 23 -13 -103 -393 -203 118 133 108 176 -89
7146 -89 272 -15 -316 242 45 -19 117 30 -54 208 -93 -66 -47 -72 181 201 117 128 -59 -26 59 13 -50 73 195
7171 195 32 -120 -183 218 -38 -86 -21 -241 82 -55 26 -238 303 -15 131 10 -167 -170 -165 -116 -64 -41 168 88
7195 88 -210 246 245 -181 -66 24 103 -63 31 -5 52 -125 77 289 -88 -38 -17 47 202 23 -193 49 52 -130
7219 -130 48 103 -173 16 -109 -35 89 -149 16 317 -18 144 -191 -134 105 34 71 -113 -93 -54 -105 -185 -98
7242 -98 207 -44 -289 -197 -120 -74 -89 2 -70 -86 201 105 -59 -266 -39 34 -43 74 131 29 -243 -23 107 43
7266 43 -32 334 95 256 166 -19 210 190 255 121 30 -28 203 -28 -122 -40 63 -55 -117 -152 242 -247 24 102
7290 102 -27 -24 30 117 -26 31 -52 -82 -88 107 -174 -105 -67 -130 167 -31 112 -208 -2 37 28 211 138 -166 154
7315 154 -93 -68 21 -35 133 -2 -90 -218 -54 26 -151 61 -97 98 -141 -77 18 -242 -92 48 43 55 -245
7338 -245 41 -22 -269 32 78 -250 -87 -33 148 -9 63 -55 78 -199 -47 182 87 -173 87 22 -38 110
7360 110 -293 -160 -155 20 326 147 -96 211 174 41 -26 -178 3 38 -110 -80 -140 111 97 114 58 146 -157 126
7384 126 105 -197 -176 111 -48 222 308 -32 -27 -106 -84 349 2 117 -208 102 -148 3 -144 -178 -136 11 -55
7407 -55 -145 -56 -111 85 83 -107 -18 24 -71 23 65 54 113 12 24 98 -108 -368 -86 164 89 -284 -166 12 101 -156
7433 -156 -155 -43 215 2 75 -71 -129 43 -147 73 -32 -15 6 65 87 54 110 -86 165 7 21 33 -43 -98 -228
7458 -228 -360 -77 -283 -256 76 85 86 -81 -219 -210 36 -247 -308 -45 -125 84 -23 -86 138 -165 88 -39 -197
7481 -197 -48 -107 26 -40 -3 75 -229 80 -1 1 223 -60 27 47 153 165 -89 310 -114 217 -82 34 49 19
7505 19 -1 314 245 -27 184 2 -112 -154 -91 23 -54 86 122 199 54 -182 43 149 150 80 46 62 -10 91 46
7530 46 3 -374 -251 -73 -63 -33 -30 98 76 13 123 147 107 -25 -176 -85 16 234 -117 73 145 110 -189 132
7554 132 -14 323 -90 -37 24 -3 149 4 252 -216 224 58 126 2 35 -255 -144 82 -222 -6 -163 -62
7576 -62 -17 105 -72 218 -254 -22 95 -143 43 -24 -12 -40 -72 121 -97 66 71 -102 352 -190 31 61 50
7599 50 -46 72 173 -9 155 158 24 -194 -82 125 49 153 -64 23 -220 -163 -133 -292 -113 -142 -6 65 32 -105
7623 -105 -70 -173 146 -61 -56 -117 -141 246 299 -314 85 201 -299 -61 254 66 161 25 -97 -49 -66 119 -246
7646 -246 131 134 -209 10 191 -90 178 152 133 5 30 -33 -94 -45 -101 -208 45 84 9 287 -96 -238 -262 157
7670 157 173 -56 -121 -155 -139 -61 132 82 -164 -11 -17 -2 -64 -34 150 6 144 -30 134 -45 57 -275 -68 4
7694 4 59 26 -74 135 101 -71 66 -366 26 99 -95 -123 182 -58 -273 120 16 -183 -284 128 -119 85
7716 85 19 332 -125 -431 -167 -171 18 15 -265 -76 -61 109 245 -46 39 152 -16 -136 150 84 -84 -188 70
7739 70 19 157 -281 71 -32 16 103 -82 282 231 -51 -173 -125 -7 291 137 -22 176 335 -82 -22 -19 -22 -193
7763 -193 -52 -50 -180 -67 -113 -169 62 -184 52 -44 -178 -49 2 -161 -39 95 -176 157 27 -319 97 132
7785 132 -118 -226 253 207 -281 -219 205 12 -8 -89 120 11 27 42 30 67 -157 244 -54 -44 58 40 -228
7808 -228 103 104 95 -125 30 118 9 184 172 -55 -94 28 53 -114 -121 107 6 230 23 26 -166 41 133 76 36
7833 36 322 47 152 -168 -318 -168 -96 -2 -71 132 -7 -77 -32 -23 104 64 -66 -97 173 367 102 -94 -277
7856 -277 303 39 33 88 165 111 109 -69 -135 11 -341 255 -100 -79 -217 101 202 23 -147 121 51 -12 26 47
7880 47 102 68 -68 -156 208 139 -232 55 -30 -117 174 -50 -472 -169 283 -7 -101 0 52 67 -41 136 23
7903 23 -58 184 -180 312 1 -304 -130 -26 -2 -134 -17 131 207 129 226 -149 27 272 308 -46 35 -516 148
7926 148 8 47 220 -40 -175 -214 282 9 -15 -78 -111 -78 -80 -152 -28 -57 107 57 -24 -67 137 27 17 -178 -174
7951 -174 81 32 -74 -37 -46 -49 142 -2 333 68 -54 -60 125 21 -3 61 178 -25 -4 -54 -81 27 -203 98
7975 98 103 77 9 -5 -294 121 -188 55 -101 88 -100 91 17 -76 -73 -113 -251 -168 -62 -335 80 233 -113 -92
7999 -92 50 -147 64 6 -6 32 -36 20 -54 -55 -14 -242 31 239 83 33 27 26 -80 285 98 -3 -11 193 84 70
8025 70 -15 55 -91 -191 -22 11 9 -143 35 -130 -102 -10 269 137 18 -76 227 -89 70 -135 -38 169 161 18
8049 18 138 29 -47 66 -47 50 124 120 11 -14 51 229 46 -67 -191 -144 119 98 -41 -104 87 -43 42 -71
8073 -71 52 -85 100 -124 -217 -247 101 103 96 153 -307 -276 -233 39 -40 -191 -138 -118 -18 174 -186 -285 175 -32 65
8098 65 -160 -91 199 96 79 146 39 -168 -39 -147 -392 -153 -111 107 -206 89 108 -202 155 103 -247 -141
8120 -141 -41 121 -59 -28 -57 5 80 30 -45 -181 -195 -86 102 3 199 58 50 25 223 -123 -15 33 69 -154
8144 -154 98 -74 -227 96 -18 -149 -64 9 116 -59 104 164 -12 -47 175 -58 -191 83 134 -77 -67 -66 -255
8167 -255 -230 147 -338 -222 -69 -21 38 -126 -245 46 -62 188 -40 14 -316 -106 -121 -39 -30 97 -74 97 134
8190 134 -86
8191h6
##END NTUPLES=NMR FID
##END=
