##TITLE=1H_Pr C6-Eth-d
 200.13Hz, CDcl3.
 8 sc
7.8.2026
##JCAMPDX= 6.0         $$ Bruker NMR JCAMP-DX V2.0
##DATA TYPE= NMR FID
##DATA CLASS= NTUPLES
##ORIGIN= UXNMR, Bruker Analytische Messtechnik GmbH
##OWNER= pz
$$ XWIN-NMR		Version 3.5
$$ Fri Aug  7 14:44:58 2026 Russian Standard Time (UT+4h)  she@DPX200
##.OBSERVE FREQUENCY= 200.1313
##.OBSERVE NUCLEUS= ^1H
##.DELAY= (6, 6)
##.ACQUISITION MODE= SIMULTANEOUS
##.ACQUISITION SCHEME= undefined
##.AVERAGES= 8
##.DIGITISER RES= 18
##SPECTROMETER/DATA SYSTEM= spect
##.PULSE SEQUENCE= zg30
##.SOLVENT NAME= CDCl3
##.SHIFT REFERENCE= (INTERNAL, CDCl3, 0, 14.3821)
##AUDIT TRAIL= $$ (NUMBER, WHEN, WHO, WHERE, WHAT)
$$ ##TITLE= Audit trail, XWIN-NMR		Version 3.5
$$ ##JCAMPDX= 5.01
$$ ##ORIGIN= Bruker BioSpin GmbH
$$ ##OWNER= she
$$ F:/spectra/data/she/nmr/H-C/1/audita.txt
$$ ##AUDIT TRAIL=  $$ (NUMBER, WHEN, WHO, WHERE, WHAT)
(   1,<2026-08-07 14:43:28.70 +0400>,<she>,<DPX200>,
      <created by zg, POWCHK disabled, PULCHK disabled
       configuration hash MD5:
       00 E9 B6 7A A2 85 ED C7 34 08 36 98 17 FE 4E 26
       data hash MD5: 16K
       A6 9F 34 DC 46 06 16 72 5D F7 57 FF 69 B6 18 D4>)
$$ ##END=
$$ 
$$ hash MD5
$$ DA F7 32 3F A7 19 0E 64 3A C4 D5 58 3F 6E 63 55
##$RELAX= 
##$RELAX= 
##$RELAX= 
##$RELAX= 
##$RELAX= 
##$RELAX= 
$$ Bruker specific parameters
$$ --------------------------
##$DU= <F:/spectra>
##$EXPNO= 1
##$NAME= <H-C>
##$PROCNO= 1
##$TYPE= <nmr>
##$USER= <she>
##$AMP= (0..31)
100 100 100 100 100 100 100 100 100 100 100 100 100 100 100 100 100 100 
100 100 100 100 100 100 100 100 100 100 100 100 100 100 
##$AQSEQ= 0
##$AQ_mod= 1
##$AUNM= <au_zg>
##$AUTOPOS= <>
##$BF1= 200.13
##$BF2= 200.13
##$BF3= 200.13
##$BF4= 200.13
##$BF5= 200.13
##$BF6= 200.13
##$BF7= 200.13
##$BF8= 200.13
##$BYTORDA= 1
##$CFDGTYP= 0
##$CFRGTYP= 5
##$CHEMSTR= <none>
##$CNST= (0..31)
1 1 145 1 1 1 1 1 1 1 1 1 1 1 1 1 1 1 1 1 1 1 1 1 1 1 1 1 1 1 1 1 
##$CPDPRG= <>
##$CPDPRG1= <>
##$CPDPRG2= <>
##$CPDPRG3= <>
##$CPDPRG4= <mlev>
##$CPDPRG5= <mlev>
##$CPDPRG6= <mlev>
##$CPDPRG7= <mlev>
##$CPDPRG8= <mlev>
##$CPDPRGB= <>
##$CPDPRGT= <>
##$D= (0..31)
0 0.7 0 0 0 0 0 0 0 0 0 0.03 0 0 0 0 0 0 0 0 0 0 0 0 0 0 0 0 0 0 0 0 
##$DATE= 1786099408
##$DBL= (0..7)
120 120 120 120 120 120 120 120 
##$DBP= (0..7)
150 150 150 150 150 150 150 150 
##$DBP07= 0
##$DBPNAM0= <>
##$DBPNAM1= <>
##$DBPNAM2= <>
##$DBPNAM3= <>
##$DBPNAM4= <>
##$DBPNAM5= <>
##$DBPNAM6= <>
##$DBPNAM7= <>
##$DBPOAL= (0..7)
0.5 0.5 0.5 0.5 0.5 0.5 0.5 0.5 
##$DBPOFFS= (0..7)
0 0 0 0 0 0 0 0 
##$DE= 6
##$DECBNUC= <off>
##$DECIM= 32
##$DECNUC= <off>
##$DECSTAT= 4
##$DIGMOD= 1
##$DIGTYP= 9
##$DL= (0..7)
0 120 120 120 120 120 120 120 
##$DP= (0..7)
150 150 150 150 150 150 150 150 
##$DP07= 0
##$DPNAME0= <>
##$DPNAME1= <>
##$DPNAME2= <>
##$DPNAME3= <>
##$DPNAME4= <>
##$DPNAME5= <>
##$DPNAME6= <>
##$DPNAME7= <>
##$DPOAL= (0..7)
0.5 0.5 0.5 0.5 0.5 0.5 0.5 0.5 
##$DPOFFS= (0..7)
0 0 0 0 0 0 0 0 
##$DQDMODE= 0
##$DR= 18
##$DS= 0
##$DSLIST= <SSSSSSSSSSSSSSS>
$$ [...]
##$SUBNAM0= <"">
##$SUBNAM1= <"">
##$SUBNAM2= <"">
##$SUBNAM3= <"">
##$SUBNAM4= <"">
##$SUBNAM5= <"">
##$SUBNAM6= <"">
##$SUBNAM7= <"">
##$SUBNAM8= <"">
##$SUBNAM9= <"">
##$SW= 18.0517328524113
##$SWIBOX= (0..15)
0 0 2 0 0 0 0 0 0 0 0 0 0 0 0 0 
##$SW_h= 3612.71676300578
##$TD= 16384
##$TD0= 1
##$TE= 0
##$TE2= 300
##$TE3= 300
##$TEG= 300
##$TL= (0..7)
0 120 120 120 120 120 120 120 
##$TP= (0..7)
150 150 150 150 150 150 150 150 
##$TP07= 0
##$TPNAME0= <>
##$TPNAME1= <>
##$TPNAME2= <>
##$TPNAME3= <>
##$TPNAME4= <>
##$TPNAME5= <>
##$TPNAME6= <>
##$TPNAME7= <>
##$TPOAL= (0..7)
0.5 0.5 0.5 0.5 0.5 0.5 0.5 0.5 
##$TPOFFS= (0..7)
0 0 0 0 0 0 0 0 
##$TUNHIN= 0
##$TUNHOUT= 0
##$TUNXOUT= 0
##$USERA1= <user>
##$USERA2= <user>
##$USERA3= <user>
##$USERA4= <user>
##$USERA5= <user>
##$V9= 5
##$VALIST= <valist>
##$VCLIST= <CCCCCCCCCCCCCCC>
##$VD= 0
##$VDLIST= <DDDDDDDDDDDDDDD>
##$VPLIST= <PPPPPPPPPPPPPPP>
##$VTLIST= <TTTTTTTTTTTTTTT>
##$WBST= 1024
##$WBSW= 4
##$XGAIN= (0..3)
0 0 0 0 
##$XL= 0
##$YL= 0
##$YMAX_a= 274265
##$YMIN_a= -237133
##$ZGOPTNS= <>
##$ZL1= 120
##$ZL2= 120
##$ZL3= 120
##$ZL4= 120
##$ABSF1= 10
##$ABSF2= 0
##$ABSG= 5
##$ABSL= 3
##$ALPHA= 0
##$AQORDER= 0
##$ASSFAC= 0
##$ASSFACI= 0
##$ASSFACX= 0
##$ASSWID= 0
##$AUNMP= <proc_1d>
##$AZFE= 0.1
##$AZFW= 0.1
##$BCFW= 1
##$BC_mod= 2
##$BYTORDP= 1
##$COROFFS= 0
##$CY= -3
##$DATMOD= 1
##$DC= 2
##$DFILT= <>
##$DTYPP= 0
##$F1P= 0
##$F2P= 0
##$FCOR= 0.5
##$FTSIZE= 0
##$FT_mod= 4
##$GAMMA= 1
##$GB= 0.15
##$INTBC= 1
##$INTSCL= 1
##$ISEN= 128
##$LB= 0.25
##$LEV0= 0
##$LPBIN= 0
##$MAXI= 10000
##$MC2= 0
##$MEAN= 0
##$ME_mod= 0
##$MI= 1.114404
##$NCOEF= 0
##$NC_proc= 0
##$NLEV= 6
##$NOISF1= 3.799351
##$NOISF2= 2.8
##$NSP= 1
##$NTH_PI= 0
##$NZP= 0
##$OFFSET= 14.38212
##$PC= 1
##$PHC0= -4218.701
##$PHC1= 9.7923
##$PH_mod= 1
##$PKNL= yes
##$PPARMOD= 0
##$PSCAL= 0
##$PSIGN= 0
##$REVERSE= no
##$SF= 200.129724274929
##$SI= 16384
##$SIGF1= 3
##$SIGF2= 2
##$SINO= 400
##$SIOLD= 16384
##$SREGLST= <1H.CDCl3>
##$SSB= 0
##$STSI= 0
##$STSR= 0
##$SW_p= 3205.1282051282
##$SYMM= 0
##$S_DEV= 0
##$TDeff= 0
##$TDoff= 0
##$TI= <>
##$TILT= no
##$TM1= 0
##$TM2= 0
##$TOPLEV= 0
##$USERP1= <user>
##$USERP2= <user>
##$USERP3= <user>
##$USERP4= <user>
##$USERP5= <user>
##$WDW= 1
##$XDIM= 8192
##$YMAX_p= 0
##$YMIN_p= 0
$$ End of Bruker specific parameters
$$ ---------------------------------
##NTUPLES= NMR FID
##VAR_NAME=  TIME,          FID/REAL,        FID/IMAG
##SYMBOL=    X,             R,               I
##VAR_TYPE=  INDEPENDENT,   DEPENDENT,       DEPENDENT
##VAR_FORM=  AFFN,          ASDF,            ASDF
##VAR_DIM=   8192,          8192,            8192
##UNITS=     SECONDS,       ARBITRARY UNITS, ARBITRARY UNITS
##FACTOR=    0.0002768,     1,               1
##FIRST=     0,             0,               0
##LAST=      2.2672688,     0,               0
##MIN=       0,             -237133,         0
##MAX=       2.2672688,     274265,          0
$$ Real data points
##PAGE= N=1
##DATA TABLE= (X++(R..R)), XYDATA
0@%%%%%%%%%%%%%%%qJ6j6J6j6K4l2L7m5N2o0P2q5R7j12J29j47J67j90K17k47K78
37A47l11L47l88M34m85N39n98O63p34Q11q95R89j090J200j323J457j605J772j956
56a026K160k394K662k969L327l752M266m899N701o754Q190j0230J3125k0153K87011
71B74265r8866l37184J38107J07728j75578L43K18154q6854j70223J65018J16874
82A51784k48904p0774K45228N3387j48905J7907L9764j13000q509J56261j6403
93E7836j34058P4415J07604j25974q5595J09852L5799o8160M0078N2301r4420
104c0322o2132J11620N7990q5469q17P0725o0768p5977O2611N2471m8119p317
116a5504N8842l0321q5471M9401Q8318o0940o2371P4045L6117p7262k0451O9025
$$ plain form
0 0 0 0 0 0 0 0 0 0 0 0 0 0 0 0 0 -8 8 -8 8 -8 16 -16 21 -24 28 -32 40 -45 52 -60 69 -78 89 -101 116 -131 147
37 147 -164 183 -205 229 -256 283 -315 348 -386 425 -470 519 -571 629 -694 763 -842 930 -1026
56 -1026 1134 -1260 1402 -1567 1760 -1992 2274 -2625 3076 -3678 4512 -5718 7407 -12746 274265
71 274265 175399 -161785 -23678 84050 -91528 -91185 126969 40115 -130108 34910 151784
82 151784 -97120 -167894 77334 130721 -18184 -277 39487 -73513 -82022 74239 57836
93 57836 -76222 -1807 105797 -20177 -105772 4080 39879 -28281 11797 64098 -30322
104 -30322 -92454 19166 77156 -8313 -9130 61595 827 -75150 -12539 39932 -8187 -15504
116 -15504 43338 13017 -72454 -23053 65265 4325 -58046 15999 52116 -25146 -45597 23428
128B3428J75n0632N0685M9209j01624o0160J03648M6312p7761r405N9504k5778
140G601n3510M3650L2437o0667J2932Q2410n2704r5582O0266Q1557m1857l4638
152a8105M1109j1985n3393M6476N2892p6796l6840R2591R851q9966J0370O7157
164C3361l0359m2030N5519K3977p4479k508P5573k5073n7161N6320M1586o5304
176a0578k7243N7258N007n4384K1030N0201m7546m1834O0378J8828n7754O920
188a9717N3898k3185n1551L2558M2569m3342j9637O0085l814o1956K4931N0308
200D1147m0273l8659M8250K6501n6789j1163N6206j8533m7254M9628L3855o5930
212b3014j9992O3804M627n2995J9972M8599m3260l2983O1265N562o7215K1791
$$ plain form
128 23428 23603 -27029 23656 72865 -28759 -88919 14729 61041 -16720 -26125 33379 7601
140 7601 -45909 -2259 30178 -30489 -17557 64853 12149 -83433 -23167 58390 16533 -18105
152 -18105 23004 11019 -42374 4102 56994 -19802 -56642 35949 45800 -44166 -33796 33361
164 33361 3002 -39028 16491 40468 -34011 -36519 39054 13981 -43180 13140 54726 -10578
176 -10578 -37821 19437 24444 -29940 -8910 41291 -6255 -48089 12289 31117 -26637 -19717
188 -19717 34181 10996 -40555 -7997 34572 -8770 -28407 31678 27864 -34092 -9161 41147
200 41147 874 -37785 10465 36966 -19823 -30986 25220 6687 -40567 9061 42916 -23014
212 -23014 -43006 20798 25425 -27570 -7598 41001 -2259 -35242 26023 31585 -35630 -13839
224a3839N8983m2699m7453M9713K7663n5396l511N9763k5745n1661N2090L0710
236C8618o4719m580O7397j3957n7945L1457M5679m9894k7770O3840J169o5904
248c6609K4339M9675m5749l0963N5799J5746o0507L34O0492k2215m9839M4471
260D974L1695n4086o505N4098j2280m7962K7218M0874m1295l0701N0836P381n4716
273c0469J5711M4664l1640l0798L9736J7267m4544k797N0233j3304m4311L3245
285B993K9891m5084r181M6914p995m3062J8587L5797l3023k7517M5105R543n0376
298b7408J1680M4034k8557l0708L7925K0093m1510o755M5625q622m3255K7830
310C72L2178m0953j4485M2621l100m0752J3350L6285k5627k9979L6815J5797m4075
$$ plain form
224 -13839 45144 2445 -45008 4705 32368 -23028 -26539 33224 7479 -44182 7908 38618
236 38618 -26101 -30681 36716 22759 -35186 -3729 41950 -7944 -35714 28126 29295 -36609
248 -36609 -12270 37405 -8344 -39307 16492 32238 -28269 -27935 32557 10342 -39497 4974
260 4974 36669 -17417 -23922 30176 17896 -30066 -2848 38026 -3269 -33970 16866 24247 -30469
273 -30469 -14758 29906 -1734 -32532 7204 24471 -20073 -22870 27363 14059 -30252 2993
285 2993 32884 -12200 -21381 25533 17538 -25524 -6937 28860 -4163 -31680 13425 22968 -27408
298 -27408 -15728 28306 -251 -30959 6966 27059 -14451 -21206 24419 15797 -27458 372
310 372 32550 -8403 -22888 19733 16633 -24119 -10769 25516 -111 -30090 6725 22522 -21553
323b1553L930M1630j9238k9930K9397K0958l3997j0353L9617j757m1447J8517
335d226L2444l3577j8369L6743L026l6630P826L3000j9012k8872L1726J8760l9089
348a6250p49L9828j4144l0853K5071K1833l0138j3212L5335O55l9389J4372L3056
361B5415k9287k1097L4825N995l4269M095L2357j2954k8686K5637K1423l4526
373a1072o140L8146q980l0918J9305K2281k5931j5710L0757N224l6468P872L2964
386B1330k3014k3018L1004J0523l2164J221L1300r110k8428K1366K3817l2228
398g401j0089L6263n220l1464J5225K2310k3624j5271K8510O363l5002O140L2962
411A9702j9404k2754K8265J0550k9075R61K8501q087k5895J8878K1035k8558j0499
$$ plain form
323 -21553 -17623 24007 4769 -25161 4236 25194 -8803 -19156 20461 18704 -22743 -4226
335 -4226 28218 -5359 -23728 13015 16041 -20589 -12763 20237 1225 -27647 4079 22839 -16250
348 -16250 -16999 22829 8685 -22168 2903 24736 -5402 -18614 16721 17376 -22013 -7641 25415
361 25415 -3872 -24969 9856 15851 -18418 -14323 18034 5080 -23606 2031 23454 -11072
373 -11072 -17212 20934 11954 -18964 341 22622 -3309 -19019 11738 16962 -19506 -11634 21330
386 21330 -1684 -24702 6302 16825 -15339 -14118 17182 8072 -20356 1010 24827 -7401
398 -7401 -17490 18773 13553 -17911 -2686 19624 -4000 -19271 9239 15602 -19400 -13260 19702
411 19702 298 -22456 5809 16359 -12716 -11755 16746 8659 -17236 1642 22677 -5881 -16380
424a6380L1877l730k8154J2586J9036j8527j3276K2100O524k7693L026K9135j2349
437D175k1356K0067J0867k1172j424K2945l580k3512R769K1195j8747j4497K4394
450I124K277k6169N335K1384j0343j7492J6531J2586k3901l679L0975n431k7536
463a6339J4648J7317j9245o713K3948l79k8473O393K6982j6720j9742K5305N581
476A2563k9444O181K6339j2852k0456J9125J4021k5809k752L2163q339k9189J8586
489A37J7677k2406n628K3095l960k5404J0165K2635j7944j5607K3714K557k3810
502a4779R116J9216j3352j3594J6472R005j7116j097J9740r081j9121J6088J3999
515A5496j6799q343J3534j34j3176N148J5852j1560j6121J5938J0816j5356j205
$$ plain form
424 -16380 15497 11767 -16387 -3801 15235 -3292 -16568 5532 12056 -15637 -12611 16524 4175
437 4175 -17181 2886 13753 -7419 -8843 14102 10522 -12990 -3221 17974 -773 -15270 9124
450 9124 11401 -14768 -9433 11951 1608 -15884 647 13233 -10668 -14347 16628 11197 -16339
463 -16339 -1691 15626 -3619 -10332 13616 13237 -15236 -8843 18139 1419 -18323 6982 12563
476 12563 -16881 -10700 15639 2787 -17669 1456 15477 -10332 -13084 19079 10740 -18449 137
489 137 17814 -4592 -10220 12875 8915 -16489 -6324 16311 -1633 -17240 6474 9031 -14779
502 -14779 -5663 13553 201 -13393 3079 12084 -5032 -6129 13611 4530 -14591 1497 15496
515 15496 -1303 -9646 3888 3754 -9422 -4274 11578 18 -16103 -165 10651 -4705 -5910
528e910J4373m847j4129Q872J5826j1172j2362J5655J297k0625Q648K1172j3717
541C081j8045J1944J0277j4719k98K2076j0276k5022J8426K0322j9895p262J9892
554A0501m857j9104J3526J9204j9662j4827K2728J715k4681J1744K1180k0852
566c385j3933K1316M750j9521N669K0231j5113j7044K3015R712k3824J623J8813
579A2309j0499j1992J5712O596j8817m353J8320k653j5051J0533Q268j6363j898
592i888J5612L48j0593J067Q509m400n722J0410M097j3570k225R925P25m705K41
607a69K283n114o348R742Q185j0714m942Q881j454o726P175Q728q891r755J1163
622B044O559j2802K526J3733j2067j2725J4984Q072j4013k846J1983o349j2871
$$ plain form
528 -5910 8463 3616 -10513 -1641 14185 3013 -9349 6306 7603 -13022 -4374 16798 3081
541 3081 -14964 -3020 7257 -7462 -7760 14316 4040 -20982 -2556 17766 -2129 -9391 10501
554 10501 5644 -13460 66 19270 -392 -15219 7509 9224 -15457 -3713 17467 -3385
566 -3385 -17318 3998 8748 -10773 -5104 15127 14 -17030 5985 15697 -8127 -6504 12309
579 12309 1810 -10182 5530 12126 -6691 -11044 7276 4623 -10428 105 8373 -7990 -9888
592 -9888 5724 6072 -4521 -3454 5055 655 -5067 5343 9440 -4130 -6355 3570 4295 -410 -169
607 -169 2114 -3000 -9348 394 8579 -2135 -7077 1804 350 -6376 799 9527 636 -9119 2044
622 2044 8603 -4199 -1673 12060 -7 -12732 2252 10324 -3689 -6535 5448 -901 -13772
635a3772J5377J2641k0020n463J8731l814j3046J2906R804j7550n809J8929n3
648H861j9022Q564J3941j6725p151J8891p29j7178N683J2888r789p685J4358L364
662H271j6849L188J5283q486q158J1803J732j1786J308J0820l255j0840N402P065
676E498r314j624J0997l807r208L726P697k418m567M528K759p517p4R813j725
691D764q152K944L702m059k504N506K369j0027n57J0170l093p565P442L629q666
706d097j105J0097J07r486L296R172r175n603J3138P46j2672K673Q527o260n991
721f633Q834L111j1876M34J3067n945r215J0198M279j0965J417J0866m073r768
735f269O729P567j0467l054J1491k722j0646O426O454p875l807Q385P67q267K315
$$ plain form
635 -13772 1605 14246 -5774 -11237 7494 3680 -9366 3540 13344 -4206 -10015 8914 8861
648 8861 -10161 -1597 12344 -4381 -11532 7359 6630 -10548 -4865 8023 -1766 -9451 4907 8271
662 8271 -8578 -5390 9893 1407 -6751 5052 6784 -5002 -3694 7126 3871 -6969 -1567 5498
676 5498 -3816 -5440 5557 1750 -7458 -3732 3965 1547 -3020 1508 4267 -3250 -3324 6489 4764
691 4764 -3388 -444 3258 -801 -3305 2201 4570 -5457 -6014 4156 1063 -6502 940 4569 -4097
706 -4097 -5202 4895 5002 -4484 -1188 7984 -1191 -6794 6344 7090 -5582 -2909 5618 -642 -6633
721 -6633 2201 5312 -6564 -6130 6937 992 -8223 1975 6254 -4711 -3294 7572 3499 -6269
735 -6269 460 8027 -2440 -5494 5997 3275 -7371 -945 5509 -2366 -6173 2212 2979 -5288 -2973
750b973R081n766n978Q796J820q161J652O847l288o152M334N275p038k961P881
765C369j208p643M114N046n020l197N421K588o463N8P647k627o598N793L881o611
781a450n67N407q22o275K166N685m842n031P382J086p748K350O550m248l985N276
797I34L094n807j410P885j485p446N237L995o521j747O146r25o144K020N672m474
813i76m416P125J419p478K216O375m140l636M772L213n280j864O689j406o939
828d326M563M252o278j949N726m53n227J662N182l603m436O080K543o732J304
843a692O164l373l934M078K921m807k427O058k80o917L120M836n647j907N239
858A432o1m488Q72N067k074m626M935L207o632R13N465l058l398L153K494m027
$$ plain form
750 -2973 6108 342 -5636 3160 4980 -3181 -1529 5318 2030 -4122 212 5487 -1551 -4512 3369
765 3369 2161 -5482 -1368 3678 -1342 -4539 882 3470 -2993 -2935 4712 2085 -4513 1280 5161 -1450
781 -1450 -2017 3390 2568 -3707 -1541 4144 -698 -5729 1653 2739 -5009 -2659 3891 -357 -4342 934
797 934 4028 -1779 -3189 4696 3211 -4235 1002 4997 -1524 -3271 2875 1950 -4194 -2174 3498 -976
813 -976 -5392 1733 3152 -4326 -2110 4265 125 -3511 1261 4474 -806 -2670 4019 2613 -4326
828 -4326 237 4489 -1789 -3738 1988 1535 -3692 -2030 3152 -451 -4887 1193 3736 -2996 -1692
843 -1692 4472 1099 -2835 1243 4164 -643 -3070 2988 2708 -4209 -1089 3747 -1900 -3807 1432
858 1432 1371 -3117 -2245 2822 748 -3878 1057 4264 -2368 -1455 4010 952 -2446 707 3201 -826
874h26k344N141K67o385K422M873m640k224M875J040m656N65M799j435m638L944
890G78L519n875l98N515j991m232K486L171m060k259M671O08o188K509N290m554
906a010k559N220M80m319R36M608j766m681L871L117n461p19N192k495l710L531
922B35J982l591j456M028Q4m528K324M249m111j947M605Q9l103J227K615j751
938I51l195K350K491l426j030L308j259k382J731J879j773j959J929K199k708
953h94n90M103j912k776K465J927k259j120K547K67l902Q17M250l017l299L967
969E74P61l661N46L782j379l790L074L391m216j213N215j653m312L720K725m382
985h18j683M284j41m758K050M393m938k427N816K12n001K164L308l201j880M349
$$ plain form
874 -826 -3170 1971 2238 -4147 -1725 3148 -1492 -3716 1159 2199 -2457 -1892 2907 1472 -3166 778
890 778 4297 -1578 -1976 3539 1548 -2684 -198 2973 -1087 -3346 1325 1933 -4255 -1746 3544 -1010
906 -1010 -3569 1651 2131 -2188 -1252 3356 1590 -3091 780 3897 -1564 -2283 2909 414 -3296 235
922 235 2217 -1374 -2830 1198 1282 -3246 -922 3327 -784 -2731 1874 1963 -1140 87 2702 951
938 951 -2244 106 2597 -829 -1859 1449 190 -2192 -461 1418 -355 -2314 -385 1814 -894
953 -894 -1484 2619 707 -2069 396 2323 64 -1056 1491 1758 -2144 -1327 2923 -94 -3393 574
969 574 1335 -2326 -1780 2002 623 -3167 -93 3298 -918 -2131 3084 1431 -2881 839 3564 -818
985 -818 -2501 1783 1642 -3116 -1066 3327 -1611 -4038 1778 1990 -3011 -847 2461 -740 -2620 1729
1001A729J890n143l51M586k719k075M417K99m894O12K730q86k223K349J486l881
1017b074o75M511m29k504J678N93j507J7K152M94k604j138K122m40j059J553L48
1034A038k121n94P55J908j290p45J854n94j850J939J761k600o92K263N91k087
1050d64J92K176k040k792L361J931m288M55K650k003j424L144J198l437p77M061
1066A943p27l331L473J212m417K28M335j162l209J752J301l185m14M546o50m506
1082b811J831K020k612P43L176j226l071R58K659j002j041K115p58l078J758J838
1098A499j013j274M11n7r27M83J996j33k558O21J182n78R74O09m44r04q90J870
1116H67N56j841K65P22q40p90J493N46j929n66J726O48k143R18J723k469j79K765
$$ plain form
1001 1729 3619 -1524 -1875 2711 -8 -2083 2334 2633 -2261 -1649 1081 195 -2028 321 1807 -2074
1017 -2074 -2749 1762 1333 -1171 507 1100 -407 -390 1762 2256 -348 -1486 636 196 -863 690 1038
1034 1038 -1083 -1677 -922 986 -304 -1049 805 211 -1639 300 2061 -539 -1231 1032 1623 -464
1050 -464 -272 1904 -136 -2928 433 2364 -1924 -1469 1181 -822 -2246 898 2096 -1341 -2118 1943
1066 1943 1216 -2115 1358 2570 -1847 -1619 2716 1554 -1655 97 1398 -1787 -2201 2345 1695 -2811
1082 -2811 -980 1040 -1572 -829 2347 1121 -1950 -992 1667 665 -376 1739 981 -2097 -339 1499
1098 1499 486 -788 -377 -434 -1361 -878 1118 985 -1573 -952 230 -348 626 1235 791 -113 -1003 867
1116 867 1423 -418 -153 569 -271 -1061 432 978 -951 -1517 209 857 -1286 -368 1355 -1114 -1293 1472
1134A472K1k551P56J892j490j280K861J63l995P79L214k007j619K758k91k879
1150b196P20L502j192k373K071P03k905J018L599k160k543K157Q16k207M48K258
1166A716j300k777J923K053k506j72J950j040j709J631J703r66j033Q45K58j380
1182h04R90J502j401j244J253K90q47j18O35j1j592N51J844j158q34J135J50o89
1200c48J49J080j01j350M62J502j180r69J633j66j742M89J522j165j121J275Q33
1217H03j945L55K326j258j713J684R03j626N3J357j70k045J044K098k071j085
1233a290K109n11j821J174J239j430p96J376Q28j941O79J889j259j191J544M96
1249A095j407J59R21m90j194P95R25j423o30J675k78j048J030N50q38n76Q02N74
$$ plain form
1134 1472 1493 -1058 -302 1590 100 -1180 1681 1844 -2151 -1372 1842 -165 -1784 974 683 -2196
1150 -2196 -1476 2026 834 -1539 532 1235 -1670 -652 2947 787 -1756 401 1217 -990 -542 1716
1166 1716 416 -2361 -438 1615 -891 -1063 887 -153 -1862 -231 1472 506 -527 318 576 -804
1182 -804 186 1688 287 -957 296 586 -261 -379 256 245 -1347 -796 1048 -110 -944 191 341 -348
1200 -348 -199 881 780 -570 -108 1394 214 -755 878 712 -1030 -541 981 -184 -1305 -30 803
1217 803 -1142 -787 1539 281 -1432 252 1155 -471 -418 939 769 -1276 -232 1866 -205 -1290
1233 -1290 819 308 -1513 -339 900 -530 -1326 50 878 -1063 -384 1505 246 -945 599 1095
1249 1095 -312 -153 768 278 -916 -121 804 -619 -1249 426 148 -900 130 680 -158 -734 68 642
1267F42q56k16J354n85r27J161K85j013l84P69O3j130O92Q74j006p43J336N3j456
1286a087Q49O30l01m05L47J087j062p68J674Q9j995J175K65o68k18M45J80o92
1304d55j80J071n64p46J179N60j453J87J219o31q20Q90O84o93q41J161j15j090
1322f37J88J111p85o97R79No14L7R45k59q32Q54N05j341K46J079n10n24J89P18
1342F57o63o16J016r5j001M34P36r19l12R93j91m33P9R10m53o67P81K93p90J70
1362g1M44K3o70L67L54o78q06J188K17j135M07Q25n06l54O79K88n20o59J145k12
1382C26o92N80M49q03j82N87j04q95N81L57j40q30P12L20q46K43R53m72o21R27
1402D50O2m12m98Q37mr33M23M64n85k90P75k6r38K54L56J81o38O91L78p97J34
$$ plain form
1267 642 -214 -430 924 339 -588 573 858 -155 -539 230 293 -837 -145 729 -277 -1020 316 369 -1087
1286 -1087 -238 392 91 -314 33 1120 58 -710 964 1053 -942 233 498 -170 -388 57 237 -455
1304 -455 -635 436 -128 -874 305 865 -588 -401 818 187 -633 257 941 248 -593 568 453 -637
1322 -637 -449 662 -123 -820 159 164 -450 -413 532 273 -559 295 800 -541 -295 784 274 -250 -61 657
1342 657 -6 -622 394 299 -702 -268 468 -451 -763 230 39 -394 -315 595 142 -525 256 549 -241 -71
1362 -71 373 396 -274 93 447 -231 -1037 151 368 -767 -360 465 -41 -395 284 572 52 -607 538 326
1382 326 -366 214 663 -140 -322 265 161 -734 -153 204 64 -766 -54 266 -580 -337 616 144 -477 450
1402 450 512 100 -398 439 435 -498 -75 389 -196 -486 289 263 -675 -421 -65 116 -522 169 547 -250 -116
1423a16Q06n06o03P05P3m34l88N92j30n33N45K34m77k77P77L9p58L36K68k32m54
1444e33N57N01m66k04M31J9n54K77R0j3k97J12J64k50l60Q56l18o20M25M22k98
1465e9j21J85J33k59n7R46p08n41N66K49m74J92N36n51o07N65L18n39j24Q75n81
1486e6n77P25N51j009j66Q89k72l67L35N18q04k58Q70l27n93O25R6o97J10N18
1506A11K91p25J41N83p81K56O76l00n33M28N7j28k38K62K6j28k57M93j11j08k09
1527a94K45j03l07K40R1N19n99L0L89k28j05K58J17n88m6P80k29q85L36L55l21
1548b45Q7P12n45o61O88K22l49k06M91q7l72J90P30p77j65N09m30j31L64N41n67
1569an51P63o2p39P20N24j031K6Q21k29m05K43K43o39r1R41k32q05P13o8l32L8
$$ plain form
1423 -116 690 184 -419 286 359 -75 -463 129 -1 -534 11 245 -232 -509 268 307 -451 -115 153 -79 -533
1444 -533 24 525 59 -145 286 305 -249 28 118 105 -192 -80 84 -166 -526 330 12 -608 -183 239 -59
1465 -59 -180 5 138 -121 -178 768 60 -481 85 334 -140 52 588 37 -570 -5 313 -226 -350 525 -56
1486 -56 -633 92 643 -366 -532 357 85 -282 53 571 -233 -491 379 52 -541 84 180 -517 -407 111
1506 111 402 -323 -182 401 -380 -124 552 252 -281 147 204 76 -162 100 126 -2 -259 234 123 15 -194
1527 -194 51 -52 -359 -119 -28 491 -108 -78 311 83 -22 236 353 -235 -281 499 270 -615 -279 76 -245
1548 -245 -158 554 9 -652 36 258 -91 -297 194 107 -265 -75 655 -122 -287 222 -208 -339 25 566 -1
1569 -1 -552 211 149 -590 130 654 -377 -351 470 241 -164 79 322 -317 -408 533 301 -504 209 141 -191 -153
1591a53N31j11o02P7M06k07k8L38j42k36K16k9j40j28J21L59l69K66k2j81j34
1612a68Q1q9L10J16j95k02j66L90k61N74k90j01lJ46p4J68J31l39n50N68L26l30
1634D2l5J08k02m92N52K30k50k03K91l3l72L28O09n25p2K38l77k04O27M4m63l31
1656d90M15M23m75J38L48m39j83P64l11j71j27J89k1k06M32L1m50J09K41l87K77
1677A07K9o9k14LM1k09K50R3m7Q2j4K48j11j05p5p0L54k07M7Ok66J77j2K25n30
1702b67o5J82K01q4P6j57R9n1K53N2k86N0K22l15R3K52j72k36K89J35k74k41L54
1725A10Q6n97J39M02n10J09M21k7l33%K63L9l07K4L98m29N6L66m2l58j00L84k16
1748a22%R5n1k71J37L55k56j36M18l12j23J82L41k07k11j7O06m15j08J23l8P1
$$ plain form
1591 -153 378 267 -335 -258 148 -59 -87 251 109 -127 89 60 -80 -208 -87 272 -97 169 147 -34 -168
1612 -168 -87 -176 134 250 55 -147 -313 77 -184 390 100 -1 -4 142 68 236 367 28 -522 46 372 42
1634 42 7 115 -87 -579 -27 203 -47 -250 41 8 -364 -36 573 48 -24 214 -163 -367 260 304 -159 -490
1656 -490 -75 348 -127 11 359 -80 -263 501 190 19 -108 81 60 -146 286 317 -133 -24 217 -170 107
1677 107 136 67 -147 -144 -103 -312 -62 31 -16 66 52 300 189 84 9 -61 293 86 133 139 -127 50 38 263 -267
1702 -267 -332 -150 51 -33 43 -114 -15 -66 187 239 -47 3 225 -90 3 255 83 -153 136 271 -3 -244 110
1725 110 196 -401 -262 140 -370 -261 160 133 -200 -200 63 102 -205 -181 217 -212 -156 210 168 -190 -290 94 -122
1748 -122 -122 -27 -78 -349 -212 143 -113 -249 169 -143 -266 -84 257 50 -161 -178 428 13 -95 28 -10 61
1770F1j74M8k65L61j43K8p8J09J29J58k27J2L8j53O7R0K35n28J36R9k16J41J32
1793F0l8p4l1K35r4q5m9j3j34K56n3J33j33p4J88J26k82k0K81k30J45J05l02J99
1817A16j23N6j36o6K78j67J5R8j18Q9N2J5r2j42J25K06j37l65J93J35mK2K08l58
1841a00K95O4l21r0KJ71j15l2K01L72l28j93L53j18n89M14Q4l00Q5J38L52o96
1863c51M47L09k75q9mk2j03J08l5J05l21L77q8Rl40L50j10j7M10j53j25o9P3J34
1887B20m95J07K48k26PK99j54L4j75J59j04m6L08j57M5k40M5j32K92J13o1j89
1909a02J20O9J59k20j87o3K15l1J12N7j04jj87M92k56J02j34l42L39l37M13l66
1931b52M11j67jl96M57Q0m6Q6J77k9l59o8M06k43k70L95j62k37J62K34K80m41
$$ plain form
1770 61 -113 -65 -330 31 -112 -84 -162 -53 76 234 7 19 57 -96 -29 61 296 -232 -96 3 -213 -72 60
1793 60 22 -52 -83 152 58 -27 -76 -89 -223 33 -20 113 -20 -94 94 220 -62 -82 199 -31 114 219 -83 116
1817 116 -7 49 -87 -153 125 -42 -27 71 -47 42 94 109 17 -125 0 206 69 -296 -103 32 28 50 258 -100
1841 -100 195 259 -62 -152 -150 21 -94 -126 75 447 119 -74 279 161 -428 -14 70 -230 -145 -7 345 -351
1863 -351 96 405 130 41 37 15 -88 20 -15 90 -231 146 58 67 -273 77 -33 -50 360 207 82 13 86 220
1887 220 -275 -168 80 -146 -139 160 6 40 -135 24 -80 -126 182 25 70 -170 -125 -257 35 148 87 -102
1909 -102 18 87 246 26 -161 -224 -9 -40 72 129 25 24 -163 329 73 175 41 -301 38 -299 114 -252
1931 -252 159 -8 -9 -405 52 132 86 172 349 320 -39 -107 299 56 -214 181 19 -218 -56 178 458 17
1953A7j40K04k61N6L8o6J29J88k56K49k51O0O4k92L01p3R7k02J26J59q2j66J84
1976H3K31n51O7K32o7j79L47j10j36J63N8k02j64L58J34n8j45r3kK37k1m60L96
1999A18j30J29l3o1k0P9K50j36k21O9j13J1O1J37j55J31j60k46N12k70J43Q9k6
2022A58k38J18J29J46m21j23K80N9j81J35k04k3L92j54J82j48j65n9o1K78q0m9
2044b9O1j11L8J12K73m17J34J56l69Q4K9l81M56J12rl18J92j80K18j49L0j21k1
2067b10J86j48oK99j66O2j75l4L7J2K02K71l57j59L30r9j39l1K09J13j67qk3K7
2091B6K60l09J82k84Q9M8J93j95k0L8m4K35j29o6k85L70k08k78N22j46j48K44
2113I5k27J37j82K29k79L35k25K37o0LMj09L2O9l15J36R3nk15K73K5JM8k11mJ60
$$ plain form
1953 17 -123 81 -180 -124 -86 -152 -23 165 -91 158 -93 -33 31 -261 40 -33 64 -138 -12 147 65 -101 83
1976 83 314 -237 -170 62 -5 -184 163 53 -83 80 138 -64 -228 130 264 206 61 -32 -34 203 182 -278 118
1999 118 -12 117 84 23 3 82 332 196 -25 44 -69 -58 3 140 -15 116 -44 -290 222 -48 95 184 158
2022 158 -80 38 167 313 -108 -231 49 108 -73 62 -142 -165 227 73 255 107 -58 -117 -178 100 20 -29
2044 -29 32 -79 -41 71 344 -73 61 217 -152 -68 -39 -420 36 148 139 -179 13 -167 51 -98 -68 -189 -210
2067 -210 -24 -172 -178 121 -45 17 -158 -192 -155 -143 59 330 -27 -186 144 45 -94 -125 84 197 30 22 -1 26
2091 26 286 -23 159 -125 -36 12 205 10 -10 28 -16 219 90 24 -261 109 -99 -377 145 -1 -149 95
2113 95 -132 5 -177 52 -227 108 -117 120 60 63 67 -42 -10 59 -256 -120 -27 -32 -247 26 51 52 100 -111 -115 45
2139D5K84k09l13K97k84M69l79m1K08k17K04J16m37Q4K30j91j36QK49k64L36Q3
2161A42O3L5k14J0n7j98K12n6j90J75LJ07L16k93k16K10k3K4q1m55L01J01j07
2184a91J66J15K19k31J57k49n9J14q7l1K31k8j16l95N01N1k26J71k55P8j49J75
2206c9j84O0L35j91J36j78k8L23o3J1j43j05l2J02J14k19M3r2M0N7J06M3M8J14
2230B58m67Q7L3K52j59J34j16Q2j69j50K95j13j45L03o1p3K9J02Qq1k36J68k04
2253b23J69O9j32K75j92m2J55%J59m68M49k20l50O8J54pk5Rm6j4K03J42q4j00
2277e1j45K12k97K83k34M11l10oo6O3r3J04qO7J6M7M66o85J85n9q9J87o4K47j18
2302F3J3qj1J60k1J9j99r7J3J92k33J20r5K25k96J61l24J87K87l08K60l6j18J30
$$ plain form
2139 45 329 120 -193 104 -180 289 -90 -131 77 -140 64 180 -257 -173 57 -134 -270 -262 -13 -277 59 142
2161 142 205 240 26 36 -21 -219 -7 -63 -253 -78 -75 32 348 55 -161 49 26 50 -31 -486 -185 -84 -191
2184 -191 -25 90 309 78 235 -14 -73 41 -46 -77 154 126 10 -385 116 167 -59 112 -143 -65 -214 -39
2206 -39 -223 -163 172 -19 117 -61 -89 234 171 182 39 -66 -98 4 118 -101 -58 -150 -110 -53 53 96 144 258
2230 258 -209 -122 -89 163 4 138 22 104 -65 -215 80 -33 -178 125 64 -9 20 122 130 49 -187 -19 -223
2253 -223 -54 15 -117 158 -34 -76 79 79 238 -230 219 -1 -351 -283 -129 -136 -161 -152 -198 -212 -9 133 49 -51
2277 -51 -196 16 -281 2 -232 179 -131 -137 -203 -140 -233 -129 -137 -70 -54 -7 459 -226 -41 -100 -189 -2 -66 181 63
2302 63 76 68 57 217 196 215 16 -81 -68 124 -109 11 -84 141 -155 6 -318 -131 156 -152 108 72 -46 84
2326H4j12j48L23Jk30Rl2K74J9k91K38J35k33r1j18K95j37oL6L71j23j37p2r0
2350c5J79j31J47j74j44J66J65r9L4k82J34o2J35l1NJ48k30K46mr3j83m1N8J19
2374B7MM2Jk00N5j64L16l10L64J17q9j45j40L05p9j63K11k9k68L82m65K63J57
2397A92m5l31J40J7L9j01J73j81j16R6M8J8oo5K75j6k05R6J5L3J11o2m0j15j62
2422a92J61J30J83o50J43j6J18J01J47j2L1j49q4l6J98J44m6l10K35j60K95J1
2444B42l04R8J17l15J75M6j25JK2j27N0M6N6R6k50L13j13J41k60J3K00J16k08
2467C0m1j83J46J67J83m58r0K84p6L1j57L13l1j44N7L3J2p9Q3o8r2L02l1Qk90
2492i1j31K26n9M7j06K1pj12K59j33K17l2J07j60R4l3k14R1N9j10J81q9p2J37
$$ plain form
2326 84 -28 -176 147 148 -82 -73 -105 169 188 -103 135 270 37 -54 -172 123 -14 -20 16 387 264 127 55 -35
2350 -35 144 13 160 -14 -158 8 173 74 108 -174 -40 -102 33 2 7 155 -75 171 167 74 -109 -150 -92 27
2374 27 31 73 74 -126 -71 -235 81 -229 135 252 163 18 -122 183 104 -59 152 123 -145 237 -228 35 192
2397 192 147 -184 -44 -27 12 -89 84 -97 -213 -117 -69 -51 -57 -122 153 137 -68 28 43 76 187 125 85 -30 -192
2422 -192 -31 99 282 -368 -225 -241 -123 -22 125 113 144 -5 -89 -125 73 217 171 -139 96 -64 231 242
2444 242 -62 36 153 -162 13 59 -66 -65 -43 -170 -120 -74 -18 78 -172 141 28 169 -91 -78 122 238 30
2467 30 -11 -194 -48 119 302 -156 -246 38 -38 -7 -164 149 118 -26 31 64 76 -3 80 12 -80 222 191 199 -91
2492 -91 -222 4 -55 -8 -114 -93 -100 -212 47 -86 131 99 206 46 140 107 -107 -16 43 -67 114 25 -47 90
2516I0J41l43n4L97J71m70J03j29K63j25m2J83k69J02r2J45p9r6J68j48R4l3J5
2539hk38Q8J39k27M88r0l8L6k94L77N0k28j1O3l08J89J02k75K59J32l82j5K23
2562C2j19j81L17j02l2K1P0k50J52K25j18j1j06J48j50P2J76j65Pj55K49p9j99
2585a98J02L04p4j1n8q5O0j29K4M0J94k02L3j63J93J14M3k52L62k10j16J13j22
2608c8J52m64L12j28L45l22O7o1K69j54Q6k4o4M8J10j91RJ69j82J29q4M2K25l64
2632a13j37L83M30m31j20J24L8j00l4j33j48L87l40K89q9%n3l09K94K14m82L05
2654b5M3Nl24K77J70k38k2J48J99k33l5J67k94J80j30J81k90L68J42m03j42K27
2676b9n1J81M0l24L95j89j82L56k22L4O0k88K29J95k30J79j55R9J35n05J37j33
$$ plain form
2516 90 231 -112 -166 231 402 -68 35 -94 169 44 2 185 -84 18 -74 71 -8 -104 64 -84 10 -23 -8
2539 -8 -246 -158 -19 -246 242 152 114 150 -144 233 283 55 44 107 -201 -12 90 -185 74 206 -176 -191 32
2562 32 -87 -268 49 -53 -85 -64 6 -244 -92 133 15 4 -102 46 -104 -32 144 -21 -14 -169 80 1 -198
2585 -198 -96 208 134 123 65 -20 40 -89 -65 -25 169 -33 0 -163 30 144 187 -65 297 87 -29 84 -38
2608 -38 114 -350 -38 -166 179 -143 -76 -137 132 -22 64 40 -24 24 134 -57 -48 121 -61 68 -16 26 251 -113
2632 -113 -250 133 563 132 12 136 174 74 40 -93 -241 146 -194 95 6 6 -47 -356 -62 152 -330 -25
2654 -25 18 23 -301 -24 146 -92 -114 34 233 0 -35 132 -162 18 -112 69 -221 147 289 -114 -256 -29
2676 -29 -80 101 141 -183 212 23 -159 197 -25 9 69 -219 10 205 -25 154 -1 98 233 -272 -135 -268
2698b68L80k31L14o7k2q0l2j59M1K29L0l22J19oL1K44m34L97j50m41L14oJ26J1
2722A8J49k18j54J81L3l2R2K16j45k8J17l07J27j27J79k73J81J55j38j99R0P9
2744dn4j7l3J07j92pK92j3j85qM0J94k1J74l88l49O58l32J01Lj22N6m2J92j46
2769i6L91l97k0l4K43k52J26j84J05L0L10j45Q6k43j70J97j35P6J82j2l9k38K60
2792D1K07k31o5K23j32O5p7no2o2l5K12k6P2l38M65j45n35M16p7m3K50j47P7j60
2817a12k6J59M4J26j12k61l3K41Q0J49n14L28j42N1qJ13J49m40K70J8K11j18P0
2840B43m78j5K21P1J76l41j21K54mj22J38J62k60M2q7K78k8p7J98j02p3j29j18
2863a72J3J21j24P2J64oj42P4j83N6K20K7j31J2K04k94J20l5K0J31k41R4O0J26
$$ plain form
2698 -268 112 -119 195 128 106 26 -6 -165 -124 105 135 -187 -68 -74 -43 201 -233 164 14 -427 -113 -119 7 18
2722 18 167 -51 -205 -24 9 -23 69 285 140 112 229 -78 49 -78 101 -172 9 164 26 -173 -83 -4
2744 -4 -58 -75 -108 -1 -193 -200 92 79 -106 -114 -74 120 99 273 -115 -464 194 -138 -37 -34 -156 -100 -142 50 -96
2769 -96 295 -102 -122 -156 87 -165 -39 -223 -118 -88 222 77 163 -80 -250 -53 -188 -112 70 58 19 -219 41
2792 41 248 17 -48 175 43 108 31 26 -36 -98 -133 79 53 125 -213 252 107 -428 -12 -89 -132 118 -29 48 -112
2817 -112 -138 21 65 191 79 -182 -215 26 106 255 -259 69 -73 -22 -30 83 232 -208 62 80 291 173 243
2840 243 -235 -250 -29 42 218 -123 -244 10 6 -116 22 184 -76 -34 -121 157 129 52 250 148 75 -54 -172
2863 -172 -159 -38 -162 -90 74 68 -74 0 -183 -127 93 120 -11 1 205 -89 31 -4 16 147 -94 0 60 186
2887A86l89J37R2P9j00k8L4J70j55j98M09k57l69K09M5K22k72Q6l9O6p9J61j86
2910a76J92j39J89k71K48k45J86K00R1l26o3J95j63R3l04M27L6j07J77l72m6K32
2932E4K40j93k5j39J11J12l63L23P6m23J92M2k64L12L7k38O7J20j19k3K27j11
2954A5k0J29k39R3O1m8m4J62o6q0k96L47N2JK65l31j43J94j75P0K54n2mK0j80
2979a5j52J73K19k41L4M0J67l83O24j91j77j35J6L7o5j22J07Q9l1j68Q4J88K88
3002C86n35N9K73m1j0q0J12k56M44j39j87j9j69K85j08J75j12n5q6J02r4K56k39
3025c8Kp8J7lJ48j6O7Jp6j82K9R5n3J96L3k86J49K01j69k8J46p1j88K23O8o6k57
3052a36K04k42O2M8J10j24p0K75j64j06L29l10j23J45K54j83M5J03k03K58l21
$$ plain form
2887 186 -203 -66 26 105 5 -23 11 181 26 -172 237 -20 -389 -180 -135 87 -185 -99 -138 -72 -151 10 -176
2910 -176 16 -123 66 -205 43 -202 -16 184 275 -51 -114 81 -82 11 -293 134 170 63 240 -132 -178 54
2932 54 294 101 76 -63 48 160 -203 120 196 -227 -35 7 -257 55 92 -146 -79 41 -78 -101 126 15
2954 15 -5 124 -115 -22 39 -9 -53 109 43 -37 -333 14 66 67 332 1 -142 52 -123 -53 201 149 145 165 -15
2979 -15 -167 6 225 -16 18 58 225 -158 466 275 98 -37 -21 16 -49 -171 -64 25 -6 -174 -90 98 386
3002 386 -149 -90 183 142 132 52 164 -92 352 213 26 7 -162 123 15 190 78 23 -63 39 -55 201 -38
3025 -38 -36 -114 -97 -100 48 32 99 100 24 -158 -129 -34 -87 109 142 -144 5 206 37 9 155 84 -104 119 187 121 -136
3052 -136 68 -174 -112 -64 46 -78 -148 127 -37 -143 186 -124 -247 -102 152 -31 14 117 -86 172 -149
3073a49Q3R7O3L7j13j27J61J3j68O5l9K59k39L22j15l26J69rj73K69J88l88r1
3096b11K06j21J38r7o1L19q2k23L20n4k80L84k4j36m3J05j3j13k3K0N8k7l04K05
3120e7j63K12j0j86M6J22M25k26j71O9o8K54k56n6M5j9L5R0j83K73l45K78l28
3143b19J98N7n7k57K82q5J8K67M8j86k21K31m6j12K70m14J32j60K72J20l59K19
3165bK3j5l01M64j57k97J09K81k75J30rK82m21J3K2K97J78l62j26J0L34m7m1m6
3189D4J54k65o8J03J65j12LJ14Q6m71L49j73k40K22m7J06K6l35M27k61J79L89
3211C95m03J23K52m34J58J73k29Rj24J6J29M4j16J20P7j57mj22J32j90j51N16
3233B14o29L12K00j4L5n3j17L4K07n37J76K7K79k82K76k26R3j3K05m35K63N0J41
$$ plain form
3073 -149 -66 31 94 131 18 -109 52 65 -103 -38 -77 182 -57 265 150 -176 -7 -16 -189 80 268 -120 -211
3096 -211 -5 -126 12 -85 -146 173 91 -132 188 134 -146 238 214 78 35 140 127 14 -9 11 69 42 -262 -57
3120 -57 -220 -8 -18 -204 -158 -36 389 163 -8 61 -7 247 -9 -65 -20 -39 -4 86 -97 176 -169 109 -219
3143 -219 -21 36 -21 -278 4 -81 -63 204 252 66 -155 76 30 -82 188 -226 -94 -254 18 138 -221 -2
3165 -2 21 6 -295 169 12 -285 -176 105 -170 -40 -49 233 -188 -175 -153 144 322 -40 -166 -156 178 131 90 44
3189 44 198 -67 -135 -32 133 21 24 138 224 -247 102 -71 -311 -89 -136 -30 -4 -339 88 -173 6 395
3211 395 -8 115 367 -67 91 264 35 44 -80 -64 65 109 -7 113 190 33 29 -93 39 -151 -302 214
3233 214 -415 -103 97 83 118 65 -52 -18 189 -348 -172 -145 134 -148 128 -98 -5 -18 187 -248 15 65 206
3256B06q3j04K05k04k78L31J46k49k8K9K00l04L02j74o1J47p5l03R0J59NK61l51
3279a33J20K20J02J2k68j93K48j78l9J22k93M26j57J53o8k20j46K57L78m74J92
3300F1k45km4J73N7r7K78k28JO9n3k26O9K29l17N52n54K10j5J42Q4k07K99q6k96
3325a46J58j46NL6MR8r0K28l73K47l37L82r0p8m3LR8J20m6j58K13j46j70J37j05
3350a99M15j58R2J89l00J97m12Q8j30R9L01l41J51j42m8M3M80n85O2J96j13J39
3372B4l66L33J15k93J99l10L94o8J18k95j06K36J6J77j02j33R2J8k5Q3l41j80
3394d14K96K25k49Q6o4J00j18K06j6j78R8Q8p2m5k08L63k43j85L48J08l71QM75
3417B38j61K4m8J12k19J85j66J00o8L09k54O3k57m6L95m28L03j52j12L02J03j
$$ plain form
3256 206 123 19 224 20 -258 73 219 -30 -58 -29 171 -133 169 -5 -66 81 6 -297 -207 -48 -43 218 -133
3279 -133 -13 207 309 321 53 -140 108 -70 -109 13 -280 146 -11 142 74 -146 -292 -35 343 -131 61
3300 61 -184 -186 -230 -57 0 -97 181 -47 -46 23 -30 -256 -187 42 -275 277 -277 -67 -82 60 144 -63 236 150 -146
3325 -146 12 -134 -129 -93 -89 9 -81 147 -226 21 -316 66 -24 -102 -145 -142 -44 76 30 -128 85 -61 -231 -94 -199
3350 -199 216 58 150 339 39 236 -176 -88 -218 -119 182 -159 -8 -150 -198 -155 325 -260 -198 -2 -115 24
3372 24 -342 -9 106 -187 12 -298 96 28 146 -149 -255 -19 -3 174 72 -61 31 49 24 107 -234 -414
3394 -414 -118 107 -142 -56 -120 -20 -138 68 52 -126 -28 60 -12 -57 -265 98 -145 -330 18 126 -245 -237 238
3417 238 77 101 53 165 -54 131 -35 65 -3 306 52 115 -142 -188 207 -221 82 -70 -182 120 223 222
3439B22q2k78L9M70l89l3J11j60o8J47m3K20j36R7k15j16M75k79J03k6%k63K17
3462A3q2R2o9K65j60j51R5J23p1o5o6N4j46p6K34K41o3j60L5ok3j03N13n12r4
3487a82J70k74K70N2n9M8j63N5m8J60j11l7J69M8j58M4L6k12L04j47n5J43j57
3510a04J85k1K3j6k50J71J77j81j5O3Q3K12j54j59o4r5l8n8K04K24m64J08J46
3533b3q4k4K24O7o5k89N74l83j62J93k3KkQ8N7ok18KJ75J9j64p5r4J53O8P8K26
3560C14k34j46n9j15j19L26r6K25l61K1K64j65J04O0l5j39J5J99J47m89K33j98
3582b48R1mL4J24k72R5M31m05K47J30j78j49N2o7L18j26l5j2l02K36J05j34Q6
3605A7J23j10r7j35n0L50m05L71K28l82qJ79K7l29K83O0J08j44J69m30L03r9r3
$$ plain form
3439 222 140 -138 -99 371 -18 -51 60 -100 -168 -21 -64 156 20 117 -98 -214 261 -18 85 59 59 -204 13
3462 13 -69 23 -46 219 59 -92 3 126 55 -10 -76 -22 -168 -244 -10 231 168 8 43 37 14 -89 424 -88 -182
3487 -182 -12 -286 -16 36 -23 25 -138 -83 -131 29 -82 -119 50 98 -60 -16 20 -192 112 -35 -90 53 -104
3510 -104 81 60 83 67 -183 -12 165 -16 -31 32 115 327 173 14 -50 -145 -183 -241 -37 187 -277 -169 -23
3533 -23 -107 -131 93 160 95 -194 380 -3 -165 28 5 7 5 93 150 144 -74 -72 103 122 -42 -117 -211 -58 10 88 314
3560 314 80 -66 -125 -240 -359 -33 -129 96 -265 -244 20 -145 -41 19 -16 -155 -140 59 206 -283 -50 -248
3582 -248 -157 -161 -127 -3 -275 -180 251 -154 93 223 45 -104 -52 -119 199 73 38 26 -276 -40 65 -69 17
3605 17 140 30 -67 -202 -252 98 -307 64 292 -90 -98 81 108 -221 62 122 230 86 255 -175 128 29 -64
3628f4l6j61m3L91j63J30j69M7k28L57k57K48q5l03J13K27K80n00J85J6n9l0j48
3651b52K20Q6K21l97M8J9J36K22m10J25J59j37n0O6j40j2O4m2J54j06j63J38m7
3674i8o0l12M53J69j73O0m3J61j37k68L69k03m2J01J31L9j50L84n57L38n6l12
3696b06K31m8J62j30q8K84l43J43n5J38k77J52L8j11L05j32q9N1k11K68kk06J56
3719C0l98K24J39q9Q4K9Q1p6j69L36j35j76J52R8k02R0j79L86m23J93J57j46k15
3742b09k7K07Kk0J25PJ75m18lK63K11k29l5r6J23k09MJ44j51M10j55k97K80k81
3766a79J04P2J8N3r0m6J93l31L20l83K43J45j76J17j08L1J26j69j60L47j63J35
3788I9k9rk3Mj72K13L7r4K1o9m2K04j32Q0j42L2J4K66l85K78k0l56K03k22P6l9
$$ plain form
3628 -64 -100 -261 -304 87 -76 54 -115 -68 -296 61 -196 52 -33 -336 -223 4 284 -216 -31 -15 -74 -104 -252
3651 -252 -32 54 275 -122 -74 -55 81 303 -107 18 177 40 -10 56 -84 -96 -32 -74 80 -26 -189 -51 -98
3674 -98 -158 -470 -17 152 -21 39 -4 157 20 -248 121 -82 -124 -23 108 147 -3 381 -176 162 106 -206
3696 -206 25 -23 139 9 -79 205 -138 5 -50 88 -189 -37 1 -110 195 63 -26 25 -186 82 80 -126 30
3719 30 -368 -144 -5 -94 -10 19 100 24 -145 191 56 -120 32 130 -72 18 -161 225 -198 -5 152 6 -209
3742 -209 -236 -29 -27 -47 78 85 260 -158 -161 102 313 84 49 -47 76 -133 -129 15 -136 274 119 -178 102 -179
3766 -179 -75 -3 15 68 -22 -68 125 -206 114 -269 -26 119 -57 60 -48 -17 109 -60 -220 127 -36 99
3788 99 70 61 38 42 -130 83 120 26 47 -22 -64 140 8 88 -54 -22 -8 258 -127 151 131 -225 -22 -244 -168 -207
3814b07M6j0M10k85J99R9j94M1l74K24k4J65j44J70k50r1L50k61J07o2K00m86
3836c77M35L23n09L03j49L64l24j07o0J16k6K12j98J46l69L16k6k40L98j07M9
3857A70MJ0m05L7L19j82P3k2j22J58l69J74J38o2J46l2K24Jk65N1j94R7J77k90
3881a64K80r7Q7j67L12l73k40J74o4J45K58L8q5k23K54l23K34m2k03L07l6K7o7
3904C2K07m68J83K6K68l14j4J72J5R9k09N1J85k11l05M09j12k63K5J91j7J58j21
3927a3j29n0J61p1J28j25k9n0K25rj88j87L58lj51J18J27J25p4m16L49l22J09
3950a17J63j39j59K58j7q6J97l6R9n5k31M4L4L38k56m01L34J7L8J02l70L01J12
3973A70l56K46O1n7o3LJ72j36P5l10J05Qo1N06k99R5j05P5Q6k12J75k25P5M7Q5
$$ plain form
3814 -207 -161 -171 239 -46 153 252 58 99 -275 -51 -75 90 -54 116 -134 -225 125 -136 -29 -91 109 -377
3836 -377 58 381 -128 175 26 390 66 -41 -101 15 -11 201 3 149 -220 96 70 -170 228 121 170
3857 170 174 184 -221 -184 135 -47 26 4 -118 40 -329 -155 -17 -79 67 35 259 260 -5 46 -148 -51 126 -164
3881 -164 116 19 106 -61 251 -122 -362 -188 -252 -107 151 189 104 -119 135 -188 46 4 -199 108 72 99 32
3904 32 239 -229 -46 -20 248 -66 -80 92 107 206 -3 48 233 22 -283 126 14 -249 -224 -33 -50 108 -13
3927 -13 -142 -192 -31 -102 26 -99 -128 -178 47 38 -150 -337 21 18 -133 -15 112 237 163 -253 96 -226 -117
3950 -117 46 -93 -252 6 -11 -97 100 64 163 108 -123 -79 -45 293 37 -364 -30 -13 25 127 -243 58 170
3973 170 -186 60 121 64 1 4 176 40 115 -195 -90 -82 -143 363 64 159 54 129 215 3 178 -47 28 75 160
3998A60k97O5J39j14k5M09j32l95M1j24L99k79P9K88k12k41L0O5J4P8O4K61l69
4021i6o3L32o4k66R7j04n2K57j75j91J33K0J80r0j19K15Q6Ok15k16L43l2P1j10
4045e3P6j52J68j94Q4J85k67L03J8r7r7J44n0J18J10k35j21JL2M1P8l56K52j06
4069a18N0J81J40l11L9o5J65q6m2J64j32K04J12q0l12K24J14n90O29k04k13Q9
4091d2J6J22J4M2l75L10j93lJ20J63l42K37rj26J35qj5k06J12j56J68K08o0j01
4115A1Q8j08J25N6l23K89j08N7k16J86k27J0J65o2L5j67J68j90Q8J41n7j63L02
4138A00J56k64j16J14J2L8k17K53J36k07J04j85q3J1rlk7J64Mj8K94j90M0m8Q2
4163A41l34K71j24Jp0J23Q7j71P0P2P2j08j65j8K91k03J33k01L32m7l95K09j42
$$ plain form
3998 160 -137 -72 67 -47 -72 337 205 -190 -149 -273 126 -153 -74 214 2 -239 -209 -144 -130 -52 12 273 -96
4021 -96 -159 173 109 -157 -60 -164 -216 41 -134 -325 -192 -172 8 -82 -201 14 100 106 -109 -325 18 -14 57 -53
4045 -53 23 -129 39 -155 -71 114 -153 150 168 71 -26 118 68 186 296 61 -60 -59 -27 14 92 -264 -12 -118
4069 -118 -68 113 253 -58 -19 -84 81 -5 -47 117 -15 189 301 221 -91 133 247 -343 286 82 -131 -42
4091 -42 -26 96 110 152 -223 87 -106 -109 11 174 -168 69 60 -66 69 61 46 -160 -48 -204 -36 172 112 11
4115 11 99 -9 116 172 -151 138 30 87 -129 57 -170 -160 5 -57 -22 -189 -21 -211 -123 18 -39 -202 100
4138 100 256 -8 -124 -10 2 40 -177 76 212 5 109 -76 -159 -148 -157 -160 -187 -23 -19 -37 257 67 107 59 141
4163 141 -193 78 -46 -45 -115 8 95 -76 -6 66 138 30 -135 -153 138 -65 68 -133 199 152 -243 -34 -176
4186a76J49k41N73k11pj79j43L78r4J24k13J03K0lp2k63O0K23m38N18l40K18J28
4209A14n8k43K90j04j5J42j92m3K15M5R8l95j8j04K27R0l06L61j46j02Q0J58j63
4232f9r1J39k28M2L87l16K64j93j55O1N4J58k9k03J17o9L0K47j53J6j10k73K77
4255i7k7K42m07O62n55j20L72L0j68Q6j00L8J43k07J83L3o2j03P1K67l03L1l23
4278c14K64j9QMj65M7K61j21J01k3J44L9m40K73kJ25o6J5j25K41n3j28j93L67
4302B40l24r3J47K37m12J17K79r6J87l93o6K00M4j53K78l37J9m0K22j75L89Q0
4324C50l90K02l56P7K75j70n1L36j07j29k5J07j94JK57R1o7m7P7l02P3m5J73j26
4348A0K29k01q5J52N0K8r1J10j74Pj07K6K1J98j66L1K07n01L84k46J23L4k96J66
$$ plain form
4186 -176 -27 -268 305 94 87 -92 -235 143 49 173 -40 63 83 80 8 -255 -195 28 -410 108 -232 -14 114
4209 114 56 -187 103 -1 -16 126 -66 -109 106 151 249 -146 -164 -268 -41 49 -257 104 -42 -144 -64 94 -69
4232 -69 -160 -21 -249 -207 180 -136 128 -65 -220 -159 -105 53 24 -179 -62 -131 -101 146 -7 9 -101 -374 -97
4255 -97 -124 118 -289 373 -182 -302 70 100 -68 18 -82 -44 99 -108 75 108 46 -57 14 281 -22 9 -314
4278 -314 -50 -69 -61 -57 -222 -175 86 -35 66 43 187 226 -214 59 57 182 116 131 6 247 194 66 -127 240
4302 240 -84 -177 -30 207 -205 -88 191 95 282 -111 -177 23 67 -86 192 -145 -126 -166 56 -119 270 350
4324 350 -40 162 -194 -117 158 -12 -63 273 166 37 12 119 -75 -74 183 274 207 160 237 -65 8 -37 136 10
4348 10 239 38 -47 105 155 183 92 202 28 35 -72 -46 -25 173 7 38 245 -256 128 -118 5 39 -257 -91
4372i1J36j32K71k76K53k93M63k98J27j38R4J04k12j89L28j95L0J20Nl05K66K45
4394C13m43K29l67M39k73L61j91J15p9k03j2J78P5j06k8J80j22m1j71N1J35K1
4416F1M9l7l33K42o3R3O0k16L61k45m5l5J62j36K98k32j14O2K28o2j62pL59k74
4440A4Lln4J10l8p2j16L6j11j11M15j88J14k04J54K23k77L9j10J17J28J43j54
4463E8J15k97p6L83n26N59n22M47j10j44J60L0M3R2n0j05j38Q7l5p0Q6J89mk52
4487h0l9K78o0l87PK82J01l48M82l93J38L3J30k37j60K04K62j52n0l1K1m9Q2q
4511B6J97j84O7k3j38Q5J84j5n45N03j03j27J03m91O11j36K8l1K84k94j3J17j32
4534b7n5l3m7J14J50R7J07m40J97j12K25m7j33j29N92n60J47N4l8R1M7j86k15
$$ plain form
4372 -91 45 -87 184 -92 161 -132 331 33 160 22 116 220 8 -181 147 -48 -18 102 107 -198 68 313
4394 313 -130 99 -268 171 -102 259 68 183 104 -99 -111 67 142 36 8 188 66 25 -146 -95 40 61
4416 61 110 73 -260 -18 -81 12 72 -144 217 -28 -73 -108 54 -82 216 -16 -130 -68 160 98 -64 -71 288 14
4440 14 17 14 -40 70 32 -40 -156 -120 -231 -342 73 -115 -1 -205 -51 172 -105 -66 -176 -59 69 212 58
4463 58 173 -124 -200 183 -343 216 -306 141 31 -113 47 77 120 212 162 57 -81 6 -29 -99 -13 176 172 -80
4487 -80 -119 159 99 -288 -281 1 102 -246 236 -157 -19 14 144 -93 -253 -49 213 61 11 -20 1 -48 34 26
4511 26 223 39 106 83 -55 30 214 199 -346 157 54 -73 30 -461 150 14 42 11 295 1 -12 105 -27
4534 -27 -82 -115 -162 -48 102 199 306 -134 63 -49 176 129 -4 -133 459 -101 46 100 62 153 200 14 -201
4557b01Q7O8J94J32n43K39Q4r4J36j91L33m69J73K9Q9o8P5j12K0j16K45j38J8
4580a0o2m8L29k68K8L19l29o5j94K75P7J53k59N9j42K91l12K28p5n4rj46K74J16
4604A76m10J48Qm1K64Q2m07K6J3J83j48J81m9j02K38k14PJ58j81m1J98r8j17J80
4628E4jj56J76l11Q1l8K53J63k31J16o4o0l67K41N6K29k6q6Pj98R8K41N4m41N6
4653a54J36K05j16l5o0J67J01k41m9K82k59j78O8K8j84J18K01k22J43j53K34j13
4675h1J85j01pK0k35L36j04L6j51p0L13N1Q2l36O4L6J24k76J26Ol11J62P5%j5
4700g1J6J30j27j29K24rM8K27m86L96l91J53J93p0j18j57k9J50J29o2l70L07k8
4723g4K4P9r0P9j27k11M10k51K81j76j97K88L4k87K50K39j22j65K52j52j59j3
$$ plain form
4557 -201 -114 -46 148 280 -263 -24 60 -34 102 -89 244 -225 -52 -23 66 -2 73 -39 -19 -135 110 -28 -10
4580 -10 -72 -120 209 -59 -31 288 -41 -106 -300 -25 52 205 -54 5 -137 154 -158 70 -5 -59 -68 -214 60 176
4604 176 -234 -86 -78 -119 145 227 -180 -154 -141 42 -106 75 26 -76 162 -52 -45 113 -68 -109 89 -9 -126 54
4628 54 53 -103 73 -238 -157 -195 58 221 -10 106 42 -18 -385 -144 -88 141 115 29 36 -162 -64 177 231 -210 -154
4653 -154 -18 187 71 36 -24 143 244 3 -46 236 -23 -201 -133 -105 -289 -171 30 -192 -49 -202 32 -81
4675 -81 104 3 -4 16 -219 117 13 49 -102 -172 141 192 274 -62 2 38 162 -114 12 18 -293 -131 -56 -56 -71
4700 -71 -55 75 -52 -181 43 34 82 309 -177 219 -172 -19 174 104 -14 -171 -200 -50 79 17 -353 -46 -74
4723 -74 -50 29 -61 18 -109 -320 90 -161 120 -56 -253 35 69 -218 32 271 149 -16 236 84 -75 -88
4745h8n8M03l45M3J45j56M3M38o01J06K83k28j48O5L04j90l33K83L33j80r1J69
4767A97j70J61q1m4J11J27j29M1r7k15m3Rp8K12k14M3L53k85M3k34M42j24J33
4790A58L14m78J36J37j88l3j89J8K59l65L1J56k29J50J63n8P0j8j80K45k13K5
4812h9J31L5J01j02N3j43J35r0n4j1j32J29J65j31m1J26l25N0O4o2J35j32j2K80
4836H0k25L15l65OR7K10l6K4r2k00K68j32j72J7J38Qp0M69k97k07L27M1k39Q4
4860D9q2j48K3Q1l2q5K85j25K14j94o8o8L30p9j43Q7N9j42J5j2Q2r7o4K66K8R2
4886B72k1k32K20k15Rl17L63K3l0P6l9r8O2j77P2Q9j0j60q1L19k30K03j07k57
4910b66K56j13m6n8J77J96p1P1j91m1J0O4k8L30k06l11Q1O6%K90l19J66j3j45
$$ plain form
4745 -88 -146 257 -88 -45 100 -56 -13 425 -176 -70 213 -15 -163 -98 206 16 -317 -34 299 119 28 197
4767 197 27 188 107 63 174 301 172 213 116 -99 -142 -133 -211 1 -213 -170 183 -102 -59 -293 149 25 158
4790 158 472 -6 130 267 79 46 -143 -125 134 -231 -200 -44 -273 -123 40 -18 52 34 -146 99 -114 -89
4812 -89 42 77 178 76 129 -14 121 31 -23 -34 -166 -37 128 -3 -44 82 -243 -193 -129 -191 -56 -188 -200 80
4836 80 -145 170 -195 -189 -92 118 82 106 14 -186 82 -50 -222 -205 -67 -59 -129 340 43 -164 163 204 -35 49
4860 49 -33 -181 -158 -77 -109 -194 91 -34 180 -14 -82 -150 180 101 -42 45 104 -38 -23 -35 47 -50 -114 152 180 272
4886 272 251 19 239 24 33 -284 79 102 72 148 109 11 73 -104 -32 57 47 -113 -194 125 -105 98 -9 -266
4910 -266 -10 -123 -169 -227 -50 146 75 146 -45 -86 -76 -12 -40 290 84 -227 -146 -80 -80 210 -109 57 44 -101
4934a01K34J27q6l24N6K24k65L11k38J40J42k47Jk16L17m03N04j81K3J02R7o9
4956A48k32j8j55K15n4O4R8n3k12Q7J01n4p8J38K36l79pR6j06J68n9j38J19Q5
4980A0O9N4Q2q8k93J66J87j24K00k43P4Ok83L94n2l4j29M2q7L9j69R7n2j00L21
5005H7k23R7L43k44j94M4J00n3j56L26j1o4L37l19J1j48q0L71l4j89k26R3J91
5028E9r8l0j36K89j70J66K65k75l0J32j43m7k00K4K39R2q4K43j39k14j9R1j43
5051a28J34J21j17k06J21o0R2j11q8J89j38PL74k38N0j37j23J98L06n50L56K3
5073G5l11K23l22J09L5K07L08o4l23K21J63n75M97n8j88L35m06J18N4m12J17J48
5095d9k16n6K47K11j00k10L71m2O2l45J67l99kN13j72K41j63N9j02j22n5K81O6
$$ plain form
4934 -101 133 260 174 -150 -94 130 -135 176 -62 78 220 -27 -26 -242 75 -328 176 -5 18 120 217 148
4956 148 -84 -102 -257 -42 -96 -32 66 13 -199 -112 -11 -65 -143 -5 231 -148 -155 -59 -165 3 -56 -194 -75 10
4980 10 79 133 215 127 -166 0 187 63 263 20 94 100 -183 211 159 125 -4 38 -49 -10 -179 -82 -134 -234 87
5005 87 -136 -39 304 60 -134 -90 10 -43 -199 127 116 52 389 70 81 -67 -147 224 190 1 -225 -132 59
5028 59 -39 -69 -205 84 -86 80 345 70 40 172 29 -18 -218 -194 45 137 53 296 157 -57 -76 15 -128
5051 -128 6 127 10 -196 -75 -135 -43 -154 -242 -53 -191 -184 190 -48 2 -135 -258 -60 246 -304 52 75
5073 75 -236 -13 -335 -226 -191 16 324 260 -63 158 321 -254 243 185 -3 332 -74 44 98 -314 -197 -49
5095 -49 -265 -321 -74 137 37 -173 198 156 218 -127 40 -359 -361 152 -20 221 58 117 15 -107 -162 119 185
5118A85qj27k2R4j62k0J62j75k5J14J31j69r6K37R3k94j5q9K5P0j65J64J25Q7
5142A20j86j0J25k43L21Kj66l8K66k01J38r8k63N37l67J47k22L49k55J55L8m51
5164c02K65P6K01m7k39pJ91l55P1JL18k87J3K71j22N7RO5k35j89K29K73k05M0
5188I2j29J03o4L8L70l70RNj74L8J75j88K96j68J1K33l27J66k19j74L22j65K64
5211A44j61J48m07L3m7K38j85J77j64J68mmKJ51n3K5J10j53M2j39P9k3N4j7j24
5236a10K7K2j37K35r4J4K69l68J12Q3n8K71j55j24O8j95J25j37L9K83j88J80j85
5259b3j27J13k08J91J24p8J42j64j55K55q7m8J92kj68J20n4j19K52k01K34l0l34
5282a75o3O1L39k51J00p3J27m5qJ66m06K47j77r8L08j21MQ3j07J28n8j01J66O4
$$ plain form
5118 185 177 50 28 122 -40 -60 102 -73 -98 16 147 -22 -118 119 212 -82 -97 -186 -161 -91 -256 -92 33 120
5142 120 -66 -76 49 -194 127 129 -37 -75 191 -10 128 30 -233 304 -63 84 -138 211 -44 111 149 -302
5164 -302 -37 39 240 193 -46 -53 138 -217 -146 -145 173 -114 -101 170 48 105 114 179 -56 -245 -16 257 52 92
5188 92 -37 66 2 40 410 40 49 54 -120 -82 93 -95 201 33 44 277 -50 116 -103 -277 45 -120 144
5211 144 -17 131 -276 -243 -290 -52 -237 -60 -224 -56 -60 -64 -62 89 36 61 171 18 60 -79 0 -23 31 14 -110
5236 -110 -83 -61 -198 37 -57 -43 226 -142 -30 53 -5 266 111 -13 55 -140 -15 -152 -113 170 -18 162 -23
5259 -23 -150 -37 -245 -54 70 -8 134 -30 -185 70 -17 -65 127 125 -43 77 23 -96 156 -45 189 159 -175
5282 -175 -238 -177 162 -89 11 -62 65 20 12 178 -228 19 -158 -256 52 -69 -65 18 -89 39 -19 -120 46 110
5306A10Q3L4k92J33k72M08j07k48L29j97M9O1mk20q7J86k1K0L12K5k87J22O4j06
5330I5O3k59K91j89n1j15J84j19n1J05M8oQ0j60K34J07k76k8L55n38N7NK71j31
5354b8K13l23J60K25m03J17n4kK03j05j2Q5k09J57j33q6L38r3k25K15M6l38L40
5377H8J17m35L30j54l1J97l42K70j49J84lM6l26J44nJ59J64k49L1j04o3K84j86
5400c3K41j80j02J12J74j20j76K31j18o4M6j46L01k04N7j1J2n5m5K69l32R7J90
5423A44l08L94m91L48l6k10K77l17J51K39k83m8J6m7J99k65L66r8L9O0j15J65
5445A80j61KO8Opk49P7J82L26o10K70J3j56J74R4l81ML13o6p5j13J31K1k02Q2
5470g7L42j79j2k70p1L28l15m2K37j92L59j28l28M48jm6j4J60k0j14P8L00k10
$$ plain form
5306 110 193 227 -65 68 -204 204 97 -151 178 -19 30 91 87 -133 -220 -34 -55 -35 277 302 15 137 201 95
5330 95 158 -101 190 1 -50 -165 19 -100 -151 -46 2 -4 76 -84 150 257 -19 -47 308 -230 -173 -168 103 -28
5354 -28 185 -138 22 247 -156 -39 -93 -95 108 3 -9 76 -133 24 -109 -195 143 50 -175 40 86 -252 88
5377 88 205 -230 100 -54 -85 112 -230 40 -109 75 72 118 -208 -64 -69 90 254 5 36 -68 -131 153 -33
5400 -33 208 28 -74 38 212 92 -84 147 29 -35 11 -135 166 -38 19 8 20 -35 -80 189 -143 -46 144
5423 144 -164 230 -261 87 51 -159 118 -199 -48 191 -92 -140 -124 -171 28 -237 129 31 70 130 15 180
5445 180 19 21 89 95 88 -161 -84 98 424 -186 84 97 -59 115 209 -172 -168 145 79 4 -109 22 43 -159 -77
5470 -77 265 86 74 -196 -267 61 -254 -296 -59 -251 108 -20 -348 100 99 53 39 199 179 65 143 443 233
5493B33k94O8J57l06K97k62P5K34j85N5o2M5j03o0R3J72n3j48pj63L26k22K53
5516A43k83K0J09J32l86K81q5J37j09J41l25K5M41k37Q0R6j16l07K74J76O1k13
5538E5J02k09j36L84k69K25Rp9j00QM1j19J97l54L77k21J19Q9M3m75L63l6j10
5561i6M4RP0j24q1r7J59J24j10j97K47M35m08k0k51M22j65M0mJ11m2R9j72j65
5585a72K4K03p0j25N2j27K88K7J11k76mP3j34J07J7J66O2k70L2p3Q2j46j40J66
5609a27J69j29J75k24J52J8j1r7RL31l02J43l03L75k53L28l61l2K95k21k14J55
5631a24O8N07m49JK27oo6j85J45L7k55J33j68j7K94k49j30m0J87J4J11M2N7k48
5655a14L14j53K26l25J54j58m1n9P6j6K31o8J53k71K62j48k35K58m07M56l61j36
$$ plain form
5493 233 -61 7 164 -142 155 -107 -32 202 17 72 10 55 -48 -108 -15 157 104 -44 -51 -214 112 -110 143
5516 143 -140 -120 -11 121 -265 16 -69 68 -41 100 -225 -200 241 4 84 180 64 -243 31 207 268 55
5538 55 157 -52 -188 196 -73 152 161 82 -18 -10 31 -88 109 -245 132 -89 30 119 162 -313 50 14 -96
5561 -96 -52 -43 27 -97 -178 -275 -116 8 -102 -299 -52 383 -25 -45 -296 126 -39 1 -3 108 66 165 -7 -172
5585 -172 -148 55 -15 -140 -88 -215 73 100 211 -65 -69 4 -130 -23 -6 160 222 -48 -16 -89 -7 -153 -293 -127
5609 -127 42 -87 88 -136 16 34 23 -74 -65 266 -36 107 -196 179 -74 254 -107 -139 156 -65 -279 -124
5631 -124 -56 451 2 3 230 224 158 -27 118 155 -100 33 -135 -152 142 -107 -237 -277 -90 -76 35 77 134 -114
5655 -114 200 47 273 -52 102 -56 -97 -156 -80 -96 135 67 220 -51 211 63 -172 86 -321 135 -226 -362
5677c62L53J17j07k45J72K4j88L70Q0j26j04O8j12O1j56oL52p9J33p9j99J61j14
5700A4m9LQ4J35k65M77l31J11J50n09M03k75K42j64j91K44j1j89J79k1j28l6J12
5723a5k34K38j12k5L5J52M6k28o0L57l60L17j56L36j10k75p0j41L89k39K14J83
5745B42j82q3K28k99jp0J23Q3j44M40l76k2j24J10j91n2rM52k53p5J01N4K55n3
5769A54j65Q1J60m91K81Q9j3k27l7J58O7k05J09L3o9P3J27k4j0o7Q1k35P9Q4L3
5794F6o3K08n06K70K29o3kk14L98m19L55k58j05K81l64J21N8J34k63J01R9o4J28
5817A27q3p9J40N0j20R3l28R4K57l78R3l9J77j54J68n8N8o6m5J03k06n9k8L28
5841D5K44l71K31l39K97k14J86q2j83K42k33L58j32j38m9o4J69l1J58j54J48k4
$$ plain form
5677 -362 -9 108 1 -244 -72 -48 -236 134 214 88 -16 52 -60 1 -155 -161 191 112 245 166 -33 128 14
5700 14 -35 -32 52 187 -78 399 68 179 329 -180 223 -52 190 26 -165 79 68 -121 58 37 -91 -127 -15
5723 -15 -249 -11 -123 -148 -113 39 85 -143 -203 154 -206 111 -45 291 181 -94 -164 -305 84 -155 59 242
5745 242 60 -23 205 -94 -95 -165 -42 41 -103 337 -39 -61 -185 -75 -266 -318 -327 125 -128 -203 -102 -48 207 154
5769 154 -11 70 230 -261 20 109 96 -131 -168 -10 57 -148 -39 -6 -75 -2 125 101 91 24 105 -130 -51 33 66
5794 66 3 211 -295 -25 204 141 139 -75 323 -96 259 1 -104 177 -187 -66 -8 126 -137 -36 63 -1 127
5817 127 44 -35 105 155 35 128 -200 -106 151 -227 -134 -173 4 -150 18 -40 18 -48 -93 10 -196 -255 -283 45
5841 45 289 -82 149 -190 107 -107 79 -3 -186 56 -177 181 49 -89 -138 -202 -33 -64 94 -60 88 64
5863F4K76n94L59k18L9J39j0J35j99P4j96j75N04J30l65l1j08L38n0j28r2K30
5885A22l46K29p9Q5r3J53M9K07k40o7j2j01K08K24m14P3p9o6K08j45K18j26L9
5908D7j76j98M26j82j13K51q0J47l81N43n4R5l04L4N7j32l3j59M24j17kp9J53
5931A67k93J91p3K59l03o0J64j09P3R3j38j57K69N3mJ1j49J8Q2k08M2K89r9k00
5955h2K93k58j06N9J00r3O6J11k0O8J5j4j53j45L24k84L10l66r9L01P4k21p4J04
5979i0joj11L22n5j28K74j80Rk00K07R4j49p8k4J42j78K51r9N5j60M1J9K6j65
6004a84L33o4k32P4J26M5K59l60K0n9K97l61L3j21L04Kj26j74J32J29j86L1R7
6027A5j8K42K4j40N4k44R1j41L42m71K79m1N8P8K09l58K1R8j00J01j95J62J08
$$ plain form
5863 64 340 -254 105 -113 -74 65 55 190 -9 65 -131 -306 198 328 -37 -68 -176 162 112 -16 -108 122
5885 122 -224 5 -74 11 -82 71 120 327 87 20 8 -93 115 339 -75 -2 -81 -147 61 -84 134 8 47
5908 47 -129 -327 99 -83 -196 55 -25 122 -259 284 230 325 21 55 112 -20 -53 -212 212 95 93 14 167
5931 167 -126 65 -8 251 -52 -112 52 -57 16 109 -29 -186 83 136 132 143 -6 12 94 -114 -72 217 118 -82
5955 -82 211 -47 -153 -94 6 -87 -21 90 70 138 153 139 -14 -159 165 -119 191 -175 -274 27 101 -120 -194 -90
5979 -90 -91 -97 -208 114 59 -69 205 25 34 -166 41 135 -14 -92 -116 26 -152 99 0 55 -105 -64 -45 -19 -184
6004 -184 149 85 -147 -73 53 98 357 -3 17 -42 255 -106 -73 -194 110 112 -14 -188 -56 73 -113 -82 15
6027 15 -3 239 263 123 177 -67 24 -117 225 -246 33 -8 50 128 337 -21 0 98 -2 99 -96 66 174
6050A74l0k22J1m0L89j16k0l08K13j20J44qo8j14K73l64K02kk59L92j20M9j10
6073e4K4j04M65l89K43k73j81K86j81J26N0k1k48L17J14m96K25J97q4n1L9k12
6095b08K63J09n0k96K83j8j11N4l9l84O3M02o1o1K3N8j63j2RM38m87R0P5j4R0
6120E3J87k70J23m52O01j28j07Jj58L70m61N6K40k23M85k12n2J0r6K66l71K15
6142G7l37M06l73k29L95J50J79l65L1j51L57j44%p7k6K31j67o0O6m0J96m33oL24
6166Dl0P0J41p4j17J16j61m9p0K89k29P4N7kP6K09l22K2K86k53k34K26pk04K54
6191G2r4j13l4J60j98J68M9J68m0j86K13K1n38J39M41k72K59l3k48K02l37K65
6213F4l72J48J52j50K14j20J69r6r0J95l0k55L25k95J5K51J60k70q7J66j43L7
$$ plain form
6050 174 144 -78 -67 -107 282 166 146 -162 51 -69 75 67 -1 -115 158 -206 -4 -6 -265 127 7 56 -54
6073 -54 -30 -134 331 -58 185 -88 -269 17 -164 -38 12 -9 -257 60 174 -322 -97 100 16 -35 4 -208
6095 -208 55 164 114 -182 101 83 -28 26 -13 -397 -334 68 7 -54 -31 27 -136 -148 -139 299 -188 -98 -23 -37 53
6120 53 240 -30 93 -359 242 114 7 8 -150 220 -241 -185 55 -168 317 105 53 63 -33 233 -138 77
6142 77 -260 146 -227 -456 -61 89 268 -97 -66 -217 140 -4 -4 -81 -107 124 -43 -103 -37 -77 119 -314 -320 4
6166 4 -26 44 185 111 -6 110 -51 -100 -170 119 -110 -36 21 19 95 304 -18 4 290 37 -197 29 22 -182 72
6191 72 -22 -135 -169 -9 -207 -39 10 178 138 -48 165 186 -352 -213 228 -44 215 182 -66 136 -201 64
6213 64 -308 -160 -8 -158 56 -64 105 9 -81 114 84 -171 154 -141 -126 125 285 15 -72 94 -49 -12
6235a2j46K89j95R9J90l29J84k94J32n7K07j41J43j02J19ok43J32j65L36n7j68
6257h4J14q8O0R7j18k69K44J82m4j4L6k52L21j60p1p5rm6J46Q8J94l29J07ok50
6282b26M33l05j8J82j64L07k56p6o8K48l0j08K35L4k46K63k66n0J32p0j1K81l30
6305a09J71j09l25L30J05r2R4k53Q8K01O3m02J7L49j99K04j13k45K84J57k50J06
6327G2n5J2J9P6J3k74J72k25M3J51J71r8j1j08J69j50j40L29k02K26l04J69J42
6350A97k07o4q8J60j47J90j29K32n5l3k8K29m44p3K31K34j10rk88L53j57J78k4
6373A48J34l75R3K26l05K35j84N2p3R2j25K9J92m4j28J20j91K09r8M5k55J85n2
6396g0J37j67O3Q3q6J90q9J01k04J1j27K40j96j67J85L12m54K01K23k34l0L9N0
$$ plain form
6235 -12 -158 131 -64 35 225 -104 80 -214 -82 -139 68 -73 70 -32 87 81 -162 -30 -195 141 84 -84
6257 -84 30 -58 2 99 -19 -288 -44 138 94 80 116 -136 185 25 -46 -121 -130 -176 -30 58 252 -77 30 24 -226
6282 -226 207 -98 -116 66 -98 209 -47 -123 -191 57 27 -81 154 188 -58 205 -61 -111 21 -49 -60 221 -109
6305 -109 62 -47 -372 -42 63 -29 65 -188 -100 101 164 -238 -221 128 -71 133 20 -225 59 216 -34 72
6327 72 17 29 48 124 137 -137 35 -190 -147 4 175 77 66 -42 127 -23 -163 166 -36 190 -114 55 197
6350 197 -10 -74 -162 -2 -149 41 -88 144 89 56 28 257 -187 -260 -29 205 95 86 -202 151 -6 172 148
6373 148 282 -93 0 226 -79 156 -28 24 -49 43 -82 -53 139 95 -33 87 -104 105 7 52 -203 -18 -70
6396 -70 67 -100 -37 46 -40 150 61 162 -42 -31 -158 82 -114 -281 -96 216 -238 -37 186 -48 -78 -39 11
6419A1k6q9P0J38k59M87j98q9Qn2k74N67m55L19k32J06K74m17j70L12j66n3K09
6442B1J13j89q3J64j67K13l16L03LJ3N5Oj96j4J03N5k20J91k35K81M9n6j12L73
6466C55l93k6J62j10j25N9oJ86j76K63j24k58J71j00J86m7j83K28k94L26j05M8
6488C7j08l1L2Nq5J71J91l14R0R4j3j56L06j20j97J10lk12M48j34m7k26L4K43
6512A15q0L4j9r3K20j33J96l63M4J41j67J03J74k48l2J37k37L00j32O8r6R2j28
6535a04J8J80k17K42P2l17L84m23K81k0r4l5J07J54j91J3j28Q5J1l8k73L46l9
6558A4J56k45p7L07m24M06k74j7M21j34k85L72Lm73J60m8K13L02l96K03j89k63
6580b68L63p6O8n1M2k21M2N12l61k24K37Q5J37l00J47J05j99n7j94J13n0J95Q
$$ plain form
6419 11 -15 -104 -34 104 -155 332 134 45 53 1 -273 294 -161 158 -74 32 306 -111 -281 31 -135 -188 21
6442 21 134 -55 -138 26 -141 72 -244 59 62 75 130 136 -60 -74 29 84 -136 55 -180 101 150 94 -18 355
6466 355 -38 -64 98 -12 -137 -78 -84 102 -74 189 65 -193 -22 -122 64 17 -166 62 -232 94 -11 37
6488 37 -71 -102 -70 -65 -150 21 212 -102 -12 82 69 -87 219 99 -98 12 9 -203 245 111 64 -162 -128 115
6512 115 35 69 50 -43 177 44 240 -123 -79 62 -105 -2 172 -76 -108 29 -208 92 -40 28 -68 24 -104
6535 -104 -86 94 -123 119 191 -126 258 -165 116 96 2 -33 74 228 37 50 -78 7 18 -20 -293 53 14
6558 14 170 -75 -152 155 -269 137 -137 -154 267 133 -152 220 223 -250 -90 -138 75 377 -19 184 -5 -268
6580 -268 95 19 87 36 78 -143 -101 411 50 -174 63 148 285 -15 132 237 38 -19 -213 -100 -150 45 53
6603E3o1j2j65J29k0j21J32Q1N4k83K75rl8j57K30j32J36j35j16j10L15L3k31
6626a52J18l50M97J00k59l6L26k26Q6j76r8J04J43m7m53M29O0M6l84M75r4j47
6648c8k77J66M34j99j93J99j41L6O3j16j36J33Q7l7K65m92L43K6l26J75j27J72
6670A7P5r2n1J31j05o3J35j38lK53m84M64j95M4k6j07L0J59l8j04j5J30J89m2
6694A64j49Qj37j32L62l12L80J6l23L26j28j45K98l75j78M41k11Q6Nk7J50j1j73
6717f5J47j19P5j76Q3l8L12l11K08R4k38J21k38L42m08K52j99nK54j43J64Oj53
6740c5J40j50M9k65l8J55J85j14JJ11L09n16L20j52l50R7R8L11k27j29M67k05
6762F2j31K4j05O3J98ok72P6k2R6JK7j17L33q6m5k03L6L6L84k01l58M6Q5K49J0
$$ plain form
6603 53 -8 -20 -185 -56 -76 -197 -65 16 70 -213 62 53 15 -142 88 -44 92 -43 -159 -269 46 79 -152
6626 -152 -34 -384 113 213 -46 -82 244 18 104 -72 -170 -66 77 30 -423 6 66 112 -272 203 109 -38
6648 -38 -315 -149 285 86 -107 92 -49 -13 50 -66 -202 -69 18 -19 246 -246 97 123 -203 -28 -155 17
6670 17 92 0 -51 80 -25 -88 47 -91 -94 159 -325 139 -56 -12 -38 -145 -115 44 6 -98 -113 17 206 164
6694 164 15 23 -114 -246 116 -196 184 200 -123 203 75 -70 228 -147 -325 116 -95 -9 -4 -31 119 108 -65
6717 -65 82 -37 38 -138 -55 -93 219 -92 116 210 -28 93 -145 197 -211 41 -158 -163 91 -52 112 118 -35
6740 -35 105 -45 4 -261 -299 -144 41 -73 -72 39 348 -168 152 0 -350 -253 -155 156 -71 -200 267 62
6762 62 -69 -45 -150 -87 111 105 -167 -91 -113 -17 -16 11 -106 227 141 96 -107 -71 -35 349 148 -210 -164 -79 170 180
6788A80k37j4L84m80O2R8J85j3l5j88K08jl08M18l28j54N35k45k3K1J0j37L35
6811B73m5k03J03k19J83J16p6k13m6N4J94l40J88o1J28j13J91k67K01j49m1j09
6833b51K39O6k99K94j01J31Q0l63J83K11m06M51m51K84M4j87J81m70N29j48Lj25
6855a05K34l79N14j52j45K7J89k88k78M58j3j95K6J40J29k42Q8l39M93J9k79L1
6877f7J05J7j98L07k76rL28j56j96kJ25o2o4L33l39J72o4j87K21J86j40J46R5
6900B75m38L93k10j61K98k84K15p8lQ1j12J18q7R2J6J7j90J54m32K65k0J43k14
6923a62K68j13K40J10n73J68Q5N3j07N0J79l32M25j19l19J31L22j53k36P0j69
6944a82J35J11J62o8k78J88k6k08j6K13J99k37J87m78K02J8J81j08K1j39J69o1
$$ plain form
6788 180 -57 -71 313 -167 -105 -7 178 165 130 -58 150 149 -159 259 -69 -223 312 67 44 65 75 -62 273
6811 273 228 25 128 -91 92 208 132 -81 -127 -73 121 -219 -31 -92 36 -77 114 -153 48 -101 -142 -251
6833 -251 -12 54 -245 49 -52 79 159 -204 -21 190 -216 235 -216 68 112 -75 106 -364 165 17 20 -105
6855 -105 129 -250 264 112 -33 -6 183 -105 -383 75 62 -133 -107 33 162 -80 8 -331 162 181 -98 -67
6877 -67 38 55 -143 164 -112 -121 207 51 -145 -147 -22 -84 -148 185 -154 18 -46 -233 -12 174 34 180 275
6900 275 -163 230 20 -141 157 -127 88 10 7 88 -24 94 7 99 115 132 -58 96 -336 -71 -91 52 -162
6923 -162 106 -7 233 343 -230 -62 23 76 -31 19 198 -134 291 172 -147 -16 306 153 -83 -13 -182
6944 -182 -47 64 226 158 -120 68 42 -166 -182 31 230 -7 180 -298 -96 -78 103 -5 16 -123 46 -15
6966a5j75K75j13J2K3R9k37K93p6K4k4l91L85k4j46j6j00R2J15L7K15l62J45L8
6990G4R7l69K07Q6j97j6m00L95J34K5L55l7o79K60k34K99J01k53J43m1j7r1J1
7013a47J54P2k6l60J17L34l82K50Nj18J25k8J16k82Q2r5L11j36j28J5mJ72R7l63
7037b19M84l13J34j07j90K22J00j16O4J66j67P5j2n0j2J38j89o5K21o0k27P5L21
7060B73n77N15K4l41l3m3K31N6RM1J32l21L5Kr1J79j73K40j35o8J27Pj80k7J4
7085a04R7L0j56L28O8m29M6K39k78K05j16J13rj87L34j31o1m0R5j46K41j73J0
7108b4j71n3K43MJ0j03Q2K57k21J78r7J04k96J86q9j35K71j69p6K21J7j63k20
7131b44K64k9Q9J5j65K12k35R9M5m2p0j22M6q3J78p9J89K6o49N74j95J58J09N0
$$ plain form
6966 -15 -190 85 -28 -16 7 106 -131 162 86 110 86 -305 80 56 -90 -106 -206 -114 1 38 253 -109 36 74
6990 74 171 -198 9 95 -102 -118 -518 -123 11 36 391 354 -325 -65 -299 0 101 -152 -9 -50 -67 -158 -147
7013 -147 7 79 53 -307 -190 144 -238 12 17 -101 24 -4 112 -170 -88 -183 128 -8 -136 -121 -125 47 144 -219
7037 -219 265 -48 86 -21 -211 11 111 -5 59 225 58 133 121 71 59 197 8 -57 164 104 -123 -48 273
7060 273 -304 211 235 -106 -139 -182 49 105 114 155 287 -34 1 3 -88 91 -82 158 23 -45 82 89 -91 -118 -104
7085 -104 -7 23 -133 195 263 -166 -120 119 -159 46 -70 43 34 -153 181 50 -11 -51 44 -102 139 -34 -24
7108 -24 -195 -248 -5 -1 9 -94 -12 245 24 202 105 209 -87 99 10 -125 146 -23 -99 122 139 -24 -244
7131 -244 20 -9 80 95 -70 142 -93 6 51 9 -61 -183 -137 -220 -42 -121 68 94 -555 19 -176 -18 91 141
7155A41j8m0j79N03j43K0k09K7J1kj04J37j58k4J01j48R6j60M9k8l9K44r8K09
7179A88N2j91r5n6k9K69Q6j79l3k49L45k75J9n2K35o0K38j57j13L24n19K38J5
7202AN7l6R6o2j59j02J10K50j72K7K97l95K99k38l20M35j04J48k71j4K19L1Nk1
7226H1P5j26O7m7K1K01j64J42l14M2K1j39Q8L14m11K75j32L0K4j83L67j42j93
7249a03N23o56J27k69J22pJ03K48J03q1j73k2L4N0K93l86P3L12k05j88K64R2j64
7272I0k0N4o5Q9p2q0J4p5K00J16k70q1P7p7m9J55rj19K02k45m0L84j77j14m8J10
7298e0J31j60J56k48K27M1l51L28M9k01R0M5lr2M2r7N1J81l84M77j33k84R0L09
7322B14k40K63j41P2J75l40j0N8r7J39j69K17J60k54K5M82o96L27l08J24j63J07
$$ plain form
7155 141 123 83 -96 407 264 284 75 102 113 111 7 144 -14 -38 63 -85 11 -149 -100 -128 -167 77 -21 188
7179 188 240 49 -46 -102 -131 138 224 45 12 -237 108 -167 -148 -200 35 -25 213 56 -57 267 -252 -14 1
7202 1 58 22 118 56 -103 -205 -95 155 -17 10 307 -88 211 -27 -347 88 -16 132 -139 -153 66 97 102 81
7226 81 156 30 97 50 71 272 108 250 -64 -22 -1 -140 -52 262 -149 126 -6 24 48 -135 232 90 -103
7249 -103 420 -236 -109 -378 -256 -263 -160 88 191 110 -63 -85 -51 -1 292 -94 -21 291 86 -102 162 254 90
7272 90 70 124 59 148 76 -4 10 -65 135 251 -19 -100 -23 -100 -149 6 -3 -122 80 -165 -205 179 2 -112 -160 -50
7298 -50 81 -79 77 -171 56 97 -254 74 123 -78 12 57 54 -38 4 -93 -42 139 -245 232 99 -185 -95 214
7322 214 -26 237 96 168 343 3 -7 51 -46 93 -76 141 301 47 72 554 -142 185 -123 1 -162 -55
7344e5m0J47J1n6R3l09Q9Kj7J76L03m06K20q3l85M10k5k19J25K78j75l07L64k95
7368a54L20k00R3j04J73j84l39K30K44J69j62J76k25j39J11RJ00j51k7K02k1l12
7390a91j85N80k38J97r0P0n3Lk81J82J43j49J40Pk39P7j08o3J38j5M0J17j46J41
7414G7kJ91l95J54k55J11L2j29J35N0J29J81J2k71j7K12l11j23Q9J65k0K8L8K5
7438A06M3l84M20m31K12M9q1J29O8j47J09n4j72KL53q5j22j4J91k24NJ05j06K91
7462B63m74J53K24o0O7J09k99j69K29J7q3J85j38k28M30m60O6K72K12k57m1K23
7484B41j78Pj20nO0Q7l6L9N9q4m0k20N3J67l6J35R3l09L4Q6L0M5m05J65J09j33
7510a56K96j65k9J33L7r1r1k7k0M1QJ19j88J31J84m3j74J82k89k00K75O4O8J44
$$ plain form
7344 -55 -95 52 63 7 100 -209 -120 -118 -135 41 344 -62 158 75 -310 100 75 -144 -19 259 84 -223 141 -154
7368 -154 166 -34 59 -45 128 -56 -395 -165 79 248 86 262 37 -102 9 18 118 -33 -60 142 121 -191
7390 -191 -376 204 -34 163 73 143 90 93 -188 -6 137 -12 128 135 -104 -27 -135 -198 -60 -75 -35 82 -64 77
7414 77 75 266 -129 25 -230 -119 -87 -216 -81 -31 98 279 291 20 3 215 -96 -219 -130 35 15 43 81 106
7438 106 149 -235 185 -246 -34 15 -66 63 131 -16 93 39 -133 -131 222 137 15 1 192 -32 -27 78 -28 263
7462 263 -211 -58 166 106 173 282 -17 -186 43 60 -23 162 24 -204 226 -234 -168 104 316 59 18 241
7484 241 63 70 -50 -55 5 92 56 95 154 70 30 -190 -137 30 -6 129 222 -87 -53 33 63 108 -297 -132 -23 -156
7510 -156 140 -25 -54 79 116 25 -66 -93 -113 -72 -64 55 -133 -2 182 139 -35 147 -142 -342 -67 -3 65 209
7534B09k67J69j33j95N91n65K68o8J05lM4j2n3J7k00O8n6q9L5l1L28k00j04j47
7558b89J35L83m2m2m39O8K73K6P5m37J93l2N8J89j81j10L55k15K24k71O4JK32
7581B18p0O8n7o1l6L2lO7k35o4L01k94J60P1ml7j11K15k07J33j67N0k14N36m73
7606a82K34k67K52J67j13k0J3j37lq7m2L54k86k9o0J74N5R1j14k34K23P5k30K89
7630A23J2k22L4n4J01J59j08j7k65J28P4l0J74j15m5k6K73j58J18l31MN8J28J77
7654A92l18K24j91M2J38k16L83j11P3j62k70J44J16j02J21K34j88k19O7j45L08
7675A20j29O3n0l8J78k47R1Q0N3j01m5P2K04l02L96n01K92j69K45k49k2QL4Q9
7699G2j69L0J60j45j87K3J91K18j93J84r0l35M38o5k72J53K0P7m48J56L00P4j32
$$ plain form
7534 209 -58 111 -22 -217 374 -191 77 9 114 111 155 143 90 107 -93 -25 -81 -170 -135 -166 162 -38 -142 -289
7558 -289 -154 229 187 145 -294 -226 47 73 148 -289 -96 -128 -70 119 -62 -172 183 -32 192 -79 -15 -14 218
7581 218 148 216 159 98 62 94 91 158 -77 -141 160 -134 26 97 93 56 -55 160 -47 86 -81 -31 -245 291 -182
7606 -182 52 -215 37 204 91 71 84 -53 -56 -143 -185 169 -117 -146 -206 -32 23 114 0 -234 -11 64 -166 123
7630 123 135 -87 -53 -107 -6 153 45 28 -237 -109 -35 -65 109 -6 -51 -77 196 38 156 -175 -171 -113 15 192
7654 192 -126 98 -93 -51 87 -129 254 143 216 54 -216 -72 44 -58 63 297 109 -110 -43 -188 120
7675 120 -9 54 4 -34 144 -103 -12 68 121 20 -25 47 251 -51 345 -156 136 -33 212 -37 -59 -51 -17 72
7699 72 -97 -67 93 -52 -239 -216 -25 193 0 184 94 -241 197 132 -140 13 33 110 -338 -182 118 192 60
7722F0L9q7M5R6m7Ql0k14J3J96P9m3j6j55J27j89J57j25N8j27k14M30l08J05K39
7747I7q4j2J06k6K18j74K5o7O6n2m1m5j02K73j59k23rK25j57n8N27k29J48o0j95
7772hR9j24K30l08M5R8L7J50N5m54J39J54j33j84%K37o3P6J9K01j31j67n0J85
7796A03m56M22k76J98Q5j1l20K69K5q2j72O2K90r7k04j41M03l9l53K51j71K80
7818F6K35k30j48K9k40M02j84Q0k58M73j23k31L43l15j58M53j94k06K29qN1l9
7840B7L27m70O4K5k72R4K20p8nkQ7j3K19n78L18o5J26k28L72R%j73j16J73J4j33
7866e8K05p2j04j42P6J18J66l1k38l5r8K94mj77K00J18k32p1R8O7j27K26j16R9
7890A62j47j68K25p7J05k77L53j30j87K39m4Q7M0o6j45j55J87J22l17M25p8k81
$$ plain form
7722 60 99 12 57 153 106 114 84 -130 -117 79 158 115 99 -56 71 -118 39 -86 -28 -155 -369 61 -247 -142 97
7747 97 13 1 107 81 299 125 150 83 149 97 56 11 -91 182 23 -200 -209 16 -141 -199 328 99 247 187 -8
7772 -8 91 -33 197 -111 -66 32 69 219 274 -180 -41 113 -20 -204 -204 33 -30 46 65 266 135 -32 -82 103
7796 103 -353 69 -207 -9 76 65 -255 14 39 -43 -215 -153 137 40 -164 -305 98 59 -294 -43 -214 66
7818 66 301 71 -77 -48 -288 114 -70 10 -248 225 102 -129 214 -101 -259 194 0 -206 23 15 66 27
7840 27 354 -116 -52 -27 -299 -205 15 -63 -68 -70 17 4 223 -355 -37 -102 24 -204 168 177 177 4 -112 61 75 -58
7866 -58 147 75 -29 -171 -95 23 189 158 -80 -115 -213 81 77 -100 100 218 -14 -85 13 80 -47 179 63 162
7890 162 15 -153 72 -5 100 -177 176 46 -141 98 54 141 181 115 -30 -185 2 124 -193 232 154 -127
7912a27O0r3j4N66n25J75n4O7M8J28n8l42M22j36k4J3k6j57R9j57J02J09o4K33
7936B45k51m0J81M7r9k73M43j77J89k72j58K29J11j34q8J13k6j37L9L36l66J40
7958E2j08j85K59j49K10k03J68j59N4J01j32J96k0l2j9O6l06L45K2m7K01k46j79
7981a11P3J2o8K65l01N5QK6K15j32Nj62JP9M3k37K65K20l72J4K09k46K04q6J13
8006I2j23j04J42J9Jj70K77j77j6R9k05K70J47o67L64r2K66k45J86k33J71R6l13
8029b15K67j1K5k23K84L5M2j25j89K62j68j34K84N0k08lJ4Lm8K79k44M3j36q9
8053b05O3lJ65n0k51K00k00L66J19k21K04k27j90K27j4j98J36J37L8m7j61L8k
8076g6k5J25m58L50L41j08k72L12l25J60o4l4n3J69j00J40o1M8J80k29K52k88
$$ plain form
7912 -127 -67 -160 -174 392 -133 42 -12 55 103 231 173 -169 253 117 93 106 80 -77 22 -135 -33 76 12 245
7936 245 -6 -46 135 182 83 -190 253 76 265 -7 -165 64 175 41 -47 66 40 -97 -58 278 -88 52
7958 52 -56 -241 18 -131 79 -124 44 -115 -61 40 -92 104 84 52 33 99 -207 138 160 113 314 68 -111
7981 -111 -38 -26 -94 171 -130 -75 -67 -41 174 42 47 -115 -114 -35 8 -229 36 256 -116 -102 107 -139 65 -21 92
8006 92 -31 -135 7 26 27 -143 134 -43 -59 40 -165 105 252 -415 -51 -143 123 -122 64 -169 2 98 -215
8029 -215 52 41 66 -157 127 162 204 79 -110 152 -16 -150 134 184 -24 -27 -13 -10 -58 221 -23 20 -116 -205
8053 -205 -142 -145 20 -30 -281 -81 -281 85 204 -17 187 -40 -230 -3 -17 -215 -79 58 96 49 -112 -74 -76
8076 -76 -101 24 -434 -84 257 149 -123 189 -136 24 -40 -74 -127 42 -58 82 21 69 249 20 272 -16
8098a6R0l40J23O8L4p0J50n5j35L26k52K3L2j37R1k15J96L25k59r2Nk34J98J81
8122C7K24Kk44J38j94M5j31J79QO0j41Q7j22Q9M2j73j8k34J10M05j90J53j79J21
8146G4n6k96L40k80J93L14l24Kk34M26j69k7K06qr8ll85K04j41L36O3n9o9m6l3
8171g0K47j43O5q5k88L89q3p2K23j84N6J06M2j53J6J39j35j8j77N34
$$ plain form
8098 -16 74 -266 -143 -75 -41 -111 39 -16 -151 175 -77 -54 -22 -159 -68 -283 -87 238 -21 -113 -108 -342 -144 37
8122 37 261 263 19 157 -37 8 -123 56 64 124 -17 70 -52 37 79 -94 -112 -346 -236 169 -21 132 -47 74
8146 74 18 -278 62 -218 -25 289 -35 -33 -267 159 -10 -37 169 161 63 60 -325 -121 -262 74 137 78 9 -37 -70
8171 -70 177 34 99 14 -274 115 32 -40 183 -1 55 161 203 50 66 205 70 52 -125 409
8191D09
$$ Imaginary data points
##PAGE= N=2
##DATA TABLE= (X++(I..I)), XYDATA
0@%%%%%%%%%%qJ6j6J6k4L2l5M3n6O4p2Q8j06J30j52J76k08K40k78L21l68M20m77
33b54N40o11O90p72Q64r68J081j204J338j486J648j823K015k224K452k702K976
50A560l279L613l983M394m853N369n954O626p404Q316r405J0734j2395J4539j7429
65i551K1559k7970L9353o5521K34148L9765m68916J45980J82871j32809o1211
76a02302K22243n5866j89155J13938J49968k20856q3810K54987P1293k07644j6984
87f4188Q6767o0639j8935J46545m992j49729L6966J19176j09015r6490J24389
98I855O6290q9642J036N2601p1775n7268J10683O6833r7492l2695P6758l3625
110A559p2384O6897O8734n5030l0793M9506j3708p3223M0730R0050n6566q0255
$$ plain form
0 0 0 0 0 0 0 0 0 0 0 0 -8 8 -8 8 -16 16 -19 24 -32 32 -40 48 -58 72 -80 96 -112 128 -150 171 -197 223 -254
33 -254 286 -325 365 -407 457 -511 570 -634 704 -782 866 -957 1058 -1166 1286 -1416 1560
50 1560 -1719 1894 -2089 2305 -2548 2821 -3133 3493 -3911 4405 -5000 5734 -6661 7878 -9551
65 -9551 12008 -15962 23391 -42130 192018 231783 -237133 -91153 91718 -41091 -102302
76 -102302 119941 64075 -125080 -11142 138826 -82030 -165840 89147 160440 -47204 -64188
87 -64188 22579 -38060 -56995 89550 84558 -65171 -28205 90971 -18044 -114534 9855
98 9855 76145 -13497 -12461 40140 -31635 -88903 21780 88613 -8879 -41574 35184 1559
110 1559 -70825 -3928 64806 9776 -21017 28489 14781 -58442 -17712 72338 15772 -64483
122f4483O5815M6047p7627k6183P6699J5238n7054K3686M7710p9171n5170J09226
134B4733N8034r1038k8484O6260j0392n7545L3873M4374n4225j3143O9824l5836
146F435r0956O2781R4325n0302n9221L8642J0791m6827L1159N6611o1559m5561
158e3682Q7235K2940r4739K89P7979k1650n5092M1134L1945o6528j4461P8245
170C3615r772o7097M2578M9332o3027l3620O2868J8624n3850Q499N3070l5998
182E222m8322N5409L0089o1173o926N4641j7370n3518K7543M8890l7081l2056
194c4652N3188Q859o2334J6488N8480l2863m3515M5172L2832n3394k0819N7218
206B4660l378n3488L4373L9652o1853k7958O6502J2962n8409P447N1927l1108
$$ plain form
122 -64483 1332 47379 -30248 -56431 20268 35506 -21548 2138 49848 -29323 -84493 24733
134 24733 82767 -8271 -36755 29505 19113 -38432 -4559 39815 -14410 -27553 42271 6435
146 6435 -84521 -21740 72585 22283 -36938 1704 12495 -34332 -3173 53438 -8121 -53682
158 -53682 33553 56493 -38246 -37957 40022 18372 -36720 4414 36359 -30169 -44630 33615
170 33615 23843 -43254 -676 48656 -14371 -47991 14877 33501 -20349 -11850 41220 5222
182 5222 -43100 12309 42398 -18775 -25701 28940 11570 -41948 -14405 34485 -2596 -34652
194 -34652 18536 27395 -34939 -18451 40029 7166 -36349 8823 41655 -11739 -32558 24660
206 24660 21282 -32206 2167 41819 -20034 -47992 18510 31472 -26937 -19490 32437 1329
218A329m1743N4807K1342o5628R504O4605l3584n3336M6438L8336n2649j7640
230b8219N7541j1969n8830L8784M1946o0714j7272O7696m704o2490K2958N3308
242C8035l9483l7146N9088J6094o6850J2256N9202l6276m0878N0675K2081n9813
254b3015r369O0662j1450n6851L4473M1832n1227j7639N5696l372n0109K1088
266i281M5366l3672l6345M6330K0499n3987L888N0232k5686l8821L5494K3046
278B7063m2969j0833M7630m881m8276K3789L8611l9499j8797M8278N61m4441J3726
291a0038L9893k5208l2161L9056J8993n0106M26M7483k2204l8465L3730K4767
303B6166m0172j3511M4091M81m5031J9225L9870l4486k2850M3236N617m1968Q866
$$ plain form
218 1329 -40414 14393 35735 -29893 -20389 44216 10632 -42704 3734 42070 -10579 -28219
230 -28219 29322 17353 -41477 -2693 39253 -21461 -38733 28963 24259 -38231 -15273 38035
242 38035 -1448 -38594 20494 36588 -30262 -18006 41196 4920 -35958 14717 36798 -23015
254 -23015 -32384 28278 16828 -40023 -5550 36282 -14945 -32584 23112 19740 -30369 -9281
266 -9281 36085 2413 -33932 12398 32897 -21090 -17202 33030 7344 -31477 4017 27063
278 27063 -15906 -26739 20891 16010 -32266 -8477 30134 -9365 -28162 20116 20677 -23764 -10038
291 -10038 29855 4647 -27514 11542 30535 -19571 -19145 28338 6134 -32331 1399 26166
303 26166 -14006 -27517 16574 17055 -27976 -8751 31119 -3367 -26217 17019 22636 -19332 -10466
316a0466L8121j9995l4220L0144K3194m2058o529M2979j2567l6510K5023K5611
328B2727l1986j5058L8224N473m0923J0999L8632k6299k5780L6415J0134l7480
340a4922K596L4015j3995l2627K4981K4038l6913j0379M0511p162l5655K1119
352d393K6926k7422j6627L3495Q236l7528O951L7610k2662k7800L2286J2851l5788
365a3865j788L2954q987l1647J8849K5971l1162j3843L7811q48l4320J5479K7231
378B1835k2211j8545K8820J1331l4227L11L5764j6494k9200K7165J5568l2593
390a2476m719L1139m916l0668J5604K7370k7205j6990L6091L232l3972J1396K7137
403B1023j9327j8756K6024J1026l2719j182L4692j4024k9455K4155J6114l0000
$$ plain form
316 -10466 27655 7660 -26560 3584 26778 -15280 -21809 21170 8603 -27907 -2884 22727
328 22727 -9259 -24317 13907 19380 -21543 -10544 28088 1789 -23991 12424 22558 -14922
340 -14922 -12326 21689 7694 -24933 48 24086 -12827 -23206 17305 10143 -25512 -4393
352 -4393 22533 -4889 -21516 11979 20215 -17313 -10362 27248 4586 -23214 9072 21923 -13865
365 -13865 -15653 17301 8314 -23333 -4484 21487 -9675 -23518 14293 13445 -20875 -5396 21835
378 21835 -376 -18921 9899 21230 -12997 -12686 23078 6584 -22616 4549 20117 -12476
390 -12476 -17195 13944 9028 -21640 -6036 21334 -5871 -22861 13230 16462 -17510 -6114 21023
403 21023 1696 -17060 8964 19990 -12729 -13911 20781 6757 -22698 1457 17571 -12429
415a2429l971K8963m810k6710J3851K4720k3258j5714L1830L849l0774R054K3839
428A8440j5904j6587J9564R403k5613k769K8541q047k6823J6985J6300k0881n431
441a2822K2330n51k2509P132K3327j3644j8244K2309Q665k6450K234K3495q905
454F367k0038J2437J4529k0457r115K7966m56l0674J1040K3153j6422j1299K2161
467I192L275k5859L469K9047j1245k4443K1370J2390k8585J04K8159j0856k4254
480a8236J5375J7247k2140q912K9993l012l0877J4584K4575k0000j1131K3109
492A0575M06k3579O616K4411j3953k0474K0892Q686k5231L105K1765j2358j6708
505a5847J5300J1509j6278n235J9177l468j9616J3973J8021j7377j0688J4995
$$ plain form
415 -12429 -16400 12563 7753 -18957 -5106 19614 -3644 -19358 12472 16321 -14453 -5399 18440
428 18440 2536 -14051 5513 14916 -10697 -13466 15075 7028 -19795 -2810 13490 -7391 -12822
441 -12822 9508 8957 -13552 -6420 16907 3263 -14981 7328 15993 -10457 -8223 15272 6367
454 6367 -13671 -1234 13295 -7162 -16277 11689 11233 -19441 -8401 14752 -1670 -12969 9192
467 9192 12467 -13392 -9923 19124 7879 -16564 4806 17196 -11389 -11285 16874 6018 -18236
480 -18236 -2861 14386 -7754 -16666 13327 10315 -20562 -5978 18597 -1403 -12534 10575
492 10575 10981 -12598 -5982 18429 4476 -15998 4894 13580 -11651 -8546 13219 861 -15847
505 -15847 -547 10962 -5316 -10551 8626 5158 -14458 -485 17536 159 -10529 4466
517D466L684j2732K263J3583q676j7261J3343J3978j6527o273J4525k149j3457
530a1233P806J5347r559j4276J3672Q217j8060L934K1674j1874k0536J2831J4206
543A2149j3559n827J7724n764k4681J4587K3612j9559j4465K0860J037j8650J0326
556b210J9774j6232j8063K1734R312k4112N179K3217j7592j8201K0934Q663k0608
569h205M34J9186j0751j9082J9513J4244k3613l770K2319o191j4524J3632R324
582A2516j7368n079J8585J066j7276O151J1701j4922n371J6371O85j4254N24R168
596B497j864o444P568N203j1954k834J2952K223p402p34L401k946m318P553P429
611A0330j1398p798R816J216p706M949P034q281r274J0309R370j1532k032J4070
$$ plain form
517 4466 8150 -4582 -2319 11264 2588 -14673 -1330 12648 -3879 -10152 4373 2224 -11233
530 -11233 -3427 11920 2361 -11915 1757 9974 -8086 -4152 17522 5648 -14888 -2057 12149
543 12149 -1410 -7237 10487 4723 -19958 -5371 18241 -1318 -15783 5077 6114 -12536 -2210
556 -2210 17564 1332 -16731 5003 14315 -9797 -4618 18599 1007 -17194 3740 12403 -8205
569 -8205 -7771 11415 664 -18418 1095 15339 -8274 -12044 10275 4084 -10440 3192 12516
582 12516 -4852 -9931 8654 9720 -7556 -1405 10296 -4626 -9997 6374 7059 -7195 -6671 2497
596 2497 633 -5811 1757 6960 -4994 -7828 5124 7347 -55 -789 2612 -334 -4652 2901 10330
611 10330 -1068 -8866 950 2166 -5540 -591 6443 -1838 -11112 -803 8567 -2965 -4997 9073
625I073p345j3398J4402J0656j4758o388J2849j477j3027J0576J2830j8985r680
638a4672J9999P00j6320R303J1649j5283p515J8626L924j8500L965J7043j2984
651f5j0899J8743K554j8765K841J4844q065j0669J1639N462j5901o12J7282o106
665B283j1645J1297N040j1894M21J1725j828j1282M503R154p721m852J0349j953
679C597j0659M006P853l485n937K996L709n679j292R660o34r184L028N761k798
694I42l028M919K451p877j994J0074j142j0174N160N597q710k405R335R44r511
709e419J254R652n966o771J1856L032j2766J523J0753m792p242P266M342j0912
723d190k088J2704l380j1701Q176O634j1105j262J1193k006j0087N279R276p938
$$ plain form
625 9073 1728 -11670 2732 13388 -1370 -7758 5091 3614 -9413 1163 13993 -4992 -14672
638 -14672 5327 6027 -10293 -990 10659 -4624 -12139 6487 10411 -8089 -4124 12919 -65
651 -65 -10964 7779 10333 -8432 -5591 9253 1188 -9481 2158 7620 -8281 -8893 8389 2283
665 2283 -9362 1935 6975 -4919 -4498 7227 5399 -5883 -1380 7774 53 -4799 5550 3597
679 3597 -7062 -3056 4797 1312 -4625 -1629 2080 -3599 -4891 4769 4135 -5049 -2021 3740 942
694 942 -2086 2833 5284 -2593 -4587 5487 4345 -5829 -669 4928 -3782 -6187 3148 4092 -5419
709 -5419 -4165 5487 -479 -7250 4606 7638 -5128 -3605 7148 2356 -4886 2380 6722 -4190
723 -4190 -6278 6426 3046 -8655 -479 6155 -4950 -6212 4981 2975 -7112 -1833 7443 -495
737d95n634J1593L70j1912N182Q681q094n274Q153J920q748L16Q600m084q092
752g518P468M438q287J50P978k560o168M415O122n784m320P771J034q951K743
767a469O686n606m121N049K380n682j532P134j312p316M894N628o534j484O469
782C184j87n477J621N858l496n984O120K858p833M90O881l990m832M140L904n526
798b269k250P166J53p728M052O193o014k755O823M03o219J268N216k663o172N838
814A042L195p925L06O812l360n158M905L391m834k234O786L94p032L357N790n675
830b40l129O525m25n201P72M737k163n182M336L263o492o67O785k162m820L864
846a99L265l941j824N342J165o438J634O112n034l257N303L81n046J61M599j536
$$ plain form
737 -495 -6129 5464 5834 -6078 -896 7785 -309 -5583 2570 4490 -4258 -3942 4658 574 -7518
752 -7518 -50 4388 -3899 -3749 4229 1669 -4499 -84 6038 254 -4066 3705 4739 -4212 -1469
767 -1469 5217 -389 -4510 539 2919 -2763 -4295 2839 1527 -5789 -895 4733 -1801 -3285 3184
782 3184 2997 -2480 -859 4999 1503 -4481 1639 4497 -3336 -2846 4035 45 -4787 -647 3257 -2269
798 -2269 -4519 2647 2800 -4928 -876 5317 -697 -3452 3371 3774 -2445 -1177 4039 1376 -4796 1042
814 1042 4237 -3688 -3382 3430 70 -5088 -183 3208 -1626 -3860 2926 3320 -3712 -355 5435 -240
830 -240 -3369 3156 2731 -2470 -1698 3039 876 -4306 30 3293 -3199 -3866 2919 757 -4063 -199
846 -199 3066 -875 -2699 2643 3808 -2630 -996 5116 82 -3175 2128 2509 -2537 -2376 2223 687
862F87m848L503L980n535j111O202j717m315L616K963l398k369M384J667n945
877b236P86N955m304m139N321P38m877J52M539j166m853L192M601n132j823O098
893B852q74m628K866L153l105k811M162J808o035O34N528l507m332M898J675n079
909b795K84M599j316m139K786M195m378j893N668j163m322K942K984l712k084
924b344L596Q89m681P34M753l551l152M379R73l681Q25K910j117k694J946L202
940B987k675j983L639m87l142J891J627j914j846J180K016k212j372L540q72k936
956b559K275K441k257j309K477R14k894j09M295j690m156L301J919m008l35L336
972A641r55l667J866L876l765k598N150k6m744L224M035m610j996M437Q18m341
$$ plain form
862 687 -4161 -658 3322 -2213 -3324 2878 1161 -3154 462 3425 27 -2342 2042 3709 -2236
877 -2236 -1450 4505 201 -3938 1383 2121 -2756 -2604 1935 769 -4084 -892 3709 -1423 -3246 2852
893 2852 1978 -2650 216 3369 264 -2547 1615 3423 -2612 -1978 3550 43 -4289 609 2284 -2795
909 -2795 -2511 2088 772 -3367 -581 3614 -764 -2657 3011 1848 -2474 468 3452 -260 -2344
924 -2344 1252 2141 -2540 -1806 2947 -604 -3756 623 1596 -2085 -1260 1650 533 -2161 -215 2987
940 2987 312 -1671 1968 1481 -1661 230 1857 -57 -1903 -723 1293 -919 -2291 1249 377 -2559
956 -2559 -284 2157 -100 -1409 1068 1982 -912 -1021 3274 1584 -2572 729 2648 -1360 -1695 1641
972 1641 686 -2981 -1115 2761 -1004 -3602 1548 1522 -3222 2 4037 -573 -2569 1868 2686 -1655
988a655R18M268l520m007N594J410n501N96M105k777k645M345J786m604r93M879
1004B199j270l337M363J063m598j92L784m61k754J590J265l000j344M162O9l968
1020b429J275J728j700O9K151M31k382p42K418N70j433R58M90k248j70J674O65
1037A325j226j232R76J92j761J324J970k551j112K505P20j537j39J945q04k459
1053a864K907K234m239m86L061j709j806K751J414l877j223L662P03l860J974
1068c58K670l965m31M475n18l420J299K373k586j189M344q5m842M82L623k513
1084f41m36K784q80l469Q86L415o39k255J608N77k824J514L176k118j568P32N32
1101C94o00J39J633r04k414K00K072p73j69N34l82o99M6J350J074j690m60J870
$$ plain form
988 -1655 -737 3531 11 -3996 1598 3008 -2493 -1897 2208 -569 -3214 1131 2917 -1687 -2680 2199
1004 2199 929 -2408 1955 3018 -1580 -1772 2012 1551 -1203 387 1652 -1348 -2692 1470 1539 -2429
1020 -2429 -1154 574 -1126 -1057 1094 1525 -857 -1599 819 1389 -44 914 1404 -844 -1014 660 1325
1037 1325 99 -1133 -157 35 -1726 -402 1568 -983 -2095 410 1130 -407 -546 1399 595 -1864
1053 -1864 1043 3277 -962 -1448 1613 -96 -1902 849 2263 -1614 -2837 825 1528 -2332 -358
1068 -358 2312 -1653 -2084 2391 1873 -1547 -248 2125 -461 -1650 2694 2609 -2233 -1751 1872 -641
1084 -641 -1077 1707 827 -2642 -1756 1659 1020 -1235 373 950 -1874 -360 2816 698 -870 -138 394
1101 394 -206 -67 1566 662 -1752 -1552 520 -253 -422 112 -270 -969 -923 427 1501 -189 -649 1221
1119A221r53o08J458J65j993n82J729Q53k166J30J929k346r09K830L82k895Q00
1136i55K097j464j026K309J204l276m8L681j343k918K623K97k899O46L073j181
1152H20k697J369J533k345K46L424j968k518J984J819j896r5J589n96k440J508
1168b63K703k521q87J690q11j726J606J437j106j912J304J119j467M27J872j445
1184B0q07J365N95r17k46N22j16j185L82J369r80q91Q20J54o95L16O58j24j324
1203a084O6K071q17j049J371K30j699P10J345m69j613O58J295j357p51J825m83
1220B49k081J530J294j502k39J833n05j831J022J812j258j228J570M4j818J090
1236a8J506j441j295J340N78j268k4J717j070j615J860P12j530j40J596m03j000
$$ plain form
1119 1221 268 -340 1118 1283 -710 -1292 437 1290 -876 -746 1183 -1163 -2072 758 1140 -1755 -955
1136 -955 1142 -322 -1348 961 2165 -1111 -1159 2522 1179 -1739 884 1181 -1718 -1072 2001 820
1152 820 -1877 -508 1025 -1320 -1074 2350 382 -2136 -152 1667 -229 -324 1265 669 -1771 -263
1168 -263 2440 -81 -968 722 -89 -1815 -209 1228 122 -1790 -486 633 -834 -407 1465 20
1184 20 -787 578 1173 256 10 532 416 -769 -387 982 2 -889 -69 85 -610 -294 364 240 -1084
1203 -1084 -1018 1053 236 -813 558 788 -911 -201 1144 675 -938 -280 1015 -342 -1093 732 249
1220 249 -1832 -302 992 -510 -749 1084 579 -1252 -230 1582 324 -904 666 710 -1108 -18
1236 -18 1488 47 -1248 92 670 -598 -622 1095 25 -1590 270 982 -548 -688 908 505 -495
1253d95M02J476j083r77J393k60j285M98R87q77o42N28O60p40l85J164K93j522
1271h65R50M63m73n59Q96J74p30J07R11n08j301Q44Q21j436M1J129m91q31N84
1290b74Q38o92o64J400R7j304L92J342r96o40R33M00j194K19O53k98j167Q18P70
1309F33j437Q5J177k78j094N07J010p34n46J094K04r13K64J111j339m97J035L65
1327F47q96j29O83j87j002P43R52j249q6J035m77m34L20P59p20m93J002L19j014
1346b27J4R61r36l37Q07K24j006k25P78J10o74M14O78j133P5J151l99n07N9Q98
1366G25n33o41P99J37p40k93J128n88q41P88K00p15k5Q51N5p25M84N94o01m11
1386c52Q43r3q87K34Q55n04j84K43M15r45j32R89l12j020O68N82n03k26P43J33
$$ plain form
1253 -495 -93 1383 300 -677 716 456 -829 -331 656 -221 -863 -335 325 -415 -800 364 657 -865
1271 -865 85 548 75 -484 412 586 -144 -37 874 366 -935 -91 730 -706 -665 464 -27 -858 -274
1290 -274 564 -128 -792 608 705 -599 -207 1135 139 -501 432 832 -362 -143 510 212 -955 -137 633
1309 633 -804 -719 458 180 -914 -407 603 -131 -677 417 621 -292 -28 1083 -256 -753 282 647
1327 647 -249 -378 305 118 -884 -141 811 -438 -524 511 34 -400 -80 679 -41 -534 468 787 -227
1346 -227 -213 748 -188 -525 282 506 -500 -725 53 163 -511 -97 581 -552 -477 674 275 -232 -173 725
1366 725 192 -449 350 487 -253 -546 582 -6 -847 -59 141 -574 -599 252 307 -418 66 660 59 -352
1386 -352 491 398 -489 -255 600 96 -88 155 570 -375 -507 482 170 -850 -182 400 -103 -329 414 547
1406E47p36n1Q70p27m54J083k5p53L92K83l33n82M22J95k45j0N28k42n21N46J14
1427C01m04j17N58l9l55m9M97j42l06J24K47o95L27p2L17n50Q3N47m36l61O34
1448A09q3j49K65K18j90j50O5L03l10l00M58j51n84K85Q59q37j95M46N6o79L27
1469b37N49J21j125P21L25p53M55N39m55q63P46N31q94j68P53j55q96R50O17j140
1489c79L7R58k22r06N92N03n38m64J110l53o44L25M71r27K86L94j58n14J32M01
1509A04J53n20L24p9l42J59K68K4k71L36k80J51k13L53M4j99R2P0n31M40j86O6
1531c7J53k31o8N33m12Q7j2J07mj92M81J0o55K45J17m81J11Q04n35n47M65M87
1553D26m62l8K75J51r48N76P20p51l23O60j68m75Q64J00o24p16R68J11o94J76
$$ plain form
1406 547 -189 -240 630 -97 -551 532 507 -246 146 429 96 -486 -64 131 -114 -124 404 162 -359 187 301
1427 301 -103 -220 338 299 -56 -105 392 250 -56 68 315 -380 -53 -125 192 -358 -275 272 -164 -525 109
1448 109 26 -123 142 360 170 20 85 388 78 -222 236 85 -499 -214 645 -192 -387 59 115 -564 -237
1469 -237 312 433 -692 29 354 -399 56 595 140 -723 23 554 -340 -508 245 90 -806 144 761 -379
1489 -379 -342 616 394 -512 80 583 45 -419 691 338 -306 19 490 -437 -151 243 85 -429 -297 104
1509 104 257 -263 61 -18 -360 -201 67 91 -180 156 -124 27 -186 167 211 12 104 174 -357 83 -103 -37
1531 -37 116 -115 -183 350 -62 25 13 120 116 -76 405 415 -240 5 122 -359 -248 556 21 -526 -61 426
1553 426 -36 -74 201 352 -596 -20 700 -51 -374 286 118 -357 507 607 -17 -733 235 346 -348 -172
1573a72M18m07m59R73r7o64M87N2l06l31N69K60o21K82l8l19K90M09m17q9N4M31
1595C05l85j16K89j75j49K43K4L6o8J54k15oK22K54k14k70j30N0J97J37j00j20
1617c7n2j34J9L30r0l01K96J73l02J81L22m06k64L57L64m16k18L82j85k25M10
1638B04J96p73k34P10Q5m72L4O31n20l05O47p1n12N41K20n88k57O31J97o19K95
1659D0K39m42P2L74j54n32O01K2k70j41N12k1l72J1M07P8l13J51l28k06K61L78
1681C67l11l29N63n48J31L31O4l70J92J26j17J8l33J39M6j60N03l30L84m77K60
1702A49j07J2j49j41J78j24J46P5J94l54k15K79j13j28J48L62j24l57M89n8j25
1723C7k29O41l76k42J75Q3m13N12P2l50j56M41J61l75j2M85p07M3N80n01m1J39
$$ plain form
1573 -172 246 -161 -620 353 256 -408 79 131 -175 -506 63 323 -298 -16 -54 -373 -83 326 -91 -180 -126 305
1595 305 -80 -196 93 -82 -231 12 36 72 4 158 -57 -63 159 413 199 -71 -201 -151 46 183 83 -37
1617 -37 -89 -223 -204 126 36 -265 31 204 -98 83 405 -1 -265 92 456 40 -178 204 19 -206 204
1638 204 400 -373 -607 103 188 -284 -250 381 -139 -444 203 132 -380 161 381 -207 -464 167 364 -255 40
1659 40 279 -163 -91 283 129 -403 198 220 -50 -191 321 300 -72 -61 346 424 111 262 -66 -272 -11 367
1681 367 56 -273 290 -258 -127 204 268 -102 90 216 99 117 -216 -77 -31 -191 312 -18 366 -111 149
1702 149 42 54 -95 -236 -58 -182 -36 39 233 -121 -336 -57 -170 -298 -150 212 88 -269 220 162 37
1723 37 -192 449 73 -169 6 89 -324 188 260 -90 -246 195 356 -19 -31 454 -253 -210 370 -131 -172 -33
1745c3J92N6l27K65r0j25L2J53m03n7N63J32l41j45L40j30m81L53K29l11J85M4
1767A01P3n60J35M86m65J78NK48o9k05K4R7k15L11L9k03q1J35p1K8P3L63l36j89
1791i8M31l73o1P3M5N4j9j39J65q3j85J42Lj69L56l8k01n1o9K75k02J92L3j05
1815b4K88k0k63Q5k1k6nk32J21K58p8k11L23j40K8J10j53j63J66J80k52J5Lk9
1839d0J11R7l31J93k65R6J86l7k61J14J03J5LJ80j63%K12q5j2j70n6M1Q1Q5j67
1864g0p2j41N39L7l93P4k19K93J17J86k62p6k50K68J40r1k30L48j00K1o4J99m54
1887b00k5L90j94j76L39J6j27j18J41J24n2k51K65n4k43J91k1n0P9j7j48K66J05
1910B40o0m77K25L22k60N9J54m27L16j13J06l41L37k74J40J75k76J63R7k44J47
$$ plain form
1745 -33 159 215 -112 153 63 -62 -30 123 -280 -337 226 358 17 -128 212 82 -399 -46 183 -128 57 101
1767 101 174 -386 -251 235 -230 -52 -47 201 132 -73 -49 48 -167 144 183 -20 -101 34 -37 -9 64 427 91 -98
1791 -98 333 -40 -101 -28 17 71 52 -87 78 -5 -190 -48 -45 -214 142 104 -97 -148 -217 58 -144 48 81 -24
1815 -24 264 244 -19 66 45 19 14 -218 -97 161 83 -128 195 55 83 193 40 -123 43 223 -29 -14 -11 -40
1839 -40 71 168 -163 30 -235 -139 47 10 -251 -137 -34 -19 -16 164 1 1 213 128 116 -54 -110 -69 12 97 -70
1864 -70 -142 -283 256 293 -100 -26 -245 48 165 351 89 13 -237 31 171 80 -150 198 98 119 55 254 -200
1887 -200 -225 165 -29 -205 134 150 23 -95 46 170 118 -133 132 78 -165 26 5 -45 34 17 -131 135 240
1910 240 180 -297 -72 250 -10 49 203 -224 92 -21 85 -256 81 -193 -53 122 -154 9 106 -138 9
1931IQ3J44n8m27M35o51M25JJ57j96mJ70K23n27J38L8q5J40p1k9L3J91l84K82
1955C7N5j74K53j14l48K90M7k00K42n3O3j0J27j36m8q9K59l75L40M6m7k04j70
1978b09M28n92L11r7K18j14N9N2R6j06j17m7k68M38J23k66p7M7K98m13J14K21
2000I9j02M7r8J9K5Q1J87k91qO3j05o1J64j60K47k22O5M6J24k77J40O7q5L08m07
2025a34PK11k10J29J13l53K26J49k57L5K6O3j07L9K12j5J30n55M98j50j4j32M3
2048d6q2J69K00r7j45Q0j04k15K85K86j87l96N54m16R2J9Q9L9l09J92r1m8K09
2071G8L4j60j77L38l9j65j14K40j36n2J85j28L65j65k17p6L10Mkk57K45m5j6p1
2095b1J02j35J16l00K02J09j66J42k80O3J28J75j78k8no0Q1k03K13j18J75o8J09
$$ plain form
1931 9 92 236 178 -249 186 -465 -40 -39 118 -78 -82 88 311 -216 -78 -40 -125 15 -56 -85 -52 139 -245 37
1955 37 92 -82 171 57 -291 -1 46 -154 88 35 98 88 215 79 31 -58 201 -174 166 212 165 -39 -209
1978 -209 219 -373 -62 -159 59 -55 4 56 152 46 -71 -118 -386 52 175 -91 -168 -121 177 -236 -122 99
2000 99 -3 44 -54 -35 -10 71 258 -33 -41 22 -83 -144 20 -140 107 -115 -50 -4 120 -157 -17 50 -35 273 -134
2025 -134 -127 84 -126 3 116 -237 -11 138 -119 -84 -58 5 -102 -63 149 134 264 -291 207 57 43 -89 -46
2048 -46 -128 41 241 144 -1 79 -25 -240 45 331 144 -252 302 -114 -22 -3 86 125 -184 8 -83 -131 78
2071 78 112 -48 -225 113 74 -91 -205 35 -101 -153 32 -96 269 104 -113 -189 121 125 123 -134 111 66 50 -21
2095 -21 81 -54 62 -238 -36 73 -93 49 -231 -168 -40 135 -43 -71 -76 -136 -55 -258 -45 -163 12 -56 53
2118E3J46j06k15m7K22k04j3K81j45J68j50j49kJ62j20K55j99J31k22J26J13k12
2140a27J24j16K48k86J48l2J8J34j82J19P7k65n8M9K74j00k45J33K90k02P2r2
2162a9k46J32K3J47R8j14q8J51N9j24J84k4k11J43j13J00j92j3J10j93K54n1J17
2185A30k33j2L86k87J1Ok3J70j8j04J17k52k5M41j89k73P7j85J10K20q0Mq2j1
2209a02r6J80P1j2J25l58J11M7J92k80J95j71K87j20J79k24k70M9R7K75m5j57
2231b7j83L13k55J73N0m85M59k4l4L5J11l40m8L43j92L90m90K59j2k67K08pMk56
2255b75M06p4O1l20J43J00k12J88O3j16L78l75R1J38j63K62n21j8L97k68M57j61
2277A81J6j14k27K68p3l5J10j01l46N67j17k31J7P3k10M32n33M21%l49N23l84
$$ plain form
2118 53 199 93 -122 -169 53 -151 -164 117 -28 140 -10 -159 -161 1 -119 136 -63 68 -154 -28 85 -127
2140 -127 -3 -119 129 -157 -9 -41 -23 111 -71 48 125 -140 -198 -149 125 25 -220 -87 203 1 73 -19
2162 -19 -265 -133 -110 37 135 21 -67 84 143 19 203 179 -32 111 -2 98 -94 -107 3 -190 64 13 130
2185 130 -103 -115 271 -16 -5 1 -22 148 130 26 143 -109 -134 307 118 -155 -78 -263 -153 67 -13 -9 -91 -102
2209 -102 -198 -18 53 41 166 -192 -81 -34 158 -122 73 -98 189 69 248 24 -246 -197 -100 175 130 -27
2231 -27 -210 103 -152 21 71 -414 45 21 -13 22 133 -207 -255 88 -104 286 -204 55 43 -224 -16 -23 -19 -275
2255 -275 131 57 118 -202 -59 41 -171 17 80 -36 342 -33 58 196 33 295 -226 -244 153 -115 342 181
2277 181 197 83 -144 124 51 16 126 25 -321 246 129 -102 -85 -12 -222 210 -323 98 98 -251 272 -112
2299a12j21O13n27LK66j28l6J90j74o1K38j23J51j04j44M3Q2l26l9L54l5J60l48
2322a78K59j33j9k7o7j41L70j00L8j71L72k63J24O5k55N29k60Nj18j06j48K02
2344b2j49K23k26K49j56r7O7K15r9K94n65L54j29K06J45k55K50r3k28K63m03K99
2366A43l09J36J02m10K79M3o5K87m6L5j51q5K32J45m96K52P8j87L33k91o2r8P0
2389f5M6j40R3J24K8k07J1K70k85l0Q2KK0L1o6K59j29k22J68j11N1J58k18R1K35
2414A96l02M3J37j40R3k20L78M7n28M30j93pK9N5J05j14n0RJ65k37q3L58k58R4
2438GN2l09K67K92k46j13o3J80k71J50K06j57L1j57m9R0M9P4J10j30KJ17Q8k9
2462A91k02%N5O2N5p1q6L15J41k56l2m3k41K11j81J25j5j51J08j09L8j90K44O0
$$ plain form
2299 -112 -233 380 -147 -144 122 -6 -42 148 -26 -87 151 28 179 75 -69 -26 56 -270 -309 45 10 170 -178
2322 -178 81 -52 -71 -98 -165 -306 64 -36 2 -169 203 -60 64 129 -126 403 143 148 30 -76 -224 -22
2344 -22 -171 52 -174 75 -81 -178 -111 104 5 299 -266 88 -41 165 310 55 305 212 -16 247 -156 143
2366 143 -166 -30 72 -338 -59 -16 -81 206 160 195 44 -41 191 336 -160 92 170 -17 316 25 -37 -135 -65
2389 -65 -19 -159 -66 58 86 -121 -110 160 -125 -155 -73 -71 -51 -20 -86 173 44 -178 -10 -121 -70 88 -130 -39 196
2414 196 -106 -63 74 -66 27 -193 185 232 -296 134 -59 -66 -37 18 123 9 -41 -32 133 -104 -187 171 -87 7
2438 7 59 -250 17 309 63 -50 -113 67 -204 -54 152 -5 26 -131 -180 -90 -41 33 143 13 15 132 220 191
2462 191 -11 -11 44 106 161 90 4 319 460 204 172 129 -112 99 -82 43 28 -123 -15 -124 -86 -276 -32 28
2486B8N8j18J93j34P8r0N6k58JJ17N9j22K89R3l95K69j03K89N5k46Pj19R0j52
2510e5J71QM9p7pL7l4p4J51k79l2J91K40k85p1J99j71K8l72M52k23K21l3r2R1
2535C3M1J46k24K2j28K71m41K93l61L23j29J69m7j83L67k35J96k64L82m7k62Q0
2557Br4r6L63J5r3m3J26Pl35L73m96L23m31L97M9j10qJ09k20K33m6J59k4k18J24
2582F6J69l97L63k15m2J04J13l42J50L79k21l31L23Pk58K16j00K73l84L50J63
2603C86n35M02r7l83J71l1K33l7Ll12J41K29P9l21%r6L81k70J22k34J43j57K43
2626F0n2K1j99J79j23L2J85n0j56j08K51p7J69J26l27j36M64m00K89r0q7k8J26
2649F9kk35L93j75k32Q0M4r8N36m87j09L61L0r6K17k4m50K01K06R8l01R6M8j45
$$ plain form
2486 28 86 -32 161 27 105 15 71 -187 -186 -69 -10 -132 157 250 -145 124 21 310 365 119 126 7 97 -55
2510 -55 116 124 173 96 89 126 92 18 169 -110 -142 49 289 4 -67 132 -39 -11 -383 69 -154 67 34 -58 33
2535 33 74 220 -4 18 -110 161 -280 13 -348 -25 -154 15 -32 -215 152 -83 113 -151 231 184 -78 2
2557 2 -92 -188 175 190 97 54 180 187 -148 225 -271 52 -379 18 67 -43 -51 58 -162 71 25 184 160 -58 66
2582 66 235 -162 201 -14 -56 48 161 -181 -31 348 127 -204 119 126 -132 84 -16 257 -127 223 386
2603 386 -149 253 156 -227 -56 -87 146 109 112 -200 -59 170 249 -72 -72 -168 213 -57 65 -169 -26 -183 60
2626 60 8 29 -170 9 -114 -82 103 53 -103 -211 40 -37 132 258 -69 -205 259 -141 148 58 -29 -57 69
2649 69 67 -168 225 50 -182 -102 -58 -156 380 -107 -216 145 175 79 296 272 -178 23 229 327 26 122 170 25
2673B5j82K37l25M66k15%r7j56K04J41j9r6r3o3J75Q6k92J95J79L2l46Q4j33J3
2697a80K32rj2j85L3L82k35p9K00k74J12kJ16j02M3J11k34K3J39j6P7j53K5Q7
2721I9j30j69J53j57M4L9J14l6J26k00Q1K00j09k61L14j68k10M15r4J30qk06k20
2744b53L70k82K39r5k38K12N4j23P5L74l99K31j06J4j69K12P4k49j74L56j32J2
2766Ck10L04K1j86J53j91L06k23L00j43k62K04O2k22J4m4J08P5n8j86L41j55n8
2789d7Q8k31J74R2J77j02m49M22m8j54J63J62k89O2J96j95L32m40P5K94j85L3
2811A30p4p0q5J08l4J96j10j35R0k61K74j8k90P4L80k7pj64nR1J12K12j98P2l62
2836a01j00J05K12N8k11P9k14J03q3J33P7j72J02J4J27j44J57k02J79rr8M9O7
$$ plain form
2673 25 -157 80 -245 221 6 6 -91 -247 -43 98 79 -17 -110 -173 2 88 -204 -9 170 202 -144 -60 -193 -180
2697 -180 52 43 31 -154 -121 261 26 -53 147 -127 -15 -17 99 -3 40 151 -83 -60 79 63 140 -13 12 99
2721 99 -31 -200 -47 -204 -160 -121 -7 -43 83 -117 -36 164 55 -206 108 -60 -270 145 51 181 173 -33 -253
2744 -253 117 -165 74 -21 -259 -47 7 -116 -41 333 -66 165 59 73 -96 116 190 -59 -233 123 -9 3
2766 3 -207 97 118 -68 85 -106 200 -23 277 134 -128 76 138 -84 -70 -114 -6 69 11 -175 166 11 -47
2789 -47 41 -190 -16 76 253 151 -298 124 76 -78 85 247 -42 20 216 21 353 -87 -12 282 97 130
2811 130 56 -14 -99 9 -25 171 61 -74 16 -245 29 11 -279 -205 175 148 141 -23 -28 63 175 387 189 261 -101
2836 -101 -201 -96 116 174 -37 42 -172 -69 -152 -19 58 -114 -12 2 129 -15 142 -60 119 110 12 61 128
2859A28k44J12L51m46J63m7ok33P1J9K61j8L8l34K85k35K33l5j29K24j62j71M7
2882a28r9N0j10P3K35K1k70K55l2J2j96L85J4k49o9n3l4M56l02K0k31J43J93J43
2906B27j12j6j4pj68Q4J24K03l37M10l16k03L20L9k45NJ73m19J51Q0K53q7r6j38
2930h9K85j89J3%J14j42J64Lj29J49l12L4R5l29L77q4K33l86J76K04l56J68p9
2953h0J80J8n3j13K0k07K77k15J26o0J19k45J83J76k16J23k20L48j63J92k10J96
2975A76k51J5m8K06j67o0R1k93M25k30M19j23o4k88L03k86l9J35J28m5Rj10Q7
2998a0j04J44O0j71P8j45L82j30q6j48J32M5j0j30j30L32j64Q7J07J24j40k15
3020i2r2K23Q5n9m7k23j1K25K45o6k79K45o3m23L72k97L12p5J54j56o4L31l20
$$ plain form
2859 128 -116 -4 347 -99 64 17 11 -222 -151 -132 129 111 149 -185 100 -135 98 63 -66 158 -4 -175 -128
2882 -128 -227 -177 -287 -214 21 42 -228 27 -5 7 -189 196 210 -39 -108 -161 -195 261 -41 -21 -252 -109 84 227
2906 227 115 99 85 78 -90 -6 118 321 -16 394 78 -125 195 234 -11 -6 167 -252 -101 -21 232 145 49 -89
2930 -89 196 7 20 20 134 -8 156 159 30 179 -133 -99 -4 -333 44 -40 193 -193 -17 187 -169 -1 -80
2953 -80 100 118 65 -48 -28 -235 42 -173 -47 -107 12 -233 -50 126 -90 33 -187 161 -2 190 -20 176
2975 176 -75 -60 -108 98 -69 -129 -38 -331 94 -136 283 160 96 -192 111 -175 -214 -79 49 4 13 -97 -10
2998 -10 -114 30 90 -81 -3 -148 234 104 18 -130 2 47 37 -93 -223 109 -55 32 139 263 123 -92
3020 -92 -184 39 124 65 18 -205 -216 9 254 188 -91 154 91 -332 40 -257 55 -20 134 -22 -86 245 -75
3043g5j17J28j8K54l27J34m0j32L15o0l1j78J43k32J47K42k61J17Oj52j54K10
3065h1L18m15mQ8K38o7o7J17k24J25k2Mk82M16N2m07J95J54k29l2K99j88J88k39
3089f3J28l71L24n8J70j37P5j7k37J97k54L89k52o7K10m04L09k1K71k33O2j17
3111i6k1q5J92R1J6k27K26k27L62k00j23J21R9k66J50P5j40J48l07L79k24M93
3133D36k95j13n4K04l3l85L39k69K44j85J70J10k0j22k1k3l1L4oq0NJ37R6j45
3157gj84J19o1K59J89n34J76K17r6j47J3J54l24K42k8K80l41j5R4P5n6q9J05j25
3181h4J03k2k9j47K42kj4M4o17M05K35L28p28L4L54j94M9j15m1L75J32k73J77
3204B12l93K51r0n2J24k84L83n9J30j61J09p1k6J90j64q5J63m19M18M3Qk51P3
$$ plain form
3043 -75 -192 -64 -82 172 -155 -21 -61 -193 122 62 31 -147 -4 -236 -89 153 -108 9 15 -137 -291 -81
3065 -81 237 -178 -182 -94 144 77 10 127 -97 28 6 10 -272 144 196 -211 -16 138 -91 -123 176 -12 176 -63
3089 -63 65 -306 18 -40 130 -7 68 51 -186 11 -243 146 -106 -173 37 -367 -58 -79 192 -41 21 -96
3111 -96 -117 -202 -10 81 97 -130 96 -131 231 31 -92 29 128 -138 12 87 -53 95 -212 167 -57 436
3133 436 141 28 -26 178 145 -240 99 -170 74 -111 59 169 149 27 6 -17 -48 -14 -20 -100 -95 42 138 -7
3157 -7 -191 -72 -133 126 315 -219 -43 174 78 -69 -56 98 -226 16 -12 268 -73 -88 6 81 25 -64 41 -84
3181 -84 19 -3 -32 -179 63 61 47 91 -526 -121 114 442 -286 -252 102 -92 -43 -158 -199 176 308 35 212
3204 212 -181 70 -20 -72 52 -232 151 92 222 61 170 99 73 263 99 14 177 -242 176 219 227 -24 49
3227D9j88m9K91j09J13j88K75k11J70k69J54N2j00j48%L0K07k94L35k39N89l31
3249A39j75J41l83J55P0L33k77m5j02L27j67k5j09J08k4J82j0Mk36p3M74p1k33
3272Cj50K25J02J33l85m2J21L4J8J54k92j63L32l6j35o5L19n13N20j60J24j26
3294A8K2Rj43K92o4k31M5M7K21l89K03j04K24j15K06l0j67J1l20K41R1q5n6L32
3318B58o51J35N12m82P1L87m14J49k02n9Ql2L24l1k0r7J47J4k9m5J86j56J27p7
3342B3N4l9j86L5rJ32j90K26L9k99L21l05L14p2q1R1O0k14J09N0l65L80k38J16
$$ plain form
3227 49 -139 -188 103 -6 107 -81 194 -17 153 -116 38 90 -10 -158 -158 -128 79 -215 120 -119 470 139
3249 139 -36 105 -278 -123 -53 280 3 -42 -144 183 16 -9 -118 -10 -34 148 138 142 -94 -167 307 236 3
3272 3 -147 78 180 313 -72 -114 7 41 59 213 -79 -242 90 54 -81 -146 173 -340 180 20 144 18
3294 18 40 49 -94 198 134 -97 -52 -5 216 -173 30 -74 150 35 241 211 44 55 -265 -24 67 -18 -74 258
3318 258 -393 -258 254 -228 -157 230 -184 -35 -237 -296 -288 -320 4 -27 -47 -144 3 17 -12 -57 129 -27 100 23
3342 23 77 38 -148 -113 -122 10 -180 46 85 -214 107 -198 116 44 -37 54 114 -100 9 59 -306 74 -164 -48
$$ [...]
8191b38
##END NTUPLES=NMR FID
##END=
