##TITLE=1H_Pr C6-Et
 CDCl3
 8 sc, 
 6.12.2021
##JCAMPDX= 6.0         $$ Bruker NMR JCAMP-DX V2.0
##DATA TYPE= NMR FID
##DATA CLASS= NTUPLES
##ORIGIN= UXNMR, Bruker Analytische Messtechnik GmbH
##OWNER= root
$$ XWIN-NMR		Version 3.5
$$ Mon Dec  6 11:03:41 2021 Russian Standard Time (UT+4h)  she@DPX200
##.OBSERVE FREQUENCY= 200.131346
##.OBSERVE NUCLEUS= ^1H
##.DELAY= (6, 6)
##.ACQUISITION MODE= SIMULTANEOUS
##.ACQUISITION SCHEME= undefined
##.AVERAGES= 8
##.DIGITISER RES= 18
##SPECTROMETER/DATA SYSTEM= spect
##.PULSE SEQUENCE= zg30
##.SOLVENT NAME= D2O
##.SHIFT REFERENCE= (INTERNAL, D2O, 0, 15.7039)
##AUDIT TRAIL= $$ (NUMBER, WHEN, WHO, WHERE, WHAT)
$$ ##TITLE= Audit trail, XWIN-NMR		Version 3.5
$$ ##JCAMPDX= 5.01
$$ ##ORIGIN= Bruker BioSpin GmbH
$$ ##OWNER= she
$$ F:/spectra/data/she/nmr/H-F/1/audita.txt
$$ ##AUDIT TRAIL=  $$ (NUMBER, WHEN, WHO, WHERE, WHAT)
(   1,<2021-12-06 11:02:46.92 +0400>,<she>,<DPX200>,
      <created by zg, POWCHK disabled, PULCHK disabled
       configuration hash MD5:
       00 E9 B6 7A A2 85 ED C7 34 08 36 98 17 FE 4E 26
       data hash MD5: 16K
       D1 8C 4D B8 EF 19 68 F2 9B 69 A2 08 B8 9F 0D F9>)
$$ ##END=
$$ 
$$ hash MD5
$$ 01 B5 33 E4 D7 F8 FC 5C 88 BA 79 3C 27 0B 1B A1
##$RELAX= 
##$RELAX= 
##$RELAX= 
##$RELAX= 
##$RELAX= 
##$RELAX= 
$$ Bruker specific parameters
$$ --------------------------
##$DU= <F:/spectra>
##$EXPNO= 1
##$NAME= <H-F>
##$PROCNO= 1
##$TYPE= <nmr>
##$USER= <she>
##$AMP= (0..31)
100 100 100 100 100 100 100 100 100 100 100 100 100 100 100 100 100 100 
100 100 100 100 100 100 100 100 100 100 100 100 100 100 
##$AQSEQ= 0
##$AQ_mod= 1
##$AUNM= <au_zg>
##$AUTOPOS= <>
##$BF1= 200.13
##$BF2= 200.13
##$BF3= 200.13
##$BF4= 200.13
##$BF5= 200.13
##$BF6= 200.13
##$BF7= 200.13
##$BF8= 200.13
##$BYTORDA= 1
##$CFDGTYP= 0
##$CFRGTYP= 5
##$CHEMSTR= <none>
##$CNST= (0..31)
1 1 145 1 1 1 1 1 1 1 1 1 1 1 1 1 1 1 1 1 1 1 1 1 1 1 1 1 1 1 1 1 
##$CPDPRG= <>
##$CPDPRG1= <>
##$CPDPRG2= <>
##$CPDPRG3= <>
##$CPDPRG4= <mlev>
##$CPDPRG5= <mlev>
##$CPDPRG6= <mlev>
##$CPDPRG7= <mlev>
##$CPDPRG8= <mlev>
##$CPDPRGB= <>
##$CPDPRGT= <>
##$D= (0..31)
0 1.2 0 0 0 0 0 0 0 0.06 0 0.03 0 0 0 0 0.0002 0 0 0 0 0 0 0 0 0 0 0 0 
0 0 0 
##$DATE= 1638774166
##$DBL= (0..7)
120 120 120 120 120 120 120 120 
##$DBP= (0..7)
150 150 150 150 150 150 150 150 
##$DBP07= 0
##$DBPNAM0= <>
##$DBPNAM1= <>
##$DBPNAM2= <>
##$DBPNAM3= <>
##$DBPNAM4= <>
##$DBPNAM5= <>
##$DBPNAM6= <>
##$DBPNAM7= <>
##$DBPOAL= (0..7)
0.5 0.5 0.5 0.5 0.5 0.5 0.5 0.5 
##$DBPOFFS= (0..7)
0 0 0 0 0 0 0 0 
##$DE= 6
##$DECBNUC= <off>
##$DECIM= 32
##$DECNUC= <off>
##$DECSTAT= 4
##$DIGMOD= 1
##$DIGTYP= 9
##$DL= (0..7)
0 120 120 120 120 120 120 120 
##$DP= (0..7)
150 150 150 150 150 150 150 150 
##$DP07= 0
##$DPNAME0= <>
##$DPNAME1= <>
##$DPNAME2= <>
##$DPNAME3= <>
##$DPNAME4= <>
##$DPNAME5= <>
##$DPNAME6= <>
##$DPNAME7= <>
##$DPOAL= (0..7)
0.5 0.5 0.5 0.5 0.5 0.5 0.5 0.5 
##$DPOFFS= (0..7)
0 0 0 0 0 0 0 0 
##$DQDMODE= 0
##$DR= 18
##$DS= 0
##$DSLIST= <SSSSSSSSSSSSSSS>
$$ [...]
##$SUBNAM2= <"">
##$SUBNAM3= <"">
##$SUBNAM4= <"">
##$SUBNAM5= <"">
##$SUBNAM6= <"">
##$SUBNAM7= <"">
##$SUBNAM8= <"">
##$SUBNAM9= <"">
##$SW= 18.0517287032376
##$SWIBOX= (0..15)
0 0 2 0 0 0 0 0 0 0 0 0 0 0 0 0 
##$SW_h= 3612.71676300578
##$TD= 16384
##$TD0= 1
##$TE= 0
##$TE2= 300
##$TE3= 300
##$TEG= 300
##$TL= (0..7)
0 120 120 120 120 120 120 120 
##$TP= (0..7)
150 150 150 150 150 150 150 150 
##$TP07= 0
##$TPNAME0= <>
##$TPNAME1= <>
##$TPNAME2= <>
##$TPNAME3= <>
##$TPNAME4= <>
##$TPNAME5= <>
##$TPNAME6= <>
##$TPNAME7= <>
##$TPOAL= (0..7)
0.5 0.5 0.5 0.5 0.5 0.5 0.5 0.5 
##$TPOFFS= (0..7)
0 0 0 0 0 0 0 0 
##$TUNHIN= 0
##$TUNHOUT= 0
##$TUNXOUT= 0
##$USERA1= <user>
##$USERA2= <user>
##$USERA3= <user>
##$USERA4= <user>
##$USERA5= <user>
##$V9= 5
##$VALIST= <valist>
##$VCLIST= <CCCCCCCCCCCCCCC>
##$VD= 0
##$VDLIST= <DDDDDDDDDDDDDDD>
##$VPLIST= <PPPPPPPPPPPPPPP>
##$VTLIST= <TTTTTTTTTTTTTTT>
##$WBST= 1024
##$WBSW= 4
##$XGAIN= (0..3)
0 0 0 0 
##$XL= 0
##$YL= 0
##$YMAX_a= 76369
##$YMIN_a= -107395
##$ZGOPTNS= <>
##$ZL1= 120
##$ZL2= 120
##$ZL3= 120
##$ZL4= 120
##$ABSF1= 10
##$ABSF2= 0
##$ABSG= 5
##$ABSL= 3
##$ALPHA= 0
##$AQORDER= 0
##$ASSFAC= 0
##$ASSFACI= 0
##$ASSFACX= 0
##$ASSWID= 0
##$AUNMP= <proc_1d>
##$AZFE= 0.1
##$AZFW= 0.1
##$BCFW= 1
##$BC_mod= 2
##$BYTORDP= 1
##$COROFFS= 0
##$CY= 11.3945322036743
##$DATMOD= 1
##$DC= 2
##$DFILT= <>
##$DTYPP= 0
##$F1P= 2.36226072786647
##$F2P= -0.459571619588291
##$FCOR= 0.5
##$FTSIZE= 0
##$FT_mod= 4
##$GAMMA= 1
##$GB= 0.15
##$INTBC= 1
##$INTSCL= 1
##$ISEN= 128
##$LB= 0.24
##$LEV0= 0
##$LPBIN= 0
##$MAXI= 10000
##$MC2= 0
##$MEAN= 0
##$ME_mod= 0
##$MI= 1.114404
##$NCOEF= 0
##$NC_proc= 0
##$NLEV= 6
##$NOISF1= 3.799351
##$NOISF2= 2.8
##$NSP= 1
##$NTH_PI= 0
##$NZP= 0
##$OFFSET= 15.70392
##$PC= 1
##$PHC0= -15511.83
##$PHC1= 10.60081
##$PH_mod= 1
##$PKNL= yes
##$PPARMOD= 0
##$PSCAL= 0
##$PSIGN= 0
##$REVERSE= no
##$SF= 200.130013532006
##$SI= 16384
##$SIGF1= 3
##$SIGF2= 2
##$SINO= 400
##$SIOLD= 16384
##$SREGLST= <1H.CDCl3>
##$SSB= 0
##$STSI= 0
##$STSR= 0
##$SW_p= 3612.71676300578
##$SYMM= 0
##$S_DEV= 0
##$TDeff= 0
##$TDoff= 0
##$TI= <>
##$TILT= no
##$TM1= 0
##$TM2= 0
##$TOPLEV= 0
##$USERP1= <user>
##$USERP2= <user>
##$USERP3= <user>
##$USERP4= <user>
##$USERP5= <user>
##$WDW= 1
##$XDIM= 8192
##$YMAX_p= 0
##$YMIN_p= 0
$$ End of Bruker specific parameters
$$ ---------------------------------
##NTUPLES= NMR FID
##VAR_NAME=  TIME,          FID/REAL,        FID/IMAG
##SYMBOL=    X,             R,               I
##VAR_TYPE=  INDEPENDENT,   DEPENDENT,       DEPENDENT
##VAR_FORM=  AFFN,          ASDF,            ASDF
##VAR_DIM=   8192,          8192,            8192
##UNITS=     SECONDS,       ARBITRARY UNITS, ARBITRARY UNITS
##FACTOR=    0.0002768,     1,               1
##FIRST=     0,             0,               0
##LAST=      2.2672688,     0,               0
##MIN=       0,             -107395,         0
##MAX=       2.2672688,     76369,           0
$$ Real data points
##PAGE= N=1
##DATA TABLE= (X++(R..R)), XYDATA
$$ [...]
$$ plain form
1735 45 -180 -24 245 59 -4 -46 -324 -235 -71 97 -244 -517 -391 -55 96 -162 -33 14 76 28 53 106 83
1758 83 158 556 485 209 59 23 217 530 103 -171 -26 36 -7 111 -43 -83 -133 -182 -278 -359 -248 -541 -343 -201
1782 -201 -355 -234 -51 -39 353 74 250 314 155 323 181 401 326 468 486 457 244 107 6 -165 161 -3
1804 -3 74 99 -171 -217 -208 -177 -437 -500 -201 -185 65 -157 -60 -300 30 -29 368 209 325 385 554 354 449 216 319
1829 319 204 390 295 288 -162 66 -222 -114 -289 -337 -250 -554 -348 -427 -366 -449 193 -172 157 97 33 -85 217
1852 217 181 228 264 -7 450 235 346 336 156 107 98 114 41 -135 -11 -382 -281 -79 -307 -359 -319 -371 -304 -396 -253
1877 -253 -233 -141 -139 56 -70 209 313 10 255 321 94 37 172 310 192 268 -172 104 -110 170 74 -259 -424
1900 -424 128 -289 -236 -204 -308 -185 -268 -249 -111 -50 -290 74 14 334 200 196 86 17 181 261 435 293 -2
$$ packed form
1735D5k25J56K69j86o3m2k78Q9J64J68l41k73J26L36J51k58J29M7O2m8K5N3k3
1758H3P5L98p1k76j50l6J94L13m27k74J45O2m3J18j54m0n0m9r6q1J11k93J98J42
1782b01j54J21J83J2L92k79J76O4j59J68j42K20p5J42J8k9k13j37j01j71L26j64
1804cP7K5k70m6RL1k60o3K99J6K50k22R7k40L30n9L97j59J16O0J69k00R5k33J03
1829C19j15J86r5pm50K28k88J08j75m8Q7l04K06p9O1q3O42l65L29o0o4j18L02
1852B17l6M7L6k71M57k15J11j0j80m9rJ6p3j76J24l71J01K02k28n2M0n2O7r2J43
1877b53K0R2KJ95j26K79J04l03K45O6k27n7J35J38j18P6m40K76k14K80r6l33j65
1900d24N52m17N3L2j04J23q3J9J38O1k40L64o0L20j34mj10o9J64Q0J74j42k95
$$ plain form
1923 -2 251 206 96 163 107 -97 -148 -240 -351 -109 -251 -260 -303 -128 -312 -105 -224 -133 28 -4 159 90 51 150 471
1948 471 317 128 172 555 200 317 211 147 200 -5 -75 -294 -329 -413 -460 -240 -409 -353 -209 -321 -180 -127 -296
1971 -296 -400 -324 90 -26 -25 -89 162 400 278 315 358 407 265 318 235 163 92 -177 108 367 1 -125 -132 -146 -228
1996 -228 -172 -380 -293 -232 -2 -306 24 -27 -85 -20 164 163 45 136 202 116 530 -24 382 148 19 -1 99 2
2020 2 115 62 -12 31 -201 -140 -349 -44 -501 -467 -420 -360 -14 203 -87 -144 -125 167 -3 110 294 -21 183 64
2044 64 114 192 194 218 281 163 332 -149 135 -204 -99 67 3 -56 -277 -6 -276 -220 -277 -253 -155 -1 71 44 -166
2069 -166 -195 113 139 201 250 415 -65 327 329 145 347 472 -1 80 39 -40 -154 -74 -81 -82 -158 -288 -391 -141 -173
2094 -173 -255 -134 -114 -93 -132 79 36 92 215 297 241 257 396 262 303 75 259 234 -51 118 193 107 -39 -197
$$ packed form
1923bK53m5j10O7n6k04n1r2j11K42j42rm3J75j84K07j19R1J61l2J63o9l9R9L21
1948D71j54j89M4L83l55J17j06o4N3k05p0k19l5q4m7K20j69N6J44j12J41N3j69
1971b96j04P6M14j16Jo4K51K38j22L7M3M9j42N3q3p2p1k69K85K59l66j26pj4q2
1996b28N6k08Q7O1K30l04L30n1n8O5J84jj18R1O6q6M14n54M06k34j29k0J00r7
2020BJ13n3p4M3k32O1k09L05m57L4M7O0L46K17k90n7J9K92j70J13J84l15K04j19
2044F4N0P8KK4O3j18J69m81K84l39J05J66o4n9k21K71k70N6n7K4R8J54P2k7k10
2069a66k9L08K6O2M9J65m80L92Kj84K02J25m73Q1m1p9j14Q0pjp6j30j03K50l2
2094a73q2J21K0K1l9K11m3N6J23Q2n6J6J39j34M1k28J84k5k85J69P5q6j46j58
$$ plain form
2118 -197 -91 -241 -94 -73 -507 -255 -232 -105 -114 -388 -203 -309 63 224 -69 -221 -74 187 387 380 208 229
2140 229 118 177 329 66 32 249 346 31 108 2 -150 -97 -167 52 -250 -315 -154 -260 -172 -152 -121 -66 -77 -108
2164 -108 -62 187 -188 234 167 246 282 188 46 281 320 -141 187 45 -195 -154 32 -26 -315 -247 -430 -160 -175
2187 -175 -419 -62 22 -11 143 77 110 24 49 297 340 303 170 -73 232 222 216 106 -23 239 136 14 -114 13
2211 13 -153 -88 -5 -255 -76 -548 -151 -216 -112 -241 -310 -176 -228 72 188 140 -40 22 219 243 70 177 275
2234 275 427 30 -100 223 225 -231 45 -8 -145 97 -333 -273 -154 -208 -492 -271 -279 -63 154 -256 55 -19 -209
2257 -209 239 456 -34 211 379 407 162 164 9 124 88 263 85 -57 114 -159 -37 176 -386 -85 -35 -103
2279 -103 -140 -129 -286 -163 -266 -170 -20 -180 -92 6 66 16 65 246 285 -20 118 198 22 -59 116 60 360 31
$$ packed form
2118a97J06j50J47K1m34K52K3J27rk74J85j06L72J61k93j52J47K61K00pj72K1
2140B29j11N9J52k63l4K17R7l15P7j06j52N3p0K19l02o5J61j06Q8K0L1N5j1l1
2164a08M6K49l75M22o7P9L6r4j42K35L9m61L28j42k40M1J86n8k89O8j83K70j5
2187a75k44L57Q4l3J54o6L3q6K5K48M3l7j33k43L05j0oj10j29K62j03j22j28J27
2211A3j66O5Q3k50J79m72L97o5J04j29o9J34n2L00J16m8j80O2J97K4j73J07R8
2234B75J52l97j30L23Km56K76n3j37K42m30O0J19n4k84K21qK16K17m10L11p4j90
2257b09M48K17m90K45J68K8k45Kj55J15l6J75j78j42J71k73J22K13n62L01N0o8
2279a03l7J1j57J23j03R6J50j60Q8R8O0n0M9J81L9l05J38Q0j76q1J75n6L00l29
$$ plain form
2303 31 187 -140 44 120 -155 -109 -228 -39 -165 -229 -90 -391 -146 -32 76 118 25 -3 20 162 423 230 185
2326 185 345 176 167 141 55 100 241 233 233 -33 -123 7 -140 -104 -272 -86 -237 -463 -169 -297 -120 -217 -89 41
2350 41 74 -51 94 174 310 -52 72 42 172 107 45 -70 148 14 129 58 31 241 -18 -214 66 12 -141
2373 -141 4 -104 -72 -212 -167 -50 -241 -116 -88 50 85 56 85 289 364 233 290 45 -62 -24 -40 370 -12
2396 -12 117 -233 -272 78 -255 -172 -399 -270 -293 -86 -34 32 89 -269 -119 -42 35 22 -45 6 96 103 155 83 210 165
2422 165 23 115 290 -7 367 236 -120 -202 -119 -358 -83 -269 -209 -235 39 -88 -211 -424 -150 -403 -82 147
2444 147 -107 37 69 168 190 175 -108 255 212 253 279 101 -147 -58 39 -267 41 34 210 -85 -192 -224 191 -41
2468 -41 -96 -74 -135 -143 -355 -172 8 -142 -121 176 68 198 -9 352 278 213 148 78 205 299 174 8 -41 148
$$ packed form
2303C1J56l27J84P6k75M6j19J89j26o4J39l01K45J14J08M2r3k8K3J42K61j93m5
2326A85J60j69rk6q6M5J41q%k66r0J30j47L6j68J86j51k26K94j28J77r7J28J30
2350D1L3j25J45Q0J36l62J24l0J30o5o2j15K18j34J15p1k7K10k59j96K80n4j53
2373a41J45j08L2j40M5J17j91J25K8J38L5k9K9K04P5j31N7k45j07L8j6M10l82
2396a2J29l50l9L50l33Q3k27J29k3K07N2O6N7l58J50P7P7j3o7N1R0PN2p2J27m5
2422A65j42R2J75k97L74j31l56q2Q3k39K75j86O0k6K74j27j23k13K74k53L21K29
2444A47k54J44L2R9K2j5k83L63m3M1K6j78k48Q9R7l06L08pJ76k95j07l2M15k32
2468d1n5K2o1qk12J83J80j50K1K97j08J30k07L61p4o5o5p0J27R4j25j66m9J89
$$ plain form
2492 148 44 -138 -118 -147 -114 -283 -51 -309 -62 19 -92 13 -126 -57 153 13 -81 224 101 -12 201 303
2514 303 -1 326 179 -66 74 171 24 21 186 61 -191 -25 -335 -268 -178 -61 -105 -138 -343 -267 -211 -83 28
2537 28 17 -39 -158 77 64 17 -127 194 228 298 221 305 97 113 118 216 -21 -21 -8 -139 -108 -67 -222 -112 -246 -416
2563 -416 7 230 -6 -173 65 -74 -31 227 16 -33 178 36 406 236 130 6 -26 40 -85 35 211
2584 211 121 -16 -28 19 -185 -112 -87 -135 -495 -155 80 -161 -121 -171 -233 25 46 170 7 151 191 -4 38 13
2608 13 116 143 36 75 -82 233 94 -12 -53 27 -59 43 -235 -397 -203 -50 -118 -337 -288 25 4 -462 -42
2631 -42 -81 -141 133 292 109 221 107 125 24 235 124 -39 179 -20 0 109 170 -39 269 -133 -126 -131 -244
2654 -244 -52 -363 -83 2 -273 -126 -284 53 51 -119 -45 192 3 229 191 247 269 363 165 216 237 17 15 139
$$ packed form
2492A48j04j82K0k9L3j69K32k58K47Q1j11J05j39O9K10j40r4L05j23j13K13J02
2514C03l04L27j47k45J40R7j47lJ65j25k52J66l10O7R0J17m4l3k05P6N6J28J11
2537B8j1n6j19K35j3m7j44L21L4P0p7Q4k08J6NR8k37%J3j31L1M1j55J10j34j70
2563d16M23K23k36j67K38j39M3K58k11m9K11j42L70j70j06j24l2O6j25J20J76
2584B11r0j37j2M7k04P3K5m8l60L40K35k41M0n0o2K58K1J24j63J44M0j95M2k5
2608A3J03K7j07L9j57L15j39j06m1Q0q6J02k78j62J94J53o8k19M9L13k1m66M20
2631d2l9o0K74J59j83J12j14J8j01K11j11j63K18j99K0J09O1k09L08m02Pnj13
2654b44J92l11K80Q5k75J47j58L37kj70P4K37j89K26l8N6K2R4j98N1K1k20kJ24
$$ plain form
2678 139 162 -116 88 120 -163 -126 -144 -180 -230 -56 -15 -57 -158 -355 -67 141 223 -210 -59 29 -75 -3 -185 -54
2702 -54 303 34 180 85 -60 155 80 44 -69 -57 -88 -87 -131 82 -91 168 -9 -276 -41 -163 -264 -41 -66
2725 -66 -97 5 47 235 221 67 83 232 128 243 120 122 268 133 136 122 34 62 191 -59 136 -568 -144 -204
2749 -204 30 -234 82 -14 -191 72 -48 -82 -114 94 -48 259 145 186 135 330 20 28 108 232 244 41 166
2772 166 22 113 -9 -119 -205 -201 -128 -194 -248 -376 -34 -116 -343 -38 -371 17 -219 253 -218 -75 -26 83 -101
2795 -101 -50 402 4 279 125 -6 254 161 17 110 0 -9 -128 -36 -185 2 -240 36 -126 -130 -232 -128 -239
2818 -239 66 -124 -19 75 92 241 186 258 284 -246 322 191 154 83 15 98 148 86 -64 113 -50 -167 10 -76
2842 -76 -235 32 -123 38 -148 -125 -242 90 74 54 115 16 427 147 171 -188 -18 -124 -2 189 137 124 119 300
$$ packed form
2678A39K3k78K04L2k83L7j8l6n0J74M1m2j01j97K88K08Q2m33J51Q8j04P2j82J31
2702e4L57k69J46r5j45K15p5l6j13J2l1Jm4K13j73K59j77k67K35j22j01K23k5
2725f6l1J02M2J88j4j54J6J49j04J15j23KJ46j35Lj4q8K8J29k50J95p04M24o0
2749b04K34k64L16r6j77K63j20l4l2K08j42L07j14M1n1J95l10QQ0J24J2k03J25
2772A66j44R1j22j10q6MP3o6n4j28L42q2k27L05l33L88k36M72m71J43M9J09j84
2795a01N1M52l98K75j54j31K60r3j44R3j10rj19R2j49J87k42K76j62mj02J04j11
2818b39L05j90J05R4J7J49n5P2K6n30N68j31l7p1o8Q3N0o2j50J77j63j17J77q6
2842g6j59K67j55J61j86K3j17L32j6k0O1r9M11k80K4l59J70j06J22J91n2j3nJ81
$$ plain form
2866 300 27 -138 26 -120 -155 46 -199 30 -197 -236 73 -276 -292 -39 52 180 12 -127 119 261 129
2887 129 227 -170 160 21 181 204 50 89 -210 74 134 140 94 59 42 -255 -19 -6 -151 -162 -1 17 -322 -21
2911 -21 -17 -50 -26 98 63 30 -101 -3 -31 10 45 -109 177 209 0 159 3 53 -84 -118 -107 -179 -190 76 156 -145
2937 -145 -266 -91 -66 -205 132 98 -44 -265 175 13 322 59 -14 21 22 250 206 -94 233 112 -58 168
2959 168 -106 -183 -218 18 32 58 40 -140 -53 49 -70 137 -94 54 -3 -222 47 51 33 -47 -71 208 -3 95
2983 95 176 202 67 -62 122 100 239 191 48 81 20 -102 -75 -24 -174 -190 -193 -146 -28 193 48 -220 -181 -148 186
3008 186 287 60 -108 -3 211 -7 -127 126 144 131 63 67 -154 182 -116 73 -57 89 -279 -32 -8 181
3030 181 -171 84 109 -17 85 -32 -115 -98 -44 -277 224 -18 182 -29 29 -49 95 130 203 116 73 153 193 12
$$ packed form
2866C00k73j65J64j46l5K01k45K29k27l9L09l49j6K53R1J28j68j39K46J42j32
2887A29R8l97L30j39J60K3j54L9k99K84O0Om6l5j7k97K36J3j45j1J61J8l39L01
2911b1Ml3K4J24l5l3j31R8k8M1L5j54K86L2k09J59j56N0j37l4J1p2j1K66Q0l01
2937a45j21J75K5j39L37l4j42k21M40j62L09k63p3L5JK28m4l00L27j21j70K26
2959A68k74p7l5K36J4K6j8j80Q7J02j19K07k31J48n7k19K69Mj8q0k4K79k11R8
2983I5Q1K6j35j29J84k2J39m8j43L3o1j22K7N1j50j6lM7J18K21j45k68L9L3L34
3008A86J01k27j68J05K14k18j20K53J8j3o8Mk21L36k98J89j30J46l68K47K4J89
3030A81l52K55K5j26J02j17q3J7N4k33N01k42K00k11N8p8J44L5P3q7m3Q0M0j81
$$ plain form
3054 12 83 -214 -58 0 -235 87 -71 -364 -19 86 -52 13 -31 43 -119 145 -24 -9 214 103 144 304 -108
3077 -108 199 255 153 193 273 15 -83 39 -99 55 -94 -135 -159 -114 -164 -38 -90 -182 128 -118 -41 -314 90 -18
3101 -18 94 219 126 141 232 217 385 -191 332 41 13 90 105 225 -2 272 99 212 -76 -124 4 -135 -162
3124 -162 -228 9 -21 -7 -127 -323 -96 142 34 -109 48 60 -77 261 -101 -165 157 -197 4 -102 127 242
3146 242 45 -29 -64 132 65 101 126 -156 -230 -172 -249 -35 -387 -132 71 17 -223 -66 62 21 -84 -178 72 202
3170 202 -57 138 93 69 -182 -115 38 137 -7 -48 106 252 -105 -249 186 -70 -22 -148 41 -110 -67 21 -13
3193 -13 -188 -38 265 77 -167 -124 17 -7 68 58 116 188 -87 -11 77 13 144 203 73 0 -48 -73 60 -212 -143
3218 -143 -45 55 -107 -139 -79 12 118 1 256 -54 106 205 105 152 -138 96 10 -168 188 296 -198 -226 -19
$$ packed form
3054A2P1k97J56N8k35L22j58k93L45J05j38O5m4P4j62K64j69J5K23j11M1J60m12
3077a08L07N6j02M0Q0k58r8J22j38J54j49m1k4M5n0J26n2r2L10k46P7k73M04j08
3101a8J12J25r3J5R1j5J68n76N23k91k8P7J5J20k27K74j73J13k88m8J28j39k7
3124a62o6K37l0J4j20j96K27K38j08j43J57J2j37L38l62o4L22l54K01j06K29J15
3146B42j97p4l5J96o7L6K5k82p4N8p7K14l52K55K03n4k40J57J28m1j05r4K50J30
3170B02k59J95m5k4k51O7J53R9j44m1J54J46l57j44M35k56M8j26J89j51M3Q8l4
3193a3j75J50L03j88k44M3J41k4P5j0N8P2k75P6Q8o4J31N9j30p3m8k5J33k72O9
3218a43R8J00j62l2O0R1J06j17K55l10J60R9j00M7k90K34q6j78L56J08m94k8K07
$$ plain form
3241 -19 124 359 126 -46 -154 258 -172 -84 -232 38 70 -24 9 -80 63 58 -33 -24 97 -33 -109 168 185 -60
3265 -60 60 68 6 -78 238 2 -14 131 13 148 190 68 -119 95 -344 -214 209 22 -237 51 -80 126
3287 126 -180 -108 38 216 -110 74 27 8 147 22 322 101 285 164 288 -114 -55 249 18 -244 -184 -77
3309 -77 55 -6 -131 -198 -68 26 95 -34 -54 164 -122 104 108 -57 -59 -55 75 100 105 315 175 269 95 162 26 9
3335 9 -37 -93 -9 -36 72 -145 40 -110 -197 19 -92 -258 -88 76 -179 -67 -74 -310 -56 -171 239 172 55
3358 55 -36 187 122 344 254 110 183 -24 360 -48 8 119 -236 100 -89 -93 179 -194 -112 -8 -65 -183 51
3381 51 -80 59 228 84 -48 112 -125 122 134 -9 99 108 -7 -211 182 30 19 -95 -154 -158 -25 -119 -111 -245
3405 -245 -97 -376 -177 -105 -166 -209 -216 -90 -71 -114 -18 -174 76 43 -52 -118 41 143 159 221 156 -70 -197 168 292
$$ packed form
3241a9J43K35k33j72j08M12m30Q8j48K70L2r4L3q9J43nr1RJ21j30p6K77J7k45
3265f0J20Qo2q4L16k36j6J45j18J35M2j22j87K14m39J30M23j87k59K88j31K06
3287A26l06P2J46J78l26J84m7j9J39j25L00k21J84j21J24m02N9L04k31k62O0J07
3309g7J32o1j25o7J30R4O9j29k0K18k86K26Mj65kMJ30K5NK10j40R4j74O7j36j7
3335Im6n6Q4k7J08k17J85j50q7K16j11j66J70J64k55J12pk36K54j15M10o7j17
3358E5r1K23o5K22r0j44P3k07L84m08N6J11l55L36j89mK72l73Q2J04n7j18K34
3381E1j31J39J69j44j32J60k37K47J2j43J08Rj15k04L93j52j1j14n9mJ33r4Qj34
3405b45J48k79J99P2o1m3pJ26J9m3R6j56K50l3r5o6J59J02J6O2o5k26j27L65J24
$$ plain form
3430 292 11 -60 43 -259 52 -73 -135 -149 -58 -15 -57 96 -48 -13 159 117 80 125 60 -12 -51 -88 -196 96 -33
3455 -33 99 248 79 75 84 1 -226 -196 150 -36 -74 -258 -107 -10 212 -52 115 -44 -89 -43 -53 -19 -240 -161 -32
3480 -32 88 54 -169 171 -295 199 -89 -44 95 -82 -28 244 -81 -190 29 -114 -47 -83 -40 85 80 -374 98
3503 98 -390 -32 -93 -136 -226 178 42 6 -141 58 -30 331 -24 154 -114 -172 119 -5 234 -54 -11 -264 161
3526 161 108 -90 -85 -122 22 -19 -150 -139 -64 162 -65 143 -320 123 103 16 -127 -88 30 188 -19 -30 76 262
3550 262 143 -16 184 159 161 -295 170 66 26 -110 -168 185 -7 -343 -60 171 -88 166 58 -124 122 -98
3572 -98 6 -76 114 63 181 -30 3 225 60 0 93 66 108 113 1 -30 46 -87 -68 -79 25 57 -68 56 38
3597 38 -69 -68 119 -91 184 94 31 54 136 114 -41 -222 260 35 13 33 -133 474 8 57 -109 201 -24 9
$$ packed form
3430B92k81p1J03l02L11j25o2j4R1M3m2J53j44L5J72m2l7M5o5p2l9l7j08K92j29
3455c3J32J49j69mRq3k27L0L46j86l8j84J51R7K22k64J67j59m5M6j0L4k21P9J29
3480c2J20l4k23L40m66M94k88M5J39j77N4K72l25j09K19j43O7l6M3J25nm54M72
3503I8m88L58o1m3r0M04j36l6j47J99q8L61l55J78k68n8K91j24K39k88M3k53M25
3526A61n3j98Nl7J44m1j31J1P5K26k27K08m63M43k0q7j43L9J18J58k07j1J06J86
3550B62j19j59K00k5Km56M65j04m0j36n8L53j92l36K83K31k59K54j08j82K46k20
3572i8J04q2J90n1J18k11L3K22j65o0R3k7M2Nj12l1P6j33J9j1J04L2j25J24j8
3597C8j07JJ87k10K75r0o3K3Q2k2j55j81M82k25k2K0j66O07m66M9j66L10k25L3
$$ plain form
3621 9 56 93 67 -192 -100 52 80 -101 -98 4 -145 -16 -13 1 -233 312 13 -46 152 28 232 330 129 -41 -235
3646 -235 35 -103 19 -174 52 -30 171 17 159 398 -233 -64 -32 -225 -451 184 -193 -180 50 138 60 -14
3668 -14 150 -12 -75 146 -84 99 137 9 -80 144 173 -99 -39 240 -145 -5 -122 -77 10 -82 49 -9 -80 80
3692 80 -133 -225 51 22 -43 -16 22 -40 131 14 176 -77 -61 230 267 111 170 116 -18 63 -145 -183 -116 -31 2
3717 2 -58 -161 -84 -120 -60 74 -43 26 78 -111 -22 -8 -265 62 101 60 -244 -18 -248 -242 120 199 -88 -183 95
3742 95 -173 -50 166 -125 -33 75 30 -49 -312 8 -150 74 -134 58 233 126 102 -77 168 36 103 58
3764 58 112 54 214 -169 84 79 36 42 177 -171 -176 -133 -66 53 -58 60 -198 -94 -214 -82 -90 -295 -157 131 -28
3789 -28 -116 -225 127 63 -10 120 -5 26 163 125 46 3 49 172 203 92 -52 -166 5 3 -238 38 -159 -109
$$ packed form
3621IM7L7k6k59R2J52K8j81LJ02j49J29LJ4k34N45k99n9J98j24K04R8k01j70j94
3646b35K70j38J22j93K26q2K01j54J42K39o31J69L2j93k26O35l77J3K30Q8p8p4
3668a4J64j62o3K21k30J83L8j28q9K24K9k72O0K79l85J40j17M5Q7r2J31n8p1J60
3692H0k13r2K76k9o5K7L8o2J71j17J62k53J6K91L7j56N9n4j34Q1k08l8O7Q5L3
3717Bo0j03P7l6O0J34j17O9N2j89Q9J4k57L27L9m1l04K26k30OL62P9k87r5K78
3742I5k68J23K16k91R2J08m5p9k63L20j58K24k08J92J75j07k4j79K45j32O7m5
3764E8N4n8J60l83K53nm3OJ35l48nM3O7J19j11J18k58J04j20J32qk05J38K88j59
3789b8q8j09L52o4p3J30j25L1J37l8p9m3M6J23L1j11j44j14J71kk41K76j97N0
$$ plain form
3813 -109 132 86 -251 27 -143 40 -196 -34 -139 -79 57 76 101 -181 -26 135 132 93 66 45 283 59 -31
3836 -31 33 68 -75 305 131 -154 -332 55 -20 48 -146 71 22 48 22 69 -89 -2 -13 -14 -140 -86 96 -82 -48
3861 -48 -5 -25 110 -34 10 314 145 20 -95 -105 30 2 -90 360 -151 -240 -129 -70 146 -82 -17 -100 -49 146
3885 146 99 111 93 40 123 12 193 37 19 6 70 -35 173 -32 -234 13 59 -116 -55 -64 -14 -123 83 -24
3909 -24 -253 263 -251 28 32 -147 87 -153 155 114 48 -90 -38 -125 2 -50 -24 -42 -73 26 -43 -206 -12 -107 -331
3934 -331 -184 -186 215 -121 -24 -398 -5 19 -42 43 5 101 -2 -108 54 -59 119 -116 237 159 161 -6 -14 178
3958 178 184 37 -54 363 81 206 94 -197 -51 157 -139 -69 172 -217 -39 -165 58 -13 -21 -146 -126 -54 22
3981 22 -194 70 10 11 277 106 3 39 102 87 193 116 7 313 -78 10 -98 -168 26 -105 7 -90 165 72
$$ packed form
3813a09K41m6l37K78j70J83k36J62j05O0J36J9K5k82J55J61ll9k7k1K38k24r0
3836c1O4L5j43L80j74k85j78L87p5O8j94K17m9K6k6M7j58Q7j1jj26N4J82j78L4
3861d8M3k0J35j44M4L04j69j25j15j0J35k8r2M50n11q9J11N9K16k28O5q3N1J95
3885A46m7J2j8n3Q3j11J81j56j8j3O4j05K08k05k02K47M6j75O1rN0j09K06j07
3909b4k29N16n14K79Mj79K34k40L08m1o6j38N2q7J27n2K6j8l1R9o9j63J94r5k24
3934c31J47kM01l36R7l74L93K4o1Q5l8R6j03j06J62j13J78k35L53p8Kj67qJ92
3958A78Oj47r1M17k82J25j12k91J46K08k96P0K41l89J78j26K23p1qj25K0P2P6
3981B2k16K64o0JK66j71j03L6O3j5J06p7j09L06l91Q8j08p0J94j31J12r7K55r3
$$ plain form
4005 72 -87 12 97 -123 16 55 -149 200 86 92 155 119 -59 -18 -162 135 337 -61 58 12 -48 -54 -188 189
4029 189 131 -24 -22 -130 150 -54 -231 154 -138 -116 181 -183 -75 -38 56 3 -33 53 55 63 -40 -75 168 61 -47
4054 -47 -71 -90 77 -97 -167 -77 -126 -123 -34 -105 58 -250 156 103 12 1 84 29 -180 141 160 -133 -96 34 -26 167
4080 167 -166 35 34 -281 -36 182 -136 183 -11 224 -178 -94 255 76 -31 -97 214 -9 89 -110 33 -73
4102 -73 -98 -81 41 112 -19 -59 68 80 -122 -140 -65 245 72 31 89 216 -45 1 -28 -2 -23 -192 -80 52 31
4127 31 -24 -105 -30 68 -238 -222 -232 -124 181 69 48 -33 12 53 -54 -99 258 -97 -17 179 -13 53 -166 78 -132
4152 -132 -92 154 101 -202 -57 231 -298 154 -33 -169 35 -248 -100 21 -155 214 147 -234 128 -195 -10
4173 -10 103 69 -367 42 195 82 -111 121 -281 4 69 -75 -108 -66 114 130 72 13 -67 -122 211 -50 28 -28
$$ packed form
4005G2j59R9Q5k20J39L9k04L49j14OO3l6j78M1j44K97K02l98J19m6o0oj34L77
4029A89n8j55Kj08K80k04j77L85k92K2K97l64J08L7R4n3l6Q6KQj03l5K43j07j08
4054d7k4j9J67j74p0R0m9LQ9p1J63l08M06n3r1j1Q3n5k09L21J9k93L7J30o0J93
4080A67l33K01jl15K45K18l18L19j94K35m02Q4L49j79j07o6L11k23R8j99J43j06
4102g3k5J7J22P1j31m0J27J2k02j8P5L10j73m1N8J27k61M6k9K6k1j69J12J32k1
4127C1n5q1P5R8l06J6j0J08L05j12k1q1M5M1j07m5L57l55Q0J96j92O6k19K44k10
4152a32M0K46n3l03J45K88n29M52j87j36K04k83J48J21j76L69o7l81L62l23J85
4173a0J13l4m36M09J53j13j93K32m02K85O5j44l3M2J80J6n8n9q0n5L33k61P8n6
$$ plain form
4197 -28 280 -4 63 113 207 70 100 -132 -54 -138 -217 21 -115 260 1 52 190 -87 -93 71 -70 100 -23 -224
4221 -224 17 15 -185 73 -144 8 -152 -112 -99 26 3 26 21 85 185 94 5 -221 -102 -28 -55 -47 -8 -29 13 -223
4247 -223 13 29 -15 -40 -52 92 36 -159 -189 40 -236 439 -25 68 -75 12 213 78 -30 9 -78 -209 96
4270 96 201 -43 -28 -203 -73 -47 -32 25 -19 -56 -195 -144 -82 -18 -185 -103 -174 236 27 140 -195 72 21 13 -275
4295 -275 204 244 12 -103 224 -125 -147 -59 -20 93 -181 -107 27 -18 -207 83 89 -34 -67 -52 97 45 -195 100
4319 100 106 106 89 -120 -224 70 -89 -40 145 63 176 -63 258 -31 179 72 18 -121 -215 55 -64 -1 60 -16
4343 -16 -123 40 -48 -143 -85 -196 -152 12 -386 168 -4 -41 266 136 124 124 167 36 87 -87 45 22 -24 52 -131
4368 -131 82 -120 15 -82 -107 -66 -63 -33 -51 2 -74 -194 120 -13 62 219 3 -6 -12 -82 91 -90 43 42 173 182
$$ packed form
4197b8L08k84O7N0R4j37L0k32P8q4p9K38j36L75k59N1J38k77oJ64j41J70j23k01
4221b24K41kk00K58k17J52j60M0J3J25k3K3nO4J00r1q9k26J19P4k7QL9k1M2k36
4247b23K36J6m4k5j2J44n6j95l0K29k76O75m64R3j43Q7K01j35j08L9q7j31L05
4270I6J05k44J5j75J30K6J5N7m4l7j39N1O2O4j67Q2p1M10k09J13l35K67n1qk88
4295b75M79M0k32j15L27l49k2Q8L9J13k74P4J34m5j89K90Oj23l3J5J49n2k40K95
4319A00O%j7k09j04K94j59M9J85q2J13k39L21k89K10j07n4j39r4K70j19O3O1p6
4343a6j07J63q8r5N8j11M4J64l98N54j72l7L07j30j2%M3j31N1j74J32k3m6P6j83
4368a31K13k02J35r7k5M1LL0j8N3p6j20L14j33P5J57k16rop0J73j81J33jJ31R
$$ plain form
4394 182 -197 63 -247 180 -47 26 122 -38 -38 58 -147 -37 -106 -55 -153 -91 42 -108 -146 -4 262 79 -76
4417 -76 -142 179 47 -261 -56 -27 56 25 67 162 80 38 35 -44 82 34 101 168 -21 -33 -75 -78 25 116 -211 -179 -121
4444 -121 -18 34 -6 -67 129 -33 215 38 15 176 -165 38 89 92 15 44 29 62 13 -95 -4 -88 33 -143 -156
4469 -156 -167 -9 -26 -87 -148 28 -145 -66 -17 17 65 125 -77 -150 152 -30 -3 -8 2 -37 200 68 -71 27 163
4494 163 48 -147 20 78 -23 84 -195 -168 8 101 -32 -65 56 -163 123 -116 -39 -242 43 66 110 152 -87
4517 -87 61 163 -98 134 255 320 -18 77 -101 127 -71 71 69 51 131 38 230 62 25 293 -75 -66 -100 3
4541 3 -241 -5 152 78 18 -53 342 1 -148 74 2 59 -111 54 146 -12 -40 -27 88 126 -57 130 74 -177
4565 -177 -120 280 -27 -142 140 -60 -215 -64 88 235 143 -251 23 155 84 180 23 0 119 43 47 -82 -89
$$ packed form
4394A82l79K60l10M27k27P3R6j60%R6k05J10o9N1r8O2J33j50l8J42K66j83j55
4417g6o6L21j32l08K05K9Q3l1M2R5q2m2lp9J26m8O7O7j89j2m2lJ03R1l27L2N8
4444a21J03N2m0o1J96j62K48j77k3J61l41K03N1Lp7K9j5L3m9j08R1q4J21j76j3
4469a56j1J58j7o1o1J76j73P9M9L4M8O0k02p3L02j82K7nJ0l9K37j32j39R8J36
4494A63j15j95J67N8j01J07k79K7J76R3j33l3J21k19K86k39P7k03K85K3M4M2k39
4517h7J48J02k61K32J21O5l38R5j78K28j98J42kj8Q0r3J92j68l7K68l68Rl4J03
4541Ck44K36J57p4o0p1L95l41j49K22p2N7j70J65R2j58k8J3J15L8j83J87n6k51
4565a77N7M00l07j15K82k00j55J51J52J47r2l94K74J32p1R6j57k3J19p6Mj29p
$$ plain form
4588 -89 105 -33 83 -214 41 99 -116 -58 59 -152 -142 -132 110 -117 -132 -288 95 36 5 13 235 -23 28 -36
4612 -36 89 62 124 101 55 89 139 104 -126 245 -253 -208 114 -177 58 211 -74 -137 4 52 -14 -40 146 -18
4636 -18 0 -56 143 -38 61 -110 -103 -79 -11 -174 231 132 36 46 -38 -27 -4 93 -85 -135 -112 10 -161 24 -3 -92
4662 -92 -220 164 79 110 -129 -67 -77 -47 2 -31 -225 319 130 -29 141 -51 73 -201 302 -67 34 -90 -16
4685 -16 -121 -183 67 309 -13 -137 -41 -40 306 -181 130 -39 -60 52 33 -37 -223 228 116 183 -18 -56 -131 36
4709 36 54 -19 -94 148 287 54 -134 -23 42 -137 -105 -122 -18 -55 -68 26 82 197 -5 -129 -87 -11 -56 -340 249
4734 249 1 -74 160 133 -14 198 90 91 130 -90 132 -58 -113 187 112 239 76 -153 88 -51 -11 -214 -83
4757 -83 35 37 -37 -209 39 -188 91 232 7 -26 190 47 -57 -221 62 110 101 -122 -100 58 -111 -88 152
$$ packed form
4588h9J94j38J16k97K55N8k15N8J17k11J0J0K42k27j5j56L83n9l1QK22k58N1o4
4612c6J25k7O2k3m6L4N0l5k30L71m98M5L22k91K35J53k85o3J41M8o6k6J86j64
4636a8J8n6J99j81R9j71PK4O8j63M05r9r6J0q4J1K3R7j78n0K3J22j71J85k7q9
4662i2j28L84q5L1k39O2j0L0M9l3j94N44j89j59J70j92J24k74N03l69J01j24P4
4685a6j05o2K50K42l22j24R6JL46m87L11j69k1J12j9p0j86M51j12O7k01l8p5J67
4709C6J8p3p5K42J39k33j88J11O5j79L2j7J04l7j3R4N6J15k02j24M2P6m5k84N89
4734B49k48p5K34k7j47K12j08JL9k20K22j90n5L00p5J27j63k29K41j39M0k03J31
4757h3J18Kp4j72K48k27K79J41k25l3K16j43j04j64K83M8rk23K2J58j69K3K40
$$ plain form
4780 152 197 -25 -46 -91 -185 -70 -177 155 96 -153 83 6 109 63 375 -71 -96 -134 49 -85 11 74 -38 12
4804 12 -31 59 181 -31 -37 -119 5 136 -77 1 197 169 -51 -113 205 -213 51 -38 -45 22 174 -14 14 44 -91
4829 -91 36 75 141 -33 62 162 53 25 8 -111 -74 -17 49 30 129 -22 -217 -121 34 -241 135 66 106 -208 63
4854 63 102 -42 -265 -113 155 -84 0 136 141 39 34 -54 -149 -19 -236 -154 -2 -39 -246 142 81 -124 -39 -4 131
4879 131 -34 -180 108 -70 37 -89 122 -18 1 102 105 -12 55 -60 -125 -21 43 -249 -114 -11 93 146
4901 146 -39 115 34 -62 157 -118 151 2 -37 45 -105 -222 -120 -73 35 151 -74 54 -81 -89 43 57 84
4924 84 -97 65 -53 115 34 111 82 3 -109 -94 28 77 169 -200 139 -55 133 78 9 -125 -70 -84 -31 -126 -58
4949 -58 9 -118 32 56 -29 227 242 -102 78 164 -93 -136 19 152 -71 69 161 -48 126 237 13 -91 11
$$ packed form
4780A52M5k22k1m5r4J15j07L32n9k49K36p7J03m6L12m46k5l8J83j34R6O3j12N0
4804A2m3R0J22k12oq2J24J31k13P8J96k8k20o2L18m18K64q9pO7J52j88K8L0j35
4829i1J27L9O6j74R5J00j09k8j7j19L7N7O6j9R9j51j95R6J55k75L76o9M0l14K71
4854F3L9j44k23J52K68k39Q4J36Nj02nq8r5J30k17Q2J52l7k07L88o1k05Q5L5J35
4879A31j65j46K88j78J07j26K11j40J9J01Lj17O7j15o5J04O4k92J35J03J04N3
4901A46j85J54q1r6K19k75K69j49l9Q2j50j17J02M7J08J16k25J28j35qJ32J4K7
4924H4j81J62j18J68q1P7k9p9j12J5J22M9R2l69L39j94J88n5o9j34N5j4N3r5O8
4949e8O7j27J50K4q5K56J5l44J80Q6k57m3J55J33k23J40R2k09J74J11k24j04J02
$$ plain form
4972 11 -54 60 -53 62 74 -187 125 -286 -32 -4 13 28 49 -188 -8 127 -52 274 258 -99 -24 -269 132
4995 132 109 -43 -325 160 -135 44 -172 25 22 8 -18 -72 -153 -79 23 2 -51 -20 -196 101 183 -31 28 89 286
5020 286 -186 -68 -19 -141 -124 -302 41 143 -30 216 -54 135 -156 60 81 44 -171 -62 68 -84 47
5041 47 -175 57 26 91 44 -27 251 -53 -7 71 -216 192 -51 9 262 -98 -41 -47 -223 62 68 106 -39 32 -108
5066 -108 98 152 100 49 -227 68 -93 -81 92 -80 -54 -202 -95 156 -89 -34 99 140 31 -132 -42 -43 -4 84
5090 84 129 12 123 14 -114 -203 -226 44 300 116 37 -1 144 45 51 169 -160 101 -62 132 -20 -60 -196
5113 -196 -42 -191 -30 95 -32 -78 -73 -27 321 158 -146 76 -42 36 84 68 -175 -31 -41 -61 -70 -6 -162 271
5137 271 185 -174 -132 -31 11 -109 -178 142 68 134 -114 64 76 -38 -151 177 229 -100 -81 -71 71 -117 203
$$ packed form
4972A1o5J14j13J15J2k61L12m11K54K8J7J5K1k37J80J35j79L26j6l57P5k45M01
4995A32k3j52k82M85k95J79k16J97lj4k6n4q1P4J02k1n3L1j76K97Q2k14N9O1J97
5020B86m72J18M9j22J7j78L43J02j73K46k70J89k91K16K1l7k15J09J30j52J31
5041D7k22K32l1O5m7p1K78l04M6P8k87M08k43O0K53l60N7oj76K85OL8j45P1j40
5066a08K06N4n2n1k76K95j61J2J73j72K6j48J07K51k45N5J33M1j09j63R0jL9Q8
5090H4M5j17J11j09j28q9k3K70K56j84p9l8J45r9OJ18l29K61j63J94j52m0j36
5113a96J54j49J61J25j27m6NM6L48j63l04K22j18P8M8j6k43J44j0k0rO4j56M33
5137B71q6l59M2J01M2j20o9L20p4O6k48J78J2j14j13L28N2l29J9J0J42j88L20
$$ plain form
5160 203 -42 43 -28 55 -45 -152 -209 -28 271 -53 -127 123 -39 163 -171 73 -45 187 -168 28 -15 128
5182 128 37 -196 68 111 -48 -120 89 1 -141 -168 67 -25 -35 -85 -20 370 42 -42 53 -124 2 -141 65 31
5206 31 221 -18 -58 -104 -198 211 -120 73 -235 117 -11 126 152 123 -50 300 111 69 130 -88 -23 -43 165
5229 165 -82 29 -91 -89 -35 141 -28 -97 41 -29 -144 81 162 -139 -42 62 -190 61 117 -214 81 -345 54
5252 54 195 -110 -5 -227 19 156 50 18 -18 -99 128 65 8 219 125 -80 -90 -32 105 151 -141 -76 146 92
5276 92 62 -282 224 63 -36 -116 -132 -112 -71 42 199 118 20 70 105 -141 -27 349 -6 43 42 6 -5 -30 -55 224
5302 224 237 -13 174 274 -134 20 136 111 104 -78 134 -137 305 -17 43 -187 84 97 -35 14 -46 183 -26
5325 -26 76 31 -26 -177 89 16 -37 223 202 71 -66 -204 -11 -95 2 58 -129 -51 -95 181 -68 -250 -48 80
$$ packed form
5160B03k45Q5p1Q3j00j07n7J81K99l24p4K50j62K02l34K44j18K32l55J96m3J43
5182A28r1k33K64M3j59p2K09q8j42k7K35r2j0n0O5L90l28q4R5j77J26j43K06l4
5206C1J90k39m0m6r4M09l31J93l08L52j28J37K6k9j73L50j89m2O1k18O5k0K08
5229A65k47J11j20KN4J76j69o9J38p0j15K25Q1l01R7J04k52K51N6l31K95m26L99
5252E4J41l05J05k22K46J37j06l2l6q1K27o3n7K11r4k05j0N8J37M6k92O5K22n4
5276I2l0l44N06j61r9q0j6K0M1J13J57q1r8N0L5k46J14L76l55M9jl6j1k5k5K79
5302B24J3k50J87J00m08J54J16k5pj82K12k71M42l22O0k30K71J3j32M9o0K29k09
5325b6J02m5n7j51K66p3n3K60k1j31j37j38J93q4R7N6j87P8m4K76k49j82K02J28
$$ plain form
5349 80 -74 227 115 100 55 244 -245 308 137 -43 -224 116 113 -35 11 -176 134 -54 21 150 -40 -110 -53
5372 -53 4 87 44 86 237 -99 -212 -91 -16 -237 -93 -115 -71 -76 -23 -87 -35 -203 -51 -144 24 63 -30 -267 37
5397 37 29 -31 -86 -142 47 -71 42 150 -124 228 -49 -146 -25 -223 -159 -49 -13 50 48 -90 228 -210 -173 90
5421 90 -138 -77 26 128 48 -15 156 -258 -181 -81 253 -60 -3 85 65 20 107 142 2 74 115 -33 115 3
5445 3 -196 -123 57 126 -153 -66 -118 -204 30 101 -22 -77 6 11 68 67 15 -61 -20 -72 240 -17 54 137 -184 -116 -115 59
5473 59 42 51 -8 2 -76 -92 70 -132 219 128 -265 146 89 -71 -14 107 117 -1 -202 248 -173 -6 5 -25 90
5498 90 192 -25 59 9 169 164 -102 -130 16 -105 -194 -44 -82 -91 62 -4 -133 -167 -201 15 -204 -114 -8 -92 -83 -53
5524 -53 -209 91 -66 -111 198 194 220 59 -34 63 72 168 117 -64 -60 104 -107 18 -19 -99 315 62 39 64 198 -131
$$ packed form
5349H0j54L01j12j5m5J89m89N53j71j80j81L40lj48M6j87L10j88P5J29j90p0N7
5372e3N7Q3m3M2J51l36j13J21P5k21J44k2M4nN3o4N2j68J52r3J68L9r3k37L04
5397C7qo0n5n6J89j18J13J08k74L52k77r7J21j98O4J10L6O3kj38L18m38L7K63
5421I0k28O1J03J02q0o3J71m14P7J00L34l13N7Q8k0m5Q7L5j40P2M1j48J48j12
5445Cj99P3J80O9k79Q7n2q6K34P1j23n5Q3NN7jn2p6M1n2L12k57P1Q3l21O8JJ74
5473E9j7Rn9J0p8j6J62k02L51r1l93M11n7j60N7J21J0j18k01M50m21J67J1l0J15
5498I0J02k17Q4n0J60nk66k8J46j21q9J50l8rJ53o6j29l4l4K16k19R0J06q4RL0
5524e3j56L00j57m5L09mK6j61r3R7RR6n1j81MJ64k11J25l7q0M14k53k3K5J34l29
$$ plain form
5550 -131 37 -16 156 -4 23 172 29 -35 -22 38 -248 354 77 26 -111 25 169 -195 128 218 102 237
5572 237 147 -27 -47 -103 61 -59 176 41 -196 102 98 -116 181 24 13 -115 -68 -107 -135 -161 -73 -3 161 71
5596 71 18 13 -198 -66 -41 -26 -23 -25 95 -158 -179 -49 183 -37 -118 -93 -42 -154 -187 -166 6 -38 -69 190 170 -120
5622 -120 -292 33 -17 1 -84 79 -329 50 -150 102 49 -108 -43 -105 153 -137 -118 -168 89 6 140 -31 -59
5645 -59 131 316 -254 -35 67 -138 142 0 -272 -121 -40 -167 48 40 135 -106 173 -218 -97 -91 41 -57 110
5668 110 -72 0 -95 -8 -104 -83 87 -78 -20 -26 71 7 188 -175 -8 206 80 -79 -85 -161 -42 -127 91 -120 -157
5693 -157 -113 198 -121 -22 -37 -74 3 -75 62 -221 -47 245 64 62 196 42 -142 -135 -103 34 -46 -43 -49 68 31 -167
5719 -167 64 -33 -134 -369 41 22 23 45 141 -29 -216 28 -98 -38 206 89 -66 46 96 65 -20 42 -92 -119
$$ packed form
5550a31J68n3J72j60K7J49j43o4J3O0k86O02k77n1j37J36J44l64L23R0j16J35
5572B37r0j74k0n6J64j20K35j35k37K98mk14K97j57j1j28M7l9k8k6Q8P0J64r0
5596G1n3nk11J32K5J5LkJ20k53k1J30K32k20q1K5N1j12l3K1J72m4l1K59k0k90
5622a20j72L25n0J8q5J63m08L79k00K52n3j57O5o2K58k90J9n0K57q3J34j71k8
5645e9J90J85n70K19J02k05K80j42k72J51Q1j27K15qR5k41K79l91J21OJ32r8J67
5668A10j82P2r5Q7r6K1J70j65N8oR7o4J81l63J67K14j26j59op6J19q5K18k11l7
5693a57M4L11l19R9j5l7P7p8J37k83J74K92j81kJ34j54j84PL2J37q0LoJ17l7j98
5719a67K31r7j01k35M10j9JK2R6j70j87K44j26O0K44j17j55J12N0l1q5O2j34k7
$$ plain form
5743 -119 111 8 -45 -128 -164 -71 -80 18 14 23 -25 -117 -46 -79 36 55 -139 -73 2 -57 -37 -26 24 101 19 7 100 213 -56
5772 -56 -84 -195 -315 258 -4 172 -56 -172 34 88 -99 -36 31 -73 2 -63 247 83 -72 -41 118 -8 -211
5795 -211 -136 83 -21 -98 -66 -115 193 331 18 64 -22 43 -204 93 -45 126 -93 -19 51 -77 28 218 18
5818 18 -24 127 219 105 119 5 -152 -152 233 -41 -1 193 153 127 -79 -222 -144 146 -143 -47 -451 -20 145 158
5842 158 52 -160 -74 -151 -12 -107 16 -172 -46 47 22 78 -26 32 -185 76 -211 -63 5 31 223 -61 -104
5865 -104 -46 63 -194 -221 -195 -71 101 -226 135 -250 -45 77 -141 2 -27 233 -308 -106 65 83 175 -31
5887 -31 -129 -61 55 122 123 -48 -33 -91 -152 168 238 -31 -20 82 -35 -189 -161 -6 133 35 -98 -45 -246 -16 -147
5912 -147 -54 -38 204 -180 -56 -152 91 -129 -166 -192 122 262 -78 -151 91 126 16 -258 170 32 -158 -250 -9
$$ packed form
5743a19K30j03n3q3l6R3rR8mRm8r2P1l3J15J9j94O6P5n9K0J1N0P7q2j2R3J13k69
5772e6k8j11j20N73k62J76k28j16K06N4j87O3O7j04P5o5L10j64j55L1J59j26k03
5795b11P5K19j04p7L2m9L08J38l13M6q6O5k47K97j38J71k19P4P0j28J05J90k00
5818A8m2J51R2j14J4j14j57%L85k74M0J94m0k6k06j43P8K90k89R6m04M31J65J3
5842A58j06k12Q6p7J39r5J23j88J26R3k5N6j04N8k17K61k87J48O8K6J92k84m3
5865a04N8J09k57k7K6J24J72l27L61l85K05J22k18J43k9K60n41K02J71J8R2k06
5887c1r8O8J16O7Jj71J5n8o1L20P0k69J1J02j17j54K8J55J39r8j33N3k01K30j31
5912a47R3J6K42l84J24r6K43k20l7k6L14J40l40p3K42L5j10k74M28j38j90r2K41
$$ plain form
5935 -9 -288 361 184 -66 66 25 -115 -133 107 -47 -1 21 61 -28 82 -38 -31 206 34 -75 52 16 268 96
5959 96 -80 32 -25 1 -202 69 -170 75 299 6 73 192 -64 271 12 123 -117 -93 14 70 3 94 -62
5982 -62 135 167 -244 -37 -320 121 -164 -92 184 -15 4 309 -48 -138 -188 -215 0 42 119 -32 -11 -36 59 -57
6006 -57 -59 71 -98 -97 127 -5 12 -145 -27 210 61 114 140 -5 40 -106 -28 -238 59 -84 21 149 84 -102
6030 -102 50 351 208 233 27 65 217 -23 -33 64 55 -51 104 -18 -80 -19 193 6 50 -261 -179 308 39
6053 39 100 91 -43 22 57 -52 107 -214 -23 -112 -17 90 -40 103 129 23 8 97 99 265 -164 134 24 -302
6077 -302 111 110 -48 53 48 -74 3 231 117 -51 -52 137 24 26 -46 146 36 29 -42 -65 26 -131 5 121 -136
6102 -136 -125 -141 219 -194 -77 17 37 61 -115 174 190 -94 -27 122 38 56 -68 38 -79 10 108 17 -83 -157
$$ packed form
5935ik79O49j77k50J32m1j40j8K40j54M6K2M0q9J10j20PK37j72j09J27l6K52j72
5959I6j76J12n7K6k03K71k39K45K24k93O7J19k56L35k59J11k40K4J07N6o7R1j56
5982f2J97L2m11K07k83M41k85P2K76j99J9L05l57r0n0k7K15M2P7j51K1k5R5j16
6006e7kJ30j69JK24j32J7j57J18K37j49N3K6j45M5j46P8k10K97j43J05J28o5j86
6030a02J52L01j43K5k06L8J52k40j0R7rj06J55j22o2O1K12j87M4l11Q2M87k69
6053C9O1rj34O5L5j09J59l21J91q9R5J07j30J43K6j06j5Q9KJ66m29K98j10l26
6077c02M13jj58J01nj22P7K28j14j68jJ89j13Kp2J92j10pp1k3R1j57J36J16k57
6102a36J1j6L60m13J17R4K0K4j76K89J6k84O7J49q4J8j24J06j17Q9R8r1j00p4
$$ plain form
6126 -157 -101 118 7 -11 8 37 -78 196 187 95 -58 -213 106 104 -248 173 -31 111 73 -73 29 83 -51 129
6150 129 51 -65 -199 -94 24 -46 -185 18 86 -78 337 183 -161 115 -30 3 94 -83 74 186 -114 -41
6172 -41 107 -57 68 84 357 -28 80 4 -56 -60 -127 25 79 -102 28 218 -241 27 -81 -125 -379 4 -40
6195 -40 -48 -29 -44 177 41 -103 -155 9 54 -59 -158 -71 110 34 -38 19 -19 -35 -38 160 -248 -42 86 -24 14 -119
6221 -119 26 -54 -35 -244 106 -37 213 -80 -265 166 -69 -59 -60 -111 129 111 222 -55 -8 11 137 -132 -31
6244 -31 144 213 -33 -58 164 95 131 -41 116 21 -41 -150 -23 -221 -93 421 288 -112 -128 18 -39 -76 -82 -357
6268 -357 -195 -153 124 -134 3 -296 -11 -13 -116 89 -12 70 -23 -46 163 -3 342 -128 -162 -93 -138 12 -148
6291 -148 -52 -104 -164 -210 123 151 -183 -47 -251 11 -177 -65 64 63 -78 -64 -7 76 59 -141 -316 141 107 -106
$$ packed form
6126a57N6K19j11j8J9K9j15K74rr2j53j55L19kl52M21k04J42l8j46J02N4j34J80
6150A29p8j16j34J05J18p0j39K03O8j64M15j54l44K76j45L3R1j77J57J12l00P3
6172d1J48j64J25J6K73l85J08p6o0mo7J52N4j81J30J90m59K68j08m4k54L83m4
6195d0qJ9j5K21j36j44n2J64M5j13r9Q7J81p6p2N7l8j6lJ98m08K06J28j10L8j33
6221a19J45q0J9k09L50j43K50k93j85M31k35J0jn1K40j8J11k77M7J9J26k69J01
6244c1J75O9k46k5K22o9L6j72J57r5o2j09J27j98J28N14j33m00j6J46n7l7ok75
6268c57J62M2K77k58J37k99K85kj03K05j01Q2r3k3K09j66L45m70l4O9m5J50j60
6291a48R6n2o0m6L33K8l34J36k04K62j88J12J29jj41J4N7Q3j7k00j75M57l4k13
$$ plain form
6315 -106 -12 -77 -25 94 -99 -41 -91 45 11 -60 209 220 -39 72 111 106 -66 176 -7 -6 -49 146 -96 41 156
6340 156 -125 5 20 -111 -136 -36 -315 -191 183 -51 -79 -2 249 16 58 -35 -40 178 -70 64 85 11 -44 219
6364 219 -4 210 88 -32 85 165 51 -13 -25 79 36 45 85 -14 -40 -235 12 -45 34 75 -14 141 68 123 -108
6389 -108 48 155 27 -13 1 79 138 68 -26 -140 8 -18 -80 7 99 139 -53 73 -53 54 -88 91 -167 176
6413 176 -65 -64 101 154 90 16 -115 59 22 177 89 93 16 56 31 99 -55 -188 367 42 46 41 173 -165 -162 -198 256
6440 256 228 -115 -98 -276 90 -276 -74 -80 84 239 -122 -47 -194 -189 22 -42 159 -42 81 129 -67 288 57
6463 57 -47 77 -140 -58 -127 169 48 64 28 13 -52 13 27 65 267 -260 -54 -134 -31 114 43 -249 28 -33
6487 -33 -28 -199 -39 22 145 -230 24 32 -35 245 -170 -52 47 -276 149 34 92 -236 64 36 92 -16 56 -94
$$ packed form
6315a06R4o5N2J19j93N8n0J36l4p1K69J1k59J11L9nj72K42j83Jm3J95k42J37J15
6340A56k81J30J5j31k5J00k79J24L74k34k8P7K51k33M2r3nK18k48J34K1p4n5K63
6364B19k23K14j22j20J17Q0j14o4j2J04m3RM0r9k6j95K47n7P9M1q9J55p3N5k31
6389a08J56J07j28m0J4P8N9p0r4j14J48k6o2Q7R2M0j92J26j26J07j42J79k58L43
6413A76k41JJ65N3o4p4j31J74l7J55q8Mp7M0k5O8j54j33N55l25MnJ32l38Ll6M54
6440B56k8l43J7j78L66l66K02oJ64J55l61P5j47NK11o4K01k01J23M8j96L55k31
6463E7j04J24k17Q2o9K96j21J6l6j5o5O5J4L8K02n27K06q0J03J45p1k92K77o1
6487c3Nj71J60O1J23l75K54Qo7K80m15J18R9l23M25j15N8l28L00k8N6j08P2j50
$$ plain form
6511 -94 -75 165 13 190 -14 -42 11 -32 -41 -221 -65 114 -209 -84 130 -105 -96 205 176 38 -50 -75 23 -13 94
6536 94 22 -22 -37 118 -47 76 123 48 225 -17 7 66 42 25 -189 -95 143 -1 136 -33 240 -280 -175 -113
6560 -113 -9 151 87 -73 -158 85 31 -76 -233 26 99 32 -123 -191 -89 117 17 67 103 -117 -93 178 -233
6583 -233 170 -75 287 92 112 -48 131 192 -218 150 43 88 72 -247 -139 -200 -302 123 36 33 -22 -129 -58
6606 -58 225 26 -107 102 -1 59 -21 -101 13 204 29 -43 -63 82 230 93 -135 -149 -70 -70 -119 -242 -82 -41
6630 -41 -279 -26 11 107 220 61 188 -100 -160 -187 67 37 102 75 -241 -10 49 148 76 -15 77 164 47 -93 -9
6655 -9 95 175 356 -166 -27 236 98 -84 -153 -3 -88 -118 -71 -163 -89 -5 41 -80 -57 244 156 -236 -283 -74 -180
6680 -180 23 -25 46 14 220 54 170 345 -7 55 49 -82 -57 55 -335 72 152 -162 189 -89 -162 -42 -231
$$ packed form
6511i4J9K40j52J77k04k8N3m3rj80J56J79l23J25K14k35RL01k9j38q8k5R8l6J07
6536I4p2m4j5J55j65J23M7p5J77k42K4N9k4j7k14R4K38j44J37j69K73n20J05O2
6560a13J04J60o4j60q5K43n4j07j57K59P3o7j55o8J02K06j00N0L6k20K4K71m11
6583b33M03k45L62j95K0j60J79O1m10L68j07M5j6l19J08o1j02M25q7ln5j07P1
6606e8K83j99j33K09j03O0q0q0J14J91j75p2k0J45J48j37k28j4P9%m9j23J60M1
6630d1k38K53L7R6J13j59J27k88o0k7K54l0O5k7l16K31N9R9p2r1R2Q7j17j40Q4
6655iJ04Q0J81n22J39K63j38j82o9J50q5l0M7r2P4Q4M6j21K3L01q8l92m7K09j06
6680a80K03m8P1l2K06j66J16J75l52O2oj31K5J12l90M07Q0l14L51k78p3J20j89
$$ plain form
6703 -231 76 -91 145 33 12 -115 -182 -51 -27 95 -117 -66 176 -98 48 -190 -53 63 89 29 53 -99
6725 -99 -100 -1 92 -178 49 -118 -38 -251 113 36 48 131 -66 -48 158 117 -206 -177 102 -105 60 -8 -99 94 123
6750 123 -20 -255 -137 9 -142 221 -60 23 -18 75 202 -36 -40 26 23 -45 16 14 178 -104 90 155 141 141 105 31
6776 31 -32 161 -32 109 -94 -10 67 46 -80 -25 243 -200 64 -48 -199 58 -89 -180 -167 -44 192 -77 11
6799 11 -48 356 -11 126 -14 -14 -69 101 65 -99 -82 -13 41 86 -7 -40 -114 242 -7 163 -7 -31 -79 148 -24
6824 -24 -47 -38 138 -41 60 49 102 30 43 85 90 -65 1 171 -142 44 20 -107 -289 19 -21 100 140 -117 203
6849 203 22 -40 36 -183 -166 122 147 -76 127 57 20 -28 -125 -15 -90 -152 -34 -87 37 0 45 -154 -8 5 -171
6874 -171 145 -3 33 6 -119 69 -43 -161 -39 -58 227 -94 3 -79 -65 -277 45 -38 -223 -57 64 -9 -20
$$ packed form
6703b31L07j67K36j12k1j27o7J31K4J22k12N1K42k74J46k38J37J16K6o0K4j52
6725i9jR9R3k70K27j67Q0k13L64p7J2Q3j97J8K06m1l23K9K79k07J65o8r1J93K9
6750A23j43k35J18J46j51L63k81Q3m1R3J27k38mO6lo8O1kJ64k82J94O5j4%l6p4
6776C1o3J93j93J41k03Q4P7k1j26N5K68m43K64j12j51K57j47r1J3J23K36k69Q8
6799A1n9M04l67J37j40%n5J70l6j64J7O9N4M5r3l3p4L56k49J70j70k4m8K27j72
6824b4k3RJ76j79J01j1N3p2J3M2Nj55O6J70l13J86k4j27j82L08m0J21M0k57L20
6849B03j81o2P6k19J7K88K5k23K03p0l7m8r7J10p5o2J18n3J24l7M5j99J46J3j76
6874a71L16j48L6k7j25J88j12j18J22j9K85l21R7q2J4k12L22q3j85J66J21p3j1
$$ plain form
6897 -20 162 168 73 68 20 247 263 60 128 -59 -18 180 7 -34 17 26 127 143 119 -61 -15 162 11 29 45 22 12
6924 12 20 -146 -59 80 -174 87 13 12 -159 -245 -125 31 -82 -71 168 -326 217 -32 -58 112 60 -132 9 89
6948 89 134 100 76 143 51 102 -46 -46 -170 116 -129 -52 -201 45 181 -27 197 -19 -75 81 32 -151 -60 -9 -12
6973 -12 -111 -33 -116 98 -85 -68 70 174 -121 19 247 -102 -36 -178 -177 177 78 0 125 -36 227 -43 70
6996 70 173 95 -6 -263 -28 1 108 204 -38 73 187 127 -52 202 -51 -138 -84 -68 51 -25 -207 -68 -224
7019 -224 19 -234 -56 -24 -69 -182 8 74 -99 -132 -21 205 41 113 -192 63 6 -58 -46 -102 1 91 -139
7042 -139 30 7 294 -14 187 149 -146 102 29 -2 -23 -175 -283 71 -36 -129 62 3 44 116 -16 63 -162
7065 -162 116 -34 -102 -14 71 -69 74 146 -78 -46 -9 -155 259 -1 198 -14 102 12 -152 -85 -90 9 -59 57
$$ packed form
6897b0J82Or5nm8K27J6k03O8j87M1J98j73m1N1RJ01J6k4j80M6J77j51J8J6k3j0
6924A2Qj66Q7J39k54K61p4jj71q6J20J56j13J1K39m94N43k49k6J70n2j92J41Q0
6948H9M5l4k4O7r2N1j48%j24K86k45P7j49K46J36k08K24k16n6J56m9j83R1N1l
6973a2r9P8q3K14j83J7J38J04k95J40K28l49O6j42JL54r9p8J25j61K63k70J13
6996G0J03p8j01k57K35K9J07R6k42J11J14o0j79K54k53q7N4J6J19p6j82J39j56
7019b24K43k53J78L2m5j13J90O6j73l3J11K26j64P2l05K55n7o4J2n6J03R0k30
7042a39J69k3K87l08K01l8k95K48p3l1k1j52j08L54j07r3J91n9M1P2j32P9k25
7065a62K78j50o8Q8Q5j40J43P2k24L2L7j46M14k60J99k12J16r0j64O7nR9o8J16
$$ plain form
7089 57 257 42 -28 -139 -30 19 -64 -110 -260 -21 -3 -117 -65 44 -87 -125 -49 -47 26 12 -100 26 180 -2
7113 -2 -62 -17 57 -208 -108 18 -68 -276 -151 -181 -126 -63 9 -6 14 180 -63 255 62 140 -88 -75 207 -94 96
7138 96 5 -128 65 203 -22 102 -5 -39 -26 -4 88 28 78 42 129 -240 95 -66 158 21 -237 54 104 -11
7162 -11 -35 -49 38 92 86 -46 -5 55 249 -167 53 203 177 78 -106 103 -121 149 -143 -165 118 49 -142 6
7186 6 -122 196 -91 -98 224 107 -62 -21 -27 216 -30 -44 -113 -76 -102 -135 85 -111 -26 -67 1 -174 160 -31 96
7211 96 217 42 138 -151 -26 202 157 -157 184 -34 -124 -340 -207 96 -30 -68 174 54 8 -95 82 22
7233 22 -46 261 -31 -105 -6 169 -42 -26 43 -61 -238 -10 -46 -52 -240 -181 -124 22 164 227 148 -105 -194 62 159
7258 159 -30 -151 -47 -36 -38 -44 -25 -134 153 23 -52 145 -115 129 -92 -179 -96 -36 -135 -51 154 -128 104 56
$$ packed form
7089E7K00k15p0j11J09M9q3m6j50K39J8j14N2J09j31l8P6KP3j4j12J26J54j82
7113bo0M5P4k65J00J26q6k08J25l0N5O3P2j5K0J66k43L18j93P8k28J3K82l01J90
7138I6r1j33J93J38k25J24j07l4J3K2R2o0N0l6Q7l69L35j61K24j37k58K91N0j15
7162a1k4j4Q7N4oj32M1O0J94m16K20J50k6r9j84K09k24K70k92k2K83o9j91J48
7186Fj28L18k87pL22j17j69M1oK43k46j4o9L7k6l3K20j96Q5m1O8j75L34j91J27
7211I6J21j75R6k89J25K28m5l14L41k18r0k16J33L03j26l8K42j20m6j03J77o0
7233B2o8L07k92p4R9J75k11J6O9j04j77K28l6oj88N9N7J46J42O3p9k53q9K56R7
7258A59j89j21J04J1koJ9j09K87j30p5J97k60K44k21q7Q3O0r9Q4K05k82K32m8
$$ plain form
7282 56 116 -329 -31 240 64 -145 166 70 -48 103 89 77 40 173 204 -71 -231 -112 -52 -47 -49 36 -69 113
7306 113 88 -205 -68 48 -122 -15 -10 -89 -139 30 124 80 34 79 -61 140 60 7 -64 -43 -11 92 219 -177 63
7331 63 116 115 -91 -219 -2 -144 42 95 -15 -163 187 144 5 203 23 41 25 -39 266 -271 -15 -104 12
7354 12 93 90 -157 -147 -22 249 -127 -165 -139 12 -89 -226 1 -142 221 -129 -6 -44 85 -21 96 142 -76
7377 -76 -92 -185 -61 -2 97 83 21 144 137 -150 161 154 -479 119 107 -34 -211 258 115 62 -185 56 14 59 163
7402 163 -82 -91 -63 43 -2 98 -58 -334 69 61 245 43 -178 -9 -46 8 117 200 47 -116 45 135 -235
7425 -235 77 -84 55 191 -61 61 18 131 -49 62 -40 28 46 198 289 -47 30 -23 -42 53 100 38 28 -59
7449 -59 99 300 143 141 -29 17 -169 159 69 10 -80 9 -74 80 -158 50 -54 -188 -52 -13 -2 47 -16 -62 -129
$$ packed form
7282E6O0m45K98K71j76k09L11r6j18J51j4j2l7J33L1k75j60J19O0NkQ5j05J82
7306A13k5k93J37J16j70J07Np9n0J69R4m4m6M5j40K01q0n3p1K1L2J03J27l96K40
7331F3N3jk06j28K17j42J86N3j10j48L50m3j39J98j80J8j6o4L05n37K56q9J16
7354A2Q1lk47J0J25K71l76l8K6J51j01j37K27j43L63l50J23l8J29j06J17M6k18
7377g6j6r3J24N9R9j4o2J23pk87L11po33N98j2j41j77M69j43n3k47K41m2M5J04
7402A63k45rK8J06m5J00j56k76M03qJ84k02k21J69l7N4J09Q3j53j63J61R0l70
7425b35L12j61J39J36k52J22m3J13j80J11j02O8J8J52R1l36P7n3j9R5M7o2j0q7
7449e9J58K01j57kj70M6j86L28r0n9r0Q9q3J54k38K08j04j34J36L9J1M9o3m6o7
$$ plain form
7474 -129 59 -100 -24 13 -274 175 62 72 149 43 -157 -101 -36 54 223 -18 -71 207 364 11 23 50 152
7497 152 179 38 14 -12 11 288 -256 81 -20 -119 96 205 27 186 250 -34 44 68 16 9 -36 -119 150 103 178
7522 178 -25 10 8 -67 75 36 -172 -38 -119 46 51 50 29 -112 8 -19 -228 105 141 -71 -25 157 168 -16 -65
7547 -65 113 180 -12 114 101 165 -60 -31 -14 134 106 96 -206 -51 55 -116 -71 88 181 -165 24 171 124 -224
7571 -224 -3 163 67 291 35 -17 184 -40 6 38 140 16 -108 118 18 -105 -82 52 -210 45 114 20
7593 20 59 144 75 -170 135 208 259 164 -3 106 81 23 -144 43 16 -144 27 23 36 142 161 -113 26 70 -52
7618 -52 79 -106 -30 -63 -25 59 -43 -84 52 -42 258 220 38 -185 -106 -155 -46 131 54 -89 97 56 93 -118
7642 -118 20 -83 55 111 85 -29 -78 202 -26 -173 -156 7 -23 107 -12 82 -31 -75 97 95 118 107 80 133
$$ packed form
7474a29J88j59P6L7k87M49j13J0P7j06k00N6O5R0J69k41n3K78J57l53J2K7J02
7497A52K7j41k4k6K3K77n44L37j01r9K15J09j78J59O4k84P8K4n2pm5q3K69m7P5
7522A78k03L5kp5J42l9k08J34q1J65Njk1j41J20k7k09L33L6k12M6J82J1j84m9
7547f5J78O7j92J26j3O4k25K9J7J48k8j0l02J55J06j71M5J59R3l46J89J47m7l48
7571b24K21J66r6K24k56n2K01k24M6L2J02j24j24K26j00j23K3J34k62K55O9r4
7593B0L9Q5o9k45L05P3N1r5j67J09k5n8j67J87k7j60J71mJ3J06J9k74J39M4j22
7618e2J31j85P6l3L8Q4j02m1J36r4L00l8j82k23P9m9J09J77p7j43J86m1L7k11
7642a18J38j03J38N6k6j14m9K80k28j47J7J63l0J30j19R4j13m4J72kK3j1k7N3
$$ plain form
7666 133 -56 156 -140 301 -124 49 124 29 -24 -153 -41 14 -25 -111 -13 322 -120 34 72 -214 -88 -62 146
7689 146 -14 -46 87 10 53 35 -202 -137 -35 219 183 -207 321 -240 7 -132 -73 231 175 256 -173 -65 -166
7712 -166 3 22 -191 -6 -184 -98 153 -93 -39 -94 -18 -27 17 -205 131 7 -106 103 255 211 -70 141 -123
7735 -123 -69 39 -225 -51 167 -248 -136 71 173 27 -174 -137 69 -204 -55 -94 -2 165 -129 -111 -93 53
7757 53 49 -124 98 26 1 47 -196 -221 -97 -85 4 -191 112 -43 -111 111 47 45 35 182 78 -34 -58 26 -19 126
7783 126 -195 14 73 -86 170 77 207 -176 214 -25 -267 -148 220 -41 60 137 91 5 204 -24 201 96
7805 96 -26 388 -99 -31 -32 -33 34 -133 64 148 -80 37 -87 -3 100 -33 134 -56 -260 -9 109 -165 -118
7828 -118 142 3 -262 205 -105 -98 -67 14 -136 118 194 -63 157 244 93 -201 29 -85 71 30 65 -114 -214
$$ packed form
7666A33j89K12k96M41m25J73P5r5n3j29J12N5l9q6R8L35m42J54L8k86J26K6K08
7689A46j60l2J33p7M3j8k37O5J02K54l6l90N28n61K47j39N9L04n6Q1m29J08j01
7712a66J69J9k13J85j78Q6K51k46N4n5P6rM4k22L36j24j13K09J52m4k81K11k64
7735a23N4J08k64J74K18m15J12K07J02j46k01L7K06k73J49l9R2J67k94J8J8J46
7757E3mj73K22p2k5M6k43k5J24J2Q9j95L03j55o8K22o4kj0J47j04j12k4Q4m5J45
7783A26l21K09N9j59K56r3J30l83L90k39k42J19L68k61J01P7m6q6J99k28K25j05
7805I6j22M14m87O8jjO7j67J97Q4k28J17j24Q4J03j33J67j90k04K51J18k74M7
7828a18K60j39k65M67l10PL1Q1j50K54P6k57K20Q7j51k94K30j14J56m1L5j79j00
$$ plain form
7851 -214 -61 -49 13 106 -140 261 -268 53 63 59 49 14 -108 -81 -61 36 -43 -89 -128 -75 101 -22 -217 -95 176
7876 176 165 -48 -137 37 -107 -43 -76 -113 -160 116 111 51 -2 -196 225 137 239 94 -203 -12 -57 -26 -5 82 89 -30
7902 -30 -174 -67 -57 23 199 13 129 -7 149 -198 103 54 -321 -22 -97 67 -206 4 -125 92 -75 -170
7924 -170 7 -75 -51 115 -2 -28 -65 -86 126 72 36 -115 -73 -167 82 -109 -68 -70 -167 89 -93 38 73 1 -65
7949 -65 66 -63 7 -77 -202 87 219 174 -104 -140 -191 218 138 65 68 -239 181 -15 -116 111 196 32 55 -183
7973 -183 89 87 -174 -150 187 96 -78 73 479 -25 13 108 -37 -25 -201 37 -59 -51 -107 86 -60 -50 183 112
7997 112 -3 51 60 35 -283 209 -40 -1 44 112 76 -205 89 129 -173 78 29 -73 52 55 -208 50 -89 39
8021 39 9 -23 193 77 -28 140 148 -37 53 -46 -35 9 -77 -35 -170 35 -64 -95 71 -192 70 -219 -24 80
$$ packed form
7851b14J53J2O2R3k46M01n29L21J0mj0l5j22K7K0R7p9m6l9N3J76j23j95J22K71
7876A76j1k13q9J74j44O4l3l7m7K76no0n3j94M21q8J02j45k97J91m5L1K1Q7Pj19
7902c0j44J07J0Q0J76j86J16j36J56l47L01m9l75K99p5J64k73K10j29K17j67r5
7924a70J77q2K4J66j17k6l7k1K12n4l6j51M2r4K49j91M1kr7K56j82J31L5p2o6
7949f5J31j29P0q4j25K89J32m5k78l6n1M09q0p3Ll07M20j96j01K27Q5j64K3k38
7973a83K72kk61K4L37r1j74J51M06n04L8R5j45J2j76K38r6Qn6J93j46J0K33p1
7997A12j15N4Rk5l18M92k49L9M5O8l6k81K94M0l02K51m9j02J25Lk63K58j39J28
8021C9l0l2K16j16j05J68Qj85R0r9J1M4q6M2j35K05r9l1J66k63K62k89J95J04
$$ plain form
8045 80 63 186 56 -47 -31 64 158 79 210 172 -110 -67 -298 62 39 49 -59 222 -103 -73 127 -138 187 142
8069 142 -70 -44 98 4 18 104 -86 212 39 157 -143 10 206 93 137 -40 -117 -201 -118 -117 -180 -143 -155 16
8093 16 13 -81 -22 -6 37 138 14 1 -39 13 18 -131 -37 101 -120 -112 35 -36 356 57 128 -173 -45 244 36 72
8119 72 15 145 100 -149 83 157 -186 -17 79 136 -184 156 103 13 -37 -26 -89 8 192 48 -118 -38 27 144 -197
8144 -197 -141 -439 -77 -35 -4 172 135 -89 -176 1 -53 72 -123 -43 94 132 -118 -105 190 -71 84 264 22
8167 22 -280 -201 9 -212 -101 -65 -51 8 -7 12 307 -119 -210 70 94 105 -117 -12 -204 88 56 7 71 -107
$$ packed form
8045H0j7J23j30j03J6R5R4p9J31l8k82M3k31L60k3J0j08K81l25L0K00k65L25m5
8069A42k12K6J42r4J4Q6j90K98j73J18l00J53J96j13M4j77p7q4Q3Jo3L7j2J71
8093A6lr4N9J6M3J01j24j3m0N2Nj49R4J38k21QJ47p1L92k99P1l01J28K89k08L6
8119G2n7J30m5k49K32P4l43J69R6N7l20L40n3r0n0J1o3R7J84j44j66Q0O5J17l41
8144a97N6k98L62M2L1J76l7k24q7J77n4J25j95Q0J37L8k50J3K95k61J55J80k42
8167B2l02P9K10k21J11L6J4N9j5J9K95m26r1K80K4J1k22J05j92K92l2m9O4j78
8191a07
$$ Imaginary data points
##PAGE= N=2
##DATA TABLE= (X++(I..I)), XYDATA
$$ plain form
0 0 0 0 0 0 0 0 0 0 0 0 0 0 0 0 0 0 0 0 4 -8 8 -8 8 -8 9 -16 16 -16 21 -24 25 -32 33 -40 42 -49 56 -61 68 -75
40 -75 84 -94 106 -115 127 -141 156 -173 189 -207 230 -251 277 -308 340 -377 419 -468 524 -595 679
61 679 -784 918 -1099 1354 -1741 2388 -3687 7252 -36770 -107395 16641 76369 -3133 -46415
75 -46415 71 11274 1800 16064 7540 -24964 -1577 36768 11789 -28727 -7502 24040 9697
88 9697 -16681 -10734 9292 10322 -10876 -22107 -4320 14736 4761 -10931 -10171 -5205 -537 10399
102 10399 6913 -12569 -9759 13926 14219 -2208 -3841 -82 -1505 10778 20991 -2252 -22793
115 -22793 185 23041 4198 -15832 -1997 8878 -3473 -7987 1715 -504 -10793 -3955 6958
128 6958 -156 -9445 -3152 1827 -5229 -4468 10244 10238 -9179 -11629 9120 15311 -1248 -5568 6533
$$ packed form
0@%%%%%%%%%%%%%%%%%%Mj2J6j6J6j6J7k5L2l2L7m5M9n7O5p3Q2r1J05j17J29j43
40g5J59j78K00k21K42k68K97l29L62l96M37m81N28n85O48p17P96q87R92j119J274
61F79j463J702k017K453l095M129o075J0939m4022p0625J24036N9728p9502m3282
75d6415M6486J1203r474J4264q524l2504K3387L8345k4979m0516K1225L1542j4343
88I697k6378N947K0026J030k1198j1231J7787J9056r975j5692P60M966M668J0936
102A0399l486j9482K810K3685K93j6427j633L759j423J2283J0213k3243k0541
115b2793K2978K2856j8843k0030J3835J0875j2351m514R702k219j0289O838J0913
128F958p114r289O293M979p056P61J4712oj9417k450K0749O191j6559m320J2101
$$ plain form
143 6533 6568 -2266 2327 7119 -3679 -7518 6173 10234 -3670 -9981 -3017 -834 -2287 2180 1405
158 1405 -8219 -8962 1561 4494 -3708 -5864 -145 2731 1694 1825 699 -1872 -1111 4908 9382 5026
174 5026 -3242 -3684 3770 6205 2203 -649 -84 -1457 -388 1295 -1934 -5923 -2216 1632 -2172 -3275
190 -3275 384 -2943 -8819 -1838 7920 3053 -6068 -4171 2094 3485 3045 2687 -425 382 6190 5900
206 5900 -1260 -2925 2470 4984 1751 15 461 -1577 -4421 -3060 1918 2465 -3231 -6320 -2320 431
222 431 -1432 -3213 -2148 -1234 657 2671 82 -3422 -925 4319 4464 2081 1937 1773 -533 477
238 477 4470 4420 460 -1594 107 1655 378 -2378 -3437 -1634 769 332 -2642 -5105 -3839 -500
254 -500 480 -1065 -1516 -535 -923 -1383 654 2593 1636 656 2123 3164 1829 839 998 1276 2366 3498
$$ packed form
143F533L5q834M593M792j0798l839J3691M061j3904o311O964K183j453M467p75
158A405r624p43J0523K933q202k156N719K876j037J31j126k571P61O019M474m356
174E026q268m42P454K435m002k852N65j373J069J683l229l989L707L848l804j103
190c275L659l327n876O981R758m867r121J897O265J391m40l58l112Q07N808k90
206E900p160j665N395K514l233j736M46k038k844J361M978N47n696l089M000K751
222D31j863j781J065R14J891K014k589l504K497N244J45k383j44j64k306J010
238D77L993n0l960k054J701J548j277k756j059J803K403m37k974k463J266L339
254e00R80j545m51R81l88m60K037J939r57r80J467J041j335r90J59K78J090J132
$$ plain form
272 3498 1947 -1019 -2345 -933 820 140 -1222 -2042 -2360 -2508 -1751 -1275 -2508 -2729 -463 873 -1025
289 -1025 -2310 -961 1149 1703 1892 2024 1108 978 1618 1782 1543 2174 2300 1298 114 519 426 -245 -1562
308 -1562 -1060 237 -575 -2323 -2923 -2011 -1328 -1190 -1150 -1195 -1809 -967 128 -87 -222 1228 1911 1337 1214
327 1214 1648 1500 1162 2276 2465 1603 356 631 485 11 -594 -798 -409 -686 -1353 -2328 -2140 -1706 -1389
346 -1389 -985 -1088 -1740 -1337 -590 -641 -552 656 1000 912 1176 1724 1209 1054 1781 2184 1701 1316 847 392 128
367 128 742 407 -294 -994 -1229 -1417 -1287 -1361 -1804 -1542 -1417 -1340 -866 -832 -1729 -1248 367 1339 921 -202 -87
388 -87 986 2134 2706 1290 253 1116 2256 1919 582 -573 -207 964 896 -238 -1919 -1772 -828 -882
406 -882 -1130 -1722 -1735 -1102 -1602 -1263 -523 -136 -546 -456 603 1379 1295 636 625 895 2068 3012 1725 -187
$$ packed form
272C498j551k966j326J412J753o80j362q20l18j48P57M76j233k21K266J336j898
289a025j285J349K110N54J89J32r16j30O40J64k39O31J26j002j184M05r3o71j317
308a562N02J297q12j748o00R12O83J38M0m5o14Q42J095k15j35J450O83n74j23
327A214M34j48l38J114J89q62j247K75j46m74o05k04L89k77o67r75J88M34L17
346a389M04j03o52M03P47n1Q9J208L44q8K64N48n15j55P27M03m83l85m69m55k64
367A28O14l35p01p00k35j88J30p4m43K62J25P7M74L4q97M81J615R72m18j123J15
388h7J073J148N72j416j037Q63J140l37j337j155L66J171o8j134j681J47R44n4
406h82k48n92j3O33n00L39P40L87m10R0J059P76q4o59j1K70J173R44j287j912
$$ plain form
426 -187 -237 1846 2564 590 -1318 -941 193 42 -1113 -1739 -1644 -1845 -1271 -612 -889 -2148 -2451 -675 551
445 551 567 -333 -568 197 1104 2092 1782 561 215 1467 2840 2254 223 -676 1140 1535 747 -614 -885
464 -885 -868 -1068 -327 -208 -1420 -2328 -2041 -993 -165 -766 -1353 -1363 -301 546 1098 468 -487 -346 1825 3157
484 3157 1576 -478 2 1704 2498 1523 -59 -731 -148 1051 941 -785 -1682 -1842 -762 -128 -999 -2158
502 -2158 -1634 -917 -1121 -734 289 -386 -1542 -724 1600 2055 444 -981 -59 2220 3316 1777 -474
519 -474 -737 1507 3071 1528 -1482 -1862 793 1575 -392 -2274 -1363 -433 -782 -1474 -982 -895 -1532 -1254
537 -1254 -610 -93 178 260 -436 -805 403 2848 2268 -396 -1146 1802 4149 1792 -1874 -1062 2013 2416
555 2416 456 -1218 -1804 -713 705 671 -1495 -2969 -1813 284 59 -1778 -2083 -457 383 -627 -481
$$ packed form
426a87n0K083P18j974j908L77J134j51j155o26R5k01N74O59k77j259l03J776J226
445E51J6r00k35P65R07R88l10j221l46J252J373n86k031q99J816L95p88j361k71
464h85J7k00P41J19j212r08K87J048Q28o01n87j0J062Q47N52o30r55J41K171J332
484C157j581k054M80J702P94r75j582o72N83J199j10j726q97j60J080O34q71j159
502b158N24P17k04L87J023o75j156Q18K324M55j611j425R22K279J096j539k251
519d74k63K244J564j543l010l80K655P82j967j882R11R30l49o92M92Q7o37K78
537a254O44N17K71Q2o96l69J208K445n80k664p50K948K347k357l666Q12L075M03
555B416j960j674n86J091J418l4k166j474J156K097k25j837l05J626Q40j010J46
$$ plain form
572 -481 799 765 -553 -433 1929 2667 993 -744 509 2334 1812 540 -198 -66 -29 323 846 -488
590 -488 -2021 -1835 114 370 -1778 -2159 -1363 -1097 -604 105 200 -1238 -1581 498 2732 1183 -1169 -478
608 -478 2176 3012 810 -246 680 987 1216 1276 780 -714 -734 593 1010 -478 -1448 -1327 -896 -533 -1006
627 -1006 -983 -1226 -1210 -610 -56 298 -300 -698 -93 778 1321 820 541 538 340 1724 2230 1098 -575 -697
647 -697 1440 2390 -11 -1974 -1534 411 664 -669 -1936 -1664 -1016 -152 -374 -1316 -1805 -462 334 -103
665 -103 95 -84 217 364 1042 1463 1334 732 284 1256 1780 1192 456 71 147 190 720 184 -1143 -1545 -681
686 -681 0 -406 -1371 -1605 -1242 -421 146 -374 -1269 -1160 652 914 595 90 293 927 1381 1313 882 352
706 352 582 1044 925 874 -22 -321 -237 36 -45 -518 -1079 -1220 -679 -214 -888 -1144 -1477 -937 -469 -163 -53
$$ packed form
572d81J280l4j318J20K362P38j674j737J253J825n22j272p38J32L7L52N23j334
590d88j533J86J949K56k148l81P96K66M93P09R5j438l43K079K234j549k352O91
608d78K654Q36k202j056R26L07K29O0m96j494k0J327M17j488r70J21M31L63m73
627a006K3k43J6O00N54L54n98l98O05Q71N43n01k79lj98J384N06j132j673j22
647f97K137R50k401j963M40J945K53j333j267K72O48Q64k22r42m89J343P96m37
665a03J98j79L01J47O78M21j29o02m48R72N24n88p36l85P6M3N30n36j327m02Q64
686f81O81m06r65k34L63Q21N67n20q95J09J812K62l19n05K03O34M54o8m31n30
706C52K30M62j19n1q96k99Q4K73q1m73n61j41N41M65o74k56l33N40M68L06J10
$$ plain form
727 -53 -447 -568 417 1068 968 371 347 576 1496 1525 634 343 503 1010 963 -164 -512 -384 13 -164 -439
748 -439 -917 -1012 -1389 -921 -600 -578 -833 -1159 -707 -258 254 -389 -441 27 897 1120 835 434 471 1189 1483 915
770 915 622 204 379 457 367 -14 -244 -776 -453 -205 -670 -995 -1268 -1258 -725 -514 -636 -972 -559 -140 11
791 11 166 319 284 534 749 1030 805 724 815 705 1333 753 293 86 149 213 -33 -346 -841 -869 -441 -480 -745
814 -745 -1096 -882 -668 -674 -515 -583 -442 -396 270 397 462 377 349 895 907 1134 851 785 622 735 1009 302 194
837 194 353 107 -281 -376 -499 -925 -876 -651 -546 -678 -971 -891 -368 -421 -152 27 -206 40 429 434 745 402
859 402 539 844 1013 850 520 393 388 723 425 16 -657 -521 -302 -396 -699 -728 -615 -555 -644 -754 -845 -1018 -317
882 -317 19 -266 -60 -107 293 306 408 607 861 763 792 612 768 646 311 436 198 361 131 -207 -573 -619
$$ packed form
727e3l94j21R85O51j00n97k4K29R20K9q91k91J60N07m7j127l48J28L97j77k75
748d39m78r5l77M68L21K2k55l26M52M49N12o43n2M68Q70K23k85m01L7P18K94n68
770I15k93m18J75P8r0l81k30n32L23K48m65l25k73J0N33K11j22l36M13M19J51
791A1J55J53l5K50K15K81k25q1R1j10O28n80m60k07O3O4k46l13m95k8M28l9k65
814g45l51K14K14oJ59o8J41M6O66J27O5q5k8N46J2K27k83o6j63J13K74p07j08
837A94J59k46l88r5j23m26M9K25J05j32k93Q0N23n3K69J79k33K46L89NL11l43
859D02J37L05J69j63l30j27nL35k98m09o73J36K19r4l03k9J13O0q9j10r1j73P01
882c17L36k85K06m7M00J3J02J99K54r8K9j80J56j22l35J25k38J63k30l38l66m6
$$ plain form
904 -619 -297 -557 -717 -922 -1084 -643 -296 -645 -565 -478 -292 289 292 103 -12 356 796 973 622 304 430 951
926 951 959 637 378 158 -8 31 209 -211 -801 -805 -235 -55 -881 -1308 -702 -559 -350 -519 -445 -267 -272 12 360
949 360 423 86 312 622 770 848 481 632 597 326 849 583 -10 -142 -230 168 146 -768 -883 -523 -317 -553
971 -553 -810 -717 -589 -461 -42 -53 -544 -527 250 469 369 159 392 955 666 466 603 809 263 82 449
992 449 442 337 -362 -294 -112 -66 -502 -676 -824 -1021 -402 -495 -244 -983 -859 -193 201 10 -331 -202 277 506
1014 506 623 640 272 368 810 1044 757 -67 -40 425 458 217 172 -459 -571 -468 -155 -303 -804 -980 -701 -273
1036 -273 -402 -740 -602 -272 14 589 55 37 79 469 766 1022 762 245 542 589 716 650 134 -27 16 231
1058 231 364 -326 -740 -471 -147 -231 -384 -879 -971 -786 -473 -181 -201 -334 -430 163 653 146 179 500 614 753
$$ packed form
904f19L22k60j60k05j62M41L47l49Q0Q7J86N81Lj89j15L68M40J77l51l18J26N21
926I51Ql22k59k20j66L9J78m20n90mN70J80q26m27O06J43K09j69P4J78nK84L48
949C60O3l37K26L10J48P8l67J51l5k71N23k66n93j32q8L98k2r14j15L60K06k36
971e53k57R3J28J28M19j1m91J7P77K19j00k10K33N63k89k00J37K06n46j81L67
992D49pj05o99O8J82M6m36j74j48j97O19r3K51p39J24O66L94j91l41J29M79K29
1014E06J17J7l68R6M42K34k87q24K7M65L3k41m5o31j12J03L13j48n01j76K79M28
1036b73j29l38J38L30K86N75n34j8M2L90K97K56k60n17K97M7J27o6n16j61M3K15
1058B31J33o90m14K69L24q4j53m95r2J85L13K92k0j33r6N93M90n07L3L21J14J39
$$ plain form
1080 753 680 623 279 146 723 946 498 -270 -407 -145 81 23 -612 -606 -786 -527 -334 -644 -758 -957 -493 -52
1102 -52 -203 -219 -486 66 235 620 494 319 129 188 580 912 650 76 441 628 236 224 -236 -410 -211
1123 -211 -142 -106 -464 -878 -833 -381 -219 -283 -545 -825 -52 50 -160 -25 149 271 620 805 443 192 318
1144 318 673 737 722 203 152 65 -42 108 118 -190 -517 -578 -526 -109 -533 -756 -724 -176 -381 -393 -606 -254 198
1167 198 469 318 157 -22 321 570 685 478 433 203 448 477 400 62 -147 -60 340 201 -415 -724 -594
1188 -594 -237 -284 -222 -506 -851 -438 -306 -258 -70 -418 -99 195 192 132 144 111 376 565 827 679 106 182 402
1211 402 356 350 190 -397 -204 -80 -10 -242 -596 -600 -255 -486 -361 -546 -558 -480 55 128 73 -142 -236 12 455 555
1235 555 420 196 471 682 586 378 50 -89 533 431 -128 -277 -343 -483 -266 -61 -233 -659 -564 -597 -268
$$ packed form
1080G53p3n7l44j33N77K23m48p68j37K62K26n8o35Oj80K59J93l10j14j99M64M41
1102e2j51j6k67N52J69L85j26j75j90N9L92L32k62n74L65J87l92j2m60j74J99
1123b11O9L6l58m14M5M52J62o4k62k80P73J02k10J35J74J22L49J85l62k51J26
1144C18L55O4j5n19n1q7j07J50J0l08l27o1N2M17m24k23L2N48k05j2k13L52M52
1167A98K71j51j61j79L43K49J15k07m5k30K45K9p7l38k09Q7M00j39o16l09J30
1188e94L57m7O2k84l45M13J32M8J88l48L19K94lo0J2l3K65J89K62j48n73P6K20
1211D02m6oj60n87J93J24P0k32l54mL45k31J25j85j2P8N35P3n5k15r4K48M43J00
1235E55j35k24K75K11r6k08l28j39O22j02n59j49o6j40K17K05j72m26R5l3L29
$$ plain form
1256 -268 -273 -282 -186 -190 72 150 205 82 213 407 736 348 497 152 776 573 695 299 41 8 154 56 -235 -315
1280 -315 -368 -359 -494 -523 -441 -721 -552 -283 27 -339 -580 -424 -260 222 415 183 366 293 542 844 388 131
1302 131 438 355 563 140 123 -81 -75 -17 -74 -210 -459 -457 -460 -186 -308 -429 -299 -575 -196 -145 -303 -241 218 206
1326 206 383 523 143 59 459 441 498 643 -117 427 370 418 69 71 59 -115 -79 -32 -494 -558 -558 -406 -349 -168 -86
1351 -86 -582 -200 -160 90 188 -88 89 441 350 402 338 590 420 505 564 179 185 -13 26 210 -239 -162 -292 -192
1375 -192 -215 -376 -582 -446 -478 -341 -225 -448 -409 -533 -302 99 143 -46 51 241 507 671 305 503 221 494
1397 494 392 384 207 83 111 144 -187 -174 -243 -457 -253 -195 -440 -545 -509 -201 -163 -237 -260 -331 104 106 322 571 222
1422 222 275 161 474 485 459 254 187 552 180 263 1 -165 -37 -107 -170 -354 -348 -486 -392 -311 -527 -640 -379 -185
$$ packed form
1256b68nrR6mK62P8N5j23J31J94L29l88J49l45O24k03J22l96k58l3J46r8k91q0
1280c15n3Rj35k9Q2k80J69K69L10l66k41J56J64M82J93k32J83p3K49L02m56k57
1302A31L07q3K08m23j7k04ON8n7j36k49KlK74j22j21J30k76L79N1j58O2M59j2
1326B06J77J40l80q4M00j8N7J45p60N44n7M8l49Kj2j74L6M7m62o4%J52N7J81Q2
1351h6m96L82M0K50R8k76J77L52r1N2o4K52j70Q5N9l85Oj98L9J84m49P7j30J00
1375a92k3j61k06J36l2J37J16k23L9j24K31M01M4j89R7J90K66J64l66J98k82K73
1397D94j02qj77j24K8L3l31J3o9k14K04N8k45j05L6L08L8p4k3p1M35KK16K49l49
1422B22N3j14L13J1k6k05o7L65l72Q3k62j66J28p0o3j84Oj38R4Q1k16j13K61J94
$$ plain form
1446 -185 -117 -250 -277 -72 76 127 303 215 209 195 501 600 450 321 418 284 341 157 -24 -103 -24 -5 -124 -178 -467
1471 -467 -502 -378 -277 -334 -408 -203 -128 -158 127 -7 -239 118 237 550 289 213 205 534 474 467 206 266 399 268
1495 268 334 69 -105 -470 -365 -39 -359 -596 -821 -359 -455 -374 -322 -309 -499 39 -47 298 193 -2 324 284
1517 284 402 479 262 421 391 495 476 580 204 -10 7 151 -125 -290 -219 7 -477 -655 -349 -527 -443 -315
1539 -315 -410 -344 -279 -318 -78 179 270 -45 92 96 296 497 413 305 132 562 389 69 60 148 -311 -15 -41 -257
1563 -257 -278 -343 -640 -438 -438 -139 -307 -334 -177 -159 -172 108 60 -24 363 274 332 193 218 332 498 479 18 247
1587 247 23 312 220 78 -227 -432 -73 -20 -435 -412 -348 -451 -417 -451 -127 -424 -210 -104 38 -104 -383 -95
1609 -95 333 382 396 227 90 103 154 443 408 134 -122 544 106 180 -300 -383 -285 95 -192 -367 -427 -375 -261 -33
$$ packed form
1446a85O8j33k7K05J48N1J76q8oj4L06R9j50j29R7j34N7j84j81p9P9J9j19n4k89
1471d67l5J24J01n7p4K05P5l0K85j34k32L57J19L13k61p6qL29o0pk61O0J33j31
1495B68O6k65j74l65J05L26l20k37k25M62r6Q1N2J3j90N38q6L45j05j95L26m0
1517B84J18P7k17J59l0J04j9J04l76k14J7J44k76j65P1K26m84j78L06j78Q4J28
1539c15r5O6O5l9K40K57R1l15J37MK00K01q4j08j73M30j73l20rQ8m59K96k6k16
1563b57k1o5k97K02%K99j68k7J57J8j3K80m8q4L87q9N8j39K5J14J66j9m61K29
1587B47k24K89r2j42l05k05L59N3m15K3O4j03L4l4L24k97K14J06J42j42k79K88
1609i5M28M9J4j69j37J3N1K89l5k74k56O66m38P4m80q3R8L80k87j75o0N2J14K28
$$ plain form
1633 -33 44 -311 -301 -273 52 53 324 -22 140 378 440 345 581 113 182 377 293 175 153 -170 -92 91 99 -298 -416
1658 -416 -280 -76 -379 -420 -394 -195 -184 -25 -27 -217 -182 88 283 183 411 -24 272 537 529 459 42 -124 126
1681 126 294 30 -26 -385 -42 -146 100 -249 -356 -466 -408 -155 -153 -342 -593 -205 10 63 -203 -101 -266 62
1703 62 349 210 171 0 244 705 488 377 -31 14 -202 -1 -113 31 -386 -223 -97 -45 -291 -409 -306
1724 -306 -219 -29 -274 -217 -219 -51 80 28 155 83 160 264 226 414 168 253 215 269 352 358 106 -117 212 257 179
1749 179 -65 -369 -215 -15 -95 -387 -630 -271 -146 -326 -317 -402 -196 37 16 338 100 192 216 24 470 321
1771 321 303 -27 350 295 135 155 44 -156 89 126 -265 -136 -196 -419 -277 -65 -302 -281 -281 -16 36 128 -122
1794 -122 -208 310 314 306 222 -21 372 320 306 326 86 304 -17 221 85 164 -188 50 -15 -282 -319 -305 -300 -173 -430
$$ packed form
1633c3P7l55J0K8L25JK71l46J62K38O2r5K36m68O9J95q4j18k2l23P8J83Ql97j18
1658d16J36K04l03m1K6J99J1J59kj90L5K70J95j00K28m35K96K65qp0m17j66K50
1681A26J68k64n6l59L43j04K46l49j07j10N8K53Kj89k51L88K15N3k66J02j65L28
1703F2K87j39l9j71K44M61k17j11m08M5k16K01j12J44m17J63J26N2k46j18J03
1724c06Q7J90k45N7kJ68J31n2J27p2P7J04l8J88k46Q5l8N4Q3Ok52k23L29M5p8
1749A79k44l04J54K00q0k92k43L59J25j80Rq5K06K33k1L22k38R2K4j92M46j49
1771C21j8l30L77n5j60K0j11k00K45L7l91J29o0k23J42K12k37K1%K65N2R2k50
1794a22q6N18Mqq4k43L93n2j4K0k40K18l21K38j36P9l52K38o5k67l7J4NJ27k57
$$ plain form
1819 -430 -332 -267 -438 -157 117 125 175 -113 -155 269 484 253 79 127 495 464 238 299 209 208 122 -8 60 -34 -136
1844 -136 -193 -90 -181 -234 -383 -427 -127 -299 -218 -243 -136 -78 165 22 177 -32 239 390 354 398 127 321 97
1867 97 75 158 187 147 -129 45 -74 -42 -119 -318 -176 -299 -563 -73 -227 -272 -13 -168 17 -2 -202 22 224
1890 224 96 -89 145 411 234 280 276 198 405 187 314 128 131 22 212 118 -103 23 -188 -343 -287 -166 -25
1913 -25 -80 -242 -232 -157 -40 -124 -102 -46 41 301 156 125 351 284 182 383 317 393 276 32 130 198 -299 -314 -235
1938 -235 -75 -137 -82 -145 -406 -270 -176 -220 -156 -122 -202 -119 178 276 91 288 154 278 56 116 173 238 230 313 353 127
1964 127 39 -110 -158 -135 -202 -490 -38 -371 -86 -292 -173 -316 -405 -251 -220 52 136 76 69 364 29 348 -14
1987 -14 181 274 190 208 7 423 80 171 -93 75 139 92 -6 -102 -318 -537 -328 -2 -229 -523 -286 -308 -100
$$ packed form
1819d30R8O5j71K81K74QN0k88m2M24K15k31j74M8L68l1k26O1r0jq6j30O8r4j02
1844a36n7J03r1n3j49m4L00j72Q1k5J07N8K43j43J55k09K71J51l6M4k71J94k24
1867I7k2Q3K9m0k76J74j19L2p7j99J42j23k64M90j54m5K59j55J85j9k00K24K02
1890B24j28j85K34K66j77M6mp8K07k18J27j86Lj09J90r4k21J26k11j55N6J21J41
1913b5n5j62J0P5J17q4K2N6Q7K60j45l1K26o7j02K01o6P6j17k44R8O8m97j5P9
1938b35J60o2N5o3k61J36R4m4O4L4q0Q3K97R8j85J97j34J24k22O0N7O5qQ3M0k26
1964A27q8j49m8K3o7k88M52l33K85k06J19j43q9J54L1K72Q4o0pK95l35L19l62
1987a4J95R3q4J8k01M16l43R1k64J68O4m7r8r6k16k19K09L26k27k94K37k2K08
$$ plain form
2010 -100 -235 -344 -50 -213 117 204 375 -46 327 371 301 293 465 244 329 157 277 162 -114 40 28 130
2032 130 -374 -405 -398 -144 -174 71 -56 -180 -118 -122 7 -24 -318 -35 -64 114 252 106 145 -151 262 306 429 409
2056 409 191 -86 106 4 -20 -154 -69 -37 -79 -317 -367 -250 -237 -279 -156 -150 -241 -3 -189 175 54 142 -111 305
2080 305 298 70 154 171 457 139 86 70 106 120 67 103 134 -14 -142 -126 -269 -274 -277 -447 -231 -309 -29 -105 14 -8
2106 -8 -143 13 196 205 271 238 165 129 230 295 -99 367 217 235 361 -184 -207 -158 -150 -73 -123 -495 -284 -132 -160 -4
2132 -4 -457 -349 -127 -20 -72 -147 96 104 -21 119 157 192 301 191 257 163 234 42 241 197 -150 169 -34 55
2156 55 -48 -165 36 -227 -390 -176 -117 -17 -149 -251 -222 -114 -102 -124 27 -74 41 98 435 302 295 -59 105
2179 105 307 236 28 -159 73 155 122 -31 79 -96 -179 -132 -12 -381 -387 -146 -291 -264 -228 -150 64 -35 -225 47
$$ packed form
2010a00j35j09K94j63L30Q7J71m21L73M4p0qJ72k21Q5j72J20j15k76J54j2J02
2032A30n04l1PK54l0K45j27j24O2mJ29l1k94K83k9J78J38j46L9k96M13M4J23k0
2056D09k18k77J92j02k4j34Q5L2m2k38n0J17J3m2J23Or1K38j86L64j21Q8k53M16
2080C05pk28Q4J7K86l18n3j6L6J4n3L6L1j48j28J6j43nlj70K16p8K80p6J19k2
2106hj35J56J83RO6l3p3l6J01O5l94M66j50J8J26n45k3M9QP7n0l72K11J52k8J56
2132dm53J08K22J07n2p5K43Qj25J40L8L5J09j10O6r4P1j92J99m4l47L19k03Q9
2156E5j03j17K01k63j63K14N9J00j32j02K9J08J2k2J51j01J15N7L37j33pl54J64
2179A05K02p1k08j87K32Q2l3j53J10j75q3M7J20l69oK41j45K7L6P8K14r9j90K72
$$ plain form
2203 47 -11 -47 136 171 329 319 0 206 315 385 431 51 -13 -131 -5 -83 -267 -348 -263 -246 -176 -294 -372 -391 -277
2228 -277 -106 36 -110 -97 -164 -180 179 157 276 119 135 262 371 125 -70 154 62 374 298 170 -153 -177 -40
2251 -40 -89 150 -188 -311 -165 -218 -29 -287 78 -60 154 134 -286 -6 92 150 122 371 76 388 295 408 268
2274 268 63 245 130 -118 222 -149 -180 -99 -76 -135 100 -64 -2 -167 -202 -11 -238 -389 -5 -71 204 21
2296 21 6 20 -90 153 345 195 82 87 343 90 234 239 0 194 -85 105 37 -129 -259 -277 -124 -64 -64 -224
2320 -224 -115 -209 -40 -37 56 -235 148 -15 305 45 220 100 369 -33 145 211 141 287 156 -129 158 -25
2342 -25 37 3 119 -47 -307 -256 -179 -178 -207 -88 -250 -170 73 -256 -88 -149 -113 239 -45 241 12 280 131 258
2366 258 184 -26 138 100 61 53 -30 -102 -294 -27 20 6 -248 -313 -85 -174 -147 -143 -209 -321 46 116 -17 60 250 126
$$ packed form
2203D7n8l6J83L5J58j0l19K06J09P0M6l80o4j18J26p8j84q1Q5J7P0j18p8j9J14
2228b77J71J42j46J3o7j6L59k2J19j57J6J27J09k46j95K24r2L12p6j28l23k4J37
2251d0m9K39l38j23J46n3J89k58L65j38K14k0m20K80R8N8k8K49k95L12r3J13j40
2274B68k05J82j15k48L40l71l1Q1K3n9K35j64O2j65l5J91k27j51L84o6K75j83
2296B1j5J4j10K43J92j50j13NK56k53J44Nk39J94k79J90o8j66j30j8J53O0%j60
2320b24J09r4J69LR3k91L83j63L20k60J75j20K69m02J78O6p0J46j31k85K87j83
2342b5O2l4J16j66k60N1P7Jk9J19j62Q0K43l29J68o1L6L52k84K86k29K68j49J27
2366B58p4k10J64l8l9qq3p2j92K67M7j4k54o5K28q9K7Mo6j12L67P0j33P7J90j24
$$ plain form
2392 126 152 273 88 315 167 157 461 359 221 8 262 214 -165 77 -138 -42 -206 -8 103 -230 -193 -252
2414 -252 -217 -153 -224 -7 -306 -205 77 29 1 163 191 203 468 107 19 -140 274 357 124 207 -98 70 -11 -158
2438 -158 -3 -233 -51 -83 -161 -144 -96 -266 -52 -55 28 87 -469 -198 -230 164 319 227 120 142 345 105 341 137
2462 137 114 171 -70 58 -86 98 132 153 -208 -79 -45 -350 -441 -410 -474 -105 -163 -218 -273 -228 194 -162 -150 -245 339
2487 339 260 121 67 194 -88 130 69 35 219 -56 71 -129 -24 -63 -19 -98 249 -120 -101 -334 -96 -127 -153
2510 -153 -158 -12 -156 -130 -129 -51 221 18 168 -227 23 110 6 41 139 320 29 -64 75 72 209 -241 -36 52
2534 52 37 -107 -99 -297 -192 -193 96 -22 12 -51 -52 138 -96 204 -153 79 238 -95 95 238 61 225 147 122
2558 122 129 -43 126 -39 -93 -229 -166 -68 -260 -180 65 -81 -210 -168 -53 -180 8 16 -125 -101 111 275 177 178
$$ packed form
2392A26K6J21j85K27j48j0L04j02j38k13K54m8l79K42k15R6j64J98J11l33L7n9
2414b52L5O4p1K17k99J01K82m8k8J62K8J2K65l61q8j59M14Q3k33Q3l05J68q1j47
2438a58J55k30J82l2p8J7M8j70K14lQ3N9n56K71l2L94J55r2j07K2K03k40K36k04
2462A37k3N7k41J28j44J84L4K1l61J29L4l05r1L1o4L69n8n5n5M5M22l56J2r5N84
2487C39p9j39n4J27k82K18o1l4J84k75J27k00J05l9M4p9L47l69J9k33K38l1k6
2510a53nJ46j44K6JP8K72k03J50l95K50Q7j04L5R8J81k91r3J39lJ37m50K05Q8
2534E2j5j44Qj98J05jK89j18L4o3jJ90k34L00l57K32J59l33J90J43j77J64p8k5
2558A22Pj72J69j65n4j36O3R8j92Q0K45j46j29M2J15j27J88Qj41K4K12J64r8J
$$ plain form
2582 178 269 18 168 409 110 165 145 140 147 -30 -35 -307 -111 -189 -42 -96 -215 -217 -47 -190 -329 -357 36 -230 -110
2607 -110 16 17 21 87 -280 121 207 99 51 58 33 -54 -153 60 113 16 71 -197 -40 -30 -143 -100 162 -123 -258 -144
2633 -144 -497 -2 -266 -86 -129 130 54 -8 40 -57 330 -91 76 83 188 377 286 -163 -123 -106 43 -15 2 29
2657 29 -327 -42 -159 77 -95 -157 -50 229 -278 -10 -148 -413 -129 -166 87 115 296 104 107 90 245 119
2679 119 -34 193 -54 181 171 -67 -9 84 -97 31 -30 -285 -153 -184 -155 -218 -289 -202 -155 -122 -220 -98 -181 -249 243
2704 243 172 -7 -37 -1 334 131 120 -169 232 140 -289 0 -28 -16 -23 8 -29 -56 -63 -1 33 -137 -43 -295 -248 -238
2730 -238 13 168 3 -125 125 262 107 16 307 292 83 125 45 -59 -56 -8 112 -34 177 -11 202 64
2752 64 -173 -256 -146 -393 -275 -47 -267 -184 35 63 19 -154 -25 28 6 -224 75 184 -30 160 -43 0 151
$$ packed form
2582A78R1k51J50K41k99N5k0nPj77nk72J96p8J47n4j19kJ70j43j39k8L93k66J20
2607a10J26JMO6l67M01Q6j08m8Pk5q7r9K13N3r7N5k68J57J0j13M3K62k85j35J14
2633a44l53M95k64J80m3K59p6o2M8r7L87m21J67PJ05J89r1m49M0J7J49n8J7K7
2657B9l56K85j17K36j72o2J07K79n07K68j38k65K84l7K53K8J81j92Lj7J55j26
2679A19j53K27k47K35j0k38N8R3j81J28o1k55J32l1K9o3p1Q7M7L3r8J22q3o8M92
2704B43p1j79l0L6L35k03j1k89M01r2m29K89k8J2pL1l7k7pO2L4j70R4k52M7J0
2730b38K51J55j65j28K50J37j55r1K91j5k09M2q0j04LM8J20j46K11j88K13j38
2752F4k37q3J10k47J18K28k20Q3K19K8m4j73J29N3k2k30K99J09k14J90k03M3J51
$$ plain form
2775 151 290 63 240 -134 168 55 -70 -239 -164 113 -272 -317 -114 -115 -320 -114 -156 42 -13 -9 131 144 -123
2798 -123 88 -4 -88 151 238 300 91 85 -4 196 16 198 -150 135 -16 -110 -89 -88 -14 -160 -258 -180 -96 -364 -31
2823 -31 -98 -1 -26 112 -66 -156 -236 -61 181 98 261 131 53 -118 203 182 119 21 191 50 -131 -115 64 -112
2847 -112 -351 -193 -218 -58 35 169 -42 101 -114 -24 -152 -61 147 -14 39 -166 -19 78 331 59 37 15 29
2870 29 -25 -31 -145 -49 -182 114 -39 60 83 253 -252 -13 -59 -99 55 -203 -69 -11 -199 36 188 12 121
2893 121 -9 25 91 19 80 396 310 -31 33 26 -63 396 -48 99 12 -22 72 -430 -47 -391 -194 52 -129 -170
2917 -170 -283 -156 101 218 -11 54 48 -116 -31 -36 60 36 453 -108 157 80 11 -169 208 24 186 -102 -252
2940 -252 91 -212 -59 -206 -90 -192 -204 -417 -192 70 80 -157 -225 -38 -97 39 61 87 162 155 56 58 13 92 105
$$ packed form
2775A51J39k27J77l74L02j13j25j69P5K77l85m5K03jk05K06m2J98n5MJ40J3k67
2798a23K11r2q4K39Q7O2k09oq9K00j80J82l48K85j51r4K1JP4j46r8P8Q4k68L33
2823c1o7R7k5J38j78r0q0J75K42q3J63j30p8j71L21k1o3r8J70j41j81J6J79j76
2847a12k39J58k5J60R3J34k11J43k15R0j28R1K08j61N3k05J47R7K53k72k2k2J4
2870B9n4oj14R6j33K96j53R9K3J70n05K39m6m0J54k58J34N8j88K35J52j76J09
2893A21j30L4O6p2O1L16q6l41O4pq9M59m44J47q7l4R4n02L83l44J97K46j81m1
2917a70j13J27K57J17k29O5oj64Q5nR6k4M17n61K65p7o9j80L77j84J62k88j50
2940b52L43l03J53j47J16j02j2k13K25K62J0k37o8J87n9J36K2K6P5pr9Km5P9J3
$$ plain form
2965 105 -121 107 -262 -288 1 -165 -151 -92 -55 -68 -96 -22 29 -201 -97 -313 -108 132 -95 113 169 -60 -66 -84
2989 -84 128 235 83 163 50 1 145 173 -39 89 -209 -123 6 -36 -250 -135 101 -41 -65 -212 -118 -222 -218
3012 -218 -169 -144 -52 102 3 -84 203 62 78 7 71 122 221 85 -7 204 -41 -42 80 -126 113 -215 -286 -78 240
3037 240 -48 66 -49 -297 103 23 18 -85 -28 1 -207 -105 182 -27 120 -88 161 91 276 -4 -53 216
3059 216 144 169 -2 -15 59 21 -78 -87 -125 -153 -134 -20 -340 -108 -372 -133 -107 61 173 -99 123 108 253 -93
3083 -93 97 163 104 -15 280 182 218 -79 -108 197 -135 156 -170 33 -243 -237 4 -76 -362 118 32 26 -134 -9
3107 -9 64 26 152 3 -45 160 104 87 54 265 131 31 -52 50 158 -58 -212 68 -18 -290 -74 -248 -214 -46
3131 -46 -221 24 -211 -98 -181 -44 78 -173 -24 65 126 132 -179 -36 -16 148 122 -63 -54 -22 72 14 158 162 140
$$ packed form
2965A05k26K28l69k6K89j66J4N9L7j3k8P4N1k30J04k16K05K40k27K08N6k29oj8
2989h4K12J07j52Q0j13m9J44K8k12J28k98Q6J29m2k14J15K36j42k4j47R4j04M
3012b18M9K5R2J54r9q7K87j41J6p1O4N1R9j36r2K11k45jJ22k06K39l28p1K08L18
3037B40k88J14j15k48M00q0nj03N7K9k08J02K87k09J47k08K49p0J85k80m9K69
3059B16p2K5j71j3P4l8r9rl8k8J9J14l20K32k64K39K6J68J12k72K22j5J45l46
3083i3J90O6n9j19K95r8L6k97k9L05l32K91l26K03k76OK41q0k86M80q6oj60J25
3107iP3l8J26j49m8K05n6j7l3K11j34j00q3J02J08k16j54K80q6k72K16j74L4J68
3131d6j75K45k35J13q3J37J22k51J49Q9O1Ol11J43K0J64k6j85RL2R4n8J44Mk2
$$ plain form
3156 140 -1 81 -133 48 40 -160 54 -86 -167 7 -163 -76 -46 -36 -157 -12 -273 45 137 129 172 104 268 392
3180 392 -96 36 -32 138 149 -153 34 -33 2 162 101 -326 52 -118 -182 9 44 -192 -52 -205 -26 -106 -103
3203 -103 57 95 177 27 -43 -28 -110 -10 34 74 240 11 28 275 28 -319 64 -70 78 3 54 -163 54
3226 54 -120 74 -222 -98 -85 -7 -82 -59 -47 -52 -170 -42 54 149 226 27 26 38 91 56 40 -30 82 252 -126 -61
3252 -61 -283 -207 105 -188 30 -152 17 135 -17 -189 22 61 29 -172 182 95 -118 94 -202 240 89 -34
3274 -34 154 22 84 60 121 98 -60 -177 -73 -152 -308 -181 150 -1 63 -115 -229 213 31 -188 -63 -7 -25
3297 -25 160 -54 49 -57 36 123 92 -180 379 74 0 30 -38 178 131 191 -173 -45 -49 159 16 -33 -26 -100 -30
3322 -30 -315 -390 -173 -30 170 270 134 -255 126 -173 215 324 -38 153 14 36 68 128 -79 65 -100 -25
$$ packed form
3156A40j41Q2k14J81qk00K14j40q1J74j70Q7L0J0j21J45k61L18R2qM3o8J64J24
3180C92m88J32o8J70J1l02J87o7L5J60o1m27L78j70o4J91L5k36J40j53J79q0L
3203a03J60L8Q2j50p0J5q2J00M4M0J66k29J7K47k47l47L83j34J48p5N1k17K17
3226E4j74J94k96J24J3P8p5K3J2nj18J28R6R5P7j99jJ2N3l5j6p0J12J70l78O5
3252f1k22P6L12k93K18j82J69J18j52j72K11L9l2k01L54q7k13K12k96M42j51j23
3274c4J88j32O2k4O1k3j58j17J04p9j56J27L31j51O4j78j14M42j82k19J25N6j8
3297b5J85k14J03j06R3Q7l1k72N59l05p4L0o8K16m7O0l64J28mK08j43m9Pp4P0
3322c0k85p5K17J43K00J00j36l89L81k99L88J09l62J91j39K2L2O0k07J44j65P5
$$ plain form
3344 -25 -124 169 125 5 -98 2 -144 -123 190 -149 -115 146 -3 76 -57 207 176 45 51 1 276 74 35 204
3368 204 -3 172 120 48 -80 -66 48 -60 69 135 -243 -94 -146 -120 -114 199 -283 -221 83 0 -156 68 121 -53
3392 -53 196 -36 -26 141 244 169 90 37 206 72 -12 -15 116 -88 70 134 -69 -223 -179 175 -119 -293 88
3415 88 -208 229 -159 -5 13 78 112 -8 154 -31 -68 151 205 197 28 28 -103 71 -29 -3 120 225 -197 44
3439 44 81 -91 133 -274 158 -119 -154 -166 30 -74 -82 102 -25 15 -265 296 95 -163 -111 -30 214 180 117 50
3463 50 109 -229 -20 225 -102 -98 124 -438 -224 66 -141 -152 16 -166 -17 -214 -118 -173 237 -134 84 -156
3485 -156 -71 155 267 -61 149 -148 -120 44 122 153 198 368 36 37 40 210 102 63 -255 2 -87 -81 41 -176
3509 -176 -123 -17 -185 -241 -71 -76 -99 -55 80 -98 111 218 190 47 209 -5 -113 9 -32 12 71 293 -224
$$ packed form
3344b5r9K93m4j20j03J00j46K1L13l39L4K61j49P9j33K64l1j31On0K75k02l9J69
3368B04k07J75n2p2j28J4J14j08J29O6l78J49n2K6OL13m82O2L04q3j56K24N3j74
3392e3K49k32J0J67J03p5p9n3J69j34q4lJ31k04J58O4k03j54M4L54k94j74L81
3415H8k96M37l88J54J8O5L4j20J62j85l7K19N4qj69%j31J74j00K6J23J05m22K41
3439D4L7j72K24m07M32k77l5j2J96j04qJ84j27M0k80N61k01k58N2Q1K44l4o3o7
3463E0N9l38K09K45l27MK22n62K14K90k07j1J68j82J49j97R6n5M10l71K18k40
3485a56Q5K26J12l28K10k97K8J64P8L1M5J70l32JLJ70j08l9l18K57q9OJ22k17
3509a76N3J06j68n6J70nk3M4J35j78K09J07k8j43J62k14j08J22m1M4N9K22n17
$$ plain form
3532 -224 -153 56 36 80 -51 172 154 128 -188 98 14 -23 -89 237 -113 31 -279 -186 -6 -30 80 -37 63
3555 63 117 -73 -226 -109 142 -1 152 203 -325 -94 82 18 32 77 174 37 -204 180 92 -20 -186 -165 -118
3578 -118 7 260 122 228 64 213 -375 -145 140 138 35 -84 92 41 111 54 -124 229 233 100 110 -149 -321
3601 -321 -194 202 -25 -10 -37 -79 -422 6 -3 3 -4 24 13 151 140 194 33 59 69 -33 -15 173 63 201 -158
3626 -158 -11 -33 -8 36 -201 5 -37 -66 139 -56 -223 42 -99 141 -147 -155 259 -162 110 150 13 -49 63
3649 63 50 159 -67 49 32 -57 -21 -6 104 -12 -51 -21 106 -278 -76 -278 -149 35 -174 -155 -41 -112 35
3672 35 -39 -102 70 -88 127 -7 116 83 -27 -126 147 61 111 301 -103 -131 -243 139 -242 -250 -51 94 -49
3695 -49 -49 -137 -53 -28 127 50 -75 -137 -93 -29 49 55 28 243 61 43 -163 120 79 74 334 136 -15 141 -11 211
$$ packed form
3532b24P1K09k0M4j31K23j8k6l16K86q4l7o6L26l50J44l10R3J80k4J10j17J00
3555F3N4j90j53J17K51j43J53N1n28K31J76o4J4M5R7j37k41L84q8j12j66K1M7
3578a18J25K53j38J06j64J49n88K30K85kj03j19J76n1P0n7j78L53Mj33J0k59j72
3601c21J27L96k27J5k7m2l43M28rOpK8j1J38j1N4j61K6J0j02J8J88j10J38l59
3626a58J47k2K5M4k37K06m2k9K05j95j67K65j41K40k88qM14m21K72M0j37o2J12
3649F3j3J09k26J16j7q9L6J5J10j16l9L0J27l84K02k02J29J84k09J9J14p1J47
3672C5p4o3J72j58K15j34J23l3j10r9K73q6N0J90m04k8j12L82l81qJ99J45j43
3695d9%q8Q4K5J55p7j25o2M4O4P8Ok7K15j82j8k06K83m1nK60j98j51J56j52K22
$$ plain form
3721 211 -119 -108 -119 -160 -161 -14 97 -331 -1 103 -217 -73 -176 -44 -41 -29 134 -18 -42 -1 109 -135 166
3744 166 257 109 321 80 105 74 45 -233 -8 11 -103 -263 -140 -5 -362 -218 104 -43 9 24 119 -172 37
3767 37 154 -121 318 19 -199 47 257 -14 41 204 220 36 29 -146 -40 89 -95 -224 -149 80 -166 -37
3789 -37 -187 -136 -74 -170 -63 4 -5 -248 -168 -121 -146 124 269 237 47 38 143 110 63 119 18 6 -86 131 -93 126
3815 126 -55 -177 -247 -95 -21 -18 -131 -95 -13 -112 -178 -36 242 -273 38 35 36 27 -71 67 94 -36 325 57 106 -143
3841 -143 -35 48 191 68 -61 106 -45 -2 66 4 13 54 -50 -32 -55 -65 11 -149 98 -90 341 12 104 -195
3865 -195 126 95 272 -123 -225 115 -41 41 7 -37 104 146 196 -34 -94 80 -41 18 -293 -123 169 -180 -139
3888 -139 33 -8 21 -6 -66 8 321 9 64 181 -176 79 329 55 -11 28 78 123 -67 36 -198 22 18 77
$$ packed form
3721B11l30J1j1m1jJ47J11m28L30J04l20J44j03J32LJ2J63j52k4M1J10k44L01
3744A66R1j48K12k41K5l1k9k78K25J9j14j60J23J35l57J44L22j47N2J5R5k91K09
3767C7J17k75M39k99k18K46K10k71N5J63J6j84pj75J06J29j84j29P5K29k46J29
3789c7j50N1O2r6J07O7rk43Q0M7k5K70J45l2j90rJ05l3m7N6j01j2r2K17k24K19
3815A26j81j22p0J52P4Lj13L6Q2r9o6J42K78n15L11lJrr8J38K7j30L61k68M9k49
3841a43J08Q3J43j23j29J67j51M3O8o2RM1j04J8k3j0P6j60K47j88M31l29R2k99
3865a95L21l1J77l95j02L40j56Q2l4m4J41M2N0k30o0J74j21N9l11J70K92l49M1
3888a39J72m1K9k7o0P4L13l12N5J17l57K55K50k74o6L9N0M5j90J03k34K20mN9
$$ plain form
3912 77 -194 -59 -112 -61 -144 -72 -361 -317 17 -91 -339 -34 -58 -97 47 -111 160 -28 48 139 134 -88 249 122
3936 122 0 253 -116 18 -256 -103 102 -154 28 63 -24 -279 275 268 -61 -46 -19 107 113 73 -154 -235 -314 18
3960 18 32 -95 -45 19 56 19 4 73 20 230 246 133 -112 -94 -125 80 -151 -163 -89 -326 44 277 -57 94 268
3985 268 43 -89 -72 45 -5 170 299 -41 15 183 -27 -8 44 156 -113 90 173 13 -350 -17 86 46
4007 46 -256 -49 -112 -59 -220 -4 146 -102 -11 -48 34 -73 -127 88 -1 302 71 38 -215 40 -17 -75 -124 166
4031 166 -58 133 261 149 183 78 141 -68 -100 80 -98 -169 -31 130 24 -129 227 -247 105 27 -57 2
4053 2 70 153 252 9 -236 109 112 201 78 -125 46 0 -15 149 -167 -276 52 -287 3 -102 -28 -248 -99 225
4077 225 -77 -3 -92 179 78 -42 -275 -33 35 -34 70 -21 230 3 18 20 -239 -56 -118 -13 127 -53 -151
$$ packed form
3912G7k71J35n3N1q3P2k89M4L34j08k48L05k4l9J44j58K71j88P6R1nk22L37j27
3936A22j22K53l69J34k74J53K05k56J82L5q7k55N54pl29J5K7J26Om0k27q1p9L32
3960A8J4j27N0O4L7l7j5O9n3K10J6j13k45J8l1K05k31j2P4k37L70K33l34J51J74
3985B68k25j32J7J17n0J75J29l40N6J68k10J9N2J12k69K03Q3j60l63L33J03m0
4007D6l02K07o3N3j61K16J50k48R1l7Q2j07n4K15q9L03k31l3k53K55n7n8m9K90
4031A66k24J91J28j12L4j05O3k09l2J80j78p1J38J61j06j53L56m74L52p8q4N9
4053BO8Q3R9k43k45L45LQ9j23k03J71m6j5J64l16j09L28l39K90j05P4k20J49L24
4077B25l02P4q9K71j01j20k33K42O8o9J04r1K51k27J5Kk59J83o2J05J40j80r8
$$ plain form
4100 -151 170 -22 73 -117 140 89 -110 138 8 -7 88 -136 241 25 82 222 26 110 27 -74 -41 -125 102
4123 102 -21 199 -142 65 37 63 -6 55 49 60 -10 -258 151 -386 9 71 307 36 -88 -136 305 89 -111
4146 -111 235 -181 5 39 -128 325 82 -207 30 165 75 -85 -91 49 -4 132 -76 -201 126 -143 -219 -106
4168 -106 50 89 -203 48 -77 66 83 -180 104 -177 -293 -88 54 -58 67 61 -92 118 -172 6 -198
4189 -198 149 47 135 43 -92 -12 -89 -49 -68 64 -17 94 -92 -64 196 120 311 300 13 -110 -164 168 64 217
4213 217 315 -78 11 -86 -108 45 53 -19 -146 124 48 -55 135 -338 -277 -100 11 -37 -109 -22 -72 185 14 212
4237 212 107 3 119 106 -35 140 79 54 75 25 -360 -48 158 -9 62 17 306 73 -131 -149 -95 -55 -218
4260 -218 1 92 -203 -192 -59 39 -2 -131 43 15 133 -43 -47 65 -147 4 58 62 171 46 0 104 269 -55
$$ packed form
4100a51L21j92R5j90K57n1j99K48j30j5R5k24L77k16N7J40j96Q4q3j01L3q4K27
4123A02j23K20l41K07k8K6o9O1oJ1p0k48M09n37L95O2K36k71j24m8M41k16k00
4146a11L46m16J86L4j67M53k43k89K37J35r0j60oJ40n3J36k08j25L27k69p6J13
4168a06J56L9k92K51j25J43J7k63K84k81j16K05J42j12J25oj53K10k90J78k04
4189a98L47j02Q8r2j35Q0p7M0j9J32q1J11j86K8K60p6J91j1k87j23n4L32j04J53
4213B17R8l93Q9r7k2J53Qp2j27K70p6j03J90m73O1J77J11m8p2Q7n0K57j71J98
4237B12j05j04J16j3j41J75o1k5K1n0l85L12K06j67P1m5K89k33k04j8N4M0j63
4260b18K19R1k95J1J33R8m1j29J74k8J18j76mJ12k12J51N4MJ09j25m6J04J65l24
$$ plain form
4284 -55 -130 17 43 -26 -61 85 -52 -200 50 -277 -198 -15 -128 -79 -201 -33 135 62 202 69 62 151 36 -7
4308 -7 185 115 -36 81 -68 -139 -95 22 -131 -25 -173 75 13 -126 -120 -6 167 -56 60 52 64 28 196 123
4332 123 97 -33 182 148 -89 19 -56 -203 66 -96 3 16 -79 -81 -42 63 -68 17 -89 -70 36 17 -114 40
4356 40 -101 -143 -168 47 -110 28 35 -21 -117 213 -207 -70 -140 28 -1 226 175 -16 11 140 52 -61 57 142
4380 142 -6 -61 -217 -51 164 -83 -5 -62 -122 156 170 -40 57 39 16 -101 26 -13 -46 -175 15 -40 32 25 -2
4405 -2 -108 -15 3 82 44 100 92 18 -102 -31 234 -95 -35 12 179 -272 -68 -117 336 85 -120 21 25 -67 84 -194
4431 -194 140 114 70 69 45 -16 -100 -18 -76 -92 36 81 -92 -14 -84 -58 -271 -11 31 92 145 108 -120 -28 -102 30 -207
4458 -207 -37 66 56 148 106 101 145 -31 136 -34 65 349 152 -248 323 -100 -169 5 4 -95 204 -89 -81 -4 -56
$$ packed form
4284e5p5J47K6o9l5J46j37j48K50l27P9J83j13M9j22J68J68p3J40j33pQ9j15m3
4308gJ92p0j51J17j49p1M4J17j53J06j48K48o2j39OJ14J73k23J16qJ2l6J68p3
4332A23k6j30K15l4k37J08p5j47K69j62R9J3r5kL9J05j31Q5j06J9J06j9j31J54
4356D0j41m2k5K15j57J38Pn6r6L30m20J37p0J68k9K27n1j91K7J29q8j13J18Q5
4380A42j48n5j56J66K15k47P8n7o0K78J4k10R7j8k3j17J27l9l3j29J90n5P2pk7
4405bj06R3J8P9l8N6qp4j20P1K65l29O0M7J67m51K04m9M53k51k05J41Mr2J51k78
4431a94L34k6m4jk4o1q4Q2n8j6J28M5j73P8p0K6k13K60M2O1N3l7k28R2p4J32k37
4458b07J70J03j0R2m2nM4j76J67j70R9K84j97m00N71m23o9J74jr9K99k93QP7n2
$$ plain form
4483 -56 194 120 -176 169 173 74 54 -108 -85 258 -9 87 170 23 250 -173 -192 175 117 -92 59 -100 -29 15
4507 15 -145 74 -227 -33 3 176 5 -24 2 -158 8 32 148 186 136 26 136 38 7 -46 80 192 -218
4530 -218 -129 -24 33 -19 53 -315 43 -103 -100 -58 75 355 -7 60 -39 180 -54 79 30 135 16 45 117 35
4554 35 149 -67 47 171 234 42 -80 91 105 -72 64 -126 -361 179 27 198 53 187 32 -31 -292
4575 -292 30 245 -125 -73 -11 -107 87 -174 -126 -97 -48 38 -68 41 -105 133 78 13 258 66 -37 183 158
4598 158 99 40 115 -174 25 68 -112 40 17 -228 173 163 138 -177 149 205 -251 -217 -423 133 71 -16 113 169
4622 169 -64 151 152 -306 -81 -194 -44 -78 109 12 62 -166 -224 107 -92 39 -41 49 105 113 -131 96 -101 -39
4646 -39 68 118 -159 -79 119 181 -67 -19 172 -6 83 -41 -162 160 -81 -87 -253 64 -141 76 104 277 38
$$ packed form
4483e6K50p4k96L45Mr9k0j62K3L43k67R6Q3j47K27m23j9L67n8k09J51j59P1M4
4507A5j60K19l01J94L6J73j71k9K6j60J66K4J16L8n0j10J10r8l1n3J26J12m10
4530b18Q9J05N7n2P2l68L58j46LM2J33K80l62O7r9K19k34J33m9J05j19K9P2q2
4554C5J14k16J14J24O3j92j22J71J4j77J36j90k35N40j52J71j45J34j55o3k61
4575b92L22K15l70N2O2r6J94k61M8K9M9Q6j06J09j46K38n5o5K45j92j03K20k5
4598A58n9n9P5k89J99M3j80J52k3k45M01j0k5l15L26N6m56L4k06N56o2q7J29N6
4622A69k33K15Jm58K25j13J50l4J87r7N0k28n8L31j99J31q0R0N6Qk44K27j97O2
4646c9J07N0k77Q0J98O2k48M8J91j78Q9j24j21L22k41oj66L17k05K17K8J73k39
$$ plain form
4669 38 3 -284 81 -142 76 -44 -59 -3 148 198 -306 56 -11 -42 9 -8 -42 -95 -11 131 158 203 -328 63 -114
4694 -114 -95 -70 -265 165 64 -62 119 -81 307 -115 -55 57 89 141 30 179 199 41 -62 -56 -113 -24 -60 225
4718 225 122 -218 -75 -13 -113 -73 -177 -15 43 23 -87 -62 40 164 -35 75 11 -89 198 186 278 -62 -54
4741 -54 29 98 77 12 100 221 -118 29 4 7 -234 -223 101 290 -6 106 177 -254 -120 123 -150 43 75 -145
4765 -145 2 55 -158 -24 14 62 -133 16 -59 -55 35 -57 -63 105 -30 135 206 81 -89 -83 -115 72 146 82 -58
4790 -58 26 26 -76 -81 97 137 -50 73 -24 140 -16 -4 -219 252 42 -421 -32 -47 -45 -63 -70 81 45 168 45
4815 45 74 210 119 7 -70 -109 143 -117 47 -79 -100 49 22 -62 105 128 -55 93 -92 -136 285 39 -141
4838 -141 119 -239 -73 -46 209 -80 173 -3 67 236 174 -103 3 -106 -109 -103 -32 268 -147 178 -98 -134 41
$$ packed form
4669C8l5k87L65k23K18j20j5N6J51N0n04L62o7l1N1j7l4n3Q4J42K7M5n31L91j77
4694a14J9K5j95M30j01j26J81k00L88m22O0J12L2N2j11J49K0j58j03On7Q9l6K85
4718B25j03l40J43O2j00M0j04J62N8k0j10K5J02J24j99J10o4j00K87j2R2l40Q
4741e4Q3O9k1o5Q8J21l39J47k5Lk41J1L24J89k96J12P1m31J34K43k73J93L2k20
4765a45J47N3k13J34L8M8j95J49p5MR0r2oJ68j35J65P1j25j70Ol2J87P4o4j40
4790e8Q4%j02nJ78M0j87J23r7J64j56J2k15M71k10m63L89j5Kj8pJ51l6J23j23
4815D5K9J36r1j12p7l9K52k60J64j26k1J49k7q4J67K3j83J48j85m4M21k46j80
4838a41K60l58J66K7K55k89K53j76P0J69o2k77J06j09lOP1L00m15L25k76l6J75
$$ plain form
4861 41 -35 -12 -262 23 -98 -332 -49 2 29 352 29 148 273 154 209 93 -43 -261 -152 124 -23 73
4883 73 59 -124 281 -36 80 -41 -28 -18 124 74 -176 -304 -110 54 -87 56 122 157 65 167 227 7 -1 79
4907 79 -64 -188 -264 6 64 -40 46 38 -147 26 -22 -81 42 -1 137 29 7 51 -35 -60 49 19 -4 -161 -262
4932 -262 -97 122 10 -191 153 -78 88 118 -69 -20 205 77 217 -180 145 -69 -73 -31 -53 -98 -191 -50 34
4955 34 -30 191 -36 -302 125 -1 -165 49 -28 -77 177 -196 67 50 -164 12 -147 108 -77 235 -30 -35
4977 -35 111 -195 61 209 112 8 128 -304 134 -163 -94 35 -123 54 35 71 -116 144 131 -18 53 284
4999 284 138 54 24 155 23 90 -82 -119 -128 157 139 323 81 -147 309 52 120 -123 -79 156 -77 -32 132
5022 132 38 94 -19 -18 -86 -44 104 -103 24 212 -195 131 273 -97 52 -7 -100 -117 -183 141 -112 303 36
$$ packed form
4861D1p6K3k50K85j21k34K83N1K7L23l23J19J25j19N5j16j36k18J09K76j47R6
4883G3j4j83M05l17J16j21J3J0J42n0k50j28J94J64j41J43O6L5r2J02O0k20qQ0
4907G9j43j24p6K70N8j04Q6qj85J73m8n9J23m3J38j08k2M4q6k5J09l0k3j57j01
4932b62J65K19j12k01L44k31J66L0j87M9K25j28J40l97L25k14mM2k2m5r3J41Q4
4955C4o4K21k27k66M27j26j64K14p7m9K54l73K63j7k14J76j59K55j85L12k65n
4977c5J46l06K56J48r7j04J20m32M38k97O9J29j58J77j9L6j87K60j3j49P1K31
4999B84j46q4l0J31j32O7j72l7rK85j8J84k42k28M56k57O8k43M4K35k33M5J64
5022A32r4N6j13Jo8M2J48k07J27J88m07L26J42l70J49n9r3j7o6L24k53M15k67
$$ plain form
5045 36 60 -85 -17 111 -463 43 -12 60 -150 -47 169 73 181 -84 -73 104 119 -202 286 114 -224 -112 159
5068 159 109 63 -224 51 -151 -157 -16 -61 8 79 -28 56 -10 -274 90 52 -87 -140 -86 -67 225 213 -141 -55 107
5093 107 7 164 -136 118 -16 -202 81 -202 -354 -35 -61 26 103 -262 -84 -219 60 -144 -15 163 156 -56
5115 -56 -17 -23 -124 -323 -165 -181 -28 10 16 -98 275 -148 18 100 19 153 -119 87 -72 146 177 34 34 39 4
5140 4 70 -161 -81 35 343 -115 132 -18 -138 -4 175 -29 90 58 228 125 105 133 -46 108 -76 -181
5162 -181 -26 135 62 26 -107 -78 74 49 12 -100 47 -66 -113 -1 108 5 129 31 30 -47 88 70 -50 101
5186 101 66 -23 -119 -102 -326 -39 254 -26 78 -12 77 -22 -115 91 -119 -79 -190 -54 103 71 -200 -224 22 -53
5210 -53 154 -185 -111 159 -16 59 52 13 93 135 83 -83 51 113 -26 -22 57 -53 242 52 -17 -126 -147 86 141
$$ packed form
5045C6K4j45O8J28n74N06n5P2k10J03K16r6J08k65J1J77J5l21M88j72l38J12K71
5068A59n0m6k87K75k02oJ41m5O9P1j07Q4o6k64L64l8j39n3N4J9K92j2l54Q6J62
5093A07j00J57l00K54j34j86K83k83j52L19k6Q7P7l65J78j35K79k04J29J78pk12
5115e6L9oj01j99J58j6J53L8Oj14L73m23J66Q2q1J34k72K06j59K18L1j43%Nl5
5140DO6k31Q0J16L08m58K47j50j20J34J79k04J19l2J70j03k0K8j79J54j84j05
5162a81J55J61p3l6j33K9J52k5l7j12J47j13m7J12J09j03J24r8jp7J35j8j20J51
5186A01l5q9r6J7k24K87K93k80J04r0Q9r9r3K06k10M0j11J36J57l2k71k4K46p5
5210e3K07l39P4K70j75P5pl9Q0M2n2j66J34O2j39MP9j10K95j90o9j09k1K33N5
$$ plain form
5235 141 -106 51 -21 -76 -75 39 16 -109 -66 18 -181 39 -186 -84 -18 49 258 36 -318 -16 181 2 96
5258 96 -122 179 -139 43 -107 -14 -36 -50 -73 72 457 23 108 -104 75 0 21 101 -21 21 -8 78 4 44 100
5283 100 279 -93 -300 -52 225 -44 -16 74 32 113 272 293 -41 336 -73 97 5 4 109 149 219 45 -163
5306 -163 -238 52 -21 -22 -53 18 133 -200 -150 -18 37 233 52 -55 40 -40 -6 84 43 39 248 -232 -4 141 -247
5331 -247 -17 110 -44 141 55 -64 -47 163 -85 30 -61 240 33 -170 -56 19 -105 -29 95 115 11 160
5353 160 -7 -51 151 -81 -136 35 -13 63 -98 -21 -91 12 34 61 16 52 65 192 -47 -42 -122 128 53 57 154 197
5379 197 249 148 -223 14 173 -23 -6 -26 17 -72 183 -200 102 -91 -32 34 -47 8 -14 193 8 72 268 -157
5403 -157 -18 142 -115 -152 68 -31 -299 83 19 -12 -11 41 -299 50 -299 -25 -70 -34 -108 150 -39 -110 -7 -145
$$ packed form
5235A41k47J57p2n5JJ14k3j25M3Q4j99K20k25J02O6O7K09k22l54L02J97j79R4
5258I6k18L01l18J82j50R3k2j4k3J45L85m34Q5k12J79p5K1Q0j22M2k9Q6p4M0N6
5283A00J79l72k07K48K77k69K8R0m2Q1J59K1l34L77m09J70r2jJ05M0P0j74k08
5306a63p5K90p3jl1P1J15l33N0J32N5J96j81j07R5q0L4R0m1mK09m80K28J45l88
5331b47K30J27j54J85q6j19J7K10k48J15r1L01k07k03J14P5j24P6J24K0j04J49
5353A60j67m4K02k32n5J71m8P6j61P7p0J03K2K7m5L6J3J27k39Nq0K50p5MR7M3
5379A97N2j01l71K37J59j96J7k0M3q9K55l83L02j93N9O6q1N5k2K07j85O4J96m25
5403a57J39J60k57l7K20r9k68L82o4l1JN2l40L49l49K74m5L6p4K58j89p1J03j38
$$ plain form
5427 -145 -192 209 -4 -57 -20 -75 -71 -165 7 266 -58 -214 78 189 53 -39 -53 46 79 36 330 25 -17 -167
5451 -167 -1 89 -83 94 -88 11 12 -26 -193 -178 165 -33 -315 -29 63 213 -143 -246 63 168 152 28 65
5474 65 -212 -38 -67 -234 182 157 111 -23 118 27 210 -84 -116 41 -53 106 -59 -168 -163 46 -41 -25 -28 67 61
5499 61 11 -67 4 -30 74 57 -132 91 -75 -32 207 25 22 -236 -102 -134 75 46 109 103 -182 -158 -28 75 -58
5524 -58 183 48 -142 127 69 78 13 90 84 22 19 105 -153 3 358 68 152 10 323 171 -52 7 -68 8 155
5549 155 -131 -163 111 147 31 108 38 -66 -135 163 256 100 -21 231 76 -23 62 -186 171 195 -182 -36 -9
5572 -9 84 5 -25 100 -79 -151 35 -20 71 -65 -4 -334 143 -256 81 -5 129 -92 -38 8 32 -114 76 -118
5596 -118 171 -316 -68 92 42 -79 -195 81 12 -14 47 144 186 245 64 91 140 -54 157 37 72 135 -33 79
$$ packed form
5427a45m7M01k13n3L7n5Mr4J72K59l24j56K92J11j36r2j4R9L3m3K94l05m2j50
5451a67J66R0j72J77j82R9Jl8j67J5L43j98k82K86R2J50l56j03L09J05j6j24L7
5474F5k77J74k9j67M16k5m6j34J41r1J83k94l2J57r4J59j65j09NK09q7J6lR5o
5499F1n0p8P1l4J04j7j89K23j66M3K39j82lk58J34l2K09k9O3ok85K4J30J03j33
5524e8K41j35j90K69n8Ro5P7oo2lQ6k58J56L55k90Q4j42L13j52k23N9p5P6J47
5549A55k86l2K74L6j16P7p0j04o9K98R3j56j21K52j55r9Q5k48L57K4l77J46K7
5572iR3p9l0J25j79p2J86n5R1j36O1l30M77l99L37q6J34k21N4M6K4j46J90j94
5596a18K89m87K48J60n0j21j16K76o9k6O1R7M2N9j81K7M9j94K11j20L5O3j68J12
$$ plain form
5620 79 34 -91 -35 29 56 -139 465 -157 -85 -92 14 -69 -161 164 -43 137 24 -262 227 -5 -128 90 152 49
5644 49 8 -35 39 251 -119 -297 276 49 -31 -80 157 85 -130 -76 -249 143 -91 -67 -41 -39 -274 -388 166 -67
5668 -67 -68 -20 -87 168 -133 -97 14 87 256 200 -122 -191 -60 -100 -31 -1 161 77 -158 7 -77 -315 -166 -7 -200
5693 -200 63 -37 166 190 -29 172 -97 252 99 182 29 -167 193 121 15 -77 36 60 -24 -58 -175 147
5715 147 70 -191 116 0 59 -96 128 -204 164 81 110 -124 -40 7 -177 -15 -71 229 -115 97 184 11 -84
5738 -84 8 175 138 -18 106 -92 61 -56 108 8 -197 151 -151 28 29 221 -77 62 -170 -205 -33 -117
5760 -117 -135 -28 6 -7 97 -220 -275 65 -80 -117 -133 30 -68 -328 239 52 127 145 -78 -154 83 -23 206
5783 206 -153 -15 -175 -185 -3 91 -49 -16 20 -116 -120 -102 54 49 258 151 -176 0 -185 -46 -128 -210 -22 -32
$$ packed form
5620G9m5j25N6O4K7j95O04o22P2pJ06q3r2L25k07J80j13k86M89k32j23K18O2j03
5644D9m1m3P4K12l70j78N73k27q0m9K37p2k15N4j73L92k34K4K6Kk35j14N54k33
5668f7jM8o7K55l01L6J11P3J69n6l22o9J31m0O9L0J62q4k35J65q4k38J49J59j93
5693b00K63j00K03K4k19K01k69L49j53Q3j53j96L60p2j06r2J13K4q4l4j17L22
5715A47p7k61L07j16N9j55K24l32L68q3K9k34Q4M7j84J62n6L00l44K12Q7j73r5
5738h4R2J67l7j56J24j98J53j17J64j00k05L48l02J79JJ92k98J39k32l5J72q4
5760a17j8J07L4j3J04l17n5L40j45l7j6J63r8k60N67j87P5J8k23p6K37j06K29
5783B06l59J38j60j0J82R4j40L3L6j36mJ8J56nK09j07l27J76j85J39q2q2J88j0
$$ plain form
5807 -32 -2 105 -134 54 191 -267 -25 7 -32 11 -120 163 -40 -20 124 116 -253 205 -52 -4 357 75 181
5830 181 -201 -67 -67 -71 299 -6 -120 -145 123 200 86 -85 -77 41 -19 18 -259 -119 -39 41 136 59 162 55 -119
5855 -119 18 -81 12 18 291 106 -193 -103 -105 42 83 -136 -49 313 -52 88 -41 -140 -76 -57 228 153 18 -9 240
5880 240 -92 -192 -55 123 34 -33 -114 98 10 -133 -101 -24 -20 193 -187 -110 -376 350 92 -77 234 -1 10
5903 10 27 -74 215 -31 89 -20 31 143 -113 47 -61 -156 -173 -87 27 131 -53 -115 -102 36 -35 -235 -18
5926 -18 -56 -3 38 -345 -28 192 217 -9 -180 144 223 51 39 -114 73 141 11 -71 -39 -28 -123 -66 237 -142
5950 -142 219 62 -22 90 105 107 41 88 -106 33 210 39 -33 188 -174 -70 38 -2 -154 265 1 78 106
5973 106 -298 0 90 -104 90 3 -107 -18 39 53 52 -151 -166 -55 -209 -161 146 -249 42 48 -80 121 180 -19
$$ packed form
5807c2L0J07k39J88J37m58K42L2l9M3j31K83k03K0J44ql69M58k57M8L61k82J06
5830A81l82J34%mL70l05j14k5K68P7j14j71QJ18o0L7k77J40Q0Q0R5p7J03j07j74
5855a19J37r9R3OK73j85k99R0kJ47M1k19Q7L62l65J40j29r9O4J9K85p5j35k7K49
5880B40l32j00J37J78q9o7q1K12q8j43L2P7MK13l80P7k66P26k58j69L11k35J1
5903A0J7j01K89k46J20j09N1J12k56J60j08r5j7Q6J14J04j84o2J3J38p1k00K17
5926a8l8N3M1l83L17K20K5k26j71L24P9j72j2j53J87O8j30q2L2J1r5N7L03l79
5950a42L61j57q4J12J5Ko6M7j94J39J77j71p2K21l62J04J08m0j52M19k64P7K8
5973A06m04K98R0j94J94q7j10Q9N7J4jk03j5J11j54M8L07l95K91Oj28K01N9j99
$$ plain form
5997 -19 -29 126 -69 90 -54 -104 248 200 22 -178 132 -25 -1 175 -235 80 -312 -115 35 -15 -192 -84
6019 -84 47 153 196 209 514 2 -77 -276 -136 44 -113 23 115 22 59 -94 148 -66 -46 -88 -23 25 -41 -96
6043 -96 148 215 -80 -199 188 81 -8 -64 112 -105 -112 75 -14 46 102 -162 -35 43 -67 180 47 -108 239
6066 239 71 141 -68 -5 29 -127 58 175 170 0 -11 -165 329 -84 323 -64 39 226 78 -64 -71 167 29
6089 29 69 -96 -45 1 -104 -53 -115 -90 99 161 -4 10 -64 -84 -41 -16 -111 91 27 190 42 -185 -36 152 52
6114 52 36 192 56 144 55 -11 -64 35 152 284 -165 222 -139 -109 154 82 134 48 20 72 -10 -37 -127 -48 -53 -93 73
6141 73 116 -20 172 11 -86 45 -310 -49 -28 11 66 -43 -9 41 12 106 121 -50 55 -83 -52 -216 18 -207
6165 -207 -162 73 39 90 -9 -91 -48 -94 85 10 2 199 214 14 -207 -218 -39 -117 301 74 -132 -202 -46 -19 -13 -124
$$ packed form
5997a9j0J55j95J59j44n0L52m8j78k00L10j57K4J76m10L15l92J97J50n0j77J08
6019h4J31J06M3J3L05n12p9j99J40J80j57J36R2r3L7j53K42k14K0m2O5M8o6n5
6043i6K44O7k95j19L87j07q9n6J76k17pJ87q9O0N6k64J27P8j10K47j33j55L47
6066B39j68P0k09O3L4j56J85J17nj70j1j54M94m13M07l87J03J87j48j42pK38j38
6089B9M0j65N1M6j05N1o2K5J89O2j65J4p4k0M3K5r5K02o4J63j48k27J49J88j00
6114E2j6J56j36Q8q9o6n3R9J17J32m49L87l61L0K63p2N2q6k8N2q2k7r0P9nm0J66
6141G3M3j36J92j61r7J31l55K61K1L9N5j09L4N0k9R4J5j71J05j38L1j64K34k25
6165b07M5K35l4N1r9q2M3m6J79p5qJ97J5k00k21j1J79p8M18k27k06p0J56K7Oj11
$$ plain form
6191 -124 55 63 110 5 119 -48 27 -134 206 -33 53 112 -29 -13 -227 -154 -35 49 -153 75 171 -185 229
6214 229 168 -201 0 273 62 67 -106 -36 119 303 200 -180 -147 -71 -58 84 32 41 -96 56 -111 -60 -89 -106
6238 -106 -102 253 35 -129 -143 44 104 -34 -115 -237 -31 -208 -93 33 2 -116 -37 36 -58 126 161 315 109
6261 109 335 204 166 20 136 110 -12 -108 -186 -7 -192 209 -247 -173 57 55 126 187 -174 -305 107 -83 -124
6284 -124 -30 -14 100 270 -133 41 -139 72 155 219 -94 -31 -60 -57 -85 257 113 -64 89 -164 -284 22 -30
6307 -30 90 155 20 230 -13 -43 -159 34 77 25 -296 5 -47 -28 -108 71 62 49 108 204 -21 214 51 -85
6331 -85 132 -41 87 -6 7 181 24 16 247 -4 22 -172 38 82 -10 -28 27 -141 13 -221 171 186 -27 -119
6355 -119 112 104 -228 -123 37 188 -8 -85 191 -19 39 6 71 -63 -293 -69 -248 -10 35 18 339 133 -29
$$ packed form
6191a24J79QM7j05J14j67P5j61L40k39Q6N9j41J6k14P3J19Q4k02K28R6l56M14
6214B29o1l69K01K73k11Nj73P0J55J84j03l80L3P6J3J42n2Rj37J52j67N1k9j7
6238a06ML55k18j64j4J87O0j38q1j22K06j77J15J26l1j18P9P3r4J84L5J54k06
6261A09K26j31l8j46J16k6j22r6p8J79j85M01m56P4K30kP1O1l61j31M12j90m1
6284a24R4J6J14J70m03J74j80K11Q3O4l13O3k9Lk8L42j44j77J53k53j20L06n2
6307c0J20O5j35K10k43l0j16J93M3n2l21L01n2J9q0J79rj3N9R6k25K35j63j36
6331h5K17j73J28r3J3J74j57qK31k51K6j94K10M4r2j8N5j68J54k34L92J5k13r2
6355a19K31ql32J05J60J51j96p7K76k10N8l3O5j34k30K24j79K38M5j7L21k06j62
$$ plain form
6378 -29 33 -127 -39 -129 -129 -18 -77 -45 156 137 45 20 17 -72 185 24 -148 133 -166 -73 -168 -102 122 -24 46 68
$$ packed form
6378b9O2j60Q8r0%J11n9L2K01j9r2k5lq9K57j61j72K81k99R3r5O6K24j46P0K2
$$ [...]
8191A55
##END NTUPLES=NMR FID
##END=
