##TITLE=1H_Pr C6-Boc
 CDCl3
 8 sc, 
 22.12.2022
##JCAMPDX= 6.0         $$ Bruker NMR JCAMP-DX V2.0
##DATA TYPE= NMR FID
##DATA CLASS= NTUPLES
##ORIGIN= UXNMR, Bruker Analytische Messtechnik GmbH
##OWNER= root
$$ XWIN-NMR		Version 3.5
$$ Thu Dec 22 14:45:13 2022 Russian Standard Time (UT+4h)  she@DPX200
##.OBSERVE FREQUENCY= 200.13135
##.OBSERVE NUCLEUS= ^1H
##.DELAY= (6, 6)
##.ACQUISITION MODE= SIMULTANEOUS
##.ACQUISITION SCHEME= undefined
##.AVERAGES= 8
##.DIGITISER RES= 18
##SPECTROMETER/DATA SYSTEM= spect
##.PULSE SEQUENCE= zg30
##.SOLVENT NAME= CDCl3
##.SHIFT REFERENCE= (INTERNAL, CDCl3, 0, 15.7039)
##AUDIT TRAIL= $$ (NUMBER, WHEN, WHO, WHERE, WHAT)
$$ ##TITLE= Audit trail, XWIN-NMR		Version 3.5
$$ ##JCAMPDX= 5.01
$$ ##ORIGIN= Bruker BioSpin GmbH
$$ ##OWNER= she
$$ F:/spectra/data/she/nmr/H-F/1/audita.txt
$$ ##AUDIT TRAIL=  $$ (NUMBER, WHEN, WHO, WHERE, WHAT)
(   1,<2022-12-22 14:43:59.21 +0400>,<she>,<DPX200>,
      <created by zg, POWCHK disabled, PULCHK disabled
       configuration hash MD5:
       00 E9 B6 7A A2 85 ED C7 34 08 36 98 17 FE 4E 26
       data hash MD5: 16K
       F4 C1 FB 1D F5 75 B1 42 DD 68 6A D5 56 CE E4 A8>)
$$ ##END=
$$ 
$$ hash MD5
$$ E7 27 E8 4F 6E 49 24 AD 09 07 56 10 3F 9B 18 D4
##$RELAX= 
##$RELAX= 
##$RELAX= 
##$RELAX= 
##$RELAX= 
##$RELAX= 
$$ Bruker specific parameters
$$ --------------------------
##$DU= <F:/spectra>
##$EXPNO= 1
##$NAME= <H-F>
##$PROCNO= 1
##$TYPE= <nmr>
##$USER= <she>
##$AMP= (0..31)
100 100 100 100 100 100 100 100 100 100 100 100 100 100 100 100 100 100 
100 100 100 100 100 100 100 100 100 100 100 100 100 100 
##$AQSEQ= 0
##$AQ_mod= 1
##$AUNM= <au_zg>
##$AUTOPOS= <>
##$BF1= 200.13
##$BF2= 200.13
##$BF3= 200.13
##$BF4= 200.13
##$BF5= 200.13
##$BF6= 200.13
##$BF7= 200.13
##$BF8= 200.13
##$BYTORDA= 1
##$CFDGTYP= 0
##$CFRGTYP= 5
##$CHEMSTR= <none>
##$CNST= (0..31)
1 1 145 1 1 1 1 1 1 1 1 1 1 1 1 1 1 1 1 1 1 1 1 1 1 1 1 1 1 1 1 1 
##$CPDPRG= <>
##$CPDPRG1= <>
##$CPDPRG2= <>
##$CPDPRG3= <>
##$CPDPRG4= <mlev>
##$CPDPRG5= <mlev>
##$CPDPRG6= <mlev>
##$CPDPRG7= <mlev>
##$CPDPRG8= <mlev>
##$CPDPRGB= <>
##$CPDPRGT= <>
##$D= (0..31)
0 1.2 0 0 0 0 0 0 0 0.06 0 0.03 0 0 0 0 0.0002 0 0 0 0 0 0 0 0 0 0 0 0 
0 0 0 
##$DATE= 1671705838
##$DBL= (0..7)
120 120 120 120 120 120 120 120 
##$DBP= (0..7)
150 150 150 150 150 150 150 150 
##$DBP07= 0
##$DBPNAM0= <>
##$DBPNAM1= <>
##$DBPNAM2= <>
##$DBPNAM3= <>
##$DBPNAM4= <>
##$DBPNAM5= <>
##$DBPNAM6= <>
##$DBPNAM7= <>
##$DBPOAL= (0..7)
0.5 0.5 0.5 0.5 0.5 0.5 0.5 0.5 
##$DBPOFFS= (0..7)
0 0 0 0 0 0 0 0 
##$DE= 6
##$DECBNUC= <off>
##$DECIM= 32
##$DECNUC= <off>
##$DECSTAT= 4
##$DIGMOD= 1
##$DIGTYP= 9
##$DL= (0..7)
0 120 120 120 120 120 120 120 
##$DP= (0..7)
150 150 150 150 150 150 150 150 
##$DP07= 0
##$DPNAME0= <>
##$DPNAME1= <>
##$DPNAME2= <>
##$DPNAME3= <>
##$DPNAME4= <>
##$DPNAME5= <>
##$DPNAME6= <>
##$DPNAME7= <>
##$DPOAL= (0..7)
0.5 0.5 0.5 0.5 0.5 0.5 0.5 0.5 
##$DPOFFS= (0..7)
0 0 0 0 0 0 0 0 
##$DQDMODE= 0
##$DR= 18
##$DS= 0
##$DSLIST= <SSSSSSSSSSSSSSS>
$$ [...]
##$SUBNAM2= <"">
##$SUBNAM3= <"">
##$SUBNAM4= <"">
##$SUBNAM5= <"">
##$SUBNAM6= <"">
##$SUBNAM7= <"">
##$SUBNAM8= <"">
##$SUBNAM9= <"">
##$SW= 18.05172834244
##$SWIBOX= (0..15)
0 0 2 0 0 0 0 0 0 0 0 0 0 0 0 0 
##$SW_h= 3612.71676300578
##$TD= 16384
##$TD0= 1
##$TE= 0
##$TE2= 300
##$TE3= 300
##$TEG= 300
##$TL= (0..7)
0 120 120 120 120 120 120 120 
##$TP= (0..7)
150 150 150 150 150 150 150 150 
##$TP07= 0
##$TPNAME0= <>
##$TPNAME1= <>
##$TPNAME2= <>
##$TPNAME3= <>
##$TPNAME4= <>
##$TPNAME5= <>
##$TPNAME6= <>
##$TPNAME7= <>
##$TPOAL= (0..7)
0.5 0.5 0.5 0.5 0.5 0.5 0.5 0.5 
##$TPOFFS= (0..7)
0 0 0 0 0 0 0 0 
##$TUNHIN= 0
##$TUNHOUT= 0
##$TUNXOUT= 0
##$USERA1= <user>
##$USERA2= <user>
##$USERA3= <user>
##$USERA4= <user>
##$USERA5= <user>
##$V9= 5
##$VALIST= <valist>
##$VCLIST= <CCCCCCCCCCCCCCC>
##$VD= 0
##$VDLIST= <DDDDDDDDDDDDDDD>
##$VPLIST= <PPPPPPPPPPPPPPP>
##$VTLIST= <TTTTTTTTTTTTTTT>
##$WBST= 1024
##$WBSW= 4
##$XGAIN= (0..3)
0 0 0 0 
##$XL= 0
##$YL= 0
##$YMAX_a= 970727
##$YMIN_a= -866384
##$ZGOPTNS= <>
##$ZL1= 120
##$ZL2= 120
##$ZL3= 120
##$ZL4= 120
##$ABSF1= 10
##$ABSF2= 0
##$ABSG= 5
##$ABSL= 3
##$ALPHA= 0
##$AQORDER= 0
##$ASSFAC= 0
##$ASSFACI= 0
##$ASSFACX= 0
##$ASSWID= 0
##$AUNMP= <proc_1d>
##$AZFE= 0.1
##$AZFW= 0.1
##$BCFW= 1
##$BC_mod= 2
##$BYTORDP= 1
##$COROFFS= 0
##$CY= 11.3945322036743
##$DATMOD= 1
##$DC= 2
##$DFILT= <>
##$DTYPP= 0
##$F1P= 2.36226072786647
##$F2P= -0.459571619588291
##$FCOR= 0.5
##$FTSIZE= 0
##$FT_mod= 4
##$GAMMA= 1
##$GB= 0.15
##$INTBC= 1
##$INTSCL= 1
##$ISEN= 128
##$LB= 0.24
##$LEV0= 0
##$LPBIN= 0
##$MAXI= 10000
##$MC2= 0
##$MEAN= 0
##$ME_mod= 0
##$MI= 1.114404
##$NCOEF= 0
##$NC_proc= 0
##$NLEV= 6
##$NOISF1= 3.799351
##$NOISF2= 2.8
##$NSP= 1
##$NTH_PI= 0
##$NZP= 0
##$OFFSET= 15.70392
##$PC= 1
##$PHC0= -19262.25
##$PHC1= 10.80073
##$PH_mod= 1
##$PKNL= yes
##$PPARMOD= 0
##$PSCAL= 0
##$PSIGN= 0
##$REVERSE= no
##$SF= 200.130013532006
##$SI= 16384
##$SIGF1= 3
##$SIGF2= 2
##$SINO= 400
##$SIOLD= 16384
##$SREGLST= <1H.CDCl3>
##$SSB= 0
##$STSI= 0
##$STSR= 0
##$SW_p= 3612.71676300578
##$SYMM= 0
##$S_DEV= 0
##$TDeff= 0
##$TDoff= 0
##$TI= <>
##$TILT= no
##$TM1= 0
##$TM2= 0
##$TOPLEV= 0
##$USERP1= <user>
##$USERP2= <user>
##$USERP3= <user>
##$USERP4= <user>
##$USERP5= <user>
##$WDW= 1
##$XDIM= 8192
##$YMAX_p= 0
##$YMIN_p= 0
$$ End of Bruker specific parameters
$$ ---------------------------------
##NTUPLES= NMR FID
##VAR_NAME=  TIME,          FID/REAL,        FID/IMAG
##SYMBOL=    X,             R,               I
##VAR_TYPE=  INDEPENDENT,   DEPENDENT,       DEPENDENT
##VAR_FORM=  AFFN,          ASDF,            ASDF
##VAR_DIM=   8192,          8192,            8192
##UNITS=     SECONDS,       ARBITRARY UNITS, ARBITRARY UNITS
##FACTOR=    0.0002768,     1,               1
##FIRST=     0,             0,               0
##LAST=      2.2672688,     0,               0
##MIN=       0,             -866384,         0
##MAX=       2.2672688,     970727,          0
$$ Real data points
##PAGE= N=1
##DATA TABLE= (X++(R..R)), XYDATA
$$ [...]
1071a166J2986j9160r94K2072j2708j5476K1807J700k0999J2138R899j8153M876
1084c178J3969j6182k908J9998j0568j4771K0639K323k1800J1252J2936j8113
1096f403Q50J5160j2072n112J6791p689j3365J8318K844k1498R933J4942j7507
1109d808k881J6138q179p681J3834m147j2479J4937M130j9823P758J5500j6161
1122c862m957J6791n667j0526J2321K91j2713J0413O280j6936N072J5146j4816
1135c163o315J7898m300j3709J1847M700j3763N983Q574j4054K468J4357j3565
1148c042p002J8712l378j6247J1591Q039j4604K966J0541j1870l26J4034j1308
1161a894p770J7726k411j6453J1272R259j5434J098J2876j0618l562J3788p965
$$ y = [-1166, 11820, -7340, -8334, 13738, 1030, -14446, 7361, 9061, -11938, 200, 10099, -8054, -3178, 10791, -5391, -8299, 11699, 1131, -13640, 6999, 9322, -12478, -1226, 11710, -6403, -5553, 9607, -2465, -7577, 9214, 1525, -11840, 6478, 9322, -12176, -2243, 12699, -4808, -7689, 8449, 270, -7411, 6423, 2276, -10203, 4734, 8864, -10959, -3201, 12299, -3862, -8819, 7972, 2305, -8221, 4100, 4391, -8322, 2091, 8371, -8565, -3493, 11653, -3163, -9478, 8420, 4120, -9589, 2258, 6958, -6805, -822, 7752, -6302, -3834, 10523, -3042, -10044, 8668, 5290, -10957, 634, 8673, -5931, -2965, 7576, -4294, -4620, 9414, -1894, -9664, 8062, 5651, -10802, 470, 9729, -5705, -4607, 8269, -2349, -5911, 7877, -88]
1174h8q744J5357j269j5443J0642R353j5932K28J4834r523o904J3459m230r433
1188g693J2481m3j3915R618R252j5508q37J5765q114r333J3095j247j0479J0001
1202C043J997j2681P388R320j3966j874J5449p042j0569J2835J007j1981Q017
1215I43M908j1778M153R498j1233k830J4092n791j1211J2769L047j3679O097P839
1229F824j0812Q85R790q562m152J2823m273j1590J2022M471j4543M652J0061j0477
1243b881j690J0617o578n814J1843k404j1753J0741N578j4610L850J1226j0506
1256b381l313J1764n065p536J0725l43j1388Q974O001j3879L198J1702j0476m458
1270f475J2381l901q839R733J540j1050O973O449j2378K091J1428r661n052J2274
$$ y = [-88, -8832, 6525, 5256, -10187, 455, 9808, -6124, -5896, 8938, -585, -7489, 5970, 1740, -7693, 4788, 4745, -9170, 448, 9700, -5808, -6645, 9120, 1006, -8327, 4768, 3521, -6958, 3043, 5040, -7641, -253, 9067, -4899, -6773, 8676, 1634, -8935, 3900, 4907, -7074, 943, 5851, -5927, -1774, 7724, -3509, -6339, 7753, 1962, -9249, 3520, 6567, -7112, -1015, 6824, -3988, -3103, 6687, -1875, -6027, 6796, 2523, -9067, 2955, 7426, -7117, -2465, 7596, -2881, -4571, 6046, -532, -6346, 5497, 3093, -8660, 2081, 7659, -6951, -3101, 8125, -2381, -5694, 6070, 1005, -6531, 4194, 3851, -7537, 1437, 7438, -6441, -3243, 8459, -2017, -6475, 5906, 2005, -6834, 2899, 4439, -6611, 362, 6811, -5567, -3476, 7952, -1709, -6761, 5513]
1284E513k812r473Q711L033j0580M962P116j0699N63J0818q075n365J1287j844
1298C155r720P706M329j0203K913P920q995j253J0186o252n973J0263p61r542
1312f227O640N233r847J411Q741p630l013R889m353o674Q990O77r339N287N955
1327E740r168N9R205o451m657R635k376p595P659K047q998L978O391q167j293
1342c991R336n179n691R088q68q133O542L282q465K440O878p098k277R007l912
1357I59o373Q400L85q512N547M415q268J043P403n944l385Q333k562o743P561
1372B259J398q626M553N316p799p0P508m753m300P825j160p122O488K462q259
1387d280L276N982p109j197P625l632n219P145K92p471N049L837p834J850O294
$$ y = [5513, 2701, -6772, 1939, 4972, -5608, -646, 6470, -4229, -3666, 7152, -923, -6288, 4999, 3155, -6565, 1141, 5470, -4733, -1820, 6100, -2895, -4148, 6038, -214, -6187, 4076, 3315, -6227, 413, 5646, -4201, -2790, 5951, -1679, -4692, 5197, 844, -5830, 3160, 3837, -5502, -215, 5740, -3428, -3369, 5836, -615, -5272, 4363, 1987, -5608, 2051, 4098, -4900, -922, 5469, -2698, -3991, 5345, 166, -5525, 3563, 2695, -5438, 1104, 4386, -4079, -1639, 5239, -1859, -4136, 4871, 959, -5414, 2986, 3371, -5141, 406, 4821, -3447, -2404, 4999, -945, -4330, 4003, 1441, -5302, 2259, 3657, -4969, -416, 4900, -2899, -2969, 4539, -214, -4514, 3311, 2151, -4971, 1517, 3979, -4280, -1004, 4978, -2131, -3328, 4297, 665, -4554, 2591, 2883, -4588, 461, 4298, -3536, -1686, 4608]
1402D608o165k127P493k650n982O569J713p760L800M875p226N54O719n292k994
1417c865P296j669o428N987K744q037K805N906o947o50P098m459l824P123r27
1432B153o729N375L307p817K012O417o510j677P431l590m557O580K7o609M558
1447C71L894p560J229O850o043k461P542k761n275O094R69o510L466M239o716
1462b672L94O766n262l200P341j916n662N472J803o501K661M706o004n37O565
1477C954m285l620O932j157n781M881K371o290J726N097n095j628O386l066m146
1492c721O063l09n836M266K970o100Q09N546m360k598O061j856m599N334O31n680
1508c379L420L378n682J63N711l728l322N934p99n161M572J492n478K474L648
$$ y = [4608, -1557, -3684, 3809, 1159, -4823, 1746, 3459, -4301, -501, 4374, -2852, -2298, 4421, -871, -3865, 3431, 1762, -4666, 1321, 4065, -3972, -1167, 4739, -2208, -2858, 4240, -219, -4043, 3080, 2153, -4576, 799, 4106, -3711, -1699, 4718, -1792, -3469, 3962, 372, -4185, 2395, 2422, -4187, 371, 4265, -3295, -2066, 4784, -1259, -3720, 3822, 1061, -4214, 1880, 2849, -3661, -195, 4044, -2672, -2278, 4488, -774, -3974, 3367, 1451, -4211, 1261, 3064, -3437, -776, 3930, -2074, -2611, 3954, -331, -3951, 2981, 1824, -3957, 924, 3295, -2995, -1269, 3828, -1267, -2895, 3491, 425, -3721, 2342, 2033, -3803, 463, 3433, -2667, -1858, 3688, -672, -3270, 2791, 935, -3664, 1670, 2301, -3379, 41, 3419, -2263, -2100, 3611, -117, -3439, 2495, 1696, -3465, 1107, 2599, -2879, -405, 3243]
1523C243m969m16N451l181l699N761j00n637L944K482n352J520L894m289q35N106
1539B923k630l773N441L70n809L504L152n165N93M152l439j446M573j902l743
1554c199M822P41n575K855L687n041j58M513k739k244M127q95l730L953J118n173
1570b938K372L907m845p81M891k148l002L769J98l714K743J792m647J733L918
1585C248m535j178N095j698l675L489J165l881J732K424m004Q29L824l922j349
1600b436M988j576l964L562J772m241J005L164l353j86L780l176j590M679j324
1615A104m145L624K081m551O35L715l008j185L706k158j943M118j021l851L378
1630D99K173m637K94M316k843k000L836j151k483L356l18l507K931K031m336J52
$$ y = [3243, -1726, -2142, 3309, 128, -3571, 2190, 2090, -3547, 397, 2879, -2473, -953, 2941, -1348, -2183, 2923, 293, -3480, 1961, 2331, -3478, 26, 3178, -1987, -1394, 2758, -681, -2127, 2446, 544, -3199, 1623, 2364, -3211, -356, 3331, -1710, -1868, 2645, -94, -2338, 1789, 894, -2836, 1117, 2235, -2938, -566, 3341, -1504, -2285, 2606, 458, -2544, 1225, 1423, -2291, 452, 2244, -2403, -670, 3248, -1287, -2465, 2630, 932, -2743, 746, 1911, -1970, -238, 2186, -1818, -989, 2835, -1087, -2436, 2552, 976, -2988, 574, 2346, -1895, -890, 2274, -1079, -1265, 2515, -661, -2251, 2428, 1104, -3041, 583, 2664, -1887, -1252, 2463, -545, -1730, 1976, -182, -2125, 1993, 972, -2879, 499, 2672, -1965, -1671, 2645, -198, -2198, 1638, 487, -1996, 1360, 1042, -2465, 466, 2497, -1839, -1687]
1646a687M514k675k684L986l02l050K562N32l120K088K032l862nM406k566k983
1662b814M072L47l677K210J381l051J310K073l056k86L932k129l111M165N51m164
1678b247J966K244k984K73K432k300p33L345j670k923L819Q13m374J760K937l267
1694i09l98K799j614j327K942j090k691L411Q59m339J763L157l365p49L204j277
1710C76j902K610l94k603K679J062m015J619L097l446r44L590j174k325K454L40
1726A024k660J957J241l410J322K851l296q11L595j040k637K300Q89k674J294
1741e5J511k796P65K724k879r95L449r89k701K334J199k839P49J983k290j6K475
1758A629k143j050L017p13k668K168J477k857K93K466k033o87K478j440j357K671
$$ y = [-1687, 2827, 152, -2532, 1454, 1152, -1898, 664, 1196, -1924, 164, 2196, -1666, -1671, 2735, 169, -2814, 1258, 1605, -2072, 138, 1519, -1532, -222, 1851, -1205, -1491, 2441, 312, -2799, 1366, 1917, -2247, -281, 1963, -1021, -748, 1684, -616, -1349, 1996, 326, -2597, 1222, 2035, -2339, -579, 2358, -909, -1307, 1492, -122, -1449, 1493, 403, -2288, 1123, 1982, -2357, -594, 2563, -802, -1551, 1653, 376, -1526, 1084, 690, -1913, 766, 1828, -2187, -568, 2529, -917, -1861, 1729, 555, -1770, 684, 1024, -1636, 321, 1562, -1848, -526, 2325, -971, -1782, 1813, 773, -1864, 436, 1325, -1349, -55, 1456, -1340, -575, 2149, -730, -1725, 1724, 735, -1966, 368, 1567, -1272, -523, 1460, -830, -846, 1629, -514, -1564, 1453, 740, -1928, 240, 1717, -1140, -847, 1619, -414, -1101, 1377, -63, -1420, 1251]
1774A251m59k463J888J489k794Q6K710j843j255K548q48j726K162J00k364J489
1790b9J600k575j67K861j653j698K702l15k136J920N49k336J148J686k360l42
1806a145K829j526j820K704j18k426J738R84k304O61J799j947n58K549j238j876
1822a694K611Q1k564J572J321k362M17J963j677q50K447q85j951K386K28k507
1838a464J414J481k253M2K063j353j147K230m71k023K012N26k457J203J559k119
1854g57j53K136j208j298K037pk160J671Q64k257Q69J554j874l67K090r54j485
1871a299J933K66k143J310J137k087M38J689j721m81J960p47j549J745N14k155
1887a190R72J447k017J19J847j393o94J767n17j513J573N88k081Q16J659j938
$$ y = [1251, 792, -1671, 217, 1706, -1088, -1002, 1708, -135, -1390, 1158, 310, -1416, 746, 846, -1518, -29, 1571, -1004, -1171, 1690, 37, -1661, 1041, 726, -1410, 510, 1059, -1277, -129, 1557, -803, -1145, 1684, 158, -1662, 1042, 924, -1502, 236, 1220, -1084, -423, 1376, -571, -1129, 1420, 182, -1694, 917, 998, -1566, 6, 1327, -1035, -618, 1345, -332, -1182, 1265, 380, -1571, 815, 1043, -1464, -50, 1431, -822, -780, 1283, -70, -1217, 1013, 542, -1481, 531, 1057, -1400, -197, 1362, -757, -910, 1226, 18, -1280, 757, 750, -1410, 261, 1125, -1132, -263, 1291, -583, -950, 1140, 186, -1299, 634, 900, -1243, 67, 1204, -883, -445, 1244, -477, -958, 1002, 255, -1294, 451, 965, -1190, -218, 1229, -788, -669, 1178, -215, -909, 858, 341, -1172, 401, 989, -1092, -276, 1383, -555]
1903e55j81J863j101r42J531j26j500J231P73j948N33J716j751n13K024q54j268
1920a068J560L0j402Q97Q95j699K76J741j579n90J934o97j317J430K97j496O23
1937a65J099j505J9J598j286p27J872n12j505J391N49j603M82J184j244k91J579
1954I35r51r93J753l71j432J270P41j643K39J437j172n90J589o31j168J610j21
1971E02j491J169P45j633J98J474j070q51J707m53j294J411Q6j448R98Q27j455
1988e78Q1J453r92r15J679k87j409J321L52j498P68Q85j363%J410r22r00J524
2006F09n8j535J167O21j574O07R94j231j76J340o98r80J429N0j504J013P06j477
2024f97L97J191j113k90J153m58r65J211J71j421Q19Q73j467J69J238r25n58J186
$$ y = [-555, -736, 1127, 26, -916, 615, 489, -1011, 220, 993, -955, -422, 1294, -457, -970, 1054, 200, -1068, 492, 522, -880, 17, 912, -787, -511, 1230, -349, -939, 995, 298, -1019, 411, 708, -788, -165, 934, -571, -552, 1046, -240, -967, 905, 393, -1112, 279, 828, -775, -293, 891, -353, -644, 935, -16, -1009, 744, 373, -1059, 211, 952, -691, -452, 985, -187, -777, 812, 181, -987, 623, 502, -989, 180, 925, -708, -510, 964, -106, -957, 750, 297, -997, 414, 500, -948, 50, 877, -578, -497, 956, -36, -951, 728, 441, -968, 353, 705, -793, -25, 860, -503, -503, 907, -15, -915, 609, 551, -984, 183, 804, -770, -163, 831, -400, -576, 764, 66, -914, 515, 565, -939, 74, 780, -697, -300, 891, -222, -512, 641, 183, -782, 429, 600, -821, -2, 871, -596, -427, 811, -114, -672, 514]
2042E14j94j058R66L91j367O54R90j430OJ323q10p32J171j2j095P79N75j258M33
2061a54R88j212j61J374p38q19J095J54j203N93Q50j216M0J073r05k87J171o25
2079A8q02J113K84j372N44R81j084j88J214p80m75J139l71r14J040K38j224M71
2097a68J003j064l61J183m85p15J012j40q62Q25K91j135L39J088j103m09J364
2114F63m37j013J041J14r06O58L84r85K95R60j006m69J373l59j098R99K74r33
2132d45M36M59q37J32Q98q04n43J360l20j228J004M74j047K52P00o36j78Q12n54
2151f5o08J210j77j161R77N84j191J14Q70n35m42Q23l40o04J023j34j068Q15O29
2170G20j225L3J147o24n61Q12p7p35P77K6r52P41N75j198J25J136o47p52R53J50
$$ y = [514, 320, -738, 228, 619, -748, -94, 896, -534, -528, 795, -15, -747, 424, 412, -683, 96, 671, -587, -154, 834, -378, -539, 835, 97, -722, 373, 527, -676, -83, 767, -449, -409, 664, -241, -528, 643, 18, -784, 329, 613, -759, -215, 766, -318, -506, 708, -72, -547, 592, 221, -693, 347, 585, -639, -168, 835, -229, -590, 593, 108, -607, 405, 265, -597, 228, 519, -616, -277, 811, -292, -701, 663, 226, -787, 254, 368, -538, 120, 504, -481, -186, 774, -232, -701, 672, 313, -785, 214, 488, -445, -9, 450, -387, -255, 643, -161, -704, 656, 336, -892, 112, 586, -461, -209, 491, -145, -323, 489, -65, -673, 537, 360, -801, 176, 760, -431, -317, 553, 18, -424, 399, 59, -545, 478, 344, -724, 91, 720, -505, -472, 675, 51, -510, 302, 225, -510, 267, 293, -659, 82, 657, -541, -416, 720, 73, -679, 274, 424]
2190D24q97N61L54r34N19O03j063J8J069o05p43R32K49r76M00O01q79K76N90q81
2210c82M1R52o15o77R75K32j076M16P21q10j7O96n61j80P96n54n78R39J96j010
2230d96K55Q50q14j61P64m77k91P19l71m43O70K24r34K96Q28p62l52R24l37m76
2250c84O43q3n40N43K43q63K89P62p39l82J030k82o66O15P2n75L58K55o57J46
2270b15P35o74l88R91j98p71O07K29o04K28M00n89N1O52n68l40Q82j41p94N89
2290H2L44p05P8N32l90k04O17l37m96Q47j21p85N96L34p57P9O49l74l48O33j70
2311A04m48N99No76N06M10p82K5O76m12m25O63o8n32M63J99p16L30N19o96m9P06
2333D01m00m56O21J37p86M74M01p45K08N72n92j31P21l67m69O56L9o44L16M41
$$ y = [424, -473, 88, 442, -492, 27, 630, -433, -415, 654, 49, -694, 238, 487, -489, -89, 512, -367, -91, 499, -382, -341, 611, -4, -681, 294, 526, -550, -134, 587, -223, -240, 456, -105, -285, 511, -43, -621, 318, 514, -496, -241, 609, -205, -366, 398, -79, -370, 349, -22, -465, 205, 429, -505, -209, 619, -143, -495, 429, 92, -384, 259, 176, -364, 179, 422, -441, -152, 610, -129, -511, 519, 237, -429, 186, 258, -317, 41, 296, -361, -215, 520, -154, -542, 449, 251, -520, 87, 316, -288, -60, 340, -249, -198, 454, -114, -454, 428, 287, -507, 82, 426, -279, -201, 331, -59, -263, 354, 17, -479, 368, 247, -538, 58, 392, -365, -286, 363, -11, -359, 274, 104, -344, 255, 260, -416, 90, 500, -282, -257, 419, 7, -418, 245, 177, -355, 108, 307, -409, -79, 440, -256, -305, 401, 1, -455, 166, 303, -483, -9, 392, -353, -145, 427, -165, -296, 425, 58, -411, 245, 284, -360, -44, 397]
2353C97o79P2O19n39j87O71k89n28O59J56p66L75M65p17LO71m44l43P05j45n07
2374c51M35K40p35L65N48p09j07P83m75l34O45j43n11L93L01o89K17N47n66j74
2394c20P48m13l86N73K0n59L46L20o11J45N52n81j32P70m20m27N80Q0n65K00M07
2415C27n60ON83m04k59O44k43m69N65J00o08K22N06n21j71N96l36l52O56j74n01
2436c93N04K07n99J52N34n42j84O88k94m39N75j0n48M47J62n08R8N04m18k93O08
2457B51j05n09M70J11n99M50J92n09N1N06l83k57O03q5n45L87K37n21K25L53n01
2478a78K0M45l29k86N93n8o17M63K50n69J42L80l97l7M18k32l37M86J0n08L44
2499CL53n81L4N12m04j98M85q2l84M16N9n59L54L92o02L3N06l25k65M08j8l91
$$ y = [397, -282, -210, 409, -130, -317, 354, 65, -463, 196, 352, -414, -39, 426, -291, -288, 383, -61, -404, 301, 156, -351, 84, 324, -411, -46, 502, -207, -314, 469, -6, -340, 305, 162, -349, 44, 345, -344, -127, 420, -146, -320, 428, 15, -371, 202, 222, -337, 9, 329, -282, -137, 415, -166, -298, 472, 52, -375, 205, 285, -280, -80, 327, -233, -227, 356, -48, -307, 337, 94, -375, 190, 290, -318, -96, 410, -111, -282, 314, -22, -374, 282, 108, -393, 111, 318, -281, -129, 405, -137, -321, 367, 73, -366, 209, 199, -349, 98, 260, -248, -150, 354, -64, -357, 251, 146, -363, 107, 218, -381, 69, 261, -248, -197, 309, -74, -331, 272, 187, -358, 29, 266, -255, -30, 323, -178, -158, 287, -42, -328, 265, 207, -410, 53, 303, -266, -124, 256, -141, -178, 240, 8, -329, 157, 167, -341, 3, 356, -225, -191, 321, -83, -281, 204, 122, -262, 154, 213, -346, 8, 400, -202, -169, 337, 12, -253, 155, 137, -254]
2521b54L12J77n05J70M27m98j34N90k18l77M18K2l76K36L47m62mM45m04j39N03
2542B76k80k98M72M3m55J91L86n39O8M61l95j65M84k15l52M67P7n62K28M58n21
2563a71q8N85l63k27M67q5m05K87K51m56J80L40m17o6M90k69l73M60jm23L43J75
2585B34m29O8M09l60j64M78j95l35M05O2m04K06K69m30M3L56k63j85M83j24m07
2606b83M42J46n62K21K80l79J7L70k85j80L62p7l78L95J36n00J45M28m01j01M08
2627B04j42k55L14o2l37L66J24m69J45L95l46j41L87p4l04K67R0l68K54J80m93
2648b65J57L81k86k13M11o7m05L32J68l99P5L04l17K2L14k50j77L37L7l71J88
2669b4K75l92N2K67k60o7M04k45k28M10n9l45K33K81m60j6L66k79j3K43j29j92
$$ y = [-254, 58, 235, -270, -100, 327, -171, -305, 285, 67, -310, 108, 130, -246, -10, 337, -125, -129, 316, -88, -227, 276, -4, -302, 170, 213, -242, -51, 335, -204, -136, 325, -70, -235, 249, 34, -318, 149, 226, -336, -108, 350, -171, -259, 326, -37, -264, 203, 118, -287, 0, 251, -205, -25, 315, -102, -168, 322, 53, -320, 140, 139, -284, 59, 234, -195, -127, 282, -78, -242, 236, 41, -294, 111, 173, -231, -25, 244, -186, -143, 213, -50, -235, 248, 124, -283, 159, 305, -257, -36, 244, -135, -118, 252, -33, -213, 149, 72, -306, 89, 225, -275, -130, 298, -103, -204, 204, 62, -193, 121, 59, -278, 88, 212, -257, -112, 283, -63, -204, 183, 109, -195, 72, 162, -206, 48, 228, -265, -108, 273, -13, -226, 185, 118, -287, 45, 213, -186, -111, 193, -124, -102, 212, -38, -215, 122, 159, -212, -24, 251, -141, -89, 178, -82, -149, 255, 10, -218, 192, 133, -212, 21, 302, -158, -174, 192, -87, -100, 143, 14, -178]
2691a78L29jl83J42M01m49q3M55j92k25L24k9k81K82J4l47K38K99m29q9M10j54
2713E4k90L23Ok37J38J72l54R7L44l03j15M35j94l21L69O6l67R9K25k58L9K70
2735A98l32j20M64j50l49L46J20l38J39J62k94M1K83k05j85M15q8l75L00J74l64
2756a58O8L51k90j45L15j53j86L92r3l13L06J83m91J25L36k25k15L48p0k63L16
2777A38o3k68K52J15l86O9L69k40j94K91M6l11K15N9k68J44K18l20P2K89k05j99
2799a77K91J6l30J72K33l63J26J88k59RK76j72k53L63L0l44J49K56l13jK63k36
2821g6j3K22q5k37K58M3l17J39K88l65K9K95k45p9K49n9j96K57J8k88R4K79l53
2844a42mL14j82j26K45n5k10J98R6k79P5K69l26n2L64j67k01K71k4k55J65K23
$$ y = [-178, 151, 150, -233, -91, 310, -139, -222, 233, 41, -184, 140, 111, -170, 112, 126, -221, 17, 316, -113, -202, 208, 54, -236, 87, 93, -144, -6, 166, -188, -91, 253, -50, -165, 270, 76, -245, 124, 190, -177, -78, 147, -111, -72, 198, -134, -254, 210, 60, -289, 57, 177, -161, -22, 140, -154, -113, 170, -35, -220, 195, 107, -268, 32, 206, -158, -90, 261, -29, -174, 141, -12, -198, 194, 101, -212, 94, 277, -214, -89, 247, 22, -193, 155, 85, -178, 138, 75, -193, 59, 174, -212, -143, 226, -14, -208, 83, 129, -182, 33, 92, -176, -32, 186, -134, -62, 227, 22, -177, 114, 130, -200, -28, 205, -158, -32, 156, -103, -94, 182, 10, -243, 120, 150, -194, -45, 211, -102, -103, 160, -76, -89, 133, 48, -189, 69, 112, -205, -66, 222, -143, -114, 181, -64, -143, 106, 47, -149, 108, 126, -162, -68, 211, -142, -146, 168, -14, -140, 105, 50, -160, 38, 134, -145, -70, 199, -127, -179, 185, 18, -183, 88, 64, -191, -26, 197]
2866A97l15M3K31j73j48L69j82k41K73J03l39J01K43k41J1J98j63j17K92j45k18
2887b21K94P9k88J05J80k32j1K97j61j72K56J9l17K31O2k46Q3K60l07n3L14j84
2909a2j44K06lj76J01J72k98J38K12k30j19L35j23k22J59J36k65J61J20k30K4
2930e8K49j86j28K61j56j61K11J00k53J16J07j92oJ79r8j16K09mk51J58K02l42
2952a59J14K06j66j78L30j24k04K90n9k05J60J75k85P0K61k47j08K72j00k19K37
2973F1l4j42J17J42k25K2K37j98j12J82k8j59J46J82k93O5J72j78l9K41j53r4
2995h8J88l5k09N4K00j53k3J39j32o0K56j09k05J84P3k15J41J12j98j2J71j03
3017b4j23K71q2j66J79J28k64J5K18j86o5K49j47j18J71K4j51J13N7j56k1K09
$$ y = [197, -118, -75, 156, -17, -165, 204, 22, -219, 54, 157, -182, -81, 162, -79, -68, 130, -33, -150, 142, -3, -221, 73, 152, -136, -31, 149, -83, -94, 203, 42, -130, 126, 145, -172, 59, 121, -125, -42, 218, -89, -142, 172, -12, -156, 50, 47, -129, -28, 144, -154, -16, 196, -34, -153, 182, 59, -163, -4, 132, -133, 28, 148, -82, -58, 191, 5, -123, 138, -18, -179, 32, 132, -121, -5, 102, -90, -96, 83, -15, -131, 78, 74, -177, -19, 183, -159, -45, 161, -5, -183, 147, 23, -181, 109, 50, -155, 5, 180, -105, -35, 226, -21, -129, 143, 43, -176, 61, 27, -115, 2, 144, -81, -59, 178, -20, -132, 50, 22, -137, 9, 191, -102, -37, 135, -43, -82, 159, 6, -88, 100, 65, -144, -90, 110, -43, -66, 73, -59, -119, 137, 28, -177, 7, 80, -135, 6, 118, -80, -92, 79, -24, -147, 124, 42, -124, 55, 183, -81, -66, 152, -34, -99, 150, 3, -115, 56, 80, -71, 42, 99, -57, -78, 131]
3039A31j88j30L22j76m9J25N2k38K13J09k77M3J82j69m9J92mk07J89l9j33J13
3061A2N0j90N4K08j32j55K72l8k25J98Q1k31N9J45j62k9J86m1j77J80L7j84J41
3084E9M5j87J12M8q0o0K04j51r7J43N9k40J68J19k30M3J74j88p9J98m2j14P8Q0
3108F2j35Q2J44k35R6O5j6j59J99k8j33J06N7j88M0J76k07K3J76q2j65J69lj72
3132a28J62M8j76M5J86j00r8J54q3j01J73J4j70O7Q3q6n4J74j15j01J95n2j43
3155a06J44M9j59P0J00j57qJ30q3p0K17j49q9J43k5p8K2J30j33k0K03j97q6K03
3179E1L4j74J12%p4kJ77j60l1J46q0j39K21Qj96J05Q4q6q0J69o5q1J07l2j42J93
3205F5jr7PJ18q3l8P2Pj23J15l6j21J32P0j91L4J50j05j03J77jj50J06N1j46J10
$$ y = [131, -57, -187, 135, -41, -90, 35, 87, -151, 62, 171, -106, -63, 119, -50, -99, 93, 89, -118, 71, 32, -101, 12, 62, -128, -74, 134, 2, -153, 119, 81, -144, 54, 135, -96, -37, 108, -54, -83, 103, 62, -115, 65, 102, -82, 59, 104, -83, 29, 77, -3, -63, 141, -10, -107, 36, 95, -145, 23, 142, -88, -45, 129, -59, -138, 60, 18, -96, -18, 62, -73, 9, 153, -82, 14, 79, 63, -96, 103, 75, -58, 48, 105, -83, -43, 133, -74, -51, 125, 43, -122, 47, 44, -128, 34, 82, -94, -49, 137, 37, -61, 93, 10, -91, 82, 96, -74, -7, 76, -10, -64, 110, -5, -106, 89, 37, -106, 38, 87, -72, -2, 98, -59, -67, 63, -20, -90, 127, -22, -111, 32, 7, -71, -49, 81, -52, -72, 131, -66, -152, 51, 85, -89, 23, 23, -51, -53, 124, -36, -67, 79, -1, -140, 81, 89, -107, -2, 82, -4, -84, 85, 20, -61, 46, 14, -128, 65, 64, -33, -26, 92, 9, -29, 43, 50, -73, 42, 6, -115, 17, 87, -104, -70, 80, -25, -128, 49, 48, -102, 4, 55, -91, 19]
3231A9P7j70R2L2l6j17J91m2j04O7J4p3M7J2q2N8Q8q4o4J82l5j16L0J49j75j6
3257e6J29r1l7J30j02p0J41j6j47R9P8j31J9J09j17M8R0o8m4J06L8j40J8R2j31
3282e3MJ63j21q8J28Oo2J10n9r1N4R1j34l3K19j32r3J37j4j01J12j0q4M4J06j73
3308g4L7J35q0j17J10R0j32M0K5p8j9K09j74j21K12j8j18Q1n5l5Q9N6j04J2Q4
3333E5k3r2J38q6r1J06L7j15J4J03p7nM4n8q2K17m9j40J31l0m6M4P9j09l6J40
3359F9r5l6J14m0p8Q8K7j19R7M2p2n6J26k1j56J18K0r5J01j6k1k9M5j8m2J17n7
3386A3r5R2L3j28P0N5p3k6L9nm2O4N4j05Q2K0p0m9J39q3oP6m1q9O6O4q6PR7r0
3416a7NR8j14JM4p3J0N8M9r4J7N8j25O2R9j42QJ00m4o1J11Pj15J3K7q1L4J08k7
$$ y = [19, 96, -74, 18, 50, 14, -103, 88, 46, -58, 9, 23, -50, -3, 9, -73, -15, 73, -11, -75, 107, 72, -44, -14, 135, -40, -56, 73, -18, -55, 75, -27, -97, 44, 28, -119, -20, 58, -73, -54, 55, -62, -14, 76, 8, -36, 70, 108, -32, -14, 78, -53, -49, 114, -7, -95, 33, 39, -23, 87, 28, -63, -9, 82, -52, -85, 134, 2, -91, 46, 32, -69, 43, 33, -51, -7, 99, -74, -37, 98, 18, -99, 11, 101, -31, 9, 34, -44, -63, 146, -28, -149, 63, 45, -73, 8, -47, -82, 7, 63, -41, -29, 55, 32, -60, 78, -8, -99, 7, 44, -71, -57, 46, -31, -36, 8, -50, -132, 85, 36, -104, 27, -3, -49, -5, 74, -35, -71, 69, -26, -62, 52, 12, -66, 22, 49, -70, 27, 69, -3, -59, 67, 46, -110, 8, 28, -67, 34, 18, -3, -32, 13, -5, -47, 70, 13, -82, 10, 43, -85, -15, 40, -33, -59, -20, -25, -67, -3, 51, -54, 28, 48, -22, -71, 68, -15, -21, 55, 14, -75, -9, 55, -31, -24, 73, -17, -12, 86, -28, -27, 17, -56, -46, 12, 61, -33, -16, 42, -83, -21, 78, -64, -56, 44, 0, -61, 50, 57, -58, -45, -18, -99, -65, 43, 16]
3445A6j37K34k2j23O7M8q1PK0q0M5N8n5r4J52k5p8L1J16j18J9O9r5k8M1M3p1N5
3473A4P4j19K7R9j35j9Q9m3j8M7L7r8M1N3j40O2L6n3m2J43m4m2K4jm9O5kk2N1
3502C5K8l3l9M2o2j4O6M7j24Q3J7o3kM3k0r5J68q7n6Q4M3r8M7K7o3j9Q5o1k3J04
3532F0Lj35R8pq0PJ46r5j8ROk1P4j6q6Q2L4j46L5J25l8o5QJ3kQ5k0j31O5O3j04
3563e1M5L9n1kO2l8o2L4PN4lj6o3K6M3j5p8R4No9MJ24j25j7J13q0L2J5No1Q2q7
3595c4J0n2P2NqO5o7j8K3M3o5M1Jn1jP6q4j5J23l9p9P7Mn3M0j0l2N6pq4P3K8k6
3628A2n6J00m7l0K2O1q2J9K8l7j9P2j7k9J2O0r5M8l7K7o7P1k7l1K3M1p6M9mk0
3658b9J7P2j10M0O0j2o2K8j6lM1kk9n2J1J9k0J23m7l1M9m1o1J04k4nrOj5l7P1
$$ y = [16, -121, 113, 91, -32, 35, 83, 2, 9, 29, -51, -6, 52, -3, -97, 55, 30, -48, -17, 99, -19, 0, 69, -26, -54, -13, 30, -41, 14, 88, -31, -4, 95, -40, -59, 30, -13, -31, 16, 53, -45, -4, 49, -91, -29, 7, -46, -88, 55, 11, -31, -7, -8, -57, 8, 6, -16, 35, 63, 30, -9, 33, -29, -43, 23, 70, -54, 29, 46, -17, -19, 24, 4, -91, 77, -10, -66, 18, 61, -37, 10, 37, -26, -45, 40, -21, -44, 60, 63, -72, 26, 19, -61, -54, 92, -3, -21, -12, -6, -27, 47, 31, -55, 27, 61, -85, -50, 75, 37, -28, -20, -7, -9, 76, 56, -75, -10, 53, -51, -6, 33, -18, -20, 42, 4, -58, -24, -17, 37, 34, 18, -45, -19, 24, 9, -69, 25, 30, -39, -35, 89, -36, -53, 60, -20, 12, 27, 32, -29, 53, -34, -24, -76, -4, 1, -7, 58, -9, -27, -4, 39, -26, 15, 16, -35, -36, 40, -44, -59, 64, 25, -54, 23, 27, -26, 14, 4, -28, 28, 21, -63, 10, 38, 12, -44, 56, 9, -21, 1, 62, -20, -1, 27, -10, -29, 43, 26, -3, 9, 69, -26, 22, -15, 12, -55, 16, -11, -42, -19, 22, -54, -5, -9, -29, -12, 60, -50, -10, 50, 38, -24, 4, -12, -15, 26, 24, -5, -57, -46, -27, -47, 76, 29, -2, 47, 6, -55, 49, 25, 20, 11, 17, 2, -35, 36]
3689C6j1j33J11K6k6L1k0m0J0K7m4L3j3J9l0O0j2l0M5k2j9l1L3M9p0P1m7p8M4
3718c1O1K0o6P5q9Q6m4L0j12J01M0o5N8mo3J5L4r6NK9k5kM5J6m2L1n0k5N4N7n5
3749a2k1L1J1k9M3N3j29N3j7L3l1K8l1k2R3l8j9kK3j0l2LrNR6r0o4N4K9J4mk0
3781a1kJ1K5l9L6K8n7j4k2Q0m6k6P4m1l0N4L0j13Q4j6o4N4Pn0N4K5l5p0Q2M3m5
3812FN0j0l6MK6j00J21j9n1J9N1o6k6O3n0j7J9j7R1n1L4p5l3J07p0L2k8NJ1O7
3842E7q6qK5l8N1L1o3N5l7k9P2o1L4J0k7j8L3N8q5J3Lj4PmRJ2Pk8J5J8M7j5m3
3875AK4%j0P3j38Q8K7p2L3o5R0l3pJ07j21n0J25p8LK0l3j4M3M1n2Oj6M6o1P1q5
3906c7K5J5n5M5J0L4k7Kj4L6l0O2r7J6M5Jk3k0M1l1j8Q0r0K0O9m8j0K3rk5J5p
$$ y = [36, 25, -108, 3, 29, 3, 34, 14, -26, -16, 11, -33, 0, -13, 6, -24, 36, 24, -6, 39, 17, -2, -33, 0, 49, -21, 50, 3, -75, -31, 30, 50, -16, 59, -30, 56, 12, 42, -70, 31, 71, 6, 64, 60, -3, 12, 46, -50, -45, -16, -41, -43, 2, 18, -24, 7, -43, -68, -14, 43, -12, -33, -2, 9, -20, 23, 76, -53, 0, -17, 16, -15, 13, -18, -40, 53, 15, -4, -6, 17, 7, -25, -22, -31, -26, 70, -20, -84, -30, -1, 13, 9, -11, -13, -2, 23, -16, 20, 48, -9, -23, -45, 35, -11, -37, 37, -4, -34, 20, 50, -63, 21, 5, -59, -5, 2, -48, 6, 31, -4, -74, 8, 51, 6, 56, 46, 10, 14, 40, -60, 61, 42, -9, 10, 61, -5, -31, 32, -18, -35, -16, -33, 58, 7, 41, -34, -67, 40, -30, 2, -26, -21, -10, 57, -29, -37, -12, -50, 1, 32, -31, 24, -13, -42, 30, -31, 3, 13, -14, -32, 1, 59, -26, -13, -10, -24, -17, -21, -12, 0, 7, -21, -6, 12, 59, 44, 1, 25, 25, 15, 88, -50, 38, 65, -7, 26, -39, 51, 18, 11, 118, -3, -53, 72, -6, -3, 17, -16, -30, 13, 54, 2, 8, -8, 38, -23, 48, -37, -12, 3, -52, -7, 3, 37, 10, 12, -2, 34, 4, 66, -31, -15, 30, 31, 8, -12, 29, -2, -20, 60, -30, -10, 59, 11, 1, 24, 15, -10, 5, -2]
3938bK1K0l8j2k0O4n0mJ2j2j1M6l6k2O9n1K9m9M7K0q2R1k1l7J13r3k2L4j6o3O8
3969gj1Jl4R6q6mP1j4j6M8ok5j6K6m9l4P6j9n0L6Q8j34PQ7o6k7N3O5j10P0J1p0
4001d3K4K5k3o1P9l8K5J6L6j11P3L3k9K4k2n1N0L2l3o7J05m6m3M5K8m5j8M5l4
4030b4oM3Ll8J3K8n0L2O2p2m2J08o7RK3K7l0p2O5o7O2Mm7O5Pp9N4kl0j1M1L2m6
4063eL9j0o0K8j2k0j2O2l5N8Q8j18k4O9l3m9N6j0j1L5r5R0k6J7J0l6QkJ2J6K5
4094E5j17P1J3n8KK7lL6NK5m6j2Knj6j1M7j6k0M0l4J9L1o3j2J2K6m9O9j7J7m9
4126c1K2rK8mj7lJ5pLM9Ol8k1OnJ2K3ol8J5J6Pj4P4r4j5Kj4j5N0N1m3k0L1j9m4
4162d7L7l5L2kNm5N3Jq3P4M1n1lj3KP5n2K9j6j0N7j8q2L5N7n5K1j9j3O4p6K4M4
$$ y = [-2, 19, 39, 1, -11, -31, 33, -17, -21, -9, -21, -32, 14, -22, -44, 25, -26, 3, -46, 1, 21, -61, 30, 9, -28, 85, -8, -30, 4, -12, -75, -7, -18, -17, -51, 45, -41, -45, 26, 12, -4, 44, 38, 13, -3, 23, -26, -60, 16, -3, -53, -17, 71, -63, -56, 31, -35, -62, -9, 56, -54, 16, 27, -43, -19, 6, -17, -78, 1, -37, -12, 4, 40, -71, 2, 35, 6, 30, 8, -43, 7, 39, 6, -61, 44, -2, -45, 0, 28, -17, -35, 10, -24, -30, 13, 16, -22, -9, 19, -31, 1, 63, -9, -51, 57, -10, -1, 22, 49, 19, -53, 12, -55, 7, 11, -36, 29, 36, -43, 11, 9, -21, -32, 9, 41, -5, 34, 24, -36, -8, -20, -40, -52, 10, -25, 33, 121, 3, -21, 48, 15, -34, 22, 12, 1, 36, -59, 31, 5, 22, 32, -4, 4, 2, 14, 30, 55, -62, 9, 22, -36, -34, -7, -10, 26, 31, 56, 10, -2, 0, -5, -21, -32, 15, -1, -21, 19, -15, 4, 35, -28, -40, -28, -2, -51, 18, 1, 18, -31, -9, -18, 10, 6, -11, -14, 1, -6, -3, 46, 52, 14, -7, -1, -6, 6, 29, 23, -15, 0, 16, 23, 9, 83, -11, -26, -24, -38, -53, -3, 48, 5, -15, 16, -3, -47, -10, -45, -13, -15, -10, -55, -2, -1, -84, -10, 31, -20, -23, -36, -34, 41, -11, 18, 2, -8, 49, 31, -51, -16, 41, -14, 7, -12, -25, 39, -37, -13, 31]
4195C1rm3J5O0l0K9k0j3k5J3K9m0M7n2l1M9k6k6L6qL1j8K3Ko9M3j3J3K4J3n3k5
4227d3O4Mm4L0ql0M1J1NlJ0n2N4k9Pk8pN6l3o5O8k1k2Rj8LoO2k4l3M8k4N0m8K6
4262A0k3O0n5K7%j8n0M6P4p6j1ON8r7J3NK7j8K3K5k8OK3o7P8l5r4Q9m6L5K8j7
4294bM3r8M8rRRLk4L4L8p6J6j0j8N4q4M0l0qP9m3K7M%m2N0k0K4l6M3o6P6K9m3
4328A7k5K4K4o7pj0L5j2j4N1j3k2M8k6j1l3M1j9J9KLln1L5K1J6k5K7k8j9M9p4
4360d7P8l8M6o5K0N7j8q2M4m9K4M5j9L0l6O1j6j08J3K2j1P0l9J8l6O4j3m7L2l2
4390c2l6Q8k7J3K5mn8J2LNqK4L1qk1j0O2o3j9pL7J2j8J9ol2j1O6o6%KL8k6l2L7
4425a0pk5O6k4j0m2L1j6L9m6N0kk1k6OoJ0Q1l8J2j6K7l2O6j19K0J6K0j9L4m2M
$$ y = [31, 22, -21, -6, 54, 24, 53, 33, 20, -5, 8, 37, -3, 44, -8, -39, 10, -16, -42, -6, -14, 17, -1, 22, 24, -45, -2, -15, -2, 22, 35, -18, -43, 21, 25, -19, 11, 3, -27, 14, 25, 30, 27, 37, -15, 39, 10, 17, -11, -18, 38, 5, -60, 8, -13, -35, -26, -44, -41, -47, 15, -9, -42, 6, -18, 32, -16, 10, -13, 47, -8, 19, 19, 1, -49, -3, 71, -5, -16, -10, 48, -49, -36, -31, -4, -22, 1, 26, -2, 4, 27, -40, 38, 3, -91, -2, -48, -13, 15, -2, 41, -57, -9, -18, -9, 0, 3, -21, 13, 51, -25, -9, -19, -37, 17, -67, -27, -57, -65, 14, -29, -2, 2, 2, -40, 10, -10, 14, -22, 21, -45, 31, 60, 17, -8, 16, 40, -27, -34, -44, -9, -21, -35, 16, 3, -19, 29, 3, -8, -41, 0, -19, 0, 2, 5, 2, -49, -14, 7, 23, -2, 25, -3, -22, 27, -47, 31, -7, 39, -26, -6, 51, 33, -49, -5, -54, -30, 15, -4, 26, -10, 51, 35, -73, -60, -38, -49, 21, -18, 0, -36, 28, 15, -32, 0, -32, -68, 20, -7, 6, 31, 27, -31, -19, -16, -11, -19, 5, 36, 28, 7, -3, 59, -4, -23, -30, 7, 19, 1, 20, 14, -18, -29, 37, -29, -29, -27, 11, -15, -47, -10, -17, -42, 24, 0, -10, -52, -21, -37, 2, -44, 6, 4, -17, -43, -37, -43, -33, 48, 10, 22, 6, 33, 1, 67, -52, -32, -16, 4, -15, 19, -23, -19]
4457a9k3J4j5L3nQJ9M7j00J5Ro5J20rk7l2Rj3N3J7k3k1nN5o6K7Jk5L3l4L6j1K8
4490C1j6n5L9K3m3N2J2r1P9m3R7o5omm1k6L1j8O9n4J3K6jm1M9k0MJ7L1k4PNp2
4523c5M9l0L2o4RK9M5j9JL1k7j3%L0p0O1q0M7k8L3m6L8M8n0n6Q5l1L1n6O2o8l
4555d5M7rK0K1k3m4kK6J1j2J0M3N4j39J5N1l3K9j4k7j1%P7k6p1J05n5j7O0j3k0
4586Hk5%K4l0k9P8l3kJ4RJ4m0j7O3pj01J03o8P9j07O6K0o6K0K8l3M8J5n0M0j8
4617Cj3J7L8m7L7J5p0J4P7n6KKn9L8lK2j9p3N0O1k8l7N3k2Rj2j0LK0K9J8m8L1
4650D2n2L4n1J4J7l1K5O7n3O8p8K5k6l6L1L9p2J9O1qJ3l1k5k1R4q0M2o0L0j4k6
4681d3O2km5K9K9l7K6k2J7Jj0m8K8L1j6pL3nk5k6l9N7NJ8K2o8L8L5J3k8Kk0mo
$$ y = [-19, -42, -28, -43, -10, -15, -7, 12, 59, -41, -26, -17, -82, 38, 29, 2, -30, -21, -34, 19, 36, 13, -8, -13, 42, -24, 3, 4, -21, 12, -22, 14, 3, 31, 15, -40, -1, 22, -21, 31, 43, -48, 31, -12, 85, 20, 14, 10, -31, -57, -26, -44, 25, -29, -16, 10, 9, -32, 17, -3, 1, 18, 49, 25, 32, 37, -35, 14, -16, 16, -48, -39, -10, 35, 16, 17, 48, 21, 8, 8, 38, -32, 29, -51, -4, -32, 1, -45, -7, 41, -9, -65, 20, -11, 20, -36, 26, -42, -45, 2, -7, 13, 34, 11, -33, -35, -9, 2, -10, 0, 43, 97, -42, -27, 24, -9, 20, 6, -21, -32, -32, 45, 19, -52, 53, -2, -19, 41, 28, 8, -17, -17, 7, -23, -52, 26, -7, -9, 5, 14, 28, -12, -29, 34, 27, -74, 29, -39, 40, -67, -1, 19, -47, -27, 1, -32, 16, 31, -19, 21, 3, -10, 7, 45, -2, 35, 50, -20, -6, 71, 15, 17, 19, -40, -2, -5, 17, -2, -75, -25, 36, 8, -29, 24, 2, 11, -1, -11, -8, 12, 41, 59, 11, 42, -10, 24, -27, -13, 4, -27, -2, 65, 12, 80, 2, 27, 1, -35, -4, 35, -37, -18, 43, 35, 48, 17, -8, -29, 65, -15, 27, -33, -3, -17, -43, 19, 17, -28, 1, 30, -7, 19, -3, 14, 15, 5, -43, -15, 16, 0, -7, 26, 21, -4, -30, -69, -12, -7, 11, 33, -35, 3, 38, 51, 23, 25, 5, 1, -5]
4715em0K9K4qPrL0l3LJ2K5k0k1N0n0L0oJl7K0n3Q8k4k0Q9j08RK8l0J6N1j2j8K
4749B0k6J1pM8l0k0L3m2O2p5M2N4j11K1N2n3l6N6P8q4l3JPl5O0K5m3PJ9k3j4O7
4781C1o5M0K5mm5N7j7k1m0N9o3L0J2qK6qL5o4J6Pm2N7mj0qj9QL1k9L4j5j0N4p5
4815b5J6j5J4m1O7k8LK2k8pmM6K9m2m9N8l9J6k4N6K6j07Q8j6J2j3l2M4l5k9N1
4846A4l4L9m0p%qlOj7K9J8j8K7rO2k1k1J8l4ml9J06k6j00Q5k7k3k5P2j5l9N4k3
4879col1N7J2n9J5M5o1Q4l8n2OJ8%k7M4n4j2K8L1%L8ll4k5K4M9r7M2m1R8p5M5
4912A8j8lK9k9L1Po1QN1p4K9J8Lj4qJ9K4j1k1k1M1l4j8M4J9p7j6Q6Ooj3m5P0n1
4946a7k0K8kK7p9M5K8j3%k2K9K9pn1K4rP2m1K9l3k3j1L3o3RL4j9R8o2m8L0J8n0
$$ y = [-5, -45, -16, 8, 0, 7, -2, 28, -5, -2, 10, 35, 15, -6, 44, -6, 24, 18, 19, -18, 2, -51, 37, 13, -7, 82, -26, -17, 11, -19, -3, 48, 36, 18, 20, -6, 5, -2, 46, 16, -4, 29, -13, 49, -26, 16, 70, -41, -20, 32, -21, -57, -1, 77, -7, -40, -39, -32, -67, -7, 18, -25, -18, 1, -22, -36, 31, -34, 6, 31, 27, -18, 39, 22, 1, -39, 20, -43, -13, -1, -9, 17, 9, 44, -20, -4, 3, -39, 18, 14, 4, -4, -23, -15, 16, -13, 21, 6, -4, 50, -25, -9, -24, -10, -51, 16, -12, -9, 13, -15, -22, -26, 20, 49, 7, -42, 16, -23, -7, -31, 25, 51, -56, 32, 16, 28, 15, -17, 27, -8, -37, 14, -20, 19, -21, -28, -28, -36, -39, -33, -50, -21, -3, -21, 6, -3, 59, 38, 17, 35, 1, -3, -42, 64, 38, -62, 23, -4, -27, -52, 20, 5, -34, 20, -3, -9, -40, 17, 29, -30, -15, 30, -31, 53, 15, -37, -31, -13, -13, -40, 4, -50, -62, -34, -3, -3, 35, 32, -2, -27, -3, 46, -51, -9, -50, 48, -27, 18, 0, -3, 26, -3, 28, 35, -26, -18, 33, -41, -12, 6, 9, -5, -13, 6, 30, 19, -2, -23, 18, -16, -34, 10, 29, -48, -64, 22, 28, 22, 9, -36, 34, -17, -37, -9, -11, 16, -63, -18, 10, -3, -3, -25, 4, 33, 26, -25, -1, -10, 62, 21, 50, 17, -6, -17, 16, -47, -38, -4, -23, 75, 13, -35, -5, 13, -37]
4979c7J2L1OL5k7m9L4j2MJ2j2NMRJ3n7rNL7l1L2K5Op9P7M7n2l5K4n5M7j6Nk1L9
5014A7j4J5Km4KJ0K6m4N0m3K7k1K8llQl9K9N1j5Kl0J9lPk4km3pQRL5l9K9Qk5K7
5051A0l3J9l2Q5on6mL5o0N4K2Kp1N6j7nm0L2k1M6m9J6Rk4m5O7J1Npo1P7K0qk3
5085DmOlK8k9K7o5J8M6QJ1n8qm2R8o8J02n6K5p5P8j8m9J5K1l0N0n0J1M5K9n5l5
5118b3L5M4l4k5QkL1qo1M8j0K8k4j1K9k9N2p1PL0m3M3L0n3N7m1K5rj3m8k0P1k
5151A1Nj0J7j0l5qJ2L3k7l5K4M1Mj1k7JM2OnK3p0k2J36j48R1p3N5Rm4K3o0Q8p9
5184d3O5n7O3l0l5M2%j8J5j4M5k0rMQk0l8N8J0n2mK2L7k0Om5L0k6L4k7j5M8Kk5
5218iM1m4K2J2L8k3m4K5m6K7M1NJk4n6O6j4n0J0K0Ol1J5K0kk5MM3k8o3J3P1n3
$$ y = [-37, -25, 6, 12, 47, 20, -29, 5, -7, -3, 9, -3, 2, 6, 15, 28, -29, -38, -33, 4, -27, 5, 30, 36, -43, 34, 81, 29, -6, 18, -37, 10, -6, -1, -22, 17, 3, 18, 20, -24, -22, -12, 14, -30, 20, -23, 4, -17, 11, 8, 5, 13, -26, 3, 54, 39, 41, 11, 30, 27, 34, 10, 8, -35, -42, -34, -25, 10, -29, 0, 8, -17, 10, -23, -4, -36, 49, 43, -13, -17, 18, -42, 12, 34, 36, -35, 21, 4, -1, -41, -9, -30, 16, -33, -17, -8, -32, -77, -10, 1, 6, -1, -62, 15, 35, 27, 4, 0, 6, 3, 31, 2, 29, -36, -18, 28, 36, 47, -11, -19, -61, 37, -31, 71, 15, 40, -35, 43, 25, -24, -9, 12, -18, 32, -18, -7, 38, 67, 12, -23, 12, 56, 22, -3, 5, 3, 34, 26, -35, 13, 3, 31, 7, -4, 25, -4, 48, -23, -16, 14, -29, 14, 44, -9, 48, 7, 32, 23, 10, -38, -58, 13, 11, 16, 6, 23, 13, -22, -30, -18, 15, -12, -47, -23, 18, 22, 11, -16, -15, 27, 33, 28, 51, -19, -41, 95, -53, 38, -35, 20, 29, -15, 8, -52, 36, -43, 22, -35, 28, -2, -37, 5, 5, -13, 2, -12, 33, 13, 4, 8, 16, -4, -42, 16, 26, -26, -30, -8, 29, 9, 15, -30, 0, -26, 8, -19, -34, 14, 16, -9, 32, -12, 10, 22, 60, 37, -7, 18, -28, -1, 40, 45, 46, 22, -34, 32, 18, -32, -22, -2, 4, -27, -12, 8, 6, -19, -15, 28, 0, -63, -50, 21, -32]
5251c2K0L2m4M7q6O6m3K4J6l0J0KJ5nm0m0R0M4j54Q4R3j12P8j7L4p1pkJ4k4K2
5282a6L9m5J3J4Or7R2Pmm7L1J2J1k2K6J6m6M7j9ln6L1K3J9n3j2L6J3l7PJ8RnR
5316A7pn3K8MM4j8M1n7j0M9m6j7M1j2l5O3m3J6m2j6N4ok4N9J4k5l7j9KN3rKN0
5349F1J7j31P0o2K4J6k7RM6L7n7J5J9n5k0K5L2Rmj1l0L0Nmkl0M4j9JJ5klm7M4
5383A5l7L2m4L9K9q5J1QO0n0M2p2R6p3k0P2J2n1K4J2k9k8K5K3oJ2l6NJ6L4n5O5
5415D6p8J4J4k8ON4p3O2l9J0jMP8j38N7l7mQ0m3k9L5K1kQM3o0j8P3l4k8P0m4M2
5448F1m8L9r3L6MJ2mm2L5L4j21J05n7O2Jk7K6jql5J9J6l6K8j9n4K9M9rj1k9M8
5480A0oj0M3n5J1%N6o5K2MK9q0O7j6m1Ql1J1j4O1m7L5J7r0R7k7j4KJ9L4q7M6n5
$$ y = [-32, -12, 20, -24, 23, -63, 3, -40, -16, 0, -30, -20, -18, -3, -8, -48, -88, 2, 46, -108, -24, 69, -43, 35, 18, 52, -19, -26, -28, -14, -38, -16, 23, -22, -9, 5, 11, -86, 6, 13, 9, -38, -7, 5, 16, -6, 20, 36, -10, 37, 18, 15, -41, -10, 13, 32, -21, -33, 3, 16, -21, -14, 4, 13, 8, 17, 10, -43, -15, -11, 33, 15, 56, -1, -11, 38, -8, -25, 16, 4, -31, 32, -11, 5, -37, -53, 1, -5, -29, 30, 44, 19, -18, -37, -35, 18, 9, 11, 61, 78, -53, 17, -45, -21, -5, -32, -23, 23, 60, 3, 18, 37, -18, -38, -13, 19, 28, 24, 13, -17, 13, 18, 14, 12, -18, 26, 7, 8, 23, 21, 18, -29, 15, -22, 10, -34, 5, 34, -51, -40, -32, 28, -22, 20, -52, 44, -29, -49, 23, 35, -16, 8, 20, -9, -37, -12, 11, 5, 17, -19, -14, 2, 36, -19, 46, -32, -18, -4, -32, -26, 28, -45, 17, -22, -12, -13, -9, 69, -69, -12, -49, -53, 27, -16, -45, -10, 11, 9, 17, 60, 0, -18, 55, 21, -7, 63, 19, 61, 13, 52, -41, -5, -1, 11, 7, -35, 0, 34, -87, 18, -39, 23, 24, -3, 23, 22, 14, -21, -2, 14, -22, 6, -13, -67, -38, 11, 2, -9, -38, 10, 4, -6, 37, -18, -7, -7, 49, -16, 6, 10, 39, -41, 26, 10, -31, -23, -54, -43, -57, 4, -43, -8, 9, -81, 16, -11, -25, -23, -4, 30, -57, -11, -66]
5513f6P7qK9k7PJ0m4M7m0j5J1k4K5L9j2k6K3l1O4l3p1jO8j1l6LRN0m0RK8n3j9
5546e8N8j4L9k2m8O0nK0l0rNK7l7M9n0J7J8k2J4ok6J9nl1K4M3o4M6l0J3l4N4j
5579A4l3M5k6m6rN2j2qnJ8k4N4K0n6l4L6%j3M1L8m7o8J5L4Rk3LkK9l5M3RKm5P2
5614D8q9J0K4N9Lk9j3l9M9j7j9kL0j3j0J7Rp5M9J8rmm1N8n4O0o4K8L0l3M1l2O9
5647E9l8Mj2j0J0M5o8J7J1NJ0J2q2P0j6K2oM1j02K0l0M1j2k3L0l6R6o7j2K9K6
5678C4J3n6R6p3J0l3ol8L4M9m0j4J1k0L7k4JK2k4J1L0qnrl8L2O2m6j2lJ3nk0L3
5712A4m1P1o3M3k3Pm0nJ7J4rN7p7L8L5rm3K2K3l0L0m6j8O5o1Q2p8M8l7nL7RM1
5745F8p2J4l6M2jom4M5p3Q5k1j7j5k0Q5K4l3l9j9M0J1j4k7J8PN9m1l5N4Rn3K5
$$ y = [-66, 11, 3, 32, 5, 12, 22, -22, 25, -15, -30, -19, -43, -18, 21, 9, -17, 6, -25, 39, 6, -65, -66, 2, -9, -45, -42, -33, 17, -23, -14, 14, -39, -58, 0, -14, 25, 3, -45, 15, 10, 30, 0, -9, -4, 23, -14, 35, -15, 2, 20, -2, 12, 6, -20, -1, -6, -37, -13, 30, -34, 12, -18, -5, -39, 15, 14, -19, 26, 0, -46, -55, -3, -15, -23, -28, -10, -34, 20, 40, -16, -50, -14, -14, -27, 14, 52, 5, -63, -48, -14, -5, -28, -25, -27, 2, -33, 10, 19, 21, -24, 48, -41, -31, -7, 52, 55, 26, 13, -26, 23, 6, -13, -15, 15, 2, -8, 9, 18, -57, -8, 10, 1, -3, -44, 14, -40, 20, -44, -16, 14, -19, 22, -10, 59, 21, 25, 13, 3, 13, 58, -10, 7, 18, 23, 33, 45, -37, 33, 17, 39, 33, 74, -28, -8, -38, 3, -9, -32, -2, -38, 58, -9, -21, 8, 34, 47, -9, 87, 14, 24, -9, -15, -53, -19, 30, -10, -24, -13, -33, 4, -20, -19, 3, -21, -10, 20, 12, 7, -2, -40, -8, 54, 8, -4, -7, 6, 1, -19, 14, -27, 44, -19, 24, 1, 8, -32, -37, -20, -6, -15, 42, -35, 3, 38, 29, -14, 8, 31, 1, 31, -15, -33, 32, -29, 53, -25, 23, -14, -19, 18, 27, 68, -4, 10, -26, 16, 15, 9, -35, 10, -63, 22, 1, -16, -31, -51, 34, 58, 25, -14, -33, 7, 18, 4, -23, -5, 2, 61, 20, -15, 39, 48, -5, 20]
5777B0Qn0M4j3M7p7P7m3n0P2k5j3jJ6K5j7J5m1kk0rL3l1M7K5n9rK2M8m9O7r4J5
5810b2N5lJ4j4j3J4J8m4K5rJ5j1l2J6m1O8J1n2J9Nn6P7j6p1P2J3p6N2m3LO7qm5
5843a2m6K6l6Q8k4j5QK1K5m6l0O3k6k2RJ7K0m0P6J0q5j7P8m8N2l9L7p6M0m0j0
5874d2M5l1M3M8j10M5l1O8Rk2l4L1J1o7K0nJ7k9kJ4K9J2K6m4j7N6n6L4j0k8Km
5906b2K9n0K8L2J7m2J4n6P9j2m0j7L3L1l2l2l0P2krl0J5KJ4M6n0k1M7K7l8L1l7
5938cK8l8j6nO9o3J4M9n9K4j6J4J4Kj4p3K3N2MJ0l1L9k0l5K9j5oL9m5N9m%m2k5
5972d1N0j0M1l1j3j9nN3n8P2r5M7M7l7K9m0K9m7NPL1K4J4q8J1LK3m6M6ml5O0K4
6005D7J6q3L2oQNn5K6LrM2m4K1k%kjK0%Nm6lK4nl1J9O2n0L3l9J3O2r1M2o4L9N
$$ y = [20, 28, -22, 22, 9, 56, -21, 56, 13, -37, 35, 10, -3, -4, 12, 37, 20, 35, -6, -8, -28, -37, -4, -35, 12, 37, -22, -31, -9, 39, -10, 57, -37, -22, 33, 30, 44, 30, 17, 31, 49, 5, 30, 21, 36, 25, -7, 9, -32, 36, 47, -5, 14, 19, -37, 40, 24, -47, 25, 38, -38, 14, -29, -26, 41, 33, -12, -58, -32, -68, 20, -4, -19, -11, 10, 35, -11, -41, 22, -4, -26, -17, 0, 20, -20, 56, 66, -19, -36, 42, -6, 46, 7, 44, -32, 8, -32, -42, 3, -28, 15, 63, -47, -2, -33, 35, 44, 22, -12, 19, 30, -37, -17, -22, -5, -34, -36, -22, 7, 19, 45, 1, -16, 40, -16, 18, 8, -20, -18, -22, 7, -43, -15, 17, 34, -8, 6, -50, 29, 17, -23, -40, -7, 24, -8, -40, -70, 2, 0, -9, -39, -24, -22, -8, 38, -12, -33, 14, 41, 3, 34, -3, 25, -13, -29, -34, 35, -28, -14, 35, -24, 0, -16, -2, 12, 14, 0, -73, -50, 2, 6, 16, -15, 24, 4, -31, -2, -17, -23, 16, -29, 30, 26, 26, -16, -41, 9, -1, 40, 9, -4, -23, -28, 25, -33, 39, -56, -9, 38, 1, 30, -10, 19, -28, -23, -16, 15, 39, 53, -35, -24, -21, 2, -44, 2, -2, -37, 23, 47, 63, -20, 12, 6, 14, 19, -36, -10, -7, -16, 26, -18, 3, 1, 1, -1, -2, 18, 18, 23, -23, -26, -2, -7, -38, -19, 43, -7, 26, -13, 0, 62, -29, 13, -51, -12, -7]
6042gK6k6O4p2J5k1J2KLJ0lM7q0J0%R5q7J6k3K6j9j1P0K1q8nL4j8N1o9N5n9O1
6075C0nj5jk7N4m9L1j6L1n4O5j9l4Rl7K0l3OP0J0n2QON9j7o8L7J5K5l3k5K7p8
6108f0O3N9m3opj2%O2l3J1rp0jNkN7m4J9K1l0KK9k6%lM7k2n4L8k4O7k8On0N5K7
6144D4K1jp8N4m8lJ5QK1j9K9q7Q1q9M3l8M5K1k6O7k0Ql1o9O0pl5P0J3r0N5k3j7
6177b6Rl5J24o5jM3l5j9J5o2M5K6k9j1M5q4R5n6kL2n4M7j5J7j8n7R4Rp8N6m0L6
6209FjJ1m3M2l3L1k1M4jj4k6l5L0L8J1r8mQ0J3J6j1m5k9J5rJ5L8oJ5o0J5M4j09
6242h1N1j6N2K1k8m4N7k6K8j8Oj5PmjP8j04N9lk0K6Kl3L0rJ1qrn4P4qm4M7j7J9
6277B6k7k8j6mK5l6O0pkO0m3K0j9pL3k5k7J6l2Q7m7j1o2Q0K9k2m8j1N0l8L4M2
$$ y = [-7, 19, -7, 57, -15, 0, -21, -9, -7, -4, 6, 3, 50, -30, -20, -20, 75, -12, 4, -19, 7, -12, -23, 47, 68, -20, -25, 9, -9, 42, -27, 28, -31, 30, 25, 10, 9, -18, 36, -13, 18, 2, 33, -21, 44, 25, -9, 0, -37, -17, -50, -44, 26, 36, -16, -8, -2, 57, 40, -28, 9, 24, 49, 16, -9, 18, -60, 3, 62, 19, 13, 6, -6, -6, 56, 23, 34, 25, -45, -46, -41, -43, 14, -30, -11, 10, -20, -18, 11, -15, -15, -18, 29, 7, -47, -9, -33, 34, 6, 12, -38, 17, 44, 65, 64, -14, 40, -8, -11, 4, 12, 33, 14, 43, -44, 37, -52, -9, -47, -2, 19, -7, 60, 40, 48, 17, -52, 8, 1, -34, 36, 49, -41, 14, -9, -26, -17, -52, 72, 7, 6, 49, 14, -5, 10, -52, -7, 19, -10, -21, 24, -60, 35, -21, -23, 9, -45, 2, -13, 4, -14, -71, 23, 32, -46, 10, -30, 6, 5, 16, -27, 15, -18, 13, -8, 36, 35, 21, -5, -40, -10, 28, 39, -59, -63, 17, 30, 46, 35, -10, -39, -24, -33, -18, 20, 14, 29, -31, -16, 28, -81, -30, -46, 6, 27, -1, -45, 12, -14, 14, -4, 2, -13, -6, -10, -11, 67, -37, 22, 19, -1, 25, 27, -6, 24, 15, 26, 18, 9, -45, 29, 21, -23, 24, 7, 26, -1, -29, -45, -49, -24, -60, 0, -7, -9, 51, 8, 28, 9, 2, 35, 10, -17, -1, -33, 54, 7, -4, -66, 14, 43, 21, -27, -38, 12, -26, 8, 50]
6309E0nk8mpj6J2L4lQm9k4R7j01P2p5L4N4r4JM9k5J4j9L6l7M7K6j6o5P5m5J2k2
6342a4J6K4j5m4N0m0l0R1l8j6J3N0o3P8p5L3j3k7N0o6N5K3np9NN9l5j7K8K7qm0
6374b3PK4j8J0rj0N3n2J9K7j9M3K4p0J4L1l7j3k5K9%M6l5j3k8K8m2M2%N1K6j03
6406b3pJ05j03K2j3J2M7k6K4n9J1j5PK6K6J0p1oN8j0J1p6P3k7N2q6M4j3K5M0n8
6437@J7k0K1k0Nl1M2K5n7%nN2j4on4R1k4N5p7J2j1L6pk4MjJ3M0m3K7n8M4ln1K1
6472aL3n2K4Nj6oKN8l4j9k4L2K2n2K9J2MmMrlm0M4j1N1m4j5k0N5l7M9m9k1RL2
6507Hm7L2k6P0k6Lj6m%nK3K5k5o1J8M4Kj7K8k0J2L2j12M6K0p4J11k3n2O2n8J3
6539a7K9J1k8LO3n3J3j2j7K6rKn3N2J3qk3J8L4k2%KO2j03L9o9oN3k0L2rLqk6R0
$$ y = [50, 45, 17, 13, 6, -10, 2, 36, 33, 41, -8, -32, 65, -36, 36, -39, -5, 49, -45, -44, 5, -20, -6, -25, 11, -26, 21, 47, 31, -34, 41, -4, 8, -14, 2, 26, 11, -33, 17, -23, -53, 38, 0, -16, -3, 47, -16, 62, -13, 20, 7, -20, 30, -36, 19, 42, 37, -42, -37, 22, -13, -30, -2, 25, 17, -23, -16, 8, -10, 0, -9, -19, 34, -18, 1, 28, 9, 52, 76, 6, 20, 51, 14, 1, -24, 5, 5, 51, 16, 3, -25, 3, -39, 3, 3, 54, 80, -23, -30, 75, -28, -6, -19, -7, 40, 14, 38, -21, -10, -25, -18, 8, 34, 44, -27, -33, 25, 15, 26, -50, 23, -4, 48, -38, 6, -7, 18, 58, 0, 17, -3, 18, -2, 3, -28, 14, 39, -18, -18, -23, 29, 15, 9, -45, 46, 22, 77, 0, 12, 1, 37, 30, 6, 10, 9, 22, 62, 19, 46, -12, 32, 29, -22, -1, 32, -20, 4, 9, -7, -13, -11, 47, 13, -6, -30, 2, 24, -28, 1, 13, 17, 13, 17, 8, 5, -35, 9, -2, 49, 5, -10, -30, 25, -12, 37, -12, -33, -24, 8, -39, -7, -33, 37, 11, 14, -2, -6, -6, -11, 12, 37, 12, -49, -31, 13, 15, -2, 26, 6, 18, 50, -62, -16, 4, -70, 41, 18, -34, 28, -30, -17, 12, 23, -5, -2, 61, 8, 21, 9, -8, 18, 9, 11, -42, 10, 23, 15, -8, 10, 44, 22, 22, 24, 86, -17, 22, -47, -53, 0, -20, 12, 3, 6, -2, -28, 62]
6574F2n4m0O5jo7N1j0k6K2k4QQKL0kl1qL5j8l6JN6j9K0j3K1m6k2L8k2j9LL1j8
6608b3Ql9QNJ9%J2N7q9L4j2QMK9k3K0M8o1n1O5j4pO1q5K9NMj0J4m9R5p9O3j5o7
6643c6J7J0J2K1rrk0j1K9L1k2nl7LJ9L5l5jPk6ll5J07n9J1J2j6RL2jk8K5m3kk
6678b0KJ0j8K8j6LK4Mj2J4m5N9K0m5o6P4nk8l7K6j6K0N6j6j9m3R1r5R0n5N8n5
6710a2O5p0KPO9p9J5N1m8J0j8O4m5l5Q4q6J9J0L0j5J9j2k1j9O5o6Lj4N9m3L5l1
6742gK2n2M4k4j3L2k8QJ0K6L0k3l2J3N0Pl6rm7K9J8l6M2Rk2J1m1L1k4jnq%O3o8
6777c1OK8Oj9k1N4pMm1O3l7L7r9J24j8j8k9OK8l1j5M8o7M5j7rk7N5k0J8l2J0l
6810ijJ3j6QJ8j2j2Jj6L2m8Q3o5L1j5L0l8RK1p4J04o1J9l5J7L0Kj4k9M1qqk9L6
$$ y = [62, 8, -32, 33, 32, -35, 16, 6, -20, 2, -22, -14, -6, -4, 26, 24, -7, -15, 20, 2, -34, -33, 23, 4, 24, 11, 32, -14, -36, 2, -20, -39, -36, -5, -23, -15, -54, -46, -41, -22, -22, -10, 47, -42, -8, -20, -12, -8, 21, -2, 18, 66, 5, -46, 19, 5, -2, 59, -26, 3, 8, 12, 2, 16, -33, 62, -17, 46, 31, -36, -19, -9, 3, 24, 15, 6, -14, -25, 4, 35, 13, 8, -29, -26, -7, 28, -7, -8, -1, -27, -30, -65, 42, -17, -6, 6, -10, -1, 31, 30, 2, 27, -16, -18, -20, -18, -8, -26, 2, -14, -11, 13, 17, 5, 19, -26, 33, 53, 8, -58, 16, 11, -17, -54, -28, -44, -24, 32, 16, -3, -46, 45, -50, 40, -15, 43, -12, 53, -17, -15, -8, 61, -18, -3, 48, 0, 10, -8, 56, 11, -24, 60, -26, -7, 3, 33, 18, 37, 25, 4, -15, 50, -16, -13, -27, 32, -11, 24, -7, 15, -37, 7, -17, -30, 2, -26, -18, -8, 18, 48, 25, -7, 6, 56, 63, 27, 18, -29, 0, 18, -18, 24, 33, 11, 22, -19, 12, -12, -13, -18, -26, -26, 37, -31, -25, 3, 9, -10, -31, 23, 16, 20, -21, 42, 5, 42, -57, 67, 49, 31, 2, 8, 36, 5, -10, 38, -29, 16, -1, -10, -37, 18, -2, 16, -16, -6, -9, -10, 3, -13, -5, 13, 1, -11, -10, -26, 6, -42, 41, -24, 7, -8, 22, -16, -7, 14, -60, 44, -17, 2, -33, -16, 14, 16, 2, -27, 14, 6, -2, -31, 5]
6844ELm1L0k9nM2j8J1L7m3k7M0j4L4J6mq7O8MrL0l7OKQk6NJ6m2PK9k7M7m2J8k8
6880b1N0k8K4m3K9%lO8j07M2k7N0m0j9L5O6p0pOK3n0jJ3K3k7O6r9N7L5q3K5ML5
6913B6n4K2j0J0k2P5j09M8L5j5K2j3k3kOk4l3P7k3L6k3qL6j9L%ljj2L6Nm9J5m2
6947c3M4L8pl3Lj1k2L9m7P5o0O6k1j9ROQLj5l5M2k5nnp1N9j3J2L2k0kRl7M1M0
6982D5p1L5j3l2M4l3RO4j2m4m9N9N1k2l0j7L3l8j8M5JlL9n4k1R2r9L6j2Nk9K7
7014a2k3J2K2J8j8OL8l0mo6Q5%k7J2rQM1rj8J0p4R6p8N1L4j24P7m1pL6k1j3L9
7047A1l1K8mk4M9k3J9k8J9j2K3J2o8J1mj1P3l3Jl2M8K1l4kl6L0L7n4L9Ko9%L0
7080a2M6lKn1j6N3l2L0k9M4j3p6M2K3Jk8N3n7L0j2LL2m5K5oL5j6L9j18K4ON3j4
$$ y = [5, 8, -33, -3, -32, -37, 5, -13, -2, 35, -8, -35, 5, -9, 25, 41, 37, -50, 18, 22, 13, 43, 6, 12, 14, 22, -4, 1, 17, -25, -18, 11, -16, 31, -11, 7, -21, 29, 1, 25, -18, 11, 11, 8, 76, -31, 11, -16, 34, -6, -25, 10, 76, 6, -1, 5, 28, -22, -23, -10, 13, -14, 52, -47, 10, 45, -38, -13, -9, 26, -28, -6, -16, -6, -28, 47, -62, -14, 21, 6, 28, 15, -8, -10, -4, -28, -61, 16, -7, 29, 6, -2, 34, 15, 18, 18, 15, 14, 2, 38, 43, -6, 9, -33, 11, 49, 42, 9, 12, 1, -21, 18, -29, 46, -14, 52, 31, 12, 21, 27, 35, 38, 23, -12, 30, 5, 0, -5, -76, -17, -30, -18, 14, -6, -8, 1, -36, 5, 45, -26, 9, -4, -36, 8, -25, -16, 48, 36, -8, -57, 2, 53, 31, 1, -16, 17, -21, -39, 6, 7, 4, 43, -11, -32, 60, -39, -3, -15, -10, -39, -12, -35, -23, -1, 17, -1, 5, 43, 13, 9, -57, 28, 28, 1, 13, 4, 12, 53, 44, 26, 36, -38, 58, -20, 31, 65, -59, 18, -23, -30, 6, -15, -28, 11, -20, 8, 4, -20, 29, 6, 25, -3, 16, 4, 27, 39, -29, -18, -22, -33, 40, 7, 8, -24, 24, 45, 11, 9, -27, 3, 40, -14, 25, 27, -42, -42, -12, 34, 31, 33, -18, -34, 19, -13, 17, -12, 32, 19, -57, -15, 8, 9, -19, 34, -23, 7, -5, -2, 30, -15, 10, 4, 39, 23, 62, -56, -32, -26, 27, 13]
7113A3NOL8p6J3j1k5P9o3K5O7o4M1m1K8J4l7O0o5Rm1N9k6m1M6p2P3l4L5J3ml8
7145a4jk9N7j7Nk0J4J8k6M6j2o4j9Q1J9rM3k1%rm2j2k0N8p2N3O1p4M4l1j1M6p
7178C5o2N6p1QJ8J6%Lm8J8rK5QJ4J1l8K6K4n6N1l1KM1k5Ol6P3o2pqL1l6J3J8K9
7213C7k0m4M2j6J6nK3rj7L2m3Rj5M4j7L5m5Ok7Q1p2K2n4M1L0o2K8n1K2N2k1mk5
7246b7O4l4j2M7J2m1L3m0p0M1L9M6j8l6n0M9k4J8J2k3K8K5m8j9P7o9JM7n7LOm
7278b4M6m4k1L7K5m5K9n3N4J3l2%K5n6M9l7N9k9L5L9n9K4pkJ7Jm7k1K8Nj9Jl8
7311d7P3k7K9k2J1n2N6J1k9l2N7o2M7k1M9PQn8N1j6o2M8n0MN0%j5l3J5k5P3o2
7343b4O0l8J2o6k9J36l8K2o6K9J3J9Ol1KK5l5L4Mm4P7m2j3j6j0M6l5R0m8j3j4
$$ y = [13, 18, 24, 62, -14, -1, -12, -37, 42, -21, 4, 71, 7, 48, 7, 35, 49, 12, 72, 7, 16, -25, 34, 8, -33, 13, -59, 14, -20, 15, 28, 24, -14, -15, -44, 13, -4, 1, -19, -5, 13, -13, 33, 21, -43, -62, 19, 38, 29, 72, 51, 51, 42, 0, -12, -32, 26, -46, 7, 68, -6, 38, 7, -4, 42, 35, -27, 29, -42, -34, -16, 0, 0, 3, -45, -27, -36, -11, -3, 11, 22, -16, 10, 34, -22, 29, -2, 0, 41, 16, 22, -14, 59, -3, -10, -18, 13, -23, -10, 8, 37, 17, -27, 15, -1, 15, 10, 33, 24, 7, 39, -4, 5, -10, 34, 17, 52, 7, 13, -14, 67, -5, 17, -37, 4, 34, -28, 0, -51, -29, 23, 2, -2, -27, 37, 3, -9, 38, 50, 9, 42, 2, -68, -27, 12, 58, 40, 4, -46, 3, -21, -3, 9, -14, 14, 39, -9, -28, 49, -20, -19, 28, -29, -26, -20, -24, 22, -22, -43, -6, 19, -26, 3, -50, 4, 17, -15, -15, 10, -46, 3, -34, 25, -4, 31, 70, 11, 35, 28, 26, 43, 44, -3, -24, 4, 9, -10, -9, -47, 26, -1, 28, 6, 17, -35, 21, 32, 3, -29, 28, -34, 13, -8, 41, 48, 56, -2, 49, 33, -29, 19, -31, -27, 23, 23, 8, -25, -10, -35, 38, -24, 36, -2, 10, -56, -85, 51, 13, 35, -31, -2, 11, 30, 36, 5, 7, 32, -3, 31, 35, -9, 68, 26, 13, -3, -13, 33, -2, 88, 40, 27, 13]
7374A3j1N9o4QJ4k7K0l7jK6j4J1K6m6pN3m7N3n3rj1J8L9Rk4M2m9jL2n1K7mO1p9
7408b4L1n0N6J5M3r6Q5j7m6K1l4L9n4J6L4l3K9k5O2k7ko6J5J4J8M3p5kN5k8J3
7439A0j2J1j4J8K4Rn2j8N7pj3j5Ll5L5M7q8Q3j9p0K2K9k4K2j7N6m9l4M8k3J3L1
7471B8j7j6J7k3k7qJ12ol3m5k6P2l5K5k9LRk0K8Mk9k7J4M0p5J33m5K2j7n5L6j0
7503@J0n0O1rm3M3J1m4O5o6RK0l9L8K0K5o0J4K5k8kK1k0j8K7Kj0n5M2j0K0J1p7
7536f7J18j5p0O3nol1Lj4L3Jk7N3j2j5K0k4L0l1K2m7L6rk8M2j2l6N3k2PK8k1k6
7569iOJ0lMk4K4k9N6Qj9p4M2K8m5n8J56l8rKl2poK0j0J2N3q5K9L0Pj7j6M3l4l0
7604a5L8K6p3jK6K7J0nl9J0k5J6P6r6N2jn0J8K0pqJ2j4j9L0m0O1l9K8j3J3no4
$$ y = [13, 2, 61, -3, 5, 19, -8, 12, -25, -26, 0, -14, -3, 23, -23, -30, 23, -24, 29, -24, -33, -44, -26, 13, 22, -2, 40, -9, -10, 22, -29, -2, -6, 55, -24, 7, -43, 13, 28, 71, -25, 60, 43, -3, 18, -16, 23, -31, -15, 19, -14, 15, -10, 52, 25, 23, -43, -28, -14, 4, 47, -28, -30, 25, -3, 10, -2, 9, -5, 13, 37, 46, -6, -24, 33, 26, 13, -2, 1, -34, 1, 48, -40, 43, 24, -46, -24, 5, -19, 3, -14, 42, -7, -41, 7, -16, -3, 28, 11, -5, 12, -11, -38, -46, 66, 60, 27, -18, -44, 28, -7, 18, -11, -8, 1, -19, 9, 13, -16, -43, -29, 11, -64, 69, 24, 46, 29, -26, 10, 0, 10, -40, 21, 12, -31, 12, 23, -21, 44, -22, -13, 7, -32, 6, 26, 51, -9, 5, 30, 2, 0, 21, 1, -17, 10, 12, 2, -53, -11, -21, -1, 10, -67, 51, 36, -34, 29, 24, 18, -13, -10, -24, 9, 10, -17, 36, 24, 9, 29, 5, 35, 4, 26, -21, 15, 6, -22, 20, 8, -28, 25, 3, 10, 38, 17, -9, -3, 7, 4, 8, -16, 8, -21, 35, 43, 24, -50, -8, 20, -25, -83, 73, 35, 26, 28, -4, -11, -17, 3, -7, 5, 58, -27, 2, 32, 39, 22, 6, 49, 15, -15, 23, 49, -24, -25, 1, 28, 38, 33, -6, 4, -21, -5, 71, -25, 27, 26, -24, -6, 14, 7, -1, 11, -3, -22, 8, -32, 29, -10, 18, 5, 18, 13, -51]
7637e1N4lL8k4N7q5K5O2o4K2l1M1o6L9j9k4J4P4m2j4oPL1q2L4O1m6J9L6J6j03
7668c0J27q8pJ9J0n6M6k2l9M1MJ6j9j3N3j3lk2j0K7L2ln7Mk3M8j3l8L2kJ1l4K0
7701brMK1k0J5OKL3l8l7N7L3o7Mj1L0Or2Q8km7k0Q3j3l3M9j4j7m5Q3n5J7k5J7
7735Aj4L2k2m1Q0m3jJNj5OMk6O5n8N5M0p8L2lk3j3n1Q6jq0M5K6l9K0K2lPl8K9
7770GML1j4l9K1LOqM3m8nMqJ9nk2j3N3k0j7k0J8j1j7M6%MLJ1M9o6Qol8%j3M3k9
7808b6Oj8M1K2Nl8j1j7rQ3L6p8n5L1L5l9L1NK2J0k3j4kj3K9kLJ1K0n3P3o8K8j2
7842A3m6mM3k7L1J9p0J8O4Pn0Mk4K4o0N9JlJNPNlj9JqOJ5m6N5o0J49j34k4J42
7877I1n1qm1J8N3m9Qj5j3k3N2J2om5pJ3NO1q0N6pnk4J4m8J6j4M6K6ln1M5p5P2
$$ y = [-51, 3, 0, 38, 14, 71, -14, 11, 73, 9, 31, 0, 41, -25, 14, -5, -29, -15, 59, 17, 3, -3, 4, 35, -47, -13, 48, 2, 21, 57, 73, -30, 97, 9, 2, 21, 31, -25, 21, -1, -40, 1, 5, 21, 2, -11, 42, 29, 26, 4, -6, 21, 53, 50, -7, -3, -26, 22, 9, -29, 3, 1, 12, -22, -2, -11, -7, 14, -6, 9, 15, 17, 50, 12, -25, 32, 65, -2, 2, -9, 21, 27, -65, 23, 21, -26, -46, 37, 24, -9, 40, 26, 9, -36, 47, -8, 9, -16, 1, -13, 19, -3, -44, 36, -7, -8, -7, -2, -17, -11, -7, -33, 32, -26, 29, 69, -9, 23, 20, -3, -16, -67, 19, 18, -62, -17, 9, -30, -10, 12, 9, 16, -22, 7, 11, 42, 28, -11, 10, 13, 19, 11, 54, 6, 1, 5, -3, 16, 11, -11, -24, 29, 9, -8, -28, -10, -21, -38, 8, 8, 12, 15, 26, 75, 9, 17, 11, -27, -27, -40, 3, -26, -20, -38, 3, 25, 30, -8, -19, -36, -45, 38, 74, -4, -59, -28, 7, -32, -1, 4, 26, 36, 13, -1, -3, -16, 13, 11, 14, 25, 45, -8, 65, -3, 25, 13, -33, -37, 6, -21, 10, 29, -41, -23, 41, 48, -2, 2, -22, 2, -58, 1, 2, -1, 0, 5, 12, 17, 14, -5, -4, -12, -6, 9, -37, 18, -42, 107, -27, -51, 91, 40, 32, -9, 9, 62, 13, 21, 6, -7, -30, 22, 34, 28, -17, -24, -11, -6, 55, -25, 31, 24, 19, -5, 9, -39, -23, -37, 9, 35, 32, -19, 26, -49, 23]
7911B3m4MPJ8p0L1MM7k5j2J1L2k6j2L4j8k6L5pM1Kl4NNm5J9O4n6J2LL1r6N4Lr
7946El5P3l3J1L3q3J5NJ2j6l4L0K9k5jM7%j8ML9m3l1k0M7jm3lK3K6j6k0N4L3q6
7980b2j4Q3l7L2rp0j4L4K5n8L8M9J5l8m5L0Ql4J6k4P3Ok3Kj9Pl9M1k0j7NJ9mL1
8014B7l3O5m8j0K1k3M4nl6NL1j5m8K9j1K0k5l1K5L5n1N8j05Q8K2J2m9LK4qK2j5
8046A8kL9p1k1K2K0n2L0M8Jm8K6J4j9k2J0M8l0MJ7m0O1o2k7P3o1O3l7l1O2nl2
8078dm3N3l2LK3K0j2J1J8j7p9K4M0m9K8L7K5p8Q5pK0o0k2N8J0q3J3K7L5n6J1k3
8110b4L8l4L1K7rr1L6L2Ko9M3j2jJ1R2q8J0M3r4O5m0K3mk9L8Mj9O6m8K5Kj5m2
8143c1P5l4K7J5p0k0O9m3O0m7l9L8K2k1m3L8j5M1j5oJ7k8Mj8J8Pjm1R4jr0M3m5
$$ y = [23, -21, -17, -10, 8, -62, -31, -27, 20, -5, -17, -6, 26, 0, -12, 22, 4, -22, 13, 6, 47, 49, 15, 20, 25, -20, -1, 63, 7, 19, 22, 53, -43, 11, 14, 5, -30, 43, 10, 21, 54, -29, -14, -9, 3, -13, -47, -17, 12, -13, -14, 33, 33, 15, 19, 58, 15, -16, -36, 11, 10, -33, -36, -13, 13, -3, -23, 31, 64, -22, -36, 47, 10, 42, 33, -37, -51, -17, 8, -50, -12, 37, 52, 14, -31, -1, 7, -27, -11, -35, 38, 44, 21, 23, 4, 11, -28, 13, -7, -24, -19, 0, -4, 27, -6, 59, 11, 1, 22, -1, 43, 38, 2, 7, 38, 23, -25, 4, -7, 13, -12, -43, -18, 17, -34, 24, -81, 7, 29, 41, -8, -5, 19, 11, 33, 18, 16, 55, -16, -37, -15, 5, -47, -17, 31, 32, -16, 10, 24, 5, -17, -7, 41, 11, 15, 32, -8, 53, -9, -36, 37, -24, 39, 2, -29, 33, 28, -4, -47, 6, -26, -23, 0, 20, 8, 19, 37, 20, -59, -35, 5, -44, -16, 21, 46, -32, 53, 46, 66, 6, -16, 42, 52, -31, -18, 9, 44, -12, -1, -24, 14, -20, 11, 38, 29, -62, -26, 6, 8, -61, -18, -30, -31, -20, 72, -16, -6, 37, -57, 8, -32, -9, -13, -42, -4, 0, -19, 47, -1, 24, 26, 11, -31, 44, 10, 37, 52, -18, -38, 31, -12, 48, 1, -38, 0, 22, 1, -42, -4, -19, 22, 7, 1, 18, -10, -6, -24, -6, 1, 0, -41, 53, 52, -38, 5, -40]
8176d0L0Q2n6M4n2k0J4K2k8J1Jokk8M3
$$ y = [-40, -10, 72, 16, 60, 8, -12, 2, 24, -4, 7, 8, 2, 0, -28, 15]
8191A5
$$ Imaginary data points
##PAGE= N=2
##DATA TABLE= (X++(I..I)), XYDATA
0@%%%%%%%%%%%%%%Mm%lJ1j8K1k3K8l6M8n8O6p7R3j14J32j49J70j97K29k64L00
37A59l37L82m34M87n44O08o78P57q45R38j036J143j264J396j534J683j848K030
55A063k227K438k669K917l184L470l761M045m286M395m155K966J126j6957J49046
70A34227Q36500j257005l48044J364931o65900o69767J103062l23599j025312
79h50907J152881L46988j388672N35748J042275j101484j90264J088401o55813
88b0847o02168J058290j74903r39680P95464M04501r69661L47598O85679q65180
98b80907p3799R33465n63892o25739Q50878R6618p45823L90716L43225n86385
108b61643K30690M77768o84039j27027Q02630k97988o35145N35490K69001n17799
$$ y = [0, 0, 0, 0, 0, 0, 0, 0, 0, 0, 0, 0, 0, 0, 0, 4, 0, 0, -3, 8, -10, 11, -12, 16, -20, 28, -30, 36, -41, 52, -62, 70, -79, 91, -106, 123, -141, 159, -178, 204, -230, 257, -287, 321, -357, 400, -445, 493, -543, 600, -664, 732, -802, 881, -967, 1063, -1164, 1274, -1395, 1522, -1662, 1808, -1953, 2092, -2194, 2201, -1954, 1012, 2138, -14819, 134227, 970727, -286278, -634322, 730609, 64709, -605058, 498004, 174405, -850907, 301974, 648962, -739710, -203962, 838313, -263171, -453435, 634966, -20847, -623015, 435275, 260372, -679308, 116156, 520657, -449004, -101406, 584273, -280907, -354706, 578759, 14867, -610872, 240006, 336624, -409199, -18483, 324742, -261643, -30953, 446815, -237224, -364251, 438379, 140391, -494754, 40736, 309737, -208062]
118b08062J46189L12063m08186N7860M56326m24869k95395N85689k1645n32669
128c32699K99560L03585m20531M2374L95926l34816j91382M58502j26076l84028
138b89585L50582J09630m05792K21326L01673m39283m4255N03874k38493l71774
148c02097L91980O0672l58624K34748J28760l69558J97245L33974m37284j30823
158b51007N10939j47006l93441L29296R5066l32257K18372J54169l75132J26204
168f4797L50465l49263j68368M20113j01851l26973L07727Q3327l49215J89646
178i189K24015l30215P791L06135k20306j51066L18545q6453k84302K90555J20251
189A85761l58180J00409K75671k40474q4543K49142j25028j50254K60252l4667
$$ y = [-208062, -61873, 250190, -157996, -100136, 356190, -68679, -364074, 221615, 199970, -332699, -33139, 270446, -150085, -107711, 288215, -46601, -237983, 220519, 94443, -289585, 60997, 170627, -235165, -13839, 287834, -151449, -195704, 308170, 69677, -302097, 89883, 150555, -208069, 26679, 155439, -214119, -16874, 317100, -120184, -251007, 259932, 112926, -280515, 48781, 143847, -188410, 29962, 184131, -191001, -64797, 285668, -63595, -231963, 188150, 86299, -240674, 67053, 150380, -198835, -9189, 214826, -115389, -107598, 198537, -21769, -172835, 145710, 59257, -225045, 65510, 185761, -172419, -72010, 203661, -36813, -121356, 127786, 2758, -147496, 112756, 78089]
199G8089k86350K28571J87573l27411L405K92083j72793j40716K40986o4998k02614
210a64175K34288N8592l03012J43809K36897k91606m5777L08683j67042j89063
220a78406K88035j8526k78323K17516J35772l15200R5142K59138k91120n8172
230a44144L42041j85037k30227L33889J0982l26630K09637J69291l22678Q2305
240f0571K69103l00676o4490L62476j85199k44337L38705J6343l26012K09335
250A4677J64971l22750P8030K68334k85069p0149L39050j67652k20290L12160
260A11312M503k97902J99479J49796k98561O2957K47757k42251p3209K90628j34849
271A9660j88843K65228O163k61025J65475J44645k53591K7485K22734j82543q7217
$$ y = [78089, -208261, 20310, 207883, -119528, -116123, 175960, 3167, -137549, 103437, 38439, -164175, 70113, 128705, -174307, -30498, 206399, -85207, -130984, 177699, 10657, -178406, 109629, 91103, -187220, 30296, 166068, -149132, -53990, 205148, -85972, -144144, 197897, 12860, -217367, 116522, 127504, -199126, 10511, 179802, -142876, -60571, 208532, -92144, -156634, 205842, 20643, -223694, 115011, 131354, -194658, 14677, 179648, -143102, -65072, 203262, -81807, -151956, 187094, 19442, -200848, 111312, 115815, -182087, 17392, 167188, -131373, -68416, 179341, -62910, -136119, 154509, 19660, -169183, 96045, 102208, -158817, 6658, 151303, -102288, -74803, 147931, -34612, -121829]
282a21829K42352q5872j78684K08448L8123k27782J07491J51597k01479j8622
292h6257K07237j21634j19377K03303k3160j84477J49196Q3764k02361M5790J70138
303A22162j54599o9287K00416o5652j55471J74130L5532j97214J00194J27598
313A17809j86416l904J90862j23081j12695K01221k2965j86253J54297P6932k09539
324a03732P1211J60039j82764l6667K09116j05040j40305K03594N80k05620J45317
335A5729J01411k16942N4823J76497j79758n1072K16098r6354j50940K00206J2305
346H2003k07876J35276J08963k11320M3618J75752j66556n5988K02761q4399j43998
357a21764J82316J9072j93598J14260J09081j86623K5891J61042j37110o0671
$$ y = [-121829, 120523, 34651, -144033, 64415, 102538, -125244, -17753, 133844, -67635, -86257, 120980, -654, -120031, 83272, 60112, -124365, 24831, 108595, -93766, -47976, 122162, -32437, -101724, 98692, 33040, -122431, 51699, 87231, -109983, -9789, 117809, -68607, -72511, 118351, -4730, -117425, 83796, 60831, -125422, 28875, 105807, -103732, -32521, 127518, -55246, -91913, 117203, 12163, -128142, 75452, 76032, -129588, 15729, 117140, -99802, -44979, 131518, -48240, -99312, 116786, 20432, -130508, 69698, 82003, -125873, 9403, 118366, -92954, -49336, 126416, -40140, -96128, 106633, 22234, -121764, 60552, 79624, -113974, 286, 109367, -77256, -51365, 109677, -27433, -88104]
367h8104J74356n8771j31402J46666L1721j67058Q1373J09133j52126j973J45292
378H9107r5818p2861J40826k3775j23178J05653N4006j43138M1118J16191j18883
389c0752l5748J39320n6154r7488J17027J7705j26829O8477Q2412j28867M124
400d6773J31694r4843o9794J42444k4746j24125J05475N2882j39247M1925J10869
411H5761j21781k5914J45561p8662r4707J46917m857j43671J00374P4871j49515
422f5623K6686J30663j17871m7396J52381o3496j06783J42841M973j48975R7790
433E190Q4552j53416J6394J39804j09045o0107J48169m9671j08677J31981J1174
444E6348j43828R0106Q5719j47248Q684J38497r7094o7443J38185l4625j08490
$$ y = [-88104, 86252, 27481, -103921, 42745, 74466, -92592, -11219, 97914, -54212, -56185, 89107, -6711, -79572, 61254, 37479, -85699, 19954, 73960, -69178, -28060, 88131, -30752, -66500, 72820, 16666, -80822, 36205, 53910, -72919, -4442, 77970, -50897, -46773, 84921, -9922, -79716, 62728, 37982, -86143, 19332, 72214, -67033, -25108, 85761, -36020, -61934, 83627, 4965, -89742, 57175, 52318, -91353, 9021, 83892, -65623, -38937, 91726, -26145, -73541, 78840, 15344, -91439, 51402, 56375, -92600, 5190, 89742, -63674, -47280, 92524, -16521, -76628, 71541, 21870, -86807, 45174, 56348, -87480, 2626, 88345, -58903, -50219, 88278, -8816, -76259, 61926, 27301, -81189]
455h1189J15303K2664j33399P0993Q5697j27836j340J27969q1798p2748J28247
466E2563j4159j13853R0293M4984j16294M0331Q4104j00976j4386J16611o2580
477F638q3102J16372J2633j20629O0814P0516r9596P206Q6908p5561l3259J09920
489E8860l9045r7818J01759M0362j24345L6584R1042r2589j8192J01015n7767
500a34o0404J05968j1239j06651Q5186N4210j25225K9131J07032r9591l8956J21480
512F0807m2082q7015R8733J1511j06441P2586N6821j25902K9656J18845j06912
523a9393n5605J34013k6972j00275Q7785K2732j00529O4708N7759j21806K2705
534c4878J19991r7308o1209J25947j9327r7931Q0575K9628r8156M8504O5116j01571
$$ y = [-81189, 34114, 56778, -76621, -5628, 80069, -47767, -49107, 78862, -2936, -75684, 52563, 38404, -75449, 14844, 59828, -56466, -16135, 67969, -33007, -47393, 69218, 6638, -76464, 39908, 52541, -68088, -7274, 63242, -36354, -29148, 57760, -17801, -51060, 58860, 19815, -78003, 23756, 64118, -60227, -23643, 67399, -25190, -43382, 57633, -134, -60538, 45430, 34191, -72460, 12726, 66936, -58289, -29158, 77874, -21717, -60673, 60807, 18725, -68290, 30443, 41954, -64487, 8099, 64920, -60982, -31326, 87519, -19393, -74998, 59015, 32043, -68232, 19553, 42285, -58244, 6464, 64223, -57583, -34878, 85113, -12195, -73404, 52543, 33216, -64715, 15860, 45488, -52668, -4164, 60952, -40619]
546d0619M900J03100p5406n3288J08932j9452r3698P7449M2286r8105K1679P4452
558E2230o9794j4227P8533n4246m2983R6273j6230r6230O8527O0478r1962n643
570c5274P8189m4863k8850O6603l6088m8304Q4115Q39r5326M9753P0039q1501
582b0668j9616Q1388l5946m5765P0069j2780o4872O4268K3874q3549L0964O6192
594E3559p4740j9975Q9991l6456o7796P5982J5441p6377L9488L6553o7671K3006
606h995N9360p5037k0289R8355l3394q2429P4223L1825p7958K6882M0940o2041
618b8558J7808N9925p0370k5686R4774k5595q0173O8372L1330p7590K7689M7881
630C9807o4300M084O3550n2204l0617P5757j9575o5525O4340K5282q0481K5739
$$ y = [-40619, -35719, 67381, -8025, -61313, 47619, 28167, -65531, 11918, 54204, -43901, -22222, 52230, -17564, -31791, 46742, -7504, -50487, 45786, 29556, -66674, 1853, 62331, -29631, -35274, 42915, -1948, -30798, 35805, -283, -48587, 35528, 36367, -58959, -9206, 60833, -20668, -40284, 41104, 5158, -40607, 29462, 16682, -48190, 16078, 39952, -43597, -12633, 53559, -21181, -41156, 48835, 12379, -55417, 20565, 36006, -40371, -883, 35670, -32001, -8995, 50365, -24672, -44961, 53394, 20000, -62429, 11794, 43619, -34339, -7457, 33483, -28558, -10750, 49175, -21195, -46881, 47893, 22298, -57875, 10497, 41827, -35763, -8074, 39807, -24493, -20409, 43141, -9063, -39680, 36077, 16502, -49023, 15317, 40599, -39882, -14143]
642a4143N9915n9206j6339N9507k8158l1110N4723j3743n4118N7552K6731p8903
654c7292J4231O7716m5753l2105N2027j0087l3123M1689k063n1535M1763L5617
666D1085o7473n69O5500l4818l8358N1970m67m5555L5037J8928n1992J9472M2844
679C5604n2628r649O1919l1547m3371N9045P586o1366K9665L8700n1710J864M7038
692C1150m2831j4506O1917l0358m9827O3641J5522p0057K4324M8154n1202o156
704b0229N1129l8659k1652O2171k3136n3017N9063J8772o8818K2818M9738n2721
716a4541j0243N6575l3279l0774N8162j2118n0913M9393J8239o2590K2497M8605
728C9013n3399j4476O0122k5252l8255N0485k087m7097L9900J8861n7108J8500
$$ y = [-14143, 45772, -13434, -29773, 29734, 1576, -29534, 25189, 11446, -42672, 14880, 41611, -37292, -23061, 44655, -1098, -33203, 18824, 8737, -24386, 17303, 15240, -36295, 5468, 41085, -26388, -26957, 38543, 3725, -34633, 17337, 16870, -28685, 6352, 25280, -26712, -7240, 35604, -17024, -26673, 35246, 3699, -39672, 19373, 26959, -34407, -4742, 33958, -17752, -15888, 31150, -11681, -26187, 35730, 5372, -44455, 19186, 34708, -35349, -11025, 37129, -14073, -20229, 30900, -7759, -29411, 32760, 9624, -43393, 15670, 34442, -34376, -11558, 38180, -14541, -24784, 31791, -1488, -32262, 25900, 13782, -37131, 12262, 30501, -32089, -9592, 39013, -14386, -28862, 31260, 6008, -32247, 18238, 16151, -30946, 8954, 27815, -29293, -10793]
740a0793M8206m8740j9420N8662j7590m2183M4682O329m6668L0700K4025n0880
752b3670R943M7334m0242k3429N4397j0862m4731M0304J4669m8582K0749L2050
764B7930m3779j312M5493l0248k6854M9734m769m7561L5744K3116m9552J1186
776a0872L8689l7907j0430M5205k1973l1168M5496J527m8685L1335K8176m9552
788b0159N678M3008l4824j6515M5810j6539l4516M2013O318m8239K6887L0267
800B9189m8020K927M4565l3044k0319M5628j1736l6373L7494J0076m5793K2054
812c352L1153m3974p87M3645k8569k2433M2538o810l6538L1543J4390m1607J4800
825f001L1394l6873n744M0246k1454k4291L6690j056l5036K4276J8437l6811O333
$$ y = [-10793, 37413, -11327, -30747, 27915, 10325, -31858, 12824, 19153, -27515, 3185, 27210, -23670, -13727, 33607, -6635, -30064, 24333, 13471, -31260, 9044, 23713, -24869, -4120, 27930, -15849, -17161, 28332, -1916, -28770, 20964, 16195, -31366, 4378, 27494, -22058, -10872, 27817, -10090, -20520, 24685, 2712, -28456, 17040, 18567, -30118, 1217, 29393, -20159, -14481, 28527, -6297, -22812, 22998, 6459, -28057, 13956, 20274, -27965, -1078, 29189, -18831, -15904, 28661, -4383, -24702, 20926, 9190, -27183, 10311, 20387, -25406, -3352, 27801, -16173, -16960, 26685, -1884, -24317, 18221, 11411, -25127, 6416, 20806, -20801, -6001, 25393, -11480, -17224, 23022, 1568, -22723, 13967, 12911, -22125, 2151, 20588, -16223, -9890]
838i890L2236k8503j1884L6426j3541k6470L1079N606l4291J6810K3061l2273
850a1634j266L3531k1912j8250L4535n598l0136K5870J2309l3944J0199K7389
862B1093k8950q213L5369j6483k4326L3588J110l3995K1658J8673l3863M563L0742
875B0966k6119j3212L6483j1994k8778L2175O411l6033J8368K2706l3337K88L2943
888B0867k3115j6991L5644q094l0683K9946R702l6439J5347K4972l1856k850L3336
901A9786j9996j9646L3764m087l1006K6350J2011l4749J2408K5829k9497n621
913a4454L2688j6137k1240L0548k79l0138K1822J4297l1812Q388K5431k5585q109
926a4580L0619j1925k2439K6478M138k8844J6083J6915k7881K900K5353j9985
$$ y = [-9890, 22346, -6157, -18041, 18385, 4844, -21626, 9453, 15059, -19232, -2422, 20639, -11634, -12900, 20631, -1281, -19531, 15004, 9406, -20730, 5140, 17449, -16495, -6296, 21093, -7857, -16070, 19299, 2816, -21510, 12078, 13188, -20807, 851, 19524, -14339, -9776, 20966, -5153, -18365, 18118, 6124, -22654, 9521, 15932, -20101, -1733, 20973, -12364, -12076, 20867, -2248, -19239, 16405, 8311, -22372, 7574, 17276, -19163, -3816, 21156, -10700, -13550, 19786, -210, -19856, 13908, 9821, -21185, 5165, 17176, -17573, -5165, 20664, -8833, -14454, 18234, 2097, -19143, 11405, 11126, -19012, 2810, 17107, -14705, -6317, 19114, -6471, -14580, 16039, 4114, -18325, 8153, 12291, -16553, -470, 16445, -11436, -8536, 16817, -3168]
938c168j1502K7258o438k3079K1769Q924k7806R942K0578k3756l432K5358j3944
951G04j5319K4232r45k4116J7242J3240k7008M826K4004k0977r331K6367q931
964C988j9278K1982L811k5236J3894J6801k6431R07K6542j9036j3407K7690n493
977F734k2808K0588Q042k5892J0573J8909k4868j877K7488j7353j6005K7982k852
990H661k5059J8954J1264k5627O697K0512k1818m779K6321j4418j7233K6662m54
1003I683k5704J6623J3926k4567L020K1463j8125p809K4211j0430j7327K3697
1015H661J264k5062J4736J5590k3678l12K2358j4479j0983K2027o173j7726K0205
1028F428L463k3707J2281J6484k2407k979K3398j1416j4549K0486j144j8717J6052
$$ y = [-3168, -14670, 12588, 6150, -16929, 4840, 13764, -14042, -4100, 16478, -7278, -10710, 14648, 704, -14615, 9617, 8672, -15444, 1798, 15038, -11970, -7144, 16860, -4117, -13448, 12919, 3988, -15290, 6692, 10503, -14733, -839, 15962, -10469, -9562, 16980, -2056, -15463, 12227, 6734, -16074, 4514, 12556, -13336, -2763, 16146, -8722, -10599, 16889, -464, -16469, 11513, 8661, -16398, 2556, 13820, -11807, -5110, 15402, -6416, -11195, 15126, 708, -16525, 10137, 9683, -16021, 602, 14528, -10039, -7019, 14444, -3681, -11490, 12721, 2291, -15036, 8661, 9925, -15137, -401, 15189, -8489, -8801, 13557, -922, -11905, 10122, 3949, -13777, 6428, 9891, -13816, -1535, 14949, -7458, -10437, 12961, 1545, -13004, 7482, 6338, -12379, 3673]
1041C673O604k1988Q969J7136k0301n024K3586r271j7460J9893L370k0618J1671
1054B40J0439j9552M856J6869j7650o378K3184p521j9520J9199P120k2141Q040
1067b815J3934j7446Q28J6764j4536p471K1805n908k0021J8313R098k2830N805
1080d480J6446j6431k497J7196j1303q984J9026l865j8514J6418R183k2647M924
1093e528J8350j5869o158J7821p135j0758J5366j212j6071J3650Q899k1156L757
1106f044J9352j4798r127J7930l137j2585J1852J906j4093R930R076j8422J751
1119f409J8765j2761j0744J7441o54j4314R652N732j3393N237J0342j4557p86
1132f449J7110j0516j1244J7229R29j6463Q540R639j3578O77J2056j0715l456
$$ y = [3673, 10277, -11711, -2742, 14394, -5907, -10931, 12655, 3384, -14076, 5817, 9187, -11431, 240, 10679, -8873, -4017, 12852, -4798, -11176, 12008, 4487, -15033, 4166, 11286, -10855, -2815, 11119, -6327, -5499, 11265, -3271, -10742, 11063, 5155, -14866, 3447, 12545, -10285, -4480, 11966, -4465, -6962, 10234, -1069, -10053, 8973, 5108, -13406, 3012, 12195, -10452, -5528, 12822, -3047, -9205, 8616, 1481, -9277, 6089, 4877, -11194, 2456, 11355, -9801, -6044, 13308, -1490, -10617, 7313, 4176, -8409, 3443, 5349, -8744, 1186, 10262, -8160, -6409, 12356, -405, -11149, 6292, 5638, -8676, 976, 6708, -6685, -1448, 8894, -5663, -6449, 10661, 145, -11099, 6130, 7059, -9404, -864, 8775, -4803, -4126, 7930, -2785, -6241]
1145f241J5294q470j1419J7046J793j8251P814J2726j3874k679J3555q050o042
1158f798J4136n883j1744J5441K884j8054P265J3518j4079m185J5037o349q812
1171g623J3265k383j2211J2520M034j6319O262J2972j3893m827J6231n275j1572
1184h819J2413J423j2498R043N047j4065N084J2217j3196n341J6518l852j3304
1197i330J1432M274j2782O199O766j2196K794J1628j1123n855J5413k632j3819
1210i231J0585O112j3395L893Q942j0652l62J1240q025o592J3307j364j3508R873
1224H23P417j4059J818J1438r143l551J0957n017p468J1307J99j3027Q505Q674
1238H873j4162J37J3080q157o188J1256k622q715R689J904j2540O760R361j3506
$$ y = [-6241, 9053, 583, -10836, 6210, 8003, -10248, -2434, 10292, -3582, -6261, 7294, -756, -6798, 7338, 1455, -10289, 5152, 8036, -10018, -2753, 10765, -3314, -7499, 7538, 1189, -7623, 5642, 3259, -8952, 3568, 7602, -8717, -2455, 10517, -3376, -8203, 8028, 2753, -8819, 3594, 5017, -7481, 1562, 6609, -7456, -2372, 9845, -3351, -8692, 7826, 3974, -9330, 2102, 6376, -6406, -207, 6559, -5637, -2843, 8785, -2338, -8193, 7220, 4588, -9231, 1354, 7466, -5929, -2036, 6906, -3746, -4108, 7132, -893, -7485, 5822, 4458, -9050, 823, 8240, -5819, -4001, 7437, -1706, -5257, 5700, 683, -6785, 4522, 4721, -8306, 199, 8873, -5289, -5152, 7928, -229, -6417, 4839, 2217, -6498, 3191, 5095, -7445, -685, 8676, -4830]
1252d830r05J3769p867p581J1924j016j0218Q380L914j1835M896R400j2165j570
1266e704J3690p361q466J2188J48j1178P266N522j1190K818R554j0409k439J2827
1280G266o428q617J1633J042j1458O137O569j0224R32R629q399l608J1539m637
1294A376q498J0377J737j1112N172P343r490p03R728o423m924J0315k729q691
1308f522Q929K634j0414L843P795q719k095J0009m895o445R517o92q863P097L910
1323E089r716K484Q010p537l175R770l376p483Q690J159r230N430N084q826J051
1338b576Q092o394m203R369k005q146P692K520r242M011O097q085l65Q122n001
1353a14m885Q480p33q282O631L595r013K804O802p318j656Q216l647n804P554
$$ y = [-4830, -5735, 8034, 167, -7414, 4510, 3494, -6724, 1656, 5570, -6265, -1369, 8031, -4134, -5704, 7986, 625, -7841, 4347, 4495, -6683, 583, 6105, -5085, -2267, 7287, -3122, -5561, 7266, 838, -7779, 3854, 4896, -6562, -425, 6144, -4080, -3148, 6481, -1918, -5526, 6013, 1376, -7122, 3255, 4992, -6120, -948, 6395, -3095, -3798, 5930, -493, -5417, 4898, 2169, -6522, 2407, 5041, -5373, -1530, 6265, -2454, -4549, 5460, 565, -5880, 3637, 2945, -5918, 1179, 5089, -4627, -2143, 5867, -1670, -4845, 4925, 1549, -5934, 2756, 3915, -5315, 115, 5199, -3627, -2576, 5516, -878, -5081, 4288, 2283, -5863, 1829, 4349, -4893, -882, 5215, -2870, -3235, 4887, -114, -4999, 3481, 2748, -5534, 1097, 4692, -4321, -1517, 5285, -2033, -3689, 4527, 880, -4924, 2630]
1368B630N98q147N405M358q697J730P427o618k843Q108k511o286O623J777q054
1383d500M110N205p970N14P526n553l719P727j234o756N712K936p772K561O118
1398D905p007r96P529m362m392P230l57p103M869M117p655J015O851n984k300
1413c640P498l183n087O649O58p212M020M873p406O4P424n222l411P490k109n762
1429d356O190J432p201L268N376p064o95P652m610m435P637j196o397N537K304
1444C442p036K414N618o407j361P573l886m939P347k42o800M796L212o699J320
1459a648N823n389k188P347l066n356O793N91o946M056L858o287L85N863m449
1474f13k949O756j980n502O004J284o803L324M292n898l47N998l542l715O214
$$ y = [2630, 3228, -4919, 486, 4844, -3853, -2123, 5304, -1314, -4157, 3951, 1440, -4846, 1777, 3554, -4500, -390, 4815, -3155, -2641, 4885, -668, -4387, 3340, 2106, -4650, 1062, 3998, -3774, -1213, 4905, -2102, -3098, 4431, 69, -4323, 2907, 2550, -4553, 316, 4433, -3222, -2207, 4644, -1340, -3640, 3858, 675, -4412, 2237, 2895, -4317, -297, 4576, -2830, -2766, 4658, -564, -3975, 3515, 1406, -4356, 1834, 3266, -3935, -667, 4709, -2355, -3050, 4602, -8, -4443, 3194, 1998, -4399, 1138, 3442, -3594, -1180, 4438, -1969, -3330, 4243, 357, -4582, 2765, 2523, -4277, 519, 3731, -2968, -1648, 4175, -1214, -3402, 3945, 879, -4477, 2316, 2907, -4039, 17, 3875, -2412, -2027, 3836, -613, -3562, 3194, 1214, -4288, 1716, 3000, -3803, -479, 3813, -2085, -2432, 3566, 24, -3691, 2523]
1489B523o67n717N001J975o442K605M621n511j155O176k757m346N585L96n811
1504c524L858K848n930J609M711m846j641N966k031m766N074J422n945K872L660
1519C337n501N43M929m018k148N512j399m848M705J949o135K154M358n007m45
1534b014M920l150k488M974q68m793M185K278n983J633M810m669j322N063k274
1549C02k928M292k40m310L418K566n615J105M969m331j927N112j500l504L635
1564A044O97m098K413K658m858O09M886l914k448N214q60m096L098J727l943J337
1580e34K919l906j07M623l279k754N150l76m587K845K548l982L54L382l125q52
1596a681M213k600k774M778j24m790K728L056m173l33L951k444j808L936j653
$$ y = [2523, 1856, -3861, 1140, 3115, -3327, -722, 3899, -1612, -2767, 3409, 652, -3694, 1891, 2287, -3524, 334, 3182, -2748, -1139, 3572, -1274, -2915, 3051, 1020, -3746, 1328, 2750, -3195, -323, 3337, -2164, -1621, 3308, -710, -2858, 2654, 1255, -3593, 1112, 3061, -3074, -920, 3438, -1569, -2014, 2906, -244, -2732, 2242, 1374, -3419, 766, 3044, -2939, -1306, 3504, -1165, -2487, 2576, 302, -2626, 1666, 1426, -2884, 534, 3100, -2515, -1410, 3559, -772, -2699, 2413, 913, -2591, 1044, 1741, -2357, 56, 2714, -2144, -1535, 3351, -563, -3011, 2203, 1343, -2753, 345, 2072, -1871, -534, 2385, -1521, -1628, 2995, -284, -3038, 2112, 1736, -2851, -6, 2542, -1440, -1086, 2296, -829, -1681, 2532, -68, -2842, 1936, 1812, -2978, -250, 2806, -1367, -1700, 2251, -193, -2001, 1935, 282]
1611B82k908M252J43m621K596L275m273q18M370j875k650L664n58l052L358N06
1627A691m237K311L175m234r78M654j599l386L579M29l411K446J165l601J601
1642c95K951l790r89M683j463l781L514J242l759J702J818l112Q87K715l141j048
1658a966M259j296l918L509J735m108R92K704k838k9K725k289j296L660q91l714
1674b761L257J920m399Q83L380k718r70K844j378j583K921m65l317K876J982m394
1690a922O38L778k735j641L190p17k153K373J63l007K313J965m144N08L955k709
1706a45k059L526l27k718K126P83k731J537K012l567M06L703k735j997L597j44
1722A267l101J908J428k695Q18K094k925N0L366k406k026L675j60l253J753J865
$$ y = [282, -2626, 1626, 1769, -2852, -256, 3019, -1254, -2072, 2298, 423, -2227, 1437, 879, -2173, 1185, 1691, -2546, -235, 2940, -1294, -2272, 2382, 783, -2603, 976, 1405, -2006, 440, 1605, -1996, -395, 2556, -1234, -2223, 2460, 997, -2784, 730, 1972, -1787, -85, 1733, -1379, -492, 2223, -918, -1966, 2293, 997, -2921, 588, 2323, -1785, -793, 1911, -927, -956, 1769, -520, -1816, 1844, 953, -2761, 496, 2416, -1983, -1100, 2280, -438, -1408, 1436, 58, -1525, 1396, 931, -2386, 490, 2472, -1922, -1284, 2494, -241, -1882, 1308, 591, -1562, 811, 974, -2033, 280, 2245, -1899, -1391, 2564, -145, -2204, 1322, 995, -1723, 403, 1186, -1545, -8, 2004, -1563, -1157, 2546, -189, -2186, 1411, 1267, -1834, 74, 1502, -1193, -375, 1719, -1206, -1156, 2210, -196, -2222, 1453, 1293, -1960, -207, 1658]
1738A658k629K08K308k221m98L003j883j909L308l5l194J706K032k649k92K622
1754A535j707j036K601j230j877K806R2l016J544K156k640n79K831j317j646K481
1770I98m58k048K215M60k685J261K104k476q08K989j040k118K390J35k237J554
1786B36R89k450Q28K013k128r39K849p97k381K346O28k617J329J354k205L48K006
1803A409j725j095K708o38k411K271Q85k778J051J723k123m1K104j440j294K497
1819A103k75k476K031J051k746Q10K028k141l62K159j072j521K187L5k317J679
1835A73J196k603O24K152k064n79K246p47j738J947M02k282J281J390k406M53
1851e55K057j825q25K191n89j756J639P43k240Q50J640k068l8K051j416j018K028
$$ y = [1658, -971, -763, 1545, -676, -1174, 1829, -54, -1963, 1345, 1310, -1884, -178, 1854, -795, -1087, 1535, -172, -1208, 1393, 163, -1714, 1092, 1184, -1832, -288, 1868, -772, -1351, 1480, 163, -1483, 998, 540, -1508, 707, 1167, -1518, -257, 1847, -629, -1437, 1552, 512, -1606, 784, 919, -1318, 236, 1225, -1225, -397, 1616, -512, -1451, 1398, 601, -1780, 566, 1194, -1423, -94, 1260, -945, -597, 1409, -316, -1411, 1297, 659, -1752, 519, 1404, -1374, -323, 1400, -723, -764, 1340, -100, -1394, 1103, 828, -1648, 383, 1434, -1312, -502, 1526, -615, -977, 1182, 110, -1411, 776, 811, -1506, 173, 1369, -1234, -610, 1542, -522, -1101, 1145, 398, -1340, 607, 1009, -1273, 8, 1398, -1008, -555, 1502, -323, -1148, 1043, 454, -1302, 337, 1080, -1160, -310, 1330, -738, -776, 1275, -141, -1159, 869]
1868H69l10j788J433R80k188N41J855j893l80K034j157j039J854j58j838J312
1884A27J068k048J56J988j584p44K027q51j246J623J53j695R73J156j886J18J955
1901A290j450r18K040n21j478J466L50j678P55J247j645j41J875j220j214K087
1917H45k10j738J289O38j581M61J205j392l26J886j013j217J869o4j746J131R26
1934I63j555J58J352j143n55J665o58j300J703N6j732J097R71j544o5J456q85
1951a6q36J589l63j411J506K45j772R29J136j554j81J565p13j068J479n5j460
1968i80J236N28j658P32J224j514l16J582o00j208J451K31j644J056P47j576M31
1985b78J218j290m19J591o23j229J405L76j624Q36R70j545J88J348j196m55J443
$$ y = [869, 559, -1229, 204, 1184, -1004, -463, 1392, -501, -881, 1153, -4, -1043, 811, 653, -1185, 127, 1195, -853, -697, 1291, -293, -1037, 990, 139, -1107, 516, 669, -1026, -53, 1103, -783, -665, 1290, -160, -1078, 962, 441, -1037, 429, 779, -899, -144, 1103, -542, -683, 1192, -28, -1242, 845, 635, -1103, 186, 824, -757, -296, 909, -483, -809, 1077, 64, -1153, 716, 652, -1094, 37, 963, -592, -434, 918, -225, -780, 885, 227, -1073, 630, 686, -1046, 51, 1022, -522, -587, 869, -16, -852, 737, 374, -1037, 469, 714, -1058, -129, 1007, -547, -728, 837, 124, -944, 535, 480, -980, 256, 784, -874, -142, 1082, -432, -748, 834, 234, -974, 477, 708, -936, 120, 867, -709, -278, 940, -350, -769, 822, 199, -1030, 375, 751, -873, -37, 933, -612, -424, 924, -272, -727, 716]
2002G16m29j237J304M64j687P24J117j443j6J330r83n51J320l08j198J087N68
2019G78j556N12J173j346k22J416p47p45J211k8j255R43O09j392M06J183j316
2036c76k89J465o36r18J116J95j141N49P69j268J45J246j146m28J467m98j084
2053h32J076L07j162M14R01j022j57J277q70o53J346l52j072J017N12j292K79
2070b83J032r09m02J163m93p59J180k23j064R06N44j231R3J260q94o11J228k91
2088B46r34J047K2j087P78N64j142J13J222q29p71J276r8j056Q19L21j050N94
2106C5N82j012k7J217p65q66J270P3j202P44N13r75K93O17p89p4R79o20p89J253
2126D57J51j376P51P02j044J06P48n77k26Q14m57p91J178J08j302O64R11j176
$$ y = [716, 287, -950, 354, 818, -869, -145, 972, -471, -487, 843, -140, -691, 629, 321, -877, 210, 778, -778, -266, 907, -439, -661, 755, 8, -737, 474, 446, -809, 134, 743, -649, -243, 940, -376, -665, 800, 164, -754, 362, 557, -584, -35, 734, -534, -389, 857, -289, -717, 750, 252, -832, 244, 551, -611, -197, 704, -318, -475, 802, -68, -721, 625, 273, -799, 218, 730, -562, -283, 749, -160, -562, 601, 108, -651, 529, 306, -758, 148, 692, -539, -446, 814, -80, -691, 537, 246, -688, 359, 381, -706, 72, 636, -506, -393, 829, 0, -771, 505, 407, -649, 170, 491, -559, 35, 617, -395, -422, 795, 30, -836, 434, 507, -695, 49, 562, -413, -120, 497, -292, -366, 613, -7, -796, 457, 608, -768, -17, 685, -359, -253, 495, -82, -308, 506, 49, -742, 436, 544, -758, -94, 817, -359]
2144c59j06R16m12m67P85k07p50Q58K64j265O11R24j102k80J212l89p16P12N8
2163B87p73O50L14j078N29Q26j114k07J169l02r31P09K94q14M41M42r39L72Q70
2182G45j080k87J241m28r08Q15M17r45K77O87q53Q9Q72q88k82J184l88r91R48
2201B25M34j038J19Q15o66j91P41n24l68R49l03q57P85M88j061Q4R63o47m07Q63
2221D04l81m60P83j52p64P10M77j019K9R74n30o22Q88j61o01O65k9o60N70L07
2241D28q27O0R86o41o37R85m0p98O01J47n91L70L47o58J5Q55n72o31R38K2p88
2262d29M68L59p13K31M21n32j17P70l61o83Q78J14r22M92N08p23j6O01m33k00
2282b87O18k74n59P79J26q84L87O26p92QO18l36l27N88j03o43O42K41r40L85P03
$$ y = [-359, -465, 451, 39, -428, 357, 150, -600, 258, 522, -743, -132, 792, -310, -590, 622, 233, -483, 229, 287, -486, 164, 478, -600, -71, 755, -359, -566, 603, 301, -630, 79, 373, -441, 0, 442, -497, -125, 745, -335, -622, 619, 191, -717, 98, 515, -430, -153, 534, -319, -230, 642, -246, -528, 656, 268, -723, 225, 659, -379, -260, 555, -111, -302, 439, -85, -453, 496, 193, -664, 121, 609, -452, -368, 595, -52, -459, 404, 23, -437, 346, 194, -570, 140, 617, -402, -373, 601, 71, -551, 337, 176, -425, 240, 211, -449, 121, 428, -399, -339, 647, 6, -631, 354, 314, -484, 117, 264, -327, 43, 390, -268, -253, 602, 30, -601, 337, 359, -429, 39, 398, -315, -84, 337, -195, -312, 458, 97, -586, 292, 406, -516, -24, 484, -239, -255, 346, -87, -287, 331, 57, -502, 277, 403, -481, -94, 532, -260, -252, 366, 30, -297, 291, 188, -455, 187, 428, -512, -127, 576]
2303E76p72j35O64k46m67N45O6o50M49L41p92K52O35o47k09P39j50n96N37J80
2323C20o09K54M41o43L8O91o00k51P28j93o09N69K91p65K34N69o48j27P23m77
2343f4l03O61j43n91M77L71p88J86O54n77k10P15l40l78N73No81N44L20p42J02
2364b09O58n46k62P33k57n48O75Mo57M65K80o17N6O74n31l81Q78k71n80O16P0
2385B50n83L57L27n31p9O75m32m12P30j11o14N29J89o22K64L61m53j09O22l80
2405b2m00O99n2o90N73K57o55J53M69l99k07N98k23m07N19L4o14M54K87n66J4
2426a78N30l55k98N64j05m66M62Q2o49M18L39n91M1N58l48l43M75P9n65M10J93
2447B53n46K14M23n42l5N04k49l86N59M8n97M32K86n70J33M37m74j72N54k32m01
$$ y = [576, -196, -331, 333, 87, -380, 165, 231, -419, 30, 371, -421, -169, 466, -181, -390, 349, 199, -397, 140, 320, -289, -35, 406, -237, -199, 492, -108, -359, 369, 176, -433, 136, 427, -338, -104, 465, -183, -310, 413, -64, -367, 294, 151, -440, 37, 408, -380, -194, 460, -117, -327, 388, 48, -330, 243, 248, -433, 111, 431, -311, -209, 449, -97, -359, 374, 117, -431, 244, 248, -409, 56, 336, -281, -225, 449, -82, -463, 415, 144, -436, 180, 250, -333, 24, 351, -180, -259, 416, -16, -428, 302, 191, -423, 106, 295, -327, -63, 298, -155, -264, 358, -22, -422, 277, 225, -465, 108, 365, -290, -137, 332, -67, -274, 324, 101, -306, 213, 247, -367, 87, 374, -192, -178, 352, -3, -301, 263, 158, -308, 154, 236, -413, 5, 344, -247, -206, 352, 4, -339, 136, 215, -350, 60, 253, -293, -79, 344, -198, -233, 271, 22, -364, 195, 243, -354, 78, 364, -206, -73, 364, -110, -282, 272, 40, -361]
2468c61M89J72o38K87L94n05j6M89l64k13N46k15l99M88J80o49K78M08n40j2M82
2489C01l49j89M65p2m93M18J98n22J86M10m87j92O26k59l75M98M2m53K03K72m19
2510a91K2N85n14k17O07j79l96M02J18m74J48L60m04m9N23l96k77O52k22m19L88
2531F7K10m88P8M51m33j71N22k39k66N72j39m89M42K37n84P7M64k96k27M95k37
2552D6l09M18J8m69L13K66n14J05M78l86k92O02k27l52M03J11n03L06K40m03q
2573a57M41l28k08N08l8n31L80K57n98K19L51m19k2M49k83k68M66j7n39L56L01
2594C20n32J24L60l49r8M10k14l27M81j6m87L41K66m71P3M37l89j15L61p1k95
2615a91K90J25m67K51K80m46O0L84l17k21L93J8l86L02J45m04J45L13m37j1N03
$$ y = [-361, 128, 300, -338, -51, 343, -162, -178, 311, -53, -266, 280, 65, -334, 154, 334, -315, -37, 371, -169, -181, 301, -48, -237, 228, 156, -337, 81, 279, -243, -57, 353, -134, -326, 300, 41, -334, 164, 206, -247, -44, 228, -191, -169, 416, -98, -315, 292, 113, -283, 119, 237, -237, -89, 271, -133, -182, 341, -55, -332, 320, 98, -321, 67, 277, -211, -133, 318, -115, -286, 236, -3, -269, 303, 164, -325, 117, 354, -230, -153, 311, 15, -212, 283, 46, -263, 155, 173, -296, 17, 283, -231, -126, 352, -34, -326, 276, 49, -303, 100, 211, -292, 14, 254, -149, -157, 284, -44, -252, 256, 218, -313, 67, 324, -274, -55, 296, -123, -145, 304, 21, -247, 219, 202, -337, 19, 320, -212, -88, 272, -77, -175, 235, 21, -306, 175, 159, -328, 13, 279, -192, -119, 318, -71, -186, 175, 104, -191, 99, 224, -243, 8, 288, -158, -98, 286, -31, -252, 141, 159, -227, 75, 220, -184, -39, 274, -163, -174, 329]
2636C29k83k81M10l6l15J01L77m37L1L19l32q5N01k38l52M25L8m45K01L18l87
2657a41M6K79k74j04M49k80k41L40J07m63J99L50l55n5L52k37j79M05j20l04L38
2678A12J41m33R4L31l11j55M21j30k82L14K1l55K89J04l38J03L33k70k95M46J
2699A41l97K84J04l24J81K00l74J67K85k78j88L66rm00K65K54m67J60K80l75J6
2720a09L26k56k30M61m5m39K84K33l73L4K85j94o5K69j74j65L02Pl81K64K33m26
2742a59M1K70j74j45L10r0k32L04N4m61K98K42m43L8L93j74k85L46m9k85K45J15
2764A59l75K19L15m86LM30k81j54K68P8l27J53J33k64N2K83l20n2L70j63k96L50
2786I5L7l30J39K27l00J8K88k60k5K51j23j65K92N4l38P1K84k79j4K62k44j26
$$ y = [329, 46, -235, 175, 139, -176, -75, 302, -135, -104, 215, -117, -202, 299, 61, -291, 134, 172, -273, -72, 246, -141, -95, 184, -90, -194, 255, -25, -266, 74, 181, -282, -83, 267, -88, -143, 209, -28, -207, 198, 78, -226, 112, 253, -180, -86, 245, -66, -221, 200, 70, -212, 102, 123, -232, 57, 161, -177, -74, 259, -11, -306, 140, 141, -256, 28, 132, -192, -11, 189, -185, -18, 267, -11, -199, 167, 158, -242, 23, 277, -190, -30, 250, -125, -109, 217, -39, -269, 192, 147, -292, -8, 225, -148, -114, 171, -23, -88, 181, 7, -158, 144, 151, -230, 34, 267, -159, -118, 152, -22, -167, 143, 53, -179, 125, 179, -282, 16, 258, -185, -147, 246, 72, -213, 133, 84, -201, 44, 159, -216, 3, 318, -168, -165, 265, -16, -170, 98, 176, -151, 2, 135, -129, -77, 206, -114, -166, 204, 41, -255, 95, 132, -198, -59, 168, -132, -114, 174, -86, -111, 140, 17, -148, 144, 198, -140, -69, 215, -64, -78, 184, -60, -186]
2808a86L41j09k24K34J01l01M7K72k07q7L13k32r5K30m9k11K23J06l44J04K42
2829A68k20j42L11q7j79K22Ok17J52J52k45j8L15k49j38L03l5k86K82O3k69J26
2851A5J25k64L3K73j87j84L19n7k78K72R4l14J13K05k32o2K95r4k20K26pk50K16
2874C7J35k68J5K10j96k2J91q0j42J67M8k54J75J51k90M0K33j43j84L03m2k23
2896a39K20K7k73J83J98k68lK13k04q5K49K5l47J18K51k94R5J89k59jK44j14j75
2919a50J85P8l08J64J99k86P4K50j92j55K82j28j32K38k9k17J80J64l33L2K17
2940A33j60j24K31j7k60K73Rk60J66J87l11k7L59j91j41K34k0k33J85Q2j66j7
2962f8K23k43n5L21j11k00J88Lj70J83J06k36K8J64k69K3K69j17j99J81J10k46
$$ y = [-186, 155, 46, -178, 56, 157, -144, -97, 175, -32, -119, 194, -38, -133, 97, 48, -163, 60, 166, -178, -74, 168, -52, -194, 117, 30, -149, 73, 79, -138, 14, 166, -79, -97, 218, -31, -169, 134, 99, -187, 95, 158, -111, 15, 140, -124, -91, 182, -5, -189, 130, 73, -205, 67, 161, -153, -40, 165, -67, -129, 166, 72, -148, 78, 71, -179, 37, 172, -96, -81, 129, -67, -89, 102, 22, -120, 47, 95, -159, 16, 167, -123, -83, 150, 7, -177, 126, 84, -139, 81, 108, -165, 18, 216, -52, -55, 158, -46, -131, 118, 143, -204, -86, 165, -129, -34, 155, -104, -105, 139, 25, -150, 35, 113, -195, -31, 168, -118, -44, 206, 14, -141, 141, 13, -119, 119, 90, -127, 53, 217, -116, -84, 133, -27, -151, 80, 63, -197, 76, 85, -175, -9, 178, -133, -160, 199, 8, -133, 101, 81, -152, 33, 115, -51, -68, 155, -88, -143, 178, 67, -133, 55, 58, -112, 71, 177, -59, -31, 133, -136, -113, 156, 39, -160, 21, 131, -115]
2984a15J23J26j68m0K06j53j10K49o4k25K00O0k19N0J83j71pJ42q0j26K40o6j87
3007a52K33L0j81j8K43j46j32K77j59j05J97o3j43J77N7j60J0J76j15j24K09l
3029A08j81R7P6j88O8J44k31k7K51j83j12K85J5k69J42Q6j75Q4J19k35O2J71q3
3052B4j84K62Lk01R1J01j96Q3J86j88p5K19j25j24J74Rj67J10Q2j19K5J43j27
3075Fo7J84q5j72J51Q1k54J20J83j74m1J54j42K0O9qj32J30M6j46N8J33j75l7
3099i8K16p3j42J24M6k16J26J16j19j8J73j63q1J38k6j18J36O9j96J02J00j41
3121d5m2K46k36l3J52L2k06J37R0k18P7J58j60n8K49j43r2J90Pj79Q2M6p4l8J72
3146A14j56r6K74l7k02J72k5j00J59l0j38N1J17j10p9K33j66j28K16k7j21Q8O9
$$ y = [-115, 8, 134, -34, -74, 132, -21, -131, 118, 54, -171, 29, 89, -130, -80, 103, -68, -75, 67, -13, -139, 101, 35, -152, 81, 111, -70, -88, 155, 9, -123, 154, -5, -110, 87, 24, -119, 58, 115, -45, -35, 141, 26, -98, 111, 108, -73, 24, 100, -88, -20, 124, -107, -134, 117, -66, -178, 107, 122, -147, -5, 81, -94, -10, 109, -126, -64, 107, 24, -160, 102, 105, -96, -5, 96, -100, -17, 169, -19, -94, 125, 0, -124, 50, 59, -108, 2, 84, -35, -10, 133, 6, -61, 123, 38, -134, 17, 98, -156, -36, 147, -27, -68, 86, -56, -36, 33, 25, -107, 23, 69, -77, -19, 114, -61, -98, 118, 45, -97, 27, 73, -143, -17, 99, -20, -38, 135, -28, -109, 29, 3, -115, 21, 90, -106, -4, 96, -45, -87, 159, -77, -110, 42, 74, -132, 5, 95, -123, -46, 112, -48, -106, 143, 0, -92, 98, 105, -74, 8, 54, -20, -58, 114, -42, -138, 136, 99, -103, 69, 44, -56, 103, 73, -65, -14, 103, -7, -86, 147, -19, -147, 69, 42, -79, 9, 78]
3169G8j18L1O9j16m9J03J8j97K28L7j57N3R8j46OJ13n3m5J27N0j90R5O3j25j1
3194c8J13q3l1R4Lj26J12M2j56J62k8j31K4J09r5q1J60lj45J48K7j76N8J55j41
3219b7KR9k3j57J60O3k06O1P8j32P0J31j56m1J39k6q6J29k2j10J7J08j46Q8O5
3244G8q8l6J29n7j39J47J7j92J02J45j28NP6j19lJ37n9r5J06j3q3J8J29j03o9
3269i5J72l3j00M7K5o6R7Qj30N2J27j32p8K38p5j19J37n4j02R2M3r8k7J85j57
3294d3k9Q9K0p8O5l1m7M8L8j06j9J73p7o2J07j3j56J16N3j29Q0P6o5n1J58j21
3320dr4J15L6j31Q5Q0j93J08M0n2n7J29n2j00J03M1j41J31L4j61Q7P4p8k8R4q6
3346b0p3J27k3o5O8R2j97K4J68p7n1P0l9p8P8J4m2N7K1j25MJ34r5o2K09n2j07
$$ y = [78, -40, -9, 60, -56, -105, -2, 16, -181, 47, 84, -73, -20, 78, -68, -62, 51, -2, -47, 80, 130, -60, 35, 98, -27, -38, 75, -8, -39, 55, 58, -68, 44, 86, -70, 92, 64, -67, -43, 66, -29, -110, 50, 47, -98, 50, 77, -99, -41, 114, -27, -25, 74, 51, -106, 54, 117, -89, -28, 50, -82, -12, 119, -37, -78, 61, 35, -51, 78, 56, -54, -37, 71, -75, 13, 78, -10, -46, 83, 26, -113, 34, 51, -141, -39, 106, -22, -17, 59, -60, -63, 74, 15, -80, 26, 13, -70, -52, 77, -26, -95, 77, 44, -56, -9, 16, -50, 47, 55, -75, -23, 104, -28, -106, 132, 57, -62, 75, 21, -81, 11, 54, -44, -71, 114, -43, -72, 17, 37, -41, 24, -7, -54, -6, 32, -74, -93, 80, 3, -59, 48, 35, -121, -5, 48, -81, -1, 75, 10, -41, 117, -4, -98, 17, 53, -78, 7, 87, -106, 2, 42, -10, -67, 62, 10, -90, 13, 54, -87, 44, 78, -83, 4, 78, 0, -28, 66, -20, -93, 34, 11, -54, 14, 106, -91, -67, 101, 24, -27, 43, 4, -74, 4, 18, -24, 33, 54, -71, -67, 67, -28, -90, 119, 67, -40]
3373d0L4M2r0L9N5j24M7J39o2j12J14K5j18L5O0j19N5J04p5k1L5J7p7nO8q6N5
3400eJ25j65nJ38n7o9Q7k0l1K0L1j21M3R8p5n4J47j20k1L9P1j12j3J74j04j3O0
3427D8j41P0P3r6l2J14M1j50Q8M0o4pP9p8L9L8m1k6K8M7r8J5J05n8l6J04j09o2
3455f9J28o2j7L4j5o4P0L2o6k0Q7p1j5Q1l3m3L5L6p3K3J9L3k6OL1q2N0K3p7N9
3485A4Mm9J5O8l0n6J04n0n5QQ8o0k4R8j00L6M1m4l6N9K9r3N1Nlm2O0n2r1J86r8
3516a7n9P1K8j09R7qp7M3O1l8o1J40r4qQ7l5m8L4P0j18N1O7o4n8P3Pjj4J2q5Q2
3547B9J5q6M1N3o0j6R4q4o2O5Q9j08L9L8r1L1O8n9n6O1J8J4m6M3k2j8P8Lj11N2
3577A2k1p2O3P5n3k4Q3r7nR4k7l7O3n6n1P5o6L1l1O6o7O5K8q9j3J05o7RJ2M0l5
$$ y = [-40, -6, 36, -54, -15, 40, -84, -37, 102, 40, -72, 42, 67, -51, -16, 44, -75, -20, 84, 9, -12, 23, 40, -37, -42, 26, -60, -5, 120, -45, -50, 88, 31, -38, 49, 29, -2, 18, 49, -72, -29, 69, -6, -60, 87, -33, -54, -15, 56, -56, -69, 105, 1, -12, 48, -93, -23, 50, -46, -78, 36, 77, -73, 15, 55, -9, -16, 63, -15, 24, 62, 21, -5, 23, 70, -28, -13, 92, 34, -2, 102, -7, -69, 59, -3, -20, 14, -1, -65, 5, 37, -29, -49, 38, -33, -48, 33, 0, -43, -8, 28, -45, -22, -3, 30, 4, 10, 41, -41, 9, 32, -45, 14, 18, -31, -16, 52, 22, -34, 70, 20, -35, -27, 61, 1, -23, 75, -25, 11, 52, 8, -28, 31, 60, -33, 18, 23, 20, -22, 38, -14, -105, 81, -17, -76, -5, 23, -86, 11, 3, -74, -31, 30, -8, -69, 71, -23, -31, 56, 21, -27, 7, 77, -41, 10, 77, 13, -45, 28, 35, 34, 20, 32, -53, 29, 44, -42, -1, 52, -8, -24, 70, -14, -76, -11, 78, -30, 9, 47, -44, -13, 55, -4, -60, 1, 19, 33, -13, 30, 8, -10, 68, 71, -40, 12, -9, -81, -18, 57, 4, -20, 63, -34, -39, 55, 28, -9, 54, -2, -53, 22, -44, -13, -44, 22, -45, 20, 48, -41, -54, 51, -16, -7, 5, 45, 10]
3608A0n2O2nk4M4J2r9Q9l2m7K5j9L5n4R7k7o1Q9Pn6L5k5l7M2L9k9p8O9J7p5N4
3639FJ3oJ9Kr2Q4J6j29J3J06k3q0J03Nq0K7J7o2Q9lk4J1K3k7Ml0L8q0J25k8j09
3670g2N1P6n3k2N2ok6j0L6m8j9Q4l6nJ6pl3N2j5j24O2P5p0L8L1m4J6K4J4m1j8
3701b2N4m6JJ30j69Q6L2r2l1J26p7l9J23j3q7L1K3m8N9K6r4K4j5MQL9n9j0L3L6
3731C3m2J0O0j02M8L7l7jj6Ko1J20m3l2QL5n3N4O1l9q8K2%M2J2jm9jO2n3j1N8
3763C5n7N3%Pp0OO1j9n3J09j44L0J3K1J8o5N6j1o4P2k6l8J02m1m8L4Q1r5J3M7
3793B7k1o2O2J8j9K7k0p7J12nn5kL4L4q5L5K3q6J02J6r4rO0j02M7Q9j09K3K4M1
3823B8p6N0K1j9m0RM7j8N3m0k1K7k0n1P0j9L7l0L2n1L6N4n0k8K6pp0J0L9p2M1
$$ y = [10, -42, 20, 15, -9, 35, 47, -52, 37, 5, -42, -17, -36, -1, -55, 42, 15, -46, 43, 50, -6, 29, 4, -33, 9, 48, 19, -59, 10, 27, -48, 6, 19, 13, 32, 34, -58, 26, 42, -87, -74, 32, 9, -71, 32, 37, -43, -16, 1, -61, 28, 25, 1, 12, 35, 8, 12, -18, 20, -60, 65, 37, -72, -21, 55, 2, -20, 32, 26, 0, -10, 26, -22, -41, 43, 7, 2, 18, 11, -22, 30, 15, -109, -47, 28, -42, -4, 27, -17, -1, 23, 37, -4, -22, 32, -14, -13, 117, -52, 34, 66, -26, -57, 69, -8, -47, 76, 63, -24, 7, 30, -18, 41, 67, -27, -3, -18, -14, -6, 33, -26, -36, -3, 33, -9, 1, 61, -41, 7, 44, 7, 6, -10, -8, -69, 51, 8, -24, -16, 19, -34, 20, 81, 42, -46, -24, -24, 18, 30, 29, -20, -21, 41, -12, -23, 35, -22, 31, 31, 38, -32, -26, 35, 16, -37, 72, -72, -42, -29, -8, 10, -55, 1, -10, -74, -2, -28, -66, 36, -5, -53, -19, 62, -33, -20, 27, 6, -56, 6, 24, 5, 32, 12, -65, 47, 42, -13, -15, 19, 53, -32, 3, 26, -60, 42, 58, -36, -45, 15, -87, -40, 49, -60, -37, -13, 28, -48, 2, 23, 4, -36, -27, 20, 2, 55, 15, -6, 21, 1, -50, 20, 1, 38, 8, 40, -11, 25, 79, 29, 1, 27, 20, -50, -40, -1, -73, -32]
3854c2P0o8M5k0Mq4J09o2L8J2L1o1M0o4N3j2M6l4o8lO7k8Rk7N2n4J13p6o7J07
3884C6k5l4N9k2o9P3J00j41L1K1Kn0M0nk2oL5n2j3K9Jl8%N0k2L4j1rj6M9m5M2
3916B2Nj4J4J8m7lK8j6l3J9N1l1l5J3K3j9J2k5L2rkL6o0Mj0J6J7l0l8K1M2k3N5
3949C3j5j6k9j7Q5o8Q6p4j3L8jL5r1oO8m9M4K1k8L5p3k5O8m2qN2j2Km9L1mJ3j4
3982b3O6l5j2K1%l9L9k0m2J6L0lQLJ3lmJ6o2R5l0n4M3K5k7Nk3%K6M9r5K0J1j6
4016bl3L9M6j01Q7l4P8o0j0m7J4M0k7n0Q4l7lK6Kl5J0k9M0k8Nj1M5L2l3Kj5L0
4048B5j2oNOM5K2q1Om7P2l4P0p2M0o7O4m7J0k9O4o6nM7l8N9l0l3p1Q9K2m6P8n0
4081a0nJ1Mq3Q7L3k0j6L6k2r7J34k3l2j9PJ1K0P6q9j5k0Q9r9O5o2N5pm7ol1M6
$$ y = [-32, 38, -30, 15, -5, -1, -85, 24, -38, 0, 12, 43, -18, 22, -42, 11, -1, 45, 11, -57, -60, 7, -21, -12, -39, 13, -41, 72, -4, -71, 36, 11, -23, 36, 14, -55, 18, 118, -23, 8, 29, 31, -19, 21, 16, -6, -12, 23, -29, -42, -13, -12, -50, -50, 0, -22, 12, 1, -8, -24, 25, -20, 22, 27, 13, 27, 45, -2, -5, 23, 7, -26, -7, 44, 13, -22, -9, 14, -5, 7, -18, 14, 5, 3, 39, -21, -17, -27, -11, 6, -24, -62, -41, 1, -22, 33, 18, 2, -27, -44, 41, -27, 59, -15, -28, 10, 9, 44, -47, -53, 15, -34, 10, 31, 3, 38, -35, -60, 8, -34, -42, 10, -2, 0, -49, -18, -22, -9, -23, 43, 8, -4, 17, 17, -22, 17, -3, -45, -29, 1, -2, 6, 9, 22, 19, 15, 31, -31, 64, 34, -20, 23, 48, 21, 26, 3, 3, 29, 78, -17, 3, 14, -2, -35, 4, 50, -51, 36, 2, 80, 20, 10, -37, -23, 17, -10, -60, 24, -13, -16, 10, 12, -23, -13, -42, -2, -30, -25, -36, 9, 41, 8, 10, -5, 25, 13, 7, 12, 18, 63, 85, 4, 10, -37, 35, 1, 71, -1, 39, -28, 36, -11, -1, -30, 34, -32, -37, 10, -28, 31, 1, -32, -103, -14, 8, -38, 40, -10, -15, -4, 0, -83, 4, 37, 17, 1, 37, 15, -82, 52, 29, -3, -22, -15, -4, 16, 92, 3, -12, -32, 57, -42, 23, -39, 16, 9, -38, -44, -75, -29]
4113b9N7kk7qk4K7K4J5rM5l3p7L1M7n4M0j6l4J2P8o4J3l6K6Jk1M7m0MqJ6kk2M7
4147B4J5qJ4o7J9J5k0P4n4n3M4j2M6n4K2m5lL8N4l9k5L4r5Q8k4J2l5j3L6P6o0
4178DL1Ll4k6O7o0N8l2OJ4J3n0NL6J9k1l9j7n4L2Q9m0o3O1PJ6o1j9M4nj4j1N9
4211A8m6KJ7qn7R3j4O5r2j1MRnJ2nl1N4j0j8O6o6L5N0k6j7%p8R8N2r0j3J7L5o2
4245b2J4Ol5J3N8l0K2k3j5J9j3K1m1k2N4Qn4R6mm2l2J3OM1k8K6m7j2L7qK2j2l1
4278a5L1nn8MK7q0Q4lj2k8J5K9J3J0M1o2NRL4m7l3K7j1P1k3n6Q6ql4j5j3K5Oo3
4312d9P6j5j2kKQm2N0q2K1O7l4K1N5r4L5K7J4q1K7L9n7K3j8N4r9L8M5n4M7j4j
4344elk1ml0O5j4R3m4m4P4r7K2m1Q0J0k0n0L7j7j2M2m2L9mj0J8j3j3n0%J5Q4K
$$ y = [-29, 28, 26, -1, -9, -33, -6, 18, 33, 24, 69, 36, -41, -10, 37, -17, 23, 7, -27, -15, 63, -1, 12, -24, 2, 3, -18, 29, -11, -7, -15, 1, -1, -23, 24, 39, 31, 45, -22, -3, 12, -8, 66, 12, -41, 3, -9, 37, -17, 5, -40, -43, -5, 49, 10, -15, 19, -76, 12, -12, 0, -35, -48, -12, 64, 4, 35, 38, 4, -22, 45, -15, 43, 11, 17, 31, 44, -6, -1, 35, 54, 33, -6, -23, -77, -45, 44, 4, -59, 2, 9, 25, -36, -55, -11, -16, -30, -41, 18, -28, -26, -9, -17, -74, 19, 5, 70, -22, -33, -29, -20, -25, -13, -18, -49, 5, -5, -23, 43, -23, 12, 62, 36, 19, 19, -59, 39, 91, 1, -12, 5, 40, -22, -8, -2, -37, -24, 34, 4, 26, 3, -12, 7, -6, 15, -26, -48, 6, 14, -40, 56, 52, 10, -22, -9, -3, 38, 10, 36, -11, -23, 14, 6, 28, 16, -15, 16, 11, -47, -43, -16, -96, -12, -15, -27, -55, -40, -11, 2, 12, 53, -9, -4, 5, 39, -8, -41, -14, -25, 46, 23, -33, 53, 45, 11, -4, -17, 8, 14, -49, 27, 12, 0, -2, 0, 8, -34, 16, -66, -45, 22, -12, 9, 64, -30, 5, 32, 46, -35, -8, 31, -26, -3, -21, 33, -66, -28, 17, -37, 10, -4, -5, -8, -29, -33, -63, 2, -12, 81, 37, -7, 67, -30, -8, -49, 31, 41, 21, -29, 8, -9, -21, 21, -21, 18, 14, 4, 22, 9, -4, -54, -54, -39, 45, 47]
4377D7k4j1k8Q1r4RM7n2K6Mj3J8l7M8nm5O2m1J5m6R6l4Lk9lK6k1J7l7K3K9k1K0
4410C0m4Mj7j0L4n2L8m1K5K5N3j05N6jj1j8K7K7Mrk2j8N2n2N5k0kK3q4KQ6p1M3
4443Gl0N7o8P0N3r5NL1J8nl7K9r2R2l6L1nk3K5p0N0j0rO5m0mJ2l4M9m7pn5P4K3
4477B4n6N3K8l4rk3Om4N5J4p3P9n8JN5Rl2qK8j3m7J7K4l3M0rJ8k1J3l9L6Qn8K7
4511b2N4nq3K6M3J7l6Q7m9l4Nj5J6J4m0P7l2m5L1k7M5rJ4k2m7k2O1kJ3rj8K6L6
4544D8l4j4JQk6k8N0pk7O5j5J9qQk4n5L2l0L9k0rj6PP3n0L0m0N6m7L6pPk7Jk5
4579b9O6l9NK9m9nO1J1n5J2j5pL0m0l6O1J6k5lj2J0k7P4k7qkM0j6KQK4j9j5k1
4613aK4orloK7j4L3j0k3K7kn7J0j3j1L4k4k7P3p1N4k5L9l7rM3mo7J2J5RJ6J2j5
$$ y = [47, 23, 12, -16, 65, -29, -20, 27, -25, 1, 5, -8, 10, -27, 21, 16, -29, 33, -8, 7, -39, 57, 23, 26, -3, -6, 20, -1, 16, -21, 2, 31, 10, 30, -14, -10, -27, -37, -3, -55, -17, -58, -33, -8, 45, -60, -4, -5, -16, -34, -7, 20, 24, 15, -7, -25, 27, -25, 30, 10, 8, 31, -53, -51, 35, -36, 7, -23, 34, -34, 36, 89, -6, -1, 30, 48, 43, 6, 35, -57, 35, -1, 30, 25, 2, 27, -43, 7, -3, -12, 53, 13, 9, 21, -13, 36, -11, -18, -73, 1, 24, -32, 21, 49, 15, 6, -17, -11, -55, 0, 14, -59, 20, -38, -37, 18, 27, -5, -13, 15, 2, -45, -28, -4, -37, 3, -6, 12, -9, 4, -35, 1, 9, -49, -22, 32, 27, -56, -30, 13, 30, -6, 81, 32, -2, 3, -12, 4, 18, -22, 55, 23, -22, 9, -18, 27, 18, 32, 10, -37, -59, 2, 0, 13, 4, -14, 12, 48, 14, 0, 1, 9, -17, -45, 5, -2, -29, 36, 21, 40, 32, 40, 16, -39, -7, -37, 2, -18, -27, -43, -36, 37, -13, 17, -23, 33, -14, 22, 15, 22, -5, -4, -29, 37, -2, 3, 32, -17, -22, 39, 50, -5, 7, -8, -15, 15, -25, -61, 0, 16, -9, -12, -24, -14, -41, 33, 6, -2, -4, 36, 20, 22, 30, 54, 35, 20, -1, 23, 17, 8, 5, -1, 26, 12, 45, 35, 12, 39, 37, -20, -10, -23, -34, 0, -24, -51, 22, -49, 5, -20, 19, -18, -27, 16, 12, -55, -43, -28, -19, -3, 9, -6]
4648fL5m2rj8L1pOO8o8M1l8nJ0j2j2J5Pn4P0Lj3O1o4M8l4j8jm5K7J2%p6J10l3
4682a1q1P0K4l3K6l0L0k1K5mj7k4M3M0m4m4J05Oj02M1J5l1J1%oP4j16M1j0lK4
4713bK4j2k3N1m4J3l9N8L0k9L9p4j4K6Pk4jL5k3M5j16J24ko3PK1j6l1L6M3q8J5
4745b7jj7M5rj6L2nLJ0Noj1Lk0K9l2L8n3L4o9O2k3L1K8r3O7k8j0N7Po6O7n0M0
4779B2q5R9r7R7k8kKj4P0k1j5n5pL8l5J0M2m5QL9mn1J0K6m4RN5l5o5O4Q0q2nm
4813b3J8O9n0k6k4L1N7o6L5L7n9K5L5q3N6l5j6QO3%j9k2Pm7LK1Jq%K9l5j0R1p5
4847a2k6N2J4kr1QK1J08o6j7qJ8K3l4L8J7j26P1P5l8om0N2m5Nk6R1p1OK2rM6n2
4880bR4q3jk0L6k1l3k5K2Ok5K2R2l0J6r3K7O6l6%l6L2l1K9l0J7K9mj3J5K0l4K2
$$ y = [-6, 29, -13, -22, -40, -9, -16, -10, 58, -10, 31, -7, -12, -2, -14, -26, -11, -4, -58, 12, 15, 2, 63, -1, 47, 13, -5, -6, -51, -24, -12, -12, -88, 22, -11, -92, -22, 2, -31, -5, -35, -5, -26, -1, -5, -22, -46, -3, 37, -7, -51, 54, 60, -42, -1, 14, -17, -6, -6, -12, 62, -54, -13, -23, -26, -2, 22, 10, -13, 38, -6, 7, -32, 26, 56, 27, 66, -8, -22, 4, 11, -13, -14, 21, -2, 43, -73, 51, 49, -14, -7, 14, -2, -33, 3, 46, -42, -27, -28, -45, 0, -9, -25, 7, 2, 5, 15, 20, 14, 3, 6, -14, 15, -17, 21, -32, 2, -67, -5, -28, 3, 31, -62, 5, -23, -33, 24, 31, -35, 32, -18, 22, -63, 36, -61, 36, 8, 6, 8, -6, 64, 43, 28, -27, -34, 4, -31, -21, 21, -24, -16, 23, 19, -32, -22, 4, -40, -31, 24, -11, -76, -12, 68, -14, -19, -23, -5, 64, 14, -12, -36, -5, 52, -14, 21, 58, -1, 24, 59, -24, 32, -3, -19, -11, 52, 52, 33, 11, 18, -29, -26, -5, -4, -12, -12, 17, -18, -28, 63, -12, -38, 14, 28, 26, -65, -57, -36, 72, 6, -11, -19, -1, 22, -12, 26, 43, -83, -12, 63, 25, 19, -21, 31, -14, -9, -35, 56, -15, -9, 13, 4, 50, -2, 92, 9, 8, -12, 24, 3, -30, -55, -33, -27, -52, -30, 62, 32, 48, -45, -18, 48, 12, 12, -24, 8, -23, 6, -24, -7, 22, 18, 5, 20, 40, 6, 28]
4913B8k6M0k0l9L4j0K2k1M5Qm3m1L5j2L4l3j6P1j7j20N5M2nrl7J7P9m7p8P7kk6
4945a5N2o5J8K4l8LO7m1rj0J0jK7L3LPr5O3l2pJ4M9p1l7P0Qk9nk3LK1K8%k3j9
4980b0K9m1N9m5J2L5o7mL0j7pJ9M1m6M6n2kJ3RL1l2L1m2K3j0kql0P7n1O9k3j3
5013A2J6n5M0m0K9jl6N5kk0J5j2Om7k8N7j8PO9o0PN4o5L4j5j3M1k4rK1L1Jq7P5
5047C8m7NK1K0Om7j4J7PjL9p2j9N1k1j2J7J4j6L9j2O8j01k2P1o5J0L7Kn5N3K2
5079C3j6J6l4j5PJ0l8J2M0l3j6K1L7j7r6J06l6rK4k8N2m0K8l3K4m8M6mJ2J0Rp2
5111d8L1O9q7J4j0K3Qj1K3K1n6O2k6n5O4J9p8P4%o2L8Jk2k4K8rM6m4j5N3n4K6
5143aJ1Pj0LpJ0p9L3L1L6o0L7j3Pk2M0j9k5MNk9O1j5qN4p9M9M9l6l1J9j4%jj5
$$ y = [28, 2, 42, 22, -17, 17, 7, 29, 8, 53, 61, 18, -23, 12, 0, 34, 1, -15, 56, 39, -81, -26, 16, 11, 2, -35, -18, 61, 14, -64, 13, 11, -15, 37, -28, -10, 14, -24, -21, 46, 5, -4, -14, -4, -5, 22, 55, 58, 65, -30, 33, 1, -6, 8, 57, -14, -51, 19, 27, -2, -7, -30, -27, -6, 22, 22, -1, -20, 9, -32, 27, -18, -6, 29, -38, -42, -12, -29, -36, -17, 24, -22, 24, -28, -30, -17, -8, 23, -9, 22, -20, 3, -7, -9, -17, -47, 30, -21, 48, 25, 12, 28, -27, 13, -27, 2, 1, -35, 20, 18, -2, 13, 1, 7, -40, -68, -11, -29, -22, 47, -13, -6, 48, -17, 17, 2, -11, 30, 6, -3, 18, 49, 50, -37, 38, -9, -4, 17, 37, 43, -4, -18, -1, 6, 5, 44, -28, -47, 4, -17, -29, -12, 2, -14, 25, 13, 81, -20, -42, 29, -36, -26, 11, 13, -42, 11, 33, 17, 33, -1, -16, -9, 1, -37, -25, 15, -18, -34, -13, 24, 7, -89, 17, -19, -28, -4, -32, 20, -20, 8, -25, -1, -49, -3, -7, 5, 15, 24, -48, -17, 52, -35, -21, -31, -8, 0, -11, 12, 33, -23, 39, 13, -42, 22, 41, -37, 37, 37, -25, 13, 14, -8, -32, -4, -13, 33, -11, -26, 27, -27, -1, 10, 17, 7, 10, 3, 13, -66, -33, -2, 34, -26, 11, -2, 5, -17, 23, 4, -21, -17, -12, -41, 20, 5, -3, 51, -28, 21, 70, 34, 3, 22, 8, 8, 7, -8]
5178hlQ9j18O6%n6J0Rj7Kk0L1M8q0N5%rPj2M5o6M8n3M2j5Pl6L6J9l1K8m5M1k8
5212a4M2m2PJ8l9M8j8J1ppPJ7l4l4J5Rj4N8m2K7pK7n7M6pj9K3Kk1K9k0N8o3K2
5246B1n9M7K8q4N0l8L7j6R3q2l5K7J0J2L2Pk7pPj0J3k3Ok3j2J1K7L7l6j7J6pk8
5279b3J2k9O8o5K4P1q1j8k3J66j42L2k2K4J0l5O2J5m8%J8POm4L4l2J0M1j4j9J2
5310A7k2J5L6q0O1K0m6j6K5N2k9r8R6k3%J0n6ON0l7oK6J0qNK3jl4K1j4MJ4n3M9
5344A7j2k9L6j2%N5q0N1l5M4q0J06m4m0L3n1J8L1J5r0K1KM2m5Q4j1j5l2JM5L2
5375E7o5k2N3J0J7o0OO1k2j1J2m0QP4q2l7L8oJl0k4N5m3M9m1N7Jm8L3j8ORm2M4
5409@k0k6J4K8k6M5n3J3P2qn7L9l5m2N2Qj7k7N1j6m5J08r8N1k0j7Q0m0rL4m8j
$$ y = [-8, -11, 78, -40, 26, 26, -30, -20, -11, -28, -26, -46, -15, 33, -47, 8, 8, -1, 6, -6, 39, -27, 21, -32, 10, -5, 2, -34, 2, 21, -10, 18, -27, 14, -14, 28, -14, -7, 11, -28, 20, 2, 13, 6, -1, 6, 23, -11, -45, -30, -21, -35, 23, -19, 8, 1, 28, -29, 17, 10, -9, 14, 16, -5, 24, 4, 62, -1, 21, -38, 9, 37, -47, 3, -35, 2, -14, 79, -3, -38, -11, -1, 11, 43, 50, 23, 16, 23, 13, 26, 3, 9, -14, -26, -15, 12, 49, 13, -4, 12, 5, -23, -11, -40, 28, -37, -13, 58, -23, -41, -64, 102, -40, -8, -30, -6, 4, -31, 31, 46, -2, -2, 16, 23, 29, -15, 19, -13, -3, 38, 24, 5, 17, -5, 10, 46, -34, 27, 47, 1, -15, 10, 62, 33, -65, 31, 8, 8, 18, -38, -32, 18, -19, -25, 1, 11, 3, 8, 31, 30, -4, 17, 3, 7, 21, -32, 17, 5, -24, 12, 0, 0, 55, -25, 26, -9, 35, -45, 61, 17, -23, 10, -41, -23, 8, 23, -67, -46, -44, -2, -47, 37, 26, 11, -21, -20, 25, 57, -8, -30, 23, 33, 50, -10, -4, 57, 35, 24, 36, -4, 4, 78, -4, -41, -3, -9, -8, -38, -62, -7, -50, -1, -42, 15, 16, -32, 1, -17, -11, -2, -44, 0, -20, -46, -32, -4, -30, 15, -38, -25, 47, 39, -18, 21, -14, -56, -4, 4, -13, -40, 11, -5, -50, 58, -40, 11, -9, -26, 54, 14, 5, 39, -9, -10]
5441a0j1J4NL0j1K0j4J5nk7n3J4L0k5J0L6j9n4P6ql0K1K2j6L1rk2L3k1l2K5Rm4
5474b0%oL2k6j5K5J5j5N6l7j5n0M8oNl%K0m8jL0J4ml7K6K2J3n7L0m2M1Qn8R2k5
5509A2O0p5RL8n6Q7r0j0L6lK0Pp7L7RM9o4K6K1m8l4M4L9m5j3O1k1l1J7M8q9QL6
5542HJ3nl0lK1k1jK1K4J7pp7J04j02L6J8J5J2o8J3%j3M7n2P1j7Nq4P0L0r9K2M5
5575A3L3r2j2N4k3N9n0J9J2k8jM1o8M7j3l3M8j6J1K6m4OK7k1l8O9n4NM7J5nj0
5607B4K8o3j7l2R9o9N3pm1mLJ2L7l4j5L2j1m9O3p4O7L1l3qk0%L5k0%L3k5l0Q5
5640E0m6l8N9pM7n6qmL1k0j0K5l0k4L1j0J3j6P3r0KN5j5J6mJ6j17R3n9J9P5q0
$$ y = [-10, -21, -7, -2, 28, 17, 37, 23, 38, 33, 6, -47, -33, -3, -28, -18, 18, -1, -55, 21, 13, -17, 4, 26, 10, 41, 32, 10, 43, 22, -10, 15, 24, -20, -20, -26, 6, -20, -35, -10, 5, -10, 46, 9, -6, -56, -8, -14, -9, -12, -12, 8, -40, -41, -11, 3, -1, -38, -12, 10, 23, -34, -4, -46, -5, 3, -55, 37, 12, 72, -3, 6, 44, -12, 75, -15, -25, 11, 8, 28, 35, -42, -5, 4, 53, -11, 15, 36, -12, -46, -2, 37, -8, -21, 40, 19, -12, 5, 53, -36, -28, 8, 21, 16, -14, -17, 4, -17, -18, 3, 27, 44, 37, -40, 64, -38, -2, 16, 31, 43, -25, -12, -12, -25, 22, -30, 41, 24, 29, -55, 15, 45, -54, -32, 13, 46, -46, -58, -4, -27, 32, -18, 1, 13, -15, -16, 25, -43, 4, -9, -42, 6, -10, 1, 27, -17, -11, 16, -5, -43, 26, -28, -23, 24, 39, 34, 24, 52, -11, -28, -60, 39, -30, 23, 16, -25, -29, -26, -14, 23, -11, -26, 6, -5, -54, 9, -65, 2, 33, 0, -8, -28, -28, 7, -13, -13, 20, -5, -35, 50, 4, -34, 25, 18, 65, 9, 1, -3, 28, 8, -2, 23, -7, -31, 0, -10, 3, -13, 60, -30, -28, 27, 12, 28, 24, 40, -77, 16, -43, -24, 51, -29]
$$ [...]
8191g
##END NTUPLES=NMR FID
##END=
