##TITLE=1H_Pr C6-B
 CDCl3
 8 sc, 
 19.10.2022
##JCAMPDX= 6.0         $$ Bruker NMR JCAMP-DX V2.0
##DATA TYPE= NMR FID
##DATA CLASS= NTUPLES
##ORIGIN= UXNMR, Bruker Analytische Messtechnik GmbH
##OWNER= root
$$ XWIN-NMR		Version 3.5
$$ Wed Oct 19 14:32:23 2022 Russian Standard Time (UT+4h)  she@DPX200
##.OBSERVE FREQUENCY= 200.1313499994
##.OBSERVE NUCLEUS= ^1H
##.DELAY= (6, 6)
##.ACQUISITION MODE= SIMULTANEOUS
##.ACQUISITION SCHEME= undefined
##.AVERAGES= 8
##.DIGITISER RES= 18
##SPECTROMETER/DATA SYSTEM= spect
##.PULSE SEQUENCE= zg30
##.SOLVENT NAME= CDCl3
##.SHIFT REFERENCE= (INTERNAL, CDCl3, 0, 15.7039)
##AUDIT TRAIL= $$ (NUMBER, WHEN, WHO, WHERE, WHAT)
$$ ##TITLE= Audit trail, XWIN-NMR		Version 3.5
$$ ##JCAMPDX= 5.01
$$ ##ORIGIN= Bruker BioSpin GmbH
$$ ##OWNER= she
$$ F:/spectra/data/she/nmr/H-F/1/audita.txt
$$ ##AUDIT TRAIL=  $$ (NUMBER, WHEN, WHO, WHERE, WHAT)
(   1,<2022-10-19 14:31:03.50 +0400>,<she>,<DPX200>,
      <created by zg, POWCHK disabled, PULCHK disabled
       configuration hash MD5:
       00 E9 B6 7A A2 85 ED C7 34 08 36 98 17 FE 4E 26
       data hash MD5: 16K
       7C 12 12 DF 71 D6 9A 0F C8 AB DE EE 33 ED BF BB>)
$$ ##END=
$$ 
$$ hash MD5
$$ 93 6E 33 15 33 9F CD CC CF 42 31 66 39 8A 9E 55
##$RELAX= 
##$RELAX= 
##$RELAX= 
##$RELAX= 
##$RELAX= 
##$RELAX= 
$$ Bruker specific parameters
$$ --------------------------
##$DU= <F:/spectra>
##$EXPNO= 1
##$NAME= <H-F>
##$PROCNO= 1
##$TYPE= <nmr>
##$USER= <she>
##$AMP= (0..31)
100 100 100 100 100 100 100 100 100 100 100 100 100 100 100 100 100 100 
100 100 100 100 100 100 100 100 100 100 100 100 100 100 
##$AQSEQ= 0
##$AQ_mod= 1
##$AUNM= <au_zg>
##$AUTOPOS= <>
##$BF1= 200.13
##$BF2= 200.13
##$BF3= 200.13
##$BF4= 200.13
##$BF5= 200.13
##$BF6= 200.13
##$BF7= 200.13
##$BF8= 200.13
##$BYTORDA= 1
##$CFDGTYP= 0
##$CFRGTYP= 5
##$CHEMSTR= <none>
##$CNST= (0..31)
1 1 145 1 1 1 1 1 1 1 1 1 1 1 1 1 1 1 1 1 1 1 1 1 1 1 1 1 1 1 1 1 
##$CPDPRG= <>
##$CPDPRG1= <>
##$CPDPRG2= <>
##$CPDPRG3= <>
##$CPDPRG4= <mlev>
##$CPDPRG5= <mlev>
##$CPDPRG6= <mlev>
##$CPDPRG7= <mlev>
##$CPDPRG8= <mlev>
##$CPDPRGB= <>
##$CPDPRGT= <>
##$D= (0..31)
0 1.2 0 0 0 0 0 0 0 0.06 0 0.03 0 0 0 0 0.0002 0 0 0 0 0 0 0 0 0 0 0 0 
0 0 0 
##$DATE= 1666175462
##$DBL= (0..7)
120 120 120 120 120 120 120 120 
##$DBP= (0..7)
150 150 150 150 150 150 150 150 
##$DBP07= 0
##$DBPNAM0= <>
##$DBPNAM1= <>
##$DBPNAM2= <>
##$DBPNAM3= <>
##$DBPNAM4= <>
##$DBPNAM5= <>
##$DBPNAM6= <>
##$DBPNAM7= <>
##$DBPOAL= (0..7)
0.5 0.5 0.5 0.5 0.5 0.5 0.5 0.5 
##$DBPOFFS= (0..7)
0 0 0 0 0 0 0 0 
##$DE= 6
##$DECBNUC= <off>
##$DECIM= 32
##$DECNUC= <off>
##$DECSTAT= 4
##$DIGMOD= 1
##$DIGTYP= 9
##$DL= (0..7)
0 120 120 120 120 120 120 120 
##$DP= (0..7)
150 150 150 150 150 150 150 150 
##$DP07= 0
##$DPNAME0= <>
##$DPNAME1= <>
##$DPNAME2= <>
##$DPNAME3= <>
##$DPNAME4= <>
##$DPNAME5= <>
##$DPNAME6= <>
##$DPNAME7= <>
##$DPOAL= (0..7)
0.5 0.5 0.5 0.5 0.5 0.5 0.5 0.5 
##$DPOFFS= (0..7)
0 0 0 0 0 0 0 0 
##$DQDMODE= 0
##$DR= 18
##$DS= 0
##$DSLIST= <SSSSSSSSSSSSSSS>
$$ [...]
##$SUBNAM2= <"">
##$SUBNAM3= <"">
##$SUBNAM4= <"">
##$SUBNAM5= <"">
##$SUBNAM6= <"">
##$SUBNAM7= <"">
##$SUBNAM8= <"">
##$SUBNAM9= <"">
##$SW= 18.0517283424941
##$SWIBOX= (0..15)
0 0 2 0 0 0 0 0 0 0 0 0 0 0 0 0 
##$SW_h= 3612.71676300578
##$TD= 16384
##$TD0= 1
##$TE= 0
##$TE2= 300
##$TE3= 300
##$TEG= 300
##$TL= (0..7)
0 120 120 120 120 120 120 120 
##$TP= (0..7)
150 150 150 150 150 150 150 150 
##$TP07= 0
##$TPNAME0= <>
##$TPNAME1= <>
##$TPNAME2= <>
##$TPNAME3= <>
##$TPNAME4= <>
##$TPNAME5= <>
##$TPNAME6= <>
##$TPNAME7= <>
##$TPOAL= (0..7)
0.5 0.5 0.5 0.5 0.5 0.5 0.5 0.5 
##$TPOFFS= (0..7)
0 0 0 0 0 0 0 0 
##$TUNHIN= 0
##$TUNHOUT= 0
##$TUNXOUT= 0
##$USERA1= <user>
##$USERA2= <user>
##$USERA3= <user>
##$USERA4= <user>
##$USERA5= <user>
##$V9= 5
##$VALIST= <valist>
##$VCLIST= <CCCCCCCCCCCCCCC>
##$VD= 0
##$VDLIST= <DDDDDDDDDDDDDDD>
##$VPLIST= <PPPPPPPPPPPPPPP>
##$VTLIST= <TTTTTTTTTTTTTTT>
##$WBST= 1024
##$WBSW= 4
##$XGAIN= (0..3)
0 0 0 0 
##$XL= 0
##$YL= 0
##$YMAX_a= 320390
##$YMIN_a= -458680
##$ZGOPTNS= <>
##$ZL1= 120
##$ZL2= 120
##$ZL3= 120
##$ZL4= 120
##$ABSF1= 10
##$ABSF2= 0
##$ABSG= 5
##$ABSL= 3
##$ALPHA= 0
##$AQORDER= 0
##$ASSFAC= 0
##$ASSFACI= 0
##$ASSFACX= 0
##$ASSWID= 0
##$AUNMP= <proc_1d>
##$AZFE= 0.1
##$AZFW= 0.1
##$BCFW= 1
##$BC_mod= 2
##$BYTORDP= 1
##$COROFFS= 0
##$CY= 11.3945322036743
##$DATMOD= 1
##$DC= 2
##$DFILT= <>
##$DTYPP= 0
##$F1P= 2.36226072786647
##$F2P= -0.459571619588291
##$FCOR= 0.5
##$FTSIZE= 0
##$FT_mod= 4
##$GAMMA= 1
##$GB= 0.15
##$INTBC= 1
##$INTSCL= 1
##$ISEN= 128
##$LB= 0.24
##$LEV0= 0
##$LPBIN= 0
##$MAXI= 10000
##$MC2= 0
##$MEAN= 0
##$ME_mod= 0
##$MI= 1.114404
##$NCOEF= 0
##$NC_proc= 0
##$NLEV= 6
##$NOISF1= 3.799351
##$NOISF2= 2.8
##$NSP= 1
##$NTH_PI= 0
##$NZP= 0
##$OFFSET= 15.70392
##$PC= 1
##$PHC0= -18047.98
##$PHC1= 29.2007
##$PH_mod= 1
##$PKNL= yes
##$PPARMOD= 0
##$PSCAL= 0
##$PSIGN= 0
##$REVERSE= no
##$SF= 200.130013532006
##$SI= 16384
##$SIGF1= 3
##$SIGF2= 2
##$SINO= 400
##$SIOLD= 16384
##$SREGLST= <1H.CDCl3>
##$SSB= 0
##$STSI= 0
##$STSR= 0
##$SW_p= 3612.71676300578
##$SYMM= 0
##$S_DEV= 0
##$TDeff= 0
##$TDoff= 0
##$TI= <>
##$TILT= no
##$TM1= 0
##$TM2= 0
##$TOPLEV= 0
##$USERP1= <user>
##$USERP2= <user>
##$USERP3= <user>
##$USERP4= <user>
##$USERP5= <user>
##$WDW= 1
##$XDIM= 8192
##$YMAX_p= 0
##$YMIN_p= 0
$$ End of Bruker specific parameters
$$ ---------------------------------
##NTUPLES= NMR FID
##VAR_NAME=  TIME,          FID/REAL,        FID/IMAG
##SYMBOL=    X,             R,               I
##VAR_TYPE=  INDEPENDENT,   DEPENDENT,       DEPENDENT
##VAR_FORM=  AFFN,          ASDF,            ASDF
##VAR_DIM=   8192,          8192,            8192
##UNITS=     SECONDS,       ARBITRARY UNITS, ARBITRARY UNITS
##FACTOR=    0.0002768,     1,               1
##FIRST=     0,             0,               0
##LAST=      2.2672688,     0,               0
##MIN=       0,             -458680,         0
##MAX=       2.2672688,     320390,          0
$$ Real data points
##PAGE= N=1
##DATA TABLE= (X++(R..R)), XYDATA
$$ [...]
1805d06n14J006N7n7L24l74j33J99M30J55j13j71q47K41P08L93n77m84m56L80
$$ -406 -920 86 143 86 410 36 -97 102 532 687 574 403 -444 -203 505 898 321 -163 -619 -239
1825b39J68O07n52n51j69M70K05L0mn86r7Q64K85m17O7l90M6L61N32l55k42p0
$$ -239 -71 536 -16 -567 -736 -266 -61 -31 -35 -621 -718 146 431 14 81 -309 -263 98 630 275 33 -37
1847c7K28l2N07j39n40k83K80L34J15Q9q15k84L88M73j81l39l5m74J75Q47j48
$$ -37 191 159 666 527 -13 -296 -16 318 433 522 -293 -577 -189 284 103 -236 -271 -745 -570 277 129
1868A29l69j03j93K67L32M41k89n63q8P50J11J22j61k79j63L13J77O5l06n73o
$$ 129 -240 -343 -536 -269 63 504 215 -348 -436 314 425 547 386 107 -56 257 434 499 193 -380 -386
1889c86L82J32R9o83J25l18L70J76n0q2k66J44L70J49J76k86l93M78J95J17J27
$$ -386 -4 128 227 -456 -331 -649 -279 -103 -153 -235 -501 -357 13 162 338 52 -341 137 332 449 576
1910E76n47j89M29L89k04qn77k04K75K21J66l57m68R8j02O21K4k28m86Q5K25L81
$$ 576 29 -160 269 658 454 446 -131 -335 -60 161 327 -30 -498 -400 -502 119 143 -85 -571 -486 -261 120
1932A20n9j35n2j87L37O7J76o2l33Q4N07K99Q3q25J90K2R3l53M75n25l4p4j4L65
$$ 120 61 -74 -126 -313 24 91 267 205 -128 -44 463 762 845 20 210 232 325 -28 447 -78 -112 -186 -200 165
1956A65O7o26j67j4P95j72j14m95Q9K62L31K63o70M53k42J53L31J80j03m00l7
$$ 165 232 -394 -561 -575 220 48 -66 -561 -472 -210 121 384 -286 167 -75 78 409 589 486 86 49
1977D9M74M7j02j45n36J89m4R8J49j33l47m7J55L87k95l49M4Nk9P31k13l95l8
$$ 49 523 570 468 323 -213 -24 -68 30 179 46 -301 -348 -193 194 -101 -450 -406 -401 -430 301 88 -307 -345
2000c45Q3M71Q1L5n2l72J81J35N03k59J3p19L53L70p6k93k60J2N3J58j12j89k67
$$ -345 -262 209 290 325 273 -99 82 217 720 461 474 -245 108 478 402 109 -151 -139 -86 72 -40 -229 -496
2023d96J08R5K33o3j4l08j21J63P47K8l32j85J93J78J78j1j32k34J0Q5N16l45
$$ -496 -388 -293 -60 -123 -137 -445 -566 -403 344 372 40 -145 48 226 404 393 261 27 37 122 638 293
2045B93k91j87K18j47O10n09l72J21J16K64k23k4j91O1q2K80Q9K40n46O3j1M41
$$ 293 2 -185 33 -114 496 -13 -385 -264 -148 116 -107 -131 -322 -261 -343 -63 26 266 -280 -217 -228 213
2067B13o8J42m00k3M75k2L0j3p0j28P1J72J49m89k29Q0J22P1J50n87j11L25p6
$$ 213 145 287 -113 -136 339 317 347 334 264 136 207 379 528 39 -190 -110 12 83 233 -354 -465 -140 -216
2090b16J55j3O0l58J3mM63N6q5k78L2O54k0m98QR2K48Q3mJ41n36j74J99m3L91
$$ -216 -61 -74 -14 -372 -359 -363 100 156 71 -207 -175 479 459 -39 -31 61 309 392 388 529 -7 -181 18 -25 366
2115C66j87m78r9J84N54m57k52K3J10K84r9l6n7J02O6k74L01L94k03l13Q6J22
$$ 366 179 -299 -398 -214 340 -117 -369 -346 -236 48 -51 -87 -144 -42 24 -250 51 445 242 -71 15 137
2137A37K94j57m05J66J21K84l24k28L98n00K8q0K51J73k40n67L01K08K07j64m10
$$ 137 431 274 -131 35 156 440 116 -112 286 -214 -186 -266 -15 158 -82 -649 -348 -140 67 -97 -507
2158e07J12J86L31q9KM2Q0K4J63q4M5j96j29J75L39J8m33m35M09R7J88m58Q2j31
$$ -507 -395 -209 122 33 35 77 157 181 344 260 305 109 -20 155 494 512 79 -356 53 150 338 -120 -38 -169
2182a69j4pK8K72j43k36k20J47O12j26n24J47K04K50k00j27K44Pk42L71J95l57
$$ -169 -183 -190 -162 110 -33 -269 -489 -342 270 144 -380 -233 -29 221 21 -106 138 145 -97 274 469 112
2204A12K35l21j08K32M00k89o12N5K32P1k31r8R7R5o8J7O8J58L4m92J09N02k8
$$ 112 347 26 -82 150 550 261 -351 -296 -64 7 -224 -322 -225 -130 -198 -181 -113 45 79 -413 -304 198 170
2227A70j66k85J20J49J72o1m2j01L51j79J69J0L9m47j26K78J72m8k82m45L2O02
$$ 170 4 -281 -161 -12 160 99 57 -44 307 128 297 307 346 -101 -227 51 223 175 -107 -552 -520 82
2249H2j00k60K0J56J13k77K54j8k64J98M7R3J04r9j34M37k44J21J47l26p9L05
$$ 82 -18 -278 -258 -102 11 -266 -12 -30 -294 -96 -49 44 148 49 -85 352 108 229 376 50 -29 276
2271B76%k06J9J33l16r6Q0L92m69j00%n6K48J63m19p8R6J61J71K01l10K6j36M00
$$ 276 276 70 89 222 -94 -190 -110 282 -187 -287 -287 -343 -95 68 -351 -429 -333 -172 -1 200 -110 -84 -220 180
2295A80k23M15J22l97qR9K6m7K6J08l30O7N5l6l02J23k02o0K34K39j27l01j31
$$ 180 -43 372 494 97 89 188 214 167 193 301 -29 38 93 57 -245 -122 -324 -384 -150 89 -38 -339 -470
2318d70O8M30r3k29J26p2L08MJ43j95J78m18L79J11J86l18l07K64LJ40j28j62
$$ -470 -402 28 -65 -294 -168 -240 68 72 215 20 198 -220 159 270 456 138 -169 95 98 238 110 -52
2340e2j06J75K22m63R0n4j56K33J82j05n9R4l64J92M02j79j20J54j06K24L4j86
$$ -52 -158 17 239 -224 -134 -188 -344 -111 71 -34 -93 1 -363 -171 231 52 -68 86 -20 204 238 52
2362E2m8J6J29pQL56k81l96j1R7M4J55j81mJ07j23J81j85p6m2r1J05P3r4K1j79
$$ 52 4 20 149 142 150 506 225 -171 -182 -85 -41 114 -67 -71 36 -87 94 -91 -167 -209 -300 -195 -122 -216 -195 -374
2388c74L22L36k15J68j57NK9J54NN9l4j88j03Q3J46l61J49k04J45j67N9J00k02
$$ -374 -52 284 69 237 80 85 114 268 273 332 298 110 7 90 236 -125 24 -180 -35 -202 -143 -43 -245
2411b45K07l09l3K92J56n94K28J36J82r1J48r6m0K50J26j89p2P6M4m9R4L7j91
$$ -245 -38 -347 -380 -88 68 -526 -298 -162 20 -71 77 -19 -59 191 317 128 56 132 176 127 221 258 67
2434F7L2j78K11q3k16J29l63J81Q0nK4j87J56m7M8K84m78K42%k0J38J5K02l11
$$ 67 99 -79 132 49 -167 -38 -401 -220 -140 -145 -121 -308 -152 -199 -151 133 -345 -103 -103 -123 15 30 232 -79
2458g9J47K8O8k3P2k53oK88j23n6K6jk24l2R2R2q4j91R1k17L47j37J4L0K27j78
$$ -79 68 96 164 141 213 -40 -46 242 119 63 89 88 -136 -168 -76 16 -68 -259 -168 -385 -38 -175 -161 -131 96 -82
2484h2N0J07k35L34k61K16K82p1m71J43J46j42L01k25J90j85o0j94J97M2m43Q0
$$ -82 -32 75 -160 174 -87 129 411 340 -131 12 158 16 317 92 282 97 37 -157 40 82 -361 -281
2506b81M3J20J66k13j66K42Q2R2O6l07q0R3J70p3j1QK03k41K27J99l93l3L9m4
$$ -281 -238 -118 48 -165 -331 -89 -7 85 151 -156 -236 -143 27 -46 -57 -49 154 -87 140 339 -54 -87 -48 -92
2530i2L36n8j24j93J02M9o1J83l01j54L56j63R9N2n8k03J9J31N05m97k6J96J25
$$ -92 244 186 62 -131 -29 20 -41 142 -159 -313 43 -120 -21 31 -27 -230 -211 -80 425 -72 -98 98 223
2553B23j84k3O5M1mj30J36K62l30m8J6k1O8j63K46k53m2k84K78p6N2r1J13j2j8
$$ 223 39 16 81 122 118 -12 124 386 56 8 24 3 71 -92 154 -99 -141 -425 -147 -223 -171 -262 -149 -161 -179
2578a79M9K05J34j42k14L71j96j08N6J86j70Q5NJ9j88J10M5k2j39L43j9l65J31
$$ -179 -130 75 209 67 -147 224 28 -80 -24 162 -8 77 82 101 -87 23 68 46 -93 250 231 -134 -3
2601cj66K3J7K5K1N1p8n9p7J46j26K7J92M8j82R9L9k65J10J93l7j10K01M4n6J16
$$ -3 -169 -146 -129 -104 -83 -32 -110 -169 -246 -100 -226 -199 -7 41 -141 -42 -3 -268 -158 35 -2 -112 89 133 77 193
2627A93k25p2J55J05j77J34j90j27P1j13QM2j23N0K09j52O8J28P9k12j36M36j43
$$ 193 -32 -104 51 156 -21 113 -77 -204 -133 -246 -238 -196 -319 -269 -60 -212 -144 -16 63 -149 -285 151 8
2650HJ04m1lJ67J26j99j19K32m52L42Nk02j8j12k44J92k5L38j53q2K9J16j35j04
$$ 8 112 71 68 235 361 162 43 275 -177 165 170 -32 -50 -162 -406 -214 -239 99 -54 -136 -107 9 -126 -230
2674b30r6K79j32K90k07Q8P9l5j24R7O2J29n5j79L0J53K78n03J73j30K0q8l1O9
$$ -230 -326 -47 -179 111 -96 -8 71 36 -88 9 71 200 145 -34 -4 149 427 -76 97 -33 -13 -101 -132 -63
2698f3r0K3j25L30j91R9k67o1K31k2P8k13J56L3P4j05J3L11j29R8k21O4JJ64J9
$$ -63 -153 -130 -255 75 -116 -17 -284 -345 -114 -136 -58 -271 -115 -82 -8 -113 -100 211 82 180 -41 23 24 188 207
2723B07j70J22l35M15l01j32K30j48k6j8J70Q5k39M3K02j00q9rj3NJ21R9j74J21
$$ 207 37 159 -176 239 -62 -194 36 -112 -138 -156 14 99 -140 -97 105 5 -84 -93 -106 -101 20 119 -55 66
2747F6R0k0K38l90l8OJ49o8J09m8j31J40k68J00m8m4J36o0J07j19O6q3J16j25
$$ 66 156 136 374 -16 -54 -48 101 33 142 94 -37 103 -165 -65 -113 -157 -21 -81 26 -93 -27 -110 6 -119
2771a19l8J01k3K36j84j89K74j2o5R9m7j18J34j36K78k25L7j76K07J21L6k95Q7
$$ -119 -157 -56 -79 157 -27 -216 58 46 -19 80 33 -85 49 -87 191 -34 3 -173 34 155 191 -104 -17
2794a7J60r8j12k4j04J49p5J22j43l1J64Q5r0j94Q0L14q9p6O9o8L54n10R0O3N7
$$ -17 143 45 -67 -91 -195 -46 -121 1 -142 -173 -9 76 -14 -208 -128 186 97 21 90 22 376 -134 -44 19 76
2819G6k1J69J33l15l4J55j73j09K16o9J68k86J62k01r9N3J35R7j02q6JQ8j18J28
$$ 76 55 224 357 42 8 163 -10 -119 97 28 196 -90 72 -129 -228 -175 -40 57 -45 -131 -130 -42 -160 -32
2843c2j43K02J62Q8o4j42N1k2k22K56K7N7k71k0J4P4N1m14J79J84k49L40k65J23
$$ -32 -175 27 189 277 213 71 122 100 -122 134 161 218 -53 -73 -59 15 66 -348 -169 15 -234 106 -159 -36
2867c6J2k0J5l2K03l32Q8L9J51K9j37J84r0J81l17J34J11j01R8o1l6J44j06O7
$$ -36 -24 -44 -29 -61 142 -190 -102 -63 88 117 -20 164 74 255 -62 72 183 82 180 119 83 227 121 188
2891A88j31l09k7K37j51j4K33k06kj3j7j7K84j64j38K46J10j52l1L5J43j02R5
$$ 188 57 -252 -279 -42 -193 -207 26 -180 -182 -195 -212 -229 55 -109 -247 -1 109 -43 -74 -39 104 2 97
2914I7j3k7j56L56k79J46Or6M5J12l13q1J10L4L6k7l3q3K12j55k39K9L46k2rj60
$$ 97 84 57 -99 257 -22 124 130 34 79 191 -122 -203 -93 -59 -23 -50 -83 -166 46 -109 -348 -319 27 5 -4 -164
2940a64L13M2k05n8J67k57K37r0K53k1K54m45j12L5K05n5k46j78L30k64K54m3
$$ -164 149 191 -14 -72 95 -162 75 -15 238 217 471 26 -86 -51 154 99 -147 -325 5 -259 -5 -48
2962d8r5K37k86J67j85M85k75k07L38k02P7P1l5J07j42J55k71J5J24l1J66p5J94
$$ -48 -143 94 -192 -25 -210 275 0 -207 131 -71 6 77 42 149 7 162 -109 -94 30 -1 165 90 284
2985B84l34pM34k43l95K47j24j9j2K2J87Mk06m3K22j2j97J86l3O0q3j9J73L1o4
$$ 284 -50 -57 377 134 -261 -14 -138 -157 -169 -147 40 44 -162 -205 17 5 -192 -6 -39 21 -62 -81 92 123 59
3010E9o9O9K4J27j19k35j59M02k08M9J15m16J83J67L57o41O28m66JK66L6k22O9
$$ 59 -10 59 83 210 91 -144 -303 99 -109 -60 55 -361 -178 -11 346 -295 333 -133 -132 134 170 -52 17
3033A7LOj4m2q2j9J81j4J41m1k3J8P2K8k08J96k01j32J90m8J64l61J88k47L01
$$ 17 20 26 12 -30 -112 -131 50 36 177 136 113 131 203 231 23 219 18 -114 76 28 192 -169 19 -228 73
3058G3j50J01j24j24K20k83K69j14J06J36o7j37K60J6O6j09k49L13l45J86J33
$$ 73 -77 24 -100 -224 -4 -287 -18 -132 -26 110 43 -94 166 182 248 139 -110 203 -142 44 177
3079A77j07r1J21R1l84J70J77l36p6J43M0k69N25k53OK02k45M9o7LK54O3k75M62
$$ 177 70 -21 100 191 -193 -23 154 -182 -258 -115 -75 -344 181 -72 -66 136 -109 -60 -127 -124 130 193 -82 380
3103C80k95J13j70J01k11J51n2J44l05J26K20M4p4k83N8K75j99j52Q4K3k00l3
$$ 380 85 198 28 129 -82 69 17 161 -144 -18 202 246 172 -111 -53 222 23 -129 -45 -22 -222 -255
3125b55nj82M90j11j76J20J25R5p1l2j09J9L50j25j07O5P7M7J59m25R3%J12N7
$$ -255 -260 -442 48 -63 -239 -119 6 101 30 -2 -111 -92 258 133 26 91 168 215 374 -51 42 42 154 211
3149B11k28P2Qj64J27J60k77j20J91k33M6K56j6j03J80j81M6K2k7J93k6l51L11
$$ 211 -17 55 63 -101 26 186 -91 -211 -20 -253 -207 49 33 -70 110 -71 -25 -3 -30 163 137 -214 97
3172I7j90M69k97k54M17l42K40kk87L72j37N5o9J8k85R2j20K53j21j29L09j20
$$ 97 -93 376 79 -175 242 -100 140 138 -149 223 86 141 72 90 -195 -103 -223 30 -91 -220 89 -31
3194c1j4K3O3P1m1l4m9L80j98j15r4L45j4l07J69j7n9R7p7l9k10J05j29q8L20
$$ -31 -45 -22 41 112 71 37 -12 368 170 55 -39 306 292 -15 154 137 78 175 98 59 -151 -46 -175 -263 57
3219E7p2m18M89m00N74k97j39J49K8J75l10J78j42J80k4r1L19r8Q3m8k81K03k03
$$ 57 -15 -433 56 -344 230 -67 -206 -57 -29 146 -164 14 -128 52 28 -63 256 158 241 193 -88 115 -88
3242h8K38M2j94K21j90K2l98L64o3Lo2o0k42O00j41j24q0K41k25J70j1j28L09
$$ -88 150 192 -2 219 29 51 -347 17 -46 -43 -105 -165 -407 193 52 -72 -152 89 -136 34 23 -105 204
3265B04j80Q8r6o9J87J21m23K12OJ60j78j23j5J18J25k76j5J66l3K39l60r9P8
$$ 204 24 112 16 -53 134 255 -168 44 50 210 32 -91 -106 12 137 -139 -154 12 -21 218 -142 -241 -163
3288a63m4pm2K64M4P9k27Q8J71j01q2L07j86J99k84Q1k05O7n4J67O4k97O8K75
$$ -163 -207 -214 -256 8 52 131 -96 -8 163 62 -20 287 101 300 16 97 -108 -41 -95 72 136 -161 -93 182
3312A82k06RJ30k45r1J21K8J54j10Oj65O6%J70n7j05O4J26n2nL69k81J18J74m38
$$ 182 -24 -15 115 -130 -221 -100 -72 82 -28 -22 -187 -121 -121 49 -8 -113 -49 77 25 20 389 108 226 400 -38
3337c8M7j97J62n7M4P1J34j76M5r4J46l02J46o3L26l59k7K9J48k4j81R7R6R4M3
$$ -38 9 -188 -26 -83 -39 32 166 -10 35 -59 87 -215 -69 -132 194 -165 -192 -163 -15 -39 -220 -123 -27 67 110
3362A10k03Q2J47K4K63m08L20l72J97R2q8r1j11l7M5J9m8j39K72q8o4J9J44k55
$$ 110 -93 -11 136 160 423 15 335 -37 160 252 164 73 -38 -75 -30 -11 -59 -198 74 -14 -78 -59 85 -170
3386a70j25J42k8K22J8l4R7j05O9Q9j84n2pL52j9m0p7l9J41j66j15j51m3L36k43
$$ -170 -295 -153 -181 41 59 25 122 17 86 175 -9 -61 -68 284 265 225 148 109 250 84 -31 -182 -225 111 -132
3411a32N7p4l9L26n15L21L42m08L30l34M1Q3j17N9J9J58L85l57k25j10L99j99
$$ -132 -75 -149 -188 138 -377 -56 286 -122 208 -126 -85 -2 -119 -60 -41 117 502 145 -80 -190 209 10
3433A0J48k8k37J77J81p0k00J76j74p1j51L81l41J69k41L33j0k94L87j76j7k21
$$ 10 158 130 -107 70 251 181 -19 157 -17 -88 -239 142 -199 -30 -271 62 52 -242 145 -31 -48 -269
3455b69L59k25n0J53J11l5n3K57j47j11M3j34J73J76j45P3k57J01k06R2J87kk80
$$ -269 90 -135 -185 -32 79 44 -9 248 101 -10 33 -101 72 248 103 176 -81 20 -186 -94 93 91 -189
3478a89J47j64J96Pj75Q1q3j10L59k92M56j62K5j38Q6j24L43j67K6O9j47p6lJ39
$$ -189 -42 -206 -10 -3 -178 -97 -180 -290 69 -223 233 71 96 -42 44 -80 263 96 122 191 44 -32 -35 104
3502A04j61L23k42n8j99K36N0m13K77j34K41R8m36J75qK72k04P1k1N9Q4r0l5m2
$$ 104 -57 266 24 -34 -233 3 53 -360 -83 -217 24 122 -314 -139 -147 125 -79 -8 -29 30 114 24 -11 -53
3526e3J55o9k17L34J0j3j66M6j3R4K1j70q6ML3J61O2k68R4k2J19j00k11N7J75
$$ -53 102 33 -184 150 160 147 -19 27 14 108 129 -41 -127 -123 -90 71 133 -135 -41 -63 56 -44 -255 -198 -23
3551b3J2k24J33j30M76j92Mq9o6OL0j23K12J45n2%J2J2m3j36O8n3j04L5J60J46
$$ -23 -11 -235 -102 -232 244 52 56 -33 -99 -93 -63 -186 26 171 119 119 131 143 100 -36 32 -21 -125 -90 70 216
3577B16l06Q4k02L00j94j21K66J57m18J90j50L12p9J41K9j05l7L8j10l3o0J10
$$ 216 -90 -6 -208 92 -102 -223 43 200 -218 -28 -178 134 55 196 225 120 83 121 11 -22 -82 28
3599B8K0J09q4j82k9J60n8L8k8k41J53K02L4j8M0k62M3p5R3L2J9N5L42l18k12
$$ 28 48 157 73 -109 -138 22 -36 2 -26 -267 -114 88 122 104 144 -118 -75 -150 -57 -25 -6 49 391 73 -139
3624a39J31K06r4Q8k16N2j07K20Mp9L6j71P1l93M35P0k17J30k40L38j67K39j40
$$ -139 -8 198 104 192 -24 28 -79 141 145 66 102 -69 2 -391 44 114 -103 27 -213 125 -42 197 57
3647E7pN1l99J84J67O4j77J70k2Q0L9jj65K2K11m07L00J82o06K71J26j00m0l4
$$ 57 50 101 -298 -114 53 117 -60 110 88 168 207 206 41 63 274 -133 167 349 -257 14 140 40 0 -34
3671c4l0J72l44p7M28k59M17k18j30L36j52j32J07k17J44k35M85k46J56p5N6j27
$$ -34 -64 108 -236 -313 115 -144 273 55 -75 261 109 -23 84 -133 11 -224 261 15 171 96 152 25
3693B5P8K9q0J08m1n2r0L09k26j56J63J31l77J83j74n5J72K63n61K59K26j27q8
$$ 25 103 132 52 160 119 67 -23 286 60 -96 67 198 -179 4 -170 -225 -53 210 -351 -92 134 7 -81
3716h1Rj83M26l90J78j4m4J64j05L63l15J13q4P1j07j6j68r7L45M5l45j38K91
$$ -81 -72 -255 171 -219 -41 -55 -99 65 -40 323 8 121 37 108 1 -15 -183 -280 65 110 -235 -373 -82
3739h2l0K97m11N1j69K33K23j45J56j07j24L19j26J34n9j95Q2l13M40j85Pl6k
$$ -82 -112 185 -226 -175 -344 -111 112 -33 123 16 -108 211 85 219 160 -35 47 -266 174 -11 -4 -40 -42
3762d2N2j1k45K10l37K87j65J96oL5P7p0j1q6N7j24P5%K17P8J71m33M9J13l9P7
$$ -42 10 -1 -246 -36 -373 -86 -251 -55 -61 -26 51 -19 -30 -116 -59 -183 -108 -108 109 187 358 -75 -26 87 48 125
3788A25k54Q3K0Q7j51J5O5j10J42j60L5K09j82j39J25Q0Jk37R5Q9N0J64J6o1n5
$$ 125 -129 -46 -26 61 -90 -75 -10 -120 22 -138 -103 106 -76 -215 -90 -10 -9 -246 -151 -62 -12 152 168 107 52
3813E2j9j09LL81j10k20K6O7j27L6q3R8J58j64M8k40K15Pq0m7K16j76L46l73N7
$$ 52 33 -76 -73 308 198 -22 4 71 -56 -20 -103 -5 153 -11 37 -203 12 19 -61 -108 108 -68 278 -95 -38
3838c8j38L33j03o0j5l7J71P4j11K8j25k8J29L8k06L9p9m5K84O2j84K71l05L6
$$ -38 -176 157 54 -6 -21 -58 113 187 76 104 -21 -49 80 118 -88 -49 -128 -173 111 173 -11 260 -45 -9
3862iJ12lj10J84n52J34L41o2Q0j77J08n9k48K46L9M5j42J14o9oo0J74q3M5R9
$$ -9 103 100 -10 174 -378 -244 97 35 115 -62 46 -13 -261 -15 24 69 -73 41 -28 -34 -94 80 -3 42 141
3887A41k20J63J65j51q3P3M7l6r1j2P6j65J52k34J62j29l5J5K27j14j1n7K84k04
$$ 141 -79 84 249 98 15 88 135 99 8 -4 72 -93 59 -175 -13 -142 -177 -162 65 -49 -60 -117 167 -37
3911c7K77j94K4j1o9Q8J02K2k81J53Qj03j71K04r2J30J64m5j00k12n7p8N9pQ8
$$ -37 240 46 70 59 -10 78 180 202 -79 74 82 -21 -192 12 -80 50 214 169 69 -143 -200 -278 -219 -226 -138
3936a38J35Q0k09K90j24O3J3l21J88jj26L59j50J67k09K3O7k4M8k24K68K63l37
$$ -138 -3 77 -132 158 34 97 110 -211 -23 -24 -150 209 59 226 17 40 107 83 131 -93 175 438 101
3959A01J9lk67k2J76j45J33r6L8K74k54Ln2N09k92J92k64j2k70J89K04k22O7J09
$$ 101 120 117 -150 -172 4 -141 -8 -104 -66 208 -46 -43 -95 414 122 314 50 38 -232 -43 161 -61 6 115
3983A15j53Ro0N3K29K30k47k46Q7M9j06P8j91O5L1o1Q7p2J48K2j08k25L83n1N0
$$ 115 -38 -29 -89 -36 193 423 176 -70 17 66 -40 38 -153 -88 -57 -118 -31 -103 45 67 -41 -266 117 66 116
4008A16R5r0j02p1K56j64J8l07K29j30K17J10l1j82k5J88n6J43j77j57m7Q5k10
$$ 116 211 121 19 -52 204 40 58 -249 -20 -150 67 177 146 -36 -61 127 71 214 37 -120 -167 -82 -292
4031b92J36J18j13M15l34rK00k95K04J10m0k38L69L9k06J52l29P2k6J52k51M36
$$ -292 -156 -38 -151 264 -70 -79 121 -174 30 140 100 -138 231 270 64 216 -113 -41 -67 85 -166 270
4053B70k78j33L83l65k7R3J6lK0o3K97j27j86k7Q5K09j46k51qL16j27j2Q9j64
$$ 270 -8 -141 242 -123 -150 -57 -41 -44 -24 -87 210 83 -103 -130 -45 164 18 -233 -241 75 -52 -64 25 -139
4077a39N1J23n8O2O3M5j97R0K49r9k14j05J97k58K24J39j1Pk99m3R9J09K4k17
$$ -139 -88 35 -23 39 102 147 -50 40 289 190 -24 -129 68 -190 34 173 162 169 -130 -173 -74 35 59 -158
4101a58jL34P1j61k73Q1L37p1N3j84K4J32j81k6M6r0J60j1j54m0p6J42N1j76j6
$$ -158 -159 175 246 85 -188 -107 230 159 212 28 52 184 3 -23 23 -67 93 82 -72 -112 -188 -46 5 -171 -187
4126a87J80o5Jj9J16K5l0j31K00j11r9P6j99M24j56L7R1k6L6J2k11j14RK93k63
$$ -187 -7 -72 -71 -90 26 51 21 -110 90 -21 -120 -44 -243 181 25 62 153 127 163 175 -36 -150 -141 152 -111
4151a11J58M7k51N7J36L8j44Q1r3p9K05q2J15K6k40O9k5%qj2j10mJ56K29l5j20
$$ -111 47 94 -157 -100 36 74 -70 11 -82 -161 44 -38 77 103 -137 -68 -93 -93 -101 -113 -223 -227 -71 158 123 3
4177Cr4P8J94q5j65K4K80j31P9l42M1P4n2Rk55L49R4r0lj44Jl4J84o4R3j51J84
$$ 3 -91 -13 181 96 -69 -45 235 104 183 -159 -118 -44 -96 -87 -342 7 101 11 8 -136 -135 -169 15 -49 44 -107 77
4204G7j65J53j60n3n3L29k01J09L61j79K8J01k91J1j61J0k4J22Nn2j08j93L48
$$ 77 -88 65 -95 -148 -201 128 -73 36 397 218 246 347 56 67 -94 -84 -108 14 19 -33 -141 -334 14
4227A4J86k17J1O7q1J00j15Lo6J68l7Nr0J97j05j9K19k40J11k9n5k37O1K01j93
$$ 14 200 -17 -6 61 -20 80 -35 -32 -98 70 33 38 -52 145 40 21 240 0 111 82 27 -210 -149 52 -141
4252a41K02m22J67K36p8J26k57J49Q7j53K52J1k53j78L05m2r2K72n1pp9J22j30
$$ -141 61 -361 -194 42 -36 90 -167 -18 69 -84 168 179 -74 -252 53 11 -81 191 140 133 54 176 46
4275D6m6K97k92J46l81K62N4k20O8M0o5RR9R7p5n8L9k57J93k05R4K64j70N0L1
$$ 46 0 297 5 151 -230 32 86 -134 -66 -26 -91 -82 17 114 39 -19 20 -237 -44 -249 -155 109 -61 -11 20
4300B0K20l90J51O0k96K92P4K09k57j44j82K88j09R5M7k08K59r2j49J90p7j35
$$ 20 240 -150 1 61 -235 57 131 340 83 -61 -243 45 -64 31 78 -130 129 37 -112 78 1 -134
4322a34L2k23K78L9J46k87k58K09R4J67J58j00q1M0r9K3n3J00N8o5O0j94N9n1
$$ -134 -102 -325 -47 -8 138 -149 -407 -198 -104 63 221 121 40 80 -19 4 -49 51 109 44 104 -90 -31 -82
4346h2J16k95K35J72j29n8q1K54j26j09Q5K10m25K44j0N4r5L23J3l48J21j80O1
$$ -82 34 -261 -26 146 17 -41 -122 132 6 -103 -18 192 -233 11 1 55 -40 283 296 -52 69 -111 -50
4369e0n4J03r2K24J6J31k14j88k21K37J54%j36J84k01O1m1K05M4j36J29k98J68
$$ -50 -104 -1 -93 131 147 278 64 -124 -345 -108 46 46 -90 94 -107 -46 -87 118 162 26 155 -143 25
4392B5Rk25P8Q9K20J15k62j2q4r3K75m7J93j92k94K50j57J92k60K23k86K98n9
$$ 25 34 -191 -113 -24 196 311 49 37 -47 -140 135 88 281 89 -205 45 -112 80 -180 43 -243 55 -4
4415drK7N3%l52K73K8j23P3n8p1J93k42R0K02J59j1j04j75J21N7l6K32m84L5J85
$$ -4 -13 14 67 67 -285 -12 16 -107 -34 -92 -163 30 -212 -122 80 239 228 124 -51 70 127 91 323 -161 -126 59
4441E9n3j0l2K10k20nO1k8J44m5n5k90J83K84l42J84p9N5L6k79K01J77m9r7l1
$$ 59 6 -4 -36 174 -46 -51 10 -18 126 81 26 -264 -81 203 -139 45 -34 21 57 -222 -21 156 107 10 -21
4466b1J47j52J13Q9k05M7k10o1J4K68K91m65J1K10r6j14LJ28j62J73k23K44J46
$$ -21 126 -26 87 176 -29 18 -192 -253 -239 29 320 -145 -134 76 -20 -134 -131 -3 -165 8 -215 29 175
4489A75J00n47L19M8j45J37j44Q6n4J71l50K48R2J74j49j3p5N4m59L58j04J9J53
$$ 175 275 -272 47 95 -50 87 -57 29 -25 146 -204 44 136 310 161 148 73 127 -332 26 -78 -59 94
4512I4j86L16k60k5j00J69k61L22k49L3J34J97p4n8rJ3l06M06j56l9k61M99k40
$$ 94 -92 224 -36 -61 -161 8 -253 69 -180 -147 -13 184 110 52 43 56 -250 156 0 -39 -300 199 -41
4535d1Q7q8J08M9k20j74J84K92k02r7O0O1K64n30J69L36j05k26J05j2j2K17j01
$$ -41 46 -42 66 115 -105 -279 -95 197 -5 -102 -42 19 283 -247 -78 258 153 -73 32 20 8 225 124
4558A24j06q5K16J12k90PJ57k87L54q6k30J52J11J91l03J76l75j3K38j63J64p7
$$ 124 18 -67 149 261 -29 -22 135 -152 202 116 -114 38 149 340 37 213 -162 -175 63 -100 64 -13
4580a3K8Rk34j16J36K96j01n8J53j60L91l47n3J9K91m87M22p5J19M5k27q2O5J50
$$ -13 15 24 -210 -326 -190 106 5 -53 100 -60 331 -16 -69 -50 241 -246 176 101 220 265 38 -44 21 171
4604A71k60J11J39j45n8o9J83m4j11J54j92L6j65J49J11j3j33K26M8k24J78J01
$$ 171 -89 22 161 16 -42 -111 72 28 -83 71 -121 -85 -250 -101 10 -3 -136 90 138 -86 92 193
4626A93K2j40J32n04K78K21k67J76j59K36N4l15K3K18j13j31q8m3K76j95K0R4
$$ 193 215 75 207 -297 -19 202 -65 111 -48 188 242 -73 -50 168 55 -76 -164 -207 69 -126 -106 -12
4648a2Pk2J64M6j37k44R2M29m01J46k0N2j47K30j91mLJ29K2j58J22j5p8j91K14
$$ -12 -5 -27 137 183 46 -198 -106 323 -78 68 48 100 -47 183 -8 -12 -9 120 142 -16 106 91 13 -178 36
4673C6N9j49J60jo3r5k85L29m8k28J50N2J76M5m03L77k1J6j43J32J22o4k77J47
$$ 36 95 -54 106 105 42 -53 -338 -9 -57 -285 -135 -83 93 138 -265 112 91 107 -36 96 218 154 -123 24
4697B4j18K16M9k57J82k06O0m8O0k96L27L5k7J37k76M7l0jR4q9J81K3k05L53m03
$$ 24 -94 122 171 -86 96 -110 -50 -98 -38 -334 -7 28 1 138 -138 -91 -121 -122 -28 -117 64 87 -118 235 -168
4722a68K88p0j09o9N9K96k9j76j49K0K92k64n2J60nk30L79j0k18j33K93k87j16
$$ -168 120 50 -59 -128 -69 227 198 22 -127 -107 185 -79 -131 29 24 -206 173 163 -55 -188 105 -182 -298
4745b98M09j40N6q9q8r5K37k49J19K17J23j65n4J03j82K48Nj86QJ51P2k50J27
$$ -298 111 -29 27 -62 -150 -245 -8 -257 -138 79 202 37 -17 86 -96 152 157 -29 -21 130 202 -48 79
4768G9q4j1QK3m1q3K28J4O4k07K0J61j89k56J10K80k13j1J58M0Lj09j54J79m1
$$ 79 -5 -16 -8 15 -26 -109 119 133 197 -10 10 171 -18 -274 -164 116 -97 -108 50 90 93 -16 -170 9 -32
4793c2K76l16K07O4m33K62J94k55n1N4K5Mk3K40k78o5O3M5j08J82p8J56J13l1
$$ -32 244 -72 135 199 -234 28 222 -33 -84 -30 -5 -1 -24 216 -62 -127 -64 -19 -127 55 -23 133 246 215
4817B15l61K32j95J62P9j59K97l50%%o7O5L6R8k33J26j30L28j75Q6j86J41j22
$$ 215 -146 86 -109 53 132 -27 270 -80 -80 -80 -147 -82 -46 52 -181 -55 -185 143 -32 54 -132 9 -113
4840a13p5K50R5l64K6K2L5J88%K11M2J4j49j01J6j52J79l03Q9P4J64k67N4P6k8
$$ -113 -188 62 157 -207 -181 -159 -124 64 64 275 317 331 182 81 97 -55 124 -179 -90 -16 148 -119 -65 11 -17
4865a7j9r8O6L60l45k30J57J12J15Rr1q9L4P8q5J14r4J38j24K0p5J88J5J55j01
$$ -17 -36 -134 -68 292 -53 -283 -126 -14 101 110 19 -70 -36 42 -43 71 -23 115 -9 11 -64 124 139 294 193
4890A93j49O7k45L23j31k75K9l9R2L17M5j87l13L93m6k14J60r7j01J57J4j35K33
$$ 193 44 111 -134 189 58 -217 -188 -227 -135 182 227 40 -273 120 74 -140 20 -77 -178 -21 -7 -142 91
4913I1L4k16J27l7J98j79J62J25l54j44L26k39J60K1k17J72MP6k04K18j53pk08
$$ 91 125 -91 36 -1 197 18 180 305 -49 -193 133 -106 54 75 -142 30 34 110 -94 124 -29 -36 -244
4936b44R4J69j15n0J96j39J74o1j19N1J49j01q7L09mj42k48J5K08j79J35j29L33
$$ -244 -150 19 -96 -146 50 -89 85 24 -95 -44 105 4 -83 226 222 80 -168 -153 55 -124 11 -118 215
4959B15k05j06k7K09j83R3p8J38n2k89K12J3l68L04J9J84j22K65o40L83J21Ll9
$$ 215 10 -96 -123 86 -97 -4 -82 56 4 -285 -73 -60 -428 -124 -105 79 -43 222 -418 -35 86 89 50
4982E0K42l84K7J40j24L43k10r7L27l01q9k9K12p3K30k15j06j17P8J02K6j04j50
$$ 50 292 -92 -65 75 -49 294 84 -13 314 13 -76 -105 107 34 264 49 -57 -174 -96 6 32 -72 -222
5005b22K59k00J75k72L29L2J23j78J19k28n1J35J23j56Q6o6M8J8k69J63J17p3
$$ -222 37 -163 12 -260 69 101 224 46 165 -63 -114 21 144 -12 74 8 56 74 -195 -32 85 12
5027A2l1j12J62q9K2j22J14K43j17J17k00K42k5j06N6k76K61q1n5L00m88N3K28
$$ 12 -19 -131 31 -58 -36 -158 -44 199 82 199 -1 241 216 110 166 -110 151 70 15 315 -173 -120 108
5050A08L2j05J38j3l17q3K71K01l02K27j23J58l37K2K6J26P2k37R3P1N7jJ1q6
$$ 108 140 35 173 160 -157 -240 31 232 -70 157 34 192 -145 -123 -97 29 101 -136 -43 28 85 84 95 9
5074Il13L57p6K29j72J5o1l5J32j88M78m31J7QK87M8l31lk99K78J56k27J09j20
$$ 9 -304 53 -23 206 34 49 -12 -47 85 -103 375 -56 -39 -31 256 304 -27 -30 -329 -51 105 -122 -13 -133
5098a33J11j20J07pQ0q5K1n9P0j0K31j9k91J21J10o9k13J74Mj12r1J97Q3L0j69
$$ -133 -22 -142 -35 -42 38 -47 -26 -85 -15 -25 206 187 -104 17 127 58 -155 19 23 -89 -180 17 100 130 -39
5123c9O5J66m29N83l63K24lk61j1j02M1J79m70M68r0n4Q0Rn1J16k8j78J79j05
$$ -39 26 192 -237 346 -17 207 204 -57 -68 -170 -129 50 -420 48 -42 -96 -16 -7 -58 58 30 -148 31 -74
5147g4J19Q3L9qq7k04r9J41L11m66j8P2J5J62P2k40nK01Or7K1p2K29P5k28p4J96
$$ -74 45 128 167 159 72 -132 -231 -90 221 -245 -263 -191 -176 -14 58 -182 -187 14 20 -77 -56 -128 101 176 -52 -126 70
5174G0k09K98k92K56q1r4M8K09j97J36k8J42l12K29n1j14o3q6P5R5r6nm6J57j56
$$ 70 -139 159 -133 123 42 -52 -4 205 8 144 116 258 -54 175 124 10 -53 -139 -64 31 -65 -70 -116 41 -115
5199a15J33q2j07K41r6J82j64K10k47J53Q8N8k62J9R4k21J11k4j45K84k43K49
$$ -115 18 -64 -171 70 -26 156 -8 202 -45 108 196 254 -8 11 105 -116 -5 -29 -174 110 -133 116
5221A16j19j72K55j98K24j28j85L03j23p5J99l57K93n4P0J14l02L05m8l39L59
$$ 116 -3 -175 80 -118 106 -22 -207 96 -27 -102 97 -260 33 -21 49 163 -139 166 118 -221 138
5242A38j37J24k84K40p5j80J89q8K9J1K57l6k01m4K18j07o3r5j9J32j41M8J7J83
$$ 138 1 125 -159 81 6 -174 15 -73 -44 -33 224 188 -13 -57 161 54 -9 -104 -123 9 -132 -84 -67 116
5266A16j37L1N6J01j80j3o9K22j82Q7K9k1J08J08k31j77O4J33q3k39J22N7K9K8
$$ 116 -21 10 66 167 -13 -26 -95 127 -55 32 61 40 148 256 25 -152 -88 45 -38 -277 -155 -98 -69 -41
5290d1O9j51J57k84L26j43J96k03J81j23J22o0n7p5l1R4m8K47n7j36j11J44j31
$$ -41 28 -123 34 -250 76 -67 129 -74 107 -16 106 46 -11 -86 -117 -23 -71 176 119 -17 -128 16 -115
5313a15K63o8J34l61n3J2J18j73K38j36J34k37L22l93J99K59m45K50L7n9J89m3
$$ -115 148 80 214 -147 -200 -188 -70 -243 -5 -141 -7 -244 78 -315 -116 143 -302 -52 -15 -74 115 72
5335G2m2j14J68p4k24K98L1j83N3k11K35m7J15J50j61Jl3N3k75R2L7m7N7j28L45
$$ 72 30 -84 84 10 -214 84 115 -68 -15 -226 9 -38 77 227 66 67 34 87 -188 -96 -59 -106 -49 -177 168
5360A68k67k5P1j85L43j39m9k8K42R1k55J29j86r7j4L06n5J30o8j29J30k17J29
$$ 168 -99 -124 -53 -238 105 -34 -83 -111 131 222 -33 96 -90 -187 -201 105 50 180 112 -17 113 -104 25
5383B5k3K9k57J80k27K20J55l3j81J7N9j26J92k4K8J08j41j58J07o1N7K7Q7j43
$$ 25 2 31 -226 -46 -273 -53 102 69 -112 -95 -36 -162 30 6 34 142 1 -157 -50 -111 -54 -27 60 -83
5407h3L64j83o8l5M4M7j4q0j40K20k91M33n26K94J43j74j34K45K2m6j4p7j21L1
$$ -83 281 98 30 -5 39 86 72 -8 -148 72 -219 214 -312 -18 125 -49 -183 62 84 38 24 -53 -174 -143
5431a43J48J29J95l85L51k48m5O8k48Q9J14M9m1j05J19q7O7j16J08j22R4J42K5
$$ -143 5 134 329 -56 295 47 2 70 -178 -89 25 74 33 -72 47 -40 27 -89 19 -103 -9 133 158
5454A58k76L94k52J47j6ll72L87n7k93K72q7J20m5P4j81P0J14J47m40L98j00j12
$$ 158 -118 276 24 171 155 152 -220 167 110 -183 89 2 122 77 151 -30 40 154 301 -139 259 159 47
5477D7P3p4Pj51Q2J17j17J74m6L0j41R3m32J66K08k01M23l21Q1k00K77j61K84
$$ 47 120 46 53 -98 -16 101 -16 158 112 142 1 94 -338 -172 36 -165 258 -63 18 -182 95 -66 218
5500B18m87N48j28j14K54k68N7j85K99k71K18J09k00O5k35lJ36j22k5K49m15L74
$$ 218 -269 279 151 37 291 23 80 -105 194 -77 141 250 50 115 -120 -123 13 -109 -134 115 -300 74
5522G4n2J69k92J87M0m9k9qJ49k38J11j81L75n17K89J05K1j26J25n4k60O9J57
$$ 74 22 191 -101 86 126 77 48 40 189 -49 62 -119 256 -261 28 133 154 28 153 99 -161 -92 65
5545F5j69J02j9k42K12L5j63mL37k60J39j30QJ24j49M17l78J15O3j68M0K0n6m9
$$ 65 -104 -2 -21 -263 -51 -16 -179 -183 154 -106 33 -97 -89 35 -114 303 -75 40 103 -65 -25 -5 -61 -110
5569a10N0K61qk27K51j36j4j28nQ5J25k31PJ85j61j02O2Q7p0J37N2k60J99p5K44
$$ -110 -60 201 193 -34 217 81 67 -61 -66 19 144 -87 -80 105 -56 -158 -96 -9 -79 58 110 -150 49 -26 218
5594B18k33K36N2k99J07l3J60k80L3j8J29j99J55j24K41j27J87j93p9j8k9m2Q2
$$ 218 -15 221 273 -26 81 48 208 -72 -39 -57 72 -127 28 -96 145 18 205 12 -67 -85 -114 -156 -74
5617g4j17J23o0J59l41N08l29J25J27r0l39L09J32J24j97p4j89M27j74J54j44
$$ -74 -191 -68 -128 31 -310 198 -131 -6 121 31 -308 1 133 257 60 -14 -203 224 50 204 60
5638F0j42l0O9j0P2j85L0K13Q5k55p2k1N7M9J1r6J3Q1J3l4J48j10j95L29LQ3k09
$$ 60 -82 -112 -43 -53 19 -166 -136 77 162 -93 -165 -186 -129 -80 -69 -165 -152 -71 -58 -92 56 -54 -249 80 83 166 -43
5665d3R0J54m15N75m70L99k61L8R3n4m5J21j92K44n27K44P1j84K72J19m62L64
$$ -43 47 201 -214 361 -109 290 29 67 160 106 61 182 -10 234 -293 -49 22 -162 110 229 -233 131
5687A31j95J21n8M7j03j10L98k91k48L28M0K1k44R5J72j69L5k57K19J9k2J0j27
$$ 131 -64 57 -1 46 -57 -167 231 -60 -308 20 60 81 -163 -68 104 -65 -30 -287 -68 -49 -71 -61 -188
5710a88J92k41K85j21j67J26J79j17j66L00r2J18k50j8K39K9K16k88j31L29j41
$$ -188 4 -237 48 -73 -240 -114 65 -52 -218 82 -10 108 -142 -160 79 108 324 36 -95 234 93
5731I3j18J62m7k28R3Q0O3K3j59J32j40J69l12J0K98l44O5P5nJ72Mr1k72K63M3
$$ 93 -25 137 90 -138 -45 35 98 121 -38 94 -46 123 -189 -179 119 -225 -160 -85 -90 82 86 -5 -277 -14 29
5756B9J55j68k7L7J89l18K45m06L57J42k01R0n7p9P4n9k81M04k18J73r2mJ07j10
$$ 29 184 16 -11 26 215 -103 142 -264 93 235 34 124 67 -12 62 3 -278 126 -92 81 -11 -15 92 -18
5780a8MJ34l75L36Mj86L37o2j76J73k66J94L0k00K50j00J10R6M5l64j17K7K25
$$ -18 -14 120 -255 81 85 -101 236 174 -2 171 -95 99 129 -71 179 79 189 285 330 -34 -151 -124 101
5803A01n1k38J55k5j15J0K31k92J89R6k58l5m0K52k63M09J33l22J35Kq8j30J96
$$ 101 50 -188 -33 -58 -173 -163 68 -224 -35 61 -197 -232 -272 -20 -283 126 259 -63 72 74 -14 -144 52
5826E2J0m7P6k0o1q1Q0o3m6P3L3m3j00L3q1J99j65R3k90L64r3j79J90j71K41n1
$$ 52 62 15 91 71 10 -71 9 -54 -100 -27 6 -37 -137 -104 -185 14 -151 -58 -348 16 -77 -256 -66 -237 4 -47
5852d7J86k16J38m7K6M9k00K64j10q0M9r3L2k23L05L5Q4k94M42k05k65J91j71
$$ -47 139 -77 61 14 40 89 -111 153 43 -37 12 -81 -49 -272 33 68 152 -142 300 95 -170 21 -150
5875a50oL85l71M8r5K55k17j27M67k27kK30r7J36k64J99j10j73Q1N4R6k79M1m0
$$ -150 -156 229 -142 -94 -189 66 -151 -278 189 -38 -40 190 93 229 -35 164 54 -119 -38 16 112 -167 -126 -166
5899a66J14j7k5j4K88j17J8l42K08N7K5m3k0j51J11K34j39k7P9j29K43Nkj68m1
$$ -166 -52 -69 -94 -108 180 63 81 -261 -53 4 29 -14 -34 -185 -74 160 21 -6 73 -56 187 192 190 22 -19
5924a9J94k96R3Q3L1j50n1J20J99j46l34j8J29R4O5j66J34q0K85n02M57K4R8j9
$$ -19 175 -121 -28 55 86 -64 -115 5 204 58 -276 -294 -165 -71 -6 -172 -38 -118 167 -335 122 146 244 225
5948B25j20k48k9L21j22J73j91Q1j09J68p0J76j88J6o8j68J69l6J00k6j62j19
$$ 225 105 -143 -172 149 27 200 9 90 -19 149 79 255 67 83 15 -153 16 -20 80 54 -108 -227
5970b27K08l16M17k2p4n5J15k9j53p1J74J75j67R4O6k22J11J69j0m60L56J88j86
$$ -227 -19 -335 82 60 -14 -69 46 17 -136 -207 -33 142 -25 69 135 -87 24 193 183 -277 79 267 81
5993H1l05o1L55j24j2J79j77J5n8L5K33j05l4p4L33j97j62j53L59l51J42O0J87
$$ 81 -224 -285 70 -54 -66 113 -64 -49 -107 -72 161 56 22 -52 281 84 -78 -231 128 -223 -81 -21 166
6016A66r9K6q8p3k0j08N62l34j06N9L3J25n5j95r5j12L66j95M6r1K17J65k26K18
$$ 166 67 93 5 -68 -88 -196 366 32 -74 -15 18 143 88 -107 -202 -314 52 -143 -97 -188 29 194 -32 186
6040A86l7n0J62l18O9j46J18J10j77K01j09J36q8k31J43N9k56L39k50m9J42k28
$$ 186 149 99 261 -57 12 -134 -16 94 -83 118 9 145 57 -174 -31 28 -228 111 -139 -188 -46 -274
6062b74L38j49j28M36O4l83K77o6m12J98J82k0l6K69o8j20J16k81L59p6J78m10
$$ -274 64 -85 -213 223 287 -96 181 115 -297 -99 83 63 27 296 228 108 224 -57 302 226 404 -6
6084fJ83r7k43K65k05O7J09%R4l28K36l8Q2j63K2j25K85k19j22N3J39j1L3J90
$$ -6 177 80 -163 102 -103 -36 73 73 167 -161 75 37 119 -44 -22 -147 138 -81 -203 -150 -11 -22 11 201
6108B01k18o4J0K47l08M4J84M09m03J36j60j14p2L33l27K38m36R7K22p5n7q9J44
$$ 201 -17 -81 -71 176 -132 -88 96 505 102 238 78 -36 -108 225 -102 136 -300 -203 19 -56 -113 -202 -58
6131e8J92k08j1J46k5k39J38J12j69k42J93L48M1j74Q3J42o25M26J85j61J7j10
$$ -58 134 -74 -85 61 36 -203 -65 47 -122 -364 -171 177 218 44 127 269 -356 70 255 94 111 1
6153AJ44k38K7J60J0P2k64M39j66l52K33k79ON41j91J07n55L13j1k17L52M5j40
$$ 1 145 -93 -66 94 104 176 -88 351 185 -167 66 -213 -207 334 143 250 -305 8 -3 -220 132 177 37
6176C7J11m46K76K40l12K44l79M46j20j20J96n2j91q5L19m43L72j64J47j29K2
$$ 37 148 -298 -22 218 -94 150 -229 217 97 -23 173 121 -70 -155 164 -279 93 -71 76 -53 -31
6197c1J5P1j85J7q2J71j29J06J75j61K99l89LJ18J63k81J89p1L09j74k02j04K69
$$ -31 -16 55 -130 -113 -195 -24 -153 -47 128 -33 266 -123 -120 -2 161 -120 69 -2 307 133 -69 -173 96
6220I6Ll56K80j18R0N3l7J6j92KJ38k42K0M33j62J5K59l05k73L95j95K67k49J72
$$ 96 99 -257 23 -95 -5 48 11 27 -165 -163 -25 -267 -247 186 24 39 298 -7 -280 115 -80 187 -62 110
6244A10m6pJ5p6L3O6j80o0K94k02J14p6J39j71J3k4J02m4k37j42J44K52ONL7k8
$$ 110 64 57 72 -4 29 95 -85 -145 149 -53 61 -15 124 -47 -34 -58 44 0 -237 -379 -235 17 23 28 65 37
6270C7Q1o7j22lJ90j34J14J36k18l6K61k89J68j65K68o3j61K41k05M9k05R3Q6
$$ 37 118 51 -71 -74 116 -18 96 232 14 -22 239 -50 118 -47 221 158 -3 238 33 82 -123 -30 56
6293E6K8m9J11m09J63J38n3JQ1j15M80n20R0K99k20m3j11j5R1J81k19o3K37J1
$$ 56 84 35 146 -263 -100 38 -15 -14 67 -48 432 -88 2 301 81 38 -73 -88 3 184 -35 -98 139 150
6317A50k20n1O8J23j50n3J47j35on3J92j31r9J49Q3R6l55M27L6Q7j96j43K75j39
$$ 150 -70 -121 -53 70 -80 -133 14 -121 -127 -180 12 -119 -218 -69 14 110 -245 182 218 305 109 -34 241 102
6341A02k11n8J61KQ4l1n1K85k67J99j81r9j16K04R1l04K33k99J87J11n1m04M02
$$ 102 -109 -167 -6 -4 80 49 -2 283 16 215 34 -65 -181 23 114 -190 43 -256 -69 42 -9 -413 -11
6364a1K66k94q3K70J48l69O5K3l0n0J91r5M6q8Q4q2N3pJ2O5j7q9q6k5K90j90j14
$$ -11 255 -39 -122 148 296 -73 -8 15 -15 -65 126 31 77 -11 73 -9 44 37 49 114 97 8 -78 -103 187 -3 -117
6391a17n6J7K31j31J58j81N9O2N1l7M8l2l78M46J1n5j1K53l20j58J57p1NJ22p2
$$ -117 -173 -156 75 -56 102 -79 -20 42 93 56 104 72 -306 140 151 96 85 338 18 -140 17 -54 -49 73 1
6416Ak03J17Lj70j5L74k65M14r4kk31Ko1J43qp9K05j16r1Q1j07kl6K58n3N1P6
$$ 1 -202 -85 -82 -252 -267 107 -158 256 162 160 -71 -69 -130 13 5 -74 131 15 -76 5 -102 -104 -140 118 65 116 192
6443A92m6k22j13L6J79O2O2k50O2q1M7o8K50j80K45l1k52K7J00P0j84P7M8j30
$$ 192 146 -76 -189 -153 26 88 150 -100 -38 -119 -72 -140 110 -70 175 144 -108 -81 19 89 -95 -18 30 -100
6467a00J88j05j10N6j02K86j95K07l39R1R6p3K58j97n1Q2p9j95J51K48k27L36
$$ -100 88 -17 -127 -71 -173 113 -82 125 -214 -123 -27 -100 158 -39 -90 -8 -87 -282 -131 117 -110 226
6489B26J08n54M98l57M2k8L73l32n1L09l01J03n8o7L3mJ28l59M28l07L6J60o9
$$ 226 334 -220 278 -79 -37 -65 308 -24 -75 234 -67 36 -22 -89 -56 -60 68 -291 137 -170 -134 26 -43
6512d3j52J59j04KK59k42J63R0l46K41J36l40K33l4J42j70mJ12NQ0l15K40n2j6
$$ -43 -195 -36 -140 -138 121 -121 42 132 -214 27 163 -177 56 22 164 -6 -10 102 107 187 -128 112 60 44
6536D4O2l9J6M8q4J83k41p2J63j85m5M8L29m40M02k92O9M6J74m03O1K40kQ2k21
$$ 44 106 67 83 131 47 230 -11 -83 80 -105 -150 -102 227 -213 189 -103 -34 12 186 -217 -156 84 82 164 -57
6561e7k14M10j59J20K3J23o9l00K22OKM7j34j0Q4J41k05Qm5kR5j03l5K17j73l01
$$ -57 -271 139 -20 100 123 246 177 -123 99 105 107 154 20 10 94 235 30 38 -7 -9 86 -17 -52 165 -8 -309
6587c09J40p4J61j25K44q3j36J98J92k60K98k20L6o6m8J63J10k00O3n6p8K23j80
$$ -309 -169 -243 -82 -207 37 -46 -182 16 208 -52 246 26 62 -4 -52 111 221 21 84 28 -50 173 -7
6610gJ2P9j68K14l67K55R4j35J1r5J86L8Lk64M1J26O0p9j88J68K12Q9k17j39J39
$$ -7 5 84 -84 130 -237 18 112 -23 -12 -107 79 117 120 -144 -103 23 83 4 -184 -16 196 285 68 -71 68
6635F8j49K90k19Oj16K34r1lK13k81J51K8q8r8j08K02k03M46k87J53l84M02j57
$$ 68 -81 209 -10 -4 -120 114 23 20 233 -48 103 131 43 -55 -163 39 -164 282 -5 148 -236 166 9
6658IN0p9j4J09J06o9j28L57j58j4k64J1N3jj25J78j81R9L42l11l8L69n69J54
$$ 9 59 -20 -34 75 181 112 -16 341 183 169 -95 -84 -31 -32 -157 21 -160 -61 281 -30 -68 301 -268 -114
6682a14J95j45K23l52J55Q2k28K92j43K2O4K06j58j8J94k03l00J98J4LK08j06
$$ -114 81 -64 159 -193 -38 44 -184 108 -35 -13 51 257 99 81 275 72 -228 -30 -16 -13 195 89
6704H9j34L01k36j5J34j94r2J63k5k00R0np8J98j0j08K44j71K76l45j05K25k12
$$ 89 -45 256 20 5 139 -55 -147 16 -9 -209 -119 -124 -202 -4 -14 -122 122 -49 227 -118 -223 2 -210
6727b10K59n5N5J40k18j88m2L52j07j6J68j44J4J32k48k7K70k19J75j79K16%k25
$$ -210 49 -6 49 189 -29 -217 -259 93 -14 -30 138 -6 8 140 -108 -135 135 -84 91 -88 128 128 -97
6750i7j78L98N5k70L78m88J40K67j02k43J82R2j75j68L15k44P1J36k79M50o2j22
$$ -97 -275 123 178 -92 286 -202 -62 205 103 -140 42 134 -41 -209 106 -138 -67 69 -210 240 178 56
6772E6J26j76q3K54m04k8K01M2J01l65K65n1J28j26j68K80l9Km2J5J42Rk39J0
$$ 56 182 6 -77 177 -227 -255 -54 -12 89 -276 -11 -62 66 -60 -228 52 13 15 -27 -12 130 139 -100 -90
6796i0J08J53P1k63q6L93j18m70J65k43N08k3n7o8L26l15m1j06n6R3J20R0R1j48
$$ -90 18 171 242 -21 -107 286 168 -302 -137 -380 128 105 48 -20 306 -9 -50 -156 -212 -119 1 91 182 34
6820C4j33K12k76J44k58K01j9K58j20k67J44LM11k01j37N9r6J19r0j76Q9NL8J96
$$ 34 -99 113 -163 -19 -277 -76 -95 163 43 -224 -80 -77 334 133 -4 55 -41 78 -12 -188 -99 -94 -56 140
6844A40j63K54m42K51j1l00K52J03l34L5K47k43L01r4J8j27m1J62K63k75L1k08
$$ 140 -23 231 -211 40 29 -271 -19 84 -250 -215 32 -211 90 -4 14 -113 -154 8 271 -4 27 -181
6866a81J75Q7j08j89J38K01j2K7r1l57K51N1q4J21L7j66J49p8n0r4J7J31r7J66
$$ -181 -6 81 -27 -216 -78 123 111 138 47 -310 -59 -8 -92 29 66 -100 49 -29 -79 -173 -156 -25 -122 44
6890D4j17R6j59J16J86j1j51N5k92L26m71K88p0l7K19j27j93K12jK27j84j61O6
$$ 44 -73 23 -136 -20 166 155 4 59 -233 93 -378 -90 -160 -197 22 -105 -298 -86 -87 140 -44 -205 -139
6913a39K12k86k8L94k14L50m25J53K6J61J9j28J02l61N3J31R6j02R7q6O8k46P2
$$ -139 73 -213 -241 153 -61 289 -136 17 43 204 223 95 197 -164 -111 20 116 14 111 25 93 -153 -81
6936h1K88j96k21R6j17K79l6QO2j77J72Q2n6L29m79K00k82J81K3j29Nn9J71oj44
$$ -81 207 11 -210 -114 -231 48 12 20 82 -95 77 159 103 432 -47 153 -129 52 75 -54 -49 -108 63 57 -87
6961h7K34J6jj70j06K19n0J33l33R9J23j93J85j12K9Kj7M2o5J29l51L48K2J33
$$ -87 147 163 162 -8 -114 105 55 188 -145 -46 77 -116 69 -43 -14 -12 -29 13 -52 77 -274 74 96 229
6985B29j18j4J14K41l93k84L30l63L34J25l43J65J54j76j26O2j41L76k32P9j19
$$ 229 111 97 211 452 59 -225 105 -258 76 201 -142 23 177 1 -125 -63 -204 172 -60 19 -100
7006a00J4K7j90Q9L4P6L16l46j3n6K45j07J09j26kM1P9k67J88m0J02J06l41O3
$$ -100 -86 -59 -249 -160 -126 -50 266 -80 -93 -149 96 -11 98 -28 -30 11 90 -177 11 -29 73 179 -162 -99
7030i9k6L27k50j32q7J56J24k46Q3L0j48R3j17K20k1K92j23n0j13n9K7J46k76
$$ -99 -125 202 -48 -180 -267 -111 13 -233 -150 -120 -268 -175 -292 -72 -93 199 76 26 -87 -146 -119 27 -249
7053b49L03M3m2k4J27m15L50k91J16M5l7K83k34K6j2j02K87k12o1l58P54j54j65
$$ -249 54 97 55 31 158 -257 93 -198 -82 -37 -74 209 -25 1 -11 -113 174 -38 -99 -457 297 143 -22
7076b2K7O0q5K07k58J90j23o2K29k72K26m9k8J30k16J12M6j53J31j55O9j34L79
$$ -22 5 65 -20 187 -71 119 -4 -66 163 -109 117 68 40 170 -46 66 112 -41 90 -65 4 -130 249
7099B49n28K99M7pK4L3L7j19L30l30m2J53k0o8o7j4j36Q0j26J03o6M46k51k08
$$ 249 -279 20 67 60 84 117 154 35 365 35 -7 146 126 58 -9 -23 -159 -79 -205 -102 -168 278 27 -181
7123a81K08k1q0J02j85J96l3L5j04p0J90k2k24J31J35n9k37J79K31P4l57J64M8
$$ -181 27 6 -74 28 -157 39 6 41 -63 -133 57 35 -189 -58 77 18 -219 -40 191 265 -92 72 120
7146A20j73J91Q5j58M2J05j12j82j51L78j14j67N3M8J3m2J4O3N%J9pk4q8qK7j8
$$ 120 -53 138 223 65 107 212 100 -82 -233 145 31 -136 -83 -35 -22 -64 -50 13 18 18 37 30 6 -82 -90 -63 -81
7173h1J31j02rL01p9k42O9k09J69O5m0LJ42q2K16k83j10M5o0K15k33J74r7j41
$$ -81 50 -52 -61 240 161 -81 -12 -221 -52 13 -27 -24 118 36 252 -31 -141 -96 -156 59 -174 0 -97 -238
7197b38J24J82k00NJ53K7j70J1L47k14q9K45j74K33k42O2JJ54k65R1R2j84J58
$$ -238 -114 68 -132 -127 26 53 -117 -106 241 27 -62 183 9 242 0 62 63 217 -48 43 135 -49 109
7220A09J22r2j79J44l39L12kj03j1J78l01K13k32K20J71l70J93J14k01k22L10
$$ 109 231 139 -40 104 -235 77 75 -28 -39 139 -162 51 -181 39 210 -160 33 147 -54 -276 34
7241C4N0O4j88J02l30L95m4o7l19J45K71j63J04O0q3l50M90l10J35j05L01k38
$$ 34 84 148 -40 62 -268 127 83 16 -303 -158 113 -50 54 114 31 -319 171 -139 -4 -109 192 -46
7263d6K7L74l05j27k8J56j36K35j46J71k71O3J30k10J00R2k54K20j11j54K31r6
$$ -46 -19 355 50 -77 -105 51 -85 150 4 175 -96 -33 97 -113 -13 79 -175 45 -66 -220 11 -85
7285h5J43l98L83K3o4jj69Q0K98k2j95n5R0j72L85j19k57J34K3J30k86N2K68m0
$$ -85 58 -340 43 66 2 1 -168 -88 210 188 -7 -62 28 -144 241 122 -135 -1 22 152 -134 -82 186 146
7309A46P1k80J8L09l11P2L1k35K43n3k5O0p4J36j36q0J64jj61K09J84k78k50K14
$$ 146 217 -63 -45 264 -47 25 56 -179 64 11 -14 46 -28 108 -28 -108 56 55 -106 103 287 9 -241 -27
7333b7J93m64L23K0J48k65M1k2K77R6r6l65PJ43M7j84M3J0L19j91n4q1J4J41k75
$$ -27 166 -298 25 45 193 -72 -31 -53 224 320 224 -141 -134 9 56 -128 -85 -75 244 53 -1 -82 -68 73 -202
7358b02K7N3K03k8Jl47R8J24q0l7K95k35K4m1K34n0j10j3R3j18O8J13j60J60j29
$$ -202 -175 -122 81 53 54 -293 -195 -71 -151 -188 107 -128 -104 -145 89 39 -71 -84 9 -109 -41 72 -88 72 -57
7383e7J88l10Q5M6P0J48m27K20n1r3P7q7K3K56P9nl01RL44Q8l26K6J80k47j8J63
$$ -57 131 -179 -94 -48 22 170 -257 -37 -88 -181 -104 -191 -168 88 167 162 -139 -130 214 302 -24 2 182 -65 -83 80
7409H0Jl09M59k05K07k33J52o3k34L20J05k53l9N7j89J22L4k09L53O9k91j7RL3
$$ 80 81 -228 231 26 233 0 152 89 -145 175 280 27 -12 45 -144 -22 12 -197 156 225 -66 -83 -74 -41
7433d1N9O5m33L71J13l4M5l0K68m17j61R0k0K95Nr5Q0j59L2R2k54K16m6k01J94
$$ -41 18 83 -350 21 134 100 145 115 383 -34 -195 -105 -125 170 175 80 160 1 33 125 -129 87 41 -160 34
7458C4q4j28M25m21K34lr1K07j73q5L82j97k14K88j54J36j25P0l64M78l32k06
$$ 34 -50 -178 247 -174 60 57 -34 173 0 -85 297 100 -114 174 20 156 31 101 -263 215 -117 -323
7480c23M98N4k03K16k89J78j84m7p4J87Pj76J71j03N4pJ05j95J40o6N1J74M4j66
$$ -323 175 229 26 242 -47 131 -53 -100 -174 13 20 -156 15 -88 -34 -41 64 -131 9 -57 -6 168 212 46
7504D6r0j63J15J60k31K74k21Q3m%J09o5K9L7k21K99o4M5N4l57P2K73o7k90K75
$$ 46 -44 -207 -92 68 -163 111 -110 -27 -31 -31 78 13 42 79 -142 157 93 138 192 -165 -93 180 113 -177 98
7529I8j83L17m22N48l97OJ25q7j77J05M10m63k48N30k7k64K5Q4o0k4J44j25J53
$$ 98 -85 232 -190 358 -39 -33 92 5 -172 -67 343 -120 -368 162 135 -129 -104 -20 -80 -104 40 -85 68
7552F8k25K34L6J59j63k07K46r2J00p2P8k36K47k84R8J07j90J54j05J41k49M09
$$ 68 -157 77 113 272 109 -98 148 56 156 84 162 -74 173 -111 -13 94 -96 58 -47 94 -155 254
7574B54k14j77L43l86l2L51j63O3J17l05Q6J01N3q2O1J77l22J15J31j81Q1M4q
$$ 254 40 -137 206 -180 -212 139 -24 39 156 -149 -63 38 91 9 70 247 -75 40 171 -10 71 115 107
7597A07j28j39P7K42o1k86%J56J28j84J97k14J74qn8J86l27jj52K00L17r7j01
$$ 107 -21 -160 -83 159 98 -188 -188 -32 96 -88 109 -105 69 61 3 189 -138 -139 -291 -91 226 129 28
7620B8K33m73J92J44q1Q5L6J03n21M95k07k13K76l14K78k3j50K13m0k11K58Mo2
$$ 28 261 -212 -20 124 43 128 164 267 -254 241 34 -179 97 -217 61 38 -112 101 61 -150 108 112 50
7643E0J7j11m2L32j61k26K54q2l09M95j97Qk60L73m4O8j35p7k08K55N5J34j91
$$ 50 67 -44 -86 246 85 -141 113 31 -278 217 20 28 -232 141 97 165 30 -47 -255 0 55 189 -2
7666bK5j75k0L05j98K04j96j64J32JJ39k36J76M05l63K47m03L69k25m5J25j76
$$ -2 23 -152 -172 133 -65 139 -57 -221 -89 -88 51 -185 -9 396 33 280 -123 246 21 -24 101 -75
7688g5j82L95K1j42l0o3K16q4j57L21k41K10l16P0K32lr2q2k03R4K56j50J06q7
$$ -75 -257 138 159 17 -13 -76 140 56 -101 220 -21 189 -127 -57 175 172 80 -2 -205 -111 145 -5 101 14
7712A4ln7L7J69l31K35k89m1K18K0p8O2K86n5j38Rj35J8j4j70K47j24K15k14J62
$$ 14 11 -46 -9 160 -171 64 -225 -266 -48 -28 -106 -44 242 187 49 58 -77 -59 -73 -243 4 -120 95 -119 43
7737D3k34K53j04J9O3q6k17K51Q6n1p7%k86L22j38J05L7O6Moj05nK22k73O1n0
$$ 43 -191 62 -42 -23 40 -46 -263 -12 74 23 -54 -54 -340 -18 -156 -51 -14 52 56 50 -55 -60 162 -111 -50 -100
7763a00M05l34j7J21j11L3O6q0P3j23J11J70j58Q2J3o9j31l81L78k80K88n1K63
$$ -100 305 -29 -46 75 -36 -3 63 -17 56 -67 44 214 56 138 151 82 -49 -430 -52 -332 -44 -95 168
7786A68j46j33K60j91j74P7J54O7k73L2R3p5K61k01J74lq2o7K29Rj47j07K01n8
$$ 168 22 -111 149 -42 -216 -139 15 82 -191 -159 -66 -141 120 -81 93 90 8 -59 170 179 32 -75 126 68
7810F8m6PJ65j56j08K03j33Qk72L25k45J98K9P0L5J8J41k32K93l58q8p1L21j72
$$ 68 22 29 194 38 -70 133 0 8 -264 61 -184 14 43 113 148 166 307 75 368 10 -78 -149 172 0
7834@k51L54O7j29J05p6j36L62l09J2L7P8k27J17K5n1jK47j69j60O3J88J68m90
$$ 0 -251 103 170 41 146 70 -66 296 -13 -1 36 114 -113 4 29 -22 -23 224 55 -105 -42 146 314 -176
7858a76K97m0O9j83o5J01J29k05j1J19j09m6J92P4j26k01K56j06k1n8K35R9r2
$$ -176 121 81 150 -33 -98 3 132 -73 -84 35 -74 -120 72 146 20 -181 75 -31 -52 -110 125 224 132
7881A32n3j0j12j6J42k30K53nl7l83N49k12j10L00k75J85m9q5K63n75M23P6j29
$$ 132 79 69 -43 -59 83 -147 106 101 64 -319 230 18 -92 208 -67 118 69 -16 247 -328 95 171 42
7904D2J34j75Q5J19m53J41K55j17J90k45k5M6j36M9L7K0j08J40j63K42Nk60R1
$$ 42 176 1 86 205 -248 -107 148 31 221 -24 -49 -3 -139 -90 -53 -33 -141 -1 -164 78 83 -177 -86
7927h6l8j3j20K11l6J09K91j47o2Rk6j43J4Q5j95P7O1M3q2M0j75K85k09K23l2
$$ -86 -124 -137 -257 -46 -82 27 318 171 109 118 92 -51 -37 48 -147 -70 -9 34 -48 -8 -183 102 -107 116 84
7952H4l99K20J03O7J2J11q9j80K70r4j48L23m51K57R2l03J21o0M6m8J21j37K65
$$ 84 -315 -95 8 75 87 198 109 -71 199 105 -43 280 -171 86 178 -125 -4 -64 -18 -66 55 -82 183
7975A83r4k45r7K58o7lK77P5k43l46M49j38o6j72J86j32J2J37M8k16J76k7O5J06
$$ 183 89 -156 -253 5 -62 -65 212 287 44 -302 147 9 -57 -229 -43 -175 -163 -26 22 -194 -18 -45 20 126
7999A26J96k75k84Q4L7j66L21J35j28l46M10k60M12m78J81J38j30Q5op2j1K63
$$ 126 322 47 -237 -153 -116 -282 39 174 46 -300 110 -150 262 -216 -35 103 -27 58 52 -20 -31 232
8021B32k98L04j93J25k17pO5O2o1J49l08J08J6j14Q4q5J15j04K41j19R6K29k35
$$ 232 -66 238 45 170 -47 -54 11 73 12 161 -147 -39 -23 -137 -53 -138 -23 -127 114 -5 91 320 85
8044H5k8p4O3l7R0j16J8L7m5J49Q5J73l74j12J76k05J15J0J81l24K53Nl74K41
$$ 85 57 -17 46 9 99 -17 1 38 -7 142 227 400 26 -86 90 -115 0 10 191 -133 120 125 -249 -8
8068hQ7j22J26j64J49L2k49K75j46PNL4j79J78M1j05K16r7p1OJ36o1J2j29K0J70
$$ -8 79 -43 83 -81 68 100 -149 126 -20 -13 -8 26 -153 25 66 -39 177 80 9 15 151 90 102 -27 -7 163
8094A63J40m14J06L1N1r2j68L24k58K37k4n3j25K58J42l89L70l63J97j03J78N3
$$ 163 303 -111 -5 26 77 -15 -183 141 -117 120 96 43 -82 176 318 -71 299 -64 133 30 208 261
8116B61m5k23Q3R8m43K79oq1J16o1J91J45k07l9n4k7M2l72L09J63j62Q3m5Q7j10
$$ 261 216 -7 76 174 -269 10 4 -77 39 -22 169 314 107 68 14 -13 29 -343 -34 129 -33 50 5 92 -18
8141a8kQ7K64n10J47K21k45J11k46K74j00j6K0O0Q0k91L74j36L8j55J28k25O4
$$ -18 -20 67 331 -179 -32 189 -56 55 -191 83 -17 -33 -13 47 127 -164 210 74 112 -43 85 -140 -76
8164g6K05l69M63k08j24J43j60l4L5j52M38k9j58k4k24L26j29O5R6r0J20k66K32
$$ -76 129 -240 223 15 -109 34 -126 -160 -125 -277 161 132 -26 -50 -274 52 -77 -12 84 -6 114 -152 80
8187H0j36jK54k83
$$ 80 -56 -57 197 -86
8191h6
$$ Imaginary data points
##PAGE= N=2
##DATA TABLE= (X++(I..I)), XYDATA
0@%%%%%%%%%%%qJ6j6J6j6K4l2L2m0M8n6O9p7Q8j04J23j46J67j90K19k50K82l18
$$ 0 0 0 0 0 0 0 0 0 0 0 0 -8 8 -8 8 -8 16 -16 16 -24 24 -32 37 -40 48 -56 67 -79 88 -102 117 -133 149 -169
34a69L58m02M53n06N63o31P03p78Q62r53J053j164J283j414J559j717J892k085
$$ -169 189 -213 240 -266 297 -334 369 -409 453 -500 553 -611 672 -742 817 -900 992 -1093
52a093K297k535K804l108L454l851M318m872N541o371P426q815J0736j3577J8184
$$ -1093 1204 -1331 1473 -1635 1819 -2032 2286 -2586 2955 -3416 4010 -4805 5931 -7646 10538
67A0538k6844M8388j94704k96058N36454J16947k53478J30599L7906l42276J65493
$$ 10538 -16306 32082 -162622 -458680 77774 194721 -58757 71842 109748 -232528 -67035
78f7035L87425k72302l08492K83768O0163k49576J97232K33950l02201j22298
$$ -67035 320390 48088 -260404 23364 83527 -166049 31183 265133 -37068 -159366
88a59366K51353q5577j88963K55788J09175l01245j1950K34515q2871n8219J79140
$$ -159366 91987 6410 -182553 73235 182410 -118835 -130785 103730 20859 -37360 141780
99A41780j33565k87214J99132L05645j18593j60875J9680o0112L1226K35434l1102
$$ 141780 8215 -278999 -79867 225778 107185 -53690 -34010 -94122 -62896 172538 141436
110A41436k95021r62K14587J9756m6774K4044p9319q4452R4179P7131n8171j0259
$$ 141436 -153585 -154547 60040 79796 33022 57066 -22253 -106705 -12526 64605 6434 -3825
122c825L0287n8597k8513Q0931L9081m0301l4890l3830j4798O2443P5153n670
$$ -3825 26462 -32135 -60648 20283 59364 19063 -15827 -49657 -64455 -2012 73141 67471
134F7471p2651p6729J30J13474Q8518p5669j24264j2452P6189R7389L6311j14119
$$ 67471 -5180 -81909 -81779 31695 120213 44544 -79720 -92172 -15983 81406 117717 3598
146C598j27238O1315J24660o086m5918p520m4044j2224Q8557K5889p3293l835
$$ 3598 -123640 -62325 62335 56249 10331 2811 -41233 -53457 35100 60989 -12304 -16139
158a6139J7668o0441J9429J13815j4848r8585P392K2717l0381N8595P2698r3644
$$ -16139 1529 -58912 -39483 74332 59484 -39101 -31709 -8992 -39373 19222 91920 -1724
170a724r3177O9617O2837o507K7994l4928j28980K1910J64508J5580j11128k5481
$$ -1724 -94901 -25284 37553 31046 59040 24112 -104868 -82958 81550 97130 -13998 -39479
182c9479R450n603P6856M8543j07828o7969P5820L1458k7183L9974P824r0255
$$ -39479 -30029 -35632 41224 89767 -18061 -86030 -10210 21248 -5935 34039 41863 -48392
194d8392j3291P8955R247k1670K0811l6019n9564O0459P8157l7163m7689L492
$$ -48392 -61683 17272 26519 4849 25660 -10359 -69923 -9464 68693 31530 -16159 -12667
206a2667k2008K765Q3031K1747q8036m1740L6162K6386L1353K0284o9637p0017
$$ -12667 -34675 -31910 51121 72868 -15168 -56908 -20746 5640 36993 57277 -12360 -82377
218h2377N4553P8994j1402l5887j8118k9250J0877O4497J1994m8616j8087J790
$$ -82377 -27824 51170 39768 3881 -14237 -43487 -32610 31887 43881 -4735 -22822 -21032
230b1032m113L5674M1587l3060n6517K787L0230K2135K2623j5020n7561j1979
$$ -21032 -25145 10529 52116 19056 -37461 -34674 -4444 17691 40314 25294 -32267 -44246
242d4246M7803K9257l800j4776l8064k4472M2192N3109j1723m5021k4312j226
$$ -44246 3557 32814 29014 14238 -23826 -48298 -6106 47003 35280 -9741 -34053 -35279
254c5279L1051M6902p409n5741k2542K4110K8304J9739k102l9179l0061K2707
$$ -35279 -4228 42674 35265 -20476 -43018 -18908 9396 29135 27033 -12146 -42207 -19500
266a9500L8116J1605q305k8016l1909J4302M8613J5480k7087k9754j4005J2920
$$ -19500 18616 30221 21916 -6100 -38009 -23707 24906 40386 13299 -16455 -30460 -17540
278a7540L8685J9529k9963l6982m137J9697K8228J8040k4555m3204m730L3421
$$ -17540 21145 40674 10711 -26271 -30408 -10711 17517 35557 11002 -32202 -36932 -3511
290c511K8498K010k3210l3658n376L6619L1047q065k7264k1761k333K9421L2338
$$ -3511 24987 26997 3787 -29871 -35247 1372 32419 24354 -2910 -24671 -27004 2417 34755
303C4755p143l4397k1097P864K6794K5648n084l6948k3819J6420K9618J5483q653
$$ 34755 27612 -6785 -27882 -20018 6776 32424 27340 -9608 -33427 -17007 12611 28094 19441
316A9441l2342k2512J7201L4824J1099j7474k5860j5272J3775L4227J4442k3645
$$ 19441 -12901 -35413 -18212 16612 27711 10237 -15623 -30895 -17120 17107 31549 7904
328G904k8887o414J8486K8611J1381k2744l1423l130K6075K4345J995k1009k6846
$$ 7904 -20983 -27397 -8911 19700 31081 8337 -23086 -26216 -141 24204 26199 5190 -21656
341b1656l399K6221K4926k669k4789k2824N09K4548K4850m128k9527k0645Q507
$$ -21656 -25055 1166 26092 23423 -1366 -24190 -23681 867 25717 21589 -7938 -28583 -20076
354b0076K5279J8176o116k6586j9162J0625K8414J5408j1569k4136j5122J0015
$$ -20076 5203 23379 17263 -9323 -28485 -17860 10554 25962 14393 -9743 -24865 -14850
366a4850K8945J5753j6690k7738r212J5769K4364J0702j6379k8398o897K0733
$$ -14850 14095 29848 13158 -14580 -23792 -8023 16341 27043 10664 -17734 -24631 -3898
378c898K1078L993j4555k4572q884K1157K5870L19k1562j9800j610J9311K4733
$$ -3898 17180 21173 6618 -17954 -26838 -5681 20189 20508 -1054 -20854 -22464 -3153 21580
391B1580q04k5548j7243O135J8119J7490N89k2509k0299P156K3971J4133n748
$$ 21580 20776 -4772 -22015 -15880 2239 19729 20318 -2191 -22490 -15334 8637 22770 17022
404A7022k0461j9122O843K7852J2682j4193k0708j0554P102K2926J4227j4088
$$ 17022 -3439 -22561 -15718 12134 24816 10623 -10085 -20639 -13537 9389 23616 9528
416I528k5512p074J3242K0116J1531j3592k7399n004K0822J9617K089j4332j9286
$$ 9528 -15984 -23058 -9816 10300 21831 8239 -19160 -24164 -3342 16275 18364 4032 -15254
429a5254l859J8324J9375j012j5059j4684m920J4669K2343J165k2011j7112K764
$$ -15254 -19113 -789 18586 17574 2515 -12169 -17089 -2420 19923 21088 -923 -18035 -15271
442a5271J6883J6731q09k1668j7888P292J9024J1281k415j7583j9059N955K6135
$$ -15271 1612 18343 17534 -4134 -22022 -14730 4294 15575 13160 -4423 -23482 -17527 8608
455H608J3536j1901k1323j0028J0478K3880R776j7120k0412K96J2827J2414N481
$$ 8608 22144 10243 -11080 -21108 -10630 13250 23026 5906 -14506 -14210 -1383 11031 16512
468A6512q244j7315o968J1872J5632N039q896j8798j0160J5061K2174J095j7310
$$ 16512 8268 -9047 -16015 -4143 11489 16528 7632 -11166 -21326 -6265 15909 17004 -306
481c06j5025j620J2291J8330M075j8578j9106L081J8296J5518o1j9222j9585P440
$$ -306 -15331 -16951 -4660 13670 17745 -833 -19939 -16858 1438 16956 16895 -2327 -21912 -14472
495a4472K6445J0300j4772j6789l913Q222J4110O888j0005j2620k596K944P291
$$ -14472 11973 22273 7501 -9288 -13201 -4979 9131 16019 6014 -6606 -9202 -6258 1033
508A033J2478j99k0008j3913J1208J7703O069o870j7136j1168J2119K0999M026
$$ 1033 13511 13312 -6696 -20609 -9401 8302 14371 7501 -9635 -20803 -8684 12315 16341
521A6341j2909j3905o371Q941K2320Q205k0367k1444L938J9677J4643l327k0625
$$ 16341 3432 -10473 -16844 -7903 14417 22622 2255 -19189 -15251 4426 19069 15742 -4883
534d883j3458J1658J7894J436j0027n909l705l86P073P853J91o791j2002m480
$$ -4883 -18341 -6683 11211 12647 2620 -3289 -6994 -7380 -307 7546 7737 946 -11056 -15536
548a5536J3905J7067l465j8316j0872O120J6123J1761o506j8482p969R073J5324
$$ -15536 -1631 15436 11971 -6345 -17217 -11097 5026 16787 10281 -8201 -16170 -7097 8227
561H227J0667o885k3081r592J8124K0883j186j7541j4787J771J7924J2053j0806
$$ 8227 18894 12009 -11072 -20664 -2540 18343 17157 -384 -15171 -13400 4524 16577 5771
574E771j4010J560L588l34N646O517o156j1132j973M985J1394R257j0325k0955
$$ 5771 -8239 -6679 -3091 -3425 2221 8738 2582 -8550 -10523 -5538 5856 15113 4788 -16167
588a6167J165J9973R312m781q891j2185j938J8166J4685q811j6752o472L368J5600
$$ -16167 -15002 4971 14283 9502 611 -11574 -13512 4654 19339 10528 -6224 -12696 -9328 6272
602F272J4984j2455k5899j76K0076R814n500r673p407Q77J0602M124m589l32J61
$$ 6272 21256 8801 -17098 -17274 2802 12616 7116 -2557 -9964 -9087 1515 5639 1050 718 879
617H79r657j904J5117J0470r300j3881l469P497J4467O872j3990j6327L015J3576
$$ 879 -8778 -10682 4435 14905 5605 -8276 -11745 -4248 10219 17091 3101 -13226 -10211 3365
631C365P621N2r090j4011j328J6524J2929p062j6446q024P110J6361N838j3387
$$ 3365 10986 11038 1948 -12063 -13391 3133 16062 9000 -7446 -15470 -8360 8001 13839 452
645D52j2748L056J0076L499j368j118k842n154M86O730P782M38j0403j0857M295
$$ 452 -12296 -9240 836 4335 2967 1849 -993 -6147 -5661 1069 8851 9289 -1114 -11971 -7676
660g676J5934O983r718j3938k450R453J0725K117r131j1175k215Q427J1596K643
$$ -7676 8258 15241 5523 -8415 -10865 -1412 9313 11430 2299 -8876 -11091 -2664 8932 11575
674A1575j2434j2917J961J4373R719n973j3389m559P586R814P94m932l302k243
$$ 11575 -859 -13776 -11815 2558 12277 6304 -7085 -11644 -4058 5756 6550 1618 -1684 -3927
688c927k13M386O625J392o561q833j136J0125J1278l594j5308o371Q196R746L430
$$ -3927 -4140 246 6871 8263 1702 -7131 -8267 1858 13136 9542 -5766 -12137 -3941 5805 9235
703I235m898j0869n176P539J0606J614n786r076n541P790J4591L66j3222o915
$$ 9235 4337 -6532 -11708 -4169 6437 8051 2265 -6811 -12352 -4562 10029 10395 -2827 -9742
717i742L860P657O020o66q269n275L888M570J787L055k008j0690l540J0361Q097
$$ -9742 -5882 1775 7795 7129 -1140 -6415 -2527 2043 3830 6885 4877 -5813 -9353 1008 9105
732I105k146p651p666r36J1196Q909o624j0612j346K847N294P467j983j1782l986
$$ 9105 6959 -692 -8358 -9294 1902 10811 4187 -6425 -7771 -4924 370 7837 5854 -5928 -9914
747i914O818P329L577k840r760n326R110J0167k125o939l248j780L207Q180J213
$$ -9914 -3096 4233 7810 4970 -4790 -10116 -1006 9161 7036 97 -3151 -4931 -1724 6456 7669
762G669o525n420j220K836P189M739q177j0218J416Q078M921M25o519q214J512
$$ 7669 1144 -4276 -5496 -2660 4529 9268 1091 -9127 -7711 367 5288 5713 -806 -9020 -7508
777g508R229M633l096m515m705l52P662P693l687q026l342K416P097N424m326
$$ -7508 1721 6354 3258 -1257 -5962 -6314 1348 9041 5354 -2672 -6014 -3598 3499 8923 4597
792D597q281k380M629N147K175k023p348m050M556O801J994m039o853l168N038
$$ 4597 -3684 -6064 -1435 3712 5887 3864 -3484 -7534 -2978 3823 5817 1778 -5075 -8243 -3205
807c205Q146J250o397n970j7M766O911P51o285n414N80N505N599L50o150o173
$$ -3205 4941 6191 -206 -6176 -6193 -1427 5484 6235 -50 -5464 -4884 621 6220 6570 420 -5753
823e753J137P133M218j254n819n595J151P127L618k665n544m250J641O609L880
$$ -5753 -4616 2517 6735 5481 -338 -5933 -4782 2345 5963 3298 -2246 -6496 -4855 1754 5634
838E634l005o486k654K666O136L501l375o847j321M086N361K598l169o634j822
$$ 5634 2629 -3857 -6511 -3845 2291 5792 2417 -4430 -5751 -1665 3696 6294 3125 -3509 -5331
853e331M720O141R76m544n521j792N420N624m8n255n162o13M746N267k7o227m788
$$ -5331 -611 5530 6506 1962 -3559 -5351 69 5693 5645 390 -4772 -5385 -639 4628 4601 -1626 -6414
870f414J341M942M559n35o004m238K583N536L105j174n070l453J670N885L146
$$ -6414 -5073 -131 4428 3893 -2111 -6349 -3766 1770 4875 3701 -1369 -4822 -3152 2733 5879
885E879k029n023l593K171O306K890l853n450j808K374N051K202l505n923j677
$$ 5879 3850 -1173 -4766 -2595 3711 6601 2748 -2702 -4510 -2136 2915 5117 1612 -4311 -5988
900e988M135M586J396l501n644j032N241M649r7l738m301m11N030M683q05m115
$$ -5988 -1853 2733 4129 628 -5016 -6048 -807 3842 3745 7 -4294 -4705 325 5008 4203 88
916H8l202j19L711N132m52n936l362J279M434K991q11n418l940K421N178J607
$$ 88 -3114 -3233 478 5610 5158 -778 -4140 -2861 1573 4564 3753 -1665 -5605 -3184 1994 3601
932C601k190l317l615J708N811K110k915l959k013K370M982K668m073m566K58
$$ 3601 1411 -1906 -5521 -3813 1998 4108 1193 -2766 -4779 -2409 2573 5241 1168 -3398 -3140
947c140K957L234J727k521n262o82M118L689mk608m812j423M954M301j795m079
$$ -3140 -183 3051 4778 2257 -3005 -3687 431 4120 4116 1508 -3304 -4727 227 4528 2733 -1346
963a346k307j55K956M383m39n249k457J523K870L475M98n287l642K914M874J375
$$ -1346 -3653 -3808 -852 3531 3092 -2157 -4614 -3091 -221 3254 3752 -1535 -5177 -2263 2611 3986
979C986j405l348l049K406M874P86k727k173j848p9M808L391m430m819N6K566
$$ 3986 2581 -767 -3816 -1410 3464 4250 1523 -650 -2498 -2577 2231 5622 1192 -3627 -3571 -1005
995a005K924J846l448m932L87M548J382k92q69l545j768M279M405q62k566k930
$$ -1005 1919 3765 317 -4615 -4228 320 1702 1410 541 -3004 -4772 -493 3912 3050 484 -2446
1011b446j372M057N554k136n475p90J988J378K713M10m533k991K228K655R24L17
$$ -2446 -3818 239 5793 3657 -1818 -2608 -620 758 3471 3881 -652 -3643 -1415 1240 2164 2481
1027B481l421m592K447N678M80l788j522j128R90M567P59l344j784O93J1K131
$$ 2481 -940 -5532 -3085 2593 3073 -715 -2237 -3365 -2375 2192 2951 -393 -2177 -1484 -1473 658
1043F58M493k491o048j9M035K614J059k741m847L7N097J727k407j415j244j924
$$ 658 5151 2660 -3388 -3407 628 3242 4301 1560 -3287 -3250 1847 3574 1167 -248 -1492 -3416
1059c416K133M510j015l922j397p2K318M537o83o157j526M386K330p79M27j452
$$ -3416 -1283 3227 2212 -1710 -3107 -3179 -861 3676 2993 -3164 -4690 -304 2026 1247 1674 222
1075B22k674J475K662Q91P2j854m023J62O201K349m713l226j15J825K837J432
$$ 222 -2452 -977 1685 2576 2648 794 -3229 -3067 3134 5483 770 -2456 -2571 -746 2091 3523
1091C523m153l034J862J435N28J790p39m524r49L982L232r16k515k245l00M508
$$ 3523 -630 -3664 -1802 -367 161 1951 1212 -3312 -4261 -279 2953 2037 -478 -2723 -3023 1485
1107A485K124k304k599R19k57M22K500J257l009k798K49K115L294K89n260l121
$$ 1485 3609 1305 -1294 -375 -632 -210 2290 3547 538 -2260 -2011 104 3398 3687 -1573 -4694
1123d694L220M012j57k563j567j168J625K783R9j802j178r66n2L601K467k529
$$ -4694 -1474 2538 2381 -182 -1749 -2917 -1292 1491 1590 -212 -1390 -2356 -2408 1193 3660 1131
1139A131m230O94L213J818j07k031j844L00K284L50J8j60j939k089J096M167L03
$$ 1131 -3099 -2405 808 2626 2519 488 -1356 -1056 1228 1578 1596 1436 -503 -2592 -1496 2671 2974
1156B974l557l124L47L521K637j435m049p43K513J995O0l46r14k035O69K789J517
$$ 2974 -583 -3707 -3360 161 2798 1363 -2686 -3429 -916 1079 1139 793 -121 -2156 -1487 1302 2819
1173B819r84k126k143J410L535J068k930k330M69J882N51R8m09j742j018L80J893
$$ 2819 1835 -291 -2434 -1024 2511 3579 649 -1681 -1212 670 1221 1319 910 -832 -1850 -1470 423
1190D23J672j053l626j099K667L430j93l285j886Q75K654J746j027j714p79N55
$$ 423 2095 1042 -2584 -3683 -1016 2414 2221 -1064 -2950 -2075 579 2325 1298 -416 -1195 -640
1206f40R56J318Q88j856k891Q74K669J678j427k479j236J804J846J4j459r31o90
$$ -640 316 1634 2522 666 -2225 -1351 1318 2996 1569 -910 -2146 -342 1504 1518 59 -872 -1562
1223a562l14J495J877m91k584j272R44K991J359k032l000N71K422J587l39j469
$$ -1562 -1876 -381 1496 1005 -1579 -2851 -1907 1084 2443 411 -2589 -2018 404 1991 1652 183
1239A83j029j16J709R94J30p19k000j001J945K679p07k678j448O25J817J014m69
$$ 183 -846 -962 747 1741 1871 1152 -848 -1849 96 2775 2068 -610 -2058 -1433 384 1398 929
1256I29k135r45Q68J331P56M50j662j866M65K446J369q01k042j128J298K933K67
$$ 929 -1206 -2151 -1283 48 804 1254 -408 -2274 -1809 637 2006 1205 -837 -1965 -667 2266 2533
1273B533k210j173L70N54R16J338j116k318o44J236J656M62j189k503m29K300
$$ 2533 323 -850 -480 74 990 2328 1212 -1106 -1750 -514 1142 1604 415 -2088 -2517 -217
1289b17J527n88j494r05l63J694J637j27j591r74K14P64K280L64k382j745J565
$$ -217 1310 722 -772 -1677 -2040 -346 1291 1164 -427 -1401 -1187 -423 1857 2221 -161 -1906 -341
1306c41J562J017r46j548j375J012J864J46j041n04j078K5J623J110j498j457
$$ -341 1221 2238 1292 -256 -1631 -619 1245 1391 350 -154 -1232 -1207 416 1526 28 -1429
1322a429n20Q33J544P96r64k067K18J700O70M27l77j424q81J839J470k25j379
$$ -1429 -1949 -1116 428 1224 260 -1807 -1589 111 781 1208 831 -593 -1474 365 1835 1610 231
1339B31q39l52J216J784m21j957n38n9N94J704J4j904j668J094J113O68R6j392
$$ 231 -608 -960 256 2040 1619 -338 -876 -935 -341 1363 1377 -527 -2195 -1101 12 680 776 -616
1357f16j821P79K494M81j238n55o22K51J666J390j366j485j29O76J468Q50j081
$$ -616 -2437 -1658 836 1317 79 -476 -1098 -847 819 2209 843 -642 -771 -95 1373 2223 1142
1374A142k171k9J496N16J30n27j711o03J559J635r09q24p46p97J038K281o80j630
$$ 1142 -1029 -1058 438 954 1084 557 -1154 -1757 -198 1437 528 -296 -1042 -1839 -801 1480 800 -830
1392h30n57N01R76R58J09j458r55J040P64P13N24j382j855J023J726L33j127q56
$$ -830 -1387 -886 90 1048 1157 -301 -1256 -216 548 1261 1785 403 -1452 -429 1297 1630 503 -353
1410c53o68NJ785O58j389j472L82M2Q83J001r03j606MJ287P13L55l68j328o31
$$ -353 -1021 -1016 769 1427 38 -1434 -1052 -1010 -127 874 -29 -1635 -1631 -344 369 724 356 -972 -1603
1429a603J989J060k80o44r56k58P48J328J64j124j296M68O26J006j76j534j005
$$ -1603 386 1446 1166 522 -434 -692 56 1384 1548 424 -872 -404 222 1228 1052 -482 -1487
1446a487N99J143L98l10q71j040M80J131Q95o68r89o45K47J920L95p69j182r1
$$ -1487 -888 255 653 343 -528 -1568 -1088 43 938 270 -719 -1364 -1117 803 1198 429 -753 -844
1464h44Q84J018L33n74j053n10R16Q39L17o91j321k73P26J010K93j207j068J05
$$ -844 40 1058 1391 817 -236 -746 170 1009 1326 635 -686 -959 -233 777 1070 -137 -1205 -1100
1482a100N27J304m98r51o29K22P20P61K89q89o40L36J248N19j46j320l07K61J067
$$ -1100 -573 731 233 -718 -1347 -1125 -405 356 645 -244 -884 -548 700 1219 1073 -247 -554 -293 774
1501G74N66m45p36o55R2P30J012o92j405l09P09N23O77r10j099j51Q90O91K10
$$ 774 1340 895 159 -496 -404 326 1338 646 -759 -1068 -359 164 841 -69 -1168 -1319 -429 262 472
1520D72p47m27j52M74J444Q5r22p29j66Q17J061L9j191n52L37O05O20l26m86j147
$$ 472 -275 -702 -854 -380 1064 1149 227 -502 -668 149 1210 1249 58 -494 -157 448 1068 742 256 -891
1540h91N08L01N76P4j041r35O6J547O56p62j096k28O41Q58K23n09k44o53N82O58
$$ -891 -383 -82 494 568 -473 -1408 -1342 205 861 99 -997 -1225 -584 274 497 -12 -256 -909 -327 331
1560C31P77k09j228l29R52Q07j6p09r36j18R97P24k46r15l20l03L30O63L23p60
$$ 331 1108 899 -329 -658 294 1101 1085 376 -560 -678 319 1043 797 -118 -438 -741 -411 252 575 -185
1580a85r78k35Q81J287k10j215n91Q66O32J30l52k9p1p5L21P49J30r38q57O61
$$ -185 -1163 -1398 -517 770 560 -655 -1246 -380 252 382 30 1 -70 -145 176 925 1055 117 -740 -79
1600g9N31Q79l94j558k49J017N00l25m76k04m7k30K20O09q2p30n00L63J314K24
$$ -79 452 1331 937 -621 -870 147 647 322 -154 -358 -405 -635 -415 194 112 -618 -1118 -755 559 783
1620G83q09p60K82Q90N41j22r36J35M29l6k3M70k16p95n48Q10Q27J81j413r83
$$ 783 -26 -786 -504 386 927 805 -131 4 433 397 374 844 628 -167 -715 95 922 1103 -310 -1293
1640a293P35R34Q1n56q03R3M28j69N51K17n14o97L60O76J010n20p95p59R65J120
$$ -1293 -558 376 457 -99 -902 -809 -381 -550 1 218 -296 -993 -633 43 1053 533 -262 -1021 -56 1064
1660A064k65p57m22L87M12J51rp8l78o45J80O82N22r60j108L79P15M77k23o91
$$ 1064 799 42 -380 7 419 570 561 483 105 -540 -360 322 844 -116 -1224 -845 -130 347 124 -567
1680e67l11N74M84K9l41P9k19n48R23Q21O9r89o11P28P58O30r91r61K18O74k05
$$ -567 -878 -304 180 209 -132 -53 -272 -820 103 924 993 4 -607 121 879 1509 518 -443 -225 449 244
1701B44r6J16l63n07K60L26Q6K32j001n33Q74Q39j25r28m44Q19R8M13K1k95L0
$$ 244 148 264 -99 -606 -346 -20 66 298 -703 -1236 -362 477 352 -576 -1020 -201 -103 310 331 36 66
1722F6N2j63N97M96n93r49j7J090M49l91p56k72K33N23k3p60K08l21l3J66O85
$$ 66 118 -45 552 1048 455 -494 -511 579 1028 637 -119 -391 -158 365 342 -418 -210 -531 -564 -398 287
1743B87M4r22l11M35L15N75j7j021J7J145J58l74j8k25j29K59L37Q2r5n49n40
$$ 287 331 -591 -902 -467 -152 423 406 -615 -598 547 705 331 313 88 -41 218 555 637 542 -7 -547
1764e47K81J244j87j117n35N51M37m8l2o39j38L38N0R3N31k16p32n2Q17N36J8
$$ -547 -266 978 791 -326 -861 -310 127 79 47 -592 -730 -392 -342 -249 282 66 -666 -718 99 635 653
1785F53n96k68K13N16L93m44l07m8j52M41M28j88j012j47L62K69L02q4q42l62
$$ 653 57 -211 2 518 911 467 160 112 -40 401 829 641 -371 -518 -156 113 415 331 -511 -873
1805h73O13N57m97l01L66m68L56N43l22J11j81J00L5O02J63r18j68M25rK44L10
$$ -873 -260 297 -200 -501 -135 -603 -247 296 -26 85 -96 4 39 641 804 -114 -282 143 134 378 688
1826F88p15j59Q8K75J66jl81p78J69N97N15m81m61j02p6N46O97p08m08j00N98
$$ 688 -27 -186 -98 177 343 342 -39 -817 -648 -51 464 -17 -478 -580 -656 -110 587 -121 -529 -629 -31
1847c1j33P48k8p58j71N51N76m58j13k93m5M97O99n60n00m00J96N1N60J46q14
$$ -31 -164 584 556 -202 -373 178 754 296 183 -110 -155 342 1041 481 -19 -419 -223 -172 388 534 -280
1868b80k45q5K71L76J47r19R1J27K76O38n5m57r4k24O50K42k0j48n34K08O23L50
$$ -280 -525 -610 -339 37 184 -735 -644 -517 -241 397 342 -115 -209 -433 217 459 439 291 -243 -35 588 938
1890I38o46o24L13J37p8L19j19k73k25J45k2L04j40n59k36L08P94j1q34Q2J01
$$ 938 292 -332 -19 118 40 359 240 -33 -258 -113 -135 169 29 -530 -766 -458 336 325 -509 -427 -326
1911c26M54L01k61N7k60J0J91J83K84m86j99K7K86J33k25j74m54P8K74L38k66
$$ -326 128 429 168 225 -35 -25 166 349 633 147 -52 -25 261 394 169 -5 -459 -381 -107 231 -35
1932c5q2l68K13j97M61l65J00j03j19L79J72J23k63k95P19K16k38r1j25p0K85
$$ -35 -117 -485 -272 -469 -8 -373 -273 -376 -495 -116 56 179 -84 -379 340 556 318 227 102 32 317
1953C17J79P4k60N0k51j45M63L1n01m70J07K63L01j30n71J09p2J59K98J78k86
$$ 317 496 570 310 360 109 -36 427 458 -43 -513 -406 -143 158 28 -543 -434 -506 -347 -49 129 -157
1974a57m52K26L20M35q4l79o0L94J49J81j54j92p6j45J34K36k26j43p9p4J81J51
$$ -157 -609 -383 -63 372 288 -91 -151 243 392 573 419 227 151 6 140 376 150 7 -72 -146 35 186
1996A86l08l28J08j25N98l37O4q4L0k90M39R8j22j33k04P75J49K3l61j47O6L03
$$ 186 -122 -450 -342 -467 131 -206 -142 -226 -196 -486 -47 51 -71 -204 -408 367 516 539 178 31 97 400
2018D00J79n34n6J62O9j37n3K56m11j98m1R2J69j86N1n46L74N73j4k52j8n7j95
$$ 400 579 45 -11 151 220 83 30 286 -125 -323 -364 -272 -103 -289 -238 -784 -410 163 149 -103 -121 -178 -373
2041c73M32J28j03k58J43K03L89r2j94qk17M07k25P6j31k90K1J39J47k8J4o99
$$ -373 59 187 84 -174 -31 172 561 469 275 267 50 457 232 308 177 -113 -92 47 194 166 180 -519
2063e19L5K36M61j09n93P7LO03k36Q7k07J23Q6J43K13j25n9n36K06O17N4J2n24
$$ -519 -484 -248 213 104 -489 -412 -409 194 -42 45 -162 -39 47 190 403 278 219 -317 -111 506 560 572 48
2086D8l48M94P6j90r4J2l13j07L20M9Nj41q0q1K51L87o35l2N01k46K41L31l53
$$ 48 -300 194 270 80 -14 -2 -315 -422 -102 -53 -48 -189 -269 -350 -99 288 -347 -379 122 -124 117 448 95
2109I5n7Q8L93k78J82k51rj63L19L20m88l00jL13K1%l93K8J14J19l38J68Q5k79
$$ 95 38 126 519 241 423 172 163 0 319 639 151 -149 -150 163 184 184 -209 -181 -67 52 -286 -118 -33 -312
2133c12j18J49L28j47R7j17k54M80L31m90j37L59n4K18o9k5J03m28j37J13N80
$$ -312 -430 -281 47 -100 -3 -120 -374 106 437 -53 -190 169 115 333 264 239 342 -86 -223 -110 470
2154D70k65k47n14N27J53k02j01j41q3L76M4R1k48O5m8k24L12M77o3o43J74L8
$$ 470 205 -42 -556 -29 124 -78 -179 -320 -403 -27 17 108 -140 -75 -123 -347 -35 442 379 -264 -90 -52
2176e2L32M09n47q9M9K06l86K42J45m21j70L72K9Mqp73K97L50P4l60j37M18k09
$$ -52 280 689 142 53 102 308 -78 164 309 -112 -282 90 119 123 115 -658 -361 -11 63 -297 -434 -16 -225
2199b25J66K83k78LQ0J7l3K02M18n28r6j69N36M0m61K3LJ4K58j26j00k94K22j64
$$ -225 -59 224 -54 -51 29 46 13 215 633 105 9 -160 376 416 -45 -22 -19 -5 253 127 27 -267 -45 -209
2223b09n5L37l72j5L0K11J34m4k47j93K79K25J56l53J15K9l5J87k7L15J15n78
$$ -209 -264 73 -299 -314 -284 -73 61 17 -230 -423 -144 81 237 -116 -1 28 -7 180 153 468 583 5
2245EK31L2K99j79m54j94M27j69Jk44n5M47n37rL13j29K00m80J05M22L14k79j82
$$ 5 236 268 567 388 -66 -260 167 -2 -1 -245 -300 147 -390 -399 -86 -215 -15 -495 -390 32 346 67 -115
2268a15Q2n9L17j94K45j61J08m2o1M60l77k0k58J00K50q6k65j07l7M13j62n4l56
$$ -115 -33 -92 225 31 276 115 223 181 120 580 203 183 -75 25 275 189 -76 -183 -220 193 31 -23 -379
2291c79j65K83J74l47L86J66k43k16N12p0J6J35j68j82M05J33l5l51K84k9m15
$$ -379 -544 -261 -87 -434 -48 118 -125 -341 171 101 117 252 84 -98 307 440 405 54 338 309 -106
2312a06K74K22l55k27P5J29qk14n4R2k28L47R3m02M9K5Q9L84k95L58j24j32J21
$$ -106 168 390 35 -192 -117 12 4 -210 -264 -172 -400 -53 40 -362 -313 -288 -199 185 -110 248 124 -8 113
2335A13J88n3J3l66J61L80k68J87j11j19k84L84J30l27j30J22n3k82J70K2j59
$$ 113 301 248 261 -105 56 436 168 355 244 125 -159 225 355 28 -102 20 -33 -315 -145 -123 -282
2356b82N4J4j04J85j50P5r2L90l9J22J72k44k3J25J01K78m20o0j21r2L77j28K16
$$ -282 -228 -214 -318 -133 -283 -208 -300 90 51 173 345 101 78 203 304 582 162 102 -19 -111 266 138 354
2379C54l94L30k2k58j07r5J57l20R0K38Nj51J83l77L46P1j70M01l47P8m4L18J47
$$ 354 -40 290 268 10 -97 -192 -35 -355 -265 -27 -22 -173 10 -367 -21 50 -120 281 -66 12 -32 286 433
2402D33l18j79J52J43j4r2j05J63p4q5N6k62K82p8j69M8O2M6k15j34M17k5j72
$$ 433 115 -64 88 231 217 125 20 183 109 24 80 -182 100 22 -147 -99 -37 9 -206 -340 77 52 -120
2425a20J71k65J61k0j5o5J73J55o1K5pJ70j09r8k7K64k27k79J37O0K6J4J30j78
$$ -120 51 -214 -53 -73 -88 -153 20 175 114 139 132 302 193 95 68 332 105 -174 -37 23 49 63 193 15
2449A5j38M0J52l00L36j12j8m19K93J12m0L9O7N1o4N2j0J3o5J56j4k2m5K60l78
$$ 15 -123 -83 69 -231 105 -7 -25 -444 -151 -39 -79 -40 27 78 14 66 56 69 4 160 146 124 79 339 -39
2474c9K72k49K44R2n10QM6K27k08l3k43J17o2J14K15l05J85Rj99L21J30j6o6o8
$$ -39 233 -16 228 320 -190 -182 -136 91 -117 -150 -393 -276 -338 -224 -9 -314 -129 -120 -319 2 132 116 50 -18
2498a8J51K79l18K80j10j54k33L22j35j30J65l53k8J45K28j59j03j66K74J96l20
$$ -18 133 412 94 374 264 110 -123 199 64 -66 99 -254 -282 -137 91 -68 -171 -337 -63 133 -187
2519a87j9Q7pk5K61k46N1m6J65O0K6m2J78j88m05L48M1J66l86j9M03p3j03o9p9
$$ -187 -206 -119 -126 -151 110 -136 -85 -131 34 94 120 78 256 68 -337 11 52 218 -168 -187 216 143 40 -29 -108
2544a08j37K23p8J55m5k8m22K17L8K20M1k89K5J14J26Q2K7m5k56L08K20j87k7
$$ -108 -245 -22 -100 55 10 -18 -440 -223 -185 35 76 -213 -188 -74 52 134 161 116 -140 168 388 201 174
2567A74O6l8m0j1N8k41j16J65P8o0M9k42j77O5K3M33k76j95K7J52J16M4l02M40
$$ 174 240 202 162 151 209 -32 -148 17 95 35 84 -158 -335 -270 -247 186 -90 -285 -258 -106 10 54 -248 192
2591A92k42R6j04O2K69J33m89N1K12j2r3R1l1P1j16j53O6l2K3k04K02m4J4j71
$$ 192 -50 46 -58 4 273 406 -83 -32 180 168 75 166 135 206 90 -63 3 -29 -6 -210 -8 -52 -38 -209
2615b09rl8L87k45J29j68K23K9R5r5Q9L4j47R5J51N4l79J90n8kj75K98l91r7K92
$$ -209 -218 -256 131 -114 15 -153 70 99 194 99 188 222 75 170 321 375 -4 186 128 126 -49 249 -142 -239 53
2640E3N2j02r4Q7k79m2L58j40O5j62k59K33N08k40R2J08k29J24j20J57j54K77
$$ 53 105 3 -91 -4 -283 -325 33 -107 -42 -204 -463 -230 278 38 130 238 9 133 13 170 16 293
2662B93j31j92J30j66K38J52m03K07J49n2k27j68J44k08K53k01j55J13J62l7k3
$$ 293 162 -30 100 -66 172 324 -79 128 277 225 -2 -170 -26 -234 19 -182 -337 -224 -62 -99 -122
2683a22N8m4p4k6J24J2J73k49J68P4M26k12m66M69l62P4J3P9K19k51o3Q9N5j58
$$ -122 -64 -108 -182 -208 -84 -72 101 -148 20 94 520 308 -158 311 -51 23 36 115 334 83 20 109 164 6
2707Fl9k9k59K31m0oP4j3j05J50J49l0k78J12K8L8K51o7r1O8K11j47K44k77p3
$$ 6 -33 -62 -321 -90 -130 -136 -62 -75 -180 -30 119 89 -189 -77 -49 -11 240 173 82 150 361 214 458 181 108
2732A08J72k73R4j34N3j69J83J88k80j76K61k19j46j09O5K85p3J97r5M3N0K4K12
$$ 108 280 7 101 -33 20 -149 34 222 -58 -234 27 -192 -338 -447 -382 -97 -170 27 -68 -25 25 49 261
2755B61M7o28N29j21R2J74l54NJ20j02J32k45j80P1K04o9k59J15J50O7p6m1o7
$$ 261 308 -320 209 88 180 354 0 5 125 23 155 -90 -270 -199 5 -64 -323 -208 -58 9 -67 -108 -175
2778a75j25J03q9K00J23j60o6J9L53k01j42K84J00J5j22R0J19j42l4l41J96J15
$$ -175 -300 -197 -286 -86 37 -123 -189 -170 183 -18 -160 124 224 239 117 207 326 184 150 -191 5 120
2800A20Oj65j98R6M7m6l22K58N6j9L42j58K0o6r9j60r2N19j99k08K22m0L05j92
$$ 120 126 -39 -237 -141 -94 -140 -462 -204 -148 -167 175 17 37 -29 -128 -288 -380 139 -60 -268 -46 -86 219 27
2824B7J06j69K00j80j17J4K49j69P2j9n3l2Q0Jl38K77j16j21P3J37J0m4J73j93
$$ 27 133 -36 164 -16 -133 -119 130 -39 33 14 -39 -71 9 10 -328 -51 -167 -288 -215 -78 -68 -112 61 -132
2848a32J05j77J51J81j09J76j57R3J1l9o2o8J44p9J69k16n6Q2j80k2K0n1L05j03
$$ -132 -27 -204 -53 128 19 195 38 131 142 103 41 -27 117 38 207 -9 -65 17 -163 -185 -165 -216 89 -14
2872a4j53J87j92O5K73l69k4P4j88K35n3M81m60L01R7j62R9o1j44P2J01j12p5
$$ -14 -167 20 -172 -107 166 -203 -227 -153 -341 -106 -159 322 -138 163 260 98 197 136 -8 64 165 53 -22
2895b2J47k81Q8J51N9j49j14K33k48J0N7lK10j95J6M3k29L5L48k26l7K90K1k26
$$ -22 125 -156 -68 83 142 -7 -121 112 -136 -126 -69 -72 138 -57 -41 2 -227 -192 156 -70 -107 183 204 -22
2919b2L11o6K0j39K11k47L49n42J73M8k58P8P6J32l41L65k85l8K42k7K6j55l5
$$ -22 289 223 243 104 315 68 417 -125 48 96 -162 -84 -8 124 -217 148 -137 -175 67 40 66 -89 -124
2942a24j38k9L54l5n6N5n2L7P0nNJ09l8j31k71L51m4q6k2J47k90L53L0k92k07
$$ -124 -262 -291 63 28 -28 27 -25 12 82 77 82 191 153 22 -249 102 58 -28 -50 97 -193 160 190 -102 -309
2967c09K36j22M1J58l59K90J5P8j17J93J6j23K21j19J94k21J36k03J70p7L5lJ36
$$ -309 -73 -195 -154 4 -355 -65 -50 28 -89 104 120 -3 218 99 293 72 208 5 175 98 133 130 266
2990B66j05k79J02K43n1o4j97L7J0p6oj46M9K44q3J59m03J99L29l16p8j40K08
$$ 266 161 -118 -16 227 176 112 -85 -48 -38 -114 -120 -266 -217 27 -56 103 -300 -101 228 -88 -166 -306 -98
3013i8KJ96j66K46k72j1J04J79K4k31J92J0k55N4N0j10N5j10J8J20J57k86M2o0
$$ -98 -96 100 -66 180 -92 -103 1 180 204 -27 165 175 -80 -26 24 -86 -31 -141 -123 -3 154 -132 -90 -150
3037a50Q1k9R0k19L80R1q5r6N9J11Jl07K11J38k18J95J40n29J82J74o6m01J92
$$ -150 -69 -98 -8 -227 153 244 159 63 122 233 234 -73 138 276 58 253 393 -136 46 220 154 -247 -55
3060e5PN0Pl54M02o4O2o5J99k48K28j81qlK40l58K33q3j43K40n6J80o5k69K67
$$ -55 -48 2 9 -345 57 -7 55 -10 189 -59 169 -12 -20 -23 217 -141 92 9 -134 106 50 230 165 -104 163
3085A63P8q0j6L7j34N1n8j8r8J31j98Lj58J42R5m2k3m5J30m6J17N1k76P7O0R8
$$ 163 241 161 145 182 48 99 41 23 -75 56 -142 -139 -297 -155 -60 -102 -125 -170 -40 -86 31 82 -194 -117 -57 41
3111D1j68L47j19j43J47k35L78r7K0J56k31j42J59l65O2L13l75K66j20N7K5j29
$$ 41 -127 220 101 -42 105 -130 248 151 171 327 96 -46 113 -252 -190 123 -252 14 -106 -49 -24 -153
3133a53R9n4lm9NJ83K3R9k06j3L38j53p2J89o0n0o7J09p0j5m8n4jK24l67N6P0
$$ -153 -54 -108 -111 -160 -155 28 51 150 -56 -69 269 116 44 233 173 123 56 165 95 80 32 -22 -23 201 -166 -110 -40
3160d0M6J6K6Mk43Q7K67k46k57L51q0j12J62J71n8r4N9j05J68j34J71l47K37J12
$$ -40 6 22 48 52 -191 -104 163 -83 -340 11 -69 -181 -19 152 94 0 59 -46 122 -12 159 -188 49 161
3184A61r0o8l9M1J5J33j40r0K0K78k6N8k86j8NK8j50J8K68l22P3R6J58j37j20
$$ 161 71 3 -36 5 20 153 13 -77 -57 221 195 253 -33 -51 -46 -18 -168 -150 118 -204 -131 -35 123 -14 -134
3209a34K50n6k8P1Q9j43l6j36K92j84O0k33J87q2J93K7k62J25l03L36q0R2k22
$$ -134 116 60 32 103 192 49 13 -123 169 -15 45 -188 -1 -83 110 137 -125 0 -303 33 -47 45 -177
3232a77J73j6j8K6o8M5pj20N13j63k17J10l1M7j03M6q8J29nL1j39N14n64L3K02
$$ -177 -4 -20 -38 -12 -80 -35 -42 -162 351 188 -29 81 50 97 -6 40 -48 81 76 107 -32 482 -82 -49 153
3257A53k74PK06J01l87j65K10J76k38L5J50k29Q6K40j12j0R8K1j3Q7N4k48j33
$$ 153 -121 -114 92 193 -194 -359 -149 27 -211 -176 -26 -255 -169 71 -41 -51 47 68 55 142 196 -52 -185
3280a85K09J44q6J62j12R7k83j43p9M24l00q3K10m2j25P9k6J75qj54K59j70L7
$$ -185 24 168 82 244 132 229 -54 -197 -276 148 -152 -235 -25 -67 -192 -113 -139 36 28 -126 133 -37 0
3303@p6J10M8j31j02K53k31N06l88Q5J60j03K6j14J19l17m7L24Q3j33l55J88O0
$$ 0 -76 34 82 -49 -151 102 -129 377 -11 74 234 131 157 43 162 -155 -202 122 205 72 -283 -95 -35
3326c5n3j71J45K88k70p2J92m6nj89J05R1J85l96L12k1J04j2J0j46j31K86j00
$$ -35 -88 -259 -114 174 -96 -168 24 -22 -27 -216 -111 -20 165 -231 81 60 164 152 162 16 -115 171 71
3349G1mM1J2j50n1J56j12OJ66k46l7n3J73k49J17K4J14Q5j27K17k55J57L4O0P6
$$ 71 67 108 120 -30 -81 75 -37 -31 135 -111 -148 -201 -28 -277 -160 -136 -22 63 -64 153 -102 55 89 149 225
3374B25k32J43J4o9NMP0r6K74l69l5K78l12n3J70j35j17K58l06K34j36L31j00
$$ 225 -7 136 150 81 86 90 160 64 338 -31 -66 212 -100 -153 17 -118 -235 23 -283 -49 -185 146 46
3397D6j11M34n39J57K16j14m6J22m5j17K73O2j50j77J68k98P5J15j46OJ34k31
$$ 46 -65 369 -170 -13 203 89 43 165 120 3 276 338 188 11 179 -119 -44 71 -75 -69 65 -166
3419a66J73L5k52J07J09l5k38Q5j03K87K91M2m72j68L61J68j59k02J91J49p3j16
$$ -166 7 42 -210 -103 6 -29 -267 -182 -285 2 293 335 -137 -305 56 224 65 -137 54 203 130 14
3441A4q2L10j17l03L05mj56j80K82Q4l63K72k20l7J28J4J78r4j22J61j96L87k97
$$ 14 -68 242 125 -178 127 123 -33 -213 69 153 -210 62 -158 -195 -67 -53 125 31 -91 70 -126 261 -36
3464c6q1PJ91j7P7r2M6q4j26P9r4K55j0PPo3J07k97j49M26l56J68N7k15J35j9
$$ -36 -117 -110 81 64 141 49 95 11 -115 -36 -130 125 115 122 129 66 173 -124 -273 153 -203 -35 22 -193 -58 -77
3490g7k02j09K67J60M6m06M72j83J11k36N3P3J96l52J20L24k53j07J15j01K46
$$ -77 -279 -388 -121 39 85 -321 151 -32 79 -157 -104 -31 165 -187 -67 257 4 -103 12 -89 157
3511A57K40m93J4M7k56K79p8J2m7l0j72Q7M4K04l43L99k71K43j01qK7K50k32N1
$$ 157 397 -96 -82 -35 -291 -12 -90 -78 -125 -155 -327 -240 -196 8 -335 64 -207 36 -65 -73 -46 204 -28 23
3535B3K54L0l42K8K06k46J04O0j30K9j61K36r2j81K32k50J72L9q5j93N95m28Q3
$$ 23 277 307 -35 -7 199 -47 57 117 -13 16 -145 91 -1 -182 50 -200 -28 11 -74 -267 328 -100 -17
3558a7K7j37M00m80J44M3J54k10O5J18n7K90l05M0n0N3j2K55m83J35P8J44m15
$$ -17 10 -127 273 -207 -63 -20 134 -76 -11 107 50 340 35 75 25 78 66 321 -162 -27 51 195 -220
3581b20J81l3L16m20Q2K83l41K4K71l10J83j22K95k05j80K31M4Q1O8j52p3oK8
$$ -220 -39 -72 244 -176 -94 189 -152 -128 143 -167 16 -106 189 -16 -196 35 79 160 228 76 3 -3 25
3604B5K15j69LK5J9k5J8k73K85j37J0j7K7q2j37J60n6J40j14J66j61m9J65q8N1
$$ 25 240 71 74 99 118 93 111 -162 123 -14 -4 -21 6 -76 -213 -53 -109 31 -83 83 -78 -127 38 -50 1
3629AL2O1L21n50N27j91k85K24k88K27J92k35K57l84J10qJ1k3l30L11j8P9k20
$$ 1 33 94 415 -135 392 201 -84 140 -148 79 271 36 293 -91 19 11 22 -1 -331 -20 -38 41 -179
3652a79K25j82K59k37j13N81n27R4J14R9k20k4N08k49k73L88m09K03j27Q5R1q0
$$ -179 46 -136 123 -114 -227 354 -173 -79 35 134 -86 -110 398 149 -124 264 -145 58 -69 16 107 27
3674B7KM6o6q7K3J7J99k06j38j08L05n1J99q3k53R2J01M12m81J65l05j3n3L07
$$ 27 29 75 9 -78 -55 -38 161 -45 -183 -291 14 -37 162 79 -174 -82 19 431 -50 115 -190 -203 -256 51
3698E1j11J85q3M7L3k15M04k05l19o7K53j30L22k0j93Rl1J33p5M6j0j05K84j29
$$ 51 -60 125 42 89 122 -93 311 106 -213 -280 -27 -157 165 145 -48 -39 -70 63 -12 34 24 -81 203 74
3722G4jr6K26k41K93j59N6m20L03J70p2J9k86M37l43oJ70k76K21p4k5J14l18L05
$$ 74 73 -23 203 -38 255 96 152 -268 35 205 133 152 -134 303 -40 -46 124 -152 69 -5 -30 84 -234 71
3746G1j22k13K95k21K36j2p8J16j20m3k0j98L13K8J4N9m7K00j47j13j81M08l30
$$ 71 -51 -264 31 -190 46 34 -44 72 -48 -91 -111 -309 4 32 46 105 58 258 111 -2 -183 225 -105
3769a05K03r5O2k59R3J81l8r8Q5j16J34p7J04m0pR0nr7j43J03o7J83N4j40jj13
$$ -105 98 3 65 -194 -101 80 42 -56 29 -87 47 -30 74 34 27 117 112 15 -128 -25 -92 91 145 5 4 -109
3795a09Q7J31pJ8M8k24K22pR0k97J54j05j55K36j48q7O4P2k3P0Lj51J99r3K5O3
$$ -109 -22 109 102 120 168 -56 166 159 249 -48 106 1 -154 82 -66 -153 -89 -17 -40 30 33 -118 81 -12 13 76
3821G6j01N4k42P2J81k13J42j39L27J29l12Q2N9P2k95K27j16J20j78Qr7J24m5
$$ 76 -25 29 -213 -141 40 -173 -31 -170 157 286 -26 56 115 187 -108 119 3 123 -55 -47 -144 -20 -65
3844f5j81M23j41J15k18N7%K9R2J3j33J12j22K03J00l62P9j36R6R8J64j23j77
$$ -65 -246 177 36 151 -67 -10 -10 19 111 124 -9 103 -19 184 284 -78 1 -135 -39 59 223 100 -77
3867g7r8N1L17k80J72o2k02L14l27R4p9j22L63j86J06n6K15n17N48J57l67J40
$$ -77 -175 -124 193 -87 85 23 -179 135 -192 -98 -177 -299 64 -122 -16 -72 143 -374 174 331 -36 104
3889A04j72N3R2J01M6j25L8p0j14k1J99nj57J37Lj27O4j82J5O1K4P2j34o5N2K38
$$ 104 -68 -15 77 178 224 99 137 67 -47 -68 131 126 -31 106 109 -18 46 -136 -121 -60 -36 36 -98 -163 -111 127
3915A27k75L42j99Mj03J37K11j29q1k2J66l51L26j65L3kO3j59P3N7N4j5m25L30
$$ 127 -148 194 -5 -1 -104 33 244 115 34 12 178 -173 153 -12 21 19 82 -77 -4 53 107 92 -333 -3
3939cl12J35L5P1k09K22n7N7j39O9J08Q3Q2K2k07N4l7L1J45j10j03J89J83m61
$$ -3 -315 -180 -145 -74 -283 -61 -118 -61 -200 -131 -23 60 142 164 -43 11 -26 5 150 40 -63 126 309 -152
3963a52L09j82K46j28P3l80J26J82m16K35j17K86j17j3q6R8O0r8J87Qr2j94J90
$$ -152 157 -25 221 93 166 -214 -88 94 -322 -87 -204 82 -35 -48 -134 -36 24 -74 113 121 29 -165 25
3986B5j26J80K48k73K8m7J70k32k23K60R5k79J99N2o0k06L4L23o1k47R0j11K18
$$ 25 -101 79 327 54 82 35 205 -27 -250 10 105 -174 25 77 17 -189 -155 168 107 -140 -50 -161 57
4009E7p1l1J25k62J73P4J36Nk52P7L1j59K26n3l4r9R1j7o3J38k81K49j99K59Q5
$$ 57 -14 -45 80 -182 -9 65 201 206 -46 31 62 -97 129 76 42 -57 34 17 -46 92 -189 60 -139 120 205
4034B05k61K23j63j38K31m6J01l33L3K52l02M35k47j13O1Q8K85j75j0K2k77K71
$$ 205 -56 167 4 -134 97 51 152 -181 -148 104 -198 237 -10 -123 -62 26 311 136 126 148 -129 142
4056A42j63J04K13m07J60j02K01n2k52r6K48J44k73L3L4o2n5J47N3r8J09J1j58
$$ 142 -21 83 296 -111 49 -53 148 96 -156 -252 -4 140 -133 -100 -66 -128 -183 -36 17 -81 28 39 -119
4079a19J21k8J8L47l30J2j53J62J6K11m10K51j04k41O3L6J86n6J51l63J15J83
$$ -119 2 -26 -8 339 9 21 -132 30 46 257 -153 98 -6 -247 -184 -148 38 -18 133 -230 -115 68
4101F8m7j84M8K68l71L2J97j46qN3J66j41J37k61R1L41q5l38J65Q4j18J93K60
$$ 68 21 -163 -115 153 -218 -186 11 -135 -143 -90 76 -65 72 -189 -98 243 158 -180 -15 69 -49 144 404
4124D04m65O6j32n6J52Q7o3j37J23r6J0j13N4J2J07L41j94K44j48j95M2j98J77
$$ 404 -61 5 -127 -183 -31 56 -7 -144 -21 -117 -107 -220 -166 -154 -47 294 100 344 196 1 43 -155 22
4147B2n0J17n7J14j0l34J60j01K07J55n05M69j99N7l3PJ06l02P5P7K64k61r8N2
$$ 22 -28 89 32 146 136 -198 -38 -139 68 223 -282 187 -12 45 12 19 125 -177 -102 -25 239 -22 -120 -68
4171f8Q5J70p6Lj57j75J44K36j43M06j58lk42N8M6J19l18q6J62lLq5l3J04J97
$$ -68 17 187 111 114 -43 -218 -74 162 19 425 267 264 22 80 126 245 -73 -159 3 0 3 -82 -115 -11 186
4196A86j44j69q5j4J90q2o6j7J84p5L8K35j39L7J7p9J48j27K19j76j4k2o2n6K04
$$ 186 42 -127 -212 -226 -36 -118 -184 -201 -17 -92 -54 181 42 79 96 17 165 38 257 81 67 45 -17 -73 131
4221A31j29o8J16k33J06R7l1j7p6J39j52P1J6J65j83j20P5n0J07J23k2k05O9L03
$$ 131 2 -66 50 -183 -77 20 -11 -28 -104 35 -117 -46 -30 135 -48 -168 -93 -143 -36 87 65 -140 -71 232
4245B32k50J34L6j94j1J08p5N9j33J18l33M54k27J04m7J70j71j49K83R1j45k02
$$ 232 -18 116 152 -42 -53 55 -20 39 -94 24 -309 145 -82 22 -25 145 -26 -175 108 199 54 -148
4267a48J29k00M52l73J47kl0q3oM9rJ46K8q8O3J50Kk23M5q0J3J44j14j40J93m04
$$ -148 -19 -219 233 -140 7 5 -25 -108 -114 -65 -74 72 100 12 75 225 227 4 49 -31 -18 126 12 -128 65 -339
4293c39K76J71j97j70J77J87k80J81k85O3N5R6l6r9L11j25j00L46j06j41M7N5
$$ -339 -63 108 -89 -259 -82 105 -175 6 -279 -216 -161 -65 -101 -200 111 -14 -114 232 126 -15 32 87
4315H7m8L9K02L8j60m31J14J72j44J53j93k17M84j7k46J18j71J56M0n9K08k53
$$ 87 39 78 280 318 158 -273 -159 13 -131 22 -171 -388 96 79 -167 -49 -220 -64 -24 -83 125 -128
4337a28J5npJ76p2J76J08j90j70M2L2j19L7N3J03J61j44m3k5J23k47RL1J83k2
$$ -128 -113 -118 -125 51 -21 155 263 73 -97 -55 -23 -142 -105 -52 51 212 68 25 0 123 -124 -115 -84 99 77
4362G7j6Nj22K71k18R1k99L39k03J72p5q9RJ87J19m55L22k32J75k8O1j51J82j04
$$ 77 61 66 -56 215 -3 88 -211 128 -75 97 22 -67 -58 129 248 -207 115 -117 58 30 91 -60 122 18
4386A8m7J74k6m4p1j16Q4Kl6K43m16J49q0M8K10j45j50L08j45L7pl8MN6j18K36
$$ 18 -29 145 119 75 4 -112 -28 -26 -62 181 -235 -86 -166 -118 92 -53 -203 105 -40 -3 -10 -48 -44 12 -106 130
4412A30R0k11J76m3L6J22k9l67J61k64L64l98K51j88L00n7M4j0K0qj49p0L50m24
$$ 130 220 9 185 142 178 300 271 -96 65 -199 165 -233 18 -170 130 73 117 107 127 119 -30 -100 250 -174
4436a74K21J56j56K12k44j52K27K28l43N1O7j79K81m2j55J07r2J43j88N4M7M9
$$ -174 47 203 47 259 15 -137 90 318 -25 26 93 -86 195 153 -2 105 13 156 -32 22 69 118
4458A18J47l20n4K54j48Pp1j12Q7P8L9m8k4j74L74j42k85K17K92m35L51O4j43
$$ 118 265 -55 -109 145 -3 4 -67 -179 -92 -14 25 -23 -47 -221 153 11 -274 -57 235 -200 151 215 72
4481G2R7j88K32l43Q0K31j33JM1M2l45N6q0K00J02o9J49l46M25l89L7K4J96n5
$$ 72 169 -19 213 -130 -50 181 48 49 90 132 -213 -157 -237 -37 65 -4 145 -201 224 -165 -128 -104 92 37
4505C7L51m44K18j69k0J0Q8k0j65J97j96K8k2O7k58L27J76l24QK65j28l3J57k38
$$ 37 388 -56 162 -7 -27 -17 71 51 -114 83 -113 -85 -107 -40 -298 29 205 -119 -111 154 26 -7 150 -88
4529h8J79m3o4M7j8R0Rk93J69m5M0L3j77K57j78L34j96r8J40p5j36j68K04K8m0
$$ -88 91 48 -16 31 13 103 112 -181 -12 -57 -17 16 -161 96 -82 252 56 -42 98 23 -113 -281 -77 -49 -89
4554h9q9k3L84k11o6K74l98L78k07k5P1K00l00K97l1j29L4Nkj17L10j4l15K62
$$ -89 -178 -201 183 -28 -94 180 -218 160 -47 -72 -1 199 -101 196 165 36 70 75 73 -44 266 252 -63 199
4578A99k00L42k30m4R1r7j60k0RL8m6K57l62J89j65P0L82j02q2r5r5J96j44J18
$$ 199 -1 341 111 67 158 61 -99 -119 -110 -72 -118 139 -223 -34 -199 -129 253 151 69 -26 -121 75 -69 49
4602D9J5J86j64J1o9j27L9N9J37j56K18j16k95J40J33j93Q7j45K09o6J13k32J3
$$ 49 64 250 86 97 28 -99 -60 -1 136 -20 198 82 -213 -73 60 -133 -46 -191 18 -48 65 -167 -154
4625a54o6K08KK5J68j49j35Q1J05j80J33N9N5K0j74O2l2P5j46J6K45o2k72O0o7
$$ -154 -220 -12 -10 15 183 34 -101 -20 85 -95 38 97 152 172 -2 60 28 103 -43 -27 218 156 -116 -56 -123
4650a23J35O5p7Q4k36K13Q5l14PL72m36M42k02J08O1j67J74j19NJ7j70J19k16
$$ -123 12 77 0 84 -152 61 146 -168 -161 211 -225 217 15 123 184 17 191 72 77 94 -76 43 -173
4673a73K88j65J07J8l09K89L72l98Rj95R7lj32M48l54j13J80j2J5M7o2j03Mj62
$$ -173 115 -50 57 75 -234 55 427 29 38 -157 -60 -63 -195 253 -101 -214 -34 -46 -31 16 -46 -149 -145 -307
4697c07K58K10r2J84l37J86J1q2K11k28m6K32k28k4M2j55j02K58o2J54j32K69
$$ -307 -49 161 69 253 -84 102 113 31 242 14 -32 200 -28 -52 -10 -165 -267 -9 -71 83 -49 220
4719B20m65J63j39K25P9r7j87M07k82r0K75j31j98J71k1L01k5l56J35j52L55k46
$$ 220 -245 -82 -221 4 83 -14 -201 206 -76 -166 109 -22 -220 -49 -70 231 206 -150 -15 -167 188 -58
4741e8j11P0J34l09K06j24J48j74K96j34l95M75R9m4p1j6j8q5K97J5k87J75J41
$$ -58 -169 -99 35 -274 -68 -192 -44 -218 78 -56 -451 24 123 79 8 -8 -26 -111 186 201 -86 89 230
4764B30j55j58J47J9j55J68k88K17J35j39k31K53J22j42j71j32K67j95L7L39l78
$$ 230 75 -83 64 83 -72 96 -192 25 160 21 -210 43 165 23 -148 -280 -13 -208 -171 168 -210
4785b10L94k64l2M6M6k48K46j94J73J66j82J30J07l33J5Q5M7J31j34O8K05n0l89
$$ -210 184 -80 -112 -66 -20 -268 -22 -216 -43 123 -59 71 178 -155 -140 -55 -8 123 -11 57 262 212 -177
4808a77K22j41m1j53J8P8L30j81j66J24p9j1j42M5M2K42j22P8J55j72J90j13r3
$$ -177 45 -96 -137 -290 -272 -194 136 -45 -211 -87 -166 -177 -319 -274 -232 10 -112 -34 121 -51 139 26 -67
4831f7L85j83k77RL64j86mq1L7N2m6R0J71k74j2P6P9j8m15j10M26l90M21j10J74
$$ -67 318 135 -142 -133 231 45 41 -40 -3 49 3 93 264 -10 -22 54 133 115 -300 -410 16 -374 47 -63 111
4856A11q5l05K93j17J71l29J76j2J18J39n0j03%j91K55j11J05q4N6k5O4k61K13
$$ 111 26 -279 14 -103 68 -261 -85 -97 21 160 110 7 7 -184 71 -40 65 -19 37 12 76 -185 28
4879B8j4j46J67j42M6M4j08L01j85o4j13J62j30J60j10J92j41K16l74L60r3JL3
$$ 28 14 -132 35 -107 -61 -17 -125 176 -9 -73 -186 -24 -154 6 -104 88 -53 163 -211 149 56 57 90
4902I0p4K34k91J1k3Q3k40J71j60L42l33J30k47L84k7l35N2k4K55j51K98k75J76
$$ 90 16 250 -41 -30 -53 30 -210 -39 -199 143 -190 -60 -307 77 50 -285 -233 -257 -2 -153 145 -130 46
4925D6K07j56j32N7J8L9p3J20p3L5j35q3O4p5M2j6J70JM3q9Q2m24N13r9l56M77
$$ 46 253 97 -35 22 40 79 6 126 53 88 -47 -130 -66 -141 -99 -115 55 56 99 10 92 -332 181 82 -274 203
4951B03l69K76l5r2P6J98o5P3n90M89j09kj41K9j8J45n2j05K51p1k96j72L18o
$$ 203 -166 110 75 -17 59 257 192 265 -325 164 55 53 -88 -59 -77 68 16 -89 162 91 -205 -377 -59 -65
4975f5n2l3J82j8K3J68J30j50q9j84L44n3P1m89L07J3j22J75q6j53J19J11j82
$$ -65 -117 -150 32 14 37 205 335 185 96 -88 256 203 274 -215 92 105 -17 158 72 -81 38 149 -33
4998c3N1p3J88l3Ojn4l11K53k9l9q2J03l75K88L67m33K93j14k5J00J5j25L14p0
$$ -33 18 -55 133 100 106 105 51 -260 -7 -36 -75 -157 -54 -429 -141 226 -207 86 -28 -53 47 62 -63 251 181
5023A81l48J14q4K63k7j07K65k46j52K89k03j07K40j33K21j46j21q2K56k53L0
$$ 181 -167 -53 -137 126 99 -8 257 11 -141 148 -55 -162 78 -55 166 20 -101 -183 73 -180 -150
5044a50K0K65k21o5L7o1L48m14K43Nq8K03k52M61k85K2k26j22N14k87N1J01Q8
$$ -150 -130 135 -86 -151 -114 -175 173 -241 2 7 -81 122 -130 331 46 68 -158 -280 234 -53 -2 99 187
5067A87j59n0J49j08j10L9J15k19J38k1J27j30J80j06m8O9j13J13K5k15J44n2
$$ 187 28 -22 127 19 -91 -52 63 -156 -18 -39 88 -42 138 32 -16 53 -60 53 78 -137 7 -45
5089d5J06J07j42j7j18J20j11K23O6l59K50J92m64K29j60Q3J17k08K03mJ2p6p9
$$ -45 61 168 26 9 -109 11 -100 123 189 -170 80 272 -192 37 -123 -40 77 -131 72 68 80 4 -75
5112g5n7p6L76j43J45r2N9m53K71r4K50j5J26j55J2L0k35N15l21rq5J43k95J58
$$ -75 -132 -208 168 25 170 78 137 -316 -45 -139 111 96 222 67 79 109 -126 389 68 59 -26 117 -178 -20
5136b0k24pO5K10j59L64l68J8J11k76L86j9N9k61Q1p1M9j23K17j42J87J00m8k44
$$ -20 -244 -251 -186 24 -135 229 -139 -121 -10 -286 100 81 140 -121 -40 -111 -62 -185 32 -110 77 177 129 -115
5160a15l8J78n9K46l16J46j16K66l0k62o3J11J11q5K9l4J6l1J04k8K12l63K08
$$ -115 -153 25 -34 212 -104 42 -74 192 162 -100 -163 -52 59 -26 3 -31 -15 -46 58 30 242 -121 87
5183H7K2K24l23j52L04N7j44n5N0k26j01L08Jmp8n2j30J51K97l51K2p1J20J3P5
$$ 87 109 333 10 -142 162 219 75 20 70 -156 -257 51 52 48 -30 -82 -212 -61 236 -115 -93 -164 -44 -31 44
5208D4q3J7l1j08L62k86J21M1P6n9k05o6J96J55j12j08J16j20l6k5K8Q8k28N3
$$ 44 -39 -22 -53 -161 201 -85 36 77 153 94 -111 -177 19 174 62 -46 70 -50 -86 -111 -83 5 -223 -170
5232a70J88Q8l36l6L47q9j12M0O2n2jJ46j60j42J40R2k48J35j52K39j49K42K2
$$ -170 18 106 -230 -266 81 -8 -120 -80 -18 -70 -71 75 -85 -227 -87 5 -243 -108 -260 -21 -170 72 94
5255I4m5n7j18J00k30J2J77J52n7j17K09k82L42j82J08l15J93Q3k06KoJ47m4J08
$$ 94 49 -8 -126 -26 -256 -244 -67 85 28 -89 120 -162 180 -2 106 -209 -16 67 -139 -137 -143 4 -40 68
5279F8k48L95k99K67k4n7k06K24j33P6N5L2k12l9K25l06l1M19j12q3J28ml71L46
$$ 68 -180 215 -84 183 159 102 -104 120 -13 63 118 150 -62 -101 124 -182 -213 206 94 11 139 135 -236 110
5303A10m27M44j93k3K51m5k9m14J18J18j7K66l15L01l31N48r2k99L1j7l11K60
$$ 110 -317 127 -66 -89 162 117 88 -326 -208 -90 -107 159 -156 145 -186 362 270 -29 2 -15 -326 -66
5325f6j61K0l3K02j25k9J08k7J43k21K55P5k36R2Kj26M4N6L6M2J19j60J86j68
$$ -66 -227 -207 -240 -38 -163 -192 -84 -111 32 -189 66 141 -95 -3 -1 -127 -83 -27 9 51 170 10 196 28
5349B8J92k30Rm6m1j10L31j18L6J43k49J29j37J4j51J66l7n4L40l72N71l64r6
$$ 28 220 -10 -1 -47 -88 -198 133 15 51 194 -55 74 -63 -49 -200 -34 -71 -125 215 -157 414 50 -46
5372d6R0K6j06LL22k00J75k10l1M2j3k08L39r8J38j67Jj34M9N1k2j58K71k07K73
$$ -46 44 70 -36 -33 289 89 264 54 23 65 52 -156 183 85 223 56 57 -77 -28 23 1 -157 114 -93 180
5397A80l18L3RQ3k26m2L24K3Rp1J43P4L3k68L2o7m2O7j5J27k51J78q3J71k56O2
$$ 180 -138 -105 -96 -13 -239 -281 43 66 75 4 147 221 254 -14 18 -49 -91 -24 -39 88 -163 15 -68 103 -153 -91
5423i1J20m0k03L23K19l56j24J04J20Q5K3j36k05L43k31m4J16L01m99K09k26J70
$$ -91 29 -11 -214 109 328 -28 -152 -48 72 157 180 44 -161 182 -49 -93 23 324 -175 34 -192 -22
5445b2n1J8n6K74m63J65K84p9J18k60K63j67j35o0P9o1J37k16J8M91l90J63K35
$$ -22 -73 -55 -111 163 -300 -135 149 70 188 -72 191 24 -111 -171 -92 -153 -16 -232 -214 277 -113 50 285
5468B85k15O9j61%P4j03J66L7j98J42r0Q0r5q8N7j7N2l61L35o0k8K9k1K25r6l2
$$ 285 70 139 -22 -22 52 -51 115 152 -46 96 6 86 -9 -97 -40 -57 -5 -366 -31 -91 -119 -90 -111 114 18 -14
5494a4J04k40L20k42J03k18m7K83j07L64m07J27n8J49K0J50j81j12p4J36o0M4
$$ -14 90 -150 170 -72 31 -187 -234 49 -58 306 -101 26 -32 117 137 287 106 -6 -80 56 -4 40
5516D0J45j99K33j07k80K55k14K01N8k91L29l36L78l31J89o7o4m5K0K37j92kj75
$$ 40 185 -14 219 112 -168 87 -127 74 132 -159 170 -166 212 -119 70 3 -61 -106 -86 151 -41 -43 -218
5539b18Q7K94l45L15lk52J27j13L72N1m56L60l16J01j4j49K47k07j36J80o6J01
$$ -218 -131 163 -182 133 130 -122 5 -108 264 315 -141 219 -97 4 -10 -159 88 -119 -255 -75 -141 -40
5561d0j08j67N65l09j84J64l0K04K4j16J25l79L50L9j08L0PL57m36J04j25p3L74
$$ -40 -148 -315 250 -59 -243 -79 -109 95 119 3 128 -251 99 138 30 60 67 424 -12 92 -33 -106 268
5584B68k19j46R8PK13k81n9o1N5r6M4Q1J36J17j79K13k90R8J16j83N6j99M64k94
$$ 268 49 -97 1 8 221 -60 -119 -180 -125 -221 -177 -96 40 157 -22 191 -99 -1 115 -68 -12 -211 253 -41
5608d1R5J91k34J32j55M1m2j36J41J01j85j30M2K18j65J5J2J68o6k03K84J32j64
$$ -41 54 245 11 143 -12 29 -13 -149 -8 93 -92 -222 -180 38 -127 -112 -100 68 2 -201 83 215 51
5631E1j65L60k03k70K12K63k55J49j03k59L73j72J40r7J34k1or7J77j75KM6k29
$$ 51 -114 246 43 -227 -15 248 -7 142 39 -220 153 -19 121 24 158 137 131 34 211 36 38 84 -145
5654a45n0Q9o6K80q2J23r8k9J64q7l74N37l06L7j78K60q0k71L58Rj7j67P9J22
$$ -145 -195 -106 -172 108 26 149 51 22 186 99 -275 262 -44 -7 -185 75 -5 -276 82 91 74 -93 -14 108
5678A08L7k04K12k17K17k17K41j83k4j49J28K05k58K69k46j99L71l36J80J62j79
$$ 108 145 -59 153 -64 153 -64 177 -6 -30 -179 -51 154 -104 165 -81 -280 91 -245 -65 97 -82
5699h2K79l10P9K8q2N9P6J58j85o5nK3J24M1M4k61K70o7m12L50J3J28j43k00o1
$$ -82 197 -113 -34 -6 -88 -29 47 205 20 -45 -50 -27 97 138 182 -79 191 124 -288 62 75 203 60 -140 -201
5724b01M82l84J60M0o6P5j6j95J51J1pNN7l8K39l8j52k19q0Q5N9J47j71J39j62
$$ -201 281 -103 57 97 31 106 90 -105 46 57 50 55 112 74 313 275 123 -96 -176 -91 -32 115 -56 83 -79
5749g9J86k86L56j88M8j68rK25j09j21L15m37Q0L07m45N94j63J87j80r7K42j60
$$ -79 107 -179 177 -11 37 -131 -140 85 -24 -145 170 -267 -187 120 -325 269 106 293 113 16 258 98
5771I8jJ57l18N1J06r4k34J08J09l9k1q0K11O4r8k09J22j03K5P2J15M1l27K18
$$ 98 97 254 -64 -13 93 -1 -235 -127 -18 -57 -78 -158 53 117 19 -190 -68 -171 -146 -74 41 82 -245 -27
$$ [...]
8191i
##END NTUPLES=NMR FID
##END=
