##TITLE=1H_Pr C6-AmQ
 CDCl3,8 sc, 
 30.9.2021
##JCAMPDX= 6.0         $$ Bruker NMR JCAMP-DX V2.0
##DATA TYPE= NMR FID
##DATA CLASS= NTUPLES
##ORIGIN= UXNMR, Bruker Analytische Messtechnik GmbH
##OWNER= root
$$ XWIN-NMR		Version 3.5
$$ Thu Sep 30 09:31:34 2021 Russian Standard Time (UT+4h)  she@DPX200
##.OBSERVE FREQUENCY= 200.1313468511
##.OBSERVE NUCLEUS= ^1H
##.DELAY= (6, 6)
##.ACQUISITION MODE= SIMULTANEOUS
##.ACQUISITION SCHEME= undefined
##.AVERAGES= 8
##.DIGITISER RES= 18
##SPECTROMETER/DATA SYSTEM= spect
##.PULSE SEQUENCE= zg30
##.SOLVENT NAME= D2O
##.SHIFT REFERENCE= (INTERNAL, D2O, 0, 15.7039)
##AUDIT TRAIL= $$ (NUMBER, WHEN, WHO, WHERE, WHAT)
$$ ##TITLE= Audit trail, XWIN-NMR		Version 3.5
$$ ##JCAMPDX= 5.01
$$ ##ORIGIN= Bruker BioSpin GmbH
$$ ##OWNER= she
$$ F:/spectra/data/she/nmr/H-F/1/audita.txt
$$ ##AUDIT TRAIL=  $$ (NUMBER, WHEN, WHO, WHERE, WHAT)
(   1,<2021-09-30 09:29:49.64 +0400>,<she>,<DPX200>,
      <created by zg, POWCHK disabled, PULCHK disabled
       configuration hash MD5:
       00 E9 B6 7A A2 85 ED C7 34 08 36 98 17 FE 4E 26
       data hash MD5: 16K
       A8 A6 BC 91 0B 80 4F D0 0F 7D 75 54 79 18 0A 87>)
$$ ##END=
$$ 
$$ hash MD5
$$ 66 1E A3 9D 75 3F 64 09 58 B3 A7 BC 67 FF 1F C0
##$RELAX= 
##$RELAX= 
##$RELAX= 
##$RELAX= 
##$RELAX= 
##$RELAX= 
$$ Bruker specific parameters
$$ --------------------------
##$DU= <F:/spectra>
##$EXPNO= 1
##$NAME= <H-F>
##$PROCNO= 1
##$TYPE= <nmr>
##$USER= <she>
##$AMP= (0..31)
100 100 100 100 100 100 100 100 100 100 100 100 100 100 100 100 100 100 
100 100 100 100 100 100 100 100 100 100 100 100 100 100 
##$AQSEQ= 0
##$AQ_mod= 1
##$AUNM= <au_zg>
##$AUTOPOS= <>
##$BF1= 200.13
##$BF2= 200.13
##$BF3= 200.13
##$BF4= 200.13
##$BF5= 200.13
##$BF6= 200.13
##$BF7= 200.13
##$BF8= 200.13
##$BYTORDA= 1
##$CFDGTYP= 0
##$CFRGTYP= 5
##$CHEMSTR= <none>
##$CNST= (0..31)
1 1 145 1 1 1 1 1 1 1 1 1 1 1 1 1 1 1 1 1 1 1 1 1 1 1 1 1 1 1 1 1 
##$CPDPRG= <>
##$CPDPRG1= <>
##$CPDPRG2= <>
##$CPDPRG3= <>
##$CPDPRG4= <mlev>
##$CPDPRG5= <mlev>
##$CPDPRG6= <mlev>
##$CPDPRG7= <mlev>
##$CPDPRG8= <mlev>
##$CPDPRGB= <>
##$CPDPRGT= <>
##$D= (0..31)
0 1.2 0 0 0 0 0 0 0 0.06 0 0.03 0 0 0 0 0.0002 0 0 0 0 0 0 0 0 0 0 0 0 
0 0 0 
##$DATE= 1632979789
##$DBL= (0..7)
120 120 120 120 120 120 120 120 
##$DBP= (0..7)
150 150 150 150 150 150 150 150 
##$DBP07= 0
##$DBPNAM0= <>
##$DBPNAM1= <>
##$DBPNAM2= <>
##$DBPNAM3= <>
##$DBPNAM4= <>
##$DBPNAM5= <>
##$DBPNAM6= <>
##$DBPNAM7= <>
##$DBPOAL= (0..7)
0.5 0.5 0.5 0.5 0.5 0.5 0.5 0.5 
##$DBPOFFS= (0..7)
0 0 0 0 0 0 0 0 
##$DE= 6
##$DECBNUC= <off>
##$DECIM= 32
##$DECNUC= <off>
##$DECSTAT= 4
##$DIGMOD= 1
##$DIGTYP= 9
##$DL= (0..7)
0 120 120 120 120 120 120 120 
##$DP= (0..7)
150 150 150 150 150 150 150 150 
##$DP07= 0
##$DPNAME0= <>
##$DPNAME1= <>
##$DPNAME2= <>
##$DPNAME3= <>
##$DPNAME4= <>
##$DPNAME5= <>
##$DPNAME6= <>
##$DPNAME7= <>
##$DPOAL= (0..7)
0.5 0.5 0.5 0.5 0.5 0.5 0.5 0.5 
##$DPOFFS= (0..7)
0 0 0 0 0 0 0 0 
##$DQDMODE= 0
##$DR= 18
##$DS= 0
##$DSLIST= <SSSSSSSSSSSSSSS>
$$ [...]
##$SUBNAM2= <"">
##$SUBNAM3= <"">
##$SUBNAM4= <"">
##$SUBNAM5= <"">
##$SUBNAM6= <"">
##$SUBNAM7= <"">
##$SUBNAM8= <"">
##$SUBNAM9= <"">
##$SW= 18.0517286264689
##$SWIBOX= (0..15)
0 0 2 0 0 0 0 0 0 0 0 0 0 0 0 0 
##$SW_h= 3612.71676300578
##$TD= 16384
##$TD0= 1
##$TE= 0
##$TE2= 300
##$TE3= 300
##$TEG= 300
##$TL= (0..7)
0 120 120 120 120 120 120 120 
##$TP= (0..7)
150 150 150 150 150 150 150 150 
##$TP07= 0
##$TPNAME0= <>
##$TPNAME1= <>
##$TPNAME2= <>
##$TPNAME3= <>
##$TPNAME4= <>
##$TPNAME5= <>
##$TPNAME6= <>
##$TPNAME7= <>
##$TPOAL= (0..7)
0.5 0.5 0.5 0.5 0.5 0.5 0.5 0.5 
##$TPOFFS= (0..7)
0 0 0 0 0 0 0 0 
##$TUNHIN= 0
##$TUNHOUT= 0
##$TUNXOUT= 0
##$USERA1= <user>
##$USERA2= <user>
##$USERA3= <user>
##$USERA4= <user>
##$USERA5= <user>
##$V9= 5
##$VALIST= <valist>
##$VCLIST= <CCCCCCCCCCCCCCC>
##$VD= 0
##$VDLIST= <DDDDDDDDDDDDDDD>
##$VPLIST= <PPPPPPPPPPPPPPP>
##$VTLIST= <TTTTTTTTTTTTTTT>
##$WBST= 1024
##$WBSW= 4
##$XGAIN= (0..3)
0 0 0 0 
##$XL= 0
##$YL= 0
##$YMAX_a= 22879
##$YMIN_a= -26897
##$ZGOPTNS= <>
##$ZL1= 120
##$ZL2= 120
##$ZL3= 120
##$ZL4= 120
##$ABSF1= 10
##$ABSF2= 0
##$ABSG= 5
##$ABSL= 3
##$ALPHA= 0
##$AQORDER= 0
##$ASSFAC= 0
##$ASSFACI= 0
##$ASSFACX= 0
##$ASSWID= 0
##$AUNMP= <proc_1d>
##$AZFE= 0.1
##$AZFW= 0.1
##$BCFW= 1
##$BC_mod= 2
##$BYTORDP= 1
##$COROFFS= 0
##$CY= 11.3945322036743
##$DATMOD= 1
##$DC= 2
##$DFILT= <>
##$DTYPP= 0
##$F1P= 2.36226072786647
##$F2P= -0.459571619588291
##$FCOR= 0.5
##$FTSIZE= 0
##$FT_mod= 4
##$GAMMA= 1
##$GB= 0.15
##$INTBC= 1
##$INTSCL= 1
##$ISEN= 128
##$LB= 0.24
##$LEV0= 0
##$LPBIN= 0
##$MAXI= 10000
##$MC2= 0
##$MEAN= 0
##$ME_mod= 0
##$MI= 1.114404
##$NCOEF= 0
##$NC_proc= 0
##$NLEV= 6
##$NOISF1= 3.799351
##$NOISF2= 2.8
##$NSP= 1
##$NTH_PI= 0
##$NZP= 0
##$OFFSET= 15.70392
##$PC= 1
##$PHC0= -14075.22
##$PHC1= 15.40085
##$PH_mod= 1
##$PKNL= yes
##$PPARMOD= 0
##$PSCAL= 0
##$PSIGN= 0
##$REVERSE= no
##$SF= 200.130013532006
##$SI= 16384
##$SIGF1= 3
##$SIGF2= 2
##$SINO= 400
##$SIOLD= 16384
##$SREGLST= <1H.CDCl3>
##$SSB= 0
##$STSI= 0
##$STSR= 0
##$SW_p= 3612.71676300578
##$SYMM= 0
##$S_DEV= 0
##$TDeff= 0
##$TDoff= 0
##$TI= <>
##$TILT= no
##$TM1= 0
##$TM2= 0
##$TOPLEV= 0
##$USERP1= <user>
##$USERP2= <user>
##$USERP3= <user>
##$USERP4= <user>
##$USERP5= <user>
##$WDW= 1
##$XDIM= 8192
##$YMAX_p= 0
##$YMIN_p= 0
$$ End of Bruker specific parameters
$$ ---------------------------------
##NTUPLES= NMR FID
##VAR_NAME=  TIME,          FID/REAL,        FID/IMAG
##SYMBOL=    X,             R,               I
##VAR_TYPE=  INDEPENDENT,   DEPENDENT,       DEPENDENT
##VAR_FORM=  AFFN,          ASDF,            ASDF
##VAR_DIM=   8192,          8192,            8192
##UNITS=     SECONDS,       ARBITRARY UNITS, ARBITRARY UNITS
##FACTOR=    0.0002768,     1,               1
##FIRST=     0,             0,               0
##LAST=      2.2672688,     0,               0
##MIN=       0,             -26897,          0
##MAX=       2.2672688,     22879,           0
$$ Real data points
##PAGE= N=1
##DATA TABLE= (X++(R..R)), XYDATA
0 0 0 0 0 0 0 0 0 0 0 0 0 0 0 0 0 0 0 0 0 8 -8 8 -8 8 -8 15 -16 16 -17 24 -24 31 -32 39 -41 48 -55 61 -69 77
40 77 -85 95 -104 118 -128 142 -157 173 -189 211 -232 256 -281 311 -344 379 -421 468 -521 585 -660
61 -660 755 -869 1019 -1216 1500 -1938 2719 -4574 22879 -3327 -15311 14735 6123 1273 -5650
76 -5650 4240 3940 -9468 4833 11705 -13511 -633 4738 -3441 -3309 -4815 -1442 -3194 -11892 5965
91 5965 1696 -12566 3950 5450 -1443 1724 337 4854 459 -3943 10429 826 -5663 7646
105 7646 2432 1328 4094 -1266 2534 -265 -441 4465 -9732 -3829 6336 -7533 -5564 1530 -2259
120 -2259 -797 -3649 1176 1698 -8179 4203 4684 -9915 1419 7522 -403 -1502 -77 9932 3713
135 3713 -6372 7667 4733 -5275 3359 2155 -2769 -1974 -1610 4621 -3747 -5909 6549 -2650 -6396
150 -6396 3618 -1397 -4534 -3520 -167 3955 -6572 -2886 8351 -2461 -1749 6549 792 389 -30
165 -30 3487 5040 -4720 941 5232 -3185 2776 3127 -4198 819 1577 953 -2466 -6812 2568 400
181 400 -7552 1315 -976 -4372 1826 -309 134 -1505 -1765 5257 -1390 -2853 6230 -1148 -1720 4567
197 4567 1735 1424 -630 1840 5820 -3251 -930 5158 -3718 -2059 1858 -1838 -1681 -3475 680 1625
213 1625 -6525 773 2828 -5827 -366 1562 -1932 -1228 -1172 3688 676 -3878 5418 3911 -2785 3260
229 3260 2481 339 961 -308 3003 -1416 -2419 4481 -1759 -3698 2845 -807 -2182 -1085 -1339 876
245 876 -3979 -2183 3042 -4052 -1966 2703 -1401 142 494 634 1943 -1662 2041 3494 -3211 2249
261 2249 3719 -1563 1123 1263 1330 494 -1868 2634 -79 -4631 2127 -265 -4217 -92 -805 -764 -1721
278 -1721 -1875 2359 -2439 -2739 3777 -1219 -2415 2288 680 548 -346 815 3871 -1673 652 4727
294 4727 -1498 -327 2548 -150 355 -1254 512 1190 -3779 600 1533 -3789 -237 647 -1964 -1031
310 -1031 -1839 804 -398 -3465 2316 1047 -2661 2356 1224 -336 1183 710 2405 -196 -710 3767
326 3767 -599 -1314 3198 -391 -1037 695 -242 470 -2310 -725 1691 -3496 -1069 1453 -2739 -1207
342 -1207 175 -495 -109 -1650 1193 1546 -2988 1358 1727 -1551 778 1209 861 768 -594 2890 892
359 892 -2420 2869 754 -1957 711 -349 -488 -1112 -1295 1696 -2040 -2365 2157 -1700 -1769 839 -865
376 -865 -541 -1088 47 1556 -1850 413 2950 -1080 640 2289 102 900 288 1233 949 -1783 1498
393 1498 1491 -2531 564 740 -1450 -56 -858 52 -870 -2656 1238 -826 -2725 1359 -270 -1225 349
410 349 1 960 -632 -575 2499 -612 -758 2779 -162 -102 1384 641 1231 -782 559 2029 -2172 -406
428 -406 1387 -1930 -685 -76 -754 -377 -1835 310 353 -2650 601 858 -2201 396 333 50 157 -405
446 -405 2020 653 -901 2493 659 -944 2160 639 310 -42 -316 1559 -927 -1485 1440 -1399
462 -1399 -948 1123 -1192 -796 -854 -152 377 -2046 -185 1234 -2088 151 1597 -424 112 156 1513
479 1513 1206 -1036 1408 1379 -1452 1542 1208 -791 349 -411 600 104 -1480 1006 -946 -1509 1091
496 1091 -931 -1769 52 -311 117 -1220 -809 1666 -803 -840 1764 -465 -93 1056 275 1116 -347
513 -347 508 1861 -875 728 1627 -1031 289 558 -252 -92 -1017 -54 -372 -1791 641 40 -2254 -132
531 -132 100 -480 -323 -990 735 154 -1179 1579 161 -817 1780 341 456 823 -143 1358 -100 -68
549 -68 1978 -540 -629 814 -544 -113 -277 -532 -180 -1740 33 833 -2233 -621 728 -589 -234 -624
567 -624 220 775 -997 958 748 -1055 1134 896 -346 834 238 557 328 -294 1490 -152 -937 1190
585 1190 -488 -833 232 -650 -151 -815 -565 676 -1492 -1024 1171 -730 -561 69 -514 534 -149 114
603 114 831 -1065 1167 1462 -855 682 1090 -17 418 -221 1099 346 -1033 1051 220 -1466 130
620 130 -229 -978 -198 -783 266 -738 -1359 765 -344 -1086 483 -517 63 834 -67 868 -378 45
638 45 1872 -552 -8 1156 -118 341 131 -54 528 -833 -40 672 -1432 -236 188 -961 98 -404
656 -404 -552 252 -1134 734 125 -1424 844 162 -393 654 -40 223 498 -197 1343 226 -132 1518
674 1518 -43 -289 928 -27 58 -362 -526 740 -1072 -499 479 -939 -455 291 -846 -91 -685 26
692 26 338 -1224 170 770 -920 94 806 164 567 -26 884 593 -409 915 422 -700 673 162
710 162 -150 130 -564 345 -526 -1111 580 -749 -1227 550 -404 -556 -61 -361 604 -546 -204 1138 -554
729 -554 -252 922 -101 624 557 237 622 -110 576 934 -639 556 506 -869 21 -130 -366 -88 -659
748 -659 198 -333 -1452 526 -83 -776 466 -303 -201 -270 -346 758 -266 -234 1168 191 -30 1105 -110
767 -110 258 -46 191 723 -433 222 951 -745 -119 259 -547 -21 -378 -324 -109 -1130 299 180 -989
786 -989 -192 -25 -426 368 -86 364 155 -343 909 508 -468 772 387 24 546 -190 473 -11 -530 714
806 714 -102 -473 521 -493 -280 -132 -513 349 -270 -451 395 -986 -19 723 -431 149 87 -146 546 3
826 3 417 513 -523 660 726 -359 437 157 1 228 -354 176 -366 -858 367 -429 -656 287 -482 -251
846 -251 -140 -637 344 -704 -637 626 -431 -318 362 -131 166 144 -81 792 -124 87 729 -347 208 684
866 684 -73 173 -119 -322 241 -773 -7 124 -829 76 -196 -307 111 -326 -175 -41 -470 840 -242
885 -242 -536 533 324 -94 320 81 275 -157 -95 534 141 -155 497 -105 -191 231 -504 -10 -487 -209 437
906 437 -246 -292 268 -549 -114 60 -142 75 -507 181 483 -554 355 629 -321 624 117 192 542 -288 641
927 641 372 -212 805 178 -598 436 -84 -232 97 -396 -15 -408 -637 105 -289 -447 58 -601 26 123
947 123 101 551 -216 219 758 -197 324 404 -158 399 376 71 143 -557 611 523 -591 63 6 -484 -9 -478
969 -478 -178 59 -697 210 -52 -537 596 -115 -425 245 -317 218 57 26 555 43 204 592 -286 134
989 134 524 22 173 -145 -35 409 -352 -321 563 -696 -58 -139 -408 -95 -359 -60 -16 -494 99 -199 -439
1010 -439 -70 -48 -154 236 26 503 -53 -229 810 -31 -19 653 85 57 52 -72 384 -146 -324 68 -260
1031 -260 -187 -133 -642 -48 -22 -307 130 -201 5 327 -273 74 362 -291 149 208 260 621 -272 79 403 -315
1053 -315 496 235 -224 192 -77 196 -66 -295 208 -91 -332 406 -346 -364 162 -380 -101 52 -227 109
1073 109 -224 -212 710 -260 123 571 181 220 34 -16 423 -193 317 233 -211 -36 6 -20 103 -412 -147 55
1095 55 -517 91 -110 -504 190 -231 -536 -217 -449 132 -107 -286 460 202 -164 439 45 114 282 -49 372
1116 372 0 -183 599 -456 196 211 -209 177 -46 -173 140 -337 -76 91 -594 -73 17 -164 28 -123
1136 -123 -77 236 -148 330 449 -102 393 81 -310 294 -1 250 179 -215 358 74 -35 428 -403 -58 -29
1157 -29 -330 -190 -69 -222 320 -287 -108 362 -596 -148 206 -178 150 -26 -18 435 -185 271 565 -275 186
1178 186 361 -13 261 -112 118 292 -371 209 -177 -428 245 -342 -116 -44 -500 230 49 -168 217 -256
1198 -256 -214 353 -220 30 249 -248 261 165 26 697 -104 191 277 -108 210 113 57 319 25 38 129 -489
1220 -489 -71 75 -648 97 -281 -411 -6 -517 277 206 -484 356 -42 -216 144 13 -7 118 -87 346 9
1241 9 -296 143 -151 -167 327 -63 55 -98 -251 221 -542 -116 42 -431 -388 229 -278 -193 -67 -193 332 -419
1263 -419 232 358 -192 302 6 -60 306 77 65 365 -316 341 181 -61 267 -73 -199 184 13 147 204
1284 204 -345 20 -254 -375 83 -341 -235 124 -274 -111 -106 -359 708 -419 200 324 -377 174 77 -147
1304 -147 318 191 250 168 -184 110 165 -151 221 -293 -96 165 -265 46 -260 -307 -40 -113 -189 367 -192 -14
1326 -14 -119 -65 374 -235 -118 372 -18 155 264 -54 149 154 39 259 -91 -53 110 -321 194 103 -225 33
1348 33 -221 -232 84 -66 32 -164 -377 169 -186 -248 -4 50 183 -48 -177 127 345 -223 407 177 239 263
1370 263 -221 148 36 -312 309 -232 -378 166 -192 -101 91 -309 249 -221 -110 -5 -340 -244 -34 -392 27
1391 27 140 -195 227 -10 87 407 -192 101 193 -372 110 -55 86 71 -146 113 166 91 30 -83 -215 205
1413 205 -6 151 -295 57 322 -163 -358 377 -146 -211 461 -201 32 282 -189 445 118 55 333 -5 65
1434 65 303 164 -10 -230 -311 272 -339 -58 38 -409 49 344 -350 -99 -335 148 95 -184 57 -8 -1 312
1456 312 128 63 272 -87 153 27 60 192 69 -40 383 -251 -28 285 -54 -173 -240 -94 243 -570 -59
1477 -59 -562 -418 125 6 -212 165 -81 108 -189 -253 322 157 -125 114 215 103 149 -268 50 31 -273
1498 -273 388 -817 -444 613 772 149 31 -123 -265 -20 -450 204 -203 -290 255 -188 -77 61 -116 308
1518 308 195 -61 140 -71 -66 152 -130 109 131 25 -65 -35 15 459 -383 142 153 -8 286 0 -257 -192 -900
1541 -900 307 -143 -556 195 182 -123 -306 -140 57 66 218 574 410 48 233 -497 922 437 46 70 -883
1562 -883 -445 -68 14 189 -446 -315 -709 -334 172 -485 -528 17 314 -139 327 -30 -174 51 -52 9 72
1583 72 -182 172 -89 -209 145 184 127 192 -129 -149 87 -162 -170 168 -171 38 -56 -170 61 -255 -82 0 114
1606 114 -73 82 106 -21 -128 -140 162 -138 334 234 101 235 5 136 267 -227 46 145 132 186 -176 -192
1628 -192 -88 -213 -102 -210 -80 363 -217 -100 -21 -393 -114 219 -119 134 56 169 414 7 290 171 -160
1649 -160 245 288 -252 391 -122 196 51 -269 -143 364 -50 -142 198 -146 1 -131 273 273 -334 203 60
1670 60 -229 314 -53 -136 -157 -71 210 -290 77 97 7 98 231 -116 127 -28 -29 161 155 -17 323 -325 124 8
1694 8 -92 140 -272 -134 -117 -23 39 164 44 189 19 14 -87 0 82 -87 -188 169 122 -33 298 -125 -138 -40
1718 -40 -168 55 70 -151 116 -321 -343 -13 -390 -14 -66 33 -40 -45 37 -122 -240 276 1 62 170 -51 -85 103
1742 103 102 -32 127 -99 257 234 -165 323 234 143 245 -156 18 93 -230 -7 -154 -93 -156 -101 161 -184 -253
1765 -253 -133 -173 -601 70 -194 -7 13 20 -45 54 256 183 -65 -20 346 -41 156 285 -120 121 -71 -48 -10
1788 -10 -339 66 -123 -104 -122 -173 -22 122 -223 -131 -97 -110 178 193 -137 -82 17 101 147 16 310 -82 97 164
1812 164 199 -3 341 -239 201 -161 -85 369 -46 -109 -202 35 -305 13 4 -41 -148 -113 1 -137 191 3 80
1835 80 38 136 26 183 122 -227 247 -154 232 -107 -57 -87 8 -214 197 -241 -80 66 -430 -320 176 -251
1857 -251 166 -335 -211 126 5 -129 113 -184 -148 -76 396 154 -289 241 156 -174 165 8 132 380 -196
1878 -196 183 46 -184 30 -330 -110 48 -70 103 139 -40 136 -49 -109 86 41 158 148 -158 -37 -145
1899 -145 -63 134 220 154 264 -413 135 136 -146 -8 161 -29 313 -115 -176 132 -165 167 -177 -216 173 -40
1921 -40 59 -22 -28 270 -34 -164 139 17 98 61 43 239 370 250 -116 -273 -40 -71 -193 -108 270 -168 57
1944 57 126 -73 21 -138 -236 41 -121 -160 10 -177 -23 -217 -11 -18 43 -93 138 -239 -83 -23 -282 162 -89
1967 -89 -114 -3 3 -5 100 -113 172 -16 -30 -85 -74 2 -78 -80 -196 82 73 72 -209 -55 -281 4 108 -60 81 39
1993 39 -17 -315 -74 79 -123 46 29 -14 -88 92 88 -99 -29 -318 23 -30 -220 -225 -328 49 -69 -72 -304 -51
2017 -51 36 -43 285 -53 17 118 -80 63 -9 -9 176 110 363 -127 98 161 -126 182 145 -224 -105 -72 -66 -149 128
2042 128 -67 -13 -160 -217 247 25 3 -128 -174 -132 99 -91 -20 5 291 165 -193 143 127 -131 13 72 50
2065 50 157 -115 27 133 6 124 -295 -214 151 -14 -88 286 -10 74 -20 -207 36 -200 60 -76 -169 326
2087 326 107 183 57 -210 109 176 -177 86 217 -138 52 -32 61 241 -176 117 173 -35 -108 2 -114 -27
2109 -27 192 -103 -180 -18 -142 -101 29 0 -266 196 52 8 24 -49 96 174 23 -12 164 -55 -2 250 -57
2132 -57 175 266 -68 167 -214 -99 -112 -40 156 -132 -129 -21 -194 83 57 -185 174 -16 -12 8 237 35 82 -192
2156 -192 197 64 41 60 -30 218 -120 -95 333 -55 -87 -168 63 -86 -213 -137 79 -125 -29 23 -80 224 116
2179 116 127 171 156 -11 -36 -189 38 -106 144 -10 129 -162 3 27 -52 -109 -183 -111 -156 -129 -32 134 -21 242
2203 242 78 -162 -147 -55 11 68 -8 177 194 -5 62 106 -201 132 -83 -49 118 119 76 -29 -72 -46 -68 76 -100
2228 -100 -146 -51 -85 -294 -187 109 96 -11 -324 20 -43 -227 24 -250 139 139 -5 -35 -18 -118 -28 233 21
2251 21 124 -108 -131 -70 -51 -238 9 51 83 -43 -306 -18 105 -64 272 165 148 45 -287 133 -278 10
2273 10 62 52 -256 129 156 -92 79 -30 180 -86 -90 67 -269 -79 -43 93 97 -49 147 49 -21 -22 109 -58
2297 -58 28 -74 -183 -132 -47 147 -181 -263 -10 13 62 -152 29 44 0 97 -14 -205 37 151 -280 71 -85
2320 -85 -209 169 6 -85 -143 70 257 34 92 55 125 155 -166 -214 -173 -179 -24 159 40 97 -26 -166 64 -29
2344 -29 -108 426 314 -44 -104 -32 -97 125 23 -65 113 -72 239 -10 -11 -200 142 40 188 -262 -102 -129 195
2367 195 58 175 -44 -111 -199 18 193 22 104 -122 73 91 -189 48 11 -85 -38 -104 128 -44 341 -35 190
2390 190 40 297 -324 47 147 -13 54 219 -68 -1 89 160 24 -50 -227 2 182 37 13 137 140 149 139 -240
2414 -240 247 77 19 -88 -37 -120 -112 -24 -137 116 -62 55 266 -27 -34 173 186 51 138 -305 -173 156 269
2437 269 115 73 74 138 82 90 182 96 91 112 23 -262 79 -52 -53 -130 167 60 66 -61 -33 -62 35 -35 -87 -122 -127 128 -33
2466 -33 32 201 -143 31 -61 -4 217 -60 77 -126 -68 -257 9 29 -19 -23 -9 289 -148 -31 59 237 220 100
2490 100 -33 9 -85 87 27 -89 130 60 80 201 -20 -76 -314 183 83 148 -151 -50 54 -6 209 -224 199
2513 199 58 -5 116 153 -7 254 -80 -67 126 -13 66 -177 197 -168 -23 -33 -95 104 -54 -59 27 57 44 69
2537 69 243 -42 241 -36 94 26 -134 -151 28 -14 -208 29 -91 291 -162 44 214 -65 4 81 24 -123
2559 -123 16 109 188 125 265 -175 104 140 142 210 55 6 -34 -68 -78 -85 14 224 11 236 108 52 -92 -162 71
2584 71 -156 -59 -137 -12 -64 210 143 -102 65 168 40 -131 -25 -260 62 200 164 27 15 -59 67 130 -178
2607 -178 175 91 -30 227 -147 -75 35 -167 128 -368 129 2 167 101 -201 -13 141 193 -6 5 33 91
2629 91 -29 6 127 -36 -283 -82 -4 267 139 84 447 17 188 364 58 248 -226 -126 -78 -84 64 28 -276
2652 -276 73 166 14 159 46 -144 -5 -19 202 143 117 -129 -33 19 -279 107 -139 -164 -163 120 213 -66 -116 173
2676 173 -312 -3 28 -112 40 -182 -265 -253 -27 -169 -244 -137 68 -108 -97 139 11 123 -6 -14 -237 1
2698 1 44 59 59 -35 -77 -136 98 44 -79 -204 -13 -121 6 208 118 -348 -17 174 108 43 -158 -46 206 154 58
2723 58 -288 -13 184 -157 -66 267 -54 -48 231 94 -39 58 -6 56 62 6 -216 130 37 181 -9 155 -66 82
2747 82 152 129 31 93 -125 62 -69 -55 95 -5 49 -150 -201 -100 -33 -67 94 -74 -127 -75 -101 -39 -80 96 -39
2772 -39 -110 23 34 71 134 -50 23 -55 -212 73 11 -274 58 99 79 -105 -32 -300 -19 134 111 63 124 -138 230
2797 230 -206 37 -307 -157 143 -42 47 -42 -141 -19 20 -156 60 -51 -130 139 50 45 200 173 -71 122 233
2820 233 -144 211 -154 169 -10 -83 -149 -8 -27 -196 86 -1 -68 51 193 118 -140 42 -138 -29 -263 -159
2842 -159 60 -102 -145 -168 135 -80 148 -107 11 147 -97 15 -471 -192 19 -26 -269 -84 -149 146 -29
2863 -29 -164 7 -231 45 -38 -8 -94 -7 -161 48 -21 111 183 96 51 -235 25 -17 -189 13 -42 146 -67 -165
2887 -165 -58 -45 -61 73 -85 87 249 -40 101 58 18 104 63 153 99 -3 -87 62 -100 275 -20 10 -33 -5
2911 -5 83 14 -209 69 52 -67 -113 3 87 -106 -41 -101 5 11 -10 33 30 -20 57 184 -59 168 -167 59 -19 -41
2937 -41 147 198 -153 -28 202 79 109 -129 -65 131 148 -81 47 -166 -129 -10 -21 -54 46 -29 -42 -169 192
2960 192 131 -137 83 -147 192 95 57 -19 14 69 -165 -124 -159 167 52 -115 7 -69 147 -46 -164 -162 -5 -248
2984 -248 -14 -178 203 -60 58 284 73 -164 -11 51 -9 -116 -104 122 329 -40 90 224 28 198 -280
3005 -280 -185 158 168 166 -224 125 121 -35 25 -68 -290 202 270 -191 -45 -96 -234 117 -102 -84 -100 -292 197 -235
3029 -235 -55 28 248 9 193 -176 24 156 53 158 110 -281 186 337 13 38 150 -134 -18 163 18
3050 18 -155 143 25 -170 -304 190 -151 109 66 231 404 99 66 -130 -172 10 34 174 91 36 -22 -25 -29 -1
3074 -1 12 -122 46 145 62 -108 111 42 -99 45 16 -28 43 7 -14 -29 77 -109 355 -80 204 -106 -243 -19
3098 -19 62 -87 -67 -185 5 -72 51 178 23 139 155 -20 50 18 81 -97 -152 -67 16 147 -68 143 -74 -17
3122 -17 81 -50 18 269 91 82 -129 -4 -284 -198 -59 -162 -65 -235 36 20 78 -57 -61 -7 18 -41 53 -63 111
3147 111 228 -167 11 -193 191 -70 -177 150 -56 -127 9 -119 30 152 111 29 -31 40 162 277 30 -288
3169 -288 -169 -245 -160 116 171 5 -149 100 58 239 55 21 56 40 35 -175 202 27 -297 14 -94 -292 143
3192 143 -132 123 -188 29 -100 168 -365 -100 -61 240 -8 52 -47 -98 192 -9 37 -13 12 -113 94 3 -195
3215 -195 -71 37 -7 -122 161 -68 -119 159 27 45 -141 77 -30 115 -27 21 107 41 -46 72 48 111 1
3238 1 -37 -179 34 -13 -207 15 -116 71 -130 -14 68 93 78 35 107 229 11 -71 159 48 4 40 -16 61 227
3263 227 -160 16 157 165 4 152 -185 -27 -224 -284 -36 -13 -72 -99 163 98 -27 -145 113 25 123 -106 145
3286 145 151 279 103 32 303 41 -144 199 134 51 -65 -129 -43 74 179 -57 -122 51 -72 -178 -305 -117 82
3309 82 49 90 57 25 -97 -138 -65 101 -93 274 -149 -231 156 338 -73 203 -19 404 157 501 220 612 595
3332 595 -409 189 490 -116 -282 289 341 79 -213 -173 -283 201 -75 -95 -61 303 -501 48 335 55 0
3353 0 73 -11 509 0 -65 -274 -69 -209 336 30 -238 367 196 -93 -135 -39 118 246 -180 -182 -520 -23 -61
3376 -61 583 -36 -699 336 38 112 -34 611 282 -220 638 420 371 -143 400 -609 1366 -363 -400 -402 142
3397 142 162 -843 -555 -173 -368 -895 642 269 876 31 284 643 -556 278 64 724 637 -806 712
3416 712 -616 -269 -530 466 -426 -251 -172 -433 -222 -393 165 -148 176 889 309 584 12 145 173 327
3436 327 865 -752 108 -574 149 133 91 64 -218 -64 140 -198 -76 -411 -171 -342 -169 -105 37 -151 79
3457 79 -23 -174 -9 429 -529 -45 -116 -274 590 -166 434 309 -43 -61 -44 197 31 58 -162 38 -172 -300
3479 -300 54 -167 32 73 -75 194 78 16 55 77 92 -28 -35 -186 -62 -96 -65 51 -126 144 -34 -19 -126
3502 -126 -112 19 -51 108 -94 73 38 59 77 12 -81 30 244 49 -93 106 -77 35 19 -183 -206 -30 19
3525 19 163 56 -2 -123 52 25 93 -111 75 27 253 44 -97 -128 5 -73 -47 -91 -30 -206 71 -173 217
3548 217 259 155 1 -185 20 83 -159 -121 140 -400 -294 -80 -91 99 367 -89 8 74 -11 -202 148 61 -238
3571 -238 -114 74 -214 -139 -13 -81 11 104 -42 -80 -99 -115 -125 -4 6 -111 -261 -339 69 -193 43 -45 -182 147
3595 147 97 18 -125 -154 21 20 148 -101 123 -120 -105 15 157 -37 94 21 66 298 -218 175 -1 -124 58
3618 58 -122 2 50 -122 127 114 -195 13 -92 322 15 8 -132 10 -79 -191 78 43 168 -248 79 -76
3640 -76 172 -233 119 -9 72 41 234 111 -40 110 34 86 -117 88 -34 -96 94 279 125 23 -55 45
3662 45 -86 -41 -52 -100 -225 -72 -90 -19 152 -16 146 8 23 -43 234 175 -14 -50 -197 167 -110 44 -48 92
3686 92 -55 -62 51 -89 95 46 77 -211 372 138 29 -146 164 157 14 -54 -66 -109 -69 40 203 -108 -34 228
3710 228 31 -79 -119 -89 255 16 125 -41 63 79 -179 -145 -223 -137 -105 -230 -20 201 -100 -243 9 -150
3732 -150 -295 180 203 17 133 -69 -99 -40 29 30 255 -28 186 114 -33 144 -216 -52 -26 -22 248 27 170
3755 170 6 55 -125 -164 44 -107 -281 60 -230 -191 -169 113 180 29 138 -17 163 215 144 -15 197 -240
3777 -240 112 -86 61 153 91 86 210 -55 32 33 -158 60 100 -46 -42 -118 -141 -66 260 -554 -786 -154 10 -23 -269
3802 -269 -286 170 -241 -138 -26 -342 -286 -245 37 66 76 -539 427 -49 -271 11 196 -163 -73 16 236 224 60
3825 60 144 -164 43 23 21 93 65 78 -253 -127 -144 39 51 -120 -9 -184 -52 -71 66 -74 20 105 -266 -115
3849 -115 -82 -197 -80 52 168 -66 7 224 100 -67 -17 23 -46 115 191 -96 53 211 -150 214 250 -174
3871 -174 -46 10 35 1 -103 -226 103 56 -3 138 145 -91 33 68 -71 -63 58 -207 167 -254 -145 -182 -138 96
3895 96 15 25 417 -168 -96 160 159 230 -130 25 -121 60 -144 18 -261 -73 -41 -133 -147 114 203 -72 25 13
3919 13 -55 80 41 161 -29 -280 92 -264 -99 -78 -71 157 41 0 134 -63 -147 38 13 -192 139 56 80 26
3943 26 -81 -71 -86 -181 140 -177 111 -94 -138 -145 281 108 -28 -90 26 13 33 358 -278 23 -50 222 161 -178
3967 -178 -97 223 69 324 -19 -147 -247 38 24 -20 -5 -61 124 -112 161 168 169 57 298 28 130 -135 90
3990 90 -106 135 381 195 -171 177 -157 -113 -69 -17 -100 -51 -165 -169 60 76 -42 180 -141 -18 231 93 156
4013 156 -660 -364 74 70 447 78 -525 -498 -255 153 244 74 -844 196 233 238 -88 3 139 165 362 -285 387
4036 387 -61 359 -566 94 704 174 186 -125 344 -289 -30 -50 20 -460 -99 371 -273 -133 88 -390 -107
4057 -107 581 309 276 -383 291 -501 -616 140 23 -203 -96 423 -180 205 84 -13 -146 24 -66 -25 -57 -113
4079 -113 154 155 -255 -185 20 -207 15 58 -150 189 49 -94 30 41 -276 -44 246 125 18 167 -30 110
4101 110 102 -122 32 -45 -30 8 106 44 152 -99 40 -98 62 -33 27 139 35 -75 -148 163 -107 -67 18 -42
4125 -42 98 302 -29 -95 -254 -39 92 -83 -8 36 299 -260 -155 47 197 -119 79 139 -168 -50 -57 191
4147 191 67 73 61 177 -119 227 -11 -102 370 -1 40 41 -65 -216 -91 -72 149 -77 -183 -13 -17 -65 147 42
4171 42 -35 -65 6 214 11 184 274 111 179 123 -213 130 28 170 -362 34 -60 -143 19 115 -149 150 -173
4194 -173 -216 -42 10 60 -120 122 44 202 -71 51 38 153 -259 -47 -150 111 -26 -287 139 -31 -35 -22 20
4217 20 87 -75 -75 18 -22 -143 -36 -322 146 92 -55 20 -85 22 82 -40 2 298 -75 66 -27 174 -41 -133
4241 -133 60 4 148 3 -156 152 109 -13 122 -23 40 -107 20 108 -102 142 156 6 -136 -166 -83 146
4263 146 188 39 -128 -164 -83 152 77 -74 249 8 185 -142 -87 91 203 -70 218 215 216 -116 3 -16 -187
4286 -187 43 30 -8 2 51 131 -94 -19 76 23 -264 134 222 -214 126 88 -105 74 300 44 134 -36 -57 -14
4310 -14 99 -212 -29 -162 230 -57 73 175 127 59 -119 -25 153 77 33 -73 -116 165 126 -80 44 35 -23 11
4334 11 -68 -192 120 20 93 -296 -27 176 74 225 24 163 14 38 169 2 60 -5 66 -229 208 -205
4356 -205 -118 106 -156 179 12 145 -99 -244 267 191 12 5 -238 -135 20 -48 209 -46 -33 -322 -158 -367
4378 -367 -186 100 -67 218 -38 -27 -72 -56 27 -102 -18 3 -274 -272 -81 270 32 -13 158 -67 48 -220 -86
4401 -86 -33 148 -135 -180 -26 -159 -60 -124 -93 47 1 -22 -38 145 99 147 3 26 -52 -135 97 -51 216 -301 86
4426 86 -245 -243 80 210 -34 -12 -132 -251 12 25 192 193 -177 -180 -41 118 7 -52 -89 -120 -57 35 5 109 -65
4451 -65 128 326 143 -38 28 79 61 269 -19 162 -16 191 94 79 112 -60 13 52 27 66 -7 -4 68 255 -74
4476 -74 10 -79 200 -162 97 -302 68 -94 169 -76 113 -141 -27 -226 -77 209 123 235 167 56 93 133
4498 133 150 14 7 -151 -87 180 161 74 3 -135 -208 9 83 -71 79 -130 -19 -58 -218 -190 267 28 -221 -111
4522 -111 40 -166 -229 -9 53 -165 155 21 2 -60 -282 -15 17 20 -161 -29 64 -117 42 120 21 49 -1 -192
4546 -192 191 -293 136 -78 -212 27 -53 64 -61 -8 113 -179 -12 14 180 99 -165 6 -99 -177 0 192
4568 192 98 36 -52 170 138 73 205 -86 -111 -24 -75 68 7 -179 -8 -185 -107 75 43 -224 19 -57 -53 96 -211
4593 -211 106 1 -83 -32 -91 117 -69 -56 276 -366 -90 -177 -228 -146 229 -51 98 167 -50 -122 -105 162 18
4616 18 -61 -185 -60 168 107 -90 -181 260 -10 96 189 230 -224 91 -71 202 -70 46 252 190 40 -9 95
4639 95 100 -66 -222 -2 179 154 -31 -10 -226 -28 -39 40 -135 229 111 -117 -14 82 -7 -193 -129 -125 273 -180
4663 -180 -147 -136 -117 -165 156 -57 16 -50 -28 -65 -103 198 218 22 -56 217 -144 -108 -34 -278 9 -300 56 146 -33
4688 -33 93 43 17 -7 60 86 44 19 -180 129 -166 -213 52 223 214 95 -49 -13 -120 -64 31 98 -227 240 -186
4713 -186 -18 84 -3 123 234 142 91 -162 -41 78 -30 -128 -105 109 144 -33 107 25 -63 71 -61 99 236
4736 236 28 55 -90 9 51 221 -13 197 -643 29 141 -127 234 -33 207 -256 748 -133 -97 4 28
4757 28 169 -240 -189 76 74 186 127 112 -30 -48 89 -41 163 29 20 -54 -160 95 52 -50 83 -4 3 56 105
4782 105 -165 145 127 442 156 359 -46 290 -168 19 374 -391 0 -308 -49 -78 -253 -45 -147 -123 -159
4803 -159 -57 293 -15 76 -284 30 -100 192 -365 116 -84 -104 339 124 145 45 113 -384 -194 586 150
4824 150 -360 181 -2 123 -19 -70 -152 119 -36 -339 -102 -172 -134 137 136 -48 -5 -6 399 149 166 -27 42 -117
4848 -117 -7 85 14 30 -128 14 72 122 39 41 28 93 35 -149 119 69 -14 73 201 -115 -397 -3 -79 91 152
4873 152 26 -34 29 218 -68 63 44 109 -34 -57 -36 360 -24 -42 80 -102 -135 -104 -9 219 99 -94 21
4896 21 209 -87 63 63 103 -199 -179 -1 190 -5 -229 59 28 -90 -191 1 -27 48 297 24 50 25 71 192
4920 192 80 351 33 13 -37 -89 106 -46 -205 116 115 -18 -48 228 -14 -21 -88 -59 65 298 -97 124 332
4943 332 182 302 -86 94 78 22 8 -166 54 -18 70 -200 -199 35 -32 0 -122 -63 78 -119 -137 226 140 225
4967 225 138 11 226 -27 56 136 -20 -153 -157 -62 -30 -32 -81 23 107 135 -101 -18 35 -144 50 112 -208 42 -113
4992 -113 121 31 -175 15 43 269 -141 114 3 23 -135 27 183 48 93 -9 -17 -133 -57 47 -103 115
5014 115 -127 41 132 61 113 73 78 -22 47 -272 166 208 13 -108 109 151 -110 -168 154 142 -159 62 54 -56
5038 -56 -77 15 -89 -106 -159 -75 -241 -250 98 123 -105 39 222 9 32 28 169 -81 129 219 -110 91 -76 -268
5062 -268 -22 -212 -211 47 76 115 74 -63 42 -49 154 37 31 -109 -26 25 -181 -158 -280 -90 -80 -241 -215 -109
5086 -109 -13 115 19 -129 45 130 -190 -25 235 25 -79 -69 -11 -52 -117 315 129 139 234 220 2 -137 16
5109 16 -234 157 191 -48 -158 185 -2 -2 92 8 -16 -220 -116 -64 -200 -248 130 308 -195 155 -72 185 -255
5132 -255 130 -145 54 24 50 -53 172 -148 158 254 29 -4 91 61 110 -231 -277 -89 -58 51 3 -51 -71 -107
5156 -107 225 81 15 100 -173 -254 54 -109 43 -187 92 41 -31 -153 59 92 -176 109 51 -58 -118 329 -258
5179 -258 102 -108 -294 143 61 -36 -323 -68 -127 5 -210 -85 77 -26 -116 3 117 182 151 155 -189 -102 -93 105
5203 105 120 35 -259 -243 57 -36 -188 -59 293 -152 314 -2 -91 55 180 -176 -1 6 209 -47 -37 33 48
5226 48 337 -87 67 25 315 188 17 26 -215 -43 -4 -5 257 -93 118 51 119 -105 20 -25 -173 36 -112
5249 -112 76 -75 84 249 -58 -100 -59 -163 -176 -40 -126 -157 -166 -93 22 -121 -15 -235 197 106 56 35 9 -167
5273 -167 -101 156 14 -12 -8 -80 -1 65 49 124 -87 63 -102 191 -32 -71 -35 -36 34 196 74 104 142 51 375 -95
5299 -95 191 -132 46 -25 188 -176 29 16 -135 33 312 -17 46 52 -236 -87 6 182 -75 -262 147 106 -175
5322 -175 129 71 -115 -276 -134 50 345 -38 -159 72 85 7 113 -122 41 -62 218 -183 197 98 -167
5343 -167 -92 68 2 -283 75 -104 -96 8 129 139 -25 53 -36 194 5 -381 -194 -52 -114 131 55 -64 206
5366 206 -124 127 209 113 -111 -2 237 164 -125 -92 67 14 -168 9 -11 -33 -70 -16 27 116 64 175 164 239 -140
5391 -140 -33 108 137 -128 36 93 -51 167 -113 -248 -74 -10 -176 -192 43 -82 -60 -30 102 92 -3 -35 -58
5414 -58 -216 -135 21 -338 -26 330 16 -225 79 -186 -85 104 119 -131 -35 194 -99 61 190 -4 -113
5435 -113 285 -102 -116 141 -252 19 268 80 53 -269 -41 -109 71 -192 176 79 32 82 -41 44 66 149 -210
5458 -210 -34 -41 -18 -160 61 121 -17 130 -150 -47 177 188 -45 117 -22 191 -13 -60 -106 64 -74 37
5480 37 30 171 -42 -205 -161 -81 72 -244 152 46 -38 3 32 61 53 -131 266 83 -97 174 -71 -133 -318 200
5504 200 -247 -46 236 113 -73 104 -90 50 -148 -3 125 168 -41 58 143 -136 -65 12 -100 32 50 135
5526 135 -70 -262 179 -68 -7 -88 -76 288 21 20 14 -63 89 -100 26 -210 17 140 -35 -208 -9 76 -103
5549 -103 3 -61 -91 26 82 -3 30 64 -93 -47 -8 155 -114 -287 124 -15 253 -62 -17 27 35 45 79 185 -62
5574 -62 -188 -48 -150 293 -13 66 -229 -5 41 218 -113 -109 24 152 -95 -233 109 -101 -116 -56 -18 -8 58
5597 58 -48 139 -67 212 44 -96 194 2 -203 117 -46 -102 -14 58 -58 119 116 91 -155 -9 -10 72 -170
5620 -170 182 27 6 137 325 170 146 -37 -80 106 179 188 21 147 158 -283 -165 73 62 191 29 -51 -224
5643 -224 -74 -74 -118 -133 158 -24 59 -206 79 -61 57 -109 257 -296 65 -49 -38 -43 -170 101 -50 19 -120
5666 -120 84 124 102 -46 86 -176 -85 -90 -154 -333 -142 -14 77 1 89 -30 -56 29 -236 -217 158 72 -70 -98 -133
5691 -133 35 74 -152 -29 50 261 80 -327 96 106 -114 -39 90 94 -83 156 -78 -98 -63 130 -54 -15 33
5714 33 39 -163 125 -303 -59 202 -58 58 -161 -119 -43 267 -115 39 31 -35 44 -8 37 169 -174 139 -189 -133
5738 -133 -92 -169 75 -44 -237 200 -95 223 62 -61 -242 39 -63 -208 -138 38 -195 -226 -35 -146 60
5759 60 -182 -119 -124 201 103 11 33 -72 -12 88 -52 -7 -61 -33 -29 14 15 174 -74 226 4 -137 21 -161 64
5784 64 -47 -164 -43 135 193 23 342 99 9 -211 -192 31 -49 -25 258 130 174 1 11 -31 123 -265 20
5807 20 -51 -140 104 165 34 -18 -114 -168 132 -46 -138 350 -78 267 77 109 69 -38 -165 26 99 70 -239 106
5831 106 -9 89 -232 -211 73 -118 -39 -76 -81 91 -141 -59 48 -281 230 160 -171 283 35 -33 142 237 309 18
5855 18 182 -72 33 -149 -55 -99 195 204 24 2 135 25 10 -271 35 80 61 78 -34 -87 -41 144 -27 -142
5879 -142 -81 -25 255 -49 -176 -17 -130 213 -20 -50 95 74 87 -161 85 44 -151 29 -42 -66 -6 13 -10 -33
5903 -33 83 -27 -95 -95 8 13 -118 -124 276 133 195 105 51 40 89 92 62 -74 40 155 -91 50 -98 180 -29
5928 -29 -36 63 -5 -277 -120 127 41 -36 -371 31 -57 23 -49 40 157 109 115 257 -194 -23 124 33 175 -13 -45
5953 -45 -205 -31 108 81 21 -86 -80 45 -147 229 95 54 24 1 6 -134 -19 179 51 113 7 4 -15 -68 20
5978 20 172 30 -179 291 -109 139 -44 96 -110 -104 -34 -130 -195 -273 -128 -138 265 -83 200 -221 -78 39 -46
6001 -46 41 -55 -104 99 62 157 -91 -204 -200 235 -88 172 302 -109 75 -42 24 -58 -138 126 109 -3 195 -137
6025 -137 100 -391 66 240 -119 79 87 76 -78 -23 149 72 25 -112 83 158 -65 0 -281 -179 -73 38 -121
6048 -121 -142 15 18 95 -68 249 169 -23 -212 -14 -52 -226 167 57 -161 -87 145 -22 19 218 126 88 -6 -75
6072 -75 -74 -3 319 -57 249 30 -91 -105 233 67 266 8 153 -16 -78 -5 -141 21 -87 -4 -79 106 96
6095 96 -73 -33 9 -85 -46 195 -57 145 -80 -150 -137 210 158 -258 -117 108 173 8 90 64 241 -43 -18 -50
6119 -50 -125 -107 -53 -265 -62 -74 -181 73 170 -254 88 -40 -153 -85 205 63 6 -114 100 -155 103 159 19
6142 19 -50 28 199 -1 -83 184 -239 -333 -118 17 -328 -84 71 -89 -27 82 -67 -67 75 62 117 285 120
6165 120 -50 92 55 77 72 115 134 -53 0 141 74 -162 67 209 115 97 10 257 -36 56 -60 -31 -210 216
6189 216 13 82 -197 149 115 -120 5 -189 46 10 78 20 20 77 -70 -5 -14 85 -130 -78 -21 -140 159 -116 -132
6214 -132 216 7 4 -47 -34 156 129 52 -71 -99 -138 -201 82 122 -84 -77 100 13 80 -110 28 -117 103 73 -165
6239 -165 -60 -167 -161 149 81 74 152 -51 -244 113 52 80 108 28 138 87 1 -56 61 -157 188 415 67 94 110
6264 110 -3 -79 15 -82 -154 2 207 87 97 -120 -69 169 -117 -186 92 56 -174 84 141 -100 -457 19 101
6287 101 163 -180 192 30 113 115 -81 -41 -6 33 -13 -213 163 222 80 -109 -201 -134 -87 -36 -1 -166 13 43 38 162
6313 162 -69 28 -4 67 -208 7 -93 180 3 -27 126 -317 -254 -131 33 28 -23 214 -89 74 58 -114 89
6336 89 -22 -306 -122 -84 -2 -137 -75 -57 -224 -128 -63 147 107 203 -59 30 76 160 40 102 -46 -9 51 96 29 138
6362 138 -271 -85 106 12 -179 -286 -32 4 83 -186 -112 -16 103 82 -9 183 4 121 -33 -124 61 119 -29
6385 -29 131 146 103 2 151 125 343 -233 -75 -97 -40 -79 -417 -176 14 30 -6 170 260 272 -141 -430 -157 107
6409 107 -118 47 -137 214 273 13 7 186 363 -8 -182 58 118 -7 86 -30 -5 89 94 105 -49 -47 166 72
6433 72 280 182 -199 80 46 176 -11 -91 70 88 -59 57 -105 -90 19 -36 85 81 178 -95 -121 -160 -75 213
6457 213 -145 13 25 -93 175 21 84 -74 19 63 133 -67 -161 15 -155 -22 38 -87 5 -15 -128 -80 101
6480 101 12 -1 14 133 -40 78 -35 264 -133 205 106 -195 -160 -25 -8 -286 -79 -379 -168 -182 192 15
6502 15 138 165 227 -6 -39 -129 220 97 -261 176 -53 29 36 -50 -174 -188 -115 -105 -142 -63 36 -187 -16 3 50 94
6528 94 -16 233 -208 -1 68 -72 286 34 -1 239 149 -271 -346 51 96 -44 55 -111 109 42 -131 44 -69
6551 -69 148 148 114 261 155 -34 -175 5 54 -245 -186 -67 -309 310 -327 -116 -133 122 -141 -87 -115 68 56
6574 56 -200 -252 49 -140 -176 100 97 152 156 142 -86 15 41 -28 147 126 -2 -53 62 -28 131 2 85 74 -9 -34
6600 -34 276 -101 -155 13 27 -154 -58 -199 -236 140 -58 26 -192 -62 -91 56 324 -61 -108 58 173 184 35
6623 35 36 -3 238 171 37 26 186 -96 172 24 76 43 -122 23 -76 -51 93 -235 -67 -10 -38 -388 140 119
6647 119 -153 -143 42 -175 37 -122 -29 59 -95 -46 -105 -46 -55 335 29 56 5 238 76 -10 118 -205 -55 41
6671 41 -17 298 -122 4 -129 -133 -56 -262 -233 47 29 96 -74 117 115 -123 -58 30 -15 110 214 -85 106 148 94
6696 94 -346 -48 -133 214 143 -156 5 316 97 9 144 88 -27 -87 -286 149 -164 204 82 -15 17 191 -142
6719 -142 198 -301 75 -58 -106 143 104 31 4 -238 -37 -25 -124 -51 -19 -27 -167 97 59 6 -270 144 -184 193
6743 193 210 18 158 148 -205 -142 -331 -182 -26 94 0 83 -169 250 177 200 100 -232 129 -91 313 7
6765 7 -58 -145 -103 -90 131 -166 94 26 67 179 205 145 -79 -105 -80 -21 -168 -151 -105 -183 -100 -36 -139 260 29 75
6791 75 110 -148 68 -156 -92 -274 -310 73 20 -128 -127 -90 -195 70 -250 96 238 87 180 210 -43 201 26
6814 26 -70 -50 222 27 -127 1 134 -155 137 217 4 223 175 -96 -100 157 69 172 -466 -114 10 -140 -36
6837 -36 115 117 226 1 -9 -330 40 -60 172 2 -42 -12 -80 53 -10 -90 -191 2 248 175 26 53 80 93
6861 93 -144 -24 91 134 217 -154 276 -87 95 164 -173 8 65 75 -73 -135 -74 40 -221 217 -109 -293 5
6884 5 223 -182 -10 123 -122 44 82 109 41 42 92 102 -68 96 237 166 -154 -33 -205 -196 46 20 -26 219 -274
6909 -274 -8 299 -130 45 -188 50 97 142 63 60 102 -21 -113 124 -174 204 -150 69 -370 -160 -136 71 173
6932 173 -44 -47 107 26 180 -15 -89 -132 288 101 -125 44 -127 -13 35 36 97 0 44 -139 -219 -257 -53 -91 -92
6957 -92 13 -198 14 287 304 235 -5 185 217 -89 209 -123 181 18 14 45 -21 101 299 86 195 -56 -74
6980 -74 -126 48 266 60 33 273 151 224 -57 -64 -90 -89 -62 18 139 137 126 -57 0 55 -70 -4 -119 -17 91 -7
7006 -7 -71 31 -151 106 60 -30 21 24 -137 -280 -31 -164 -66 -53 -196 -14 -70 2 176 41 -245 -36 -21 111
7030 111 274 -227 -81 -71 -73 335 44 -32 56 280 177 252 -48 162 -118 -87 63 -7 -101 46 54 29 -70 -175
7054 -175 -68 25 -56 -42 -328 38 75 -62 -61 198 -12 52 -45 -114 -189 87 98 -153 2 48 -107 -164 -105 -189 -294
7079 -294 -248 -73 171 115 -177 -204 169 95 128 103 -208 303 -173 34 106 174 102 -128 -61 -120 -9 -111 -87 -113
7103 -113 105 149 20 123 -73 345 -58 -33 -20 50 66 -70 137 -166 50 83 12 213 -131 112 -226 -48
7125 -48 -50 135 -69 -63 124 28 -17 -123 6 77 -20 202 -15 -92 299 -93 124 161 239 41 5 63 175 -161 226
7150 226 103 -99 -184 -3 102 207 -31 112 12 107 -14 -13 43 40 117 116 -172 77 -37 133 44 -144 138 -32
7174 -32 52 154 114 -122 -24 -110 -50 -140 -29 -66 -231 96 -90 46 -157 59 -41 149 299 37 -243 78 150
7197 150 -167 230 96 62 30 26 -93 -55 60 45 -238 153 -89 4 -212 75 299 104 35 144 -49 172 -71
7220 -71 -55 80 50 -170 206 112 102 -121 12 101 -103 -75 271 202 423 134 -126 -327 249 90 36 74 -17 -37
7244 -37 -11 36 44 51 -68 -44 145 118 -39 -106 9 -156 201 -49 -19 39 -186 23 -128 268 -60 139 32 -72
7268 -72 -105 -49 21 6 -129 74 -280 -158 -132 119 -216 147 250 10 41 24 -26 -9 -11 23 188 -72 180 -60
7292 -60 112 -215 1 -76 -17 -83 -263 -137 246 32 23 -95 -17 22 -26 52 -156 -4 35 -217 184 -30 -35 -51 117
7317 117 -128 -113 -118 73 -274 -30 -58 232 496 -118 -31 134 -75 41 77 132 72 -126 196 63 -145 108 -8
7340 -8 -340 131 166 -87 -163 -91 8 60 -109 36 -94 58 18 -163 44 103 3 37 32 -44 23 -18 82 102 73 -110
7366 -110 -91 -15 24 200 9 19 106 128 152 -144 -44 125 9 86 188 -15 368 36 162 -4 -6 111 222
7389 222 -150 -33 30 -151 -94 -95 -123 40 -32 -136 64 -32 -39 -133 101 -34 242 -85 70 -321 -1 85 71 159
7413 159 181 23 39 53 201 181 -69 101 88 147 121 -91 -122 36 37 19 58 129 -36 290 -1 279 18 -3 -77
7438 -77 -77 -133 270 151 -107 -101 -61 -4 -62 134 -54 -57 0 145 192 140 -226 93 -300 95 26 18 59 173 162 148 34
7465 34 164 167 172 -60 192 -23 174 100 38 192 -117 140 179 -157 182 -38 -13 -99 33 149 184 -92 153 -214
7489 -214 184 143 -185 155 4 101 -20 105 318 76 27 135 72 -349 107 195 -79 -19 -20 -43 -139 -57 -146 132
7513 132 -66 175 284 -109 33 -77 71 120 -231 -50 63 174 209 130 235 -204 -128 122 -214 -183 102 48
7535 48 81 212 130 -44 -124 -19 -43 75 -8 107 55 -89 -55 -157 -74 -49 13 26 64 -298 -266 -116 -26 -60 -44 -109
7561 -109 -155 -153 82 180 -9 -20 232 140 -271 -43 92 -17 -46 -223 267 186 -114 -165 141 4 178 140 -29
7584 -29 140 108 -60 -297 -95 59 -261 -107 134 93 -45 124 -67 -231 -44 167 -1 76 4 -40 -76 -135 -32
7607 -32 234 61 11 225 67 56 85 70 -90 -107 40 138 52 0 -155 109 268 -133 160 -69 53 -26 32 185
7631 185 104 -164 -61 73 -162 45 -287 45 63 -213 -122 -114 -255 -107 -113 -22 13 -48 -171 -174 -35 127 53 -406
7655 -406 28 -74 22 -6 27 -54 -41 46 -20 15 -140 197 -19 193 -102 136 158 -132 -192 -115 -22 -68 -31 -102 188
7680 188 -187 83 3 66 129 -262 -104 12 -12 -28 -100 143 114 258 -176 154 -115 -51 -187 -8 70 -368 179
7703 179 162 -119 -385 -112 30 -49 -61 18 121 293 93 -65 53 -221 205 88 138 100 41 -62 11 28 298
7726 298 -297 117 135 -114 -44 54 50 53 -43 -254 -79 70 -117 136 -134 28 131 -87 42 -61 -240 -90 75
7749 75 22 26 -41 57 -73 -80 -79 267 86 18 70 103 155 -269 -31 69 70 -39 148 164 -245 -13 7 27 168 -74
7775 -74 -57 -34 -34 -236 -3 203 333 8 23 -273 171 -40 41 6 102 -19 92 141 185 47 -179 -14 -76 201
7799 201 188 -276 165 170 79 177 239 53 133 81 16 -41 -12 -105 86 -70 134 -77 -140 -173 -119 -169 -78 -25 108 160
7825 160 -54 -42 99 158 191 131 54 5 63 280 -36 61 -230 117 -2 -199 -68 86 181 21 -49 -65 -127 99
7849 99 123 -83 70 63 28 -14 -110 -289 -94 170 -44 18 98 55 -174 235 13 146 -54 -129 117 -116 -148 -86
7873 -86 -35 -61 -47 -268 145 298 122 61 127 -31 -45 10 62 -151 112 140 86 -185 -64 -243 55 -4 -22 0 156
7898 156 -70 142 -26 10 -94 -203 4 -115 -236 150 118 87 -97 -219 -226 -87 194 -244 56 -5 29 130
7920 130 -55 191 -168 179 11 103 34 148 217 198 26 -49 101 44 145 -109 -49 -112 -22 -120 29 -126 188
7943 188 127 47 -234 -38 243 312 111 11 -76 -206 92 -162 232 -162 96 250 60 23 -66 133 104 -51
7965 -51 99 160 169 93 211 -71 -74 72 -238 -121 -175 -183 -56 -27 -116 -86 141 -219 -113 -220 -176 -12 -52 226 22
7990 22 -44 163 94 -165 -183 285 -94 -70 -13 -122 -217 156 106 -165 34 -82 79 147 135 185 -75 8 -108 184
8014 184 -58 36 -121 65 114 25 128 -38 -20 -67 122 26 -26 -53 40 174 -8 75 44 -81 -213 -2 80 22
8038 22 82 -29 109 46 -152 235 153 278 -163 -65 -200 78 95 139 144 -107 51 67 161 103 154 -33 7 26 2
8063 2 131 88 -55 -117 -58 -17 71 70 -9 69 -122 70 37 125 -263 -139 -137 146 -150 26 -170 -128 -113 -9 21 203
8089 203 -19 95 105 -163 -54 -55 -125 87 -25 -82 38 -69 185 -28 -52 36 -93 112 -4 -168 -151 36 -49
8112 -49 -140 151 -177 -123 123 -259 22 262 -125 -128 -68 137 -149 -104 -134 54 -49 -48 -82 101 0 2 191 -76
8136 -76 146 97 -25 132 46 -112 8 -226 127 -96 21 100 -95 28 -179 -235 -91 40 -90 -99 -201 -15
8158 -15 -37 34 82 -163 -362 196 -248 -27 -211 392 266 -89 -123 167 -170 -179 30 32 -51 150 20 -147 253
8181 253 250 -268 -256 -70 15 -183 168 216 353 -87
8191h7
$$ Imaginary data points
##PAGE= N=2
##DATA TABLE= (X++(I..I)), XYDATA
0 0 0 0 0 0 0 0 0 0 0 0 0 0 0 0 0 0 0 0 0 0 0 0 0 -8 8 -8 8 -8 8 -8 11 -16 16 -16 19 -24 24 -28 32 -35 40 -43 48 -52
44 -52 59 -65 71 -78 86 -96 106 -116 128 -142 157 -173 195 -214 242 -273 310 -357 417 -495 605
65 605 -770 1039 -1562 2938 -14407 -26897 11889 8244 -5169 -3301 2713 9410 -2990 4176
79 4176 16569 -6415 -3021 12902 -582 -2390 253 -823 2247 -7291 3476 5640 -12433 -1250
93 -1250 7302 -7512 -3589 -2904 -2232 -1582 -7813 3826 2401 -8903 5366 6107 -2045 4962 274
108 274 2268 4008 -288 5454 -2555 -3284 11186 -613 -5197 6332 738 -1144 -1586 -1493 1530 -7733
124 -7733 -2247 4760 -11149 -3952 7283 -3839 -4978 -749 4778 2881 -8771 2495 7451 -6857
138 -6857 1845 5719 -1783 1181 2763 5717 1886 -4224 7140 3196 -7089 4240 1892 -5713
152 -5713 -1632 -83 2332 -4338 -6174 6331 -1664 -7430 3806 -1119 -4771 -776 122 2865 -4143
167 -4143 -2161 7217 -822 784 6082 -2305 1571 5354 1205 146 -2998 3407 4836 -5609 956
182 956 3452 -4199 881 816 -2550 -1608 -3614 1079 -1553 -6612 2792 -599 -4968 3191 1127 -1265
198 -1265 -39 259 4905 -1082 -2529 6629 -363 -2005 5240 1050 20 615 1808 3548 -3786 -1113
214 -1113 4795 -4924 -2510 2838 -2919 -2660 -1448 596 279 -5677 1331 3347 -5507 -433 2521 -2154
230 -2154 154 169 1806 1447 -1668 5164 2217 -2933 4166 2337 -1634 1298 69 1689 -1193 -2694
246 -2694 3286 -1984 -4251 2894 -1703 -2741 -42 -1889 -369 -2578 -1167 2423 -3730 -464 4300
261 4300 -2205 -451 2718 998 1464 -663 2023 2598 -2843 2381 3660 -2856 1048 2174 -553 98
277 98 -1308 1222 -698 -4195 2144 -974 -4750 1059 60 -1525 -1116 -1063 2271 -1311 -2025 3950 -928
294 -928 -1908 3046 406 51 728 890 3010 -1053 623 4177 -1987 -585 2822 -1408 -952 -566 -97
311 -97 576 -3361 520 1459 -4143 11 993 -2652 -191 -445 62 -251 -1995 2361 837 -2151 3211
328 3211 1480 -1146 1910 1170 1415 7 -319 3230 -869 -1675 2905 -940 -1835 1157 -637 -544 -1640
345 -1640 -1102 1383 -3453 -1338 1966 -2791 -1096 1106 -699 187 -956 1248 1660 -2296 1685 2477
361 2477 -1987 1501 1852 59 974 -42 2016 330 -2196 2370 186 -2852 1200 -321 -1529 -661
377 -661 -1139 641 -1838 -2028 2090 -1864 -2076 1593 -738 -728 649 19 1286 -1230 622 3194 -1378
394 -1378 501 2649 -692 398 686 305 733 -1676 935 961 -2652 177 744 -2167 -72 -469 -360
411 -360 -869 -1626 977 -699 -2577 1747 77 -1282 1174 415 713 95 -51 2763 -462 -561 3005
428 3005 -457 -273 1689 -117 254 -267 250 943 -2057 -536 1159 -2573 -572 328 -1249 -631 -1141
445 -1141 217 436 -2239 932 856 -2136 1127 1073 -400 317 158 1895 680 -963 2295 713 -930
462 -930 1687 11 -1139 239 -73 374 -1223 -1051 1535 -1976 -1744 1161 -1463 -1162 -144 -704 461
479 461 -1422 -181 1053 -1632 535 1840 -814 602 983 681 1223 -589 872 1336 -1052 1378
495 1378 661 -1839 838 374 -179 -345 -1359 638 -589 -2119 815 -661 -1747 369 -337 -104 -432
512 -432 -295 1281 -449 -233 2101 -691 -204 1908 273 980 239 636 1266 -834 599 1521 -1736
529 -1736 -150 1084 -822 -510 -898 -125 -50 -1587 177 199 -1826 509 48 -868 35 -564 700 175
547 175 -717 1862 49 -669 1939 375 -189 1046 262 779 -321 -85 1356 -1238 -983 1412 -919
564 -919 -889 -85 -430 142 -1228 -496 606 -1824 -119 669 -1384 -22 323 -201 624 -341 937 803
582 803 -899 1539 685 -892 978 486 -117 370 -151 831 -311 -1080 1391 24 -1247 38 -693
599 -693 -412 -275 -829 272 -939 -333 1212 -1087 -561 951 -312 183 70 314 946 -742 936 1593
617 1593 -891 464 946 -403 225 220 336 -3 -1034 799 136 -1766 210 -426 -660 184 -804 -246
635 -246 -158 -700 932 -245 -991 1380 35 16 707 49 1022 -72 151 1517 -376 148 1269 -549
653 -549 -184 215 -252 -149 -783 -385 -327 -1670 -452 181 -1360 -108 63 -809 92 -682 534 105 -981
672 -981 1150 695 -530 668 383 95 442 223 1097 -7 -329 1489 -13 -408 990 -311 -190 -247
690 -247 -588 392 -1003 -795 605 -1190 -622 693 -862 -324 79 106 496 -979 368 1052 -721 735
708 735 882 -324 563 333 383 473 -614 758 291 -893 609 105 -747 147 -616 -199 -386 -1028 215
727 215 -565 -945 669 -381 -535 550 -291 375 54 17 926 -317 482 1364 -478 122 735 -3 548
746 548 -120 564 689 -651 288 424 -912 -58 302 -905 -206 -474 133 -306 -984 515 -62 -1108 344
765 344 -46 -305 476 26 675 -109 -92 1112 304 12 907 -90 243 341 -1 413 -486 -264 618 -843
785 -843 -188 348 -711 -295 -162 -666 -56 -926 -26 372 -991 385 603 -577 493 116 320 437 -376
804 -376 708 201 -735 650 505 -714 647 -98 54 116 -484 491 -289 -689 491 -475 -561 -93 -594
823 -594 112 -315 -690 537 -545 -129 750 -493 120 672 -64 363 293 535 739 -453 282 598 -487
842 -487 540 366 -319 150 -369 85 39 -709 444 37 -580 243 -243 -502 37 -586 -1 53 -367 750
862 750 -312 -255 665 -192 80 459 -216 557 -237 368 820 -755 119 425 -310 281 -118 -384 -76 -546
882 -546 -238 -18 -948 134 234 -719 256 26 -196 136 -734 502 241 -741 813 329 -217 454 47
901 47 104 173 -142 740 -107 -388 705 -129 -150 377 -422 -228 -163 -464 79 -793 -403 299 -771 -86 465
922 465 -271 394 -42 75 698 -211 608 359 -287 503 366 -202 504 16 258 280 -343 487 103 -606 304
943 304 -153 -527 54 -433 -54 -138 -398 334 -802 -418 388 -360 246 259 -93 336 -309 4 453 -422 90
964 90 581 -206 163 191 194 317 -402 140 314 -655 37 -247 -698 148 -182 72 -92 -542 216 35 -616 523
986 523 -443 -339 379 -124 129 339 -141 525 128 165 689 171 -116 690 -330 320 -107 65 399 -579
1006 -579 248 -10 -570 -221 -56 -574 74 -310 71 123 -435 236 335 -537 609 369 -406 273 9 204
1026 204 194 -64 561 167 -469 709 -414 -379 176 -15 193 58 -349 174 -745 -122 264 -398 -329 71
1046 71 -120 225 -345 -371 277 -464 105 287 -446 275 253 156 277 -120 136 215 -200 358 -83 -433 569
1067 569 -137 170 -101 -279 152 -279 -454 271 -281 -544 145 -97 -138 438 -96 499 -149 -42 635 -236
1087 -236 74 622 21 340 6 -138 486 -478 -29 132 -440 121 175 -577 -77 -148 -195 -33 -465 -88 -138
1108 -138 -646 357 92 -372 276 -144 -41 123 -362 522 -84 -157 522 -214 6 158 82 34 -44 -38 384 31
1130 31 -375 220 -486 -55 -147 -334 -47 -174 -56 67 -241 -143 397 -450 291 -151 -71 166 32 387 654
1151 654 -190 197 0 -246 432 163 161 -13 -139 113 37 -260 333 -267 -483 180 -496 -194 -20 -367 205
1172 205 -522 -386 275 -322 -18 106 -23 211 -250 -20 400 -222 -76 723 -357 287 363 -302 443 388
1192 388 -205 -106 -562 -49 212 -438 9 42 -408 137 -402 -178 -50 -462 272 145 -577 381 16 102 374
1213 374 -78 488 4 107 311 95 148 610 -349 216 103 -12 159 -127 -132 282 -500 -89 -8 -380 -79
1234 -79 203 -161 -100 -71 212 -15 -238 164 -46 -51 211 20 196 377 -7 269 128 53 499 -224 -460 539
1256 539 -99 119 -43 -345 -35 -243 57 166 -124 -362 13 -525 -288 22 -177 416 -215 -4 215 -391
1276 -391 263 320 172 341 87 -127 110 -134 268 -28 -332 404 -173 -131 35 -379 -219 -72 -287 199 13
1297 13 -570 320 -487 -202 -113 -311 33 398 54 509 -320 -31 457 -61 64 143 -143 227 75 -90 567
1318 567 -186 92 150 -551 222 43 -131 -17 -325 -109 -28 -310 301 11 -172 360 -178 -105 141 -128 -20
1339 -20 35 -79 559 67 -89 312 -194 -157 25 -175 89 -122 -216 142 -517 -37 346 -408 25 172 -136
1360 -136 117 -235 -150 361 -203 235 -3 8 -37 -62 123 179 -98 361 266 -23 356 190 -42 75 2 83 32
1383 32 8 239 -187 -457 116 -170 -289 -55 -196 -43 -53 -204 64 -105 18 261 -187 325 372 28 384
1404 384 223 -128 150 -173 -112 -52 -17 452 17 13 132 -103 202 95 -353 107 -156 -284 31 -35 75 119
1426 119 -301 126 -267 -329 -64 -138 70 679 -142 35 291 -80 136 279 106 103 -73 65 374 -326 132
1447 132 72 5 36 -391 -162 -150 -294 20 -201 -390 110 -214 -191 123 -124 -120 222 -164 250 -375 48 77 -174
1470 -174 153 -93 285 -17 119 -198 319 76 -113 291 -38 -141 -81 -96 7 1 -146 250 -322 74 100 -430
1492 -430 310 8 12 317 -201 -96 225 290 54 -77 35 387 89 17 -109 -339 122 -95 -213 194 -341
1513 -341 -297 -26 -104 -120 -229 -525 222 -185 177 179 -160 71 100 67 389 -40 -37 349 -90 -50 283 -127 181
1536 181 143 -188 -303 60 105 -588 -390 324 -459 -905 -63 -122 -441 291 -149 712 -516 710 233 -170
1556 -170 -795 228 718 -59 496 -91 822 -523 482 -466 546 164 112 600 -76 54 14 78 -464 -68
1576 -68 76 -245 -163 -393 -17 42 -38 -66 121 -167 10 -33 -209 62 13 -190 23 76 243 154 -203 96 101 -74
1600 -74 92 -190 -82 132 51 -57 92 -250 70 -215 167 189 -267 183 -150 -316 -63 128 -123 -79 -314
1621 -314 194 -165 174 56 143 -107 214 122 48 40 -149 256 227 71 -114 -149 -307 -15 -320 -132 -109 -312 146
1644 146 -74 -129 -43 -70 -59 -62 34 356 166 -114 -148 -1 -226 183 26 49 134 -64 332 -12 -83 -37 -315 23
1668 23 109 -174 38 -160 50 -42 -307 57 166 -58 20 94 -17 273 -21 -38 17 84 52 49 -163 102 162 139
1692 139 126 -12 202 109 8 108 -85 122 235 -187 23 92 -130 75 -340 -252 62 -184 -60 -107 -280 -23
1714 -23 -51 -92 2 -80 170 145 106 68 195 -98 128 -6 -68 107 -235 73 6 82 7 9 -167 251 -186 33 53
1739 53 -109 192 70 66 9 -223 105 42 113 140 -16 -103 122 -107 -84 155 106 43 104 205 42 54 34 194 -187
1764 -187 155 -167 -184 -134 -83 -108 -25 -16 -44 127 -64 228 -59 -37 74 -165 -107 182 6 162 181 -45 164 -274
1788 -274 -46 63 14 130 211 -404 145 95 41 327 -98 -157 -15 -56 137 -125 66 138 -24 -252 87 -204
1810 -204 19 151 -168 103 288 94 194 9 31 -9 62 60 62 -85 135 92 -129 -129 -47 -74 -228 249 -95 -71
1834 -71 -185 -44 -163 23 62 -240 -87 -328 -107 239 -91 351 92 -72 228 -26 267 178 -237 11 60
1855 60 -162 -135 -28 -72 289 -114 -135 45 -129 -135 -76 -232 110 -293 1 194 114 69 -46 64 138 -65 -13 383
1879 383 93 95 -46 119 228 85 -114 150 192 -154 16 -114 58 -196 -136 19 -19 -3 -48 -187 -35 106
1901 106 43 -220 -177 124 42 -67 104 -55 -115 204 86 221 173 54 223 88 257 -288 -9 -28 129 -105
1923 -105 -120 105 -143 73 -18 -95 60 -81 -270 -73 -57 102 102 -206 -178 111 80 90 -48 423 332 14 -8 52
1947 52 68 -62 -156 -74 92 34 -26 -26 -169 150 -160 -7 -18 -129 -49 63 -337 -90 11 12 168 55 -42 172
1971 172 -130 126 151 -47 63 97 36 154 -37 61 49 -138 28 24 -121 -109 -286 -78 -124 -122 -25 63 64 -153 61
1996 61 140 -256 137 141 -65 167 45 -3 -211 114 -148 -204 347 81 15 -80 -43 54 -162 239 194 -218 48 -224
2020 -224 135 -35 -514 74 -52 89 84 2 -54 130 -128 9 269 -144 130 127 -182 120 194 9 60 -118 146
2043 146 -187 259 110 272 -288 88 31 -91 -242 8 -20 -198 268 -241 88 -143 -167 31 210 37 -323
2064 -323 49 -121 11 24 -10 256 194 -197 -168 89 -111 -142 -278 -93 -28 -60 1 -9 52 -93 -184 26 -64 -89
2088 -89 -234 166 -113 70 36 -76 109 -112 -80 165 46 127 -102 158 299 270 30 140 -71 277 -35 30
2110 30 21 -272 -105 132 -177 40 -49 -297 -124 -186 -59 64 -6 20 -233 11 167 191 -117 30 -146 -41 108
2133 108 -102 217 -211 154 41 22 -112 -116 74 -48 -325 -45 -24 116 -8 32 -109 96 2 -176 134 -64
2155 -64 69 -49 -89 150 -64 19 126 15 58 -59 -110 -30 16 -187 2 41 -190 76 -195 -25 285 -34 -63
2178 -63 -105 -191 -41 -45 -178 -26 -285 39 93 -70 112 365 149 103 -352 14 133 -196 387 55 -280 -56
2200 -56 14 -183 61 -216 -153 -141 -113 217 79 40 196 -311 -60 -77 -277 137 -270 -88 -12 94 78 202 -231
2223 -231 141 26 57 47 -170 -103 -97 -107 28 74 -30 170 -72 54 25 -210 -105 79 17 7 34 -93 173 -105
2247 -105 -50 88 163 75 248 118 37 168 -36 -42 -45 10 -50 4 172 -88 77 -153 53 272 105 -46 254 -145
2271 -145 52 27 -66 -49 188 -110 292 217 -238 26 206 -88 116 168 290 19 -141 -201 -75 138 -101 -120
2293 -120 19 -105 126 97 -171 166 22 -141 316 -92 -153 18 -152 -194 -234 -226 83 218 130 25 -42 55 -49
2316 -49 -258 -17 43 97 -147 36 -133 -36 149 78 117 -61 -13 -6 -261 -235 131 50 -95 -259 65 -184 -56 -484
2340 -484 42 13 79 133 98 -201 -30 -87 22 188 -49 -32 -83 225 -46 130 153 -116 190 -9 -52 33 -238
2363 -238 6 87 -167 -3 -112 -187 -139 93 -30 -107 -57 -37 35 -15 3 -45 5 127 -32 333 -109 305 237 68
2387 68 337 -2 -154 -173 -40 -69 28 -2 139 129 -170 160 13 -219 -17 -185 -485 208 -126 -81 103 -123
2409 -123 -67 -101 32 -118 365 10 55 -216 -145 37 -73 236 43 -49 178 -117 -7 -37 206 -73 -26 -85 -8
2432 -8 16 -197 51 13 -123 13 -99 -104 276 -211 165 28 115 176 -64 49 19 18 80 -80 -12 -41 -96 35 58
2457 58 -161 55 271 -110 270 -127 107 -27 -54 223 -221 -47 -75 -204 286 193 -277 -9 293 93 203
2478 203 215 174 -185 204 158 125 -115 104 -49 52 135 -187 50 -153 -69 302 96 9 -43 99 -74 145 -150
2501 -150 64 -30 -44 227 -174 248 99 27 35 -32 206 112 -161 154 246 -4 -79 13 229 36 -43 -12 -49 -159
2525 -159 -16 34 -397 41 -213 -45 2 83 -68 7 -313 165 110 -40 278 -132 31 190 -45 138 75 119
2547 119 226 5 -83 222 -106 74 50 15 -177 -238 48 -23 19 18 14 201 -146 -65 -109 -101 -115 -95 -42 190 55 140
2573 140 -106 -206 -20 70 -82 220 92 136 67 306 -175 33 28 -159 147 -255 -277 24 -127 -82 -91 -52 16 256
2597 256 -172 -204 -95 47 237 -63 87 9 26 -150 -16 132 34 -98 -6 -72 49 137 -103 -16 155 -41 -171
2620 -171 -243 -145 -173 -68 12 -118 192 -141 -395 38 -94 -43 -112 -135 201 49 20 139 177 149 100 108 204 122 115 174
2646 174 177 127 -21 117 150 -43 51 -144 382 46 -83 -31 1 199 171 2 92 162 -109 52 -87 -150 -11 250
2670 250 94 -131 -252 -49 18 144 189 33 -76 181 189 57 217 28 -26 -70 -10 -26 2 -54 -6 351 89 -45
2694 -45 127 61 62 -50 8 133 0 37 -37 80 32 -22 53 -44 -21 233 -68 342 78 -41 -230 -108 -119 198
2718 198 -15 -125 -51 5 -117 -112 -25 -14 47 -15 259 -76 -60 -110 57 53 -28 140 -18 -37 -143 58 -44 -8 27
2743 27 13 68 0 -79 -72 65 -14 42 54 237 -16 178 -97 174 -19 23 -152 -8 127 170 219 57 165 -66
2767 -66 -196 -197 -125 -13 155 -192 135 57 221 53 -212 -27 -9 -97 381 89 26 148 -19 -242 102 246 -45
2790 -45 110 -108 -47 64 -105 87 177 -195 -164 -34 40 65 27 24 -18 65 99 -110 253 230 -46 -93 -23 3 178
2815 178 110 -91 -87 78 -106 90 94 -432 217 67 -42 -8 -20 148 -78 -47 122 -80 3 158 231 107 -283
2838 -283 -30 159 -142 -5 -150 -85 -42 -78 96 67 215 -151 -180 -168 -178 -69 119 242 172 -216 351 200 143
2861 143 131 31 35 78 -6 176 123 -203 -61 30 -109 -33 50 26 166 -76 110 6 123 -220 -34 -380 -56
2884 -56 -77 71 107 -115 39 -13 -161 416 -28 -15 -137 242 -16 282 2 -282 8 75 144 9 -17 -45 89
2907 89 -279 -2 -69 159 11 -26 -31 76 -168 -233 -348 -65 88 -154 39 -51 -38 -136 -79 45 251 -40 52 -43
2931 -43 -118 -118 196 3 -67 88 9 -60 44 28 -219 233 116 -27 -23 142 28 -181 0 -117 155 110 -137 139
2955 139 194 -181 -43 -263 266 15 -50 -54 242 -34 63 165 161 -214 223 102 38 313 -39 113 12 -69 -254
2978 -254 2 -206 -9 31 -13 59 -129 93 -148 133 -32 -239 -69 -72 -272 -139 34 20 -64 69 66 -21 -25 -292
3002 -292 19 142 -40 80 -75 395 46 -211 -32 -121 49 137 132 -57 -66 -20 -220 46 105 26 -195 -240 61
3025 61 -267 222 145 165 245 203 72 214 -235 30 21 -41 -124 286 -88 -72 -45 37 295 174 -36 -100 45 35 272
3050 272 32 91 149 84 135 128 -121 -68 -13 113 -53 -119 -356 56 -174 -63 4 67 0 -195 32 33 -116 -138 2
3075 2 56 -44 31 217 -62 100 258 -221 -105 9 302 33 -34 18 -51 -13 227 4 -45 16 -128 120 -213
3098 -213 -57 -266 8 202 71 -58 63 -94 -103 -58 55 56 112 -165 -115 -21 90 -70 6 -155 -54 54 -17
3121 -17 62 44 -89 -82 300 85 72 -118 221 -178 17 198 62 18 76 107 -93 102 -61 -146 53 -162 26
3144 26 -73 25 -30 -21 -6 -43 158 -90 -158 89 -67 58 214 -24 160 132 -36 -71 69 301 -72 91 -108 -127
3168 -127 -184 290 -29 132 -3 -23 74 44 145 -106 214 -123 -9 -157 65 74 -118 -6 156 -178 75 -244
3190 -244 307 -34 57 241 121 117 -38 7 52 65 -24 364 -104 6 21 286 -45 89 65 42 36 4 -9 8 119
3215 119 -200 61 -151 -225 -111 -167 -8 141 283 133 -38 23 -58 -68 147 5 -153 -169 -141 89 22 -10 57
3238 57 42 -154 -5 -372 -57 -70 83 84 -289 5 -364 75 -197 -172 169 229 129 108 61 56 -169 206 -67 126
3262 126 197 -8 31 61 -173 242 -43 -29 -160 -175 -213 91 135 -124 18 116 -166 63 114 18 115 -41 -150 8
3286 8 42 171 -143 -12 -89 -24 -89 32 151 212 -78 -103 -161 -153 -162 -13 -186 54 112 90 13 101 -88 -217 -91 -43
3312 -43 76 -24 147 -26 -150 77 55 -28 -102 99 82 -361 201 289 -190 367 -246 366 -504 -43 97 827
3334 827 -191 -93 -314 -181 -397 102 90 -37 499 -218 -70 -277 -480 105 384 158 316 -221 388 -477
3354 -477 -466 81 97 -370 50 -49 -39 132 -262 -61 356 187 416 79 -417 493 323 -55 -200 23 -38 -609
3376 -609 526 -117 -790 49 -372 -28 980 -49 -443 -83 159 -506 230 731 338 99 199 -71 -4
3395 -4 -4 -337 -622 619 120 -90 -131 -238 290 -312 -323 261 -7 -287 -68 -28 -302 -118 288 441 -352 -287
3417 -287 470 -251 -693 -173 -482 -618 -519 416 -318 -12 -4 -305 1059 -893 79 115 -565 -145 1012 -650
3437 -650 189 -276 256 -281 -444 145 -40 -68 -10 -143 -190 177 -86 -27 -169 186 -30 373 48 520 -265
3458 -265 -8 -414 -358 -326 526 -232 73 294 19 -470 89 -823 -181 781 -299 500 293 83 -91 109
3478 109 -301 32 -331 79 -149 -2 72 284 141 -165 279 89 98 172 195 -20 -249 -280 195 175 -38 91
3500 91 -73 29 -205 100 -68 -44 39 42 -109 -200 -93 -112 -10 -5 -52 365 -216 -246 -151 -135 -77 -3 94 -76 228
3525 228 -114 132 279 347 -5 58 -333 -264 94 -42 -102 -51 -176 52 8 -51 166 3 135 -174 -128 203 -125
3548 -125 295 291 113 24 92 -297 -60 -98 -175 -98 -169 122 59 -7 94 -113 -158 -16 -49 -206 -44 181 219 178 127
3573 127 -141 53 -51 -17 -97 -141 -38 -99 119 -5 -97 -88 11 19 -82 133 205 107 128 74 -17 43 -53 166 -239 162
3599 162 -153 15 36 -57 -141 -5 118 -2 10 71 -142 244 179 -201 78 -168 144 -106 -62 -56 33 -74 -268
3622 -268 31 -102 -20 30 117 -129 106 -135 121 139 74 27 -72 -149 -90 -60 45 -57 23 199 111 -108 106 75
3646 75 -99 -146 -207 -89 159 9 54 37 67 46 9 87 29 113 -33 295 -6 -48 12 113 -145 -72 -63 76 -41
3671 -41 -64 -20 -11 90 80 105 -20 -223 -76 -29 57 -59 90 58 181 -42 46 -127 27 67 118 246 -48 -283
3695 -283 31 -128 -124 -33 -156 60 81 66 -201 -87 -68 -42 -6 268 -183 -99 25 -24 -67 0 83 26 134 180 4
3720 4 -31 -103 89 150 2 -41 -87 -279 274 -72 -90 184 -10 14 -9 21 228 -293 -82 223 -121 37 121 60
3744 60 -176 86 -116 -49 -129 -62 -95 109 76 70 -79 -137 19 14 -10 83 -384 84 -234 -102 157 -106 73 -88
3768 -88 -261 -196 6 -202 -42 55 116 -79 38 37 81 123 124 -153 -24 144 147 145 84 85 94 -134 -151 132 -12 -187 -182
3795 -182 -138 -60 -110 -224 50 -175 -176 -8 -4 -506 243 108 -10 246 -216 408 311 -331 -322 320 124 92 142 -97
3819 -97 -180 5 -30 -45 -123 -90 -123 37 -7 199 -37 68 87 84 -52 129 206 -53 -35 29 -132 -3 -21 -157 -146
3844 -146 -41 -233 67 258 3 216 69 -266 116 -193 28 204 -112 16 9 -114 7 21 -56 25 240 -159
3866 -159 22 -213 47 -124 -295 -107 80 -70 67 -118 197 156 -16 -92 9 87 198 -148 -100 117 170 -155
3888 -155 -84 -156 -225 64 -55 -47 124 -277 70 -102 -154 -99 211 -79 94 64 -123 152 96 -23 266 114 154
3911 154 -35 56 -139 -23 85 -118 98 -84 82 -55 -57 -61 66 67 30 67 -2 33 -16 -93 -130 -118 105 -67 50
3936 50 55 -8 30 189 -108 -37 48 -71 5 -109 -78 37 -125 -44 103 55 32 -244 -41 6 -119 320 -59 -264
3960 -264 -80 208 -79 -308 169 313 -215 172 152 154 161 -30 -161 109 9 88 -155 -70 7 142 -260 -23 -159
3983 -159 19 72 -93 -23 -40 -52 141 -35 -89 167 122 -72 126 -191 103 -47 -249 176 -150 -119 114 148 105
4006 105 -53 108 -156 -171 -413 59 -17 388 -705 -315 -294 44 -330 -702 -229 -320 96 -97 631 475 182
4027 182 283 453 -549 323 -231 -320 90 138 -429 -2 324 340 120 -285 403 57 -173 195 -172 243 -474
4048 -474 -35 -273 620 -58 33 -314 108 -6 964 214 474 133 110 433 266 508 -75 -448 -26 263 -448
4069 -448 -219 -295 70 229 19 35 29 36 -217 -65 -37 -91 214 207 20 88 -29 -26 -143 177 -144 -43 -20 1 -25
4094 -25 -244 -58 -141 -25 -139 39 199 55 -165 -39 -66 -118 89 -4 238 -133 -94 -14 -22 -53 -79 -77 -203 -296 -96
4119 -96 153 -257 100 -126 -80 223 84 -21 135 -141 35 22 -130 -81 -68 86 104 17 -53 136 28 -228 -111
4142 -111 89 128 -56 -197 37 64 -117 120 167 -62 76 -131 -99 -221 97 5 -324 -167 -31 -105 -162 166
4164 166 38 -191 81 262 -46 18 84 -35 -68 -272 -45 -35 89 -64 -39 -17 -284 -121 10 195 136 25
4186 25 -14 172 -66 -93 39 -231 174 111 -42 193 -97 -189 -164 23 115 54 161 75 -59 43 -46 73 -22 73
4210 73 -94 33 51 -113 -59 191 -186 -56 32 3 76 -154 -158 238 -123 210 50 -104 228 28 -36 -28 -66 -72 3
4235 3 -157 80 62 96 -65 -115 19 115 40 -34 288 -118 -145 16 -39 127 37 88 -89 -139 -74 17 -191 230 -18
4260 -18 -33 -30 -32 -115 -31 101 -49 -160 -169 -185 -76 222 96 -165 61 216 100 -36 132 164 47 86 -160 90
4284 90 -88 -240 -70 -190 159 29 119 -100 110 -165 -342 231 -157 -1 -56 267 -84 35 126 43 -109 -130
4306 -130 121 -94 -13 -23 -180 15 91 74 202 163 -221 -307 -64 -41 381 -11 193 200 80 -115 176 49 86
4329 86 -97 36 -166 -36 8 54 54 195 -205 167 60 44 96 171 -235 173 226 57 -141 -125 -22 -29 59 95 -33
4354 -33 91 -50 -87 -44 151 23 25 148 -74 -208 -311 133 123 -11 -61 224 -198 174 138 -66 -35 180 -128
4377 -128 -34 -102 27 213 106 -156 -153 -27 -23 50 424 51 17 -75 155 94 -60 -47 -134 49 152 -1 26 141
4401 141 -261 -334 -28 -21 -240 14 182 219 85 -32 -64 -8 168 162 4 -127 23 -20 151 68 -46 -7 13 214
4425 214 30 19 -215 149 30 -76 -38 140 -31 150 27 76 -73 -53 -24 -97 -74 112 -54 -142 27 -71 25
4448 25 123 219 -114 -46 -38 -161 55 122 32 -196 30 -95 129 131 -113 -85 10 110 48 -210 264 108 -90 42
4472 42 -42 29 -84 -76 -111 50 59 19 -122 26 113 -108 69 -119 -32 234 -249 -36 141 -233 -3 262 -95 -41
4496 -41 15 -154 147 59 5 30 -15 165 76 72 125 346 -91 75 149 -80 41 100 -157 -281 241 70 101 80 -75
4521 -75 -150 4 18 66 140 -157 -90 193 4 176 30 -211 -45 107 -15 136 -24 88 162 28 -235 -131
4543 -131 221 335 -136 -85 -149 249 -47 143 187 78 -57 -187 -10 15 -66 -210 149 201 -220 22 -63 45
4565 45 -5 -155 101 -54 175 -217 -148 -16 -115 -133 165 126 7 -154 41 114 -31 -144 283 98 -27 62 -235
4588 -235 21 -300 15 -192 -3 196 -52 74 -35 22 -199 -112 85 -22 111 -80 -149 -174 -16 -84 78 -96
4610 -96 40 44 -4 -152 75 -12 -308 -94 65 141 -121 -44 99 -1 -202 49 -7 -16 -295 -40 -254 21 147
4633 147 11 -59 -80 93 80 -53 170 23 -43 87 12 28 -227 -4 22 89 -60 65 225 6 23 -53 -31 64
4657 64 -223 376 -155 -147 57 -145 77 145 -30 -77 -42 -10 -76 -20 231 34 164 -172 131 62 -16 -54 -105 -3
4681 -3 2 -82 22 -256 160 107 24 -193 -81 -57 -65 373 42 -102 108 57 -209 69 -188 221 104 345 107 -1
4705 -1 13 -8 50 17 0 132 -60 -223 212 -12 -33 -66 117 -21 157 -89 -50 -43 13 106 341 145 203 74 1
4730 1 -75 -12 -5 116 -175 134 -24 38 -56 121 82 -210 -12 166 -56 -236 -40 41 248 -613 363 293 340 341 127
4755 127 21 -169 -237 78 -135 -295 -82 238 -152 227 54 123 -30 24 -10 -51 127 -47 1 -64 -89 27 17
4778 17 -20 118 155 -31 -115 -259 128 524 -744 -805 376 -76 -192 -411 -559 71 180 -404 -253 55 -269
4799 -269 87 517 230 -96 -224 -160 -22 -79 -137 -239 41 -89 168 -273 259 335 53 -51 59 -362 236
4820 236 -197 208 203 169 -461 62 -83 -41 -129 -70 -35 -135 10 65 -31 -71 112 63 108 176 135 127 70 161 -151 -58
4846 -58 148 -45 66 27 -141 -49 -107 -10 -173 -89 45 222 136 72 284 -97 -58 2 -62 -46 -115 -112 -230 -31 -42
4871 -42 54 -20 -147 -219 -44 156 125 -49 -32 -278 -203 210 104 295 71 -67 -227 303 -311 -104 71 120 -59
4894 -59 -12 -91 139 111 -199 89 189 -55 -40 149 -160 -91 200 -53 -209 192 -50 -54 170 -40 -57 208 18
4917 18 -164 17 -48 -118 35 -245 -187 -43 3 157 94 -156 -143 121 -216 -361 -26 -91 -161 -322 -148 -20 -85
4940 -85 67 -243 -47 81 -30 86 150 -8 -151 47 -94 -6 58 -103 -199 -250 79 45 -9 125 -44 50 -111
4963 -111 170 -21 -89 88 299 -36 -41 218 31 -91 -97 236 35 218 146 95 -217 -47 7 10 29 -94 118 94
4987 94 75 122 -190 20 149 45 -50 -43 -12 -140 22 -29 -147 108 108 182 110 53 7 -117 48 91 252 143 221
5012 221 -92 55 -154 219 63 -14 -22 18 -13 220 10 174 -30 -62 -27 76 11 -316 40 -18 100 -103 -79
5035 -79 -181 -165 -104 -115 -23 -68 8 -182 -174 43 219 126 4 -252 15 -260 266 249 -141 64 -123 154 343 -4
5059 -4 -79 -9 41 -162 -265 -242 25 -24 -89 84 146 293 235 14 -95 256 167 7 110 96 -4 -66 124 127 -27
5084 -27 99 -35 -13 3 131 0 -178 10 20 206 69 -186 -101 30 -34 -61 -147 -14 51 186 30 218 147
5107 147 40 390 211 91 -97 169 247 -382 -244 53 21 -4 70 -217 -76 -94 92 -54 81 -142 103 -55
5129 -55 -240 -65 56 -219 -4 156 -19 -192 102 87 133 169 69 59 -216 170 -110 -136 16 -5 -90 -79 -102
5152 -102 84 -77 93 -17 104 25 -44 6 -62 16 -64 -103 -233 84 -8 41 -58 -162 223 22 40 -162 -190 19
5176 19 -35 -3 -231 44 133 99 -10 -196 137 234 167 98 -111 217 -188 122 1 92 -226 69 -55 -39 -40 -30
5200 -30 -173 -164 44 -13 3 1 158 189 180 -18 -16 10 -24 -127 -173 215 181 18 10 106 61 -1 213 175 -29 -223 -234 255
5228 255 -228 100 48 38 149 -120 10 -188 -71 -37 -26 16 164 -1 -7 112 -77 -58 134 79 -211 -3 27
5251 27 47 -156 31 151 -14 -80 -15 -216 -44 -118 2 -80 -85 188 65 -73 104 179 192 125 -74 -122 -36 -58 143
5276 143 -94 -56 140 -277 239 -1 -146 110 -181 -45 -6 164 99 -202 106 38 -83 30 -10 -11 -20 -110 -17 141
5300 141 -118 -143 80 -18 -63 -101 107 -97 115 126 -108 9 -134 116 182 -100 151 -62 -292 -152 27 -128
5322 -128 -2 -125 74 -52 14 2 -322 69 61 8 -85 -179 94 -150 209 229 -239 73 67 -127 -105 310 19 -231
5346 -231 -257 218 -179 -154 -89 -224 -448 -88 137 -344 -90 324 -28 89 -138 116 -147 354 63 -12 -29 -209
5368 -209 -128 324 -192 339 -123 -243 75 -109 -177 -70 109 75 214 106 -285 -32 3 80 107 92 118 355 -12
5391 -12 103 95 106 -3 -81 88 -118 -70 -76 19 -46 -22 41 147 -97 70 38 139 -207 208 -146 -115 116 -23 -89
5416 -89 202 140 49 -11 124 -177 -153 -28 -118 95 -69 -74 120 -195 277 83 -194 118 -77 -84 -28 -123 107 -7
5440 -7 159 75 -163 117 -90 126 -64 33 -24 73 85 -111 -56 0 -258 21 -91 -5 102 -138 80 257 -49
5463 -49 5 34 44 55 73 69 278 -7 103 -76 36 -27 82 -71 276 -59 4 -19 -240 4 -10 381 53 -29
5487 -29 40 28 -63 -108 240 96 133 -18 -118 225 19 -137 112 40 -2 -29 -163 46 -3 123 -164 -143 -181 -95
5511 -95 15 -50 -170 64 -199 -96 90 261 -80 76 72 -115 122 156 294 -33 -158 200 -106 4 -244 0
5533 0 -14 48 99 81 -208 123 20 229 173 -45 -161 -24 -32 -151 233 40 155 29 -219 -49 -118 2 51 342
5557 342 -122 72 76 10 -140 -78 36 -46 -16 -108 -48 110 132 -7 -162 -39 -22 -46 267 -52 -34 -5 6 128 -17
5582 -17 -28 -175 -19 201 186 60 198 84 -58 -6 -63 -34 55 197 -78 122 -32 -100 35 185 72 112 90
5605 90 -92 -2 24 29 41 -244 49 189 123 -137 -16 -119 93 134 -35 16 14 -167 81 162 -133 167 -220 -162
5629 -162 43 71 68 -181 -153 -16 95 -201 -169 -93 110 105 19 -114 50 198 47 166 125 2 199 116 -132 -140
5653 -140 165 11 -157 216 -70 26 128 12 -5 -105 19 101 185 -113 12 -16 -261 -42 238 35 15 140
5675 140 -63 -137 -85 -92 -194 31 106 32 136 0 -32 5 -59 4 52 104 -57 140 -245 235 22 26 -147 15 11
5700 11 196 -129 257 34 -125 65 107 192 114 -100 -8 131 3 80 -45 -71 -25 -36 -189 -161 146 -116 -126 90
5724 90 131 99 -93 62 -76 51 44 -9 43 -73 110 163 -103 167 -251 -143 -114 23 -238 -55 -177 57 -76
5747 -76 -21 34 -27 -51 63 4 34 -56 -258 -33 73 142 -216 -43 105 -22 257 50 -35 120 -102 168 -152
5770 -152 -76 11 -144 78 128 100 165 109 -171 -170 109 173 -14 136 -99 187 39 65 161 -114 99 18 -162 -181
5794 -181 1 -112 29 -119 111 -1 -94 -154 -63 -234 122 -164 -17 -113 134 -313 -277 147 -135 -432 -108 79
5816 79 92 -92 51 300 -13 46 21 163 -24 -102 237 -53 132 268 116 12 -71 -84 38 -112 118 133 141
5839 141 -290 -42 -80 14 72 -280 -106 -191 113 -142 345 -446 -60 -221 -88 -175 141 68 -27 219 48 49 15
5862 15 -50 -311 112 110 57 -81 125 -82 80 189 -74 256 -84 84 160 -92 4 -212 -199 -22 -345 90 95
5885 95 -25 62 -89 70 -225 125 199 -214 88 -256 -158 45 -22 407 63 -13 389 92 -38 -46 66 85 -50
5908 -50 95 -19 -101 74 65 167 -90 -54 -12 -75 -140 67 -43 78 16 184 -170 -230 -53 13 178 329 -4 -348
5932 -348 138 136 174 -47 -46 -192 -34 18 -100 -344 -124 -113 -204 128 98 -88 78 -76 -24 -212 -97 198 -270
5955 -270 -258 215 -150 -76 -25 193 130 0 -105 28 39 -89 80 -211 77 116 -61 -90 60 60 -79 76 -252
5978 -252 91 -34 -11 332 188 -130 -85 -95 83 -168 -123 80 65 60 8 42 64 109 66 -95 -229 -60 189 -62
6002 -62 -86 170 -65 119 35 -11 -209 2 17 57 -67 -193 -243 56 82 -100 21 -33 -135 160 160 -189 35 144
6026 144 116 24 28 230 85 287 129 191 154 -142 76 94 181 -116 70 163 -125 -78 180 49 59 33 -143 49
6050 49 -94 -224 -149 115 83 -4 85 -43 -128 192 -20 19 -45 76 -121 144 -169 -15 87 283 -9 29 -70
6073 -70 39 221 -221 -125 22 100 -172 214 138 33 -188 47 -42 133 127 151 170 -64 -143 112 209 -67 -55 50
6097 50 20 183 -308 56 30 31 25 239 -175 14 3 -32 64 4 -117 -133 52 281 -161 53 59 -13 18 -152 25
6122 25 -52 37 16 -24 111 230 28 170 62 166 -212 301 109 47 -100 -141 115 -96 -37 16 -226 103 -10
6145 -10 83 -24 -69 -78 -192 118 71 -106 -91 38 -82 393 -150 -28 228 13 -211 -297 84 24 139 -87 135
6168 135 18 -73 16 144 -190 211 66 -10 -436 120 155 187 93 14 54 21 -98 -114 -184 -144 72 132 294 69
6192 69 217 99 55 -266 -132 -49 83 -153 -132 -3 -190 -44 -35 -115 78 -203 -41 -54 -14 23 -31 -115 -127 79
6216 79 38 -46 -151 -79 178 199 191 -22 -292 315 -55 -217 -42 -48 101 77 12 368 -51 -139 131 -176 -105 30
6240 30 1 -33 60 -54 69 -68 -271 104 4 -323 10 -81 -41 -15 -363 -128 148 197 80 -111 72 112 -40
6263 -40 47 96 229 -53 -62 -9 65 68 -165 -153 138 -239 -9 -73 55 95 67 118 145 -171 70 280 -83 69 -40
6288 -40 167 37 -41 -159 64 -349 -55 -128 142 90 -435 -123 24 14 -28 -138 0 152 -230 73 30 50 -36
6311 -36 95 24 -70 -303 -136 -36 -11 -119 -166 43 39 -97 73 -22 254 200 42 112 51 61 51 21 8 124 223
6336 223 34 90 -65 -102 43 -54 53 95 156 -102 38 13 86 -298 -231 -75 -22 -24 25 60 -85 -147 2 243 33
6361 33 -141 -64 -131 34 -37 -169 -16 -26 249 0 -135 133 318 -93 32 -165 147 38 48 -61 -80 -251
6383 -251 0 -165 119 31 113 121 91 116 176 -47 -317 194 -16 143 43 496 64 180 -79 -274 -45 120
6405 120 -208 -36 -11 64 -121 33 232 -68 155 -144 62 89 -165 -122 -20 -123 -11 216 -225 168 41
6426 41 53 -13 -28 21 -65 -63 -41 144 75 196 -82 123 -236 8 -87 202 5 153 -22 -261 4 47 -27 63 -283
6451 -283 95 46 147 199 -282 -21 148 -60 -11 53 368 -124 -132 62 -261 -129 -106 -89 36 -52 75 80 89 -87
6475 -87 -75 -23 173 29 -85 -166 -134 -137 115 -62 94 -41 -90 -193 -2 -112 1 186 -61 -8 -118 -149 18
6498 18 253 99 13 -133 73 -1 -31 -23 -144 54 -90 119 -85 -11 -58 16 46 9 114 46 135 -63 -144 -242 -196
6523 -196 -101 21 131 112 -58 186 -40 17 -163 -172 184 -37 -264 3 -171 7 97 117 80 31 62 61 174 25
6547 25 142 -2 359 39 -11 34 -55 -13 -170 26 54 25 21 210 105 79 126 2 -157 -225 -41 -289 -111 -52
6571 -52 40 -10 -81 -14 -87 -76 6 148 -49 -217 13 -100 -125 -69 -38 -27 -60 -142 78 30 -16 -121 24 -214 109
6596 109 309 -265 315 84 107 -155 -407 -14 120 -46 6 37 -39 93 133 10 143 87 87 -200 -191 -2 148
6619 148 61 -329 10 61 176 -261 -37 -214 -170 96 -205 43 -39 313 95 121 -40 34 -100 -366 -78 -45
6641 -45 -220 -208 106 197 19 -16 55 -10 -185 111 -37 37 67 -77 272 -200 -6 41 25 66 208 -83 -221 126
6665 126 299 29 -16 -17 131 230 -6 190 85 -42 71 10 -33 -152 -202 33 118 19 4 -164 104 17 47 205
6689 205 65 55 -13 -88 107 -155 -68 -12 -25 -197 247 -14 188 96 37 139 206 -44 117 -61 254 -74 51
6712 51 142 43 -70 -30 -84 201 302 -25 -84 -59 -156 -43 109 106 -337 36 247 -52 30 -109 2 -138 231 -176
6736 -176 -11 -74 -209 -200 5 -65 -59 88 -207 -22 -146 -93 -31 17 133 -143 159 -89 -3 -13 43 15 -63 34 -49
6761 -49 33 -32 204 -315 2 -89 66 294 -134 48 -120 -209 218 66 -70 195 -198 -183 217 0 -7 218 111
6784 111 318 53 -20 88 25 38 -104 196 -56 75 -165 -15 -43 143 -172 -41 67 -11 69 35 -178 -44
6806 -44 -51 -25 56 -200 16 64 70 -89 146 -167 -21 308 193 100 23 13 -32 62 71 -185 89 -161 191 6 -219
6831 -219 -100 67 -116 -151 -230 -144 90 79 186 233 248 17 -5 43 115 -46 233 134 72 133 -226 -109 47 49 100
6856 100 35 42 -98 -2 -116 -140 17 76 212 -102 297 -118 -197 13 -6 -95 31 -44 -65 -82 1 -190 -154 -80 221
6881 221 -19 177 304 -78 71 -85 273 -163 139 170 -230 -8 66 -16 102 -122 -114 51 -42 40 16 -182 -64
6904 -64 259 40 -1 56 -209 -21 69 42 -74 213 24 122 -173 -101 27 -78 -190 -206 -186 17 293 -107 -38
6927 -38 49 -19 -9 198 142 8 246 66 143 -55 -46 -58 10 79 -61 -83 -75 -91 72 80 -277 -14 92 -145 -7 271
6953 271 62 -230 159 -7 187 136 -227 192 -221 30 82 169 -17 -130 25 99 7 144 21 -182 22 60
6975 60 246 -30 68 12 59 -56 119 -6 -104 19 2 -125 152 129 -177 126 -54 -216 -78 168 -93 -1 -108
6998 -108 -95 -30 53 -47 44 -17 -4 -212 -63 -198 1 -333 -66 312 -55 30 -148 83 -72 119 -43 98
7020 98 76 -158 20 199 -261 71 -62 -86 57 -155 127 152 73 40 -105 -62 157 132 143 -29 -31 -21 -57 -74 -183
7045 -183 -75 35 65 193 78 -104 -67 87 71 226 -130 -222 -21 80 18 -47 21 -124 -57 123 91 19 -202
7068 -202 -185 -159 108 139 122 117 -5 -16 302 -106 138 -76 142 29 -17 -110 -28 166 49 239 19 145 -80
7091 -80 113 -229 -181 164 -161 -34 1 -160 -139 -80 -62 97 -121 -20 -41 -126 128 65 -23 -4 -247 -6 213 -12
7115 -12 6 -82 -68 -4 158 -201 157 129 -94 -73 -46 -26 107 48 121 249 -266 13 38 -120 -45 225 147 -34 -74
7140 -74 -150 177 77 1 -36 159 277 -185 8 -134 -71 193 181 115 85 293 46 154 -103 -69 169 113 10
7163 10 -3 102 -126 75 123 148 131 38 -38 28 90 -85 -86 171 -107 -98 154 -151 -101 -150 44 84 243 249 92 36
7189 36 66 112 3 -158 -56 95 -79 93 -84 -357 40 -90 -48 151 -282 286 207 64 367 -102 -209 -265
7211 -265 -55 86 111 -23 -27 124 -95 145 114 -58 -66 144 -29 92 161 78 200 180 -77 90 72 183 21
7234 21 -113 -23 -151 -84 69 68 17 67 -102 237 112 134 -116 134 -133 -15 117 -38 57 1 -142 17 15 -85
7258 -85 109 32 61 100 153 -159 244 30 133 87 -240 -72 -191 105 -322 136 28 -225 -145 88 40 86 33
7281 33 -67 235 86 164 57 61 -131 25 247 -36 -11 36 8 -122 213 -194 131 -73 75 60 -234 31 -152
7304 -152 56 -58 97 57 -264 -55 237 92 -82 -159 123 155 121 -53 -163 27 -91 3 -82 -121 165 257 -141
7327 -141 57 -98 58 -55 30 196 175 -70 -229 7 -9 -17 -89 -139 -206 -41 -32 -349 -176 54 -245 146 26
7350 26 -15 -8 -85 -115 52 67 154 36 -218 76 103 -9 49 -27 -134 -134 7 217 44 103 206 233 -180 195 130
7375 130 -3 -21 68 -143 190 -22 -17 11 -28 -207 22 -209 -66 18 192 -65 -66 -113 79 71 -43 144 164 112 -266
7400 -266 61 -7 -70 -235 -74 -227 67 26 -5 -76 -127 -9 -259 -165 -74 -40 217 83 104 214 -57 -106 26 -163
7424 -163 42 73 -7 -142 32 -60 -173 142 -37 -109 -19 -131 -65 19 -61 -50 -150 -82 84 40 107 177 -128 210
7448 210 -95 272 -130 -46 -15 27 323 137 74 40 124 45 -190 -169 98 -104 68 -13 -155 -1 -194 392 -19
7471 -19 -74 -44 40 -171 -54 177 -79 128 31 15 -43 -25 -88 18 1 79 9 243 73 39 -47 16 58 72 206 -45
7497 -45 -90 22 -93 177 -133 128 -102 169 -56 -8 118 49 -144 182 8 -73 368 62 108 405 -135 -106
7519 -106 -318 -29 -217 -35 291 -6 -33 -85 394 -156 125 78 -105 -78 143 184 112 136 133 -45 -41 -4 163 115
7543 115 29 104 -269 -22 73 187 -56 229 -153 2 -159 -33 135 -77 -156 -25 46 42 24 -128 105 -272 -78
7566 -78 141 30 245 -50 -76 77 -146 -149 87 269 -189 -68 79 -84 116 -11 -23 -218 139 -119 84 -271
7588 -271 -111 127 -75 -102 343 69 -77 -83 -100 -190 -38 113 84 -258 -56 330 -151 -4 223 47 -185 24
7610 24 -97 -77 -28 58 27 31 119 52 -151 -96 223 134 107 -221 250 35 -184 139 -55 260 172 32 65 10 -49
7635 -49 -30 -38 38 11 -121 39 10 4 351 -76 85 -43 194 1 -171 123 18 190 162 80 -19 -303 12 10 -182
7660 -182 -201 -137 220 -30 -18 105 41 -83 -165 -236 -21 -63 10 56 -93 244 -6 -12 78 -256 -48 77 -186 -45
7684 -45 139 -137 -182 -180 148 60 148 -183 246 -77 -20 -26 -326 31 5 -108 -57 8 -67 90 67 179 -36 75 76
7709 76 -206 346 -66 -35 -95 -171 -121 -5 9 -16 -32 70 -238 -82 -135 100 -73 54 -182 -169 -56 -281 -152
7732 -152 45 -5 -27 -97 -49 -252 9 251 -71 76 6 452 261 198 1 99 204 -136 51 10 -63 -296 151
7755 151 -12 95 137 -20 -67 -100 159 51 -251 41 -69 48 -20 263 -5 -161 70 124 -5 -284 -188 162
7777 162 -68 42 16 -203 -311 -155 -42 -100 -20 29 -157 -54 5 65 -49 -7 6 -61 21 -18 113 110 38 -348 -144
7802 -144 111 115 -28 124 -34 -91 -62 -88 120 -48 -114 65 -37 6 133 -225 -219 -115 -7 227 -21 -19 99 37
7826 37 -115 -23 -88 160 36 1 -18 277 -91 -90 -37 45 41 -160 105 6 8 75 -69 50 -97 -94 260 -87 -133 92
7852 92 236 55 107 -179 -30 19 1 25 100 -105 -103 151 -89 123 -23 93 123 12 -138 -7 8 -99 -7 -49
7876 -49 -32 51 331 116 146 -61 -126 -63 -248 -226 52 -49 -113 -4 28 -42 286 -86 -59 -194 201 -30 -203 308
7900 308 223 -282 -59 -53 -13 146 18 -188 114 -138 -173 72 -274 103 -292 -100 61 8 -97 246 74 -43
7922 -43 388 -105 -18 -57 24 53 -86 24 -35 -70 305 -37 44 139 -203 42 -41 4 20 140 -135 62 16 -160
7946 -160 -133 -126 274 -217 -80 -63 -231 5 251 -48 133 -27 82 -74 -118 -25 169 13 -175 -173 -66 -122 68
7969 68 73 67 -163 -97 -14 320 244 -123 -112 -54 50 -99 -16 67 -36 -122 161 11 -63 -38 120 -11 22 61 -57 -60
7995 -60 -89 34 1 -128 -51 -76 127 -121 -81 83 138 136 92 -44 16 35 -65 18 -65 86 -260 -24 -344 -99 -27
8020 -27 -149 13 197 109 14 -81 -45 46 -39 250 -48 223 64 44 -30 -136 -260 -61 -129 -192 66 -156 92 -14
8044 -14 -33 -6 -120 137 176 -23 34 47 -33 -69 -307 34 -13 26 -21 -93 -34 82 -71 -167 -177 160 26 -16 -287
8069 -287 -54 75 -257 73 -61 69 -74 -129 -164 -97 -104 40 -15 -94 -172 120 77 -103 -44 53 110 228 137 -98
8093 -98 -158 41 111 -12 -210 214 -172 171 274 -138 -146 45 -19 -74 232 209 73 -126 27 113 42 -88 21
8116 21 -192 -78 110 178 95 -14 -134 122 253 -35 21 -53 -266 -122 71 115 263 -133 83 35 131 -35 44
8139 44 -23 110 19 -164 -129 106 -48 -34 138 -11 -74 -130 -110 260 33 219 -145 177 185 -67 -29 -22 -133 6
8163 6 -192 -202 183 -142 -93 356 -39 -247 114 -41 -49 -162 139 103 -67 22 60 141 -140 150 263 30 -8 -37
8187 -37 80 -117 110 22
8191B2
##END NTUPLES=NMR FID
##END=
