##TITLE=1H_Pr C6-Am
 CDCl3,8 sc, 
 22.9.2021
##JCAMPDX= 6.0         $$ Bruker NMR JCAMP-DX V2.0
##DATA TYPE= NMR FID
##DATA CLASS= NTUPLES
##ORIGIN= UXNMR, Bruker Analytische Messtechnik GmbH
##OWNER= root
$$ XWIN-NMR		Version 3.5
$$ Wed Sep 22 13:50:40 2021 Russian Standard Time (UT+4h)  she@DPX200
##.OBSERVE FREQUENCY= 200.1314
##.OBSERVE NUCLEUS= ^1H
##.DELAY= (6, 6)
##.ACQUISITION MODE= SIMULTANEOUS
##.ACQUISITION SCHEME= undefined
##.AVERAGES= 8
##.DIGITISER RES= 18
##SPECTROMETER/DATA SYSTEM= spect
##.PULSE SEQUENCE= zg30
##.SOLVENT NAME= CDCl3
##.SHIFT REFERENCE= (INTERNAL, CDCl3, 0, 15.7039)
##AUDIT TRAIL= $$ (NUMBER, WHEN, WHO, WHERE, WHAT)
$$ ##TITLE= Audit trail, XWIN-NMR		Version 3.5
$$ ##JCAMPDX= 5.01
$$ ##ORIGIN= Bruker BioSpin GmbH
$$ ##OWNER= she
$$ F:/spectra/data/she/nmr/H-F/1/audita.txt
$$ ##AUDIT TRAIL=  $$ (NUMBER, WHEN, WHO, WHERE, WHAT)
(   1,<2021-09-22 13:49:46.15 +0400>,<she>,<DPX200>,
      <created by zg, POWCHK disabled, PULCHK disabled
       configuration hash MD5:
       00 E9 B6 7A A2 85 ED C7 34 08 36 98 17 FE 4E 26
       data hash MD5: 16K
       95 93 48 EA AE D1 F0 8F 71 85 BE F9 89 2D A2 CD>)
$$ ##END=
$$ 
$$ hash MD5
$$ F2 0C 8E D4 05 EE A1 8F F4 D6 52 D2 84 F4 6E 3E
##$RELAX= 
##$RELAX= 
##$RELAX= 
##$RELAX= 
##$RELAX= 
##$RELAX= 
$$ Bruker specific parameters
$$ --------------------------
##$DU= <F:/spectra>
##$EXPNO= 1
##$NAME= <H-F>
##$PROCNO= 1
##$TYPE= <nmr>
##$USER= <she>
##$AMP= (0..31)
100 100 100 100 100 100 100 100 100 100 100 100 100 100 100 100 100 100 
100 100 100 100 100 100 100 100 100 100 100 100 100 100 
##$AQSEQ= 0
##$AQ_mod= 1
##$AUNM= <au_zg>
##$AUTOPOS= <>
##$BF1= 200.13
##$BF2= 200.13
##$BF3= 200.13
##$BF4= 200.13
##$BF5= 200.13
##$BF6= 200.13
##$BF7= 200.13
##$BF8= 200.13
##$BYTORDA= 1
##$CFDGTYP= 0
##$CFRGTYP= 5
##$CHEMSTR= <none>
##$CNST= (0..31)
1 1 145 1 1 1 1 1 1 1 1 1 1 1 1 1 1 1 1 1 1 1 1 1 1 1 1 1 1 1 1 1 
##$CPDPRG= <>
##$CPDPRG1= <>
##$CPDPRG2= <>
##$CPDPRG3= <>
##$CPDPRG4= <mlev>
##$CPDPRG5= <mlev>
##$CPDPRG6= <mlev>
##$CPDPRG7= <mlev>
##$CPDPRG8= <mlev>
##$CPDPRGB= <>
##$CPDPRGT= <>
##$D= (0..31)
0 1.2 0 0 0 0 0 0 0 0.06 0 0.03 0 0 0 0 0.0002 0 0 0 0 0 0 0 0 0 0 0 0 
0 0 0 
##$DATE= 1632304185
##$DBL= (0..7)
120 120 120 120 120 120 120 120 
##$DBP= (0..7)
150 150 150 150 150 150 150 150 
##$DBP07= 0
##$DBPNAM0= <>
##$DBPNAM1= <>
##$DBPNAM2= <>
##$DBPNAM3= <>
##$DBPNAM4= <>
##$DBPNAM5= <>
##$DBPNAM6= <>
##$DBPNAM7= <>
##$DBPOAL= (0..7)
0.5 0.5 0.5 0.5 0.5 0.5 0.5 0.5 
##$DBPOFFS= (0..7)
0 0 0 0 0 0 0 0 
##$DE= 6
##$DECBNUC= <off>
##$DECIM= 32
##$DECNUC= <off>
##$DECSTAT= 4
##$DIGMOD= 1
##$DIGTYP= 9
##$DL= (0..7)
0 120 120 120 120 120 120 120 
##$DP= (0..7)
150 150 150 150 150 150 150 150 
##$DP07= 0
##$DPNAME0= <>
##$DPNAME1= <>
##$DPNAME2= <>
##$DPNAME3= <>
##$DPNAME4= <>
##$DPNAME5= <>
##$DPNAME6= <>
##$DPNAME7= <>
##$DPOAL= (0..7)
0.5 0.5 0.5 0.5 0.5 0.5 0.5 0.5 
##$DPOFFS= (0..7)
0 0 0 0 0 0 0 0 
##$DQDMODE= 0
##$DR= 18
##$DS= 0
##$DSLIST= <SSSSSSSSSSSSSSS>
$$ [...]
##$SUBNAM2= <"">
##$SUBNAM3= <"">
##$SUBNAM4= <"">
##$SUBNAM5= <"">
##$SUBNAM6= <"">
##$SUBNAM7= <"">
##$SUBNAM8= <"">
##$SUBNAM9= <"">
##$SW= 20.0188988654967
##$SWIBOX= (0..15)
0 0 2 0 0 0 0 0 0 0 0 0 0 0 0 0 
##$SW_h= 4006.41025641026
##$TD= 16384
##$TD0= 1
##$TE= 0
##$TE2= 300
##$TE3= 300
##$TEG= 300
##$TL= (0..7)
0 120 120 120 120 120 120 120 
##$TP= (0..7)
150 150 150 150 150 150 150 150 
##$TP07= 0
##$TPNAME0= <>
##$TPNAME1= <>
##$TPNAME2= <>
##$TPNAME3= <>
##$TPNAME4= <>
##$TPNAME5= <>
##$TPNAME6= <>
##$TPNAME7= <>
##$TPOAL= (0..7)
0.5 0.5 0.5 0.5 0.5 0.5 0.5 0.5 
##$TPOFFS= (0..7)
0 0 0 0 0 0 0 0 
##$TUNHIN= 0
##$TUNHOUT= 0
##$TUNXOUT= 0
##$USERA1= <user>
##$USERA2= <user>
##$USERA3= <user>
##$USERA4= <user>
##$USERA5= <user>
##$V9= 5
##$VALIST= <valist>
##$VCLIST= <CCCCCCCCCCCCCCC>
##$VD= 0
##$VDLIST= <DDDDDDDDDDDDDDD>
##$VPLIST= <PPPPPPPPPPPPPPP>
##$VTLIST= <TTTTTTTTTTTTTTT>
##$WBST= 1024
##$WBSW= 4
##$XGAIN= (0..3)
0 0 0 0 
##$XL= 0
##$YL= 0
##$YMAX_a= 319266
##$YMIN_a= -431584
##$ZGOPTNS= <>
##$ZL1= 120
##$ZL2= 120
##$ZL3= 120
##$ZL4= 120
##$ABSF1= 10
##$ABSF2= 0
##$ABSG= 5
##$ABSL= 3
##$ALPHA= 0
##$AQORDER= 0
##$ASSFAC= 0
##$ASSFACI= 0
##$ASSFACX= 0
##$ASSWID= 0
##$AUNMP= <proc_1d>
##$AZFE= 0.1
##$AZFW= 0.1
##$BCFW= 1
##$BC_mod= 2
##$BYTORDP= 1
##$COROFFS= 0
##$CY= 11.3945322036743
##$DATMOD= 1
##$DC= 2
##$DFILT= <>
##$DTYPP= 0
##$F1P= 2.36226072786647
##$F2P= -0.459571619588291
##$FCOR= 0.5
##$FTSIZE= 0
##$FT_mod= 4
##$GAMMA= 1
##$GB= 0.15
##$INTBC= 1
##$INTSCL= 1
##$ISEN= 128
##$LB= 0.24
##$LEV0= 0
##$LPBIN= 0
##$MAXI= 10000
##$MC2= 0
##$MEAN= 0
##$ME_mod= 0
##$MI= 1.114404
##$NCOEF= 0
##$NC_proc= 0
##$NLEV= 6
##$NOISF1= 3.799351
##$NOISF2= 2.8
##$NSP= 1
##$NTH_PI= 0
##$NZP= 0
##$OFFSET= 15.70392
##$PC= 1
##$PHC0= -14075.36
##$PHC1= 13.20089
##$PH_mod= 1
##$PKNL= yes
##$PPARMOD= 0
##$PSCAL= 0
##$PSIGN= 0
##$REVERSE= no
##$SF= 200.130013532006
##$SI= 16384
##$SIGF1= 3
##$SIGF2= 2
##$SINO= 400
##$SIOLD= 16384
##$SREGLST= <1H.CDCl3>
##$SSB= 0
##$STSI= 0
##$STSR= 0
##$SW_p= 3612.71676300578
##$SYMM= 0
##$S_DEV= 0
##$TDeff= 0
##$TDoff= 0
##$TI= <>
##$TILT= no
##$TM1= 0
##$TM2= 0
##$TOPLEV= 0
##$USERP1= <user>
##$USERP2= <user>
##$USERP3= <user>
##$USERP4= <user>
##$USERP5= <user>
##$WDW= 1
##$XDIM= 8192
##$YMAX_p= 0
##$YMIN_p= 0
$$ End of Bruker specific parameters
$$ ---------------------------------
##NTUPLES= NMR FID
##VAR_NAME=  TIME,          FID/REAL,        FID/IMAG
##SYMBOL=    X,             R,               I
##VAR_TYPE=  INDEPENDENT,   DEPENDENT,       DEPENDENT
##VAR_FORM=  AFFN,          ASDF,            ASDF
##VAR_DIM=   8192,          8192,            8192
##UNITS=     SECONDS,       ARBITRARY UNITS, ARBITRARY UNITS
##FACTOR=    0.0002496,     1,               1
##FIRST=     0,             0,               0
##LAST=      2.0444736,     0,               0
##MIN=       0,             -431584,         0
##MAX=       2.0444736,     319266,          0
$$ Real data points
##PAGE= N=1
##DATA TABLE= (X++(R..R)), XYDATA
$$ [...]
1938g37K16K11l67K79N00o92O8O09k25r4L06k91O01m9m40P05n6m01N45k42k35
1959B11N11q1L5J92m46P1O39p98J43L82p32M31L0n06M61k08m28O69l0q53M29o
1981A16j06L53o93j75P36q76r8N26j57p6k24k27K10r7JO13q5o22K78K14k96L69
2003c16m16j5O39k66K42Q3l29J88O06l71k9J00j84L95K50o59P29j46m10K63j9
2024C35O5o0K99k34M29n56M45L32p02M4L25m88J53J88n58M61k3p01M81q4m54N03
2046B00n86J03L94o66L15N86m46l70J99k06R9l6l24O27k86k61L07r4n15M97J06
2067c57l95O69k94l9L98n82M54M31m01K8K54j10L3O1l75N17L89q44Q52k58m01
2088C0O01P3k10k8k65M60K2n56K69N20m80k39M00k19K86k04o60N06J99m72j94
$$ plain form
1938 -737 -521 -310 -677 -398 102 -590 -522 87 -138 -232 74 -217 384 335 -105 600 544 143 688 446 211
1959 211 722 641 676 868 422 493 1132 334 477 859 127 558 588 82 543 335 -93 576 546 -307 122 116
1981 116 10 363 -330 -505 231 -645 -743 -217 -374 -450 -674 -901 -691 -788 -787 -174 -259 -881 -603 -389 -685 -316
2003 -316 -732 -747 -108 -374 -132 -49 -378 -190 416 45 16 116 -68 327 577 -82 647 501 91 354 335
2024 335 400 340 639 405 834 278 723 1055 353 397 722 234 387 575 17 478 455 -246 235 151 -303 200
2046 200 -386 -283 111 -555 -240 346 -100 -470 -271 -477 -378 -414 -738 -111 -397 -658 -351 -445 -960 -463 -357
2067 -357 -752 -83 -377 -416 -18 -600 -146 285 -116 -88 166 56 89 150 -225 292 681 -163 689 431 30
2088 30 631 704 494 466 201 661 683 127 396 916 436 197 597 378 664 460 -200 306 505 33 -161
2109a61K32j83Q8j24j2K10o74Q4L73j84j52Q4k16M00k33l64L00J42l87L84j1k08
2131f12N58l93n1L84k42N0J93m68N04N9k11L55J75l49J53J09o9K35k28r8L46J93
2153E93m72L16%J33J53n72Q5M80k05l23L81k86J14J34n50N85l53k39L28j33k21
2174e2J76j05l99N47m05lL06l54j17K31n03N95r9n65K29J04m42J54N05n44L24
2195d17m3j64P83o99j5N99k95k22M79m60M28J81m20L58R9l30J5M95l18M28j89
2216B93l64Q25m50j71N28l72n6N66o16K44N27p24K33L26q83P93l78k66M62k00
2236C17j43J75k74j29L23n51J00L01k40k43N59m66P6n5k02L88j26p86O10Rl85
2257g42L11J90l71K98j84p8O39m99p8P58l48l7J07j35K34R7j20R2K70n29M27Q2
$$ plain form
2109 -161 71 -112 -24 -148 -160 50 -624 -540 -167 -351 -503 -419 -635 -235 -468 -832 -532 -390 -777 -393 -404 -612
2131 -612 -54 -447 -498 -114 -356 -306 -113 -581 -77 -18 -229 126 301 -48 105 214 145 380 152 54 400 593
2153 593 121 437 437 570 723 151 236 716 511 188 569 283 397 531 -19 566 213 -26 302 169 -52
2174 -52 124 19 -380 167 -238 -241 65 -289 -406 -175 -678 -83 -182 -747 -518 -414 -856 -702 -197 -741 -417
2195 -417 -460 -624 159 -540 -555 44 -251 -473 6 -454 -26 155 -265 93 192 -138 -123 372 54 482 293
2216 293 -71 754 304 133 661 289 233 799 183 427 954 230 463 789 -94 699 321 55 517 317
2236 317 174 349 75 -54 269 -282 -182 119 -121 -364 195 -271 -195 -250 -452 -64 -190 -976 -366 -357 -742
2257 -742 -431 -241 -612 -314 -498 -576 63 -436 -514 244 -104 -141 -34 -169 65 162 42 134 404 -125 302 384
2279C84m26L05j3l13R51m15m74P43l59o4L34o85M65J72l89kM54m38J5L39r78O36
2301B42lm02K58m07P3K13j57k16J18J61q1j73J42Jp9l34M67R5p42K43M83n43K01
2324d40M2J40%l99j76R32j54l74N58k72o6M42k89J47p4m58P70J25m75M52k41l7
2346A53L84k53k45L86j28j99M97k17l0K76j53j36j4j22J32J99l75J38L39o80J46
2367I8j26M5J59r2k82K12j98m15N60j38l52M10k68J45j81r0L16K0o03N97j45k66
2389e94L27p6k63O71l33j89J75j01l5J59K27j74J45k51M16Mj69L82j56L1%J26
2411C22o9j3J43r8J09l57O6L86kl29Q3J79J46l43J48r1J13l52M50k24m11M68j52
2434A72j18j00k52K76J38q3o00N51j91j74J28Mq6K54p46N09J46m29O53k10j70
$$ plain form
2279 384 -42 263 250 -63 888 473 -1 742 383 319 653 -32 433 605 216 214 668 230 245 584 -394 242
2301 242 239 -163 95 -312 -239 -26 -183 -399 -281 -120 -201 -374 -232 -231 -310 -644 -177 -82 -824 -581 -98 -641 -440
2324 -440 -398 -258 -258 -657 -833 99 -55 -429 129 -143 -209 233 -56 91 17 -441 329 454 -21 431 190 153
2346 153 537 284 39 425 297 98 595 378 348 624 471 335 321 199 331 530 155 293 632 -48 98
2367 98 -28 17 176 84 -198 14 -184 -599 -39 -177 -529 -119 -387 -242 -423 -513 -197 -177 -780 -183 -328 -594
2389 -594 -267 -343 -606 65 -268 -457 -282 -383 -418 -259 -32 -206 -61 -312 104 108 -61 321 165 196 196 322
2411 322 253 240 383 285 394 37 103 489 487 158 241 420 566 223 371 280 393 41 491 267 -144 324 172
2434 172 54 -46 -298 -22 116 33 -567 -16 -207 -381 -253 -249 -335 -81 -827 -318 -172 -601 52 -158 -328
2455c28J68m45J58J74r9r8P10o03k30N57k0K5K02k57R9j8L2K01J83k39J38J7l18
2478IN22j02N2p6l04QO09l86r9J88%l67M73l29J85P3n37L35P8o03M16o7j46L07
2502B39n81K7N14m22N5J59m34Q8J57n9KJ46k50J79k93J94J66l17j28K02l3l1N05
2525H5n10J45J48m6k5K19q5rn7J97J32K72p27O85k33l00N68q4K06l31k26M23j23
2548C24P3j67jm7J55K30k08J61k66j70o6O10p15J02N50p11J74J28j30J27L7m69
2570b79L44n1l03K85m57k3J79k31L24q2j90M35j95k44L4P0N4L12k61k6K95n8l52
2593d20N41l31o0M37l03NJ35k9R4L28n99J98L95m79L23J07N6J8j54Q9lr9j40J91
2617C00j49K77O8o62N76j34k86J83K69n18L63l22om6L73k30J92k50J26j47o2l56
$$ plain form
2455 -328 -160 -605 -447 -273 -372 -470 240 -363 -593 -36 -56 -31 171 -86 13 -5 27 228 411 172 310 327 9
2478 9 531 429 481 405 101 109 718 332 233 421 421 54 527 198 383 456 -81 254 332 -271 145 78 -68 239
2502 239 -342 -315 199 -223 -168 -9 -443 -355 -198 -257 -255 -109 -359 -180 -473 -279 -113 -430 -558 -356 -389 -420 85
2525 85 -425 -280 -132 -178 -203 16 -69 -78 -135 62 194 466 -261 424 191 -109 459 375 581 250 24 447 324
2548 324 397 230 229 182 337 567 359 520 254 84 18 628 -87 15 565 -146 28 156 26 153 190 -279
2570 -279 65 14 -289 -4 -461 -484 -305 -536 -212 -294 -484 -49 -244 -488 -454 -384 -330 -18 -279 -305 -10 -68 -420
2593 -420 121 -210 -270 167 -136 -131 4 -25 69 397 -202 -4 391 -88 235 342 398 416 262 351 348 249 109 300
2617 300 151 428 496 -166 410 276 -10 173 442 -76 287 -35 -41 -87 286 56 248 -2 124 -23 -85 -441
2639d41L06l25J5L36j29J8j64J7K52k49k45L16J08j18J18j75J4M59m23o5L90k29
2661b14j20N23n59L82L92p14K86K15l21M29n0k65M59k00k8M3K4p8M48k24l75M08
2683D61n88N22j00k32J95J95j97J47l96L0M3J6p7K27k29k83L06l10J65K53k29
2704h1n4K21m02r6M85k99n8K34k1r2j14j55N84l91l3l4J18L9K9k04oL76j51oJ79
2729F8l99M08M5k35M93K4l44K66K0l54M51j20o7P7j20k93L20O0j96L79m13P2J54
2752B96m9K13j92j52O2r2k44K91R4l17L02k98m4K44k75l9J59m63L6K47j83K8J61
2775b15k23L91j70k19J95Q6m31N24k03J36Nq6j30O50n29j79M44k60m0N70k55N6
2797A17J53k32M11l50R8K63k58l14M39k31j5M05l75K63J84n23L28k03q0K67J22
$$ plain form
2639 -441 -135 -460 -445 -109 -238 -220 -384 -367 -115 -364 -609 -293 -185 -303 -185 -360 -346 113 -310 -375 15 -214
2661 -214 -334 189 -370 12 404 -310 -24 191 -130 299 249 -16 443 243 215 258 282 204 652 428 53 461
2683 461 -127 395 295 63 258 453 256 403 7 37 80 96 19 246 17 -266 40 -270 -105 148 -81
2704 -81 -135 86 -316 -412 73 -226 -284 -50 -71 -163 -277 -432 152 -239 -272 -306 -188 -149 -120 -324 -330 46 -105 -111 68
2729 68 -331 77 122 -113 380 404 60 326 346 -8 443 323 256 333 213 -80 240 300 104 483 70 142 296
2752 296 247 460 268 116 178 86 -158 133 227 -90 212 -86 -130 114 -161 -200 -41 -504 -468 -221 -404 -376 -215
2775 -215 -438 -47 -217 -436 -241 -155 -586 -62 -265 -129 -124 -210 -340 310 -219 -398 46 -214 -254 316 61 117
2797 117 270 38 449 99 197 460 202 -112 327 96 81 486 111 374 558 35 363 160 80 347 469
2818D69m45J33J27o9l04K89l12L48l2j65Q0j31l03K84k10Q6K51n31K77J94l99
2839c63J56j11Q0J48k24j89L13r1OK29k45K66n8k55J35Q5M1L4J62k49J99j1l53
2862b95M34J05l97L91J86k35j55L71j97M8K90l03K72k46k30K24K07j20j6k10l7
2883H7L93l16j8k53Q2J99j56N7O0k7l77K40J75k72J40m93L54j08O1L0k6l32L23
2906a77k8l21K99J02m9o3n1j40L83q5n09O00J51l05K27j49p5J39j30kL32k85j19
2929b55N94r7m4p4qK27k74l5K12p6j44L05k00N4R7Ol01N03l78k23M86k81j66M42
2953C70k74J00j93o0J83q1l21M00k42k68L13j52J42P8k68o4N68n28PL4j35O9l5
2976c57K07lj87J10J8J66k16K77k30K20j7K27j60J17k39K05J15j44pK36j39K92
$$ plain form
2818 469 24 157 284 215 -89 200 -112 236 204 39 119 -12 -315 -31 -241 -155 96 -435 -158 36 -363
2839 -363 -207 -318 -238 -90 -314 -503 -190 -281 -275 -46 -291 -25 -83 -338 -203 -118 -77 -43 119 -130 69 58 -295
2862 -295 139 244 -153 238 424 189 34 405 208 256 546 243 515 269 39 263 470 350 334 124 87
2883 87 480 164 146 -107 -25 174 18 75 135 108 -269 -29 146 -126 14 -479 -125 -233 -172 -142 -168 -500 -177
2906 -177 -205 -526 -227 -125 -174 -237 -288 -428 -45 -130 -639 -39 112 -193 34 -115 -190 -51 -181 -183 149 -136 -255
2929 -255 339 242 198 124 116 343 69 34 246 170 26 331 131 185 282 288 -13 490 112 -111 375 94 -72 370
2953 370 96 196 3 -57 126 45 -276 124 -118 -386 -73 -225 -83 -5 -273 -337 231 -297 -290 -256 -391 -322 -357
2976 -357 -150 -153 -340 -230 -212 -46 -262 15 -215 5 -12 215 55 172 -67 138 253 109 102 338 199 491
2998D91m50k01M36o3m72N98M9m10M54k27J04K5k77o3K46l24jM58m45J63L12l58
3020D5K79j65k48K28r3p1Q4k69l0J28j04j25J18q8R9O7k79M7K28l76L93r7jK01
3044b9N3l02K84k13P5n5P5O6K57j02o9n8q7J70L1j78K0M31l10J8R0j59J08J36
3068B52k35J51R4j9m0k50K05K89m05K45J34l98M72l89R8l83K34J16q0km50L67
3090Fj2L8Q3j52P1j22Q1J41j08m77L61K99p71K06K05j3nN8k15O4j38L28J93l06
3114a85k29M28j15l8M79n32J57J97k16J44J0j91L75p3j99L49k06K66l35J52j02
3135A36L81n08J68J13k26J83J67k18j28Q1p0j02N21n62J95r5p2n5J00o49Q39k42
3157d3p5J83l24J11K07k33nJ87l57J63K71j56l78Q8n9K25j14L48r3k77o7M01q6
$$ plain form
2998 491 41 -160 276 213 -259 339 388 -22 432 205 309 334 57 -6 240 -84 -85 373 -72 91 403 45
3020 45 324 159 -89 139 46 -25 59 -210 -240 -112 -216 -341 -223 -311 -212 -145 -424 -377 -149 -525 -132 -229 -230 -29
3044 -29 24 -278 6 -207 -132 -187 -112 -46 211 109 40 -18 -105 65 96 -82 -62 369 59 77 167 8 116 252
3068 252 17 168 262 243 203 -47 158 447 42 287 421 23 495 106 204 -179 55 171 91 89 -361 6
3090 6 -6 32 115 -37 34 -88 -7 134 26 -451 -90 209 -562 -356 -151 -164 -169 -111 -326 -262 -400 -72 121 -185
3114 -185 -414 14 -101 -139 340 -192 -35 162 -54 90 100 -91 284 211 12 361 155 421 86 238 136
3135 136 517 9 177 290 64 247 414 196 68 149 79 -23 498 -64 131 36 -36 -91 9 -640 199 -43
3157 -43 -118 65 -259 -148 59 -174 -179 8 -349 -186 85 -71 -449 -361 -420 -195 -309 39 -54 -331 -398 3 -83
3180h3j75l2L50n1K77m83M61Q5n67qM13k58J70J49k54M37n18K40N4o8j97L85Q1
3203D08N8k28k21L41R0k46L9P1k86N9N08n19J48j11n79P43n60J45l6K85l61l9
3225b91j01K51m1M6j90K15o3J4j2l10L95k30J35j7r8J54k65K85qkj03o2N61j74
3249H9j9J03l64Q9K55k73J92J46k78J83L03k21l7q7l5J00J86j94M64m42j39K59
3271B80o2N8J33l32J37J66l37M1J85Jk37K00m58P45o78J18o2j80K16L7l06L73
3293C8j83j50J35J46k31j32M59m49K02j63J38Q3m1j10L46j83k23Q7k0J37J44l09
3315b79K45K21o17N18k01L11p2k22K86n4q4j42K34p4J75J77m31M2L66j02k43O8
3337A22m7k0J52k01J19j09P9M6J01l04L77k57j94O14n51OJ60j9j79R8j58J48K53
$$ plain form
3180 -83 -258 -290 60 9 286 -197 264 349 -218 -226 187 -71 99 248 -6 431 -87 153 207 139 -58 327 408
3203 408 466 238 17 358 448 202 241 312 26 85 593 74 222 111 -468 275 -285 -140 -176 109 -252 -291
3225 -291 -392 -141 -182 -136 -326 -111 -174 -160 -172 -482 -87 -317 -182 -199 -297 -143 -408 -123 -131 -133 -236 -298 263 89
3249 89 70 173 -191 -102 153 -120 72 218 -60 123 426 205 168 81 46 146 332 138 602 160 21 280
3271 280 218 276 409 77 214 380 43 84 269 270 33 233 -225 520 -158 -40 -102 -282 -66 -29 -335 38
3293 38 -145 -295 -160 -14 -245 -377 82 -367 -165 -328 -190 -107 -148 -258 88 -95 -318 -231 -251 -114 30 -279
3315 -279 -34 187 -430 88 -113 198 126 -96 190 136 52 -90 144 70 245 422 -9 33 399 297 54 122
3337 122 75 55 207 6 125 16 95 141 242 -62 315 58 -136 478 -73 -67 93 74 -105 -7 -165 -17 236
3360B36m20J94k75m4K4j55J21L19j89q4J06J84n56L72J28j05Q5Ll0R6l6QQ5k52
3384a85M89m53K99L3n2k00L06J30m91J69j2O3j4O3r0J02Lj82K27m8J81K7k71j58
3408f4K13k17K56L6l31P9Q3k89L03k89K50J78m10J93k31k2j90O54o15J00O2J66
3430h5j64P6n4j09K18k70K45j2P7Lk43q0K29q8J15L22j36k95K60j35K81l30m7
3453b22L07j04J29o1M7p8M95l53j66J57Pr4J20P6j57NP4N7q7j46O2J18J38k60
3477F4J9m9q9L41r8l0l72L55r6l44L07J55m68J18R3r9k26M34l19L11J5l67L22
3500b3k93p1K26q6K62m2l77K63L89k45L0K18l93jK4L28k65N62o42M34j19l08K15
3523H6J43j10J04k44O1L04l65J73k4k6m1K44l36J59K07l91p1K89j67K92k86r1
$$ plain form
3360 236 -184 10 -265 -309 -285 -440 -319 0 -189 -273 -167 17 -539 -167 -39 -144 -59 -56 -86 10 -26 -18 67 -185
3384 -185 304 -149 150 183 131 -69 237 367 -124 45 33 96 82 145 55 157 160 -22 205 157 338 365 94 -64
3408 -64 149 -68 188 224 -107 -28 55 -234 69 -220 30 208 -202 -9 -240 -262 -452 202 -413 -313 -251 -85
3430 -85 -249 -173 -227 -336 -118 -388 -143 -155 -78 -75 -318 -398 -169 -257 -142 180 44 -251 9 -126 155 -175 -222
3453 -222 85 -19 110 49 96 18 513 160 -6 151 158 64 184 260 103 108 182 239 152 6 68 186 324 64
3477 64 83 34 -55 286 188 158 -214 141 45 -299 8 163 -305 -187 -94 -193 -419 15 -304 7 22 -345 -23
3500 -23 -316 -387 -161 -247 15 -27 -404 -141 248 3 33 251 -142 -143 -119 209 -56 506 -136 298 179 -129 86
3523 86 229 119 223 -21 40 344 -21 152 128 102 61 305 -31 128 335 -56 -127 162 -5 287 1 -90
3545i0L12j98k39q0O3P7K70l01r5L14O1l05J45n2m3K05m19m5M48l88J54m7J92
3568f1j21k0j15jm2L24k0%J19p4J56k59N5J9K16j81j23M01P7n47K40K09k05J96
3592B43Ok30N3L2L1j02j10J01k2J37k03L45n60L77J07k51J89L7j55J79j10p5O6
3615H5m19N6LJ37J14J06l16lk2J6Q3j27P1J22l52K70J76j03m25N06m0n3P2j12
3639a55l9L05l21j58O00l11L06p9l10L80p5k50O01k15n40L66K6L1O6J17l02J52
3661A95k25K25J51m33N20l05k61J85N8J60oo2k23p6J21Q0l45K93j35m3K1j69J97
3684g7lR7j80j82K44m5j31J63M04o36J49J06k1J23l44O2K04j5j9po8N1J16L7J02
3709A30j16K3J85j42J25k01K33k95O4J55m4j8j56L83l0l60K16pk15L63o8k07J90
$$ plain form
3545 -90 222 24 -215 -295 -232 -155 115 -186 -281 33 94 -211 -66 -118 -161 44 -375 -420 28 -360 -206 -253 -61
3568 -61 -182 -202 -317 -318 -360 -36 -56 -56 63 -11 145 -114 -59 -40 176 -5 -128 273 350 -197 43 252 47 243
3592 243 249 19 72 104 135 33 -77 24 2 139 -64 281 -279 98 205 -46 143 180 25 204 94 19 85
3615 85 -334 -278 -275 -138 -24 82 -234 -237 -259 -243 -160 -287 -216 -94 -446 -176 0 -103 -528 -22 -62 -115 -43 -155
3639 -155 -194 111 -210 -368 232 -79 227 148 -162 218 143 -107 494 279 -261 105 131 162 228 345 43 195
3661 195 -30 195 346 -87 433 128 -133 52 110 270 264 202 -21 -97 24 104 -241 52 -83 -126 -105 -274 -77
3684 -77 -80 17 -163 -345 -101 -146 -277 -114 290 -346 -197 -91 -112 11 -333 -271 -67 -82 -101 -108 -176 -125 -9 28 130
3709 130 14 37 222 80 205 4 237 -58 6 161 117 99 -57 326 296 -64 152 145 -70 293 225 18 208
3732B08k6p0l30L44J1j48K8J20Qk60j15L40jk16J80n68N37N0k12l76M14k32L15
3755Aj14p6n7K35l22K9J81j68L93p93P02n2p5p0q1J37R7J69l44L7K02j45L59j80
3779F5l00N58Ol52J71L2j98K73j01j24K48m68J46M58l37p8J62M8j36J1J68k32
3801B0K06r7J28o0q6q3k9q6M04k97N3Q8l27J19j61LK80k2l84J68j16M3K2J88j77
3826b03qK94m91L93o7r2K41j66n1O2p4P6L2K53k99K18J21m14L73l91M47l06J4
3849c8K93k66L07j03j52j47M03k11n4k0Kp9L03n2O8K00m60J43j16J8K72j42l6
3872A33j70j65J50J21k21J2J04j27J49m70M93K4j41j10k7J26l85L80m4lL1J46
3894Fl73K52j29K01L7kk93M24j01j53K10m3j55M23l97K67j37qN1K00l58J82N9
$$ plain form
3732 208 182 112 -218 126 137 -11 17 137 145 -115 -230 110 109 -107 73 -495 42 92 -120 -496 -82 -314 1
3755 1 -113 -189 -246 -11 -333 -304 -123 -291 102 -691 11 -41 -116 -186 -267 -130 -33 136 -208 -171 31 -114 245 65
3779 65 -235 323 329 -23 148 180 -18 255 154 30 278 -190 -44 414 77 -1 161 209 73 84 252 20
3801 20 226 129 257 197 111 28 -1 -87 317 20 73 161 -166 -47 -208 -205 75 53 -331 -163 -279 -236 -214 -26 -203
3826 -203 -211 83 -408 -15 -82 -174 67 -99 -150 -88 -162 -86 -54 199 -100 118 239 -175 198 -193 254 -52 -38
3849 -38 255 -11 296 193 41 -106 297 86 32 12 14 -65 238 186 254 454 -6 137 21 39 311 169 133
3872 133 -37 -202 -52 69 -152 -140 -36 -163 -14 -484 9 33 -108 -218 -245 -119 -504 -124 -168 -171 -140 6
3894 6 -367 -115 -244 -43 -6 -8 -301 123 22 -131 79 36 -119 304 -93 174 37 29 80 280 -78 104 163
3917A63q3j7K21j11P4j41k01J78o3k02M24l64L50M29o94j63J73m4K1j38K53k00
3939a35M31l05j56j9q4N4K03p4j86K43j76j5j00K30k93r1K49l5p0L60k60J65J1
3962e3J7k72L38k81O5K21J49m77K86Q0M9J82m63L89o0p3L0J58l75K22k25O2mJ22
3986H7M0K88k63LJ12o7N9P8l76K86j45k45M47n02l3J33J16J66n2j11K5k60J49
4009f5j95M40n5n64K08M6J24M1j30L2j46K10j30N6Q1K54m01J4k13M53k02J60k4
4032fR5q5j4k40K28K94n18L21k44N20l7l22MJ65N0RJ21k26J45J55m20J83Q2l38
4056g8L29k25M4k0J6J46J91o21K37J97m00N64k28j89L82l42j10j78J82J1j50j48
4078c90M90j96k16K70j48j98K55N3Q2P1Q1m35M46k87m70M85M7K40j78k25K97j56
$$ plain form
3917 163 80 63 284 173 247 106 -95 83 20 -182 242 -122 228 657 -37 -200 -27 -71 -50 -188 65 -135
3939 -135 296 -9 -165 -184 -268 -214 -11 -85 -271 -28 -204 -219 -319 -89 -382 -473 -224 -259 -329 31 -229 -64 -53
3962 -53 -36 -308 30 -251 -186 35 184 -293 -7 73 122 304 -159 230 170 97 127 285 -90 132 -93 -31 -35 87
3986 87 127 415 152 155 267 200 259 337 -39 247 102 -143 304 -198 -231 -98 18 184 132 21 46 -214 -65
4009 -65 -260 180 125 -439 -231 -185 -61 -20 -150 -118 -264 -54 -184 -128 -47 207 -194 -180 -393 60 -142 18 -6
4032 -6 89 4 -10 -250 -22 272 -246 75 -169 351 314 -8 -4 161 211 220 341 115 260 415 -5 178 260 -78
4056 -78 251 26 70 50 66 212 403 -218 19 216 -184 380 152 -37 345 3 -107 -285 -103 -92 -242 -390
4078 -390 100 -96 -312 -42 -190 -388 -133 -80 2 73 154 -281 165 -122 -592 -107 -60 180 2 -223 74 -82
4100h2R3O1j71j06L07j99k8L37J10k71J29q5N5J37m04K48M12m20m39O32k41L85
4122D60l70L5J51l71J36R6q3k08K37k36J31Q3KK58m87Q7L7j24J00P9k05j82M05
4145C1j00kr7J63k40J7R0J12k06K64l88L52Qj02k33N41k98N2j27Q7J59j55J22
4168E0j43J56j13L78m61K25m8j43L77j60l43L19r7N7J30k8L9m9%k5o7j53J01O
4192Hkj00J05j53K64j23o5J01k70l3L24j90m0p7R0J24l3k53J98K69m22L90k28
4215a16j15N8q2J4K34j88K2J55r6pK2L37l28J53L9l7K15m15k3K68j06J52j81K52
4239B27l2q7j27L53l91M6J90j83J91L3l62K49J23k42P2J31j96L73l22k37K32m6
4261eo6J5J79j19j70P7j24L25q8J2l7k79K16K54l77O7j17J72l2K3N4jJ20k41K74
$$ plain form
4100 -82 11 72 -99 -205 102 -97 -125 212 322 51 180 95 150 287 -117 131 543 123 -316 316 75 460
4122 460 90 125 276 -95 41 137 54 -154 83 -153 -22 61 63 321 -166 -79 -42 -166 -66 13 -192 -374 31
4145 31 -69 -71 -168 -5 -245 -228 -138 -26 -232 32 -356 -4 4 -98 -331 210 -88 -36 -163 -76 83 -72 50
4168 50 -93 63 -50 328 -133 92 44 -99 278 118 -225 94 -3 54 184 156 195 146 146 121 54 -99 2 8
4192 8 6 -94 11 -142 122 -1 -66 35 -235 -268 56 -134 -174 -251 -161 -37 -70 -323 -125 144 -278 112 -116
4215 -116 -231 -173 -255 -241 -7 -195 -173 -18 -114 -121 -99 238 -90 63 102 65 280 -135 -158 110 4 156 -25 227
4239 227 195 108 -19 334 -57 -11 179 -4 187 220 -142 107 230 -12 60 191 -5 368 46 -191 41 -5
4261 -5 -71 -56 123 4 -166 -89 -213 112 24 36 -1 -280 -64 190 -187 -120 -237 -65 -97 -74 -20 -21 99 -142 132
4286A32k88J06M2k20K04M2j13J23J7Q2l31M20k15J7p0k09J34J12J62n0j19J40
4308A18M7k25K11Q3o9J4j67K27l89M47j42P1l00Q6O1J34N0l32l2k4J81j30m2M81
4332C59l06l44L12p3kJ0M3or6J73J2q2L6j73J91k81L4K1j9K52k33p9R0m3J56J05
4358E7p0j10l9qJ06n0P2%J38r2J11R6k54Q7MQ1Jp3J0J88j29m1K97l54k4J03j11
4385dQ0j78K97P2m58K00j64L9J9N5O6l98L90m75N23q7N1j28k75K49j86L54n68
4408e26L42L46l23J11l08J75J76n0p8RL7J33q8J40k31j1j06L40j39nR3J0Q4p8
4432E3J84m15%L41q7k5J83k06j1K33N2L4l21R2n3o8K88l83K84L41l12J40l75j9
4456e0l4L24j52M2k88R9j32K27k81J19J77r4k08K27K00j34k39K03n1J18j33j5
$$ plain form
4286 132 -156 -50 -8 -228 -24 18 -95 28 45 127 -204 216 1 18 -52 -261 -127 -15 147 97 -22 118
4308 118 165 -60 151 234 165 179 12 239 -150 297 155 226 -74 12 73 207 257 -75 -107 -131 50 -80 -122 359
4332 359 53 -291 21 -52 -54 -44 -1 -7 -103 70 82 0 36 -137 54 -227 -193 -172 -191 61 -172 -251 -161 -204 -48 57
4358 57 -13 -123 -162 -170 -64 -114 -42 -42 96 4 115 211 -43 44 48 129 130 57 67 255 126 85 382 28 4 107 -4
4385 -4 76 -102 195 267 -191 9 -155 -116 -97 -42 24 -374 16 -459 64 -23 28 -100 -375 -126 -312 42 -526
4408 -526 -184 162 -161 -50 -358 -183 -7 -57 -135 -126 -89 44 -44 96 -135 -146 -252 88 -51 -56 37 47 131 53
4432 53 237 -178 -178 163 76 51 234 28 17 250 302 336 15 107 54 -14 274 -109 175 516 204 344 -31 -50
4456 -50 -84 240 88 130 -158 -59 -191 36 -245 -126 51 -43 -251 -24 176 42 -197 6 -45 73 -60 -75
4478g5J54l74L02j26k87K33K57j88J91J9j93M39n56J51J77j14q5P9M6k05K42K7
4500A14K28l60jO6O5k28%R8J73j18o1K85L7j57k88K65J2m94L64J93Q3l78k3k34
4524c59K25K45k41R5j00j97K05Q8M31m74J91k17PM4J28j52J44pk07J7K7k20K63
4547f4j50L8L05j0k58M1J76k14J17J2L9J08j10j76K29O0j71P4L15n8l49LK19j97
4571b1M73j48k19k29J94l7J95L2j67L9k77J16M6J29rl7j36j75L48l95L52j81P5
4594c2k48K78j20r8Q0L3j33K87j2k02K43k46L56m62PK47p1J19o9j13J16o2P1l2
4618f3J0k06J45q0N89l16o7j34P2m0J6K52Q7k19J04J3rk55K72j64Q9k23n1L99
4642B21k53K86l10k12J21QQ1j1L28p6N6l3l52L0J56j68K33k07K84N1j54j80L55
$$ plain form
4478 -75 79 -295 7 -119 -406 -173 84 -104 87 106 -87 352 -204 -53 124 10 -75 4 50 -155 87 114
4500 114 342 -18 -19 47 112 -116 -116 -18 155 37 -24 261 298 141 -147 118 130 -364 0 193 276 -102 -125 -359
4524 -359 -134 111 -130 -35 -135 -332 -127 -39 392 -82 109 -108 -101 -57 71 -81 63 56 -151 -134 -107 -327 -64
4547 -64 -214 -176 129 119 -139 -98 78 -136 -19 -7 32 140 30 -146 83 143 -28 46 361 303 -46 -43 176 -21
4571 -21 452 304 85 -144 50 13 208 240 73 112 -165 -49 -3 126 117 80 -56 -231 117 -278 74 -107 -32
4594 -32 -280 -2 -122 -220 -140 -107 -240 47 35 -167 76 -170 186 -276 -269 -22 -93 26 -43 -156 -40 -102 -31 -63
4618 -63 -53 -259 -114 -194 395 79 12 -122 -50 -90 -74 178 265 46 150 163 154 -101 171 7 96 -127 -178 221
4642 221 -32 254 -56 -268 -147 -139 -58 -69 259 183 239 206 -146 -116 40 -128 105 -102 182 233 79 -101 254
4665B54l27j2L0o2J97j04j15J38J24k81l8J22j08L17k30k04L44k85K7K18j16J85
4687G4r0r8L50k42P5Kj30j2L48k02k12K74r3J94k52O0M0q6j24M45m0l51K79L09
4711E18m84mK59k40L7k4N6j34J73l06K89k17M0k6Q4R7n72N91m9m5l80O2J78R6
4735al22J99O0J22j36P9J37k32j56J38Ln2K43P3k91N6N9N9j14J9m1K9q7J7P4J36
4761G1j00k1L1J61L08m57J58J5j54m0R6J49j59Q9r1r7Q0O9J82j36J9j60k97L70
4785H6J79l17L9J49R6q1j78j17K31l10K84N9k29l8j97K08J35o9j67L22j96K30
4807A19o8k85J96K75l54n9p2K30j10j72J50J3K22r6k22L38k8q0l8j31J90M1K1
4830H0K0N8j1Q3K67m80k67K68k15K12J02q5qj43r9Q8j6P0J74r4R0n0j08L9K15
$$ plain form
4665 254 -73 -85 -55 -117 80 -24 -139 -1 123 -158 -196 -74 -182 135 -95 -299 45 -240 -213 5 -111 74
4687 74 -16 -114 236 -6 69 71 -59 -71 277 75 -137 137 44 238 -14 46 86 0 -124 321 281 -70 209 518
4711 518 34 30 289 49 86 62 118 -16 157 -149 140 -77 -37 -63 21 118 -454 137 88 43 -337 -275 -97 -1
4735 -1 -323 -124 -64 58 -78 1 138 -94 -250 -112 -109 -161 82 155 -136 -80 -21 38 -76 -57 -98 -69 -156 -139 -65 71
4761 71 -29 -50 -19 142 450 -7 151 166 12 -28 68 217 58 147 56 -41 39 108 290 154 173 13 -284 86
4785 86 265 -52 -13 136 232 151 -27 -144 87 -223 61 120 -109 -147 -344 -136 -1 -70 -237 85 -111 119
4807 119 51 -234 -38 237 -117 -176 -248 -18 -128 -300 -150 -137 85 -11 -233 105 77 -3 -41 -172 18 59 80
4830 80 100 158 147 230 497 17 -250 18 -197 15 117 32 24 -119 -218 -130 -146 -76 98 4 94 44 -64 -25 190
4855A90l11J47%R2m3k72N7K17k89K28k5r3R1N7m6J13k58K10k16J24k8j00P4q4
4879a65j56L12k33K23L6J50j26k3n6k7J23k16J83j63J65k46L62k70L23j12K14
4900B98j37k41j56K49j88Q7J45j64L87j53n3J5m9K58m61k0K89qN7p4j19m2n9Q3
4924e6l3M3o0l03L27RRJ31J45p6l63J55k8q3Q1n5L1m0N53n28p3K26k37j7L21O0
4950A39o0j00m5K25n6q3q2O3K01k25J97k22L05m05N44l58j7P4j42J67R5m5m8k24
4974a02J50o3K84k31J77m1l02J07J82k17k72N44r6q8o4m3J99q9R0k48J07o7pK2
4998f8o5K44k37M4j01K14j82L75m26q3J88P8o4K88n54M7Q5J40o6j77M89m4j20
5021Ek5M6j36M34k44N4j58K77m1r3q5j58J78J36l13o3J73J12K10j53k47n2J17
$$ plain form
4855 190 -121 26 26 118 75 -197 -140 77 -212 16 -9 -102 -11 46 0 113 -145 65 -151 -27 -55 -155 -81 -165
4879 -165 -321 -9 -242 -19 17 167 41 18 -38 -65 58 -158 25 -138 27 -219 143 -127 196 84 298
4900 298 161 -80 -236 13 -175 -88 57 -107 280 127 74 89 40 298 -163 -183 106 98 155 81 -38 -80 -139 -56
4924 -56 -89 -46 -106 -409 -82 -73 -64 67 212 136 -227 -72 -100 -183 -102 -157 -126 -166 387 -141 -214 12 -225 -242 79 139
4950 139 79 -21 -66 159 103 20 -62 1 202 -23 174 -48 257 -148 396 38 21 95 -47 120 215 170 122 -102
4974 -102 48 -15 269 38 215 174 -128 -21 161 -56 -328 216 120 32 -32 -75 124 35 125 -123 -16 -83 -90 -68
4998 -68 -133 111 -126 -82 -183 31 -151 224 -202 -285 -97 -19 -83 205 -349 -302 -217 -77 -143 -320 169 125 5
5021 5 -20 26 -110 324 80 134 -24 253 212 119 34 -124 54 190 -123 -186 -13 99 309 156 -91 -143 -26
5044b6O2L21m25M2l2J70j67k39L53Nr6N0J69k52N8J59r5k90K21m9J32j60k2P0
5068d1n9QK44k58M9M7L05l04l7m8J78k21j7j1K68k32n8J34J67r1Q2J4k69Q7K46
5093A83K95l64rKN4j59R9l58M56l9k29M60l50L4k80K76j05J07j19L2J50k83R5
5116e2OJ07K02l02j27M33k85K63l64k78J07K95O5l21L99j30j75J09J30O0k65l8
5138a61J22O6j63J94k5j73P1J78k55J29J27M4r8JJ72k06J12L3Ok64l7P3K32q0
5162I8j47Q6k64L13J66o3j04K35m2j01j94O1O9K1Kp9K40j05j50j23j3J84o8l35
5186c13M64k01q2o3O9k1J98j69K29k3Rk11m6J26j8j10L03m6j87j00j4K61M1K0
5210A16o9K11k54ml2j37L91l16J01P1k41K53j32K53P1l12K5J60q7L4J2Rk59K00
$$ plain form
5044 -26 36 357 -68 -26 -58 112 -55 -294 59 64 -32 18 187 -65 -7 152 57 -233 -12 -61 71 -89 -111 -41
5068 -41 -100 -92 152 -106 -57 -10 295 -9 -46 -94 84 -137 -154 -165 103 -129 -187 -53 114 23 105 119 -150 -63 183
5093 183 478 114 105 107 161 2 101 -257 199 160 -69 391 41 75 -205 71 -34 73 -46 -14 136 -147 -52
5116 -52 -46 61 263 -39 -166 267 -18 245 -119 -397 -290 5 70 -251 148 18 -157 -48 82 142 -123 -161
5138 -161 -39 27 -136 58 33 -140 -69 109 -146 -17 110 154 56 57 229 23 135 168 174 -90 -127 -54 178 98
5162 98 -49 37 -227 86 252 189 85 320 278 177 -17 44 113 134 136 57 297 192 42 -81 -94 90 22 -313
5186 -313 151 -50 -132 -195 -126 -147 51 -118 111 88 97 -114 -160 -34 -52 -162 141 95 -92 -192 -206 55 96 116
5210 116 47 258 4 0 -32 -169 222 -94 7 78 -163 90 -42 211 282 -30 -5 155 68 102 114 123 -136 64
5234F4j41N7j83K12L8r3n0L24k74l33N49m13K24P8k22J11J40r5k8l88L87K38j22
5257H0jJ38k68J12l71J69K08m11N44m0k03R2k29K40k29K84j44N6l9l82K42J57
5279EP2l33L39J24O7j58j65J8K06m59L78J12Q9k78j07J30k34k9L14r0k9r7p0J52
5303d3K44m6%o1j23N5n4O5K9m7n8J25j7k1l0K25k83K10l01K22k16m2L00k13k93
5328c73K32J13j94J68J2J01o0j5j11J28m2K48k49r0K88n08J66K53j54K2K3R1J79
5351B28k40J14J26j88L33j19j12k37o3J98O6j69K16j65J36j06M2L7K06k04O1j84
5373b4J5J90j41K81l96K11k60k3J97r4l0N8K2N1ok05J70L6j56K87n15M38l53P5
5397a72K86j04j28j51L0L30k06L5N1L3j54J38j25J48q2J60r3J34n6k1j21R9R7
$$ plain form
5234 64 -77 -20 -203 9 47 -46 -96 228 -46 -379 170 -243 -19 59 -163 -52 88 -7 -35 -423 -36 202 80
5257 80 79 217 -51 61 -310 -141 67 -344 200 160 -43 49 -180 60 -169 115 -29 27 -12 -394 -152 5
5279 5 77 -256 83 207 274 116 -49 -31 175 -284 94 206 295 17 -90 40 -194 -223 91 1 -28 -125 -195 -43
5303 -43 201 155 155 94 -29 26 -28 37 66 19 -39 86 69 48 18 243 -40 170 -131 91 -125 -167 133 -80 -373
5328 -373 -141 -28 -222 -54 -42 59 -1 -16 -127 1 -41 207 -42 -132 156 -352 -186 67 -87 -65 -42 49 228
5351 228 -12 102 228 40 373 254 142 -95 -158 40 106 -63 153 -12 124 18 60 97 303 99 160 -24
5373 -24 -9 181 40 321 -75 136 -124 -147 50 -44 -74 -16 6 57 51 -154 16 52 -104 183 -332 106 -247 -172
5397 -172 114 10 -118 -269 -239 91 -115 -80 -29 4 -150 -12 -137 11 -71 89 -4 130 74 53 -68 31 128
5420A28J9m7J34j29j44J4K4K76m13K78j49K49k01L8MK24l6m59K76J49k62o9J9
5443g7k42J34K81j24J68m12J70M8k9Q9k92J36K13k34L33K68l95O7k20M5k39K06
5465a06o7K34k1j27K70l03K01k63k95M59J7P4m1j4n0K38k28o0M8r5K95l94L54
5488A26n5N4P1j77P3J35k80k07O68k65n6L5r9K16j62p9K03J5k85J46j26L0J18
5511I9p7k6j49R3j07J32J69k97K33N2l22L1J06j21K78k50N7j01N8O0j70L31P6
5534A55j48Q9l54L38j71J27j57Q6j48L07M7k92K32N3j4r5J16k40K43k81L39m76
5556b44L13k70J02J91j03j0j45l6L49m9j26J98P4m60L09r2j29K33j21onQ4m36
5579c79K35K16lr9Nj82L13k78Q2L6j30K93m4m89K29K12qj5p0K94l26L06j51j53
$$ plain form
5420 128 147 100 234 105 -39 -25 -1 275 -138 140 -9 240 39 77 81 305 269 -190 86 235 -27 -96 -77
5443 -77 -319 -185 96 -28 140 -272 -102 -54 -83 6 -286 -150 63 -171 162 430 35 102 -118 -73 -312 -106
5465 -106 -173 61 40 -87 183 -120 81 -182 -477 -18 -1 73 32 18 -32 206 -22 -82 -34 -129 166 -228 126
5488 126 71 125 196 19 92 227 -53 -260 408 143 87 122 23 239 77 -2 201 216 -69 77 -49 -19 99
5511 99 22 -4 -153 -60 -167 -35 134 -163 70 122 -200 -169 -63 -184 94 -156 -99 -200 -142 -82 -252 79 155
5534 155 7 96 -258 80 -91 36 -121 -35 -183 124 171 -121 111 164 150 55 171 -69 174 -107 232 -244
5556 -244 69 -201 -99 92 -11 -21 -166 -202 147 98 -28 170 244 -216 93 1 -128 105 -16 -22 -27 57 -379
5579 -379 -144 72 69 -30 -25 -207 106 -172 -90 -54 -184 109 65 -424 -195 17 9 -6 -76 218 -108 198 47 -106
5603a06K86k20j01K54k27J74j50j18J18J76p5j79O6L59k68J62k2Lj55J48j68R1
5625D8j2K3O6L18m45mn4pM41n50O0J75j61L9K35j0J3j67j05J19J06j63J38j62
5649e9k6J62l73L58J04l17K59k58j8J21k46K67j51Q4P2o0k13K36R0j66J76K0J62
5672B24l05J79n3m4j63P9j1J55j53o5J70j9k53K69J57j08p2J17m17M61J29l90
5694a13J47J80Q7m12J47j01L11l15J74j0j70L16l71J72J33l43J65n2j63K14k66
5715b70KQ9K13J03rj50j78K62k33K04K6ok1k84l1N5J12r7L32J43k74J74k20k24
5739b82L24l02M61m22K16n5J6J77R5k6l10K68j11K20l79K48l51L58q4p1J06j79
5761h3q1K13Rj19P5J58k06J40k89J23K44l28K47J01j55l9J86k51l8j83O0J51j06
$$ plain form
5603 -106 180 -40 -141 113 -114 60 -90 -208 -90 86 11 -168 -102 257 -11 151 129 132 -23 125 -43 48
5625 48 36 59 125 443 -2 -6 -60 -67 374 -176 -116 59 -102 -63 172 162 175 8 -97 22 128 -35 103 -59
5649 -59 -85 77 -296 62 166 -151 108 -150 -168 -47 -293 -26 -177 -93 -21 -81 -294 -58 32 -134 42 62 224
5672 224 -81 98 45 1 -162 -83 -94 61 -92 -157 13 -6 -259 10 167 59 -13 104 -313 148 277 -113
5694 -113 34 214 301 -111 36 -65 246 -69 105 95 -75 241 -130 42 175 -168 -3 -55 -218 -4 -270
5715 -270 -268 -179 34 137 128 -22 -200 62 -171 33 59 53 32 -252 -283 -228 -116 -213 119 262 -12 162 -58 -282
5739 -282 42 -260 201 -221 -5 -60 -44 133 228 202 -108 160 49 269 -110 138 -213 145 61 -10 96 -83
5761 -83 -164 49 58 -61 14 172 -34 106 -183 -60 184 -144 103 204 49 10 196 -55 -93 -276 -216 -65 -171
5784a71O6K05j65j15N06n72OJ25j8J98k08J17J92r3j83J98n36L44M8r9K72j06
5806A1J9O4n8L0Nq2j23j43K87l1L9K6P8J59l52j41M12k87K04q4J39k27k99L61
5830GQ3j4m5j38J75r2j85K56n62L51K62k38O8M5k5J29j67M2J60j56j6K5n9L23
5854B29k7j05n32J94L70l99M35q6LK6l1k22J43o6N7r9J44N4k50P1O6K04j53l8
5878a2K21j98mM0j65M9oj33K22j13J50q6J75j0m2j45M3l5L42k79j7N49k71m98
5902b23M43l89o6L27j26K5k48M16j55j61n2L25n0l56L77n6o9n4J68m80K56j02
5924b50K27p4Rq3L52k78j88M24r7j87k32L60JQ5O6k66K40Op7Nl2q5q4O9K14n2
5950G3k30K51k85K06J18j84p6K24O2k24j55J77K29m5j38l02K49M00n26J89n4j12
$$ plain form
5784 -171 -105 100 -65 -180 326 -246 -240 -115 -133 65 -143 -26 166 73 -110 88 -448 -104 -56 -155 117 11
5806 11 30 94 36 66 71 -11 -134 -277 10 -21 18 44 122 281 -71 -212 200 -87 117 33 172 -55 -354 7
5830 7 90 76 31 -107 68 -24 -209 47 -515 -164 98 -140 -72 -27 -52 77 -90 -48 112 -44 -60 -35 -94 229
5854 229 202 97 -435 -241 129 -270 165 79 82 108 77 -145 -2 -68 -11 -110 34 88 -162 -91 -25 179 26 -12
5878 -12 209 11 7 47 -118 -69 -75 -208 14 -99 51 -35 140 130 88 -57 -14 -49 293 14 -3 546 275 -223
5902 -223 220 -169 -235 92 -34 -9 -257 159 4 -157 -209 116 66 -290 87 31 -38 -92 76 -404 -148 -250
5924 -250 -23 -97 -88 -171 181 -97 -285 139 42 -145 -377 -17 -16 69 135 -131 109 115 38 43 11 -74 -158 -89 125 73
5950 73 -157 94 -191 15 133 -51 -127 97 159 -65 -220 -43 186 141 3 -299 -50 350 -176 13 -41 -153
5972a53P8J51l04L49j79n6P5o8Q1J05r9j82j56L48K7n0k11K11MK55J7l60K22j19
5996a4o2j90J07P3O2J13N8j20j71J62k19J23K98N2l49L85n1k78K15k92j16K94
6018H0k51J42K25j11r6J38k13J72Q6K5k62K98n0j64j18qK16m5q6j64J27k25L42
6041E8J72j61J31k50L1r0o6J89J06q5p2L31m43J52J07k96J4J96j67J44j2r2k9
6064a32J22q3J85lj58J21k61N5m5K83j63J88JJ56k43p5J04j8k09K43J47q4j80
6087d9k44N00j47m04L14L7n8O6j03Q2J0Rl53K27Q8O4k2j65J57J35l95K01j38K18
6111C0n3J5k00K40J22j57j90K90j80P3Oj90K57J14n9q0J9n9J26o8j94J23n9O8
6135fJ37j4l22L33N7l8o4r3O6q9j15j67O11n9k75J76j85J72q5k38L12L8k09N7
$$ plain form
5972 -153 -75 76 -228 121 -58 -114 -39 -107 -26 79 -20 -202 -358 -10 17 -33 -244 -33 -29 226 243 -117 105 -14
5996 -14 -76 -266 -159 -86 -24 89 147 27 -144 18 -201 -78 220 272 -77 308 257 -21 194 -98 -214 80
6018 80 -171 -29 196 85 -11 127 -86 86 172 197 -65 233 183 19 -99 -107 109 64 -22 -186 -59 -284 58
6041 58 230 69 200 -50 -19 -109 -175 14 120 35 -37 294 -149 3 110 -186 -172 24 -143 1 -11 -103 -132
6064 -132 -10 -93 92 89 -69 52 -209 -154 -199 84 -79 109 110 266 23 -52 52 34 -175 68 215 131 -49
6087 -49 -293 207 60 -344 -30 7 -51 15 -88 -6 4 13 -340 -113 -25 39 17 -148 9 144 -251 -50 -188 30
6111 30 -23 -8 -208 32 154 -3 -193 97 -83 -10 -4 -194 63 177 118 38 57 -2 124 56 -138 -15 -74 -6
6135 -6 131 117 -205 128 185 147 83 -10 56 -33 -148 -315 296 237 -38 138 -47 125 40 -198 114 152 -57 0
6159@p3l14N51n3k41K84k19K34k34N5j72J47J60j18K4J46l8r5p3k70M74j87r7
6182a09o0j19K03J10R5r8j60J21j62P2n7J30r1R9Nj44K61P1l5j96Q9r5J64p2L8
6207F0K7M4r9K64l75L42k31J24q7k12M13m91K20J7j20r8L16j37j3R3Q6k90K96
6230A49q8J94j95j80R6n2N3p5m6l6K31J49n1p8j65K75j01K5l71L8K94k20l1K55
6254G0k85O6J05N2M15l48r7K01mj4k45n2M8J60l61M46j49L13l43J48N6l14J79
6277D7j0J14n19N12j9k82K09K02m30M2J26J33j81o5K67j31K36l35O7k17K22K39
6299B27n3l73L2m5J79P7r7Q8k43N1J63L7j84N4J24j75M66l50j08m3J10q8O6Q2
6323cn5J45n2k77J70L4L31k77L1J59j97Jl08M18N6j72n6J56J1J2Rj26k41J32K09
$$ plain form
6159 0 -73 -387 164 111 -130 154 -65 169 -65 -10 -182 -35 125 7 31 177 139 44 -29 -299 175 -12 -109
6182 -109 -169 -288 -85 25 120 22 -138 -17 -179 -107 -164 -34 -125 -26 -21 -165 96 167 132 -64 25 -70 94 22 60
6207 60 87 131 32 296 -79 263 32 156 69 -143 270 -221 -1 16 -104 -202 114 -23 -36 57 143 -147 149
6230 149 61 255 60 -120 -24 -76 -23 -98 -144 -180 51 200 149 71 -94 181 80 105 -266 -228 66 -154 -185 70
6254 70 -215 -149 -44 8 423 75 -22 179 175 161 -84 -136 -88 72 -289 157 8 321 -22 126 182 -132 47
6277 47 37 151 -368 144 125 -157 52 254 -176 -134 -8 125 -56 -121 146 15 251 -84 -17 -234 -12 227
6299 227 174 -199 -167 -212 -33 44 -53 35 -208 -157 6 43 -141 -87 37 -138 328 -22 -130 -173 -63 -151 -85 -3
6323 -3 -58 87 35 -242 -72 -38 293 16 47 206 9 10 -298 120 176 4 -52 104 115 127 136 10 -231 -99 110
6348A10r0m8K99j04j82m7L58m01K49j1J00k00k02K88J8j71J25j29j6j98K64J5
6370B7k78L41k27l8m5O1K21J35k90Q2J04m4l03J23L05K50j74j39l65J12J28J09
6392I5JP4k62j56L25q3M5jN7p1j15J79k04l1K21J25j6j47M9k0k15J25K23k85K07
6417A20j41n5j36L23k13Q2J98k14P2m7j24k9J29N8j1m5n6J89k29J29J20q3Jj50
6441a12K82k70j6j02N21m08J65m0j23n3J82J40l29M24k22O4j12K6o1J0k42N0K57
6464C1j85N15j90k28Q6q5j36L46j81K01k84J99J17j32j33K42q7j69J35j6LK59
6486C08m26K6L42k25K29l08K76qj89l4L39m55NL46j28j94J71j82K5j65O7J61J40
6509A21j89p5j03J60K53l39R5Q9k15K92j33J76o9JJ74l47L10l54P4K16j26k09
$$ plain form
6348 110 20 -28 271 167 -15 -62 296 -105 144 133 233 33 -169 119 137 -34 91 -38 -54 -252 12 27
6370 27 -251 90 -137 -175 -220 -159 62 197 -93 -11 93 49 -254 -131 174 424 250 111 -254 -142 -14 95
6392 95 96 170 -92 -248 77 -6 39 38 95 24 -91 88 -116 -147 74 199 183 36 85 65 -150 -25 198 -87 120
6417 120 -21 -76 -212 111 -102 -20 178 -36 36 -11 -135 -164 -35 23 12 -33 -89 100 -129 0 120 37 38 -112
6441 -112 170 -100 -116 -218 303 -105 60 20 -103 -156 26 166 -163 261 39 103 -9 17 -44 -34 -276 -226 31
6464 31 -154 361 171 -57 29 -56 -192 154 -27 174 -110 89 206 74 -59 183 96 -73 62 46 49 308
6486 308 -118 -92 250 25 254 -54 222 214 25 -9 330 -125 -120 226 98 -96 75 -107 -82 -247 -180 -19 121
6509 121 -68 -143 -246 -86 167 -172 -77 12 -203 89 -44 132 63 64 238 -109 201 -153 -79 137 11 -198
6531a98K72J45k99J76k24M46j87q7L8l8L7K20k32J44Q3l28K07l70L82k93J57Q8
6553A39l10J49o0K70n6k82K60r8j76L8K81l53m4L02J18j91j46J43J02k08J91k81
6575b12l5l0J95O5Q1K8K82l82K49l49J72j72J57J02k09J6J12j97O3K44o4j7j76
6598g7K9pN6Q9j29MJ57q1L52m00k15K61k14N7J08lN8o3j38P3J81l05L33j77j24
6623a75K67r2L11m29J19j87K02j04J14n4J04pj80K43j66J32m0l30L31k17l8J14
6645h2M2l1J2l1O0j62J60P4k49J86K68j33N4k48J1K2j8k49M91j49M9K2o9L8J09
6670A77j73J43l69k0M35k22j5J82l10J48r1K77m87J72M09J66j81k00P9j88N9l3
6692d2L0OJ08k30K49Q0j19j10n9k38K64J19p1k1J20k46J77o4j66K72PK27k09k2
$$ plain form
6531 -198 74 219 -80 96 -128 318 131 44 82 44 81 301 69 213 296 -32 175 -195 187 -106 51 139
6553 139 -171 -22 -82 188 132 -150 110 12 -164 -126 155 -198 -242 60 178 -13 -159 -16 86 -122 69 -212
6575 -212 -247 -277 -82 -17 64 92 374 -8 241 -108 64 -108 49 151 -58 -42 70 -127 -64 180 116 99 -77
6598 -77 -48 -55 1 90 -39 -35 122 41 393 -7 -222 39 -175 -118 -10 -13 45 -18 -156 -83 98 -207 126 -51 -175
6623 -175 92 0 311 -118 1 -186 16 -88 26 -28 76 69 -111 132 -34 98 58 -272 59 -158 -196 -82
6645 -82 -40 -71 -59 -90 -30 -192 -32 42 -207 -21 247 114 168 -80 -69 -47 -65 -314 177 28 77 99 30 68 177
6670 177 4 147 -222 -242 193 -29 -44 138 -172 -24 -115 162 -325 -153 256 422 241 41 120 -68 -9 -42
6692 -42 -12 -6 102 -128 121 201 82 -28 -87 -325 -61 58 -13 -34 86 -160 17 -47 -213 59 66 293 84 62
6716F2P0j32lJ7j77L42l02J6jl13O50m84M02j64N4P9j53K31j94K18k50m2J83N7
6740A66k01MJ25J76k2q8j0J03l22K21j09L3k6j37J70k32L7P8Q4j79J43J4k25L85
6764A88n01K65K70R0l89k01J76K29j52p2j79K41J15q4J23j52n6N2N4J54k30J99
6786A40j29P0J11j29l5k41L68p5o0m6J08J02j90j96L51N8k23L25Qj33j79J98O2
6809B65j87Rm0M4r9K23k38m4J50J62j94K3Q6j12q5K08k47K02j21k60J69j65K56
6832Ej1j84J69J74m58K81Km7L23m39M3N5q9R5J0J48J13m01J07K17J0k66J98K5
6856H0Nj35K5M7R8L6o5J12L2k91K29k70P9J39j02j5J02j17j06L6R8j7Mn8j62L34
6882A18o4%q4j12K44k20q1K72P0j47R1k59L0J40K38r1j48k16K75L2j18j83M0J94
$$ plain form
6716 62 132 0 -3 14 -163 179 -123 -107 -108 -421 229 -255 147 -17 37 116 -37 194 0 218 -32 -74 109 166
6740 166 -35 -31 94 270 248 160 150 253 -69 152 43 76 50 -87 83 -149 -112 -34 50 -129 14 28 -197 188
6764 188 -313 -48 222 312 -77 -278 -102 127 -25 -97 -276 -35 80 -4 119 -33 -89 -37 17 171 -59 140
6786 140 11 81 192 63 28 -213 155 80 20 -26 82 184 -6 -202 149 207 -16 309 317 184 5 203 265
6809 265 78 87 47 91 -8 215 -23 -67 83 245 51 74 160 48 -37 171 -76 126 5 -255 -86 -251 5
6832 5 -6 -190 -21 153 -305 -24 -22 -69 254 -185 -142 -87 -176 -81 -71 77 190 -211 -104 113 123 -143 55 80
6856 80 85 -50 -25 22 120 156 91 203 235 -56 173 -97 -18 121 19 4 106 -11 -117 -81 17 0 4 -54 -216 118
6882 118 54 54 -30 -142 102 -118 -199 73 143 -4 87 -172 -142 -2 236 145 -3 -219 56 88 -30 -213 -173 21
6906B1j81J08p7L7Q6K7q7K19k57K25k9k55K41q8K48j79J6M5l4q1R9j4K4m1K78
6931C51q3l05J9r2J41Nj31J11j23J68o3J9J22p9R7k40R5R9j87L8P8J4k04J33l9
6956e6J54q0P0j90p9K28k21K36K53k76k37J45K93j01M5r1K58l25j56M33k79m8
6978b4j65N4L53k7k49K8k1J37o4Q6j43j0J04R7l86J66o5L53j71Jj4J09p5j0n3
7003A1k18K69P1p7j54J72j6N2R2n5k71J95k38m2N10n33J36q7J48Q0J6J82l65J09
7027a3J56j41q1J12k36K53k6k11K14q5L1m6j32J88J4K8j19L30l04L5J13l92J49
7050a63O0J77k59LJ83k11K16J7qO9k26J89k15L18Mj98J82j94LK08J17j59l18K20
7074A5K14j11k2k61r1K95k42J83n6J6J71l37J21J60QJ05j64m1k2J57j83J55o2
$$ plain form
6906 21 -160 -52 -129 -92 -6 21 -66 153 -104 121 92 -163 78 -10 238 59 75 120 86 5 104 90 114 73 351
6931 351 268 -37 -18 -110 31 36 -95 16 -107 61 -2 17 139 60 157 -83 12 111 -76 -38 40 54 -150 -17 -56
6956 -56 98 18 88 -102 -181 47 -174 62 315 39 -198 -53 240 139 184 93 351 26 -130 303 24 -24
6978 -24 -189 -135 218 191 -58 -30 -51 86 22 108 -35 -45 59 156 -230 -64 -129 224 53 54 40 149 74 64 11
7003 11 -207 62 133 56 -98 74 58 110 202 147 -124 71 -167 -209 301 -232 -96 -183 -35 45 61 243 -122 -13
7027 -13 143 2 -79 33 -203 50 24 -187 27 -58 -27 -73 -205 -17 -3 25 -94 236 -68 -33 80 -312 -163
7050 -163 -103 74 -185 -182 1 -210 6 23 15 84 -142 47 -168 150 154 -44 138 -56 -53 155 272 113 -205 15
7074 15 229 118 96 -165 -256 39 -203 -20 -76 -60 111 -226 -105 55 63 168 4 -37 -59 98 -85 70 8
7097Ho8J54o5k39N0l9L31o9J43m6k55J98j30N9q2k4J88l43M61l32N5R5k55M10
7121B05m39N03j18j09l16J18K50lQ1j53k16L84j05j77JJ9J93q4p7L3R7p1j09K60
7145A67j21j52J41J22j01r8j3j65K25o4L0L1J12q8j47r7K05l17N12K4l82K28O9
7168A21j07J60m17L30j83L59l26k6M0K41j59O0j63L2oJ84k26j8J10M1j06k90N15
7191A66o1J6j4l79J98J60k8l1J71j30J66J2m28J65J82j25R0o0J78J89o59M24m8
7214A54k77J70j29J82q8lJ92j80r5nJ42J8j33m2J5J07k48K13n9K4K26k29O0O7
7238H2k3m7j03J08k13K15Q9j12n1k48J98m1K17l1q6M87k33j82J27J95l45J37k08
7261f8K87j94j62K77k50L00Q5m9k84o2L57k40j00K8m5R6K01l56K34r6J30p8k02
$$ plain form
7097 8 -60 94 29 -210 -160 -199 132 63 206 160 -95 103 -27 32 -50 -74 114 -229 232 -100 -45 50 -205 205
7121 205 -234 269 151 42 -274 -156 94 91 172 19 -197 187 82 -95 -94 -75 118 34 -43 -10 87 16 -93 167
7145 167 46 -106 35 157 56 -42 -55 -220 5 -59 -29 2 114 26 -121 -218 -13 -330 182 206 -176 52 121
7168 121 14 174 -243 87 -96 263 -63 -89 -49 192 33 93 -70 -38 -44 140 -86 -104 6 47 -59 -349 166
7191 166 105 121 107 -272 -74 86 58 27 198 68 234 246 -182 -17 165 40 130 70 248 437 -222 202 154
7214 154 -123 47 -82 100 12 9 201 21 -74 -79 63 81 -52 -94 -79 28 -220 -7 -66 -42 184 -45 15 82
7238 82 59 12 -91 17 -196 19 108 -4 -55 -303 -105 -146 71 40 -46 441 208 26 153 348 3 140 -68
7261 -68 219 25 -137 140 -110 190 275 226 -58 -120 237 -3 -103 -75 -120 -24 177 -179 55 -41 89 11 -191
7284a91JrO4P2L9k1j13O2J81KQ2k16n0Q2KJ2J99k49j79J52J88j89L5J30r4R7K
7311I1j47j08J96K24l45r2L91j82M7m9K55q0p4j0J41k76q1Q0jM0M2j7j34K55m75
7336c09J73M8J10K2Nj53P3j01m5K46J52m72M53j55r5q0K12R1k53J82j85m1m0L08
7360A46k20j59J02J62l47J84K11N1r7r2J81l11K88n2L5j7qj53J99j85J35J6L0
7383I9Lqr7k4K30j36j94N8K90n2N8j98j2k10L80k20Q5P0k57j4M9K4l2j3K16l27
7409b32J41o6L6K94O3l22J25o3j04M1k4P1j10J8J42K1pk81M3J87r5L79k93j9k16
7434b71M09o1k03L08j68K17q1j08j37M5K63P6l80K01J3q9r3J72j96j12J99L5j6
7457B3j47J65n2J89k41k5j82K75Q1o5Qn0nj0j47J71j85L63k53k16K50q1J73j11
$$ plain form
7284 -191 -190 -199 -135 -63 -24 -45 -158 -96 85 87 169 -47 -97 -15 -13 -1 198 -51 -230 -78 110 -79 -44 86 -8 89 91
7311 91 -56 -164 32 256 -89 -181 210 28 75 26 281 201 127 117 258 -18 -99 -19 -20 20 62 45 -89 166 -309
7336 -309 -136 -88 22 44 49 -104 -31 -132 -177 69 221 -251 202 47 -48 -128 84 175 -78 104 -81 -122 -162 146
7360 146 -74 -233 -131 31 -316 -132 79 130 33 -59 122 -189 99 47 82 65 57 -96 103 -82 53 69 99
7383 99 102 94 -3 -27 203 67 -127 -69 221 169 227 29 17 -193 187 -33 52 122 -135 -149 -100 -76 -108 -121 95 -232
7409 -232 -91 -157 -121 173 236 -86 39 -24 -128 -87 -111 -40 -150 -132 10 31 24 -257 -214 -27 -122 257 -36 -55 -271
7434 -271 138 77 -126 182 14 231 150 42 -95 -50 213 289 -91 110 123 34 -59 113 -83 -195 4 39 23
7457 23 -124 41 -11 178 -63 -88 -270 5 86 21 29 -21 -26 -36 -183 -12 -197 166 -87 -303 -53 -134 39 -72
7481g2p4K05p3j67J1K77l02K7K75j56o3L6R2k23J44O8k81J62j62L08k14J76R0
7504H4j15J41l11L83j82j27K29l02N4J42K02j13q8j66K18n0K01k28L8K84k16k53
7526a75K48pj69P9K32J53k12K3k59M4rR2M3k2j34L18k89k67J83Q4P9k9m1L5p4
7551g4N9r1K1l4K79k08n1J55j01J08K2p9k73L46j48K34o9k7J3J14M5n61L87K30
7575B97l9j28l83K60K39j44l77K11Q1N2k29M20j19k26n2l5L10j46j66K20O8o5
7597D9j39L97j79L4n8J5p2l23K85j7k34L55l83J84M12j56l36M8R5J45j57J9Q5
7620F9k46K22J56k97j06K01N1p9j7J99l25M4K42k00nQ8J01k26N1M13l09k5j31
7643a29R2L05k03j25r8J50O9J07j10lj35K04n6P9n03M50N9j18j12Lr3K65j14N4
$$ plain form
7481 -72 -146 59 -14 -181 -170 107 -195 -168 107 -49 -112 -76 16 -207 -63 5 -276 -114 -276 32 -182 -6 84
7504 84 -31 110 -201 182 0 -127 102 -200 -146 -4 198 85 -3 -169 49 -1 200 -28 10 294 78 -175
7526 -175 73 66 -103 -24 208 361 149 172 -87 -43 -52 40 83 61 -73 245 -44 -311 -128 -44 35 6 -35 0 -74
7551 -74 -15 -106 -85 -119 160 -48 -99 56 -45 63 85 6 -267 79 -69 165 96 69 82 196 241 -320 67 297
7575 297 258 130 -253 7 246 102 -275 -64 17 69 -160 260 141 -85 -137 -172 138 -8 -174 46 114 49
7597 49 -90 307 128 162 104 119 47 -276 9 -8 -242 113 -270 -86 326 170 -166 -118 -23 122 -35 -16 69
7620 69 -177 45 201 -96 -202 -1 50 -29 -46 153 -172 -128 114 -86 -91 -3 98 -128 -77 336 27 2 -129
7643 -129 -37 268 65 -60 -158 -8 61 168 58 55 -80 124 68 147 -356 94 153 35 -77 -74 -167 98 -16 38
7667C8J78l04J17m4p9J05k73K22K86k27j74K42n1k05K65j66p8K29R4j20ol9J01
7690A11j16n5Q8j0j19J07K51l56N3k3Q9K9q7J54j13K08j85J56j45J40J10m33J57
7713A1J39l3k03J97m5J25k25Q5K02k74p4K28r2R5M1j59N1l2J93k14j0N1j37J41
7737F1j03j05j49J32M7J87Q2j47Q2j46J05J94l20J81Mj89p8Q7J45j79R5L24l60
7760e0K11J5q0j54J28J90k32J66p8J92l41m4k2j17J8K77J56l68K13K00j29p0j42
7783f1J39j16J97Q6j8k11Q2m02N36k13m7k1J09Jj33J41j84J24M3O8l0n2j10J14
7807D2l49J32L1R5l02O0J29J23M7M1mj74K0j19J81J44j04J78j81M9O1R6k05J88
7831A79m2m52J24K81o1j41P0L69k00l3j12J4P9J90k87M04k64q7j04O4J84k58R8
$$ plain form
7667 38 216 -88 29 -15 -94 11 -262 -40 246 19 -155 87 36 -169 96 -70 -148 81 175 55 49 10 111
7690 111 -5 -60 28 18 -101 6 257 -99 -46 -69 20 49 -38 116 3 211 26 182 37 177 287 -146 11
7713 11 150 117 -86 111 66 191 -34 51 253 -21 -95 133 41 136 177 18 69 37 230 16 6 57 -80 61
7737 61 -42 -147 -296 -164 -117 70 152 5 87 -59 46 240 -80 101 105 -84 -162 -75 70 -109 -14 310 -50
7760 -50 161 176 96 -58 70 260 28 194 116 308 -33 -77 -99 -216 -198 79 235 -133 80 280 151 81 -61
7783 -61 78 -38 159 245 227 16 98 -304 232 19 -28 -49 60 61 -72 69 -115 9 52 120 90 38 -72 42
7807 42 -307 -175 -144 -49 -351 -291 -162 -39 8 49 45 -129 -109 -228 -47 97 -7 171 -10 39 100 196 -9 179
7831 179 137 -315 -191 90 29 -112 -42 327 127 94 -18 -4 75 265 -22 382 118 31 -73 -9 175 -83 15
7854A5k3j56O0P2K70j29j33K56j91R2k31L0P4k19J24L21k32j77R4N7J62l39Q6
7877a17K05r4J62k22L7o2R1R7N7j08J47l38J34L2p0L8j70L36r7k8k01K89J27l32
7901h7K36l52J44k21K93J64j26k70K46p7O4M6p7Q8k47L99l88J80J07O8R5j88p5
7924B2K02j64l31K49k71L22k5J6R0l52L85j77n3N0M9j8p6L0Q1p5K16k21m2J58
7948F5l06K37j20L0nM3K23k89K09j84j25K55p2M21l42J17K2j6j46jk64O5J10L2
7972d1j58J70M5j65L75J0p06N69q7j03o8M00k63J18K2m8j97lJ22P0k14j84K92
7995d4J26J69k66n4J15p3p1M4j14Q0K08j81j05L66k84ML8M7p4MO7N1J2j04k8K75
8021B08l17K31k10p0K7P5n6J3K63l48P8K58j10j17K34rJ68k99J03N6k23%J89l65
$$ plain form
7854 15 -8 -164 -104 -32 238 109 -24 232 41 133 -98 -68 6 -213 -89 232 0 -177 -83 -26 136 -203 -117
7877 -117 88 -6 156 -66 -29 -91 0 97 154 46 193 -145 -11 21 -49 -11 -181 155 58 30 -171 118 245 -87
7901 -87 149 -203 -59 -280 13 177 51 -219 27 -50 14 60 -17 71 -176 223 -165 15 122 190 285 97 22
7924 22 224 60 -271 -22 -293 29 4 20 110 -242 143 -34 -87 -37 12 -6 -82 -52 29 -46 170 -51 -93 65
7948 65 -241 -4 -124 -94 -99 -56 167 -122 87 -97 -222 33 -39 382 40 157 179 163 17 16 -248 -183 -73 -41
7972 -41 -199 -29 16 -149 226 236 -470 99 12 -91 -159 241 -22 96 118 70 -127 -130 -8 62 -152 -336 -44
7995 -44 82 251 -15 -69 46 -27 -98 -54 -168 -88 120 -61 -166 200 -84 -80 -42 5 -69 -65 2 53 65 -39 -67 208
8021 208 -109 122 -88 -158 -131 -56 -112 -99 164 -184 -106 152 42 -75 159 150 318 19 122 178 -45 -45 144 -221
8045b21L20j76K91m8j20L2j21K32j70N4L1j43O5j09r6J87J50q8j73L1N2N4l48
8068c14J13Q9k44L10J0L07l83J49M4p2j73J31J73N0j63k5j77Q3K50m6J47k83K1
8091cJ09p2l16J97P2l3j92K55j10J69k03J36J13j00p1N3l0J2o9R9j83L18m04K97
8115D4J40j24n9J0O0n6k95M35lj96P9k0j38R9R3k93J69j66K7K24j58K27o5k36
8139b02J25k9L25k21J82k66j8J21P9j47j13J49L48m76J15j17k3O9j24M23j48j57
8161a05J30j14J39l49K71j1K6J87l32O6J74J85m45J43K7R7N6m19L45J81O6p9l50
8184a11L8l31L57L11k59m41K75
$$ plain form
8045 -221 99 -77 214 166 46 78 -43 189 19 73 104 -39 26 -83 -179 8 158 70 -103 -72 -20 34 -314
8068 -314 -201 -112 -356 -46 -36 271 -112 37 81 9 -164 -33 140 190 27 2 -175 -92 158 112 259 -24 -3
8091 -3 106 34 -282 -85 -13 -46 -238 17 -93 76 -127 9 122 22 -49 4 -26 -14 -83 16 -167 151 -253 44
8115 44 184 60 1 11 71 15 -280 155 152 -44 35 15 -123 -24 69 -224 -55 -221 -194 30 -128 99 34 -202
8139 -202 -77 -106 219 -2 180 -86 -104 17 96 -51 -164 -15 333 -143 -28 -145 -168 -99 -223 200 52 -105
8161 -105 25 -89 50 -299 -28 -39 -13 174 -158 -92 82 267 -178 -35 -8 89 145 -274 71 252 318 239 -111
8184 -111 -73 -404 -47 264 5 -436 -161
8191a61
$$ Imaginary data points
##PAGE= N=2
##DATA TABLE= (X++(I..I)), XYDATA
0@%%%%%%%%%%%%Qj6J6j6J6k4L2l6M4m9N7p2Q6r9J15j33J51j73J98k23K52k86L25
35A73l65M08m57N11n70O33p04P83q65R55j057J167j285J417j561J718j893K084
53A092k302K547k819L130l491L913m412N012n753O695p931R636j2146J6208k3828
68a4449M2826j71903k88058M80717K70133k90188k42318J59603J38468m0853j3933
79C0045K6217j07298k3009J72958L8645k03927o5517J69952J08972j28908j61342
90a43212N9583J87223J9020j50600r2276Q5463J37229l46j07118m1684K2483M7109
102B2874O7366k5360j26239j9594J10197L8431q4181m5031N3595J1290m6876L7550
114e978M5545p3397k8306J00229K1356j01024k4923J06007N0563j09671q2638
$$ plain form
0 0 0 0 0 0 0 0 0 0 0 0 0 0 8 -8 8 -8 8 -16 16 -20 24 -25 32 -40 46 -53 62 -71 80 -93 105 -118 134 -152 173
35 173 -192 216 -241 270 -300 333 -371 412 -453 502 -555 612 -673 744 -817 901 -992 1092
53 1092 -1210 1337 -1482 1648 -1843 2070 -2342 2670 -3083 3612 -4319 5317 -6829 9379 -14449
68 -14449 28377 -143526 -431584 49133 319266 29078 -213240 -53637 84831 43978 30045
79 30045 56262 -51036 -74045 98913 137558 -66369 -131886 38066 147038 18130 -143212
90 -143212 -83629 103594 122614 -27986 -120262 -34799 102430 102084 -5034 -46718 -24235 22874
102 22874 90240 64880 -61359 -80953 29244 67675 -16506 -61537 -7942 3348 -43528 -5978
114 -5978 39567 -33830 -62136 38093 59449 -41575 -66498 39509 90072 -19599 -102237
125a02237Q6911Q5059n3616p6263P099M6477M865j8423L2299R331q1294k508J29891
138F7591K6454j35078m7008J27887O2291j20911n5805J19480K7043j20198n162
149e3416J02430p893p9069J2827N9023k2338m1731M8616L5636o0073k0291N5671
161B9392Q507l3293K41J1704j3168j8372J4157K8057j9018l9371N086K7046J6308
174A7276o226l0274p334K9220J2469o398q157j6079O12K2728N162k2106k1843
187c0950J8000L2543k6867l9574L4311L8483k9184l0327J8311K6145n092j6066
199a0267J1809N824k4990P601L7432q421l6052m643K7377K0503j9237k4653J3647
212d070J3548p509M804N289j0051n965R247J9782o332l2771R033L8104j1924l6592
$$ plain form
125 -102237 -15326 69733 16117 -60146 -53047 -6570 -1705 -20128 12171 21502 -59792 -62300 67591
138 67591 94045 -41033 -88041 39846 102137 -18774 -74579 44901 71944 -48254 -53416
149 -53416 49014 41121 -37948 -25121 33902 11564 -30167 18449 54085 -5988 -26279 29392
161 29392 37899 4606 4847 16551 3383 -14989 -832 27225 8207 -31164 -26078 968 17276
174 17276 11050 -19224 -26558 2662 15131 8733 576 -15503 -14891 7837 12999 -9107 -30950
187 -30950 -12950 19593 -7274 -46848 -12537 25946 -3238 -33565 -15254 10891 5799 -10267
199 -10267 1542 7366 -17624 -10023 27409 18988 -17064 -21707 5670 26173 6936 -17717 -4070
212 -4070 9478 1969 6773 12062 2011 -3954 5293 25075 18743 -14028 -4995 33109 21185 -15407
226a5407M035K8561O625k4999j5817J6587R814k839M152j5558j7666K4397K4762
239B6647j9378k9716K615L0961O776l0052r126J8472N455l794o411q120J0129
252e542Q917q965m800L35L442R229m079j0096K478N715P746j010j6595L956J9930
267A0661r005j2718J1078P375o697p203O657J3689r213j2189J3776M432r924N292
281F011K427q554K821O255L1n575o394R794Q183j3169m172R011J034M58n999p887
297e725J0485N592j1705l034M008J250R79m775q34K689n050M421N893j3887j345
312a1038J4776l960j0257K426N521K649p062l666R730j070p237O447o32m973O564
327a782N60m694L263M37J474L084n057J481N294l013J143k47m012Q509n8r650
$$ plain form
226 -15407 -11372 17189 23814 -1185 -17002 -415 9399 6560 10712 -4846 -22512 1885 26647
239 26647 7269 -22447 -19832 11129 17905 -12147 -21273 -2801 2654 -1140 -7551 -15671 -5542
252 -5542 3375 -5590 -10390 -10055 -6613 2616 -1463 -11559 -9081 -3366 4380 3370 -13225 -9269 10661
267 10661 1656 -11062 16 7391 694 -6509 148 13837 4624 -7565 6211 10643 719 6011
281 6011 8438 -116 2705 8960 8991 3416 -2978 6816 14999 1830 -2342 6669 7703 8161 2162 -5725
297 -5725 4760 10352 -1353 -4387 -379 871 1850 -2925 -3759 -1070 -6120 -1699 4194 -9693 -11038
312 -11038 3738 -222 -10479 -8053 -2532 117 -6945 -10611 -881 -1951 -9188 -2741 -3373 -8346 -1782
327 -1782 -1222 -5916 -2653 -2216 -742 2342 -2715 -1234 4060 1047 2190 1943 -2069 6440 6382 -3268
343c268N789O185o325N47K074m4J233l000K186L188p420J339P500p137k740N775
359E882k456j401P28k848L132r00m319L507j606k797M524k989l344M655k678j948
375d858M769m174k016M381j461r65q04k526M985O24o489M156J842l857M842j55
391a706n017M430K293j539O90l138K015N680m032j271L018j994L962J980o649
406a278K366M475k508J641l98l871M665R57j599O64l739J424O115m373l521L177
422D197j719J232K354o008p07K891l81J704l411m671M684K490l466M23m024j070
438e482P602j553n957o80P5M860K836q070k491M168L200K490n488p594Q333O795
454C044m617l652k110K383Q664j456p175j49K431O911K525j0162k812Q145M187
$$ plain form
343 -3268 2521 8706 2381 2928 5002 4958 6191 3191 5377 8565 1145 2484 9984 2847 107 5882
359 5882 3426 2025 2753 -95 3037 2137 -2182 1325 -281 -3078 1446 -1543 -4887 -232 -2910 -4858
375 -4858 -89 -4263 -6279 -1898 -3359 -4324 -5128 -7654 -2669 -2045 -8534 -4378 -2536 -6393 -1551 -1706
391 -1706 -6723 -2293 0 -1539 -849 -3987 -1972 3708 -324 -1595 1423 -571 3391 5371 -1278
406 -1278 1088 5563 3055 4696 4298 427 5092 6049 4450 5114 1375 2799 8914 4541 1020 4197
422 4197 2478 3710 6064 56 -651 2240 1859 3563 152 -4519 165 2655 -811 -388 -4412 -5482
438 -5482 2120 567 -5390 -6070 -5995 -1135 1701 -6369 -8860 -4692 -1492 998 -4490 -12084 -3751 3044
454 3044 -1573 -5225 -7335 -4952 3712 2256 -4919 -5068 -2637 4274 6799 -3363 -6175 1970 6157
469F157K92o528o734R752R153o214p767q78P496Q244p348r088M304M661K373m18
485G457q907j639Q298K296k309n207n144P247O932o191o147j873M678Q277o351
500A417j0427M312O461M42l740o293K758O822l187k976O60k583J456M656n06k262
516b990n888M44J3075mj3396j013R221M775l188p823J930Q024k545j491L088l244
532a025n90M197J326J246n462m307J0583N117j0196n110N465Q442P81j2497l025
547e055J1755K623n386k588k799K836N174k289j275l133n227P160P120n596q490
562e170l299R386J1095j1436j4654Q113J2445j718j0093o948Q835R855o551p878
576h018R68K577M916J217n858l269j128O269J2467q298j9666O174K1686L180j9180
$$ plain form
469 6157 6449 -79 -6813 2939 12092 5878 -1889 -2767 4729 12973 5625 -3463 841 5502 7875 7457
485 7457 -1450 -3089 5209 7505 5196 -11 -5155 2092 9024 2833 -3314 -5187 -509 7768 1417
500 1417 -9010 -4698 1763 2205 -1535 -7828 -5070 1752 -1435 -4411 -3751 -6334 -4878 -222 -728 -2990
516 -2990 -8878 -8434 4641 4637 -8759 -9772 -551 4224 1036 -6787 -4857 3167 622 -869 2219 -1025
532 -1025 -1615 2582 3908 5154 -308 -4615 5968 11085 889 -4221 1244 9686 10467 -2030 -5055
547 -5055 6700 9323 3937 1349 -1450 1386 6560 4271 2996 -137 -5364 1796 8916 3320 -5170
562 -5170 -8469 917 12012 576 -14078 -5965 6480 4762 -5331 -12279 -3444 6411 -140 -8018
576 -8018 -7050 -4473 443 1660 -4198 -7467 -8595 -2326 10141 1843 -17823 -11649 10037 13217 -5963
591e963j2606J6918J8121j2427j4373N871Q297K680k876o527J726M071J740K477
605G129n166p196O712R046j652q645q639R264J6324p965j7056J731J2249O407
619A2543q087j2034M530R214j770l120k953j725M356R25k265O43m296j986Q402
634B377J589r016l937N302R211l054j4400J360J4496L08q732m974L279R185j027
649A967p312J215J937j063L210J537k882k439m26P396L506j0827k368J2373J456
664G280q531k566N608O957n085p865N489N499l318j131m03m74K801j146j322K377
680D170j843j775J775n6J160j87m438J017K908k531R20O32l707Q4J690N54J155
697A528m558k512N775J108l863k129N62M483P23p233M0O985o56l514k225R84N155
$$ plain form
591 -5963 -18569 -1651 16470 4043 -10330 -4459 3838 6518 3642 -2885 -1159 2912 4652 7129
605 7129 1963 -5233 1479 10525 8873 228 -8411 853 17177 9212 -7844 -6113 6136 12543
619 12543 4456 -7578 -3048 6166 4396 1276 -1677 -3402 954 1879 -386 257 -4039 -6025 2377
634 2377 3966 -5050 -8987 -3685 5526 2472 -11928 -10568 3928 4236 -4496 -9470 -6191 2994 1967
649 1967 -5345 -4130 -2193 -3256 -46 1491 -1391 -3830 -4256 3140 6646 -4181 -6549 5824 7280
664 7280 -1251 -3817 1791 8748 3663 -4202 1287 6786 3468 2337 1934 1460 4261 3115 1793 4170
680 4170 2327 552 2327 2271 3431 3244 -1194 -177 2731 200 1120 1752 -1955 -1871 -181 373 1528
697 1528 -3030 -5542 233 1341 -2522 -4651 -4089 394 1117 -6116 -6076 909 253 -3261 -5486 -4502 653
714F53j25m313L82P99L49L658r28l345O98J347K885J329n323m90N557L24k355
731A102p32k14L435m9l215J494J229q99J621r30k567K119O54J20L34l791J5M110
749C836m35j617j718j541L349K025m228r95N24K41K311j555l783K199J357j352
765a382J30j980N84K103j820r09J025j131K122P45l570M69K271j91N75j076j353
782c388L047n8j412J531j008l51K927j647J9J819j910K97K260j000N24L2j190
799D92K072J67k071K247m91j171K299q29j867K045L1q66J88j745R71J689k202
816I59p26R07j315K478p02l685J730J606j882k0n29p32J807r98j565J371j129
833b425P67J143l005L34K734j870p7O76j215J641J76j855J285M58n24J347j105
$$ plain form
714 653 528 -3785 -3403 -2604 -2255 1403 475 -2870 -2172 -825 2060 3389 -1934 -2424 3133 3457 1102
731 1102 370 156 3591 3542 327 1821 3050 2151 3772 2842 275 2394 3048 3168 3502 -289 -274 3836
749 3836 3401 1784 66 -1475 1874 3899 -329 -1324 -800 -559 1752 197 -3586 -1387 -30 -1382
765 -1382 -1252 -3232 -2648 -545 -2365 -3274 -2249 -3380 -1258 -513 -4083 -3614 -1343 -1534 -959 -2035 -3388
782 -3388 -341 -399 -1811 -280 -1288 -1639 1288 -359 -340 1479 -431 -134 2126 1126 1650 1682 492
799 492 2564 2731 660 2907 2416 1245 3544 2715 848 2893 2924 2058 2246 501 1472 3161 959
816 959 233 1140 -175 2303 1601 -2084 -354 1252 -630 -650 -1179 -1911 -104 -1102 -2667 -1296 -2425
833 -2425 -1658 -515 -3520 -3186 -452 -2322 -2399 -1723 -2938 -1297 -1121 -2976 -1691 -1233 -1757 -410 -1515
850a515o70K941n66j588J718o30J61J842j740K15J917j373J320Lj663K519J11
867C002k863K022Q25j654J369o02j282K060r13o67R40j668Q49J162k473N39J294
884A940k457J037M03k308J496K56k190J047n8o72J407j519j071K256j404n42J392
901i87j309l80J807j294J07R81j626J218K14j672K145K5j852K083L9j162K293
918F30p21r42J958j083q3J965j226J66J047j421J435L55j634J288P04j623J722
935B537p8j548J134k42l44J039j605j14J982j483o51J577j889K84Q42j421K44
952B64N65j903J132K59k162R89O15j043P17p84j307K146j256r41J829j488J81
969b187J486j484L06N03r08J490j07j917J616P90j314J230j58p68J621l01k18
$$ plain form
850 -1515 -2185 756 190 -1398 320 -310 -149 1693 -47 168 2085 712 2032 2035 372 2891 3002
867 3002 139 2161 2986 1332 2701 2099 817 2877 1964 1297 2237 569 1418 2580 107 646 1940
884 1940 -517 520 923 -1385 111 367 -1823 -776 -834 -1506 -99 -1618 -2689 -433 -1837 -2379 -987
901 -987 -2296 -2676 -869 -2163 -2056 -1075 -2701 -1483 -1269 -2941 -796 -771 -2623 -540 -501 -1663 630
918 630 -91 -1033 925 -158 -241 1724 498 664 1711 290 1725 2080 446 1734 2438 815 2537
935 2537 2459 911 2045 1803 1459 2498 893 779 2761 1278 627 2204 315 599 1441 20 264
952 264 829 -1074 58 317 -1845 -856 -241 -1284 -567 -1351 -2658 -512 -1768 -2709 -880 -2368 -2187
969 -2187 -701 -2185 -1879 -1376 -2284 -794 -901 -2818 -1202 -412 -1726 -496 -654 -1422 199 -102 -320
986c20J090j494J000K027j549p06P77L26J288n90k257J878J345j686O02j75m47
1003A109J389l49q65K84j100M19K062k041j297J293o0O65o92k358J758Q03j445
1020d25O2n34q11J911l99j909N70J9J50J257k439j17J861r16M0N94j403M60J307
1039g22n54P79j376j031L463L6k747L74J505O39N19k261O43K587j440m49J225
1056A190m81P4N46j86J254j254j823L255Q27l038QJ273J301n22k482N27K595j703
1074A361r31J021r58L17K78j414J178N0j952J013J056j741J23o36M22J439j795
1091a169j276J801k02o46L56j291Q99J459j946k20J148k86L9j93k4J476j504j470
1109c049L902J42l588N79K736P74j133l029K514L220k912j105K125m0j35K9n17
$$ plain form
986 -320 770 -724 276 2303 754 48 825 1151 2439 1849 -408 1470 2815 1129 1731 1556 1109
1003 1109 2498 2149 1284 1568 468 887 2949 908 -389 904 844 1509 817 -1541 217 1020 -425
1020 -425 -363 -897 -1708 203 -196 -2105 -1535 -1516 -1366 -109 -2548 -2665 -804 -1720 -1680 -1086 -2489 -2029 -722
1039 -722 -1276 -497 -1873 -2904 559 595 -2152 -1778 -273 366 885 -1376 -733 1854 414 -35 1190
1056 1190 709 783 1329 1143 2397 1143 -680 2575 3402 364 372 1645 2946 2424 -58 469 3064 1361
1074 1361 430 1451 493 810 1088 -326 852 902 -1050 -37 1019 -722 -599 -1235 -813 626 -1169
1091 -1169 -2445 -644 -846 -1492 -1136 -2427 -1528 -69 -2015 -2235 -1087 -1373 -1334 -1527 -1551 -75 -1579 -3049
1109 -3049 853 995 -2593 -2014 722 1496 363 -2666 -152 3068 156 -949 1176 1136 1001 1030 513
1126E13J905q07k297K765J401l146n26J728J642o39l784J286L793k157k675J765
1142G67M53j43J74k091J222M40j635J281j82j652M87M52J66O69k133j187L020
1159A08k43j593k12j41J656M90k613Q6J960m18P4o86r43K587m31j932J696J005
1177D50j585O55L23R42o33j876K268K409l430j164L207P35j165j239M25K111k28
1194B205k292J511R82j752L78K56M66k05j568Q26K221k263j825K443O2p98q56
1211b09l17J677n41k081J630K63j643P03L40j061L95j90O7Q48j371n29J318j062
1229a763N64P93j603L04J032p05Q27m77r76J928k67j518J241N65m36M13k72K20
1247a30J025j642N03K082j631m93J538J37m56m14j9J639k67k213J809N65j302
$$ plain form
1126 513 2418 1611 -686 2079 3480 334 -192 1536 3178 2539 -1245 41 3834 1677 -998 767
1142 767 1220 1077 1251 -840 382 822 -813 468 286 -1366 -879 -427 -261 408 -1725 -2912 108
1159 108 -135 -1728 -1940 -2081 -425 65 -2548 -2462 -502 -920 -846 -1532 -2475 112 -319 -2251 -555 450
1177 450 -1135 -480 -157 785 152 -1724 544 2953 -477 -1641 1566 2301 1136 -103 322 2433 2205
1194 2205 -87 1424 2406 654 1032 1288 1754 1549 -19 807 3028 765 -1060 1383 1445 647 -209
1211 -209 -526 1151 610 -1471 159 422 -1221 -518 -178 -1239 -844 -1034 -967 -119 -1490 -2019 -701 -1763
1229 -1763 -1199 -406 -2009 -1705 -673 -1378 -551 -1028 -2004 -76 -343 -1861 -620 -55 -491 -78 -350 -130
1247 -130 895 -747 -244 1838 207 -286 1252 1389 933 519 500 2139 1872 -341 1468 2033 731
1264G31K30M06j28L50j446Q03J437k065p91J977l71o45l19k12Q40n29j277J355
1282C46j55j679J041N28j024j02k33M13P26j673j00J986j332n13P21k6Q9j57l15
1301a459J001j30j264J328M41j222O67M39L21j27p91O74J372j624K00J610j025
1318D11k02O41L54m8l25m88J651m28j381J312L57j110L47j01r9N39j322N87J006
1337A701j421m81J662n54q08k95j55J283r41j395J694j0j879R46O85r69O5OJ41
1356g25L04j486L96J417j640r8J056l00L88n94k90J269k91j204J298L55q35Q67
1374a13n3j11O53j080Q70J033j444K03J197q47P7L59k55O42m06m71J527k61j472
1393D8J052J56n28L35j05j33N52j084l9J260j220j11P76p27j85J93p38J061l99
$$ plain form
1264 731 961 1367 1239 1589 143 946 2383 318 -473 1504 1133 488 169 -43 797 268 -1009 346
1282 346 191 -1488 -447 81 -943 -1045 -1278 -865 -139 -1812 -1912 74 -1258 -1771 -1050 -1076 -987 -1144 -1459
1301 -1459 -458 -588 -1852 -524 -83 -1305 -638 -199 122 -5 -796 -122 1250 -374 -174 1436 411
1318 411 209 850 1204 1156 831 343 1994 1566 185 1497 1854 744 1091 990 891 1430 108 695 1701
1337 1701 280 -201 1461 907 99 -196 -351 932 -9 -1404 290 280 -1599 -653 32 -937 -872 -866 -725
1356 -725 -421 -1907 -1511 -94 -1734 -1832 -776 -1076 -688 -1282 -1572 -303 -594 -1798 -500 -145 -980 -113
1374 -113 -166 -277 376 -704 166 1199 -245 -42 1155 308 385 744 489 1131 725 254 1781 1520 48
1393 48 1100 1256 728 1063 958 825 1377 293 254 1514 294 183 959 232 47 240 -498 563 164
1412A64j512J413J43j554O75K00k81J08p45K80Q52j340J35J299j085j59P76o10
1430a241N11P2n61J099k79j484J725J22m18P87o20J51N00p16J92J410j390J53
1448A3J163n00rL38o63J042k45r47J160J1q98J001k05p37P96l33k65P53j071q8
1468C16J108j426K27M00o61O54j54r44P13m6j342J138q1r22M44L6k60N80j001
1487a221K33R74j368k8J115j003k0Q09o64L94M2m75P76Qp30R16J34k44M96l85
1507b41j19J078n62j81Q42q28M03K51j28R4K14m23R06j94p76R11j02q67R43m45
1527G76m14Q43l55l38M75m94l00R47j142K62L13r41J73O13j047O28J13p19N27
1546h0m24n16O96k99m21N70p07J21N54m67k44P01n12L95J82j060R18K35k17J88
$$ plain form
1412 164 -1348 65 208 -1346 -671 -471 -752 -644 -1389 -1109 -257 -1597 -1462 -163 -1248 -1407 -631 -1241
1430 -1241 -730 -658 -1219 -120 -399 -1883 -158 -36 -454 333 -287 -136 364 -352 -160 1250 -140 13
1448 13 1176 676 667 1005 342 1384 1139 192 1352 1363 465 1466 1261 524 1320 987 722 1475 404 316
1468 316 1424 -2 225 625 -36 618 464 -480 233 187 -1155 -17 -98 -1020 -576 -540 -800 -220 -1221
1487 -1221 -988 -14 -1382 -1410 -295 -1298 -1318 -509 -1173 -779 -737 -1212 -436 -428 -1158 -242 -108 -352 144 -241
1507 -241 -360 718 156 -25 817 -11 392 643 515 609 823 400 1306 1112 336 1247 1145 278 1221 776
1527 776 362 1205 850 512 987 493 193 1140 -2 260 573 -368 -195 418 -629 -1 112 -607 -80
1546 -80 -504 -1020 -324 -623 -1044 -474 -1181 -1060 -506 -973 -1217 -516 -1028 -633 -451 -1511 -593 -358 -575 -387
1566c87j26l97R87j88p71J151m25j37J033q13J72M33l61M15L87r67O40J62k02
1585F06O64q37k98R55q9o71O41j67j27N88p79j12P27n06k23K28n54J12L44n31
1605b9J83j00n44M52J95o38j41m09L77N77j046k76J260q65J53K07q08P96j1m12
1625a079L73L95o70K08L39o2pp36O02J250j004p25J415k17j64N47o58M79N14p73
1645B7L90P86p18J47K41m90O01j09r12J315k66r27N98J50K21J81r80p2J059q59
1665C83k17K69k92J84j10m03N38n8j296O19J98m44N20q36K86O28q09n28J418m06
1685c56l66j32m42P44L66j194Q01L27q31N19K92m88N92n24r9J373o74n62R29q7
1705A88j44L47m35O43M73j078L7R67o34M95j62r2O45n09k55O16j3q23O11l21j04
$$ plain form
1566 -387 -513 -910 77 -111 -882 269 -156 -293 740 -73 99 532 171 586 973 6 646 808 606
1585 606 1270 433 135 1090 1001 330 971 804 677 1265 486 374 1101 595 372 600 46 158 502 -29
1605 -29 154 54 -490 -38 157 -481 -622 -1031 -654 -77 -1123 -1399 -139 -1004 -851 -644 -1452 -656 -667 -1079
1625 -1079 -706 -311 -981 -773 -434 -496 -503 -1239 -637 613 -391 -1116 299 82 -82 465 -193 286 800 27
1645 27 417 1203 485 632 873 383 984 875 -37 1278 1012 85 683 833 1054 1235 255 183 1242 383
1665 383 166 435 143 327 217 -186 352 294 -1002 -383 -185 -629 -109 -945 -659 -31 -840 -1368 50 -356
1685 -356 -722 -854 -1296 -552 -186 -1380 -579 -252 -1083 -564 -272 -760 -168 -692 -791 582 -92 -654 275 188
1705 188 44 391 -44 599 1072 -6 31 998 364 859 697 605 1250 741 486 1102 1089 266 877 556 452
1726D52K37l15n60J253n88n55M75o18N73L57j292P34N3j046P87k73m27N43p99
1745a009mQ46n83n79J129m54k74J20P2L70o8n44J02N43k26J23K55n24P14k72j26
1766c89O30l24l77R24l31k03O3K14L71K0l63L18N25n79L78J37m34L50j4k65K38
1787H89k69j93M71j00l70L53m22M0K43o05K2K82n89M82k9o41k5L72l31M6k41k07
1809h22N06l57k73P37m19l92P10m17m3j36K3M56J29p64O61L23p62L39k21L95J97
1830a30j72k89R65l49n71R50L7q8Q6k54M35J51p09M50L83n63J44O19p73N22k33
1851F11l11N30m33l28N20l6j68K31m15Q8L55o63K01K17o75M14K60q59K35J75n54
1872f05M29n50o7O99m46n28P94l96k41N19l91K70K79n39J33O18r75O84K88n14
$$ plain form
1726 452 689 374 -186 1067 479 -76 399 -219 354 711 -581 153 206 -840 -53 -326 -753 -210 -1009
1745 -1009 -1013 -167 -750 -1329 -200 -654 -928 -808 -736 -366 -434 -978 -876 -333 -559 -436 -181 -705 9 -263 -389
1766 -389 241 -83 -460 464 133 -70 -7 207 578 598 235 553 1078 499 877 1014 580 930 916 651 889
1787 889 620 427 898 798 428 781 359 399 642 37 59 341 -248 234 205 -436 -461 -89 -420 -374 -615 -822
1809 -822 -316 -673 -946 -209 -628 -1020 -310 -727 -770 -906 -883 -427 -298 -1062 -401 -78 -840 -501 -722 -327 -130
1830 -130 -302 -591 374 25 -546 404 441 353 439 185 620 771 62 512 895 332 476 1095 322 844 611
1851 611 300 830 397 69 589 553 385 616 201 289 644 -19 182 399 -276 138 398 -461 -226 -51 -605
1872 -605 -176 -726 -793 -94 -540 -1068 -274 -670 -911 -392 -783 -513 -234 -773 -640 -22 -997 -313 -25 -539
1892e39L09o8j06L49k84K49N70m41j74N17l79M28O5k31J3M35m58M16J81n39J46
1913D59M42o19J94J73l08O06m96k54N15n4m67M49m2m53K13m86K81J85m77j54L81
1934H8l93J55j21l15N20p07P3M83k10j94K82j43o6m8j46M47K17p89J96L34m34
1955g71K47J63l31L34o0J1O53k10m68R46o71j59P70m08K19L87k57J40J77n86N91
1976G17J57o53K71K05l51K20K00k72K13k41k16O11o94r6M83m04J10p0k98N3qk54
1998c17O6M10p72L71j00k98L46j67m63O41m81J49K22k33p8L98n77M17L14q32Q17
2019a67q0k92L53j23j54K99n8j80N47l66J26N95o11J47O06k31l87M86k47Q33n03
2040E93k57L99J42m18J50J99m75M25k39k92N70m92j61O19l39q7p5j9l65N61n32
$$ plain form
1892 -539 -230 -298 -404 -55 -339 -90 480 39 -135 382 3 431 496 265 278 713 255 671 852 313 459
1913 459 901 282 476 649 341 947 451 197 712 658 191 640 598 145 358 -128 153 338 -139 -293 88
1934 88 -305 -150 -271 -586 -66 -773 -700 -217 -427 -621 -339 -482 -548 -596 -742 -295 -78 -867 -671 -337 -771
1955 -771 -524 -361 -692 -358 -418 -407 246 36 -432 514 -157 -316 454 46 265 652 395 535 712 126 717
1976 717 874 221 492 697 346 566 766 494 707 466 250 861 167 71 554 150 260 190 -108 -55 -63 -317
1998 -317 -251 159 -613 -242 -342 -640 -294 -461 -924 -283 -764 -615 -393 -626 -704 -306 -883 -466 -152 -984 -167
2019 -167 -247 -539 -186 -309 -463 -164 -222 -402 145 -221 -95 500 -111 36 642 411 24 510 263 1096 593
2040 593 336 735 877 459 609 808 333 758 519 227 797 305 144 763 424 337 262 243 -122 439 -93
2061i3J51K31q65M10J57m02l5P8k04L89mm74N68l87k43K80j76o7N04l86PN73n85
2084e73K21L48o95K30L87m21K35J25m8M58l26l36P66r8k96M30j5n0J32m78L39
2105C35N50q75K86O18l86j2P1j51N99o18K80P5l08j61L34j10l89R2j46K18k7l64
2127h9J87j2m11L43j11m44L40k37l93M12j38K21j00n1k54N65m03qM00n10J44O7
2149d82q6L21Q9n01L11M12j15n6j88L84K95l55k16O26l18j48M99l20J86J51k97
2170A92K25M67p22J25L03L7J59j16m17M39j09m15K50k66j26M99o47K14L59o44
2190a93j58O30n79jL51m85P41k87p50N69j8n40K69k14J98N61p08O3M99n52j04
2211g08M61m81J17N82n89L75M20r36O11k0k0L25m06K44M29n02n3O36pl78J62l8
$$ plain form
2061 -93 58 289 -576 -166 -9 -411 -446 -368 -572 -183 -187 -661 -93 -480 -723 -443 -619 -686 -182 -568 -561 12 -573
2084 -573 -352 -4 -699 -469 -82 -503 -268 -143 -191 267 -59 -395 371 273 -23 407 392 342 474 -4 335
2105 335 885 10 296 914 528 516 587 436 1035 417 697 772 464 303 637 527 138 230 84 302 275 -89
2127 -89 98 86 -325 18 -93 -537 -197 -434 -827 -415 -553 -332 -432 -483 -737 -172 -575 -583 -183 -693 -549 -482
2149 -482 -568 -247 -158 -659 -348 64 -51 -107 -295 89 384 29 -187 439 121 -27 472 152 338 489 192
2170 192 417 884 162 287 590 627 786 670 253 692 583 168 418 152 26 525 -122 92 451 -193
2190 -193 -351 279 -300 -301 50 -435 306 19 -731 -162 -180 -720 -451 -665 -467 94 -614 -551 -52 -604 -708
2211 -708 -247 -728 -611 -29 -618 -243 177 -759 -148 -168 -188 137 -269 -25 404 -98 -151 485 478 100 262 224
2233B24L3N16n94K6M49m05J40K32l78M68k84k78N03J3k65L07l75k02L13n16L44
2254B71N4n13L51N4k45o1j05m48N64j02p86P22R8o50M94N1k2L0p85L54N12l52
2276e14l20N94j94K41p0k01L58k50k80N02M11o39O40m11j57O20j06m35O06j35
2296B60J20K37m19j28N78o28J44N57o51N86j56j58L08k68r4K04j33j85m6J9q3
2317F4K94o03K12O42p39R0K94m26P2l19O9L86m16k68M99L3m28K72l09J97K91n37
2339f30J19L42k30q2M08k91J25k29J00K40j83k2L54m1l90O56l0j99L00j41RL31
2361E16k44L4j8j40Q0L00m86L17K46l05L49k87j91L87J8n48L54J4k70L10m34J83
2383A85O0m63N8P13n11l46K62j59jj89j88O51l21j92K38J77n39J03K65j36J73
$$ plain form
2233 224 257 773 179 205 654 249 389 621 243 711 427 149 652 665 400 707 332 130 443 -73 271
2254 271 325 -188 163 217 -28 -89 -194 -642 -78 -180 -966 -244 -146 -796 -302 -251 -273 -243 -1028 -674 -162 -514
2276 -514 -834 -240 -434 -193 -263 -464 -106 -356 -636 -134 277 -362 278 -133 -290 330 224 -211 395 260
2296 260 380 617 198 70 648 20 164 721 70 656 500 342 650 382 288 492 359 174 128 147 64
2317 64 358 -245 -33 609 -130 -40 254 -172 -100 -419 -350 36 -380 -648 -149 -116 -544 -272 -581 -384 -93 -630
2339 -630 -511 -169 -399 -481 -73 -364 -239 -468 -368 -128 -311 -333 21 -20 -410 246 216 17 317 176 185 516
2361 516 272 306 288 148 228 528 42 359 605 300 649 362 171 558 576 28 382 396 126 436 2 185
2383 185 245 -218 -160 553 42 -304 -42 -201 -202 -391 -579 72 -249 -441 -203 -26 -565 -462 -197 -333 -160
2404a60p10L23L24k34j89P02k63N0M4l47N18k20k22K09J47k37L07J91k62R7o0
2425HJ17L5j32M07J72l61p7N01m69R8K34l68K34M8k18L44k17m63M33m8J47N2l10
2448A67J14K07p30K81J29j47K4L3m09K28J50n93L59q9j84M41k48m86L16J02j30
2469d65j70P3L02K22m60K93r0l77L97nj45O03j48m10N41k8m11N98K9l09J44q3
2491A01l6M86l48j66Q56r91L16M41m33K05L0m21Q48n18m55O59l20J21q8R9m57
2512g1N02m17P6L48n98m2L95l08P7J00k22J96l52n33Q82l27n8J82q2j18J69j10
2534c11J55R0n08K81K61l60J43J74k75K34j23m4O07j53m02M80l71QM18l54Q5M26
2556D61l85J03K59j96l0K25j68mN6j00J02J29l26L64n2l85K96k44M8L73k97l38
$$ plain form
2404 -160 -870 -547 -223 -457 -646 56 -207 -157 -113 -460 58 -162 -384 -175 -28 -265 42 233 -29 68 8
2425 8 125 160 28 435 607 246 169 670 201 299 533 165 399 447 229 573 356 -107 326 278 425 477 167
2448 167 281 488 -242 39 168 21 45 78 -331 -103 47 -546 -187 -276 -460 -19 -267 -753 -437 -335 -465
2469 -465 -635 -562 -260 -38 -498 -205 -295 -672 -275 -280 -425 178 30 -380 161 133 -278 320 349 40 184 101
2491 101 65 551 203 37 893 -98 218 659 226 431 461 40 888 370 -85 574 254 375 287 386 -71
2512 -71 431 14 90 438 -160 -202 193 -115 -38 62 -160 36 -316 -849 33 -294 -352 -170 -252 -370 -201 -311
2534 -311 -156 -66 -574 -293 -32 -392 -249 -75 -350 -116 -239 -283 324 171 -231 249 -122 -114 304 -50 35 461
2556 461 76 179 438 242 212 437 269 265 321 221 323 452 126 490 438 53 349 105 153 526 229 -109
2578a09M07k79L14k06m28J84K08m56J54K52M4m05o5o4O68o10j41L98k87j5M43
2599Gn32K56Q4l00K17J35j33J53K88m46J34rl3L18k16l40N70p5j88K41K4J47O6
2622C68l99J30L91m06J45K07l08K26O8j37L2j75j49M82j5n41L77N9l6N1k88q8
2644fj34L6L08k36j2q0l3R1P1k04j85K45J7m51N30n21J79K38j44Q0Pj01J89k1
2668a37l97K97M75p81M28k5k78N78n1l91J78J89r3J10K56m47L09r5n9L26m51K06
2690A47L30n3j92K83l94L01j25j50J33p2j34J94m9J61M9j63j47M61m71j14J12
2711A07j66K64J8m57J49L18o21K16k05P1J64J5o41N16J0PJ2m9k38L10k61J76P6
2734b09k09K40J96l43N58n26r4N09k74Q7MO0j38L74m42J97M06n24J33M53m41K84
$$ plain form
2578 -109 298 19 333 127 -301 -117 91 -365 -211 41 85 -320 -385 -449 219 -391 -532 -134 -421 -436 7
2599 7 -525 -269 -185 -485 -268 -133 -266 -113 175 -271 -137 -146 -179 139 -77 -417 153 78 -110 131 155 302 368
2622 368 -31 99 490 84 229 436 128 354 422 285 317 142 -7 475 460 -81 296 355 319 370 82 -6
2644 -6 -140 -104 204 -32 -44 -124 -157 -66 5 -199 -384 -139 -122 -573 -43 -564 -385 -147 -291 -211 -204 -305 -116 -137
2668 -137 -534 -237 238 -543 -115 -140 -418 160 109 -282 -104 85 -8 102 358 -89 220 125 66 392 -59 147
2690 147 477 424 232 515 121 422 297 147 280 208 74 268 219 380 429 266 119 580 109 -5 107
2711 107 -59 205 223 -234 -85 233 -388 -172 -377 -306 -142 -127 -768 -252 -242 -235 -223 -272 -510 -200 -461 -285 -209
2734 -209 -418 -178 18 -325 233 -293 -387 122 -152 -65 -61 -1 -139 235 -207 -10 396 -128 5 458 17 301
2756C01m6rK38j77k17K70o1o0J95j12j71M42m14k49K84J73k47L2p8j68L16j69
2778G3k33pjK7J20k03K02k35K1J19l6k87L04r8r9K80l34q0L31Jj86J92k70J50
2802b49J61k34K33L9l31L35J19k83M13j44k03K96m54J50O91o89K13L29j93l37
2822a38l5K19K39J68k54N50k99l03Kj76J54K06k8k41L31m63pL13k5p4O6p4m14
2845b83N96q82Q22k34j68p2n1L2J27l2k78K88j70O5J68j78k9J34k29P7j2O8ql9
2869b88L2J47L10o03K30R3j25L97J8l97J63K5M0P6K53k45J44J37j07n6j49M05
2891E00k44k14K26K28m69N52m94j0M55k92m01M66k30J67K8k27m7J62j97J22r6
2912a5k38K12J24k46N0qj35N9Q8l32N86l64l06L24oJ34l5k24L8K96k54L3L25j20
$$ plain form
2756 301 255 246 484 307 90 360 299 239 434 322 151 593 179 -70 214 387 140 172 94 -74 242 73
2778 73 -160 -167 -168 -141 -21 -224 -22 -257 -236 -117 -153 -440 -136 -234 -333 -53 -387 -467 -136 -135 -321 -129 -399 -249
2802 -249 -88 -322 -89 -50 -381 -46 73 -210 203 59 -144 152 -302 -152 539 -150 63 392 199 -138
2822 -138 -173 46 285 453 199 749 450 147 149 -27 127 333 305 64 395 -68 -75 238 213 139 205 131 -283
2845 -283 313 -569 253 19 -149 -221 -272 -240 -113 -145 -423 -135 -305 -240 -72 -250 -279 -145 -374 -297 -309 -241 -249 -288
2869 -288 -256 -109 201 -402 -172 -79 -204 193 211 -186 -23 2 42 118 371 126 270 407 300 244 95 500
2891 500 256 42 268 496 27 579 85 75 530 238 -163 303 73 240 268 41 -6 156 -41 81 -15
2912 -15 -253 -41 83 -163 -113 -121 -256 -197 -109 -441 145 -219 -525 -201 -207 -73 -108 -332 -294 2 -252 -219 106 -14
2936a4k33K82k93L55o4L4K44k94o6K08k13R5J03J0K0M16k56k43J57q6K69n5l05
2959G1L38l81J70J52k86J80mm60N52K41n82o8K62m17l6M34r3j00j06L8L4P5l9
2982b5o3l53N65l17o4M89j94m48k12M14k83J54N94o13J03l2J09j66J77k53N76
3003A58j79k77K79N2rJ59k83j51N13N9j57J52l15K17K04r3K7l36J33j12L77k97
3025A21J5J15l8J7M9k85M52m34J34J19k03j55K44k34j11L55l38K83J07o06O10
3046B17l54k17J36j1r1M90l91P0r3p3r9N49l49n3j04J52J74k40N9j94L11k23M15
3069H1k13j86N18L3l98K69p1Q8R7j56M6L68k45k09M2J05j56L04j57J31J00l10
3091H1L10M6k83r1R7j33K08k77K53L52m42l05J49j83j28M75l88K88P4l36K57j87
$$ plain form
2936 -14 -247 35 -258 97 33 67 311 17 -49 159 -54 41 144 154 174 590 334 91 248 162 431 376 71
2959 71 409 28 198 350 64 244 240 -220 332 573 -9 -77 185 -232 -268 166 73 -27 -133 -95 -61 14 -25
2982 -25 -88 -441 124 -193 -257 232 38 -410 -622 -208 -491 -337 257 -356 -253 -285 -176 -342 -165 -418 158
3003 158 -21 -298 -19 33 24 183 -100 -251 262 321 164 316 1 218 422 329 356 20 153 41 418 121
3025 121 136 251 213 230 279 -6 446 12 146 265 62 -93 151 -83 -194 161 -177 106 213 -393 217
3046 217 -137 -354 -218 -229 -320 170 -221 -151 -244 -317 -416 133 -216 -269 -373 -221 -47 -287 -228 -422 -111 -334 81
3069 81 -132 -318 200 233 -165 104 33 121 218 62 108 476 231 22 64 169 13 317 160 291 391 81
3091 81 391 437 154 63 160 27 235 -42 211 563 121 -184 -35 -218 -346 129 -259 29 103 -233 24 -163
3113a63k73J93J30j05oOk2j22Kj93M34o2K24l15M6J84j91l58M40L85m84K31j20
3136a39J45J51k81K93P6k04K4N83l89j51k03M2K75N0K04j82j10k6N1J21n28O56
3158D58k50p9j5j62J64J28o7p7L70n65j61N97l07nK10m33J36K39m78K57Q0j53
3180a13j81M39n98M23j01k36K10r8J41j89R1%M9r3J51j57M0K61o0k79L63K11j60
3203A14k8p6J37p3M3K05J20m49J47J50j15j9lj03K34j32k39N21l50j05Q5P5M5
3226A84J8L5j09K91m66K78j00r8O5p3l5m5K5q6JN8j92K96j31j40r8K23k06Q2k12
3251d35K07R0k56J84k1J44l5K8l9M4J00o6oj65J38L02k01q8J50j86L10k23K48
3274B24k78K59j87J92M16o52K82j08Q7j63J26j89K27J08m18L23Q6m9K74k46k61
$$ plain form
3113 -163 -436 -243 -113 -218 -224 -218 -240 -362 -360 -553 -119 -181 43 -272 -226 -42 -233 -591 -151 234 -250 -19 -139
3136 -139 6 157 -124 169 245 41 65 648 259 108 -95 -53 222 272 476 294 184 158 209 330 -198 458
3158 458 208 129 114 -48 116 244 177 100 470 -95 -256 341 34 29 239 -194 -58 181 -297 -40 40 -113
3180 -113 -294 145 -453 -30 -131 -367 -157 -255 -114 -303 -212 -212 -163 -256 -105 -262 -222 39 -21 -300 63 274 114
3203 114 86 10 147 74 117 322 442 -7 140 290 175 156 153 50 284 152 -87 434 84 -21 64 139 184
3226 184 202 237 128 419 -47 231 131 33 98 25 -10 -55 -30 -116 -115 -57 -249 47 -84 -224 -322 -99 -305 -223 -435
3251 -435 -228 -138 -394 -210 -231 -87 -122 -94 -133 -89 11 -55 -61 -226 -88 214 13 -75 75 -111 199 -24 224
3274 224 -54 205 18 210 626 -26 256 148 235 72 198 9 236 344 -74 249 335 286 560 314 53
3295E3q6p9M18K9l75o3N7j90R8K07k21P6J01j09n4j10j12P7J93k23P2NP1l3k64
3320d62K24K06k93L1J57j36J80K46k05J2qj78K00J28p3Qn6K62r0k98K07M06l50
3343A18j79M84o08N44j47m21L95J42l67j28L97j85M6Q6J36p2k4K8k9k13j1mm1
3366e3N6K1k39K56k97k06L73j76QJ83j07j61K33mj80J53j12j71M24pn57L44j09
3389c28J08J13j94L67j27l62N63r2k85L90Jn67N20m7m5p4K29j61J21k56K84N4
3411B12j81M6M2k95L50O4k42M58j39k63M4m7J1O36n69r7K48k21k43J00O1J20j18
3434b3p7j93R4j36J25J8j23J10J57j62M77o59J46L9j37r8K93k36K04K84m69Q0
3456b86K79k13K50J90j00k78K69q8M48l96j7j43mL98j3l93J12L29k66L15j08o
$$ plain form
3295 53 -33 -112 306 335 -40 -103 -46 -236 -138 69 -152 -76 25 -84 -138 -248 -360 -283 -90 -313 -241 -236 -165 -198 -462
3320 -462 -238 -32 -325 -294 -137 -273 -93 153 -52 -40 -48 -226 -26 102 29 37 -19 243 153 -145 62 468 118
3343 118 -61 423 -185 359 212 -209 186 328 -39 -167 230 45 91 177 313 241 217 245 216 3 -8 -12 -53
3366 -53 3 24 -215 41 -256 -462 -89 -265 -257 -74 -181 -342 -109 -113 -293 -140 -252 -423 1 -6 -563 -219 -328
3389 -328 -220 -107 -301 66 -61 -423 140 48 -237 153 154 -413 107 60 15 -59 170 9 130 -126 158 212
3411 212 31 77 119 -176 174 238 -4 454 315 52 96 49 60 696 127 30 278 57 -186 -86 -25 95 -23
3434 -23 -100 -293 -199 -335 -210 -192 -315 -205 -48 -210 267 -392 -246 -207 -344 -442 -149 -385 -181 103 -366 -286
3456 -286 -7 -220 30 220 120 -158 111 23 471 75 58 -85 -89 309 296 -97 15 344 78 393 285 279
3478B79k34L24l22L75j26k51J72J12j91L39m40j82L72j6j80J19k62J72m5J87J30
3499C32j69j47mj28K18l6k20o6K38k21l4j76L61l22M00k03L3k34J12K36m4p9J50
3522cJ51o1j22n9M7PJ5k0J50k99K54O0k99K02J14J27j91L77l78J49L60n01L95
3545D75l08r6j8K62j99J59j86K43J37l89k58L22O6j81Q6j62k28L39l13K46j76
3566a79J55k1j00O3K29O5m66J91k29N9J99l89J45K81n33N66o8J6k66J08J43o5
3588i6J63l68J82M7n6K53j37j13N8K07j65K98k63K2k8M2J16Nl54L89L01l44J62
3611C21j02M0Kn3J44j03J67k43N8km29L23j24J6N4k21K82J7j59J2J3j34j31j18
3635c70K36L24j24k24O9l74K42j55K61p6J58n0J20k60Q7m0N0j44N5O19m86q4j7
$$ plain form
3478 279 45 369 47 422 296 45 217 329 138 477 37 -145 227 211 31 150 -112 60 15 202 332
3499 332 163 16 12 -116 102 66 -154 -220 18 -203 -237 -413 -52 -374 26 -177 -144 -378 -266 -30 -74 -153 -3
3522 -3 148 87 -35 -94 -47 -40 -25 -45 105 -194 60 120 -179 23 137 264 73 450 72 221 581 80 475
3545 475 167 71 53 315 116 275 89 332 469 80 -178 144 210 29 115 -47 -275 64 -249 -3 -179
3566 -179 -24 -45 -145 -82 147 212 -254 -63 -292 -233 -34 -423 -278 3 -530 36 -32 -16 -282 -174 -31 -96
3588 -96 67 -301 -119 -72 -128 125 -12 -125 -67 140 -25 273 10 32 4 46 162 167 -187 202 503 159 321
3611 321 219 259 261 208 352 249 416 173 231 229 -200 123 -1 15 69 -152 130 147 -12 0 13 -121 -252 -370
3635 -370 -134 190 66 -158 -89 -463 -221 -376 -115 -191 -33 -83 37 -223 -136 -176 -126 -270 -215 404 -82 -166 -183
3658a83M5K87l55QL80k78L45j9r9k62L03k53K14L0L4K9m0J46q1K8l52L97k66K74
3682C32l04N7lj19J01o1RJ23j36J01m49M93l08O5M2k42L40L1k40l41O35k36k46
3705c56M63m21m6L95n36J67K99n6K3p3l63K02L67l65nN03l33K87j89p1L52l39
3727i5O4K58M6m91K61M4n0J52k33K4j44N02k4p6j77N8K23k58R6L6r0J90k00M2
3751A58J98m17j50N11l68k5J98J91k93Q0j64m4O7r4K8m4j67K73Q3n57N58k29R
3774a98J41j16N9J76r7j37J69J30k91J50N8k94K07l6PJ04l5O0L2k60M42n93K95
3797b7L23k18J80o0k23K52n6l50M30k32R0O9P1k17j30L40l23K09k04J77J39l23
3819h3J09j54J96j1P0k97M64n38J50N4K9j22J33l9j48k8L7L0%m4k0L13n93K50
$$ plain form
3658 -183 -138 149 -206 -198 182 -96 249 230 131 -131 172 -81 133 163 197 226 186 332 251 279 -73 324 58 332
3682 332 28 85 82 -37 64 3 12 135 -1 100 -349 144 -164 -99 -57 -299 41 72 -168 -509 126 -110 -356
3705 -356 107 -314 -360 35 -501 -334 -35 -91 -68 -141 -504 -302 65 -300 -305 198 -135 152 -37 -108 244 -95
3727 -95 -31 227 273 -218 43 87 37 189 -44 -20 -164 338 314 238 61 119 342 84 180 216 126 316 116 158
3751 158 356 -61 -211 300 -68 -93 105 296 3 83 -81 -125 -58 -152 -124 -168 -335 -62 21 -536 22 -207 -198
3774 -198 -57 -173 -114 62 -35 -172 -3 127 -164 -14 44 -250 -43 -79 -72 32 -3 57 89 -171 271 -322 -27
3797 -27 296 78 258 198 -25 227 171 -179 251 19 109 178 249 32 -98 242 -81 128 -76 101 240 -83
3819 -83 26 -128 68 57 127 -170 294 -244 -94 -40 -11 -133 0 -39 -187 -215 -178 -148 -148 -192 -212 101 -492 -242
3843b42N7kL74j31k24J34j99Q5J92O7j21j41K88l39P71n29j89P0j1K57K50k80
3865A37n0O8j49M4L92l65K47k02j37K53p6k05K10K80l97J24q2k01K56j57J66r7
3887E9k72O1K93l77J80K4k03q4P4R2J20j80n3M55l48lK12k58j78J71P7l7L30o09
3911d54M55J93n64M47J2m0K3k27J71J03o0J3l4Rk25K46p9L07n3l38K78n8j21L99
3935D03j66k6j29J6j93K46J0j99J78J17j17m4r8k1K33j56N0k12p0L23M2n53N75
3958B09k26k42N02o54K23P4j7n3oj05NJ51J7kJ3J23j02k12MK76j2k87M11r6m19
3983d25K26J21J97L2k87k3L88r6k00J50Q9q5LJ55k62J36k75L73j81J83n6J3R5
4006B71j36K5k13K96j27j4k34J56J97k89K16Mj11k83K07Pq4O7j5k6J03l84R3K68
$$ plain form
3843 -242 -185 -187 187 56 -168 -34 -233 -148 44 111 -10 -151 137 -202 569 40 -149 -79 -90 167 417 137
3865 137 87 155 6 50 442 77 324 122 -15 238 162 -43 167 447 50 174 92 -109 147 -10 156 59
3887 59 -213 -152 141 -236 -56 -32 -235 -319 -245 -153 -33 -213 -266 189 -159 -162 50 -208 -386 -215 -138 -175 155 -454
3911 -454 1 194 -370 77 89 49 72 -155 16 119 59 72 38 47 -178 68 -11 296 243 -95 183 125 4 403
3935 403 237 211 82 98 -95 151 161 -38 140 257 140 96 -2 -23 210 54 104 -108 -178 145 187 -366 209
3958 209 -17 -259 243 -411 -188 -114 -131 -184 -190 -295 -290 -139 -122 -124 -111 12 -90 -302 -298 -22 -34 -321 90 -6 -425
3983 -425 -199 -78 119 151 -136 -159 229 133 -67 83 172 87 90 245 -17 119 -156 217 36 219 163 176 271
4006 271 135 160 -53 243 116 102 -132 24 221 -68 148 152 41 -242 -35 -28 -112 -45 -60 -86 17 -367 -274 -6
4030fJ00o20M99j88J48j63J55m3mj81L1K44J69j42j95J16r1K46r0ok52L05M1J04
4054A77l29K65J29k52K72l11J65K20m41J53J44j81K08P6j06j49l0l3K31J07k09
4075A06K06k67P8J04k01j06K31j56L20l62j19R2K85k48j16J6j82L25l9k61J68
4096a26L8j54N3o3O7N7P7JJ31l08L15j69o7J26j0P0j13K69l30J70K63k51k93K35
4120a2r5L29l10kO5J45L9j60K15rk50j15L61j43n9K35J0k35L27j74j91r4J36L
4144A6j13J4J23K5q9LKl28M26J44l23K09j82j88J71k51K34L13l37J25K10l04q3
4167a83K31k19J10o2J8j02o6L8K53J05P4r8L7m54L65q9j8O4Q1q0J17R5j44m5J10
4192A38m8Nl1pK26m21M55r6k21K30R6l27K47J02l46P4J35n5Kq0j66J90j68J30
$$ plain form
4030 -6 94 -526 -27 -215 -67 -230 -75 -118 -122 -303 -272 -28 141 -1 -196 -80 -171 75 -15 -21 -273 32 73 177
4054 177 -152 113 242 -10 262 -49 116 336 -105 48 192 11 219 295 189 40 10 -23 208 315 106
4075 106 312 45 123 227 26 -80 151 -5 315 -47 -166 -74 211 -37 -153 -137 -319 6 -33 -294 -126
4096 -126 -88 -242 -189 -252 -185 -128 -51 -50 81 -227 88 -81 -148 -22 -32 38 -75 194 -136 34 297 46 -247 -12
4120 -12 -107 222 -88 -90 -25 120 159 -1 214 205 -45 -160 201 58 -1 234 244 9 336 162 -29 -123 13 16
4144 16 -97 -83 40 65 -24 -21 -19 -347 79 223 -100 109 -73 -261 -90 -341 -107 206 -131 -6 204 -100 -183
4167 -183 48 -171 -61 -123 -105 -207 -273 -235 18 123 197 99 136 -318 47 -42 -60 4 85 5 122 217 73 28 138
4192 138 90 95 64 57 283 -138 317 221 0 230 326 -1 246 348 2 76 211 156 158 78 -88 102 -66 64
4216F4m1J25l73J24j94K89J55l45L58j35nj05J68k81L42j52R0j03j91N2J43k80
4238b95N5J50O7O5k75K60QJ53k90k25L09n4L65o04J07J36j46K81j81L15m71M82
4260B12Q5j45K00m11J67J11m56L21n3K37k31j1J37j49M5j99K90m9J2N4M6j63O7
4283A17k69L36K01k94j27M2N7j59K03k19J48n3j82P1o7K79k36j30L35l21J70N0
4305d8N7J2J82q5m12L04p8l82L47J26l6L9j60J61j74K69J45l47R5K79j84j09K37
4328B38k21j9J65K58l98O0K7m8K18l3k78K11m0k43J88j16J39Q8k50O4q1k4J56
4351F1J71k99pj69K14J04k91po0L72j15j3k22J52K18j77M0j00Q1K6k3q0k08L91
4375E9l08Q7j27M10j17Q1j98M8j0nJ07J63k13J35k2J24K65n32J66J08l67K4j8
$$ plain form
4216 64 23 148 -225 -101 -295 -6 149 -196 162 27 22 -83 85 -196 146 -6 84 -19 -210 -158 -15 -295
4238 -295 -240 -90 -23 42 -233 27 35 188 -102 -327 -18 -72 293 -311 -204 -68 -214 67 -114 201 -270 212
4260 212 297 152 352 -59 108 219 -237 84 31 268 37 26 163 14 59 -140 150 101 113 167 213 50 117
4283 117 -152 184 385 91 -36 6 63 -96 107 -112 36 -17 -199 -128 -195 84 -152 -282 53 -268 -98 -48
4305 -48 9 21 203 118 -294 10 -68 -450 -103 23 -13 26 -134 27 -147 122 267 -80 15 294 110 1 238
4328 238 17 -2 163 421 23 83 110 62 280 247 -31 180 140 -103 85 -31 108 196 -54 10 -71 -95 61
4351 61 232 -67 -74 -243 -29 75 -216 -223 -283 89 -26 -39 -261 -109 109 -68 -28 -128 -47 -21 -44 -124 -332 59
4375 59 -249 -162 -289 121 4 85 -113 -65 -75 -80 27 190 -23 112 90 214 479 -53 113 221 -146 -122 -140
4398a40J57K19l5j86K84k12n3j6J54J18j19k78p9J81J1j78J26j18l5K69p6O8j84
4421a22K2p7J39j81L14j45j30J15J69n9M0l86J04P0j12K7J05N9R7j38K7J47o5
4444B0j76L56k41kJ77O2j17n6Nn3J54N5l22J38M8J66j76j0m8R8M9K20l48j85L50
4469A64j97K69k83K48j86M7k6J0j38J07q1J38j05P1K6j01k2j73j6p9R5J75J67
4492A10l18M2K65j70M8k21K4o1L64k72J0K15k50N73l39Rn7q4Q1m5J80j9J32j09
4516A08K0lk23N8J80J15l06J9K14k29q7L8K76o2j04nl3K18j73j22J05j27J51l1
4540cJ32m00K10K36k15J86K19k57q5k71K69k26K37q6K97m62K40J1j96L6j1K08
4562F9q4k55J95R3k65K60l02L07l97N15k60K89p3L0m05J08L62J9k30J25j07J87
$$ plain form
4398 -140 17 236 201 15 299 87 34 18 172 290 171 -107 -186 -5 6 -172 -46 -164 -199 70 -6 62 -122
4421 -122 -100 -177 -38 -219 95 -50 -180 -65 104 45 85 -301 -197 -127 -239 -212 -107 -48 49 -89 -62 85 20
4444 20 -156 200 -41 -43 134 196 79 23 28 -25 129 184 -138 0 48 214 38 28 -20 78 127 347 -1 -186 164
4469 164 -33 236 -47 201 15 62 36 46 -92 15 -66 72 -33 38 64 -37 -59 -232 -248 -327 -232 -57 110
4492 110 -208 -166 99 -71 -23 -244 -220 -281 83 -189 -179 36 -214 359 20 29 -28 -112 -31 -76 104 85 217 108
4516 108 128 125 -98 -40 140 255 -51 -32 182 -47 -134 -96 180 118 14 9 -24 194 21 -101 4 -123 28 -3
4540 -3 129 -271 -61 175 -40 146 365 108 23 -248 21 -205 32 -54 243 -219 21 32 -164 -128 -139 69
4562 69 -15 -270 -75 18 -247 13 -289 18 -379 136 -124 165 92 122 -283 -175 187 206 -24 101 -6 181
4584A81l65lM53m9j46j08K46k62L13l91K88j64K28m20L80q7rr5K32j71P7K1j18
4607C1J43l10J24l27J97k44K57j01K45j80Q1k92K26K59o5l25K66j01j10K25k49
4628b50J73L29l11j66L67k30L6J09m7k23M77k80p7K09j23M3K57m19Q8J69p0j96
4650a35M16l31J13k78N07o2o0j80j2J99K8j61q8L1J45j84J54k60J95K65o3k75
4672c6k55J08J10L62k58P1J32m57J32np9O7j48J57LJ44l00L57r1q2J69J13j91
4695B3oj0J78j90OK0l86L71k71J16N6O9p7M0L20l24l0J85k01J02nj0K87j9j67
4720G7r6L92m51M67l43J40j80K43k1k91J56j93J17N1N0J66n20L14j11k2K28l14
4742a41o9J00K33j60J61k56l3J48o2P2j34P7nJ11k15L3K00p2Q9M2j09J13N0k89
$$ plain form
4584 181 -184 -187 266 217 71 -37 209 -53 260 -131 157 -7 221 -199 181 94 85 -10 222 51 128 149 31
4607 31 174 -136 -12 -339 -142 -386 -129 -230 15 -165 -84 -376 -150 109 44 -281 -15 -116 -226 -1 -250
4628 -250 -77 252 -59 -225 142 -88 -52 57 10 -213 264 -16 -93 116 -7 36 293 -126 -38 131 61 -135
4650 -135 281 -50 63 -215 292 230 170 -10 -22 177 205 44 -44 -13 132 -52 102 -158 37 302 239 -36
4672 -36 -291 -183 -73 289 31 102 234 -223 -91 -96 -175 -108 -256 -99 -96 48 -252 105 14 -68 101 214 23
4695 23 17 7 185 -5 1 21 -365 6 -265 -149 -93 -24 -101 -61 259 -65 -95 90 -111 -9 -14 -24 263 244 77
4720 77 -19 373 -78 389 46 186 6 249 228 -63 93 -100 17 68 118 284 -236 78 -33 -55 173 -141
4742 -141 -210 -110 123 -37 124 -132 -165 -17 -79 -7 -141 -64 -69 42 -173 -140 60 -12 77 119 10 123 173 -116
4766a16J5J42J38k7k65K04K3j32j10K18k08K26k01N3O4J67l5k2J88k69L24k03
4788A74p5m2J94n61M57k6j88J68j43R5J22n9q4M1J61k72L9k01J01K83l90q9K33
4811f2k4J65j17o4m1J53k5m2k22K22pJ01l58j3J28M6J16l14K92j78K09k07K16
4834b6j76K86mK0l6r2J2l8L16k47K24m25K89j53K84m9J55n83L02k1J20R3j90k45
4858a84J97J31r8l1k58L44q7k04Q7M40m69J00K4j42J82J38l19K27L2j6q8K3n5
4881b6N1j60J49k2j29k01N29N5j91J02m19j30L41N7mJ5O3k59k2J29J36jj39j8
4905i4J17jJ30j72J28n8j5m2K52Lk49J80j34L3q4j57J73m4q0L63l18K58m00J88
4929b3P2K26Jn4o5m81L87l37K54o4J19j41J42k34R3q8O9j87K56J52l8Q1l79J28
$$ plain form
4766 -116 -101 41 179 152 -113 91 114 -18 -128 90 -118 108 -93 -40 24 191 156 134 322 53 377 174
4788 174 99 57 251 -310 147 121 -67 101 -42 53 175 116 32 73 234 -38 1 -200 -99 184 -206 -295 -62
4811 -62 -86 79 -38 -102 -143 10 -15 -57 -279 -57 -64 37 -321 -334 -206 -160 -44 -358 -66 -244 -35 -242 -26
4834 -26 -202 84 80 100 64 -28 -16 -54 262 15 239 -186 103 -50 234 185 340 -243 59 38 158 251 61 -184
4858 -184 13 144 46 15 -243 101 14 -190 -103 337 -132 -32 -8 -150 32 170 -149 78 110 94 6 29 -26
4881 -26 25 -135 14 -8 -137 -338 191 246 55 157 -262 -392 -51 6 2 17 80 -179 -201 -72 64 63 -76 -94
4905 -94 23 22 152 -20 108 50 35 -7 245 248 -1 179 45 78 -6 -163 10 -34 -114 249 -69 189 -211 -23
4929 -23 49 275 276 222 157 -324 63 -274 -20 -84 35 -106 36 -198 -105 -193 -124 -311 -55 97 59 140 -239 -111
4953a11P9l7J33n6L0j68L4J29k68K29j02J23r2k37K01Q6k0L4K34j23j65K48J8
4976A99p7j05l4%q4R5J05j21pJ25j70J93j11l0J70k70J85J17j41m9K27k21J29
4999A25j2k01j66Q5K6K63N4k20j39l4K75J5J75m38j4K53l6o5n4J51P0k33n6Q2
5023i4J64j43J0m4j29L98j40p4N9J41J00l18N2N0rM7K18k50L21k37m4R0j46J35
5047A57R7j72j39K31J63k52M9r9p4J60j17J14k41J10p2N05l69L8j64O7qpn0j34
5071b07J52J2P0K0j15J13M5j02J09k40J81j10m1n8j05L2K01J55l70L8K79j51j24
5094b16O0K75j57L6k3K22k35MrR0l0M5k18K89j38l10K53L4K27n0m6j62J32j06
5118c3j97J43m5K26J11p1pl72K65L3P4k56N6P7m1K56j97j47J43k23K74r5q6J63
$$ plain form
4953 -111 -32 -69 64 8 38 -130 -96 33 -235 -6 -108 15 -77 -314 -113 -27 -47 -13 221 98 -67 181 199
4976 199 122 17 -17 -17 -101 -6 99 -22 -29 96 -74 119 8 -22 148 -122 63 180 39 -10 217 -4 125
4999 125 113 -88 -254 -169 -143 120 174 -46 -185 -219 56 71 246 -192 -206 47 11 -54 -108 43 113 -120 -176 -94
5023 -94 70 -73 -63 -107 -236 162 22 -52 7 148 248 -70 -18 32 23 70 288 38 359 122 78 168 22 157
5047 157 254 82 -57 174 337 85 134 35 -39 121 4 118 -123 -13 -85 420 51 89 -75 -8 -16 -23 -73 -207
5071 -207 -55 -43 27 47 -68 45 90 -12 97 -143 38 -72 -113 -171 -276 -244 -43 112 -258 -220 59 -92 -216
5094 -216 -156 119 -38 -2 -25 197 -38 -34 -43 47 17 62 -156 133 -5 -315 -62 -28 199 149 103 -59 73 -33
5118 -33 -230 -87 -132 94 205 134 127 -245 20 53 127 -129 -73 4 -37 219 22 -125 18 -205 69 -26 -112 51
5142E1P3j80o7K74k09J17J41o2k66J09K46k96r6J56k30J73k2J50m7k41J80j65
5164b11M26j61N0q4l0Q4m5J03j35q8P3N3K7j87R8L0J24k21M48m65J05n0K64j75
5188C3K79j97k2O3j06J48k11J35o0J52j99J18j59J48j44j41Q0J41l9m5o4J18J4
5211D2j33Q0J23p7k08L93k66j50K93K5l57L37k4l20L32J87k19nOK3k47k26L99
5234HJ41j99P8J89j85J65k48J73k58L8o1K42n8n0N5p0K4K5j79j49L73J7N4Q6l37
5259a26K00P4k91J62j96K23R6k05L22k34j64J52j13k46K17K71k62O2j29L50j96
5280c3J91k45J58k54J59l8k55K34j14J24J35j69K92k15k0J95lj53J90n7j18j01
5302i7J41r4k73M93k90R4N57m83k7J01k93P8k9L09r3n02M81q8m7K24PO6p4J22
$$ plain form
5142 51 124 -56 -123 151 -58 59 200 138 -128 -19 227 -69 -165 -9 -239 -66 -88 62 15 -226 -46 -211
5164 -211 215 54 104 20 -10 74 29 132 -3 -91 -18 35 62 -125 -27 3 127 -94 354 -111 -6 -56 208 33
5188 33 312 115 93 156 50 198 -13 122 62 214 15 133 -26 122 -22 -163 -83 58 19 -26 -90 28 42
5211 42 -91 -11 112 35 -173 220 -46 -196 97 122 -235 102 78 -242 90 277 58 53 59 82 -165 -391 8
5234 8 149 -50 28 217 32 197 -51 122 -136 -98 -159 83 25 -25 30 -40 -16 9 -170 -319 54 71 125 211 -126
5259 -126 74 148 -143 19 -177 46 142 -63 259 25 -139 13 -100 -346 -129 142 -120 -58 -187 163 -33
5280 -33 158 -87 71 -183 -24 -62 -317 -83 -197 -73 62 -107 185 -30 -50 145 142 -11 179 122 4 -97
5302 -97 44 -50 -323 170 -120 -26 531 48 21 122 -171 -93 -122 187 94 -408 73 -15 -62 162 169 235 161 283
5326B83j64j33J6j2pKO1j87m2J47R2O7j31j27M84n04j43J64N6k8L9P0J32j04l4
5351cr7k6j22N9k4K42q1l1N7J10j97L6K93k16rK0K57l24l3k76P24n21OJ66K48
5376B58j50j15K84k69K77k26M5Jo1o9M7J15l21L92k76J07n9q4K84k12l97M05q
5399c2j15J6K96j68J44p5k3k69K09J31k90O2J29l2n4J12j14K76m1k01l9Q8P4m33
5423c49L28p2k6K83k7m4q1j45L5L33l68P3K8J88j39J04j28O4K41j27n7n9j7J70
5447B08k20J70Q5j39J06j44O1L4o8P1j88K19l14K42k48QL15n45N95l50K34j6l79
5470b63K83kR9j75k82N48q4j49q0rJ63N9j16j6J64Pk57l0K59j99n3M92m25L7J4
5495a5j17K53j53K91m19O36k55m0k97l0P5J49j19K2J81k19J6M3q2J17M3J41m64
$$ plain form
5326 283 119 -14 2 -10 -17 -15 46 -141 -183 -36 56 123 -8 -135 349 -155 -298 -134 -78 -106 -67 3 135 31 -3
5351 -3 -100 -126 -248 -189 -213 29 -52 -83 -26 84 -113 -77 216 0 -9 11 268 -56 -89 -365 359 -162 -156 10 258
5376 258 108 -7 277 8 285 59 104 105 44 -25 22 137 -184 208 -68 39 -20 -104 180 -32 -429 -24 -32
5399 -32 -147 -131 165 -3 141 66 43 -226 -17 114 -176 -114 15 -17 -71 41 -73 203 162 -39 -78 10 84 -349
5423 -349 -21 -93 -119 164 137 93 12 -133 -98 235 -133 -60 -32 156 17 121 -7 57 298 171 114 55 38 208
5447 208 -12 158 243 104 210 66 127 161 93 164 -24 195 -119 123 -125 -117 198 -347 248 -102 132 116 -263
5470 -263 20 18 117 -58 -340 208 124 -25 -105 -114 49 108 -8 -24 140 147 -110 -140 119 -80 -133 359 -66 -29 -15
5495 -15 -132 121 -32 259 -160 476 221 181 -116 -146 -71 78 -41 -19 162 -57 -41 2 -80 37 80 221 -243
5518b43K13K1J10l69J55K82j04j2l89K61p1J95j90o1L18l5k9l5l9k2J7j7J15j46
5542g5K28r0j11j74rL37j46j09J38Q4O0j27L7L23m08K15j65P1k1j15m1J73j76
5565a01J94j5q8o1J38L7k03L53l21J29j2J59m55N84m57j0j99L37m9J65q0Rm8r7
5589i1K55k35Lm8r9K34j67K01l56R3n2J68k2J74k49l2M13l13M2J50o7J70k26k2
5613g6j39L16j22j00J00J89m96K11K23j67O9Jr2K26j18O1j25o7L40k88K77l01
5635g8r8J07J45j85J49J02j4J10n3n15J74L38M3k36l8J30j92J93J5J03k03j0Q0
5658F7K10m32N23o78K30L0L7k44J02J22o9o3j8J67J5j91J16j5r3o6J94L17k79
5681a8K1K75j97j07J86k95O1J5l2J11mk09k6L19J46l40OK67p9Nk22J48j62J15
$$ plain form
5518 -243 -30 -9 101 -268 -113 169 65 53 -336 -75 -146 49 -141 -202 116 81 52 17 -22 -44 -27 -44 71 -75
5542 -75 153 63 -48 -222 -231 106 -40 -149 -11 73 133 6 43 366 -42 173 8 79 58 -57 -98 75 -101
5565 -101 93 78 -10 -71 67 104 -99 254 -67 62 50 209 -246 338 -119 -129 -328 9 -40 125 45 54 6 -91
5589 -91 164 -71 -68 -116 -215 19 -148 53 -303 -210 -262 -94 -116 58 -191 -223 190 -123 -81 69 2 172 -54 -76
5613 -76 -215 101 -21 -121 -21 168 -328 -117 106 -61 8 9 -83 143 25 86 -39 -106 234 -54 223 -78
5635 -78 -176 -69 76 -109 40 142 128 238 185 -330 -156 182 225 -11 -49 81 -111 82 97 200 -3 -13 67
5658 67 277 -155 368 -310 -80 -50 -13 -257 -155 -33 -102 -165 -183 -16 -1 -192 -76 -91 -184 -250 -56 261 -18
5681 -18 3 278 81 -26 160 -135 -74 -59 -91 20 16 -193 -219 100 246 -94 -88 179 100 105 -117 31 -131 -16
5705a6p8p3K11K66l38L02m15k7R9j82K60m6P2K35j64M6Q0k25q2M1J53Qj31J26
5729A22j09L4k2q9R6R6j32q6l5m8K72l04K12Rr2R3K01k37l12K10J27M7l20J35
5753a32L62j79n1N4M5j9k34J03J98k47J41J85l88k9R4PP7K52l02K48J3q2j11Q7
5777I2k02j53J81P4Q7k84o6M05k57j6P2P9K2j19K17m4k66J88j95n0K97l93J56
5800a75Q9K45l74O2k4J81K7J9O2l65L34kK71n35J28J19J8N3l2J5O5j74j31pM85
5825C54m88K04J89k13k4j03K91R6m34J22l2J60o6l2M2m7J05l5l98K55J20r1J19
5848I4k9j87J68N6k4O6l57J07L93m85k8N08J00l76Mj43J45k29J24k16K04J2L42
$$ plain form
5705 -16 -94 -167 44 310 -28 274 -141 -168 -69 -251 9 -37 35 270 106 152 232 7 -75 -34 119 127 -4 122
5729 122 13 47 25 -64 32 128 -4 -90 -125 -173 99 -205 7 16 -76 17 218 -19 -331 -121 6 53 -267 -132
5753 -132 230 51 0 54 99 80 -154 -51 147 -100 41 226 -162 -191 -97 -90 -13 239 -63 185 198 116 5 92
5777 92 -110 -263 -82 -8 79 -205 -271 134 -123 -139 -67 12 34 -85 132 88 -178 10 -185 -235 62 -331 -175
5800 -175 -86 159 -215 -153 -177 4 31 50 112 -253 81 79 350 -185 -57 62 80 133 101 116 181 7 -124 -131 354
5825 354 -134 70 259 46 22 -81 210 306 -128 -6 -38 122 56 24 66 19 124 89 -309 -54 66 -25 94
5848 94 65 -122 46 102 78 144 -213 -106 287 -198 -226 282 382 6 10 -133 12 -217 -93 -309 -105 -93 249
$$ [...]
8191A40
##END NTUPLES=NMR FID
##END=
