##TITLE=1H_Pr C6 Boc
 200.13MHz, CDCl3,
 8 sc
 
 30.1.2025
##JCAMPDX= 6.0         $$ Bruker NMR JCAMP-DX V2.0
##DATA TYPE= NMR FID
##DATA CLASS= NTUPLES
##ORIGIN= UXNMR, Bruker Analytische Messtechnik GmbH
##OWNER= pz
$$ XWIN-NMR		Version 3.5
$$ Thu Jan 30 14:11:22 2025 Russian Standard Time (UT+4h)  she@DPX200
##.OBSERVE FREQUENCY= 200.1313
##.OBSERVE NUCLEUS= ^1H
##.DELAY= (6, 6)
##.ACQUISITION MODE= SIMULTANEOUS
##.ACQUISITION SCHEME= undefined
##.AVERAGES= 8
##.DIGITISER RES= 18
##SPECTROMETER/DATA SYSTEM= spect
##.PULSE SEQUENCE= zg30
##.SOLVENT NAME= CDCl3
##.SHIFT REFERENCE= (INTERNAL, CDCl3, 0, 14.3821)
##AUDIT TRAIL= $$ (NUMBER, WHEN, WHO, WHERE, WHAT)
$$ ##TITLE= Audit trail, XWIN-NMR		Version 3.5
$$ ##JCAMPDX= 5.01
$$ ##ORIGIN= Bruker BioSpin GmbH
$$ ##OWNER= she
$$ F:/spectra/data/she/nmr/H-C/1/audita.txt
$$ ##AUDIT TRAIL=  $$ (NUMBER, WHEN, WHO, WHERE, WHAT)
(   1,<2025-01-30 14:10:15.00 +0400>,<she>,<DPX200>,
      <created by zg, POWCHK disabled, PULCHK disabled
       configuration hash MD5:
       00 E9 B6 7A A2 85 ED C7 34 08 36 98 17 FE 4E 26
       data hash MD5: 16K
       93 29 8D 9D DF 5D C9 CE BF B3 D9 8E 1D 5E 97 2B>)
$$ ##END=
$$ 
$$ hash MD5
$$ 24 FC 57 FD A9 9F 0C 1B 5C EE 16 30 36 B2 63 78
##$RELAX= 
##$RELAX= 
##$RELAX= 
##$RELAX= 
##$RELAX= 
##$RELAX= 
$$ Bruker specific parameters
$$ --------------------------
##$DU= <F:/spectra>
##$EXPNO= 1
##$NAME= <H-C>
##$PROCNO= 1
##$TYPE= <nmr>
##$USER= <she>
##$AMP= (0..31)
100 100 100 100 100 100 100 100 100 100 100 100 100 100 100 100 100 100 
100 100 100 100 100 100 100 100 100 100 100 100 100 100 
##$AQSEQ= 0
##$AQ_mod= 1
##$AUNM= <au_zg>
##$AUTOPOS= <>
##$BF1= 200.13
##$BF2= 200.13
##$BF3= 200.13
##$BF4= 200.13
##$BF5= 200.13
##$BF6= 200.13
##$BF7= 200.13
##$BF8= 200.13
##$BYTORDA= 1
##$CFDGTYP= 0
##$CFRGTYP= 5
##$CHEMSTR= <none>
##$CNST= (0..31)
1 1 145 1 1 1 1 1 1 1 1 1 1 1 1 1 1 1 1 1 1 1 1 1 1 1 1 1 1 1 1 1 
##$CPDPRG= <>
##$CPDPRG1= <>
##$CPDPRG2= <>
##$CPDPRG3= <>
##$CPDPRG4= <mlev>
##$CPDPRG5= <mlev>
##$CPDPRG6= <mlev>
##$CPDPRG7= <mlev>
##$CPDPRG8= <mlev>
##$CPDPRGB= <>
##$CPDPRGT= <>
##$D= (0..31)
0 0.7 0 0 0 0 0 0 0 0 0 0.03 0 0 0 0 0 0 0 0 0 0 0 0 0 0 0 0 0 0 0 0 
##$DATE= 1738231814
##$DBL= (0..7)
120 120 120 120 120 120 120 120 
##$DBP= (0..7)
150 150 150 150 150 150 150 150 
##$DBP07= 0
##$DBPNAM0= <>
##$DBPNAM1= <>
##$DBPNAM2= <>
##$DBPNAM3= <>
##$DBPNAM4= <>
##$DBPNAM5= <>
##$DBPNAM6= <>
##$DBPNAM7= <>
##$DBPOAL= (0..7)
0.5 0.5 0.5 0.5 0.5 0.5 0.5 0.5 
##$DBPOFFS= (0..7)
0 0 0 0 0 0 0 0 
##$DE= 6
##$DECBNUC= <off>
##$DECIM= 32
##$DECNUC= <off>
##$DECSTAT= 4
##$DIGMOD= 1
##$DIGTYP= 9
##$DL= (0..7)
0 120 120 120 120 120 120 120 
##$DP= (0..7)
150 150 150 150 150 150 150 150 
##$DP07= 0
##$DPNAME0= <>
##$DPNAME1= <>
##$DPNAME2= <>
##$DPNAME3= <>
##$DPNAME4= <>
##$DPNAME5= <>
##$DPNAME6= <>
##$DPNAME7= <>
##$DPOAL= (0..7)
0.5 0.5 0.5 0.5 0.5 0.5 0.5 0.5 
##$DPOFFS= (0..7)
0 0 0 0 0 0 0 0 
##$DQDMODE= 0
##$DR= 18
##$DS= 0
##$DSLIST= <SSSSSSSSSSSSSSS>
$$ [...]
##$SUBNAM0= <"">
##$SUBNAM1= <"">
##$SUBNAM2= <"">
##$SUBNAM3= <"">
##$SUBNAM4= <"">
##$SUBNAM5= <"">
##$SUBNAM6= <"">
##$SUBNAM7= <"">
##$SUBNAM8= <"">
##$SUBNAM9= <"">
##$SW= 18.0517328524113
##$SWIBOX= (0..15)
0 0 2 0 0 0 0 0 0 0 0 0 0 0 0 0 
##$SW_h= 3612.71676300578
##$TD= 16384
##$TD0= 1
##$TE= 0
##$TE2= 300
##$TE3= 300
##$TEG= 300
##$TL= (0..7)
0 120 120 120 120 120 120 120 
##$TP= (0..7)
150 150 150 150 150 150 150 150 
##$TP07= 0
##$TPNAME0= <>
##$TPNAME1= <>
##$TPNAME2= <>
##$TPNAME3= <>
##$TPNAME4= <>
##$TPNAME5= <>
##$TPNAME6= <>
##$TPNAME7= <>
##$TPOAL= (0..7)
0.5 0.5 0.5 0.5 0.5 0.5 0.5 0.5 
##$TPOFFS= (0..7)
0 0 0 0 0 0 0 0 
##$TUNHIN= 0
##$TUNHOUT= 0
##$TUNXOUT= 0
##$USERA1= <user>
##$USERA2= <user>
##$USERA3= <user>
##$USERA4= <user>
##$USERA5= <user>
##$V9= 5
##$VALIST= <valist>
##$VCLIST= <CCCCCCCCCCCCCCC>
##$VD= 0
##$VDLIST= <DDDDDDDDDDDDDDD>
##$VPLIST= <PPPPPPPPPPPPPPP>
##$VTLIST= <TTTTTTTTTTTTTTT>
##$WBST= 1024
##$WBSW= 4
##$XGAIN= (0..3)
0 0 0 0 
##$XL= 0
##$YL= 0
##$YMAX_a= 353931
##$YMIN_a= -371703
##$ZGOPTNS= <>
##$ZL1= 120
##$ZL2= 120
##$ZL3= 120
##$ZL4= 120
##$ABSF1= 10
##$ABSF2= 0
##$ABSG= 5
##$ABSL= 3
##$ALPHA= 0
##$AQORDER= 0
##$ASSFAC= 0
##$ASSFACI= 0
##$ASSFACX= 0
##$ASSWID= 0
##$AUNMP= <proc_1d>
##$AZFE= 0.1
##$AZFW= 0.1
##$BCFW= 1
##$BC_mod= 2
##$BYTORDP= 1
##$COROFFS= 0
##$CY= -3
##$DATMOD= 1
##$DC= 2
##$DFILT= <>
##$DTYPP= 0
##$F1P= 0
##$F2P= 0
##$FCOR= 0.5
##$FTSIZE= 0
##$FT_mod= 4
##$GAMMA= 1
##$GB= 0.15
##$INTBC= 1
##$INTSCL= 1
##$ISEN= 128
##$LB= 0.25
##$LEV0= 0
##$LPBIN= 0
##$MAXI= 10000
##$MC2= 0
##$MEAN= 0
##$ME_mod= 0
##$MI= 1.114404
##$NCOEF= 0
##$NC_proc= 0
##$NLEV= 6
##$NOISF1= 3.799351
##$NOISF2= 2.8
##$NSP= 1
##$NTH_PI= 0
##$NZP= 0
##$OFFSET= 14.38212
##$PC= 1
##$PHC0= 99.33865
##$PHC1= 2.792229
##$PH_mod= 1
##$PKNL= yes
##$PPARMOD= 0
##$PSCAL= 0
##$PSIGN= 0
##$REVERSE= no
##$SF= 200.129724274929
##$SI= 16384
##$SIGF1= 3
##$SIGF2= 2
##$SINO= 400
##$SIOLD= 16384
##$SREGLST= <1H.CDCl3>
##$SSB= 0
##$STSI= 0
##$STSR= 0
##$SW_p= 3205.1282051282
##$SYMM= 0
##$S_DEV= 0
##$TDeff= 0
##$TDoff= 0
##$TI= <>
##$TILT= no
##$TM1= 0
##$TM2= 0
##$TOPLEV= 0
##$USERP1= <user>
##$USERP2= <user>
##$USERP3= <user>
##$USERP4= <user>
##$USERP5= <user>
##$WDW= 1
##$XDIM= 8192
##$YMAX_p= 0
##$YMIN_p= 0
$$ End of Bruker specific parameters
$$ ---------------------------------
##NTUPLES= NMR FID
##VAR_NAME=  TIME,          FID/REAL,        FID/IMAG
##SYMBOL=    X,             R,               I
##VAR_TYPE=  INDEPENDENT,   DEPENDENT,       DEPENDENT
##VAR_FORM=  AFFN,          ASDF,            ASDF
##VAR_DIM=   8192,          8192,            8192
##UNITS=     SECONDS,       ARBITRARY UNITS, ARBITRARY UNITS
##FACTOR=    0.0002768,     1,               1
##FIRST=     0,             0,               0
##LAST=      2.2672688,     0,               0
##MIN=       0,             -371703,         0
##MAX=       2.2672688,     353931,          0
$$ Real data points
##PAGE= N=1
##DATA TABLE= (X++(R..R)), XYDATA
0@%%%%%%%%%%%%%%%%%qJ6j6J6j6K4l2L2l7M5n3O1p2Q5r7J12j28J44j61J85k11
38a11K35k62K94l31L69m09M52n02N58o15O77p47Q25r09J000j100J210j333J470
57G71j620J789j983K203k452K739l070L445l853M219m196J854K6529L27556l48613
72E318l16559M41365L9002l57023J85358K05279l71017J490M25934j76786l74265
83b91904L09417K40273l39157p9789K89160p4684j80629J66032M7947k05820P8087
94d1067J97732j59522j60598K03972J16566k07044q1558J77013M1912j30604J782
105d1416P5720n4969q265J20385n8069j75900J22078J98124j78088j79499K04041
116B4142J08146j91126N4J37519j09622m1155J92844p4002k23069J74941J85327
$$ plain form
0 0 0 0 0 0 0 0 0 0 0 0 0 0 0 0 0 0 0 -8 8 -8 8 -8 16 -16 16 -21 24 -29 32 -40 45 -52 60 -68 76 -85 100 -111
38 -111 124 -138 156 -175 194 -215 237 -265 293 -322 355 -392 433 -476 524 -576 634 -699 771
57 771 -849 940 -1043 1160 -1292 1447 -1623 1822 -2031 2188 -2008 -154 26375 353931 5318
72 5318 -311241 130124 169126 -187897 -2539 202740 -168277 -166787 259147 82361 -291904
83 -291904 17513 257786 -81371 -161160 128000 53316 -127313 38719 86666 -119154 -41067
94 -41067 156665 -2857 -163455 40517 157083 -49961 -131519 45494 87406 -43198 -41416
105 -41416 34304 -20665 -28930 91455 33386 -142514 -20436 177688 -400 -179899 24142
116 24142 132288 -58838 -58784 78735 -30887 -72042 120802 46800 -176269 -1328 183999
127A83999k38544r7889K42686p532j80005J01974P4413j50634M5275J41039j49027
138c4245r0704K00258J9786j90740M2088J32483o6823m3860N3919m1508j5270
149c4616R4361l0238j07776N6399Q5719m7197m3249Q644P109M5164P894r1877
161d9663j567J04164k1612p6364M3193J5962m3976N9576J9922j19643K6246J42274
173I8512p9315j21336J15223O3262j17465J1569Q2175p5314j6778J08722n7221
184A2034j05134J12749O7375j34302j4860J15073l0703o1957N7016k738n6400
195d1847N8435L5890q9387j1175Q8664n708o3584P363K9809N115k046k1470j0487
208b0428K8192O352j8762L378p605o483M3146l856p0323K9635P6532o0310n4947
$$ plain form
127 183999 -54545 -152434 90252 82720 -97285 4689 79102 -71532 -26257 114782 -34245
138 -34245 -124949 75309 95095 -95645 -53557 78926 12103 -31757 22162 -19346 -34616
149 -34616 59745 29507 -78269 -21870 63849 16652 -26597 -17953 -10844 34320 42214 -49663
161 -49663 -51230 52934 31322 -45042 -1849 14113 -29863 29713 49635 -70008 -43762 98512
173 98512 19197 -102139 13084 76346 -41119 -29550 52625 -22689 -39467 69255 12034
184 12034 -93100 19649 87024 -47278 -62138 52935 22232 -39725 17291 14553 -41847
195 -41847 16588 52478 -36909 -48084 40580 34872 -28712 -21349 8460 13575 11529 -9941 -20428
208 -20428 7764 14116 -4646 -1268 -8873 -15356 27790 23934 -46389 -16754 59778 -532 -55479
221e5479Q0355Q298p7399M7292M5180r1835J0282J08238p2059q8868J18645L8329
233G0979j32416K5134J05554p9856m4519J07988k9804r9292R4620N8482j28491
244e1621r59J21217n3341p8884Q5265J7329q6658M1914O0244q0431j9043Q9369
256D4401k0378p1384M3978L8427m5857n262L1367j5059j0219J9091n375j1379
268g649P729R92K330J254j8186Q214K8812k6283k5707M3790O019m9095K4100L5384
282C1704n1862l372O4867l7280n3855P2606K0373q8237K5306P5873o7727l7921
294d9525R0468j4916q5114O4201N2571r3429l781R3149m4164o4171P5718J8179
306C9186q0888K9040O0235o1358k3085O9998j5696n5259M1805K5843m8666M834
$$ plain form
221 -55479 24876 33174 -44225 3067 48247 -43588 -33306 74932 2873 -85995 32650 70979
233 70979 -61437 -36303 69251 -10605 -55124 52864 23060 -76232 18388 76870 -51621
244 -51621 -52580 68637 15296 -63588 21677 39006 -47652 -5738 54506 -25925 -44968 44401
256 44401 24023 -47361 -3383 35044 -10813 -16075 15292 233 -9986 9105 3730 -7649
268 -7649 80 1072 3402 4656 -13530 -5316 23496 -2787 -28494 15296 21315 -27780 -3680 31704
282 31704 -20158 -23530 41337 4057 -49798 22808 43181 -45056 -19750 56123 -11604 -49525
294 -49525 40943 26027 -59087 5114 57685 -35744 -39525 53624 9460 -54711 21007 39186
306 39186 -41702 -12662 47573 -13785 -36870 33128 17432 -37827 3978 29821 -18845 -14011
318a4011L6781k5570j5452L0318m452k0680J4004N120r944O780k955p314J6394
331I019l304k1117J9287J2268l1362Q126L0466l2279j4324M8592j3595m8364M2897
344F310K8475o1465N611O0703m1777l7942O6910K55p0845M0252N1904o9212j6394
357c7215P6525k3665n9696N3629K5101o4361J4184N2605m4440k5057N6413p116
369A6907m7930L1806K5234m0493K115L2419k2516j3143K9484p345k2711J9350
381C177P978j8848N330P189j0127Q100L311j8725J1646J8171k6676m812L2935
394A8649j5736k4807L5349L156m3653K4952L5707m8867j2915N8582j7460m9447
406c6490M3609K2890n5732J2035M8581m3705k4346O1013p880n8246L7123L7632
$$ plain form
318 -14011 22770 -2800 -18252 12066 7614 -13066 938 6058 -3886 2894 -61 -7375 9019
331 9019 5715 -15402 3885 16153 -15209 -7083 23383 -8896 -23220 25372 11777 -36587 6310
344 6310 34785 -26680 -21069 39634 -2143 -40085 26825 27080 -43765 -3513 48391 -20821 -37215
357 -37215 39310 15645 -44051 9578 34679 -29682 -15498 37107 -7333 -32390 24023 16907
369 16907 -31023 783 26017 -14476 -12361 20058 -2458 -15601 13883 6538 -16173 3177
381 3177 11155 -7693 -2363 4826 -5301 2799 6110 -12615 -969 17202 -9474 -14286 18649
394 18649 2913 -21894 13455 16611 -27042 -2090 33617 -15250 -28165 30417 12957 -36490
406 -36490 7119 30009 -25723 -13688 34893 -8812 -33158 27855 19975 -38271 -1148 36484
418C6484n2563p009M9844k1884l0986L9624L613m1645K1210K9608l5179j1146
430b0029L4322n666k1524J3919L854j1804J0439K846j5200O761J0435r824K11
443a260L311r471J1130J1187k7429l209L6869j2215l3823K8042J6547l6710J0023
456g008L2353l6717j4209N3964j2122n4590L7678L8196n2488r548N0327k1292
468D544l1011M3833N37n1038L0480M0941n1927j8921N6721o465m4160K5819J9427
481A8780l2974Q621K7960l0313j4750L9854Q27l5927P578K2732p362p515j15l700
495f304R257P272j4765m273J1776q20k25K792j5522J916K8985j2558l3278K5122
509f25K5458l2714p210L0105j5169j5316L3558r056m1196L4830L4703n3368j6672
$$ plain form
418 36484 -16079 -23088 26756 4872 -26114 13510 17123 -24522 -3312 26296 -8883 -20029
430 -20029 14293 8627 -12897 1022 4876 -6928 3511 6357 -8843 -2082 8353 -1471 -1260
443 -1260 2051 -7420 3710 14897 -12532 -15741 21128 8913 -24910 3132 19679 -17031 -7008
456 -7008 25345 -11372 -25581 28383 16261 -38329 -651 37545 -14943 -24491 25836 4544
468 4544 -26467 17366 17903 -33135 -2655 38286 -13641 -32562 24159 17694 -26466 -647 18780
481 18780 -14194 -5573 22387 -7926 -22676 17178 18005 -17922 -10344 12388 5026 -2489 -2604 -6304
495 -6304 2953 10225 -4540 -8813 2963 2143 1918 4710 -10812 -8896 20089 7531 -25747 -625
509 -625 24833 -7881 -15091 15014 -155 -15471 18087 9031 -32165 2665 37368 -16000 -32672
522c2672N6743o295m2711K6121J5109l5561J7705L2256m4756j8007N8103r63n4147
535b9075J7141L5380k4816r233K1689j5552j0819L1354k548l5588J2311K9610
547A9854j4374j8334Q591Q231J975k510j1987K255J6543m072j3279L647L226J838
561A604R100j2544j8679K5052K0282l3939j3366L3903L97k2168J3343J099k1612
574a7528K4039K0977m4738j1183N3856m099m7799J8669K7871k6818m93K4764k5793
587h275j3460M2911l122m6685J8293L7502k5991j9754K3590M45j1689J4262m079
600C948k1066J8148J9690k4821j3858K1813P597j1253m704k262N643J3178q713
613C340j7401J0217J3908o776m895k237m624J5037J0352k6906r296L2760K266
$$ plain form
522 -32672 24071 17776 -24935 1186 16295 -19266 -1561 30695 -14061 -32068 26035 25072 -29075
535 -29075 -11934 23446 -1370 -10603 11086 -4466 -15285 16069 13521 -22067 -9756 19854
547 19854 5480 -12854 -4263 3968 5943 3433 -8554 -6299 10244 6172 -7107 -3460 -234 1604
561 1604 10704 -1840 -20519 4533 24815 -9124 -22490 11413 11810 -10358 2985 4084 -17528
574 -17528 6511 27488 -17250 -28433 25423 21324 -26475 -7806 20065 -6753 -7246 17518 -8275
587 -8275 -21735 21176 18054 -28631 -10338 27164 1173 -18581 5009 5454 -6235 8027 3948
600 3948 -17118 1030 20720 -4101 -17959 3854 11451 198 -4506 -6768 -1125 12053 3340
613 3340 -14061 -3844 10064 3288 -1607 -3844 -8468 6569 16921 -9985 -19281 13479 15745
626A5745k9427P227J6053j4294L435J4709k3443p693L7440m715m0589J7683L1915
639B4046k5355j4413K4519n608j4682K2141r38l0209J6735K8560k7168j9351K7894
652F171O830j9148L629M299r213J1025R267k1235n539K3492J506j7525j06P150
666F03K595L054p419r306J2017R313j2705m676P385j623K813N409j5109m145K4704
681A2910j995k7742J0828K2274j7485r189J8432p185j1813K1556n38k9288J4588
694d647K7481k5110j7492K7848K550k1448J1563P746k0398Q584K1708k1988j5692
707a9295K8277N940k5570L639J5533r236k297R660r332o054J5704P78j5781K691
721e343J1017k769m809q15K25O014Q01r191J287Q585m274k940N547n941k956J4493
$$ plain form
626 15745 -13682 -6455 9598 -4696 -1261 13448 -9995 -17688 19752 15037 -25552 -7869 24046
639 24046 -1309 -15722 8797 3189 -11493 10648 9710 -20499 -3764 24796 -2372 -21723 6171
652 6171 13001 -6147 -2518 1781 -7432 3593 12860 -8375 -13914 9578 11084 -6441 -6547 603
666 603 3198 6252 -1167 -10473 1544 10857 -1848 -6524 861 -762 2051 7460 -7649 -11794 12910
681 12910 10915 -16827 -5999 16275 -1210 -10399 8033 848 -10965 10591 10053 -19235 -4647
694 -4647 22834 -2276 -19768 8080 10630 -10818 745 8491 -11907 -3323 18385 -3603 -19295
707 -19295 8982 14922 -10648 -7009 8524 -712 -3009 6651 -2681 -8735 6969 7747 -8034 -5343
721 -5343 5674 2905 -1904 -2719 -2494 3520 4321 -4870 -3583 5002 728 -2212 3335 -2606 -5562 8931
737H931l644j9102J2264J6911j9236q636K1178l687j6059J5420M574k2299R776
750c609K1699k2036j3334K8088N51k5388J2303J4831k0545Q1K1490j4824j5096
763a5789K4189M068k5931P063K0081j4601r318J6228k081j2187J0503N042j3451
776f184K111J1529o251o552O003J859k647N34j941J48M490k815l640N014o27m733
792c702O222Q77j0096N614J0094j2195n059J6068l272j4602J2003P527j7640L222
806d939J7427j4222j1171K1316M53k1956J0969J5553j9051m371K0960p689j6042
819a2763J6883O424k0060M492J6895j2942q807J6125p51j3830Q243P457j1418
832d052l34R742m917n167O698L1m855L279J046l053K287L14k995L361N41n310
$$ plain form
737 8931 5287 -13815 -1551 15360 -3876 -12512 8666 4979 -11080 4340 8914 -13385 -3609
750 -3609 18090 -3946 -17280 10808 11359 -14029 -1726 13105 -7440 -7359 14131 -693 -15789
763 -15789 8400 12468 -13463 -6400 13681 -920 -10238 5990 3909 -8278 2225 7267 -6184
776 -6184 -4073 7456 1205 -5347 656 2515 -132 402 -1539 -1391 3099 284 -3356 1658 1031 -3702
792 -3702 2520 3397 -6699 -1085 9009 -3186 -8245 7823 4551 -10051 1952 9479 -8161 -4939
806 -4939 12488 -1734 -12905 8411 8864 -13092 -2123 13430 -5621 -9992 10968 3279 -12763
819 -12763 4120 10544 -9516 -5024 11871 -1071 -9878 6247 5496 -8334 -91 7366 -4052
832 -4052 -4386 5356 439 -4728 1970 2001 -2854 425 1471 -1582 705 1019 -1976 1385 1926 -3384
848c384L786M056p808K38Q994o260o149J1015k95j2454Q375R002j4885j240J6914
863I905p867j3399J5564N209j8442N138J5478j4117p471J8469k754j7260J1726
876A79J0485j6414j181J5398p219r762J2268J611j2370N926Q540j0173k516J0201
890D973k759o821N543J924n169J974K443l510O31K211k214N73J076k822K131K949
906C133n916j90Q245m272p224Q845K726j1019M013R277j0411l859J3994m132j3111
921i901J1552P638j5893M73J5363q795r647J4129J079j4722P758J0657j3750l278
935g337J5110m402j1755R810N217j1411J987Q780p469l677R441j776p969N243
949b08M429n885o70M119j488r17J463j606L94K146k414m52K914k702j058N330
$$ plain form
848 -3384 402 4458 -3350 -3112 5882 -378 -6527 4488 4193 -8261 114 9116 -5769 -7009 9905
863 9905 2038 -11361 4203 9412 -9030 -3892 11586 -2531 -10002 8467 5713 -11547 179
876 179 10664 -5750 -6931 8467 1248 -8514 3754 5365 -7005 -1079 7461 -2712 -5228 4973
890 4973 2214 -4607 936 2860 -2309 -335 2108 -1402 -771 1440 -774 -201 875 -1947 184 3133
906 3133 -2783 -2973 5272 1000 -6224 2621 5347 -5672 -1659 7618 -2793 -6652 7342 3210 -9901
921 -9901 1651 9289 -6604 -6131 9232 437 -9210 4919 5998 -8724 -966 9691 -4059 -7337
935 -7337 7773 3371 -8384 1426 6643 -4768 -2781 5999 -1470 -5147 4294 2518 -5451 -208
949 -208 4221 -1664 -2334 1785 297 -620 843 -763 -369 1777 -637 -1089 1825 -877 -1935 3395
965C395k839o079P328L804j0481P92J0655o205o887J0058M70j0582O876P488j2503
980d710j415J4448n621j1848J1006N440j2724K284J0162r043m361J2575k870j1997
994h674Q862Q009j1503k366J0522k742o367N879R51o237L640M393o012j873N722
1009B204l4l614J22Q80J398O85l326o12M390q59l174K620R3l352M386K085q295
1026d403J092J0088n198q787Q444M228r244J955O779p964j399J1303m919j1271
1040i296J0523P588j3039j538J1638m497o660Q582k82r578P066P298j1338l347
1054f880J2092r55r434L729M661m435O27L019m503m96N997j406n246J774L576
1069B120m26j806k123J052M333j371n006K051L417k387j25J265l865J474O833
$$ plain form
965 3395 556 -5523 1805 5609 -4872 -4080 6575 370 -6517 3541 4011 -6571 305 7793 -4710
980 -4710 -6125 8323 2702 -9146 1860 7300 -5424 -3140 7022 -2021 -6382 6193 3323 -8674
994 -8674 188 8197 -3306 -5672 4850 2108 -4259 1620 2571 -3666 -26 4367 -1645 -3518 2204
1009 2204 2170 -1444 -1322 -442 956 1641 -1685 -2297 2093 1234 -1940 680 773 -2579 1807 3892 -4403
1026 -4403 -3311 6777 1579 -7208 1236 5464 -3780 -1825 4954 -3010 -4409 6894 1975 -9296
1040 -9296 1227 8815 -4224 -5762 5876 1379 -5281 3301 3019 -6559 507 7805 -3533 -6880
1054 -6880 5212 4257 -5177 -1448 3213 -1222 -595 2424 -2079 -2575 3422 2016 -3230 -1456 2120
1069 2120 1694 -112 -2235 -1183 3150 1779 -3227 -1176 2241 -146 -271 994 -2871 -1397 5436
1084E436n078p407Q370N358r663j101Q165l722l708P346k519q525Q634O703j2736
1099d447k684J3263k227j0064N820M270p158K502N834q097k485J1097j336j0603
1113f315M120P516m784l103L349j123o96L789k058m757L501M297l247l246J328
1128a429K594J283k537l153K901L606l019k161K272n51O3L092l637m307P110L700
1144E827r609j251R483k008o683N000J458o105M631N020r691j800J2090k076j1247
1159f961N469P268o876j610N735m063k578P970j564r089M767P748o298m580N542
1174H80J015k906J841l71l108L121L120m438k342L850J784k009j974j32K707J515
1190B553l639j597L796M20k642J412j64k538L827K510p210p64Q828j666q169M198
$$ plain form
1084 5436 358 -7049 1321 6679 -2984 -4085 4080 358 -3350 3996 1477 -7048 1586 8289 -4447
1099 -4447 -7131 6132 3905 -6159 -339 3931 -3227 -725 5109 -2988 -5473 5624 4288 -6315
1113 -6315 -2195 5321 537 -2566 783 -340 -1036 2753 695 -4062 -561 3736 489 -2757 -1429
1128 -1429 1165 2448 -89 -3242 -341 3265 246 -1915 357 -194 -131 2961 -676 -4983 2127 5827
1144 5827 -3782 -5033 4450 2442 -4241 759 2217 -3888 743 5763 -3928 -5728 6362 4286 -6961
1159 -6961 -1492 5776 -1100 -2710 3025 -1038 -3616 4354 2790 -6299 -1532 6216 -82 -4662 880
1174 880 1895 -1011 830 459 -2649 472 3592 -846 -3188 662 2446 437 -1537 -1669 1038 2553
1190 2553 -1086 -2683 1113 1533 -1109 303 139 -2399 1428 3938 -3272 -4036 4792 3126 -5043 -845
1206h45M894n566j3M978n142k415Q541j177r717M997P802p152l819P098q41m750
1222c127M855Q71o735L067O502n843m542O668J733n491O93K805k042J57K129k442
1238g42j385L345O56k832o26J609J395l25k655L7L516n88l355J638J882k604Q14
1255b20K500l933j138O232j372o795M014N340o002j873O215k281m230N776Q35
1270C068p487L256O798o603m025P931J79p033L503L846n664L0N942l604m496N959
1286A600J910o276P75M865k536k227K860j24k231J794R15k247l0J782k43j029
1302d42k63M36J206o71j727J442J514k348j45K594j701j746L563j51m473K670
1318b42L844m913j622N772j444n103M472K434o076R76N866m291l743O490M12o632
$$ plain form
1206 -845 4049 -1517 -1530 3448 -1694 -4109 4432 3255 -6462 -1465 6337 -815 -4634 2464 1623 -3127
1222 -3127 1728 2599 -4136 -1069 5433 -410 -4952 1716 3449 -2042 -1349 1456 -586 -429 1700 -742
1238 -742 -2127 1218 1874 -958 -1584 25 1420 1095 -1560 -1523 1993 1405 -1950 -312 1570 -1034 -220
1255 -220 2280 -1653 -2791 3441 2069 -4726 -712 4628 -1374 -3247 2968 687 -3543 2233 3068
1270 3068 -4419 -1163 5635 -968 -4993 2938 3117 -3916 -413 3433 -2231 -2201 3741 137 -4359 1600
1286 1600 3510 -2766 -1991 2874 338 -1889 971 847 -1384 410 1325 -922 -952 830 587 -442
1302 -442 -705 -269 937 266 -1461 -19 1495 -853 -998 1596 -105 -1851 1712 1561 -2912 -242
1318 -242 3602 -1311 -2933 2839 1395 -3708 764 3198 -2878 -1902 3964 -327 -4070 2420 2832 -3800
1334c800K967M927n395j689O007j653m840M225K192n086N50M341k742k607L700
1349A097L63l189J305J788j851k80J639q07n81R38k67k06K21l41J56P15j260k14
1367g74K113j052k181K411J180l421P35L315k824j849M347n82m454L182L287n185
1383a752q02N711k109m493M362J790n373J363M689m131k479N450l28n016K691
1398d27L284l912p95L890j601k541L146N46l258J036K453j916j255J907R1j158
1414e10L87J80k37L43k40k67O06m37j83J290o97j651K028J284l274N4L493j793
1432C76k679L289P20l980J778L281m055j385N219j102m874L497L096m782k79M600
1448B720k459l009M395M02m749K105L700l917j704M294n08l442K246J635k919
$$ plain form
1334 -3800 -833 4094 -1301 -2990 3017 1364 -3476 749 2941 -2145 -1595 2746 4 -2603 1097
1349 1097 1460 -1729 -424 1364 -487 -767 872 65 -516 422 155 -51 170 -171 -15 700 -560 -774
1367 -774 1339 287 -1894 517 1697 -1724 -989 2326 -498 -2347 2000 1418 -3036 146 3433 -1752
1383 -1752 -2554 3157 1048 -3445 917 2707 -2666 -1303 3386 -745 -3224 2226 1898 -3118 -427
1398 -427 2857 -1055 -1850 2040 439 -2102 1044 1590 -1668 -632 1821 -95 -1350 557 648 -510
1414 -510 -123 57 -180 163 -77 -344 262 -175 -358 932 235 -1416 612 1896 -1378 -1324 2169 376
1432 376 -2303 986 1706 -2274 -496 2785 -1270 -2655 2564 1462 -3412 85 3181 -1601 -1880 2720
1448 2720 261 -2748 1647 2049 -2700 -595 3105 -812 -2516 1778 1270 -2172 74 1709 -1210
1463a210K96K651j815j502K323M51k100L40J378n03n33m7K41M24l36o50Q83L8
1481C29j115Q69Q99k027J10K735j511k599K958J460l600L87L244k271j805L680
1497A743o14l765K823K702m497o72M891j685l778L397J464l959J192L215l318
1512h61j454M476o45m085K235K764k959r72K698q53j461J826l9k018J096J626
1528A374j584r11J212M61l97l81l72P85P30j216m30J317l00o99J076n82j471K065
1546F77J024l275j2L587j277k817K361J050k673J179K097l239m64M350j347m290
1562c069K947K951l717q35L179j252j725K798l08l416K190K893l236j726L285
1577I59L98k231N56P47q99Q05P14j739l37J869R7j452l42P96Q47j84j513p1J894
$$ plain form
1463 -1210 -914 1737 -78 -1580 743 1194 -906 -566 812 309 -224 -271 -30 394 58 -592 291 329
1481 329 -786 83 982 -1045 -935 1800 289 -2310 648 2108 -1492 -1105 2139 -132 -1937 1743
1497 1743 1129 -2636 187 2889 -1608 -2280 2611 926 -2852 545 2009 -1950 -758 2457 -861
1512 -861 -2315 2161 1516 -2569 -334 2430 -529 -1501 1197 344 -1117 709 670 -1348 -252 1374
1528 1374 -210 -1121 91 552 155 -226 -598 187 917 -299 -729 588 288 -411 665 83 -1388 677
1546 677 1701 -1574 -1586 2001 724 -2093 268 1318 -1355 -176 1921 -1318 -1782 2568 1221 -3069
1562 -3069 -122 2829 -888 -1723 1456 204 -1521 1277 969 -2447 -257 2636 -600 -2326 959
1577 959 1357 -874 -318 429 -470 335 1049 -690 -1027 842 939 -513 -855 -59 788 604 -909 -980 914
1596I14j11j725N38P30o74Q22M68k394L41L546j615l494K623K364l005n87K452
1613A193j537j032L148j051l751L019L274m194j806M142R4k948J537Q66k334J454
1629G4K222l211j455L905M04l571M44K261p15o59M63q45J23J752n86k004P17J792
1647A111l66j166n01Q11J373o79j881P31J719q02q32N03o54L36J878j509k541
1664b469K643K336l205j421L156k8j969J382J18k167J919K205l550j480M213K74
1680A957l784Q89K317j566l24J507j676q59L115k23l373J057K840j289j731J021
1696a22M22k42O26p66j118J297J146j261j048P10Q33K85r65j136J267J559j524
1713c7j267J564L88q12N59k13j540J710J634k880j145L330K04l080R32J788j706
$$ plain form
1596 914 803 -922 -384 346 -328 494 962 -1432 -1091 2455 840 -2654 -31 2333 -672 -1259 1193
1613 1193 -344 -1376 1772 721 -3030 -11 3263 -931 -2737 1405 1499 -1449 88 954 -1380 74
1629 74 2296 -915 -2370 1535 1939 -1632 -1188 1073 358 -301 162 -683 -560 1192 606 -1398 -681 1111
1647 1111 745 -421 -922 -111 1262 583 -1298 -567 1152 350 -482 21 -633 -297 1581 72 -2469
1664 -2469 174 2510 -695 -2116 1040 1012 -957 425 543 -1624 295 2500 -1050 -2530 1683 1957
1680 1957 -1827 -938 1379 -187 -511 996 -680 -1539 1576 1353 -2020 -963 1877 588 -1143 -122
1696 -122 300 58 684 -82 -1200 97 1243 -18 -1066 -356 477 762 -203 -1339 -72 1487 -37
1713 -37 -1304 260 648 -164 395 182 -1358 352 1986 -894 -2039 1291 1495 -1585 -653 1135 -571
1730e71J41J850k138j204L554Q2l917J234L164j951j689K090j32j545J774K44
1746I86k632R51K752j993j949K073R54j517n3O33n31M13P12j053n93J189M10p56
1764dm89J21P66L78j215n47J492K29j401M03O65q81M68J008j598o31K430j63k609
1783a578J164K059j892p98K053q06j515K129K99k799J036K592k105j702K697J94
1799A028k259J074J236j847J49J983j360j395J990N29j922K88J314q13l89O99
1815C05l80l15O72p7p33M39K82k85J76j78k59P59R2j218N51J002j011n49J427
1834G00l94j278J392M29j890N76J796j732j002K366j52k214J288J466k045j61
1850h55K172j154j527K059M81k477P86J962j661j031J967j06j548R23Q26j459
$$ plain form
1730 -571 -430 1420 -718 -1922 1632 1714 -2203 -969 2195 244 -1445 645 513 -1032 742 986
1746 986 -1646 -695 2057 64 -1885 188 1142 -375 -428 205 -326 87 799 -254 -847 342 752 -4
1764 -4 -493 -372 394 772 -443 -990 502 731 -670 -267 398 -483 -15 993 -605 -1236 1194 1031 -1578
1783 -1578 -414 1645 -247 -1045 1008 202 -1313 816 1115 -1684 -648 1944 -161 -1863 834 1028
1799 1028 -1231 -157 1079 -768 -619 1364 4 -1391 599 1128 -794 -506 808 -5 -394 305
1815 305 -75 -390 282 205 -528 -89 193 -92 84 -94 -353 406 498 -720 -169 833 -178 -727 700
1834 700 306 -972 420 849 -1041 -465 1331 -401 -1403 963 811 -1403 -115 1351 -694 -855
1850 -855 1317 163 -1364 695 1176 -1301 -515 1447 -214 -1245 722 616 -932 -9 817 -642
1866f42J23J380q06q30J086K44r98J97N22k11n5O5k43K66Q3l18Q5J51m12L44M83
1887E14j034j80J547m40j491J151R80j575KJ515j076r20J903j53k205J234J812
1904A584k049r34K388m23j801J418Q05k044N91J900j675j186K255J95k111P10
1920c77J369j124m58J232n36q99J229K24j437L12J053m54o03L31K62M3l4l13O0
1939a20L54j41j13J76l14o0Q95n06j158J084R86j644l59J625m46j209J336K92
1957F78j754R50J501j780q43K286j27k232J146J390j742j76J725j114j130J955
1973G33K28k172O88J782j453q80J625m3j164P85N04j166K79J070q29o50Q73K61
1991D71o10j19K44O1R5j59k63L68P9m06K95Q9m98M10N21r28k66J458m24j336R89
$$ plain form
1866 -642 -519 861 55 -775 311 555 -443 -246 276 65 10 75 -168 98 181 -137 -52 99 -313 31 514
1887 514 -520 -700 847 407 -1084 67 1047 -528 -526 989 -87 -1007 896 743 -1462 -228 1584
1904 1584 -465 -1399 989 566 -1235 183 988 -1056 -465 1435 -240 -1426 829 1024 -1087 -377
1920 -377 992 -132 -590 642 106 -793 436 660 -777 -465 588 134 -469 -138 124 167 133 -180 -120
1939 -120 234 93 -20 156 -158 -218 677 171 -987 97 1083 -561 -920 705 259 -950 386 678
1957 678 -1076 -126 1375 -405 -1248 1038 911 -1321 -175 1215 -527 -703 1022 -92 -1222 733
1973 733 961 -1211 -523 1259 -194 -1074 551 508 -656 129 633 -533 -254 816 -13 -663 210 471
1991 471 -139 -258 -14 47 142 -17 -280 88 167 -239 56 145 -353 57 578 -350 -616 842 418 -918 71
2012G1Q04j348pJ282q93q39J593nj882J037J456j745n93J873k83j426J075O01
2030G71j432M00J333j237p52J597N8j559N69R62q37k75P15m70k63P54j00o25L14
2049g7M16l11j61J10RL39j09o98L55P69p43m03P48j68n11P59j00j069Q25J041
2069A021j448n46J761j73j478Q46P42j270L81J172j414o09J904j6k040P08J496
2086A037j206n73J178l35p81J174j1j334O22J298r52r29R86L60o14J4N5j68L69
2105A90J99o43j71N48J70k53m03l7P24L22j058k91J227O2j005K95L27n20M98M79
2125F60j280k14J878m11j844Q26J431j176n34J178o60n78J545k27j906R96J762
2142A446j555j128J696K30j149M85L20r68N66J046j255r13J623M81j392j17Q13
$$ plain form
2012 71 875 -473 -480 802 -91 -930 663 658 -1224 -187 1269 -476 -1069 804 521 -905 170 771
2030 771 -661 -261 1072 -165 -917 680 738 -821 -252 710 -127 -402 313 -157 -420 334 234 -391 -77
2049 -77 339 28 -133 -23 -14 325 216 -482 -127 642 -101 -504 244 76 -435 324 224 -845 -20 1021
2069 1021 -427 -973 788 615 -863 -17 725 -545 -164 1008 -406 -1015 889 873 -1167 -459 1037
2086 1037 -169 -742 436 101 -680 494 483 -851 -229 1069 117 -812 174 534 -80 -66 -11 -179 190
2105 190 389 -254 -425 123 293 40 -363 -400 324 646 -412 -703 524 586 -419 -124 203 -317 181 660
2125 660 -620 -834 1044 633 -1211 -385 1046 -130 -664 514 -146 -724 821 594 -1312 -316 1446
2142 1446 -109 -1237 459 689 -460 25 345 -623 -57 989 -266 -1179 444 925 -467 -584 229
2159B29j02m3R1n42N8R36k13r62J30P63J28l66o74K28J005l13j050L23Q54l77
2179A03k91K57m39J5J221n35j480J021J423j442q29J297J62q73O77kj162R00J251
2198A274j686r31J958L39j694K39J060o82LP43r14m49J469N4j540J60J260l43
2216C20p09J99Q2J12L41m36n44N98O43n18m77J72L81L65l81p56M88Q22o51o00
2236e49N87J97m60M37p3q80O93J043j230r24J607L24j378L20P82o92j0R04r18
2255b20p22J673J14j776M27J364p61p45Q71j54n65Q61R4j220L42J242o92q45P53
2274D1L95m23n1j3j05L57J70o07l9M58j8k06n5k16K93M23n44m65Q14K34p78J35
2296b00N95n97Q8O89p30n73J264P4j361L86J197q97o02J145k51r35Q91M22j307
$$ plain form
2159 229 127 84 175 -367 -309 627 414 -548 -418 345 473 107 -567 -339 666 353 -697 -374 480 103
2179 103 -188 69 -370 -355 866 331 -1149 -128 1295 -147 -976 321 483 -390 287 285 -877 23 1274
2198 1274 -412 -1343 615 954 -740 -501 559 -123 -120 623 -291 -740 729 783 -757 -597 663 320
2216 320 -389 -190 -108 4 345 -91 -635 -37 606 88 -389 -217 164 529 148 -608 -120 702 51 -549
2236 -549 38 235 -225 212 139 -741 -48 995 -235 -1159 448 772 -606 -286 496 -196 -206 698 -220
2255 -220 -942 731 845 -931 -504 860 99 -646 225 71 -494 367 461 -759 -417 825 133 -712 41
2274 41 436 13 -38 -51 -156 201 371 -236 -275 183 165 -41 -96 -312 -19 404 -140 -605 209 443 -335 -200
2296 -200 395 -202 -114 575 -155 -728 536 610 -751 -365 832 -65 -667 478 227 -708 183 605 -702
2315g02K11J298o79r03J145K15j050L20O38p30j31Q87m66o26P46K49p25L5N08
2334B40k17j88J95o6k0J88j38j34K37q2l0K15k17j23M46Op52L59O09p40k68Q78
2356C98k58o60O75K71r64L78R72r72n65J304r6j144O02P43r63j42J091o90o72
2375f92J112N3j179N30P97p22m05Q15r7o00N48J84p49L40N68o13k87O70m0m15
2395a82J68K3r5J97q7l58L38K25l93J07K40l61J08N10n41l47Q26N2r08K98O87
2416E07o70j11O37m40l93Q32K0j155N42J052r76n23J023n9p16N64K19q08L20Q17
2436F82q17m90R52J33q13K33L71m58J83K82n38J8O12j01n97L06K85k58O0%k73
2457b28M02K26o63Q4M66k22l26M11k06l15O81Pq85L47R01p52n17Q91L2o94L79
$$ plain form
2315 -702 -491 807 128 -775 370 585 -465 -145 493 -237 -368 519 53 -573 173 422 -303 -268 240
2334 240 23 -165 30 -36 -56 132 -6 -140 97 15 -15 200 -17 -140 306 312 -440 -81 528 -212 -480 398
2356 398 140 -520 155 426 -538 -160 812 -160 -725 579 483 -661 -59 684 -279 -421 670 -20 -692
2375 -692 420 473 -706 -176 621 -101 -506 309 212 -388 160 344 -405 -65 503 -110 -397 273 233 -182
2395 -182 -14 9 -86 111 24 -334 4 229 -164 -57 183 -178 -70 440 -101 -448 378 430 -478 -180 507
2416 507 -163 -274 363 -77 -470 362 382 -773 -231 821 -155 -678 345 286 -430 134 353 -455 -135 682
2436 682 -135 -625 327 460 -353 -120 251 -207 -24 258 -280 -262 350 249 -348 -42 243 -15 45 45 -228
2457 -228 174 400 -263 -179 287 65 -261 150 -56 -371 310 317 -568 -221 680 -72 -589 302 334 -360 19
2478A9L73q09L01Q63q94n34J076O1j012M12N83p06k4P95n71m52Q57J18r46K63
2498b27P73n19l02M64j21k20L43j03m02L39K54l95n4J71J1O2l8k64J16M26l48
2519c4l03N35n2l88L48J35n47K56O08q20l30J046q9r33M96O13q38o3Q66o02n34
2540f30J039N7j135N39Q46q94l08R13k57o33O49J83q12K37P77p52l99Q59J6o92
2560c97L47K69l35R5K72l70m1M13j91k44J86Q2j48J67r9j61K65Q9n02K39L50l66
2582h0p9M48k62l75O19j7p71N18O46q80l11R70k08p38O81K22p80L00O31p78l29
2603e73J024j72q77N74M71p34J28N59m69k62O95j34o99M51M09m74j57L93j31j52
2623a30L21l33j52M60k3l67J86J62j46J16M3m08K47M90n52l06O83o3n46K93K64
$$ plain form
2478 19 392 -417 -116 747 -147 -681 395 456 -556 -144 439 -267 -291 504 -67 -519 338 456 -490 -227
2498 -227 546 27 -275 189 68 -152 191 88 -314 25 279 -116 -170 1 12 74 36 -228 -112 314 -34
2519 -34 -337 198 146 -242 106 241 -306 -50 558 -262 -592 454 365 -568 -72 541 -297 -360 506 -96 -630
2540 -630 409 466 -669 -130 716 -178 -486 427 170 -463 186 369 -443 -206 571 -181 -580 279 295 -397
2560 -397 -50 219 -116 -21 251 -119 -160 253 62 -182 4 86 -62 105 6 -155 110 199 -303 -64 286 -80
2582 -80 -159 289 27 -348 271 254 -517 1 647 -233 -544 426 218 -520 161 383 -397 -97 534 -244 -573
2603 -573 451 279 -598 -24 447 -287 -159 400 -69 -331 364 230 -469 -18 391 -83 -240 153 22 -130
2623 -130 191 -142 -294 166 143 -224 -38 124 -22 94 137 -271 -24 466 -86 -392 291 228 -318 -25 239
2644B39n13K93M08o69k73R80r4r90N15O56p12j03O58m50l25Q19j59r20O13O46
2664F19p20l60O95q4l81L41mn10N17L13o81j11O14m2k63P7o1L9J82r3m03L63K51
2687B98l24j79K17j46J40K53m75j60P46mq19L00N77m65q8M03l97k07P56q4j000
2708f58N61P66q62l37Q34j41n27N20N6o81M45O31q20l80R10P6p09K15L20l92J56
2729a7L35n44m9O21o6o90L69K33j85o6J10k49K44K64m59m1L51j3j95Q5j40k6L88
2752B60j18o73M36N23n38l00N88j32k94M44o2n95M51N33p02l23R03r5o59L94K69
2773C10n37J70N55p42j86Q32j29p80L80M94n05j8L70l23p2N24k30m43M01K15m16
2794a30J7K53j55O1Q5k73l1L39q2l24K29J22k25J54J17m00J48N19m86l05O43l
$$ plain form
2644 239 -274 19 427 -242 -515 465 371 -619 -104 552 -160 -263 395 -55 -380 439 280 -640 -27 619
2664 619 -101 -461 234 150 -231 110 106 -404 113 426 -255 -366 248 206 -57 20 -41 -2 180 87 -316 47 298
2687 298 -26 -205 12 -134 6 259 -216 -376 370 366 -453 -153 424 -41 -129 274 -123 -330 426 342 -658
2708 -658 -97 669 -193 -530 304 163 -364 156 212 -469 -24 607 -213 -593 317 393 -316 -101 219 -173 -17
2729 -17 318 -226 -275 346 280 -410 -41 192 7 -59 51 -198 46 310 -149 -190 161 148 -47 38 -102 -128 260
2752 260 142 -531 -95 428 -110 -410 178 46 -248 196 134 -461 -10 523 -179 -502 401 306 -353 41 310
2773 310 -227 -57 498 -244 -430 402 273 -507 -127 367 -138 -156 214 -109 -181 343 113 -330 71 286 -130
2794 -130 -113 140 -15 46 131 -142 -173 166 84 -240 -11 111 -114 40 157 -243 -95 424 -62 -367 276 273
2816B73n54K46L35n44L6N53m41k95O73m3o70L46M77n39j28N97l02l06N36o9n71
2837c90L65M62n25k01N35j96l20K87R5l77K82J59l31M6L38k68p7K36r5n9J91q2
2859G5k88L04Q9l44M3L73l86nL70k91k14M79l3n92L57M49n77j27O73k96m25N90
2881B24J3n69K85N21o66j55O94j31o30M71K15n57J97L95m53j27N74j37n33L35
2901c4L20l87PL14k43o4L11k15k18K99R0l36N6J88j48N0L8j86J31L20l44j64M28
2924B13j26k13J86R7l57K58K64n22p0O10k10m95M19K04n10J58M68n66q1O87k48
2945A66o05M99L59o13N8L86k95j40M67k11m55N26K17o28O5M28j88j72K59r7j69
2966a43L26n8m05L06J87k41n9J77j39J8K01k09k56M76mm28J77L13l36m6L05k96
$$ plain form
2816 273 -281 -35 300 -244 -208 345 -96 -391 282 239 -431 -85 392 -147 -275 322 20 -286 250 181 -390
2837 -390 -25 437 -88 -289 246 50 -270 17 112 -265 17 176 -155 -109 229 -39 -116 120 25 -34 157 75
2859 75 -213 91 180 -164 -121 252 -134 -139 231 -60 -274 205 172 -420 -63 386 -191 -318 355 59 -366 224
2881 224 237 -332 -47 474 -192 -347 347 216 -414 57 272 -285 -88 307 -146 -273 301 164 -369 -34
2901 -34 286 -101 -94 220 -23 -87 224 9 -209 90 180 -156 -100 88 -60 -10 28 -158 -27 293 -51 -215 213
2924 213 87 -126 60 157 -200 58 322 -200 -270 340 130 -365 54 258 -252 -94 374 -192 -273 414 166
2945 166 -439 60 419 -194 -136 250 -45 -185 282 71 -384 142 359 -269 -204 224 36 -136 123 26 -143
2966 -143 183 125 -280 26 213 -28 -87 90 -49 -31 170 -39 -295 181 177 -251 -74 239 -97 -143 162 -134
2988a34p4N36j42n37L46M09n40m1M41k69k17M88j47n75N06L75o39j55O23j14m31
3009b91L55O5l37J96L10m50j2N12k00l86K89J00k11R6N8k97J62K53l18l7K59o3
3031E3o3M6q8j26L42L6m24K05L18l88j24M67k11k96M05j9m77L35M13o01j01N71
3053B73j80l40L84J41n87L16L68n46r8N67j10n14L05L24m86J28L46l64j27M02
3073B02j22l22K92J79l17J8K62k44J3K06k10q7L49j89k13J98O0j95J11K3j80J21
3095d5K48l08q5M29j17l83L36J40l80J26L43m52m7N06j78m26L35K58n41P6M84
3116C19l88j75M53r9m36M17K23n51N4M96l56j03L15q6k85J86K07l57ML48k25j11
3138a50K14q6j31K32o0j50K29K6k58M7K50j71p9J98j28r9L05j88k46K39K81m55
$$ plain form
2988 -134 -208 328 186 -351 -5 404 -136 -177 264 -5 -222 266 119 -456 50 425 -214 -369 254 140 -291
3009 -291 64 129 -208 -12 298 -152 -164 348 148 -238 51 151 -60 36 94 -203 -41 212 -106 -143 116 53
3031 53 -10 36 -52 -178 164 200 -224 -19 299 -89 -213 254 43 -253 152 133 -344 -9 404 -197 -298 273
3053 273 93 -247 137 278 -309 7 375 -171 -269 298 188 -326 -21 303 -183 -55 291 -73 -200 202
3073 202 80 -242 50 229 -88 -70 192 -52 -39 167 -43 -130 219 30 -183 15 75 -120 -9 14 -166 -45
3095 -45 203 -105 -190 239 122 -261 75 215 -165 -39 304 -148 -195 311 133 -293 42 300 -241 -165 319
3116 319 -69 -244 209 110 -326 91 314 -237 -183 313 -43 -146 169 83 -202 -16 191 -166 -162 186 -39 -150
3138 -150 64 -22 -153 79 19 -131 98 124 -134 -87 163 -8 -87 111 -17 -116 189 1 -245 -6 275 -180
3160a80n8M59j77k71L51k5l47L39K00m72m6N48k61k66L35kk89K02J97m59O4L89
3182B31k08l14L33J60l30O6J60j90M5K38k77o8K82j6k47J55N4j54J29O4l34J75
3204d6K43k20j83L61p6j84J19J58l71J48K82l58q5M13j07l24K65J14l04J67K09
3225B21m29l0M93j76m17L22K98l67o4L46k27j32L69j48l13L59J96m36j7L03j20
3246C1j66K09l3j59K72q6j68N9R9n9p5J28j15N3J83k21o4K22Jk46J02J47k05P2
3270a9K00l52q4M71j47l48L53K35m39P0L13l30r7M25j70l44L58K34n18M6L27j28
3292E6k90L71m4l99L57J90m46K9L47j23j83K00K1j53J02R0k15N5K28k55q5K86
3314A39j23o6J26j9j49J13O7k67J22K18j93q2K63j80l2J59m4k16K07J68l54K0
$$ plain form
3160 -180 -238 221 44 -227 124 99 -248 91 291 -181 -227 321 60 -206 129 127 -162 40 237 -222 -158 231
3182 231 23 -291 42 202 -128 -62 98 -92 -47 191 -86 -154 128 112 -135 20 74 -80 49 113 -221 -46
3204 -46 197 -23 -206 155 79 -105 14 172 -199 -51 231 -127 -212 201 94 -230 35 149 -155 12 221
3225 221 -208 -238 255 79 -338 -16 282 -85 -149 197 -30 -162 207 59 -254 105 301 -135 -152 151 31
3246 31 -135 74 41 -118 154 68 -100 -41 58 -1 -76 52 -63 -10 173 -48 -112 110 111 -135 -33 114 -91 -19
3270 -19 181 -171 -255 216 69 -279 74 309 -130 -60 253 -77 -174 251 81 -263 95 329 -189 -143 184 56
3292 56 -234 137 93 -306 51 241 -205 -176 171 48 -135 65 86 -67 35 125 -90 -35 193 -62 -147 139
3314 139 16 -50 76 57 -92 21 88 -179 -57 161 -32 -114 149 -31 -63 96 52 -164 43 211 -143 -123
3336a23K93j77j96K96p7j91K31J95m56%M14k11k08L11L6k59J25J65k22m2K67j30
3358D1k64L22J1k19P8Q3j39N1J53k04j1J97r2j89K06N9j69Q2J17j21l8K39k98
3381a05j11L48q1k45K12J03k28O0K61k42j37L42j54k68K53K37m15R3K56k32j50
3402b03L31n2k64K64J33m06J03K82j76j59K37n7j59J88J07k89O2K08j63r2J22
3423A7rp2O3Lj17J91J2k03P9R7p9n4J97j10r1J80n3k13K05J67m00J06K46j91r5
3448a24K99j31k41J91K04l71J1L70j94j88K66ok35J92R7l04P5L52k50k51K88N6
3470A06j94P4J41k63J28J08j13j99J99J45k00O2JM9L5k2j69N9J78j92r1K15lr4
3494d0O7m1o5Q5J34k31j0K79j31j96K11M2k02J40Q8l16O8L85k73k22K48J38k47
$$ plain form
3336 -123 170 -7 -203 93 16 -175 56 251 -205 -205 209 -2 -210 101 137 -122 3 168 -54 -96 171 41
3358 41 -223 99 110 -109 -31 52 -87 -36 117 -87 -98 99 7 -182 24 83 -86 -4 113 -8 -46 193 -105
3381 -105 -216 132 51 -194 18 121 -107 -47 214 -28 -165 177 23 -245 8 245 -170 -77 179 -53 -203
3402 -203 128 76 -188 76 209 -197 -94 188 12 -147 90 33 -126 62 169 -120 -58 150 -13 -105 17
3423 17 8 -64 -1 2 -115 76 88 -115 -36 61 -18 -72 125 15 -76 104 51 -162 43 210 -190 -84 162 -29 -124
3448 -124 175 44 -197 -6 198 -173 -162 208 14 -174 92 86 -149 43 140 -164 -89 263 13 -238 50 106
3470 106 -88 -14 127 -136 -8 100 -13 -212 -13 132 -68 -6 -5 44 79 57 -112 -53 125 -67 -158 57 54 -40
3494 -40 27 -14 -79 6 140 -91 -101 178 47 -149 62 104 -98 42 130 -186 -118 267 -6 -228 20 158 -89
3517h9L1K04k47O6K10j57k30K75J01k59K8J99j56J8J63j66j02K20M3k78K2K21
3539A17j39nN8r8P9J18j79o2J66j6j03O6Q3j53KJ78j69p4K82j11k10J76J12k02
3563h4RJ82j89n7K92p5k43J83J70k48J5J26j16n2J83p5j46J91O0k49L8K14j36
3586gq2J08ro7J17O2k14N6J22j45K5O5n6lR2n3n2J13rj61O5J62j84l0R6p9j7J80
3614I5p2j76K05N7j62l5K23j09j65K31j2k02J55R1k00qK25j05k17K15J03k22O9
3637a6J59k40N6J62r5j46J87jj17L0N0p1L7O8j37J6J43r6k4J02n1k5rM0o3P0L4
3664F3j53O4J02l5j40J19N3j76J37R0j71k1J73j04k17K58L5j68Q5J39j66l4J68
3687A01n9j90K64K8k41N8J57j81m7J87j06o3J19M7j76R2J11j61PJ51j22l7J16
$$ plain form
3517 -89 -58 146 -101 -35 175 18 -212 63 164 -95 -67 132 -24 -6 157 -9 -111 109 152 -126 -104 117
3539 117 -22 -27 31 -67 12 130 -49 -111 55 39 -64 2 85 -68 -66 112 -57 -131 151 40 -170 6 118 -84
3563 -84 -75 107 -82 -139 153 78 -165 18 188 -60 -45 81 -35 -87 96 21 -125 66 126 -123 -85 129 -7
3586 -7 -89 19 10 -57 60 122 -92 -36 86 -59 -34 31 -25 -28 64 11 -41 72 63 -98 -33 129 -55 -85 11 -68 -85 95
3614 95 23 -153 52 109 -53 -88 135 26 -139 92 80 -122 33 124 -76 -84 141 36 -181 34 137 -85 -16
3637 -16 143 -97 -41 121 26 -120 67 66 -51 -21 29 -42 -5 63 -74 -58 85 -11 -35 67 16 -9 -18 22 -41 29 63
3664 63 -90 -26 76 41 -99 20 73 -103 34 124 -47 -68 105 1 -216 42 77 -91 -6 133 -33 -67 101
3687 101 42 -148 116 144 -97 -39 118 -63 -110 77 -29 -92 27 74 -102 -10 101 -60 -53 98 -24 -61 55
3710E5l5m7M9M0q6J2Qk5L5Pj4o2J53q1j30J10J17j19M1R7j58J3P7o8j32J90L9
3737H6j48J1J78j77r8J82rj59J42Q8j82K6K39j44j59K21k7j29LJ03r3K7J25j70
3761f4r8J81np8N7j2n9Q9M1j00k0J50m2q8J18n5r6J08jr3J04L1j63M2J75o8j06
3788e2J08l8j07J01N6j30KJ74p7j04J51m5j28J17O9j59N2R3o0j89J99j5j03N3
3812c2Q5l4m5Q0o7m4N8M9r7K3Q7p7j2P3p1O2MK0r0L4L1o3m1J57j18O2J0p8j6J44
3842I4p5j58K35m3p9oO4n5QJ60j04j52J44K2j42M6J13p9q5J99r4n6O3M4j26O0
3868bR5q5j15K38j42r0P7l4rR5m5m0N0P3p4j04J02j7nJ16n4o5LR4r1L8N6o4j3
3897a2M2n1n5N5O3j00j7J84j00o3J32k7j11J18K5j30O9J15j92o3J37O0j29K4L3
$$ plain form
3710 55 20 -27 22 62 -24 -12 -4 -29 6 13 -1 -63 90 9 -121 -11 106 -13 28 125 -33 -20 57 -11 -143 47 86
3737 86 -62 -51 127 -50 -148 34 25 -134 8 96 -86 -60 179 35 -124 97 70 -59 -56 47 -46 -19 106 -64
3761 -64 -162 19 14 -64 -7 -19 -78 11 52 -48 -68 82 40 -48 70 15 -81 27 26 -67 37 68 -95 -53 122 54 -52
3788 -52 56 18 -89 12 68 -62 -60 114 37 -67 84 39 -89 28 97 -62 -10 83 23 -166 33 18 -85 -32
3812 -32 53 19 -26 54 -13 -57 1 50 -47 -24 63 -14 -26 47 -24 38 42 62 -28 6 37 -26 -67 90 -28 34 44 -34 -50 94
3842 94 19 -139 96 53 -26 -32 32 -23 -15 145 41 -111 33 55 -87 -41 72 -7 -92 107 13 -43 20 64 -62 -2
3868 -2 93 8 -107 131 -11 -101 -24 -58 -67 28 -17 -57 -7 66 -8 -112 -10 -27 -32 84 30 -35 -32 62 -29 9 65 1 -12
3897 -12 30 -21 -76 -21 42 -58 -75 109 9 -54 78 51 -60 58 83 -47 22 137 -55 -118 19 79 -50 -26 7
3922Go7N6M8j09m3J63K4j28P0j9k0O4p2l6K6R3j8j01R7L8j59R1K2r8J51p5o1P
3950d9J19k1j03R2J0j7oO5j10L0K7k7j55J75N0j24M6J8j5l9Q3o9p5J09N9j08O
3977b9J02k7p5N3m7l6J40r6o7mJ06J8l9j0K4pK2Rq5O7M1p4l7N3J0k7L3l2J5kj9
4008b0m2Q1Nk2j00J00p4O4Q5o7r9J44J7q7j2Q1j21K3J0jm7J45l3j51Q8O0p5LL6
4037iK1o6R8k6n9N9K5k5p1P1k2k6L9o%m5L3k1l8J23k4l9OK3k1R1n2p4P3k7k1K7
4069A7M4m8m4N0o3O9k1m0qj9J19j11L1N0l4qK1n%QR3j13n1N0N2j1l1j1K2j2Pj9
4101a6o4M1R5r1mJ4J3k3M7j04R4Q5j24L4J9l7J4K2O3j11J15n9m9J4M2o2j3R0l0
4130A5Lq7Q2l3M2M3l2p4O8K3r4RJ26j48K9P1op3JQ1p7J06o3l8QP1m2l3R5m3p2
$$ plain form
3922 7 -60 -4 44 -65 -108 55 79 -49 21 2 -18 46 -26 -62 -36 57 39 -62 35 73 -86 5 27 -71 80 5 -56 -49
3950 -49 70 49 -54 38 48 31 25 90 -20 10 37 10 -145 30 80 -44 2 20 5 -34 49 -20 -95 14 73 -35 -29
3977 -29 73 46 -29 24 -23 -59 81 -15 -82 -86 20 38 -1 -11 13 6 28 37 -48 19 60 -14 -51 2 12 -15 18 -14 1 -1 -20
4008 -20 -62 19 24 2 -98 2 -72 -8 77 10 -89 55 72 -15 -27 54 -67 -44 -34 -35 -82 63 30 -121 -33 27 -48 -45 -9
4037 -9 12 -54 44 18 -41 18 43 18 -53 18 -4 -30 9 3 3 -42 -9 -30 -68 55 31 -8 -2 21 0 91 39 -35 38 11 -10 17
4069 17 61 13 -31 19 -44 25 4 -36 -44 -63 56 -55 -24 26 -8 -16 5 0 0 8 101 -12 -63 -13 39 28 -3 -14 8 -4 3 -16
4101 -16 -80 -39 56 -35 -39 -25 -12 -35 12 -92 2 87 -37 -3 16 -21 -7 15 78 -33 82 23 -26 -12 30 -32 -45 45 15
4130 15 18 -69 13 -20 22 65 33 -41 27 50 -44 -35 91 -57 -28 43 37 -36 -35 46 -31 75 12 -26 -18 53 11 -22 73 30 -42
4161d2O2Pl0K0j7j6Rk7M3n4R2k2j5k1R1j35j1J09l2m6O1j7p8O8j2k5K4M5p2K9
4191a2K1L8j03L4Jj3j4J79j09n0N4j4n9P4K3n2KK2nn4M9K3q1M9O4m6J4Mq2N4N6
4222F7p8o1L2Q8k4k3pl2L4L1n1J7oM0q0N1J1l6K5N0p6MP6o2oO1%n6Q0o4J8Jj8
4255Fk0k7O2M1j05M2L0j7j6mo3R3L3q0LPK2n8j8J14m6j7O6o4qlJ9K9l3k3J9N4
4287C8l6%M6l3qp8R9K4n7jJ0k9O8m2J3m1O7l6n1J6M8o2M7Q0r8K2k2N5q4L1n6L2
4319c8NL5K0l1J7j0j9K2L5j3l0j6J8KK5rN4q0J7l9O7o6J6O8p5j2M1qN1r7N1jn1
4352e1N3Rl0K2J8j4p1Q3k1r0P5L3Mj7Rj8J6J0J1q8P0N2r4JQN9p6l4R6J1m9K3k6
4385a6N8q7J6k5K8RJ1j2J4J8m1K4nL8l6K3n7J08k1k8l7M0k5k0M0k5K4Lk7MK8l4
$$ plain form
4161 -42 20 27 -3 17 0 -16 -7 -34 9 -45 47 25 10 -11 80 -55 -66 43 11 -35 26 9 -69 -1 -13 -38 -14 31 -41 -12
4191 -12 9 47 -56 -22 -21 -34 -48 131 22 -28 26 12 -47 27 50 -2 0 22 17 -37 12 35 -46 3 67 21 35 39 -43 11 67
4222 67 -11 -72 -40 48 24 1 -6 -38 -4 27 -24 -7 -13 27 -53 -2 9 -27 -2 48 -28 -24 52 -10 -16 45 45 -11 69 5 23 24 6
4255 6 -14 -41 21 62 -43 -1 29 12 -4 -8 -71 22 55 -25 -22 -15 7 -51 -69 45 -1 -18 48 -16 -24 -27 -8 21 -12 -35 -16 38
4287 38 2 2 48 15 7 -71 28 52 -5 -6 4 -25 43 1 14 -27 40 4 -47 -31 17 -45 2 82 -16 6 -16 39 -45 -14 -70 -38
4319 -38 -33 2 22 -9 8 -2 -21 1 36 23 -7 -23 -5 -3 22 13 67 -13 4 -35 32 -34 -18 50 -25 -37 4 -4 47 -50 1 0 -51
4352 -51 2 11 -19 3 21 7 -64 19 -2 -92 -17 16 20 3 12 -6 10 20 31 -57 13 65 -29 -28 -20 39 -37 -71 25 36 -13 10 -16
4385 -16 42 -45 -29 -54 -26 -17 -6 -18 -4 14 -27 -3 -8 30 -6 17 -40 68 47 19 -18 22 -3 -23 17 -8 16 19 -8 -4 24 -10
4417a0km4P3ql8L6L8l6lO5n9NqJ9o9oR4o4l6N9j8Nj5J2J9J6lo0K9L1k0OM1kj13
4452f6N2N4m8rlO2m6nl3L5N3q6L0R0j11K6m2M4nqK7m6M1km4M8j2k5k3P0pj3LK7
4486B8rJ0n1J3k0O4K3o9k8O0J6m4RN0l0m8P1m4j3j1J4mL6K0omj9O1rj8k6J0J3
4519D5j7k9K0o3N1N7j16O6rL8m8k1M5LOj7jo7R5k7J7L7n1J8m2pk7K9J0LPmL2j8
4553A5o4M3K1p8NM2J2J6l6om1R3k4Lk1m7R7p5M3lK9j4n9L0M7l9M3m1L7j5m4L4
4585Ck6k1O6j2K4k6N8j10Q2l2K0Pqo6M4M3o0l4N8j7K3M8q6kM4p6P0lqN7j28J16
4617D8o6L0o8N7l1J9P5k5o7M8jl1k5M1PK3nj2K6k6k0o0J34o6l2K5L0k4L1l6m9
4648e0N8J6L0k2j6j2J4n0N4m6rL9J5l6J3L7n3k3L1M2n4N1m5k8J0K6k7K9P5p6R
$$ plain form
4417 -10 -12 -56 17 9 -29 7 45 9 6 71 12 17 9 28 -41 -47 47 -17 -53 6 -12 -7 -22 -10 9 25 22 -38 -9 22 2 8 49 47 -66
4452 -66 -14 40 -8 -17 -20 42 -4 -9 -42 -7 46 -40 -10 80 -31 -5 -47 -3 -8 -16 11 -35 6 4 -40 8 -4 -29 -52 18 11 -2 1 28
4486 28 19 29 -22 -9 -29 35 58 -11 -39 21 37 -7 2 52 22 -26 45 1 -12 -23 -9 -13 23 43 37 33 14 75 66 48 22 32 45
4519 45 28 -1 19 -44 7 64 -52 14 5 43 -5 -26 19 22 28 11 10 -57 38 11 28 65 14 32 -10 -17 -44 -15 -5 -2 5 1 33 15
4553 15 -49 -6 15 -63 -58 -16 -4 12 -24 -30 -71 22 -2 1 -20 -67 30 -45 -2 -5 24 10 -49 -19 28 -11 32 -9 28 13 -31 3
4585 3 -23 -44 22 10 34 8 66 -44 38 6 26 33 25 -41 3 46 -14 -48 10 -7 16 64 -22 -24 20 -56 14 11 3 60 -68 48
4617 48 -18 12 -56 1 -30 -11 64 39 -28 20 19 -12 -37 4 11 34 29 17 43 17 -3 -63 71 5 -27 -2 28 4 35 -1 -50
4648 -50 8 24 54 32 16 4 18 -32 22 -24 -33 6 21 -15 -2 35 -18 -41 -10 32 -22 29 -16 -44 -34 -8 -35 -6 69 -7 2
4679BK3n5J0N9m2l3K1N7n1M7k3j0l5N5l2Ql9J0Ol6Q6n7J6J1n2O3r5J11m0L3m0
4710b2JN5NKn5J4pM0k7rn0Q7m2K1n4N2Lo5Q5jl5mk4J3lK5l2J0L1k5k4L2j4j6m1
4745g4M2L4qK9n5J3K6oj4J3KJ5j0K3m5j4N6J5m7K4j1k0j7M2OK5n9mjM8j4J5q6
4778e7O6mJ5p0J27q5QN0o6qJ9k7rQ5p1j4P1J3p2N3l5L3L3k8j8o4N7N0j9l5M8o5
4810a9OqK4o0P5L7n2rQ7q7j8M8j0k1o1P7j3M0n3K5m4O0k9QJ0l9K5K3k3k1PM6l9
4843hoJ7MoJ5K9j2J3J4r0j6J15k3k2o3N4n2oJ21j02J1K7n3J3L9M7l1j7j0J5m8
4874c1J9J7m0O0j3m2N7k7L2j2j4J9m0J7L5n3jM5p1O7Mm6NK6K0n1N9L9r7M6l0O
4906EK6n8O7m3J6m4j7O0M2n2k4KJ7%N0m5q5J01roMn1K6M8K7n6r1Q5lJ7Qj8m3L7
$$ plain form
4679 2 25 -30 -20 39 -3 -36 -15 42 -9 38 15 5 -30 25 -7 1 -38 -28 -22 -58 28 -29 -13 -2 -54 9 -86 25 -15 18 -22
4710 -22 -21 34 39 41 -14 0 -7 33 6 -3 -53 34 -8 13 -41 11 14 -51 34 33 -2 -6 -30 -17 -20 5 -27 -17 14 -11 -35 -3 -17 -33 -74
4745 -74 -32 2 -6 23 -32 -19 7 1 -13 0 2 17 7 30 -15 -29 27 42 -5 19 8 -12 -29 13 19 44 -15 -19 -20 28 14 29 -57
4778 -57 9 5 20 -50 77 -8 0 50 -16 -24 -5 -32 -41 44 -27 -41 30 43 -29 24 -11 22 55 27 9 -55 2 52 33 -2 46 -19
4810 -19 -13 -21 3 -57 18 55 3 -6 81 -6 -24 24 14 -7 -68 9 -4 36 -17 8 -36 24 -5 3 13 -26 -1 22 -1 -22 -15 31 -8
4843 -8 -14 3 7 1 16 45 33 46 60 -30 -46 69 46 24 -39 15 -37 -43 78 -24 -13 14 -39 -26 13 60 29 12 2 17 -31
4874 -31 -12 5 -35 25 12 -30 27 0 32 20 6 25 -15 2 37 -16 -17 28 -43 24 28 -18 -13 13 33 -18 41 80 -17 29 -1 5
4906 5 31 -27 40 -3 13 -31 -48 12 54 2 -22 -20 -3 -3 47 2 -83 18 9 3 7 -44 -18 30 57 1 -90 -5 -8 9 17 -1 -44 -7
4940gJ05j09rM4mm7L0Mm2P9r5N8p7N0O0%k2rk5jN3q7L6k3LK6J0NO5Jm8j0lk6P
4975hJ8k6K7l5M3oj4K3K3k0l9k8N2n4L0R7p6j5j0K5QQ2o4n0K4J5j0m8J06n8q2
5006g0L8P0j10O6J0j5K6M0p3J2NL1k0Jn2P0Rn1j3L9k8K8l5J9NN1n9LRk8oM3Qj2
5040A1j6n6P6J5lPJ3o0J6L8q1J5JL7n5J7O7n6j2K0j1J4K1l5PM0m1m0N7J1n0M5
5072A2Nq1J22m2Pkj9RPJ7m8N8q8N5LJ1poo2M1N5m1J4JJ6l7K5k5j1Qj3l0O1Qn0
5107b7J9L4m3K7K6l8l7k2O0J6lJ2j5o1J1L8J0l4NkL3L1Pn8oRRj9L1j6M8k2J5J9
5141E7o1k6jL8j3Lj4l4N0K1J4Mm6Nj3o6J18J1o8oJ3oJPN6n1L2l1M3k8Olk7M6K
5176C3j7m3Ol8M8L2m3L9m2L6j2P2q9m1P7L8m7p0L3P6jK0k8r5N0l4Q2n3l8O6n2
$$ plain form
4940 -7 98 -11 -20 24 20 -27 3 7 -35 44 -51 7 -70 -20 40 40 18 9 -16 -17 36 -51 -15 -38 -35 -9 1 6 71 72 24 14 11 -15 -8
4975 -8 10 -16 11 -24 19 13 -1 22 45 25 -14 -42 10 -44 -14 83 7 -8 -18 7 15 97 33 -17 7 22 12 -36 70 12 -70
5006 -70 -32 38 -72 -6 4 -11 15 55 -18 -6 -1 30 10 11 -41 29 38 -13 -26 13 -15 13 -22 -3 2 53 -6 -3 6 -22 -28 15 23 11
5040 11 -5 -61 15 30 27 34 47 -13 3 41 -40 -25 -24 13 -42 -25 42 -14 -26 -6 -17 -3 18 -17 -10 30 -11 -51 6 17 -33 12
5072 12 17 -64 58 16 23 21 2 11 18 35 -13 45 -43 12 15 26 19 13 -49 -8 47 6 20 21 37 0 25 0 -11 -3 -16 -46 15 23 -27
5107 -27 -8 26 -17 10 36 -2 -39 -61 -1 15 12 24 9 -52 -41 -3 7 -27 -22 -24 9 40 47 -11 -17 -8 1 -18 13 -3 45 23 38 57
5141 57 -4 -30 -31 7 -6 -3 -17 -51 -1 20 34 38 -8 -3 -16 -82 36 47 -21 -27 -14 -20 -19 -12 44 -7 25 -6 37 9 15 12 -15 31 33
5176 33 16 -27 -21 -59 -11 21 -22 17 -25 11 -1 71 -18 -59 18 56 9 -61 -28 48 47 67 39 -56 -6 -40 42 -11 -49 17 -35
5207c5knN8Olo4K8K4J0K1k4ll9P2n4j2l3O2RoM1m6l4K9k3L5n7N0M6o1L6n7Q6m5
5241A0j2m2K1O5n8R3j5p4rK2P0l9j5o0M4okK3J2k0m2L8n9P9j4NJ3l4j5j2oqK6
5274b1OL2pnoNk4O6o5N7m0k8m4N7Pm2O5k7KO8p6mnK9jkJ9k2qL5Np1J2J2M5q0L9
5311a7K9nmk4K9pm5qO3j5n5O4K3o7O4j1k7J2l5M1k9J01k7Mn0j4l8O1k2N6n3L1
5343B5%j7m0M4N7l7Qm2KK3jj8lk2Rn9Q8k1L9Qq6O4k5M0q5J1L5J4n1L7K6p8J04
5376D9lp7RJ2KM0l4K6lo9K7K0nK9J3l0Rm5O8m3k0L6j2L9l7Jj3L2n7M3j2O6p8K4
5410GN1o0L5k3k8MRJ9m6PM0k8N8m3oj0OJ6M9j2j9n0L6k2kK2N2j8n3J8N2n9M0q8
5444d6P2k8m3N8l1Pl5L4J8m3R7k9Rk8j3lM0k0J1L9r4k5O2k7K3M0o6J00p8L5j32
$$ plain form
5207 -35 -37 -42 16 22 19 -45 -17 7 17 38 14 11 -28 44 -10 -22 -55 7 16 10 51 5 -29 0 -23 12 -45 5 51 -10 26 -31 55 10
5241 10 -2 -44 -23 42 -16 77 62 -12 -21 1 71 32 17 -43 1 -5 -7 16 28 8 -34 4 -55 24 10 15 28 -6 -21 -33 -39 -47 -21
5274 -21 -15 17 10 5 -1 4 -20 46 -19 38 -2 -30 -74 -17 -10 -52 13 -14 -12 56 -20 -24 -29 0 -1 -3 16 -6 -14 21 26 -45 -33 -21 24 -56 -17
5311 -17 12 7 3 -21 8 1 -44 -52 11 -4 -59 5 28 -39 25 14 -13 -1 -36 5 -24 77 50 54 4 -10 -48 13 -9 47 -6 25
5343 25 25 8 -32 12 69 32 40 -2 0 23 22 4 1 -21 -12 -71 17 -4 35 43 -43 21 -4 36 -49 -38 -3 11 -40 -3 23 -55 49
5376 49 46 -31 -22 -10 -8 32 -2 24 21 -48 -21 -1 -6 23 36 6 15 -30 38 -5 -25 11 -1 38 1 2 -11 21 -36 7 -5 61 -17 7
5410 7 58 -2 33 10 -18 -14 -5 14 -32 -25 15 -13 45 2 -4 -14 -8 8 57 45 26 -24 12 -10 -12 10 62 44 -9 9 61 2 42 -46
5444 -46 26 -2 -45 13 -18 -11 -46 -12 6 -37 60 31 40 12 -1 -4 36 16 27 66 -28 -53 9 -18 5 45 -21 79 1 36 -96
5475i6J48k6k2Ol2M4MoN0j04N5k2Lok9K5QJ4O4o7m2L5k5M6%J2k2l2kK8kL9q3O1
5509B4Jm5K3kk2RK5n7J2L9L7j5m5j8P2m6N7k7j6L2k6k1PjJ4j8l0L9mj6P7o1l3
5542c5N0j7K1J2l4J4Pn1N3j5J2J3n7K0j1MM4m1mL7J7k4j0l2j4L1J7%j1m3K8PN9
5575D7j2n3KLL0l8L6k2%O1q0K4m4OK1l5O0lK2kOj7O7q2J3KM0l6j6j5k0L9k9O0
5609C5m7m6RP0L5l7k7l2M2MK1K3Jo2j4K6m1N8k3k9K6m6J8KKL7L9J1p9J0K5RM7
5642F7r2L3oj8P0n8j9K8l2RO5j15J17q8PM6k6O2r8O0k4L2j2O0o3r6J14%qj0Rl9
5674b5L6l5M6o7O1rL8J2r0J3P5m5J1l9JN3k2K1n9M7q8M6l6O6KK7Oo0RK4l0rNM7
5708C2n7OL0m4N6K7k8rl9orM0K4lK1l6PPj7qL1l6M7l2N2m8o5P9k0K2o0j8M2nL0
$$ plain form
5475 -96 52 26 4 10 -22 22 26 20 70 -34 21 -1 2 -4 -33 -8 0 14 78 11 -31 4 -21 25 25 37 15 -17 -19 9 7 46 -37 24
5509 24 25 -20 3 1 -21 -12 13 -44 -32 7 44 29 -16 -34 38 -8 49 22 6 38 12 -9 -2 -3 11 -7 -37 2 -2 -18 59 -2 -35
5542 -35 15 -2 19 31 -3 11 18 -33 20 5 17 30 -27 -7 -18 -14 30 -11 -15 22 39 15 5 -27 -41 -10 7 7 -4 -47 -19 -12 47
5575 47 35 -18 -16 -13 17 -21 15 -7 -7 54 -26 -2 -46 -40 -19 -54 6 3 25 23 29 12 79 -3 10 12 52 16 0 -15 -35 4 -25 35
5609 35 -12 -58 -49 21 56 19 -8 -40 2 6 27 50 51 -11 -25 1 -40 18 -5 -34 -8 -54 -36 -34 -32 5 44 55 -24 -14 11 20 67
5642 67 -25 8 2 -16 54 -4 -23 5 -27 -18 47 -68 49 -39 -32 14 -12 50 -48 12 -12 20 8 68 5 -91 23 23 15 5 14 -25
5674 -25 11 -24 22 -45 16 7 45 57 -33 -20 55 10 21 -18 -17 36 14 35 -24 23 -65 -19 -55 11 13 40 46 -14 -5 19 -11 -20 -15 32
5708 32 -25 -19 11 -33 23 50 22 13 -26 -32 -41 -1 23 20 41 5 12 19 2 -6 25 -11 36 4 56 8 -57 22 2 24 -36 -54 -12 -17 13
5743A3Rj3k9J6m0M1N0m4l1J8j0l2L9J5Qk4j8O2j0j9K2jql0J6Qm7P5q4Q1Jl5K2
5776B1j6mm0J5l5L9M1k9qJ9j3jK6n0O6o5Nj2M5M8L3r9RNj7j7OM7j1j3J6Mo0Q0
5810C5rm7j1P0j04R2Ol9mjk0K4LN1o7k9N5km3K2m6O6N7j05L9JL8l0K6l4J9l1J0
5843hj5J6J9j2K9kjJ4j36J01Jo5P8p0K0L6K5Ll0o3K7N0on8N8o7Q2nn8J5M3k4n
5876hL6ok4mN6p4M8q2N8m9O0o1j4M6lN2m3O4j25J12l1K2j2j3p5O8J1J7n1LQ1k4
5908C5p4M1M2j3m1L4p0J0M9L3m0pn5N5k2l9Q6k3J3m9M0oNJ0p5M2L8m5M0m7llM6
5941GRql2P3p9m6O1N9k6K0j7j0RK3o2L0k2k4Q2o0N4j15O0K8%M4j9m4k0N3K8n4
5973BJ7N3o7J8lK9l1j5M2q1Nk1K0o3J16JQm9N3q8M8j5M9m4L9j8J0m1J0J6k1K4
$$ plain form
5743 13 22 9 -20 -4 -44 -3 47 3 -28 -10 -20 -52 -13 2 10 -14 -32 30 20 1 23 22 14 -16 0 8 -39 36 -48 33 34 -1 21
5776 21 5 1 -39 -24 -59 -20 21 -8 -16 3 -10 -11 15 -35 31 -34 -29 -41 4 52 85 -14 -5 0 -17 -34 -28 19 8 -5 11 15 -45 35
5810 35 26 -21 -32 38 -66 26 32 -7 -11 -12 -32 -8 -5 46 -21 -50 5 3 -40 -18 -64 2 59 -46 -7 -6 32 2 28 -6 13 -18 -8
5843 -8 -23 -7 12 0 29 27 26 40 -96 5 6 -59 19 -51 -31 5 30 33 3 -60 -33 17 11 -47 11 -56 26 21 -37 -22 21 -3 -8
5876 -8 28 22 -2 -6 50 -24 24 -58 0 -49 11 -50 -64 -18 -21 31 -12 52 -73 39 8 30 18 5 -70 -2 9 26 -25 -22 59 35
5908 35 -39 2 44 31 -10 24 -46 -36 13 46 6 -1 -56 -1 -23 -62 24 1 14 -35 5 -1 4 14 -61 -19 19 -26 14 -33 -36 -39 7
5941 7 16 8 -24 49 -30 -76 -15 44 18 38 21 11 20 43 -19 11 -11 -35 47 -13 41 -74 -14 14 14 58 39 -5 -25 28 56 2
5973 2 19 72 5 23 20 49 18 3 45 -36 -31 -52 -32 -95 21 22 30 -19 34 -54 -6 -21 28 -16 23 5 15 -26 -16 0 -21 3
6005Cj2rP1n8j7L4K1j4j2n4O9j3j9JKK4j9l1L7k9J8M1K4p0J8j4k3J3K1K0o2Q1
6037D2Kk9k7J7k9qK4J0J3nK7r7O1lMl2L2N4p8M8L5k8k9pJ0n4j8R6j9n7K8L8J4
6070C5l8L2n8M2n6j4O0ml0N3J1K7l6k1L9k8L7q6jN8m5MlpM3o0N0j0Kk6Q5j00P2
6103B7Qm7jK0L3m1j8M3Mj3M9q8M9j4L5o4M6o8J8N9n5k0P4k7l4J2N8Jl7k0PJ8N9
6136G3o2pJ0M1m6j0Rjrk5K6krP7j9r0NJ05n5rj0O2m6l8j4O5n4N8%m1J9n8O0N2
6170E7m9Kq5N3K2Kk8mL1J2LoJ0m6Lj8L3k1J8L1m8M5Po5N5Ok9J2j5K3j8l3M5J9
6204B4j3k6L9j06N0J4J0o1Q6Rj0n4N3j1QJ0J7j3k6K7NJm4L6l0OK5m1nO3o9N2n6
6237c0L8j0J7j8K9n6j7O9m6M7k0L5p0O4k9J9n3L0%k4Q0n3j7m1N0K2J6qk1n0M5
$$ plain form
6005 3 -9 -18 53 -5 -22 12 33 19 7 -47 22 9 -10 -9 -7 17 -2 -33 4 -25 -7 34 58 -12 6 -8 -31 -18 3 23 -39 42
6037 42 44 15 -12 5 -24 -32 -8 2 15 10 37 -60 1 -2 2 -30 2 56 -22 26 61 33 4 -3 7 -47 -65 31 12 -45 -17 21 35
6070 35 -3 29 -29 13 -43 -57 3 -1 -31 22 33 60 24 3 42 14 51 -35 -36 22 -23 -19 -22 -29 14 -46 4 -6 -4 -30 55 -45 27
6103 27 35 -12 -13 7 40 -1 -19 24 28 15 64 -24 25 11 46 -18 28 -40 -22 37 -18 -38 36 9 -25 -13 45 46 9 -11 -4 14 73
6136 73 11 4 14 55 9 -1 8 7 -2 -27 -1 -3 -12 65 46 -44 -39 66 11 2 -8 54 8 -30 -44 21 -33 25 25 -16 3 -55 5 57
6170 57 8 10 -75 -22 0 2 -26 -30 1 13 16 10 20 -26 -23 -41 -8 -29 -11 20 -28 17 24 -41 14 20 -9 3 -12 11 -7 -40 5 24
6204 24 11 -15 24 -82 -32 -18 -8 -69 17 26 16 -38 15 4 12 22 39 26 0 27 32 33 -11 25 -5 1 26 -15 -20 43 -26 26 -30
6237 -30 8 -2 15 -3 26 -30 -47 22 -24 23 3 38 -32 32 3 22 -31 -1 -1 -25 55 2 -15 -56 -6 16 32 24 3 -47 -2
6268bpnL4mPJ5k6O8p2L0m2J7pk0K6k3nL7m9o7J25Rk3m9k7M9L8j5J3k4J1%kL4j7
6303B7K1k1m1J6j8M9j2KK4m3J5j8k3L7j6K2K6o9j9L8k2%K1MrL9l3K0k7K1k9L9
6335B1l4q2J26k1k8PL4k9J9k5K7l9RO0m1Pl3Nm2P8J4J4m9J1j7j5k4J20l3k9K2
6366C3n9j4O3j7m6RK5Rj2M4o1O2j9j8M1k9m5K0K9k1kj8Q1n7O0j3o1L7J2Pp9K0
6398a9L9j0Jk9k5O3j1Qo8Q6l5n4K6k6M0mQ9o1p3N1l0J15q1l8O4n5L4nJ3J2Kl6
6430a7Ll4P0m8N2p7Q6ll3Ll0M3L3m1n8N2K3p2N5ro2O0Ol4POj6M7qk7L8m1k0J3
6464c3MN8k9mL1J7o3N1rjqQJ7J6o3N8m9K7j1l2N6L0n7J3l8J4l4Kl2Q6j6j8RJ3
6498A3j3N1n4k7J9N3oj9k6Qj5M5q0P4m4O3k8J7n5k3N4M3l9qJ9l9LJ5L6j9l9j6
$$ plain form
6268 -2 -9 -14 20 16 23 38 12 80 8 38 -4 13 6 -14 12 -11 -16 21 -28 -95 30 39 16 -33 -60 -11 27 12 25 1 12 12 10 44 27
6303 27 48 27 -14 2 -16 33 21 23 47 4 19 1 -22 15 -1 21 47 -22 -41 -3 -25 -25 -4 0 -9 30 -3 17 -10 11 -18 21
6335 21 -13 -95 31 10 -18 -11 23 -6 13 -12 15 -24 -15 45 4 11 -22 -17 -59 19 33 47 -2 9 -8 -23 -47 73 40 11 33
6366 33 -26 -40 23 6 -40 -31 -6 3 -9 35 -26 36 17 -1 40 11 -34 -14 15 -6 -8 -26 55 -2 58 45 -16 21 33 40 -39 -19
6398 -19 20 10 11 -18 -43 20 9 17 -51 35 0 -54 -28 -54 -14 -18 71 10 -63 -12 -42 73 -8 -46 18 -37 -3 -8 5 17 19 -17
6430 -17 -14 -48 22 -26 26 -51 35 32 -1 2 -28 15 48 7 -51 1 24 -48 7 -2 -64 -4 2 -32 -25 -19 -35 12 4 -23 15 -26 -46 -33
6464 -33 -29 29 0 -4 27 44 -19 32 23 22 14 22 39 55 -8 50 1 28 17 -15 41 71 14 27 -11 3 -31 -29 -61 25 9 -9 0 13
6498 13 0 51 -3 -30 -11 42 36 17 -9 -1 -16 29 -51 23 -21 42 14 31 -24 -47 7 50 11 3 22 -17 -14 1 37 18 -21 -37
6530c7NJ5K9M4n1M5p4J3j7l4N7O2o3M8j1l9K4r%l2J3O3k8Km6k8K8Q0n4qK0M2k5
6563C4k2l6K9J3m5KP1J7pk6J2o3N5l5J0j9j8J3K8K0l3j6J5j7K7j7LNMPK2m6M6
6596C3J0l8RJ1m0NN0l5n2oP8o1O0l8J7l4L7ln0M4L6q5L4K6q%Ol1O0JJ1l7Kj5m5
6631d8O9m7QN4p4O9o3N7m1%L3Pk6M0K1j15J15l9m6J2ON7o2J0%m1K3L8Nn4m2Q4
6663A0L6J0m4o1N3rOnN0o9MO7m4rl0N4o3N0j9RQmN9o4m1J05l9p2K8nL4j1Qj9K7
6698A0MN9n1km2m0O0k3L0l0LL6k2J3J3j4Rj2j3j8M9K3n6K2J4q4J0M1L3j4J4Kp0
6731d6M9k8N5n3QK8J1oo1M0KqN8l4qmP7n9m0L1j0PJ3NQm5Jkk3N5j4j5M4m7J4k6
6767b3L7m4L5k3K0m2P1K4j01M3k4M1l7M1j0qojn5P7j6K0k5L1k9k0N5n5K0l2j2
$$ plain form
6530 -37 -32 -17 12 56 5 50 -24 -11 -28 -62 -5 57 -6 42 31 -8 16 7 7 -25 -12 51 23 25 -21 -49 -21 59 5 -3 17 59 34
6563 34 12 -24 5 18 -27 -25 46 63 56 30 42 -21 34 -1 9 -10 -28 -15 13 33 0 -16 -1 -18 9 -8 -5 0 4 11 33 -13 33
6596 33 43 5 14 25 -15 -10 40 5 -47 -53 25 -36 24 -14 3 -31 6 3 -47 -3 33 -52 -18 8 0 0 6 -25 35 36 47 10 12 -3 -48
6631 -48 21 -26 -18 36 -38 31 -32 25 -16 -16 17 24 -2 38 59 -56 59 20 -26 -14 -8 49 -13 -3 -3 -44 -21 17 22 -32 -74 10
6663 10 46 56 12 -49 4 -5 1 -4 46 -23 -19 48 4 -5 -35 19 -44 6 -13 -4 4 0 59 -5 -46 59 20 -52 -24 -29 5 -6 2 -17 10
6698 10 14 73 22 20 -22 -62 -2 -25 5 -25 -22 14 -8 5 18 4 13 1 -12 -30 19 42 -14 8 22 -62 -52 -11 22 8 22 24 -46
6731 -46 3 -25 30 -23 -15 13 24 18 -43 -3 -1 -9 49 15 7 3 80 21 -19 12 2 9 22 27 35 -10 -9 -11 -34 21 7 -8 36 -11 3 -23
6767 -23 14 -30 5 -18 2 -40 31 55 -46 -3 -27 14 -23 18 8 0 -6 -7 -62 15 -1 19 -6 25 -4 -24 31 -24 -4 -36 -48
6798d8O2J4oK9o5l2P5jp7Q9j7o8L8O7l4m3Q2k7Km2k3J9m6K0RO9j23Q4K2J5l5J0
6830A9l1j2j5Q3j08N3K0m3k2L9M8qm0OK5mnj4Qjlk1L3N9q0N4m2k1k0K2L7q6N7
6863a3N4l4q4P3KO2o2PL1j6n0M1n3P3nK0m0n8N2J6k3j1J6L9n6P3p9O9l7L1l3k
6895CKK5J5j05R0k7N6p1j2o0P8j8N3k6lj5J0l0J00n9M9p7K2j8m0Q2j1J3Qk6j3
6926eNj4m6R2o2L1N6o4nM0k9JM1l6j7N3o1K7j2PM6q8N9Nk0mJ0nMMkJ0K1on1K1
6962FnK1q4J03k8p1R5n7M4k1l5N5J4n3j1L1L2L1j04K4J5l0N3K0j4l5M0j2l0K2
6992A6M2n6k1LQ3m2l0qN0k5k4N9m2K1m1J3K7M2j35J06K4n3j2N4p7J8K3m3kK2l9
7023d7N1J8m8PL8k2LPl5l9L3N4k6kM3m8J1M7l6m0O4K6m5m9N6k7OQJ9qp2J01n3
$$ plain form
6798 -48 14 28 22 51 -14 -46 29 28 -49 40 23 -45 -7 60 26 -17 65 38 40 -2 -25 -6 -52 -32 -23 46 -77 7 29 44 9 19
6830 19 -12 -24 -39 44 -64 -11 9 -34 -56 -17 31 23 -17 -11 14 10 5 -9 -1 -2 -5 -26 7 66 -14 40 -2 -23 -43 -21 16 -70 -13
6863 -13 41 7 -77 -4 -2 60 -2 5 36 20 -30 11 -42 31 26 46 6 -52 0 16 -7 -18 -2 37 -19 54 -25 44 7 38 5 3
6895 3 5 30 45 -60 30 3 59 -12 -24 -84 -6 -24 29 3 0 -15 -5 -35 65 6 55 -22 0 -18 -58 24 13 26 34 8 -5
6926 -5 0 -14 -60 32 -30 1 57 -7 -12 28 -1 0 41 5 -12 41 -20 7 -5 2 48 -40 19 24 4 0 10 5 9 13 11 21 42 36 -15 6
6962 6 1 22 -62 41 13 -58 37 -20 24 3 -32 23 37 -16 -27 4 36 67 -37 -13 2 -28 25 45 31 -4 36 24 -6 16
6992 16 58 2 -19 -16 67 25 -5 -13 37 12 -12 47 5 26 -15 -2 25 67 -68 38 62 9 -3 51 -26 -8 15 -28 -30 -8 -47
7023 -47 4 22 -26 -19 19 -3 0 7 -28 -67 -34 20 -6 -8 35 -13 -2 45 9 -31 33 59 14 -35 21 -6 0 8 27 19 -53 48 -5
7056eN3n7jj7L3K4l2n2O8n0O4Jj9k4j5M2ko2R3n0J6m2M9j4l3M7LJ1k6o0P5m3K2
7089cK3q5N8k2N7LN4j16Q4l5l3P2m1m0OL2o4M9MK5p0N2l8KM5j5k5jL7K7n6K5k2
7122a1k0j2P5r9K0L7k9rP7n6K0L3kk4m2K7J0K5q5O4J8J1k6p1J53j60P2nm8N0J
7153fJ4n0%L1J0qM9l2L0l0o4R0%K8j5k2p2lO7Nj0J1jr0J2M9J2jL7m5R0n7J1j8
7187B2pn1k6J04m8k8O9n2j2M4kl7N4l2pM3n5RJ6K5n6N9p5Q9k4j5p8Q3K1k3L1l5
7219Fj6Ql8N9J3k5lkj6J3P3m5n6K5jL8p8K0N5j3n6qJ8M0N0n3n6J9M3p0M9j0l6
7252e3Q6q1R9o7j4O4j0l1k3K3llQK0L5q9N8Pm7k5Q2l9k3O8q1M0M6qp1P2lo6L8
7285Ij1qq1O7j8ML3RK5rN4p9K4lK9n4k1LQ1q5N9l8n7Q7pL3n0M2o6K5N0o7N3j5
$$ plain form
7056 -5 48 -9 -10 -27 6 30 -2 -54 14 -36 28 29 10 -14 -29 13 11 -51 42 -8 8 -34 15 1 -32 15 18 29 3 -57 18 -25 -3
7089 -3 20 -65 -7 -29 28 31 85 -31 53 18 -15 57 16 -24 -18 14 -50 -1 3 28 -42 10 -28 -26 19 4 -21 -22 15 42 -14 11 -11
7122 -11 -31 -43 32 -67 -47 -10 -39 -48 29 -27 -7 26 24 0 -42 -15 -5 20 -65 -1 17 28 2 -69 84 -76 -4 -9 -57 -7 -6
7153 -6 8 -42 -42 -11 -1 -9 40 8 38 8 -56 34 34 62 47 25 -47 -50 17 22 12 23 22 -68 -56 -7 5 4 41 -4 86 29 40 22
7187 22 15 -36 -62 42 -6 -34 35 -17 -29 15 13 -24 30 -2 -9 34 -21 -12 4 29 -27 32 -43 46 22 7 -71 12 33 10 41 6
7219 6 -10 -2 -40 19 32 7 4 2 -14 -1 72 27 -29 -4 -5 33 -45 -25 30 17 -39 -47 -29 11 61 8 -48 -29 14 -56 -7 -17 -53
7252 -53 33 -48 51 -16 -30 34 24 -7 -30 -7 -10 -13 -5 15 50 -39 19 26 -21 -46 36 -3 -26 42 -39 1 47 39 -32 40 37 -29 9
7285 9 -2 -10 -91 -24 -42 -38 -5 4 29 20 74 -5 19 16 45 -9 -30 -27 54 -31 28 -10 -67 20 13 46 -4 38 -28 -3 47 -20 33 18
7319A8l5K9k8j5K6J0Pm1k5N8NL8k1m2N0l3J5rRk9K8L7p1N7j1m6K7J2j4Lm4N8l7
7352a4L0j4L0k7j5n5P4l8L8L8%n0l5J3L4l9K8j8K4ql7J5kL4n2O2Mj1l2Mj6%N2
7385A7K3qo4j6N8J2rl0L9k7J3J3J6L4j1l3o6N5m9J5K7J8N4o8L8po6k9J9M0q4P1
7417em2M6%k9L0Nj6M6Nl5k1OK3J9l0L6q4KJ8O6Jp5L1L6j4n6J0J6J03r0j6M0k8
7450bJ7j6J2N6j16R9n5J3Jm1M3J2n4K5Q4o0j2l3P1k7j5L5m5P8p7N1l2Oj0oJ3m4
7482b9K5K4l8M0J2j6J6J2q5N5lP3l9n8L4Pn5O1p1M1K2m0M6l1o7J03lm1J3k8N1
7513C1j7J0n7K6jJ3K1L3pj20Q0n2J8mP0l2rK0k6K2k0L1n8RL1j1j0K1Nj7J0k8j7
7546c5M5q0J11j3m1K4J5j2np3J03j0j0k7J1J4l4J9J5NOl7O6l8J4j4jJ5n0K3jj5
$$ plain form
7319 18 -17 12 -16 -31 -5 5 12 -29 -54 4 9 47 26 -16 34 1 16 7 16 -13 15 52 -19 38 27 -19 8 20 6 9 -35 23 -14
7352 -14 16 2 32 5 -10 -65 9 -29 9 47 47 -3 -38 -25 9 -30 -2 -20 4 -4 -41 -26 -28 6 -46 16 20 9 -23 -19 -35 -35 17
7385 17 40 32 -32 -48 10 22 13 -17 22 -5 8 21 37 71 60 27 -39 16 -33 -18 9 27 81 13 51 44 -22 -51 -32 8 -76 -5
7417 -5 -47 -1 -1 -30 0 5 -11 35 40 5 -16 -10 13 32 2 38 -46 -44 -26 40 41 -34 -3 33 19 -37 -27 -11 92 2 -14 26 -2
7450 -2 15 -1 11 67 -49 50 -5 8 9 -32 11 23 -31 -6 78 18 6 -27 44 17 2 37 -8 70 -7 44 12 18 8 2 15 -29
7482 -29 -4 20 -18 22 34 18 34 46 -39 16 13 86 47 -11 23 30 -25 36 -35 6 28 -12 34 3 -64 39 36 -5 8 -20 31
7513 31 14 24 -33 -7 -8 5 26 59 52 -68 12 -40 -22 -26 44 12 3 23 -3 19 -1 30 -28 -19 12 1 -9 12 17 0 10 -18 -35
7546 -35 10 -70 41 28 -13 11 26 14 9 -64 39 29 19 -8 3 17 -17 2 17 22 28 -9 57 19 33 19 18 33 -17 6 5 -10
7578a0n3L0N6n8P0m1n2J38o4n%J9Oj9J6l0j0rJ4k2JL9pL2p0O7q3Q3l7J6j1lL0
7611C3j0K4j9m5kJ1M8o4J0M1j8Lk6L1K9l9J3k1J4o5Q2k7k1M0k1j6J4J4l3J6K0
7642A6l0L3j7LQk3N6k5K7j7p5LM4pPkj4K4n1M2kN1j9%l9j3L9o6K6j8Q0l5k7K6
7676EM4r6M7j4K0L0r4K5P7o7qL8J4J6nrK1o1J0pO2K3p1j0L7k6K8Jk4Nl7K2K6j8
7710D%o8P6k6K8Jm7Q7pq4L6K1o8K7L0l3jK4j6M4m9O0p5M2j2j4j6J5K9j4j7J2N4
7743D3o4K6L1o0N6j4k2K2j7j7M1Klk2L4Ppn6nO2l2JL4M0j00L3l5N5l5k1L5O3o5
7776A0Rj7k8O4j6j4J9k1j4M2p1M0MK9K1q3L4k5j9N1o0J7j4N4m9pP7o7M3J7K1n1
7808drJ6K8j6M5l1K7p6K2L5%k7P4k8m5jJ6k7pk0R1o7K6l2J5qJ7j9mL6l2M7k4L2
$$ plain form
7578 -10 -63 -33 23 -35 35 -6 -58 80 16 11 11 30 36 17 33 3 -7 -16 -2 -24 -23 16 9 41 -29 38 -45 38 1 17 6 3 33
7611 33 23 47 28 -17 -19 -8 40 -24 -14 27 9 12 -14 17 46 7 20 -1 13 -52 30 3 -18 22 1 -15 -1 13 -20 -4 16
7642 16 -14 19 2 5 13 -10 46 21 48 31 -44 -41 3 -4 3 1 -13 11 -40 2 0 51 32 32 -7 -20 19 -47 -21 -39 41 6 -21 5
7676 5 49 -47 0 -14 6 36 -58 -33 44 -23 -31 7 21 37 32 23 44 -17 -7 -14 48 71 0 -10 27 1 29 30 6 11 -26 -4 22 4
7710 4 4 -64 12 -14 14 15 -32 55 48 -36 0 21 -47 -20 10 -23 -24 0 -16 28 -21 39 -36 6 -6 -20 -36 -21 8 -6 -23 -11 43
7743 43 -21 5 36 -24 32 18 -4 18 1 -16 25 27 24 2 36 43 36 -20 -25 37 5 6 40 80 -20 13 -22 33 -2 -23 12 75 10
7776 10 19 2 -26 38 22 8 27 6 -8 34 -37 3 7 36 57 -26 8 -17 -36 15 -45 -28 -42 12 -37 -44 33 -34 9 26 47 -4
7808 -4 -13 3 31 15 60 29 56 -20 2 37 37 10 84 56 11 10 26 -1 -8 -28 63 -4 22 -10 5 -3 14 -5 -9 27 -5 42 18 50
7842E0Nm0m1J9Nj2J5l3L9j2J6l5KK7N3m5k8K2j0Rm5O0k8L1j8Mk3MmlL4rJ5pj5
7877BQOm1oO8l8L1j2l3O2q1j1P1mPq4O3l0J2L1M5o5q9M7L9J5K0K3p3jK5m3L2K9
7911B5o0L0k1M5J8m1JJ9k4L5l8k9N9k7K3k0j9M0nnpK0qj6K8m4K8j1M7Mq5N9K9
7944E0oLm3%j6N7o8RjOk1m8O2oM0NN0j27O1J9L9l9j6l4K5K4n6N3j7k8L3m8J3M8
7978B3o4J2L5j5j9j3Q3ol1J1l0L3J3j8kj0j6%k1j4K8K9l6P6o7O4j9l0N5k8N0l7
8010C6k5jk6O6l4rRLj8PP7q2K8L7n2l0J3M5q2R3q3O2jN7p4m0mO2k7k2j3M5j7j1
8044a1j9L8l5j0K0lj8J5K6k7k0N0qM6p7l1O5J5m1P9n1K1k0Ml1L8%n5PK1M7m7N8
8077D6k6Nn3j9O6j9Qo9L9K0k9K3K3oL0m9K5k8N4k7Ql1l9P9j0k0K2k9mm0N9QNj3
$$ plain form
7842 50 55 15 -26 -7 -2 -14 1 -32 7 -5 11 -24 -22 5 58 13 -15 7 -3 6 -39 21 -7 24 6 10 -13 -9 -13 -16 18 9 24 17 2
7877 2 10 16 -25 -31 37 -1 30 18 -15 47 -34 -45 26 22 29 -55 8 -22 -10 21 66 1 -88 -41 -2 13 33 56 -17 -18 7 -36 -4 25
7911 25 -35 -5 -26 19 37 -4 -3 16 -8 27 -11 -40 19 -8 15 -5 -24 16 11 6 -1 19 11 -5 23 -21 7 -4 43 47 -38 21 50
7944 50 44 47 4 4 -12 45 -23 -14 -15 -9 -30 -78 -16 -22 18 23 73 -54 7 26 65 26 10 -24 1 25 -31 22 5 -23 10 -38 -25 23
7978 23 -41 -29 6 -9 -28 -41 42 36 5 16 -14 19 32 14 12 2 -14 -14 -35 -49 -21 8 -28 48 -19 45 26 -4 51 23 73 36
8010 36 11 10 -16 50 16 7 16 19 1 8 85 3 31 68 16 -14 -1 44 -38 55 -28 34 33 90 16 -24 -28 34 7 -15 -28 17 0 -11
8044 -11 -30 8 -27 -37 -17 -20 -38 -23 3 -24 -44 6 -2 44 -33 -64 1 16 -25 54 3 24 4 8 -23 15 15 -40 -33 -12 35 -12 46
8077 46 20 25 -28 -47 19 0 8 -61 -22 -2 -31 -8 15 9 39 -10 15 -13 41 14 22 -9 -48 31 21 1 23 -6 -10 -50 9 17 22 9
8111IPRJ7o0oNK1k3K8j3k%L0k8k8M4j4N6n6llk9O8J5l9n4K7M8p4Q2o7nO1k5m2
8146d4j0P1l3P7o0K4rl1j6M8k4O7m2n6Q7k1l1Pl9N2p4J28p2L2n0K1k9K4j5Pn0
8177f1oJ18p6M4k0K9rL8j22J03l1m8O5J9
$$ plain form
8111 9 16 25 42 -18 -24 -19 2 -21 7 -6 -8 -8 22 -6 -34 10 -4 52 -4 -7 -10 -39 29 44 5 -49 -22 26 -48 34 -33 -38 23 -2 -44
8146 -44 -54 17 -16 61 1 25 16 -15 -31 17 -7 60 18 -38 49 28 -3 4 -35 17 -57 71 -1 31 -19 2 -27 -3 -18 -11 -61
8177 -61 -67 51 -25 19 -1 28 19 57 -65 38 7 -41 24 43
8191D3
$$ Imaginary data points
##PAGE= N=2
##DATA TABLE= (X++(I..I)), XYDATA
0@%%%%%%%%%%qJ6j6J6k4L2m0M9n7P2q8J04j21J45j73K00k35K73l13L60m11M69
32B50n33O04o83P71q67R72j086J213j355J505j668J849k048K264k498K753l034
49a591L343l682M055m471M933n446O025o682P434q303R324j0543J2023j3870J6250
64H799j9443K3978l0958M3168p0417K33482r4628m65684M57517J46597l89090
75a56679N7508L06377l03877r0034M04086q3790m20680K60510L07110l30648j67131
86b17248L27804o933k35667J24956J19276j94871K1831K04186j22198j83960J87993
97B5169J35603k09482j00280J96324O1431j53778k1399J05705k7021m1954Q6658
108E6976k4819j51487R0666J91511j52059j94967J96086J50116k02430n6746J69780
$$ plain form
0 0 0 0 0 0 0 0 0 0 0 0 -8 8 -8 8 -16 16 -24 25 -32 40 -48 56 -65 80 -93 107 -128 145 -168 192 -219 250
32 250 -283 321 -362 409 -458 514 -572 641 -714 791 -877 972 -1076 1188 -1310 1443 -1591
49 -1591 1752 -1930 2125 -2346 2587 -2859 3166 -3516 3918 -4385 4939 -5604 6419 -7451 8799
64 8799 -10644 13334 -17624 25544 -44873 188609 93981 -371703 85814 232411 -156679
75 -156679 -99171 207206 -96671 -186705 217381 133591 -287089 -26579 280531 -50117 -217248
86 -217248 110556 103623 -132044 -7088 112188 -82683 -60852 143334 21136 -162824 25169
97 25169 160772 -48710 -148990 47334 108765 -45013 -66412 39293 12272 -29682 56976
108 56976 32157 -119330 -28664 162847 10788 -184179 11907 162023 -40407 -97153 72627
119G2627n7131r4057J55895j6548k16383J27868K12262k12533j45588K49536M5933
130A21881k18414N8517J30823j33541j4646J52333j01625j19849J82395N6099
140A13973k02584J4300J66526o0040r0287O4215j585l6848P2877q075j05637M7576
152b5589J00803n5954o5280L1046K3100J7396L277p1490p360J03020q836r5147
164e1014L3893M9231m6891K1615L4876r3386R76J36493n3292j36956J00986R6308
176I2839j20823k5962J04498m6216n2232R6227k1013j11901Q8368Q9419j28545
187c5341m1609J29620r841r1700M6974K9641n9907L2831M7878p7462k3048R3171
199D1207J357p8121Q766M6731k462j4579j3936o697K6428R897k5838j494P365
$$ plain form
119 72627 15496 -78561 77334 60786 -155597 -27729 184533 -28000 -173588 75948 121881
130 121881 -96533 -38016 92807 -40734 -55380 96953 -4672 -124521 57874 113973
140 113973 -88611 -74311 92215 32175 -58112 6103 4518 -32330 40547 32472 -73165 -25589
152 -25589 75214 19260 -46020 -14974 8126 25522 28799 -42691 -50051 52969 44133 -51014
164 -51014 -17121 32110 -14781 6834 41710 -51676 -50700 85793 32501 -104455 -3469 92839
176 92839 -27984 -53946 50552 4336 -47896 48331 27318 -84583 3785 93204 -35341
187 -35341 -76950 52670 42829 -48871 -1897 27744 -32163 668 48546 -28916 -51964 41207
199 41207 42564 -35557 -26791 19940 17478 2899 -11037 -17734 8694 18591 -7247 -8741 -1376
212a376o332K5167L365n8646J5250P6831m5264o9200P2798L4074q2133J9668O5015
225D9217p2123j9627J04302m1963j03254R8433O6312j30492p096J24022n4875
236A2856p8248R8260P736j08229O5019Q2295j16352l0400J30128k7787j03707
247f8429P3076M9135q9967J3697P6170o4737m0582Q8526k047q3233L4662N5879
259D2150m7482k0843M0280o853k0711J9127J203j6038Q402N769l836J561j0242
272g513J999K4714j6865k9488L5732J7516m8549Q284M4795l9083k1250O1146j6582
285A4856o2355N6692L9541q3473J893Q5770m7991n9650Q2301J2316r1631M1034
297a0697P1534q2278k9309R7070k1372q1816O2789M2438q1747O523P3430m7694
$$ plain form
212 -1376 -7708 17459 20824 -37822 -22572 54259 8995 -60205 12593 46667 -35466 -15798 49217
225 49217 -22906 -42533 61769 19806 -83448 14985 81297 -49195 -56291 67731 12856
236 12856 -65392 32868 40604 -67625 -2606 79689 -36663 -67063 63065 35278 -68429
247 -68429 4647 53782 -36185 -22488 53682 -11055 -51637 36889 34842 -48391 -13729 42150
259 42150 -5332 -26175 14105 7252 -13459 5668 6871 -9167 -765 5004 1168 2729 -7513
272 -7513 -5514 19200 2335 -27153 8579 26095 -22454 -14170 30625 -8458 -29708 31438 14856
285 14856 -47499 9193 48734 -34739 -32846 52924 4933 -54717 27584 39900 -51731 -10697
297 -10697 60837 -21441 -50750 46320 24948 -56868 5921 48359 -33388 -26865 46565 -1129
309a129m2683O8917K989o5003L1038M1506m7828r891M4542j7063k6811K9878M525
322A2987k6890J0792J2917j3491J823M188q574J0384L348k0201J1284J8569k6357
335i221l187L2895k0428k4221M1938J233n1052K8720M0599n4305j2703O3837k4305
348I800n1905N6658K0305p1769K0708O4171n6913l5404P6039l969p0865M0699
360b445M3695o1736n212O0934l1318m0235N2935Q664n4614K1078L7805l8428j1325
373b0202L8387j3611k3385K7920K480k7493J4839J5865k0707o13J3965r167M18
386a304P917j4594L572J9963j9831j2974L1449n113l0697K6453J5407m1284J0872
399a0164M1937l8071k5771N5979k031n6392L1686L7890n1999n902N4567k9226
$$ plain form
309 -1129 -43812 25105 28094 -36909 -5871 35635 -12193 -22084 22458 5395 -21416 8462 12987
322 12987 -13903 -3111 9806 -3685 -1862 2326 -6248 4136 7484 -12717 -1433 17136 -9221
335 -9221 -12408 20487 59 -24162 17776 19009 -32043 -3323 37276 -17029 -29732 34105 9800
348 9800 -42105 14553 34858 -36911 -16203 47968 -8945 -44349 31690 27721 -43144 -2445
360 -2445 41250 -20486 -25698 35236 3918 -36317 16618 25282 -29332 -8254 29551 -8877 -20202
373 -20202 18185 4574 -18811 9109 11589 -15904 -1065 14800 -5907 -6520 7445 -1722 -1304
386 -1304 6613 -7981 -4409 15554 -4277 -17251 14198 9085 -21612 4841 20248 -21036 -10164
399 -10164 31773 -6298 -32069 23910 21879 -34513 -2827 35063 -16936 -22838 31729 2503
411B503l8187N4605Q476o2300K3703M9785m6870k2797N3566q227m1908L2610J7865
424B2824m2572R690L7058l0014k0749L6556J939k9190J1050J2572j4050M045P778
437F937j4126K367J3983r308n371P791n209L218J1569j9441q384L3505m011l7100
451b3580K0460K6640l3812l875L6132k4066k4805M7034J514n6579K5784M8437
463C9284m6938k4723N3797o240m2509L4285J6585m9557J5513M7843m2915l0919
475c6494N6489N825n2415J7306L2776l1141n241L1829k0734k1837L6938P471l9406
488a8634M501L0134q447j4887M306J034M841O422j2900o389J4317J490o934K410
502A264p584j336K3032o695l2581J9103L0924k9790j7185L2945l955k4064K5383
$$ plain form
411 2503 -35684 18921 27397 -34903 -11200 38585 -8285 -31082 22484 14257 -27651 4959 22824
424 22824 -19748 -10058 27000 -3014 -23763 12793 14732 -14458 -3408 9164 -4886 -841 6937
437 6937 -7189 -4822 9161 -147 -5518 2273 -2936 282 11851 -7590 -15974 17531 13520 -23580
451 -23580 -3120 23520 -10292 -14167 21965 -2101 -26906 20128 21642 -34937 -9153 39284
463 39284 -7654 -32377 21420 15180 -27329 6956 23541 -26016 -10503 37340 -5575 -36494
475 -36494 19995 25820 -26595 -9289 23487 -7654 -12895 18934 -1800 -23637 13301 20772 -18634
488 -18634 -14133 16001 7554 -7333 -3027 -1993 2848 9270 -3630 -10019 4298 5788 -1146 1264
502 1264 -6320 -7656 15376 8681 -23900 -4797 26127 -3663 -20848 12097 8142 -15922 9461
515I461L969l9021K2179L9646m5646k6932N7200N254n1878J6996L0092l2373J371
528i682L5496l2489k6177N3589Q749n8180R937M6305k2163k2740K4440l813j6956
541a3684K4742M038l5043Q101L3562j4441k4326J2373J2763l555m624p417K046
554e465J5240l069j5874M397Q961j592K956o645j4613J8738K0615l0458j7934
567b4743L5260P322k9562O722J2573j8411J1498K2597l5330j7091N1172L944n2768
580b6817J1964L9341k3846j4640K7044j3362k0146L5813N369m6679J1293M3370
592B8704k3328k9232K6081R916j8532P775M029j8665J1856K1175k2548j7044K4537
605D724J0521j7283n626M466M649Q315p237j6377R911J6521r289r849K994j05
$$ plain form
515 9461 13430 -25591 -3412 36234 -9412 -36344 20856 26110 -25768 -8772 21320 -11053 -9682
528 -9682 25814 -6675 -32852 20737 29486 -28694 -18757 27548 5385 -17355 7085 3272 -13684
541 -13684 11058 15096 -19947 -11846 21716 7275 -17051 -4678 8085 4530 -94 -7511 -5465
554 -5465 9775 6706 -9168 -4771 4190 2598 5554 -1091 -15704 3034 23649 -6809 -24743
567 -24743 10517 17839 -11723 -5001 7572 -10839 659 23256 -12074 -29165 22007 25951 -26817
580 -26817 -14853 24488 642 -13998 13046 -316 -20462 15351 20720 -25959 -14666 28704
592 28704 5376 -23856 2225 12141 -6391 1384 5413 -13252 -1396 19779 -2769 -19813 4724
605 4724 15245 -2038 -7664 -3198 1451 9766 2529 -13848 -3937 12584 3295 -6554 -3560 -3665
619c665Q509Q249k1302j0680L0971O381l2364K501K3849j1343o761J5363j3890
632d182j2109L1517J830m0650J1443L7668k2415k4012K6207M448k0672J4693P422
645A1188k7403R286L0625k2972k4569K8793J3152k4633j079J2074p214L570R819
658A0637j7066p697K3347L420k1227l97J2666Q32j545m792o836J0036J0091j2994
672a525p441J0802J416k814L866q900n563K0536J413k7268O338K6064j4582j6528
686a4186J8939J117j5977J5028O242k6487P741K9648k0601k3472K7642J0352k5826
699i840M782J5267j6872L16K1909j5973j9407K6283J1111k8059q11K1295o992
712C009r033J0256l943q278J3297L440j6528J338J3823l313p923J256K133L346
$$ plain form
619 -3665 4844 13093 -8209 -18889 12082 18463 -13901 -11400 12449 1106 -5655 9708 -4182
632 -4182 -16291 15226 17056 -23594 -12151 25517 3102 -20910 5297 9745 -10927 3766 11188
645 11188 -16215 -6929 23696 724 -23845 4948 18100 -6533 -7612 4462 -2752 818 10637
658 10637 -6429 -14126 9221 12641 -8586 -8983 3683 4515 2970 -1822 -8658 1378 11469 -1525
672 -1525 -8966 1836 3252 438 4304 -4596 -10159 10377 11790 -15478 -9140 16924 2342 -14186
686 -14186 4753 5870 -10107 4921 11163 -15324 -7583 22065 1464 -22008 5634 15986 -9840
699 -9840 -5058 10209 -6663 -6347 15562 -411 -19818 6465 17576 -10483 -11294 10001 3009
712 3009 -6024 4232 289 -7989 5308 8748 -7780 -6442 7381 4068 -3855 -2599 -466 2880
726B880O58p958j14R563k828o311N424j275m798J0561P5j7341P855J9008j6286
741h87j3503K1025K584j9460R859J0827j9733K501K2950j6431j8345K6131P307
754A4825k7883O263K1003j7203p588K2059p893j8924K0307R842k6141J715K3863
767A4245j1599j5096J6141L380j4788O935Q752j2723j189J3050m616r181O648
780d1M094m581k60K83m73L630j412m674M165J800n380L413L253q675K186J0730
796H058r138q125J4694J175j6007P946J1716j5421k430J8522r045j5077J8479
809E347O147k2637N428J9456j5617j0400K0816j857j9300J2933J1612j9241q66
822h179J9333r205j3220J5328M002j5634N059J0881j0453l833J1057k664p763
$$ plain form
726 2880 3538 -4420 -4534 5029 2201 -4110 1314 39 -4759 5802 5877 -11464 -3609 15399 -887
741 -887 -14390 6635 9219 -10241 -382 10445 -9288 -6787 16163 -268 -18613 7518 14825
754 14825 -13058 -6795 14208 -2995 -10583 11476 3583 -15341 4966 14808 -11333 -9618 14245
767 14245 2646 -12450 3691 7071 -7717 -782 7970 -4753 -5942 7108 2492 -6689 -41
780 -41 4053 -528 -788 -505 -978 2652 1240 -3434 731 2531 -2849 564 3817 -4858 -2672 8058
796 8058 -1080 -9205 5489 6664 -9343 -1397 10319 -5102 -7532 10990 1945 -13132 5347
809 5347 11494 -11143 -5715 13741 -1876 -12276 8540 6683 -12617 316 11928 -7313 -8179
822 -8179 11154 1949 -11271 4057 8059 -7575 -2516 8365 -2088 -5921 5136 2472 -5291
835e291O282K336o165K020L003l585Q66J923l046J683K114m512J531N090n992
850a743k214Q917l247q130Q976L187j2348M292J1341j2035n582J6472l313j5822
864a1249J2205R765j7631j00J7696r933j1896J7066K473j8646P567J4369j4722
877c036n978J6497l287j3132J0321N756j2967K321J0932q565n555J0812l54q831
891e066M591M425n648K57M016l152q21L171j830q56J957j913L04L210m210j874
907c439P445j925q154O719N369j0271N09J0788p449o911J2703n1j4140Q096J0783
922A0072j4265l831J6331m894j3099J1924N618j5160L528J3253j1201p234J5085
935F127n72j4007P654Q742j1100j571J0599n145o428Q813Q77r089L756O294n946
$$ plain form
835 -5291 991 3327 -2838 -818 2185 -1400 -534 1389 -1657 26 2140 -2372 -841 4249 -1743
850 -1743 -3957 4960 1713 -6417 2559 5746 -6602 -2310 9031 -3004 -8586 7886 4573 -11249
864 -11249 956 10721 -6910 -7010 10686 753 -11143 5923 8396 -10250 -2683 11686 -3036
877 -3036 -9014 7483 4196 -8936 1385 7141 -5826 -3505 7427 -1138 -6693 4119 3765 -5066
891 -5066 -475 3950 -1698 -1441 2575 -577 -1398 1773 -57 -913 1044 -869 -565 2645 -1565 -3439
907 -3439 4006 2081 -6073 646 6015 -4256 -3747 7041 -408 -7319 5384 5333 -8807 -711 10072
922 10072 -4193 -8024 8307 3413 -9686 2238 7856 -7304 -3776 9477 -1724 -8958 6127
935 6127 5555 -8452 -798 7944 -3156 -4727 5872 727 -5701 3112 3989 -5100 -1344 4950 -996
950i96k485N294p57k562J771m41o30K221j450j483K912j101k183M178p10o050
966d472N107N273r234j821J0935l498r252Q394M009j0862L262R568j0058m592
980g241J4050k157j3698Q687R014j2297j670J2005o068p562J1243O99j2740O133
994a602J0259j0686n289J1496l75q686M667L725o359J623N545n153l111O157P89
1009C000m788K91K057N57k6k390q82M002K7m081J770J847l204K189L048o525p08
1026c816R653l079r847O990O774r168j223Q410n135m479J0017j746j1848Q015
1040d82R783j2248m763J2869j560r524O940L317r441L843Q877r630n468J2220
1054D733J077j1210K611P204m441j931L899k800j879N473m95n900J870M510j284
$$ plain form
950 -996 -3481 1813 1056 -1506 265 -176 -806 1415 -35 -1518 1394 293 -1890 2288 1578 -4472
966 -4472 635 5908 -3326 -5147 5788 2290 -6962 1432 5441 -5421 -2159 7409 -2649 -7241
980 -7241 6809 4652 -9046 -359 8655 -3642 -5312 6693 625 -6937 4306 5005 -7735 -1602
994 -1602 8657 -2029 -7318 4178 3803 -4883 -216 3509 -2850 -1227 4318 -835 -3946 2211 3000
1009 3000 -1788 -1497 560 1117 1091 -1299 -2181 1821 1848 -2233 -463 1384 -1820 369 3417 -3108 -3816
1026 -3816 5837 2758 -7089 -99 6675 -2493 -3716 4694 -441 -4920 5097 3351 -8497 -482
1040 -482 9301 -2947 -7710 5159 3599 -5925 1015 4332 -5109 -1266 7611 -2019 -7487 4733
1054 4733 5810 -5400 -2789 4415 -26 -1957 1942 -858 -2737 2736 2241 -3659 -1789 2721 1437
1069A437k565p56J282L389j038m936J702M559k412j969K000j889j83N588l325
1084H84p408O829O750r352l460R326j234o283N842P57q325N835P927j1073m951
1099g936J3549J69j2167M256P415o907q69O781n624m251R921O29j1245K895R336
1114E952m632n381M362R13k140K729p92m512L001M599l602l881K469K838k6k561
1130f64k422K788L640l107l062K913Q22j218J913j693l933N497M252q562k651
1145e487R831m80q418L649M287n908J566N838p368l531J1183j0j2141M016R539
1160F566o297m580O577j280m326O256M81q838L256Q740n910o257O172K726m449
1175a163N64J338k770J976L319m047k691M372K003k996j731Q19K332R86l266j775
$$ plain form
1069 1437 -1128 -1884 -602 2787 1749 -3187 -1485 3074 662 -1307 693 -1196 -1379 4209 884
1084 884 -6524 305 7055 -2297 -5757 3569 2335 -3948 1894 2651 -5674 161 8088 -2985 -7936
1099 -7936 5613 5782 -6385 -2129 5286 -1621 -2490 4291 -1333 -5584 4337 4966 -6279 -3384 5952
1114 5952 1320 -4061 301 1214 -926 1803 1011 -3501 -500 4099 497 -3384 -915 1923 1897 -664
1130 -664 -3086 -298 3342 235 -2827 86 908 -310 1603 -90 -4023 1474 5726 -2836 -5487
1145 -5487 4344 3864 -4554 -905 3382 -2526 -960 4878 -2490 -6021 5162 5152 -6989 -2973 6566
1160 6566 269 -4311 2266 986 -3340 2916 3397 -5441 -2185 6555 645 -5612 560 3286 -1163
1175 -1163 -599 739 -2031 -55 3264 -783 -3474 898 2901 -95 -1826 -1007 1325 2311 -955 -2730
1191b730L872J107l436M80J304k121K047K622n592j813Q352l72q843L077O882
1206D836n089k602N599k719l886P119O39r472L138R015o301o005P448J464o177
1221b993K924K972o076J240O903m681n627O568L140o262l78M179j547j293K207
1236A276j476j813L062R19l216n66K237R41q72k024J02L187o6l691J082K870k223
1253b71o47K755k391k128N331M7o880K678O314n196l759O290j60n470M252K651
1269C416o922J273P450n036n612P552K136p669J719N630m825k049O139k035n527
1284d360N157L133o326n11N749j750l666K957J054k634J051J636k138m59K141
1299A034k42j422J00N97Q28n33j688J087J722j924j026K688p75k410K835R17m150
$$ plain form
1191 -2730 1142 2249 -1187 -707 597 -1524 523 3145 -2447 -4260 4092 3720 -5123 -2046 4836
1206 4836 -253 -2855 2744 25 -3861 3258 3897 -5575 -2437 6578 277 -5728 1720 3184 -2993
1221 -2993 -69 2903 -3173 -1933 4970 289 -5338 1230 4370 -1892 -2270 1909 362 -931 1276
1236 1276 -200 -2013 1049 1968 -1248 -1814 423 1364 492 -1532 -1430 1757 1691 -2000 -918 1952 -271
1253 -271 -918 1837 -554 -2682 2649 2696 -4184 -1506 4808 -388 -4147 2143 1983 -3487 765 3416
1269 3416 -3506 -2233 5217 181 -5431 2121 4257 -3412 -1693 3937 -888 -2937 3202 1167 -4360
1284 -4360 797 3930 -2396 -2907 2842 1092 -2574 383 1437 -1197 -146 1490 -648 -1107 1034
1299 1034 792 -630 -530 67 895 362 -1326 -239 1483 -441 -1467 1221 446 -1964 871 1788 -2362
1316b362J420M316l835k865N563J09n626L031L836n448p61O149k862m928N663
1331A400K112o873J395O065m394l431O005m0n520L023L627m834p55M841j839l456
1347b674L426J386l657N64K566j774j034J823l22j074Q97J69o27M11n2j39O42
1364E31p65n16J729l03k290J715J802l020k98L416j795k752L698P86m619J966
1380g15M042m257k204N683o06n276L384L230n094j91N243k919l742M951J101n392
1396b762J535M320l536k107M060l83l319K458J660l380L23L047j660j858K073
1411D71O10j574J97O32l47P1lm02M91r8m83R16j68j602J452J529k667p04L542
1430A863q18l377K763J784l826M93L800l028k512M827J25n213K298M081m234j672
$$ plain form
1316 -2362 -942 3374 -461 -3326 2237 2346 -3280 -249 3587 -1861 -2622 3527 665 -4263 1400
1331 1400 3512 -3361 -1966 4099 -295 -3726 2279 2239 -3281 -258 3369 -1465 -2220 2621 782 -2674
1347 -2674 752 2138 -1519 -955 1611 -163 -1197 626 304 -770 127 296 -331 80 28 -111 531
1364 531 -234 -750 979 676 -1614 101 1903 -1117 -1415 2001 206 -2546 1152 1938 -2681 -715
1380 -715 3327 -930 -3134 2549 1943 -3333 51 3281 -1813 -2004 3239 320 -3422 1529 2630 -2762
1396 -2762 -1227 3093 -443 -2550 1510 1127 -2192 266 1926 -1454 -1131 1916 256 -1602 471
1411 471 1081 -493 -296 336 -11 60 57 -345 146 48 -435 481 313 -1289 163 1692 -975 -1679 1863
1430 1863 1045 -2332 431 2215 -1611 -1118 2682 -346 -2858 1969 2094 -3119 -821 3260 -974 -2646
1446b646M871j223l893L631J760m713R17M438l122k927M327N83m022J472K629
1461B082k736o81K786j066k191K173J028k377Q6J763m86r08L43L21K20j64o25
1478d32M82M73r99L34J063j459m78K395p91k746K229K125l300o36L612j401k624
1495b153L157P06l952J715L454l812j672M811m87m574K648K725l870k61L751k320
1511a34k457M042M78m454J590L518k762j820K991k0k162J454P17k057O48J891
1527A463j509j237J502N75q42l90o1O06O50j039n64J277J64j094O90J23j309J351
1545C56J330k767o11L538o02l357J830K021k628N6K455k248j382L920l79m429
1561b897K229L746l381j965L561k84k568K226O55l266J282L306k859k411L385
$$ plain form
1446 -2646 2225 1002 -2891 740 2500 -2213 -1296 3142 20 -2907 1420 2003 -2019 -547 2082
1461 2082 -654 -1335 1451 385 -1806 367 1395 -982 -896 867 381 -527 -184 137 357 193 -432
1478 -432 50 523 -476 -142 921 -538 -1016 1379 588 -2158 71 2196 -1104 -1740 1872 471 -2153
1495 -2153 1004 1710 -2242 -527 2927 -885 -2557 2254 1767 -2807 -159 2566 -1304 -1565 2186 -134
1511 -134 -2591 1451 1929 -2525 -935 2583 -179 -1999 992 972 -1190 264 981 -1076 -428 1463
1527 1463 -46 -1283 219 794 -48 -438 -499 107 757 -282 -846 431 595 -499 191 314 -995 356
1545 356 1686 -1081 -1692 1846 1244 -2113 -283 1738 -890 -834 1621 -627 -2009 1911 1532 -2897
1561 -2897 -668 3078 -303 -2268 1293 1009 -1559 667 1322 -1944 -662 2644 -215 -2626 759
1576G59J076k843N7J576p90P1Q53j264n60J925J81j694j77J125N05l56j251l0
1594h37J826l0j943L20J222n89L2N69j621p5L119r95l577K060L188k896j667K860
1612I66l55j863K355M1l596K058L614l643k756M346R54l652P45K023k031K93K461
1629A960k429j874L712R19l895Q7K992o87j481O39k11j91J485m95k030P70J979
1646A250o74j355o0R76R67p25j689P27J885p95j314P01J68j89J265q92k309K054
1664iK523l009j982L305O94k643P53J218j924Q99K354k835j969M078R62m205L82
1681a408L112j291j320J608q37j265K577L25l413O22L267j247k307J199J074n66
1697A30J32k16r82J060J198j311j129J011R59k71r51p36J130J350j416j431J598
$$ plain form
1576 759 1835 -1008 -951 625 -165 -94 759 -505 -1065 860 1041 -653 -830 295 800 444 -807 -837
1594 -837 989 959 -984 -664 558 -31 1 570 -1051 -1126 1993 998 -2579 -519 2669 -227 -1894 966
1612 966 611 -1252 1103 1144 -2452 -394 3220 -423 -3179 1167 2121 -1531 -786 1237 -794 -501 1960
1629 1960 -469 -2343 1369 2288 -1607 -1520 1472 785 -696 -57 -268 -459 1026 531 -1499 -729 1250
1646 1250 576 -779 -839 137 1104 379 -1310 -583 1302 507 -807 -106 62 -127 1138 246 -2063 -9
1664 -9 2514 -495 -2477 828 1522 -1121 -368 850 -1074 -175 2179 -656 -2625 1453 2415 -1790 -1408
1681 -1408 1704 413 -907 701 -136 -1401 1176 1501 -1912 -1290 1977 730 -1577 -378 696 130
1697 130 262 46 -936 124 1322 11 -1118 -107 852 581 -370 -1106 24 1374 -42 -1473 125
1714A25P95j176J16M01j151J006J688k415j480L311P33l467M12K533j380r32J913
1731A032j192j599K889O56l837O24L649j645k510K222P35j914J060R32k318M26
1747g90K706j525k324J975J599j899n35J110m05k4O88q02n99J120M72r57m03M55
1765a38O69P7r69n12J376M35j522Q6J051o67k43J083j037q99K096K71k707Q08
1783g42K322j601j326K002Mj815J506R64k543L84K804j734k195K477R38k500M19
1800f36J806j540n54K008p62j795J753J008k020n2J592n15p92P73m8n88O11P8
1818C27p23K15N16l49q5K2j81M73J70r02J79J152p77q24J229J20j336Q63R03j716
1838g24P2J918j180j572K130M58k368Q16J844j740q69K289n56j961J733J115k462
$$ plain form
1714 125 920 -256 -140 261 -890 116 1804 -611 -2091 1220 1953 -1514 -1102 1431 51 -881 1032
1731 1032 -160 -1759 1130 1786 -2051 -1427 2222 577 -1933 289 1024 -890 170 1102 -1216 -790
1747 -790 1916 391 -1933 42 1641 -258 -793 317 -88 -112 576 -226 -825 295 767 -190 -593 -138
1765 -138 531 608 -361 -873 503 938 -584 -498 553 -114 -357 726 -311 -1210 886 1157 -1550 -742
1783 -742 1580 -21 -1347 655 659 -1156 350 1314 -1229 -845 1959 225 -1970 507 1445 -1055 -636
1800 -636 1170 -370 -924 1084 322 -1473 280 1288 -732 -784 808 293 -499 274 226 -362 249 327
1818 327 -396 -181 335 -14 -99 -77 -258 215 385 -517 -338 814 37 -787 442 562 -774 89 992 -724
1838 -724 -652 1266 86 -1486 644 1102 -1266 -450 1394 -346 -1215 1074 518 -1443 290 1405 -1057
1855a057J96K315j266j611J916M88j868O37J166j284l13J458n99j086J022O42
1871G56j161m1Q08k29k59J82j61J12L00m15J6L05l24J02M52o72l89J263j68j523
1891a046Q44J284j379n73J627m95j289J528N53k236O45K166j752j443K316K96
1907A046k199R64J293j760j28K066j236j630K140P08k303L08J830j056q83J319
1923D79n8j144J036M66j340l5J289m22q18L61M48k22Qk42n0M61k2m18K36K3k20
1944a84O48k50r77P82J073j341p27J629p3j455P94R07j566K71J624j348j223K179
1962G63L28k317O56J914j437q25J782m82j492J544O78k147L27J967j191j327J577
1979C18M40j467N07Q26r99p9J107n05q92Q92M32p51j06M28n8N6j34l14L75J59
$$ plain form
1855 -1057 -861 1454 188 -1423 493 981 -887 -250 916 -368 -681 777 178 -908 114 756
1871 756 -405 -446 362 133 -126 56 -105 7 307 -108 -92 213 -111 -9 443 -229 -618 645 477 -1046
1891 -1046 -202 1082 -297 -870 757 262 -1027 501 1054 -1182 -537 1629 -123 -1566 750 1046
1907 1046 -1153 -189 1104 -656 -784 1282 46 -1584 556 1264 -1039 -731 1099 43 -840 479
1923 479 421 -723 313 779 -561 -596 693 271 -547 -186 262 40 48 -194 -244 217 195 -223 13 36 -184
1944 -184 464 214 -763 19 1092 -249 -976 653 580 -875 -81 826 -740 -469 1155 -193 -1416 763
1962 763 1091 -1226 -570 1344 -93 -918 864 382 -1110 434 1112 -1035 -708 1259 68 -1259 318
1979 318 758 -709 -202 624 -375 -454 653 148 -744 148 580 -171 -277 151 93 149 15 -299 76 235
1999B35m27P4L02m01R8N39o27m26J232lj430O47J169j230m50J421m49j123J254
2018D05M61j867N16J762j399j128J834J65j705O75J153j322j59J477p75j144J480
2035D29M77j638K96J274p70n63P56r5n24M88J35p12K71N39l62k90K00J34J33o
2055A72n61L05P32n89o29Q17J66p36M56K81j047M79J123j242q48J759J56j705
2073i11O11J077j060k22J406r05j033J729L61k116M42J869j055j120J270J15j019
2090e61P47L72j286K53J438q69j062J027O61p89j83K70q8K43J99o10j12N67J72
2109C89m21l22P2N41K92q90l68J073K28j019O0P18m01k7O76r57l72J602n7k010
2129a193O75J741j176r12J153n1q77J090K01j732O71J893j346j559J669P49j440
$$ plain form
1999 235 -192 -118 184 -217 -119 420 -207 -633 599 596 -834 -187 982 -248 -698 723 274 -849 405
2018 405 866 -1001 -485 1277 -122 -1250 584 749 -956 -281 872 -450 -609 868 93 -1051 429
2035 429 906 -732 -436 838 68 -495 261 166 -358 130 265 -447 -176 363 1 -289 -89 45 178 172
2055 172 -389 -84 648 59 -570 247 413 -323 133 414 -633 -154 969 -273 -1121 638 794 -911
2073 -911 -300 777 -283 -505 901 -4 -1037 692 1053 -1063 -621 1248 193 -927 343 458 -561
2090 -561 186 558 -728 -475 963 94 -968 59 720 -69 -252 18 -70 173 372 -238 -350 217 389
2109 389 -32 -354 -282 259 551 -339 -707 366 594 -425 -365 353 -48 -75 601 -356 -728 874 817 -1193
2129 -1193 -518 1223 47 -865 288 237 -640 450 651 -1081 -410 1483 137 -1422 247 996 -444
2146d44J36P71p50O9J147r40j081J466P04j529l25J097j1m06K0k75J09P32j30
2165C60r16R8R07l0n04l25K30Q20j91j085K02J042l60o43L77o7j66Q12k35j361
2185a035P24J548j229j173J366N98j168K78M94r62M75J220j260j232J891O28j884
2202g21m0J368n19m98P39m38o51J265L23j587J40J417l37r28K57M45j92K41k76
2221Hn17N07N71n82m78L68L56J09l46n52M32Q34o04q30P81M06n62J26J81p35M70
2242e7R90j070r90J518O47j625m0J261o08l61Q46n47p97J286N08j723Q5J658n95
2261C86j100Q76K47p96N23L68j041R9J211n20j088P69O45o33j80J92j00K37K29
2280C24n12j63O35n2k73p1k7J56L04l76m78O77L49q24jO72m02k56P22l94p16J012
$$ plain form
2146 -444 -308 463 -287 -218 929 -11 -1092 374 1078 -451 -776 321 310 -96 -76 -351 -242 490 360
2165 360 -556 -458 449 419 -85 -410 -180 640 449 -636 -434 608 248 -395 -18 -85 -251 561 326 -1035
2185 -1035 -311 1237 8 -1165 201 799 -369 -91 403 -559 -84 1136 -124 -1356 535 1163 -721
2202 -721 -761 607 88 -410 329 -109 -760 505 828 -759 -619 798 461 -467 -210 235 43 284 8
2221 8 -509 -2 569 -13 -491 -123 233 342 -4 -556 -124 710 106 -724 57 463 -99 27 208 -527 -57
2242 -57 933 -137 -1127 391 1038 -587 -627 634 26 -335 511 -36 -833 453 961 -762 -677 981 386
2261 386 -714 162 409 -387 136 504 -537 -438 773 253 -835 -66 579 -54 -234 -42 -142 95 324
2280 324 -188 -351 284 232 -41 -112 -139 17 321 -55 -533 144 493 -331 -332 340 -62 -318 404 10 -706 306
2302C06M26j349J42J405p66r17J004K07r90N20O31j117j15J385n44j158J025N96
2320F91j147J47P88o13l35Q84j64q33P28M54q25j31O69j89l56K51q5p0K02l7k21
2341a92J96L3j34J77m2j85K98J70o13J33O57n05m23O57R1q43N27M90q82Q4R31
2362F25o79p64J185K57j314L64J115r61m15J101k54q64Q19M05j199K07J079p61
2380e4o42R56J20p90L73L75o54J01O67m71m17O55J53o05J72J99j80J52o8k31J69
2401b0L26m19j06L17j59j50M67l18m27P24K23r39J53Q28m37m98O94o7o34P05J74
2422D37j013L22R86q02p33R98K80r53M02M99p53P9Q36o31o19R94K24q89L4O28
2442C26l34j22K87k42k36N66j17n65L54L00k20p6R0j87K96J63n06o6O19j13n02
$$ plain form
2302 306 732 -617 -475 930 164 -753 251 458 -532 -12 619 -498 -613 772 228 -930 95 691
2320 691 -456 -309 479 -134 -469 415 251 -582 146 600 -225 -356 313 124 -232 19 -66 -136 66 29 -192
2341 -192 4 37 -97 80 38 -147 151 321 -292 -159 498 -7 -430 227 318 -525 2 492 -390 -306 625
2362 625 -54 -818 367 624 -690 -326 789 -172 -587 514 260 -604 215 620 -579 -372 707 -54
2380 -54 -696 260 380 -410 -37 338 -316 -215 452 -19 -436 219 372 -233 -61 138 -42 110 42 -189 -20
2401 -20 306 -113 -219 98 -61 -211 256 -62 -489 235 458 -481 -328 500 63 -435 259 192 -442 263 437
2422 437 -576 -254 732 -70 -803 195 475 -478 -76 423 -330 -251 585 -46 -665 329 553 -336 -302 326
2442 326 -8 -130 157 -85 -321 245 128 -437 -83 217 -3 -79 11 -176 120 283 -223 -289 330 217 -285
2463b85M04K4l88M42J60q41J98R43n99p68R37K68q94K33N50o55nR37o51p27R72
2484B55L70j049N3R14n16l95P29k67o86Q05K41j028J71R32m01n47M93J31l49K41
2504I7L2l65K17L72m13j67L49n0o9M1j69jL97j95m68M06J85l84J66K10l94M8O76
2527E21n26n67R34J91j049K50P88o43l25Q29l04p22Q51K61j128L02R70o28n81
2546e76R19K1q40N37M58q24LR01n52o02P74K30q13K08M26l66n9L28j98k08L84
2567A51o2l32L40O8k15J08l1j61K69J15m91J21M12l24k88N22j45m61N42J69p37
2588d30K87P32p04m77R67K8q73N55L88p28O6O94n58n59R10J23r82L77P10o72k10
2609c56O77l28l82O59K9p35L55O47o49k64N75r1k68J97j22j36M01r6l09R1K87
$$ plain form
2463 -285 119 143 -245 197 357 -484 -286 657 58 -710 227 495 -399 -166 384 -271 -276 661 10 -717 255
2484 255 625 -424 -371 543 27 -368 361 94 -592 213 454 -574 -403 529 128 -419 74 205 -144 97
2504 97 129 -236 -19 353 -60 -227 122 72 3 44 -125 -126 271 76 -392 14 199 -185 -19 191 -203 -155 521
2527 521 -5 -572 362 553 -496 -246 542 -101 -426 403 99 -623 228 489 -639 -337 633 5 -576
2546 -576 343 364 -476 61 519 -305 -302 599 47 -555 219 449 -364 -156 270 -96 -155 173 -25 -233 151
2567 151 89 -243 97 165 -50 58 27 -134 135 250 -241 -120 292 -32 -320 202 57 -404 138 307 -430
2588 -430 -143 589 -115 -592 375 403 -470 85 473 -255 -189 505 -53 -612 298 421 -561 -184 526 -146 -356
2609 -356 321 -7 -389 270 299 -436 -81 566 -83 -347 228 137 -131 66 -56 -192 209 113 -196 -105 182
2630A82j97l7J27k41R0M69m30m03O72J46o20J12M22m13l1N71n79k86Q43O4j023
2651e62L51P79o62l25O72j29n01P01N6q98L72Q30o57n61P05R4n17K34J97m47K70
2672BM49o31k92P43K4m39N6J49r9J88j04k93K45L57l52j67K99j29k5K26l18k60
2694c71O90P4q44Q7Q55m58l66M87j03m02O36M1q45L04R09p39n78Q64J32p51L71
2715gK75o61K07Q07o74n79R17J33p36J08N08l35n3L40l54k32O36j1o64K33M77
2736C35l48j52R7n7J31K09l18j69M24O6l44J11N6j06K90m1n04K06O00m46m22N70
2758A88K0m69K87K24n78K44O03o59m00P99J60q40K70N29n42k0O07m93l16P04J07
2779D25r02L04N69l80l31M35j15k53L93nn00L78L32m79q1L46o3q9J61j88j22L49
$$ plain form
2630 182 -15 -52 75 -166 -76 393 -37 -440 232 378 -242 -130 292 -121 -152 419 -160 -446 397 461 -562
2651 -562 -211 568 -94 -419 253 124 -377 324 380 -518 -146 684 27 -534 171 265 -252 -18 179 -268 2
2672 2 451 -180 -472 271 295 -144 -88 61 -38 150 46 -247 -2 355 3 -164 135 6 -19 207 -111 -371
2694 -371 319 393 -451 -364 491 33 -333 154 51 -351 285 326 -519 -215 694 -45 -623 241 373 -378 -7
2715 -7 268 -393 -186 621 -53 -632 285 418 -318 -210 298 -37 -90 250 -104 -336 300 289 -375 -142 335
2736 335 -13 -165 -68 -125 6 215 -103 -272 152 218 -126 -15 41 -65 225 184 -320 -114 486 40 -382 188
2758 188 208 -261 26 250 -328 -84 519 -140 -540 259 419 -421 -151 378 -164 -184 423 -70 -386 318 425
2779 425 -477 -173 396 16 -315 120 5 -248 145 140 -360 18 350 -129 -210 136 73 -16 145 -43 -165 184
2801A84N1n02K35K46k90l0K23k43mM08l05l56N61J42o54J80N29m73j66N82k65
2822E3m66O30J63o94J04O40m68k97N90j27n11M95J74o32K26N46m91k52M91L1m65
2843b60K54K30l66J32K20l42l8L98j68k25K40m1j29J44J4k66K49K30m83M2M03
2864B38j82k56L61j14l15L39J79n65J76M66m36l11O70j14m88L79K82n70J48N66
2884D53n17l32P08o8o25L55M22n62l5N64l62l20O07m8o76L57L85m61r5M24j77
2905cj65L10o5l07L12P7l36N8K80j50J6j1j34kL02k42k72M56L2l35J49K15l13
2928a28P7L64m44j40N69l8p03M06L77m76l3M37l45k79O18n7o61M03M64n51j94
2949c34N90j91l15M50j19m22M10K90n18p5M78j59l36L25L5k11J26R7m06J82L38
$$ plain form
2801 184 235 -267 -32 214 -76 -106 117 -126 -130 278 -27 -383 178 320 -334 -154 375 -98 -264 318 53
2822 53 -413 217 380 -314 -210 430 -38 -335 255 128 -383 112 286 -346 -120 426 -65 -317 174 205 -260
2843 -260 -6 224 -142 -10 210 -132 -170 228 60 -165 75 34 -95 49 63 -203 46 276 -207 -165 238
2864 238 56 -200 161 47 -268 71 250 -315 -139 327 -109 -420 250 136 -352 27 309 -261 -113 453
2884 453 -64 -396 312 244 -381 -26 396 -166 -201 363 1 -319 288 240 -436 -79 306 -155 -250 174 -3
2905 -3 -168 142 77 -230 82 159 -177 -119 161 11 27 16 -118 -120 182 -60 -332 124 156 -179 -30 185 -128
2928 -128 -51 313 -131 -271 298 260 -443 -37 340 -136 -169 268 -77 -356 262 205 -456 -53 411 -140 -334
2949 -334 256 65 -250 200 81 -341 69 359 -159 -234 244 85 -251 74 109 -102 24 121 -285 -103 235
2970B35k45j94K54m2p2J78j00k49L33J61n11J49M24l70j33L57j87k93N11l6n84
2991d14L21M67m25k69N75j31l19L86L3n08K23N21n88l02O65j2n32K70K87m59J65
3012d6K75l91m9M71j21m17L02K06k85L9J50j98K9K84k37k36K94Pk22J33k5r4K30
3035I9L8l69J18N02m43k27M19Rl57L52N2m87K58M12n13j70N59p5n10L48K29n03
3057b59J56M21l62l43O63no22L53L26m04r1M11j95l13M26o6l65K21K85l59m7L65
3079A96k14j09J94o3j41K34M3k45J45J73k78O9J08j35m5K74k17j87L51n0l64K52
3101iK63l45p4M44k86k15M47rn48L18L78n57j5M51k49k54M05M6m94K64L43m96
3123a92j15N80k18l42L02J29l36J68K60l48L2L39k22k42L15Kk24J53R3k95J14
$$ plain form
2970 235 -10 -204 50 8 -64 114 14 -235 98 259 -252 -103 321 -49 -182 175 -12 -305 206 170 -414
2991 -414 -93 374 -51 -320 255 124 -195 191 224 -284 -61 460 -128 -430 235 223 -309 -39 248 -211 -46
3012 -46 229 -162 -211 260 139 -278 24 230 -55 -16 134 -64 -35 249 12 -224 70 77 -145 -12 -37 -131 99
3035 99 137 -232 -114 388 -55 -282 137 146 -211 141 193 -294 -36 376 -137 -307 252 177 -333 15 244 -259
3057 -259 -103 318 -44 -387 276 271 -351 2 328 -76 -167 244 49 -264 162 96 -269 -48 237 -122 -169 196
3079 196 -18 -127 67 4 -137 97 140 -105 40 213 -65 4 112 -23 -68 206 -11 -198 153 103 -261 -9
3101 -9 254 -91 -165 279 -7 -222 225 216 -332 -14 364 -193 -208 243 -6 -260 145 191 -303 -39 304 -192
3123 -192 -307 273 55 -287 15 144 -192 -24 236 -112 -80 259 37 -205 110 112 -112 41 134 -161 -47
3144d7J57k34j2K83j13j90K77p1j95K09O8k91J83K32l61j59M60j05l20K41J09
3165A21k92O9L91m14j52N18j28l38K11K36l43O0L02l64m8M75k06l82K70K56l48
3186a06J4K03j45o5K03q8j61K22K5j44k5K03j66O2Q7k69O2L36k31k44L28P2l19
3209a46N8K16k91M8L23k99j86N06q7m50L37K47l82l0L37k68j42M82q0n20K41M11
3231C25m11j38L86j62j82K59R1m18K88J98l55n0L37p3k39K14l2j73K03M4k34O1
3253f1K08j81k0N7o2K5J62j79j07K81O1l28J27K11k34mJ95j90j65L81m7l76K16
3276c0K88l73q1L14j05j85L94j31l26K30L19m51j21M90j33l14L11L5l66K01K51
3297B17l22j26M90j68l21K37O4j51J0J22j44k6K88j52j24J85N9k06L6Q3j01N1
$$ plain form
3144 -47 110 -124 -136 147 34 -156 121 50 -145 64 132 -159 24 256 -105 -264 196 91 -229 12 121
3165 121 -171 -102 289 -125 -277 241 113 -225 -14 222 -121 -61 241 -123 -171 304 98 -284 -14 242 -106
3186 -106 -92 111 -34 -99 104 16 -145 77 102 -42 -67 136 -30 32 119 -150 -88 248 17 -227 101 173 -146
3209 -146 -88 128 -163 -115 208 -91 -277 229 142 -308 29 276 -106 -136 201 -67 -209 273 193 -327 -86 325
3231 325 -86 -224 162 0 -182 77 168 -250 38 236 -119 -169 168 95 -144 70 38 -135 68 112 -122 -61
3253 -61 147 -34 -54 3 -59 -34 128 -51 -158 123 184 -144 -17 194 -40 -44 151 -39 -204 177 130 -246 -30
3276 -30 258 -115 -196 118 13 -172 222 91 -235 -5 314 -137 -258 232 99 -215 96 131 -235 -34 217
3297 217 -105 -231 259 91 -230 7 71 -80 -70 52 -92 -118 170 18 -106 79 138 -68 -32 51 -50 1
3319AQ2j72L7J90j75q4J84k8j74J85K5k45K05J18k51q2L88j40k08K24L8k59J44
3342CK06k88q2L59p2l35K55J25l11R5K62k57l9K20q6k14J84J33k46L0J71j79m6
3365a12K58j77q3J60oj95J70J04k36O9J94k00j7K36j94j85L26Nl67J99K54l34
3387a31N8K38k21r3K96j5l57K30K27l09j27L97j42k23L00j5k88J61K24l82RK54
3409I1Jk82K15J27k37P4J44k70N8J75j25j00K03J0j49J58o7j18J46k7r7mJ62q3
3433Ej30K06o2j20J87K8k63J10K93k92j04K97j18j82L11j15k35K36J75k82k08
3454b63M33p0l03K37Q3k55J47J17k11o0L73j25k99K08J43j66l7J55j46l9K08j03
3476B7k30K72O5k04N7O7p2L6L8j64N3J31l1j75J76jj21R4N3j43Q1J48k80RK74
$$ plain form
3319 1 83 -89 -52 138 -37 -121 63 35 -139 46 71 -174 31 149 -102 -184 204 64 -144 80 118 -141 3
3342 3 209 -79 -161 198 126 -209 46 171 -140 -45 217 -40 -79 141 55 -159 25 158 -88 -58 113 -66 -112
3365 -112 146 -31 -114 46 40 -155 15 119 -117 -48 146 -54 -71 165 -29 -214 112 117 -250 -51 203 -131
3387 -131 -73 165 -56 -149 147 132 -225 5 232 -77 -204 193 51 -172 128 113 -175 -14 210 -172 -163 91
3409 91 92 -190 25 152 -85 -11 133 -137 -79 96 -29 -129 74 84 -65 93 26 -92 54 27 -70 -74 88 5
3433 5 -125 81 19 -101 86 114 -149 -39 254 -38 -142 155 37 -145 166 51 -184 52 227 -55 -263
3454 -263 170 100 -203 34 117 -138 9 126 -85 -145 228 103 -196 12 155 -11 -48 107 -39 -78 130 27
3476 27 -203 69 134 -70 -13 54 -18 18 56 -108 -55 76 45 -130 46 45 -76 18 71 -72 9 157 -123 -114 160
3501A60q3k44J20J51k68R6K32k44l9K91q0l14K83J45k85M0J61j35j01L10j00l13
3523b17K73J31k59p9K56j06j25J84q5j25J66J22k17J3J30o4n4R7j08J8R2qj35
3546a00Q9Q3j94J08O4o1k1J26j06q9K33k4k81J07J78r4j18K21j43q1J61K7k70
3569a85J97J53k64o7K81r1k09K47O3k29J03J44k10mK08l5j95O1J13j36J3P3q1
3592e0M3J00n8j34J74kj16Q9n2n0Q3N6j67L5J61j58q1K06p3j80J85Mj90J46J84
$$ plain form
3501 160 77 -167 -47 104 -164 -68 164 -80 -119 172 92 -222 61 206 -79 -39 122 -13 -114 196 96 -217
3523 -217 56 187 -72 -151 105 -1 -126 58 -27 -152 14 136 -81 -68 62 -2 -56 41 -67 -49 43 35 -100
3546 -100 -11 72 -122 -14 50 -11 -32 94 -12 -101 132 108 -173 -66 112 18 -100 121 -22 -103 58 85 -185
3569 -185 12 165 -99 -166 115 24 -185 62 125 -104 -1 143 -67 -71 137 102 -93 -32 81 -55 -42 31 -50
3592 -50 -7 93 35 -99 75 73 -43 46 -6 -56 27 83 -84 -49 112 -46 -127 79 6 -174 11 15 -175 -29 155
$$ [...]
8191D
##END NTUPLES=NMR FID
##END=
