##TITLE=1H_C6Boc 1.2
 CDCl3
 8 sc, 
 23.12.2022
##JCAMPDX= 6.0         $$ Bruker NMR JCAMP-DX V2.0
##DATA TYPE= NMR FID
##DATA CLASS= NTUPLES
##ORIGIN= UXNMR, Bruker Analytische Messtechnik GmbH
##OWNER= root
$$ XWIN-NMR		Version 3.5
$$ Fri Dec 23 14:39:22 2022 Russian Standard Time (UT+4h)  she@DPX200
##.OBSERVE FREQUENCY= 200.13135
##.OBSERVE NUCLEUS= ^1H
##.DELAY= (6, 6)
##.ACQUISITION MODE= SIMULTANEOUS
##.ACQUISITION SCHEME= undefined
##.AVERAGES= 8
##.DIGITISER RES= 18
##SPECTROMETER/DATA SYSTEM= spect
##.PULSE SEQUENCE= zg30
##.SOLVENT NAME= CDCl3
##.SHIFT REFERENCE= (INTERNAL, CDCl3, 0, 15.7039)
##AUDIT TRAIL= $$ (NUMBER, WHEN, WHO, WHERE, WHAT)
$$ ##TITLE= Audit trail, XWIN-NMR		Version 3.5
$$ ##JCAMPDX= 5.01
$$ ##ORIGIN= Bruker BioSpin GmbH
$$ ##OWNER= she
$$ F:/spectra/data/she/nmr/H-F/1/audita.txt
$$ ##AUDIT TRAIL=  $$ (NUMBER, WHEN, WHO, WHERE, WHAT)
(   1,<2022-12-23 14:37:57.87 +0400>,<she>,<DPX200>,
      <created by zg, POWCHK disabled, PULCHK disabled
       configuration hash MD5:
       00 E9 B6 7A A2 85 ED C7 34 08 36 98 17 FE 4E 26
       data hash MD5: 16K
       CE EC 70 47 87 9E F2 50 0A 28 48 6E 91 08 51 A3>)
$$ ##END=
$$ 
$$ hash MD5
$$ 35 29 6B 0D CC 52 64 A0 48 67 0C DA 34 DB 9E 96
##$RELAX= 
##$RELAX= 
##$RELAX= 
##$RELAX= 
##$RELAX= 
##$RELAX= 
$$ Bruker specific parameters
$$ --------------------------
##$DU= <F:/spectra>
##$EXPNO= 1
##$NAME= <H-F>
##$PROCNO= 1
##$TYPE= <nmr>
##$USER= <she>
##$AMP= (0..31)
100 100 100 100 100 100 100 100 100 100 100 100 100 100 100 100 100 100 
100 100 100 100 100 100 100 100 100 100 100 100 100 100 
##$AQSEQ= 0
##$AQ_mod= 1
##$AUNM= <au_zg>
##$AUTOPOS= <>
##$BF1= 200.13
##$BF2= 200.13
##$BF3= 200.13
##$BF4= 200.13
##$BF5= 200.13
##$BF6= 200.13
##$BF7= 200.13
##$BF8= 200.13
##$BYTORDA= 1
##$CFDGTYP= 0
##$CFRGTYP= 5
##$CHEMSTR= <none>
##$CNST= (0..31)
1 1 145 1 1 1 1 1 1 1 1 1 1 1 1 1 1 1 1 1 1 1 1 1 1 1 1 1 1 1 1 1 
##$CPDPRG= <>
##$CPDPRG1= <>
##$CPDPRG2= <>
##$CPDPRG3= <>
##$CPDPRG4= <mlev>
##$CPDPRG5= <mlev>
##$CPDPRG6= <mlev>
##$CPDPRG7= <mlev>
##$CPDPRG8= <mlev>
##$CPDPRGB= <>
##$CPDPRGT= <>
##$D= (0..31)
0 1.2 0 0 0 0 0 0 0 0.06 0 0.03 0 0 0 0 0.0002 0 0 0 0 0 0 0 0 0 0 0 0 
0 0 0 
##$DATE= 1671791877
##$DBL= (0..7)
120 120 120 120 120 120 120 120 
##$DBP= (0..7)
150 150 150 150 150 150 150 150 
##$DBP07= 0
##$DBPNAM0= <>
##$DBPNAM1= <>
##$DBPNAM2= <>
##$DBPNAM3= <>
##$DBPNAM4= <>
##$DBPNAM5= <>
##$DBPNAM6= <>
##$DBPNAM7= <>
##$DBPOAL= (0..7)
0.5 0.5 0.5 0.5 0.5 0.5 0.5 0.5 
##$DBPOFFS= (0..7)
0 0 0 0 0 0 0 0 
##$DE= 6
##$DECBNUC= <off>
##$DECIM= 32
##$DECNUC= <off>
##$DECSTAT= 4
##$DIGMOD= 1
##$DIGTYP= 9
##$DL= (0..7)
0 120 120 120 120 120 120 120 
##$DP= (0..7)
150 150 150 150 150 150 150 150 
##$DP07= 0
##$DPNAME0= <>
##$DPNAME1= <>
##$DPNAME2= <>
##$DPNAME3= <>
##$DPNAME4= <>
##$DPNAME5= <>
##$DPNAME6= <>
##$DPNAME7= <>
##$DPOAL= (0..7)
0.5 0.5 0.5 0.5 0.5 0.5 0.5 0.5 
##$DPOFFS= (0..7)
0 0 0 0 0 0 0 0 
##$DQDMODE= 0
##$DR= 18
##$DS= 0
##$DSLIST= <SSSSSSSSSSSSSSS>
$$ [...]
##$SUBNAM2= <"">
##$SUBNAM3= <"">
##$SUBNAM4= <"">
##$SUBNAM5= <"">
##$SUBNAM6= <"">
##$SUBNAM7= <"">
##$SUBNAM8= <"">
##$SUBNAM9= <"">
##$SW= 18.05172834244
##$SWIBOX= (0..15)
0 0 2 0 0 0 0 0 0 0 0 0 0 0 0 0 
##$SW_h= 3612.71676300578
##$TD= 16384
##$TD0= 1
##$TE= 0
##$TE2= 300
##$TE3= 300
##$TEG= 300
##$TL= (0..7)
0 120 120 120 120 120 120 120 
##$TP= (0..7)
150 150 150 150 150 150 150 150 
##$TP07= 0
##$TPNAME0= <>
##$TPNAME1= <>
##$TPNAME2= <>
##$TPNAME3= <>
##$TPNAME4= <>
##$TPNAME5= <>
##$TPNAME6= <>
##$TPNAME7= <>
##$TPOAL= (0..7)
0.5 0.5 0.5 0.5 0.5 0.5 0.5 0.5 
##$TPOFFS= (0..7)
0 0 0 0 0 0 0 0 
##$TUNHIN= 0
##$TUNHOUT= 0
##$TUNXOUT= 0
##$USERA1= <user>
##$USERA2= <user>
##$USERA3= <user>
##$USERA4= <user>
##$USERA5= <user>
##$V9= 5
##$VALIST= <valist>
##$VCLIST= <CCCCCCCCCCCCCCC>
##$VD= 0
##$VDLIST= <DDDDDDDDDDDDDDD>
##$VPLIST= <PPPPPPPPPPPPPPP>
##$VTLIST= <TTTTTTTTTTTTTTT>
##$WBST= 1024
##$WBSW= 4
##$XGAIN= (0..3)
0 0 0 0 
##$XL= 0
##$YL= 0
##$YMAX_a= 802342
##$YMIN_a= -920472
##$ZGOPTNS= <>
##$ZL1= 120
##$ZL2= 120
##$ZL3= 120
##$ZL4= 120
##$ABSF1= 10
##$ABSF2= 0
##$ABSG= 5
##$ABSL= 3
##$ALPHA= 0
##$AQORDER= 0
##$ASSFAC= 0
##$ASSFACI= 0
##$ASSFACX= 0
##$ASSWID= 0
##$AUNMP= <proc_1d>
##$AZFE= 0.1
##$AZFW= 0.1
##$BCFW= 1
##$BC_mod= 2
##$BYTORDP= 1
##$COROFFS= 0
##$CY= 11.3945322036743
##$DATMOD= 1
##$DC= 2
##$DFILT= <>
##$DTYPP= 0
##$F1P= 2.36226072786647
##$F2P= -0.459571619588291
##$FCOR= 0.5
##$FTSIZE= 0
##$FT_mod= 4
##$GAMMA= 1
##$GB= 0.15
##$INTBC= 1
##$INTSCL= 1
##$ISEN= 128
##$LB= 0.24
##$LEV0= 0
##$LPBIN= 0
##$MAXI= 10000
##$MC2= 0
##$MEAN= 0
##$ME_mod= 0
##$MI= 1.114404
##$NCOEF= 0
##$NC_proc= 0
##$NLEV= 6
##$NOISF1= 3.799351
##$NOISF2= 2.8
##$NSP= 1
##$NTH_PI= 0
##$NZP= 0
##$OFFSET= 15.70392
##$PC= 1
##$PHC0= -19110.13
##$PHC1= 11.20073
##$PH_mod= 1
##$PKNL= yes
##$PPARMOD= 0
##$PSCAL= 0
##$PSIGN= 0
##$REVERSE= no
##$SF= 200.130013532006
##$SI= 16384
##$SIGF1= 3
##$SIGF2= 2
##$SINO= 400
##$SIOLD= 16384
##$SREGLST= <1H.CDCl3>
##$SSB= 0
##$STSI= 0
##$STSR= 0
##$SW_p= 3612.71676300578
##$SYMM= 0
##$S_DEV= 0
##$TDeff= 0
##$TDoff= 0
##$TI= <>
##$TILT= no
##$TM1= 0
##$TM2= 0
##$TOPLEV= 0
##$USERP1= <user>
##$USERP2= <user>
##$USERP3= <user>
##$USERP4= <user>
##$USERP5= <user>
##$WDW= 1
##$XDIM= 8192
##$YMAX_p= 0
##$YMIN_p= 0
$$ End of Bruker specific parameters
$$ ---------------------------------
##NTUPLES= NMR FID
##VAR_NAME=  TIME,          FID/REAL,        FID/IMAG
##SYMBOL=    X,             R,               I
##VAR_TYPE=  INDEPENDENT,   DEPENDENT,       DEPENDENT
##VAR_FORM=  AFFN,          ASDF,            ASDF
##VAR_DIM=   8192,          8192,            8192
##UNITS=     SECONDS,       ARBITRARY UNITS, ARBITRARY UNITS
##FACTOR=    0.0002768,     1,               1
##FIRST=     0,             0,               0
##LAST=      2.2672688,     0,               0
##MIN=       0,             -920472,         0
##MAX=       2.2672688,     802342,          0
$$ Real data points
##PAGE= N=1
##DATA TABLE= (X++(R..R)), XYDATA
0 0 0 0 0 0 0 0 0 8 -8 8 -8 16 -24 32 -32 40 -56 72 -88 104 -120 147 -176 208 -240 282 -330 384 -442 506
30 506 -578 662 -753 853 -961 1083 -1219 1368 -1527 1703 -1898 2110 -2340 2594 -2867 3168
46 3168 -3500 3859 -4250 4681 -5157 5684 -6262 6908 -7631 8444 -9370 10428 -11653
59 -11653 13094 -14820 16922 -19552 22952 -27538 34088 -44250 62215 -103250 390084 -332464
71 -332464 -779702 723635 138141 -678071 286422 463590 -667558 33494 802342 -382911
81 -382911 -687969 608055 253190 -674256 142660 565052 -436160 -230880 576692 -105631
91 -105631 -572336 326071 315686 -449686 22437 497549 -296758 -371007 480001 152124
101 152124 -574276 47745 489108 -190240 -225901 326115 -65698 -349894 320694 233714
111 233714 -522765 -55242 587999 -109214 -449645 262136 179519 -354469 88664 284410
121 284410 -335973 -106770 482482 -88753 -451542 252685 252594 -369822 -17278 363147 -178979
132 -178979 -216067 322123 40989 -334277 113046 211199 -228116 -27539 290131 -112762
142 -112762 -247857 212901 153504 -259102 -71836 212324 -10613 -107044 96067 386
152 386 -155992 84083 158416 -178774 -146956 237069 107830 -232685 -17920 179905 -96033
163 -96033 -93688 174091 -32426 -189951 179639 156996 -266043 -48115 276138 -102563 -208942
174 -208942 230644 83126 -271521 80732 226042 -212680 -108795 251224 -65498 -209736
184 -209736 218135 99055 -295928 40096 272259 -170187 -181216 222500 38764 -193402
194 -193402 111620 111861 -209294 3960 238377 -116842 -198416 197884 118715 -209006 -1313
205 -1313 175359 -106774 -100953 175867 -1904 -194747 109099 158837 -190880 -74566 219213
216 219213 -49546 -199842 155978 116363 -220075 6719 214227 -134440 -137760 217217
226 217217 2013 -229458 147258 169375 -245906 -41577 271434 -97934 -203730 204850
236 204850 71456 -232458 90417 183641 -214036 -69380 260610 -69589 -224037 176648
246 176648 115949 -223485 15833 191631 -135722 -109675 193730 -6700 -190692 109753
256 109753 130172 -173888 -37107 185300 -57628 -145783 132398 75742 -161591 16930
266 16930 153309 -97040 -98190 154753 18194 -169750 73139 141027 -146576 -70908 180431
277 180431 -26566 -166729 115444 95299 -176951 5110 178419 -112691 -124815 182418
287 182418 23013 -197809 86650 146892 -167609 -45943 193969 -66751 -150690 158893
297 158893 61296 -190778 51325 164261 -137409 -81956 179268 -18885 -161716 106962
307 106962 95772 -156932 -8459 152756 -77618 -109999 129705 35368 -147821 37638
317 37638 120895 -99167 -67137 128758 -4269 -124824 71940 89041 -118599 -25646 137544
328 137544 -42978 -113979 107993 61234 -140121 17656 135332 -92107 -83941 143523 3657
339 3657 -151522 80885 108385 -146024 -31552 160911 -62309 -127926 131333 48236 -160313
350 -160313 42741 131926 -119745 -62121 154658 -25887 -137453 103602 79956 -141131
360 -141131 3022 136409 -74822 -85521 123308 17424 -127616 54113 97146 -104082
370 -104082 -40955 123248 -24212 -110395 76024 66397 -109730 -11494 109492 -50039 -85094
381 -85094 93847 33701 -116189 26338 104439 -83357 -62161 119666 923 -119252 66409
392 66409 85636 -111582 -18297 126843 -53685 -96200 115029 34920 -137120 42422 115736
403 115736 -107147 -56369 136191 -22306 -123294 89330 66498 -129387 6266 121715
413 121715 -79384 -79404 121061 10775 -126046 55353 92401 -101355 -33715 115658 -27451
424 -27451 -91880 80135 46738 -102309 14614 99304 -66440 -66041 102040 17994 -109034
435 -109034 34942 86402 -80163 -41095 100023 -19919 -94750 73744 55385 -112543 -1040
446 -1040 115388 -61371 -86238 105670 28395 -119465 40246 95611 -94868 -37236 120855
457 120855 -31673 -101330 95541 51416 -126094 20028 119574 -81798 -73716 116682 6696
468 6696 -111421 58391 68123 -104093 -6111 112131 -60404 -89223 103364 38178 -118091
479 -118091 17513 96428 -66050 -49869 91081 -7964 -87390 62505 60514 -95735 -13359
490 -13359 106074 -34517 -83454 77511 42826 -96250 11954 89703 -60131 -54285 90489
501 90489 -618 -94066 58394 64772 -105531 -16904 119170 -41911 -100926 84586 48749
512 48749 -102442 16659 83691 -77546 -35484 113569 -24889 -111013 82150 77093 -109521
523 -109521 -17560 106154 -39986 -66441 83932 10720 -95244 48171 75554 -90344 -31763
534 -31763 103694 -22508 -90199 65594 51137 -91527 -5186 86657 -42038 -59055 71459
545 71459 11143 -81563 40152 67614 -82609 -34862 105339 -4942 -97352 45445 65928
556 65928 -68144 -11203 71740 -44173 -47419 89797 7893 -107713 38685 92963 -76398
567 -76398 -51336 89925 -7585 -78084 58466 37016 -91014 13623 88364 -64610 -58431
578 -58431 94791 8633 -97535 42940 73817 -77401 -29193 87141 -17396 -65388 57552
589 57552 25714 -74953 24615 72568 -65452 -48894 88952 14961 -87316 18834 60734
600 60734 -46342 -19910 55634 -28856 -51207 66590 26754 -89947 4107 87199 -38618
611 -38618 -62715 62373 20844 -68030 26696 53401 -62757 -18126 81534 -23123 -70296
622 -70296 63614 39863 -84097 6006 82750 -46981 -55515 71009 11884 -70429 32815
633 32815 42709 -69112 -2201 80869 -43191 -71929 72386 39481 -81338 -647 64537
644 64537 -36234 -29525 59099 -12749 -61624 52909 46740 -75269 -15348 80274 -16128 -61451
656 -61451 45599 30321 -58946 8663 55069 -43134 -33846 63740 -1207 -67635 36007 48981
668 48981 -65944 -20039 75080 -17888 -64625 46742 31899 -61214 11369 54720 -52172
679 -52172 -27967 79224 -7684 -80356 44956 60152 -65683 -19483 68084 -22275 -45371
690 -45371 56971 9347 -70665 30482 60713 -61934 -33416 73121 -5219 -65474 37687
701 37687 36439 -59110 -1388 57979 -34633 -39989 57705 7813 -64470 26567 53833 -52950
713 -52950 -27361 66334 -3397 -57901 34906 35335 -52011 322 55387 -34584 -39973 61485
725 61485 12491 -70932 19514 58298 -47011 -31000 57615 -8379 -51966 41558 25772 -63550
737 -63550 7079 62533 -41070 -43026 62206 9457 -63715 26869 46964 -51340 -14135 60519
749 60519 -20245 -47112 50140 21397 -61621 12307 56672 -40022 -34425 55337 4179 -54002
761 -54002 24060 35341 -45352 -9075 49526 -21763 -41551 43673 19405 -54501 6152 48794
773 48794 -30338 -30309 45538 3431 -46435 25028 34831 -44549 -9713 53575 -16620 -44324 40975
786 40975 24254 -52231 4487 48405 -31160 -30124 47334 1000 -50316 26340 34179 -48096
798 -48096 -10159 51569 -19849 -41845 40931 17828 -49900 10513 43171 -34721 -22081 48696
810 48696 -3881 -45673 29800 31505 -44494 -5503 48634 -18604 -36350 38462 15714 -45979
822 -45979 9517 39882 -32273 -23635 43498 -1162 -45091 23378 30801 -41444 -9802 44871
834 44871 -16310 -36911 36268 16533 -46070 9424 42190 -32232 -23559 46904 -691 -45434
846 -45434 27780 31696 -44100 -5242 48609 -20649 -36849 41445 13984 -49033 13118 40099
858 40099 -36754 -20254 46847 -7371 -43792 29993 25267 -44472 -1580 43987 -23215 -30750
870 -30750 39810 8180 -43045 16462 34599 -34535 -14351 43701 -7675 -37813 29401 22931
882 22931 -40273 -103 41141 -21425 -28979 36788 8697 -41680 13838 32945 -33681 -16707
894 -16707 41371 -7448 -39250 26924 22758 -40515 -863 40268 -22013 -27440 37895 6601
906 6601 -41125 17743 32691 -34876 -11992 42745 -10013 -35269 30811 18812 -40373 4539
918 4539 37968 -25457 -23726 38196 1756 -40017 18638 28304 -35091 -10488 38978 -11502 -32874
931 -32874 28047 16418 -36942 3877 34608 -22594 -21685 35229 3236 -36281 18063 28409
943 28409 -31651 -10223 37862 -9366 -31056 27323 16205 -36874 4393 35076 -24472 -22762
955 -22762 36262 1839 -39063 18060 27876 -34359 -9796 38180 -12642 -31186 29959 13486
967 13486 -37894 8298 34020 -26626 -18525 38039 -1073 -35571 21701 24276 -33176 -3624
979 -3624 35480 -16068 -25470 31213 7783 -36532 11186 30020 -28082 -16276 34758 -3260
991 -3260 -33270 19728 20242 -31282 -2978 32152 -16228 -24050 29889 8624 -34686 9895 30287
1004 30287 -24424 -15541 32991 -1742 -29161 20317 18444 -30291 -64 32286 -18070 -23544
1016 -23544 31416 7262 -35503 10591 27661 -26057 -13435 31508 -6859 -28728 22344 15064
1028 15064 -32518 1834 32007 -19383 -22162 30570 6652 -31396 10733 24277 -22444 -8440
1040 -8440 28671 -8034 -24119 23681 13145 -31521 2233 30153 -16707 -21182 25510 5468
1052 5468 -27998 9725 20402 -23882 -8171 29057 -9005 -27170 22060 15999 -30214 -852
1064 -852 29331 -14296 -19872 25190 5026 -26781 12294 20915 -24836 -6458 31411 -8916 -26884
1077 -26884 22799 15809 -29496 318 26606 -15776 -15996 25167 -1012 -27343 16313 19357 -28855
1090 -28855 -7179 31531 -8392 -26577 19851 13041 -25782 3414 23189 -17754 -12976 27318
1102 27318 -677 -27138 15669 21261 -25000 -7582 28393 -6319 -22474 18811 10639 -24325
1114 -24325 4407 21982 -19422 -13450 27791 -1125 -29964 14256 21622 -24607 -8973 25975
1126 25975 -6999 -20146 19896 7281 -26555 8821 25109 -21482 -15213 29365 1551 -27040
1138 -27040 13339 18710 -21845 -3315 23800 -11756 -17715 23237 5296 -28081 8261 23724
1150 23724 -20907 -13719 25444 -918 -24305 12898 14114 -21876 -958 22665 -13817 -16860
1162 -16860 24217 5949 -27768 7482 24452 -16972 -12786 22653 -390 -19931 14494 11736
1174 11736 -23118 1140 25103 -13889 -19501 22957 7432 -25862 5197 19847 -17107 -9461
1186 -9461 22001 -5762 -20674 17696 11149 -25251 1189 25468 -13493 -17875 22543 6083
1198 6083 -23291 8131 18134 -17216 -5514 22715 -7266 -19627 19434 11431 -24559 378
1210 378 23438 -11812 -15812 18446 3152 -20202 9290 13820 -19780 -4480 23055 -7903 -20707
1223 -20707 17169 11856 -22229 245 20772 -11571 -12533 19622 1829 -20326 11426 16017 -19541
1236 -19541 -5169 23688 -5958 -19671 16098 10448 -20826 935 18278 -12877 -11120 19300
1248 19300 -1278 -21179 11810 14893 -20511 -5497 22136 -6491 -17525 15582 7759 -19144
1260 -19144 4471 17306 -14520 -9393 21436 -280 -20456 11581 15245 -17759 -4639 19737
1272 19737 -5881 -15461 14944 6436 -18837 4143 16679 -14494 -10516 19337 -261 -19765
1284 -19765 9623 13514 -17059 -4073 18612 -7199 -14672 16257 6299 -19619 5270 18662
1296 18662 -14084 -10276 20185 513 -18543 10670 12995 -17096 -2822 18731 -8287 -14662
1308 -14662 16412 5310 -20097 4821 16732 -14504 -9626 18277 -1642 -17945 10871 10816 -17720
1321 -17720 -1178 18501 -9086 -13489 16860 5148 -18706 5829 16625 -13598 -7801 18742
1333 18742 -1705 -16816 11688 10768 -17350 -1158 18310 -8936 -13801 15975 4319 -19118
1345 -19118 5103 15226 -14901 -7943 17986 -3186 -16931 12132 9476 -17677 238 18186
1357 18186 -9647 -12262 16713 3274 -18040 7482 14592 -14473 -5539 18475 -3874 -15658
1369 -15658 12898 8449 -17975 1051 16617 -11076 -11289 16160 1688 -17745 7058 12892 -14593
1382 -14593 -5155 16745 -4956 -14646 12776 7318 -16974 1997 16442 -10207 -9766 16325 1585
1395 1585 -15971 8303 12536 -14460 -3501 16949 -5381 -14050 13085 6892 -16940 2090 15223
1408 15223 -11004 -9748 15167 447 -16030 7870 10718 -14734 -2841 15848 -6043 -12521
1420 -12521 13212 5807 -15729 3443 14241 -10588 -7238 15323 -559 -14216 9237 9877 -14569
1433 -14569 -1722 15661 -6582 -12315 12485 4802 -15439 3086 12577 -10805 -7707 14007 -1256
1446 -1256 -14063 8289 9083 -13682 -2087 14608 -5986 -11056 12136 4606 -14011 3856 12819
1459 12819 -10089 -6053 14349 -1061 -13288 9211 8677 -13887 -1680 14226 -6330 -10839 11758
1472 11758 3585 -14329 3588 11444 -10971 -6139 13805 -2071 -13108 8605 8143 -12580 -861
1485 -861 13384 -6211 -9200 11863 3426 -12912 4784 11258 -10452 -4694 13983 -2197 -12366
1498 -12366 9179 7441 -13437 -697 13170 -6648 -9765 11230 2438 -13488 4582 10208 -11142
1511 -11142 -5216 13309 -2277 -12476 8582 7760 -12336 -119 12362 -6577 -8084 11998 2163
1524 2163 -12579 5726 10538 -10833 -4490 13724 -2713 -11844 8892 6467 -12520 333 11502
1537 11502 -7919 -8360 11694 803 -13643 5715 9711 -11160 -4330 12854 -2597 -10641 8780
1550 8780 5425 -11322 1985 11428 -7831 -6818 12664 1085 -12576 5919 9621 -10101 -3464
1563 -3464 12120 -3335 -9688 9126 4083 -12501 1703 11132 -8963 -7606 11824 508 -12386
1576 -12386 5158 8359 -9887 -2691 11277 -4273 -9056 10252 4148 -12184 2924 11956 -7902
1589 -7902 -6845 11614 835 -10773 5764 7279 -9915 -1090 10839 -5607 -9105 10328 3626
1602 3626 -12879 1866 10406 -7715 -6442 10046 -573 -9724 6209 6187 -10581 -363 11687
1615 11687 -5579 -8931 10351 4718 -11091 2146 10105 -6756 -4432 10050 -1397 -9189 7148
1628 7148 5961 -11175 -644 11798 -5154 -8912 8678 3422 -10636 2135 8099 -7603 -3822
1641 -3822 10176 -2528 -10008 7895 6318 -10968 -744 10963 -4015 -7642 8527 2807 -8951
1654 -8951 3805 7677 -8222 -2909 11093 -2314 -10412 6936 6381 -9885 -1355 8873 -4565
1667 -4565 -6455 7738 636 -9637 4267 7367 -9193 -3642 11143 -1735 -10073 6249 6372
1680 6372 -8525 -330 8801 -4906 -5569 9110 1098 -9763 4832 8345 -8714 -3776 10363
1693 10363 -1114 -8633 5452 4296 -8379 767 7813 -6324 -5438 9531 505 -10532 4019
1706 4019 7969 -7889 -3604 8936 -1830 -7336 6561 3633 -8520 1896 8915 -6123 -5601
1719 -5601 9762 1689 -9464 3787 7382 -7345 -2665 8217 -2866 -6874 7294 2827 -9458
1732 -9458 1642 8918 -6546 -6316 9067 1209 -8854 3623 6335 -7213 -1547 8745 -3338
1745 -3338 -6924 7767 3610 -9376 1576 9078 -5377 -5105 8480 711 -7554 4380 5006 -8025
1759 -8025 -707 8473 -4128 -7185 7805 2890 -9305 1201 7478 -5534 -4474 7652 -550
1772 -550 -7627 5249 4886 -8086 -706 9119 -3703 -6598 7329 3162 -7869 1860 7137 -5630
1786 -5630 -3205 7998 -879 -7484 5216 4819 -8245 -925 8058 -3889 -6525 6140 2318 -7725
1800 -7725 1998 5917 -6029 -2908 7903 -1346 -7402 5193 4660 -7477 -578 7829 -3281 -5035
1814 -5035 6610 1819 -7315 3069 6314 -6185 -2462 7748 -1178 -7065 4977 3963 -7144
1827 -7144 -312 6740 -3626 -5044 6286 1056 -7516 2643 5743 -6091 -2637 7577 -1227 -6594
1841 -6594 4872 4137 -6716 654 7094 -4018 -4317 6865 1266 -7100 3074 6044 -6054 -2607
1855 -2607 7332 -1436 -6492 4892 3398 -7362 -37 6862 -4380 -4564 6544 295 -7112 2949
1869 2949 5142 -6326 -2115 7333 -1804 -5825 5453 3085 -6655 1017 6667 -4488 -3805 6931
1883 6931 516 -6773 3320 5170 -6078 -1739 6914 -2186 -5707 4987 2480 -6880 1046 5663
1897 5663 -4829 -3570 6602 -73 -6416 3529 4766 -5780 -1204 6647 -2241 -4877 5508 2075
1911 2075 -6432 1926 6101 -4968 -3124 6963 1 -6245 3259 4016 -5815 -1064 5939 -3011 -4963
1926 -4963 4926 1624 -6731 1337 5350 -4579 -3059 5902 -502 -5517 3774 3832 -5458 -166 6067
1941 6067 -2574 -3948 5460 1736 -6151 1822 5391 -4584 -2996 5812 -197 -5323 3499 3058 -5661
1956 -5661 -285 5419 -3032 -4673 5185 1335 -6261 1598 4867 -4303 -2331 5601 -801 -4969 4035
1971 4035 3117 -5394 46 5854 -2771 -3882 5383 1613 -5446 2050 4720 -4627 -2253 5474 -1157
1986 -1157 -5153 3714 2841 -5644 -55 5269 -3360 -4198 4999 840 -5286 1981 4013 -4522 -1392
2001 -1392 5511 -1375 -4854 4256 2978 -5568 524 5447 -2727 -3223 5056 795 -5134 2130 4096
2016 4096 -4700 -1212 5614 -1451 -4926 3822 2360 -5564 241 4909 -3778 -3559 4722 368 -5294
2031 -5294 2768 3824 -4457 -1015 5218 -1660 -4493 4394 2523 -5121 835 5077 -3114 -2735 4788
2046 4788 -17 -4830 2723 3599 -4890 -1253 5217 -2060 -4481 3843 1718 -5186 607 4348 -3371
2061 -3371 -2451 4818 -368 -4606 2974 3521 -4604 -545 4963 -1664 -3760 4055 1608 -4681 1229
2076 1229 4230 -3377 -2134 4745 -718 -4608 3065 3149 -4561 -1002 4594 -2077 -3560 3525 1286
2091 1286 -4641 1542 3936 -3813 -1897 4990 -406 -4788 2895 3076 -4056 -354 4333 -1861 -2665
2106 -2665 3966 793 -4132 1928 3967 -3969 -1711 4549 -625 -4484 2570 2269 -4252 -447 3812
2121 3812 -2392 -2578 4086 582 -4661 1837 3837 -3561 -1898 4083 -155 -3742 2578 2145 -3773
2136 -3773 518 3903 -2526 -2468 4545 501 -4681 1702 3682 -3088 -1600 3695 -880 -3312 2647
2151 2647 1463 -4121 451 3666 -2967 -3142 3994 511 -4451 1288 3226 -3171 -1144 3889 -994
2166 -994 -2839 3357 1888 -3886 488 4026 -2470 -2572 3606 864 -3546 1351 2551 -3076 -650
2181 -650 3394 -1577 -3193 3079 1814 -4341 152 3681 -2092 -2783 3134 566 -3490 1837 2536 -3485
2197 -3485 -768 3895 -1421 -3474 3331 2213 -3646 239 3681 -1912 -1840 3029 -148 -3176 2336
2212 2336 2383 -3868 -696 3944 -1416 -3670 2481 1275 -3428 323 2769 -2291 -1580 3456 -422 -3156
2228 -3156 2537 2695 -3527 -502 3651 -963 -3063 2629 1121 -3213 1135 2772 -2685 -1393 3952
2243 3952 -611 -3450 2058 2178 -3547 -948 3222 -1441 -2196 2499 467 -3351 1266 2631 -3060
2258 -3060 -1378 3950 -305 -3315 2198 2149 -2825 -168 2977 -1256 -2046 3008 485 -3145 1548 3129
2274 3129 -2575 -1509 3423 -515 -2879 1694 1571 -2883 220 2786 -1815 -2213 2977 450 -3447
2289 -3447 1255 2808 -2353 -1366 3036 -614 -2545 2120 1538 -2943 285 3091 -1386 -1916 2964 676
2305 676 -3289 828 2320 -2304 -1352 2896 -894 -2446 1888 993 -2872 261 2808 -1832 -2248 2925
2321 2925 398 -2918 1186 2335 -2298 -1009 2999 -694 -2274 2322 1456 -2783 118 2808 -1382
2336 -1382 -1693 2629 578 -2620 906 1930 -2263 -820 2598 -1039 -2523 1772 947 -2746 13
2351 13 2712 -1791 -1710 2633 49 -2847 1516 2023 -2406 -469 2967 -982 -2170 2265 1591 -2729
2367 -2729 325 2771 -1724 -1516 2435 -126 -2700 1286 1731 -2684 -618 2498 -935 -2279 2027
2382 2027 970 -2606 651 2341 -1869 -1196 2693 20 -2599 1658 1894 -2476 -369 2652 -1069
2397 -1069 -2033 2336 1314 -2685 741 2170 -1728 -1307 2496 -619 -2665 1448 1362 -2547 -414 2290
2413 2290 -1379 -2212 2121 647 -2643 464 1898 -1839 -852 2979 -393 -2095 1822 1644 -2079 -4
2429 -4 2354 -1068 -1776 2240 248 -2428 934 1874 -2123 -913 2345 -711 -2424 1435 1373 -2232 -249
2446 -249 2044 -1211 -1598 1935 318 -2200 1205 2094 -1743 -781 2698 -236 -2160 1819 1294 -1904
2462 -1904 315 2076 -1195 -1203 1865 124 -2233 901 1772 -1711 -716 2147 -560 -2023 1576 1032
2478 1032 -2059 12 1959 -1503 -1028 2205 22 -1979 1027 1579 -1616 -675 1994 -491 -1666 1539
2494 1539 693 -1965 557 2345 -1354 -1406 1949 148 -2164 969 1574 -2092 -652 1839 -703 -1647
2510 -1647 1257 813 -2086 19 1652 -1302 -1134 1891 331 -1829 1262 1685 -1528 -191 1973 -724
2526 -724 -1101 1953 401 -2095 130 1849 -1541 -1166 1725 70 -2083 748 1360 -1697 -571 1720
2542 1720 -1046 -2014 1426 702 -1773 390 1694 -1254 -951 1806 112 -1713 1263 1596 -1512 -8
2558 -8 2231 -866 -1450 1789 577 -1594 742 1703 -1293 -1050 1652 -201 -1629 905 1095 -1772 -532
2575 -532 1620 -782 -1498 1354 678 -1633 298 1489 -1160 -829 1838 143 -1452 1396 1104 -1545
2591 -1545 177 2023 -969 -1121 1652 418 -1903 524 1679 -1463 -674 1668 -382 -1606 1267
2606 1267 689 -1844 -39 1734 -750 -1331 1554 366 -1570 437 1218 -1194 -406 1858 -133 -1354
2622 -1354 1272 805 -1546 -54 1788 -1073 -1093 1439 438 -1695 634 1157 -1411 -690 1697 -546
2638 -546 -1734 1088 705 -1705 -111 1498 -693 -756 1399 190 -1640 993 1241 -1159 -340 1734
2654 1734 -37 -1194 1254 704 -1293 218 1076 -969 -997 1540 -160 -1746 813 958 -1223 -423
2670 -423 1456 -363 -1124 822 623 -1582 452 1439 -986 -895 1627 197 -1358 848 1434 -939 -455
2687 -455 1701 -457 -1115 935 204 -1381 329 1285 -972 -895 1371 -43 -1506 716 658 -1390 -373
2704 -373 1188 -791 -869 1198 211 -1505 68 1386 -788 -854 1208 162 -1070 648 865 -926 -209
2721 -209 1561 -691 -768 1097 534 -1383 358 1189 -983 -864 1160 -394 -1298 779 737 -955 -44
2738 -44 1377 -709 -1035 1098 466 -1398 238 1252 -946 -677 1281 -194 -881 907 671 -1206 -22
2755 -22 1458 -502 -1031 1060 446 -1359 281 779 -995 -318 1320 -299 -1169 912 871 -1373 -10
2772 -10 1139 -658 -565 960 237 -964 722 947 -1074 -277 1407 -141 -1157 968 816 -1004 -137
2789 -137 1115 -753 -711 1095 169 -1284 331 690 -1017 -590 1267 -342 -1333 818 671 -987 147
2806 147 1299 -838 -519 1310 -8 -1223 616 831 -929 -115 1386 -14 -962 626 568 -845 -81
2823 -81 809 -626 -873 1065 -181 -1221 437 576 -1441 -713 920 -544 -1173 914 246 -1210 87
2840 87 1191 -727 -355 1144 304 -894 367 787 -972 -323 987 -45 -742 911 332 -966 240
2857 240 563 -777 -588 954 10 -1308 529 545 -1095 -76 843 -339 -843 878 359 -1236 317
2874 317 1295 -454 -558 1270 216 -1068 655 648 -650 -161 1026 -334 -881 749 330 -996 375
2891 375 720 -651 -809 722 -126 -1235 637 484 -1046 -315 913 -529 -736 1002 135 -1048 356
2908 356 936 -430 -437 961 -30 -827 661 655 -1118 126 835 -668 -552 976 352 -924 215 676
2926 676 -653 -579 944 -278 -880 604 302 -716 50 846 -847 -388 967 488 -915 281 823
2943 823 -812 -70 871 -88 -650 796 461 -997 100 872 -673 -830 650 -259 -729 377 526 -990
2961 -990 -275 614 -235 -528 566 335 -802 98 478 -468 -596 750 164 -664 501 511 -666 -204 927
2980 927 -210 -623 593 257 -916 144 713 -671 -656 776 -181 -944 380 408 -721 -145 874 -176
2998 -176 -611 640 157 -799 91 619 -379 -288 798 -7 -676 730 473 -707 162 894 -391 -475 672
3017 672 187 -695 197 679 -609 -544 514 -208 -984 491 537 -662 -249 593 -291 -499 609 130 -642
3036 -642 191 1028 -505 -314 914 185 -757 265 313 -390 -8 651 -459 -652 717 298 -753 280
3054 280 725 -828 -348 778 -16 -852 142 242 -954 135 705 -512 -523 727 91 -721 285 325
3072 325 -579 -234 906 -218 -536 432 420 -838 -26 694 -191 -891 423 108 -582 317 592 -768 -354
3091 -354 747 -272 -597 430 229 -454 122 770 -336 -376 482 -141 -690 389 579 -661 -42 700
3109 700 -105 -639 660 258 -442 268 525 -614 -496 426 -7 -864 240 189 -710 -384 669 -292 -674
3128 -674 275 -272 -634 -105 498 -35 -298 707 80 -609 391 413 -584 -192 815 7 -515 407 361 -536
3148 -536 -16 661 -509 -622 625 -63 -699 174 246 -425 -121 596 -85 -574 584 232 -417 529 478 -240
3168 -240 -123 569 -115 -684 375 308 -761 -5 588 -37 -368 413 247 -460 204 541 -425 -177 255 -279
3188 -279 -710 271 185 -1021 -68 497 -390 -288 370 355 -514 -81 398 -526 -94 621 -322 -417 351 278 -703
3209 -703 -79 540 -547 -372 494 -116 -570 459 545 -645 -364 375 -426 -609 573 487 -578 -61 615
3228 615 -352 -363 582 112 -415 433 446 -409 -28 578 89 -623 447 311 -349 81 394 -451 -293 630
3248 630 -135 -664 74 301 -512 -421 262 -240 -662 453 445 -663 76 392 -290 -199 519 19 -324 391 349
3269 349 -226 -70 619 -105 -440 363 278 -381 270 586 -385 -350 582 -11 -385 -71 36 -571 84 537 -452
3290 -452 -472 485 0 -641 34 179 -231 -226 458 226 -368 191 341 -157 81 250 -105 -538 660 366 -480
3311 -480 184 406 -512 -423 246 -318 -492 415 58 -261 -22 508 -244 -367 226 79 -273 10 355 -370
3331 -370 -109 280 -22 -487 485 160 -214 -9 661 -47 -484 374 -56 -369 267 113 -402 -157 278 -191
3351 -191 -385 227 248 -630 4 417 -200 -96 212 166 -255 424 272 -105 -107 428 -292 -441 217 221 -338 160
3373 160 440 -353 -338 366 71 -440 262 110 -329 -148 192 -240 -576 459 239 -495 19 433 -9 -413
3393 -413 424 95 -240 365 604 -504 -267 316 -8 -578 321 187 -321 155 170 -389 -78 470 -351 -201
3413 -201 243 214 -331 -19 227 -266 -327 221 16 -109 -161 531 -264 -108 245 66 -206 91 180 -243 -32
3434 -32 404 -57 -241 258 186 -129 76 148 -364 -196 293 -170 -290 232 261 -399 15 274 -182 -214 406 248
3456 248 -164 377 127 30 -235 537 -29 -56 169 324 -232 -112 356 -113 -353 476 -44 -159 296 164 -428
3477 -428 -386 272 -302 -473 11 382 -520 -157 557 -90 -200 85 46 -399 -10 323 -232 117 434 67 -303
3498 -303 263 -52 -140 -28 255 -254 -115 445 -111 -320 201 375 -258 -152 304 -291 -153 396 -239 -39
3518 -39 199 208 -109 -45 244 287 -217 167 360 -294 281 295 -45 -130 324 134 -376 39 351 -421 -236 373
3540 373 78 -288 -8 -56 -399 -271 257 -102 -228 477 -112 -179 16 270 -118 -99 324 -158 -13 -35 262
3561 262 -470 144 306 -28 -362 147 52 -337 212 164 -408 -359 335 108 -178 39 146 -310 155 185 -76
3582 -76 23 267 60 -337 164 410 12 -86 317 89 -223 152 163 -148 36 155 -238 -256 138 108 -117 -2
3604 -2 268 -378 -185 141 -61 -158 112 237 -240 129 484 96 -165 302 240 -242 207 406 -61 -76 303 -75
3626 -75 -304 101 140 -349 174 206 -125 31 2 -127 -419 -152 88 -215 -26 274 -45 -250 -235 40 -321 -71
3648 -71 159 -229 50 328 143 -297 121 406 -44 -279 436 31 -186 71 65 -51 57 115 -254 -125 257
3669 257 -71 -50 114 306 -393 -58 -47 -154 -430 133 393 -373 178 215 -490 -48 283 28 -33 8 393 -404
3691 -404 -67 121 217 -302 272 -10 -423 111 390 -313 -62 204 64 -338 -31 257 -432 -223 188 0
3711 0 -42 150 43 -312 10 83 -76 -116 284 -136 -318 246 197 -150 36 164 -163 -94 139 -99 -177 49 -238
3734 -238 -163 -49 249 87 -353 -74 -32 -306 -174 321 -407 193 332 11 -214 -231 319 -267 -33 390 -17
3755 -17 -179 94 -78 -221 -122 143 -112 -143 291 -17 -172 -39 276 -155 -90 284 -121 22 3 -41 -207 30
3777 30 228 -42 -182 425 119 9 141 73 -13 -44 340 -175 -280 203 186 49 27 119 -112 -231 37 37 -355
3800 -355 23 159 -117 -138 51 -51 111 265 204 -82 -97 -84 -261 -241 110 -117 -193 134 326 -344 -52 85
3822 85 -343 -204 121 79 -270 125 113 82 -261 129 -99 -407 276 -189 -212 -76 66 -85 -40 130 4 41
3844 41 160 258 -351 -36 251 -58 -338 268 -46 -285 137 265 130 -41 150 17 -129 80 67 -280 32
3865 32 -45 -321 -293 -15 157 -190 -213 66 -283 -112 257 37 55 -38 186 55 -83 254 157 -332 68 82 -275
3888 -275 -81 15 35 -255 205 -110 -69 -49 49 -179 -123 305 45 19 -115 75 5 1 281 -46 116 50 136 223
3912 223 138 131 -302 14 293 73 -41 264 255 -119 -8 -49 -121 -140 95 -33 -220 -28 155 -30 -92 322 142
3935 142 -198 1 50 -267 -137 288 -193 -62 127 94 -283 178 185 -167 96 137 -154 -403 173 88 -375 8
3957 8 218 -233 -55 -10 -32 -74 -28 114 -294 9 136 -168 -45 4 224 -93 -48 211 -278 -30 122 179 -10
3980 -10 54 59 -214 17 -74 -181 59 149 96 -7 100 338 -183 30 122 110 -421 -81 -14 -212 95 -112 -391
4003 -391 -150 51 234 -276 282 449 -234 -185 105 252 -304 155 159 -212 -86 71 37 -84 57 19 -79 -105
4025 -105 144 -27 -18 120 -90 -276 58 67 -289 133 99 -7 -51 -43 17 -33 31 189 -176 64 55 136 -18 164 15
4050 15 -91 59 -52 22 -57 47 120 -146 -71 -85 -31 -144 149 -237 -99 124 -9 -112 -183 159 -294 -157 229
4073 229 1 -29 263 165 200 -141 374 -109 -292 -18 -47 -209 -142 31 -201 -190 310 70 -281 -27 1 -180
4095 -180 -139 28 -121 -208 18 -357 -5 -169 59 -18 -62 87 -29 -260 12 148 87 50 152 -2 -61 309
4117 309 74 -37 54 126 -1 -218 176 -256 -374 -146 -88 21 3 -25 -116 -136 182 47 -146 41 27 -213 3
4140 3 193 -140 -3 48 -309 -147 63 -141 36 -185 43 186 69 141 3 -184 259 -36 -394 -161 79
4161 79 52 -22 -12 368 74 120 78 -4 -90 -235 106 -266 -195 -91 147 -223 188 -249 -100 -14 211 -121 -305
4184 -305 1 26 87 -42 88 208 7 97 -235 58 189 146 -68 1 111 -209 54 285 196 -183 199 99
4206 99 -117 -9 88 86 67 173 70 -366 -165 136 -93 -84 -73 -27 -234 87 -228 -328 210 253 -390 -363 194 -3
4230 -3 -211 75 46 -258 79 35 -168 -50 104 63 123 -5 193 40 -158 202 -138 -169 -42 225 -156 -87 69
4253 69 -120 -46 -195 130 -167 16 -12 -234 -194 26 -80 -303 113 187 17 270 142 -203 -70 308 168 -232
4275 -232 38 -110 23 -360 124 11 -150 -39 6 -33 -102 113 -165 -55 100 14 -165 -194 79 77 -129 -30 126
4298 126 -283 86 126 -169 192 45 87 -253 -4 246 -7 -296 168 -210 -181 -26 -99 -304 76 -56 -183
4319 -183 -118 45 -35 -62 144 -101 -39 -147 50 -29 132 109 13 -65 -143 169 52 -139 -45 -53 -121 71 15 -30 -71
4344 -71 212 -77 -28 331 10 198 -278 -59 -102 93 322 -69 -86 -23 -110 -144 133 67 -95 -173 234 184 -265
4367 -265 -64 149 143 180 50 -107 222 -142 -10 -96 72 37 -119 -43 -39 81 9 100 61 -100 -67 183 -5 -6 -32
4392 -32 -136 60 169 -121 48 64 163 -62 18 73 -57 -25 -83 143 92 131 -48 -37 -225 -50 -129 -330 -122 300
4416 300 -203 -123 327 40 49 -176 -237 -304 -29 8 8 -180 200 -62 11 11 62 -58 -80 -21 116 -4 216 339 -233
4441 -233 -73 -30 273 -234 156 11 88 -276 159 12 -305 -6 26 -105 101 130 131 85 217 71 46 -11 6
4464 6 -157 -103 68 31 124 145 173 -60 334 162 -91 -82 -30 21 135 28 189 -418 -155 127 -365 -52 129 -259
4488 -259 39 189 -119 25 -27 112 150 -26 113 196 -103 10 -179 73 -101 154 10 -31 -25 28 -87 211
4510 211 -76 -235 31 -48 47 245 13 -34 146 -119 327 79 -187 49 254 -5 -27 266 -32 -51 -28 42
4532 42 -107 172 113 109 -204 156 153 -293 21 23 -262 -119 -164 106 42 60 92 -141 2 -30 99 -73 -25 128 -28
4557 -28 68 29 -1 178 186 -24 27 209 -133 -147 92 -89 7 52 13 147 -335 44 25 -67 68 -61 -77 91 -84
4582 -84 -72 94 26 -31 115 -80 126 214 95 23 178 -39 -65 21 -126 222 21 -5 -17 223 57 0 -71 242
4606 242 -128 9 -384 74 -151 -51 -67 -200 14 -122 -116 -26 -2 338 -191 -49 119 172 -104 169 243 -1
4628 -1 41 135 64 169 -16 -51 -39 -107 9 -108 79 34 6 -29 -253 -1 124 102 162 -160 -106 60 -8 105 -44
4653 -44 18 -73 -101 128 -31 -143 145 -11 -30 114 64 29 -19 -55 -127 -209 -100 -240 -349 -42 -31 114 -24 -154
4677 -154 0 139 80 222 209 -72 3 31 -58 263 40 128 -116 -143 -75 76 -66 40 -35 -187 152 -109 -227
4700 -227 -203 -77 -207 -111 -138 -166 271 -161 40 -133 -22 207 117 67 -9 5 -5 82 -137 -199 219 145 189 128 55
4725 55 -130 -22 191 47 -181 -103 122 -228 -65 158 -155 68 87 -113 -187 -68 244 163 -115 -137 -15 -165
4747 -165 147 169 225 40 262 -95 109 -165 -182 -132 -106 12 25 -85 18 -46 167 259 -288 -84 -160 -110 -142 -75
4771 -75 -10 -26 -315 -227 141 -97 -76 132 -200 114 196 -230 -59 -28 38 54 -239 109 -125 -26 55 91 224 -40
4795 -40 146 124 -38 -110 -31 -98 -46 -21 233 -253 -120 20 -84 -128 -183 -62 88 -29 116 -157 -48 2 223
4818 223 49 110 -67 107 63 -8 84 -150 221 111 213 -148 38 -4 -338 320 -176 -81 7 -43 50 124 82 27
4842 27 234 -139 118 -38 124 44 -81 121 139 15 -77 152 -112 249 2 -86 58 310 196 -39 220 273
4864 273 -45 24 -132 -63 -68 -31 294 -236 -257 133 -155 -85 229 83 -95 -113 -33 7 -28 -164 -315 15 -21 70
4888 70 10 63 126 -22 -113 -136 16 -24 -104 40 212 -123 -126 -126 219 -21 47 -4 -206 -30 -123 -175 68 -107 -215
4913 -215 -83 77 -68 -224 -84 292 -11 195 102 137 -125 -54 13 -219 60 68 -66 -48 78 46 35 50 63 -236
4937 -236 113 62 422 -62 150 239 -83 -112 -40 65 -324 18 -86 -262 142 245 -67 260 253 38 -128 -103
4959 -103 185 -154 -39 96 -32 -87 85 -110 -165 219 59 33 133 246 -65 -107 106 -48 -108 -23 101 -40
4981 -40 9 233 -150 89 -169 -202 -287 33 76 -76 99 29 -22 -25 54 -212 7 88 -81 -1 -75 108 111 -167 220
5006 220 -67 200 218 261 -241 -14 163 45 -27 197 110 42 39 -55 -2 -23 107 219 26 -135 -67 -224 -115 24
5030 24 -50 -328 110 -192 -154 -1 -22 -203 13 84 53 19 -39 166 -67 -118 62 153 -194 -63 352 165 -31
5053 -31 -47 -127 54 -118 146 368 8 55 54 -69 -81 -62 287 95 -166 53 -192 -19 -166 -186 152 180 138 99
5077 99 -42 129 127 20 35 -95 -50 163 -318 75 298 84 -128 -181 331 -154 -80 258 233 -221 117 70 -218
5100 -218 -74 199 9 -174 262 -108 -14 118 -138 -131 -81 2 -120 -65 -95 27 3 31 -24 56 -162 3 -231 -41
5124 -41 203 -143 -17 13 178 -67 -78 -148 15 165 -121 142 -99 -179 137 261 -59 105 37 208 57 102
5146 102 109 -46 51 124 -294 -38 -218 -41 96 -90 159 163 -143 87 27 -142 97 79 -9 -137 104 -160 -32
5169 -32 -54 -21 -114 -51 -141 48 -46 6 175 185 187 -42 97 107 -33 -90 -36 205 136 -8 125 32 -34 -164 -6 -234
5195 -234 317 -101 86 -140 98 102 -176 80 -98 222 -244 71 -36 125 34 0 -151 19 -8 29 -64 259
5217 259 27 26 -3 128 -334 98 -251 121 175 41 8 -165 143 -110 118 132 -81 219 46 -183 109 63
5239 63 -162 19 84 90 27 -71 53 -26 161 -217 84 -73 127 -113 54 -74 -66 186 -201 72 -106 -169 133
5262 133 -140 17 252 36 87 108 -241 -77 46 163 -174 -16 -1 -145 97 255 150 91 110 84 -412 -24
5284 -24 83 -99 -309 1 99 39 -279 -85 131 59 -140 20 -217 -152 -47 -57 104 96 189 225 -103 -81 206 -11
5308 -11 49 196 124 110 147 -82 70 26 11 -18 169 -201 -84 194 -28 -28 -78 141 121 -11 -163 114 -128 -100
5332 -100 129 -23 -55 22 65 99 210 7 -48 -41 -16 -142 -103 -132 -47 -88 -82 46 -30 11 -19 22 61 -44 -83 -25 -11
5359 -11 32 -9 -1 -53 -131 29 227 68 147 78 -113 97 -15 173 65 -74 34 98 -81 -131 -30 81 203 -132
5383 -132 94 -56 -46 -50 -143 -123 165 59 -120 130 35 -100 157 24 166 -140 74 -153 -2 76 -25 60 -168
5406 -168 19 285 -31 103 228 167 -85 -87 -242 -117 -79 80 3 43 -1 308 339 97 272 -60 48 39 182
5429 182 -80 12 4 -320 -120 -78 60 -10 -67 73 174 -53 136 7 133 -8 48 -89 128 -54 49 -12 14
5452 14 -35 -59 238 -165 -19 16 140 -21 114 101 -123 35 49 -141 38 171 45 -96 28 -94 120 -14
5474 -14 -230 -115 -150 -16 124 -64 84 -212 -22 -83 -73 126 155 -203 -303 -27 -46 56 48 -234 114 -189 152
5497 152 -23 -6 -173 -219 -117 -83 -59 25 91 -134 24 -51 179 5 250 -239 94 -50 161 -55 -30 169 -195
5520 -195 57 45 74 48 -140 226 -11 -74 -104 -18 226 -47 94 -297 -56 130 126 281 -94 99 -118 76 -73
5543 -73 2 -71 45 19 -136 -235 -99 86 -132 -158 -111 -126 -115 -28 -156 34 -4 -5 -97 0 57 63 73 -72 92 67 116
5570 116 113 -26 6 -263 -23 51 -130 -179 61 -152 -191 -243 -61 62 -147 41 -77 -18 -106 182 -5 134 -124
5593 -124 46 60 15 -84 -97 32 92 -8 79 105 32 -90 52 -144 180 -176 -181 31 -140 141 144 130 68 108 4
5618 4 -67 159 59 129 -65 -209 205 -154 -164 61 -96 -136 -93 -73 -65 -58 -245 -91 -54 -41 -70 -14 143 116 -311 -21
5644 -21 -128 136 19 130 -71 -26 97 34 67 148 166 266 -225 206 -156 -120 -106 91 -196 -83 129 -63 -33
5667 -33 6 -37 71 209 -65 20 19 35 -259 -46 12 -30 -33 82 74 54 -11 235 83 -41 -239 61 79 77 46 -66
5693 -66 -99 320 231 104 101 -75 -60 -116 13 -203 116 -67 -267 -268 -152 -141 9 103 -2 87 103 -92 284 198 -59
5718 -59 69 97 -73 182 31 95 -3 18 -312 -68 -4 -114 -119 -43 46 94 -61 -47 52 -87 -50 -238 -196 -128 -156 57
5744 57 36 -236 94 -24 -125 -120 129 172 229 76 -11 -174 17 176 -80 -54 -159 38 24 -71 -32 -192 158 -30
5768 -30 293 4 -107 327 38 -133 -99 -354 -19 184 19 114 -151 -234 -245 66 160 46 -127 -23 9 -69 -32
5791 -32 -45 131 69 144 129 -26 -12 72 77 -120 -11 -121 -8 110 118 -19 -178 26 -74 -154 42 39 -210 -13 44
5816 44 -35 30 -12 -97 -167 -3 120 102 -8 -23 -33 73 -185 -158 -70 9 100 -60 116 -149 1 -172 144 86 69
5841 69 85 101 57 103 79 29 41 -26 -34 159 8 239 58 -83 -25 84 -64 142 -14 -170 0 92 35 -147 -116
5866 -116 130 1 -121 -214 -108 -14 60 -163 -200 -95 -213 67 47 164 171 -62 24 -23 9 -18 106 160 87 86 236
5891 236 44 -131 -138 34 -106 120 82 16 -14 42 -181 -169 -213 -71 38 113 -157 -132 97 15 162 190 -60 -105
5915 -105 -1 18 -228 140 -84 -62 -205 28 128 -166 61 -3 -67 -3 190 -22 -9 66 9 -95 -106 -132 -18
5938 -18 151 33 61 -69 -11 -55 195 -167 263 5 67 54 -164 -148 -69 83 15 125 -179 261 127 11 181
5961 181 29 -43 -98 -40 128 196 24 -261 -93 -145 -92 184 109 -72 46 -192 35 223 206 217 -204 -257 117
5984 117 -101 158 -61 141 -93 104 151 -113 -103 104 29 147 -66 5 -23 25 -136 40 -197 -33 61 -96
6006 -96 118 16 243 -281 -22 -166 196 304 -236 -44 228 -94 97 43 -67 100 17 58 25 48 -226 50
6028 50 -62 -96 65 18 148 203 -123 -39 158 65 -375 328 77 224 19 -72 20 -15 -10 115 150 -50 16 14 213
6053 213 42 1 -47 204 -19 97 154 -117 -26 131 -75 -102 181 164 -81 -18 -243 -131 -156 -6 53 192 -87
6076 -87 -180 -143 -176 -181 -78 212 -8 -85 -52 62 264 162 115 288 -19 -22 -195 108 -5 115 -106 13 62 -59
6100 -59 60 -117 -30 131 -10 -170 110 -23 104 -9 -85 41 8 16 168 160 183 35 229 -2 85 85 145 -159
6124 -159 -8 -127 195 281 -209 -61 42 -192 -160 231 -150 15 -116 146 -25 111 141 -6 -34 -14 -162 25
6146 25 -21 -131 2 290 -79 131 -134 -87 -52 39 42 -104 -92 -298 -196 104 -208 106 29 116 40 -158 -95 5
6170 5 196 -189 -119 -21 -21 -74 204 -81 -108 166 36 48 -47 -95 -57 101 -229 -25 -129 -266 -167 81 -28 31 -115
6195 -115 -97 -127 -118 83 115 172 -94 82 -42 128 14 20 -11 96 181 -240 -125 -155 -13 -127 127 108 187 -99
6219 -99 22 -95 -41 178 -213 -171 -47 70 166 -56 116 -150 94 -190 -64 -20 135 72 23 -109 -120 -153 -36
6242 -36 7 -18 -135 -36 173 104 -85 -181 -7 194 17 -66 154 -73 -25 201 -7 -151 17 -86 114 -174 117
6265 117 -49 80 310 -1 -58 31 -194 103 -126 209 115 -160 32 -167 -32 -24 -216 177 -67 165 -148 -216
6287 -216 118 86 184 -191 -104 -243 -113 220 126 -71 -110 -79 -69 107 -51 72 -85 -53 -51 -89 153 284 -342 -155
6311 -155 13 -49 -140 72 -80 193 172 -246 -256 -161 -137 -226 -5 165 212 75 342 3 66 -211 -1 198 95
6334 95 251 -307 99 121 -11 -234 -20 256 298 -180 143 212 -100 106 85 -193 82 36 -75 -145 -92 -70 -180
6357 -180 153 115 119 118 -24 -7 408 158 68 -24 237 116 15 -29 76 -91 -73 120 213 -143 -30 -66 135 162
6381 162 45 1 171 -50 3 24 -17 6 75 -99 174 113 174 -83 67 -97 -195 -176 -81 75 -65 -82 -30 -77 305
6406 305 -29 49 -167 103 -108 81 24 -330 21 -35 -55 -255 -39 -31 162 -208 -67 -76 224 -8 43 -9 112
6429 112 53 -92 -146 -29 -50 -301 -96 76 282 -66 406 117 -79 -148 217 158 -116 468 -48 94 49 -106
6451 -106 163 144 -126 -260 -166 55 189 55 -9 92 -85 -101 -127 89 152 90 -40 -48 -237 330 40 135 88 246
6475 246 -11 147 90 -25 115 -105 29 171 141 -58 101 45 -122 -149 233 91 -133 -234 -70 87 -199
6496 -199 -140 10 203 -11 -124 113 189 135 106 17 -98 240 332 -21 -267 -80 32 -64 43 -86 -97 22 19
6519 19 -58 15 10 99 -10 235 -10 -30 -196 119 -127 39 -92 -23 159 192 -40 -196 -14 154 -31 -226 143
6542 143 152 -140 -13 192 -151 4 -83 -146 -283 -172 80 -72 -59 93 -84 -65 -159 -71 219 -29 7 5 -43 -27
6566 -27 -65 -13 251 63 26 36 -124 57 107 62 -46 -44 -208 -34 104 -159 24 -138 -37 -314 97 -102 82
6589 82 -47 192 -128 55 -73 97 328 -15 242 -120 28 -336 25 -45 20 1 -133 -29 -156 -88 57 -141
6611 -141 -113 26 -89 -149 -325 212 -2 94 -97 45 -36 -23 -14 -120 -56 -51 -269 -69 136 -171 -197 -171 59 57 170
6636 170 89 -62 82 -95 29 47 245 233 7 -77 -173 50 -167 54 198 -155 -390 183 258 -130 -166 68
6658 68 21 58 -89 -124 -192 289 -118 137 -55 -216 -94 -134 -179 150 21 -185 118 114 333 -95 -208 217 -7
6681 -7 -15 -118 78 -197 -125 53 14 2 -48 22 -112 -509 -63 -74 79 264 -30 254 -201 -203 159 -144 268 -129
6705 -129 -58 -16 -103 -8 1 42 -6 -167 41 -73 -16 -127 -55 53 -33 21 45 -49 -304 37 -19 -85 137 -117 -98 -94
6731 -94 21 -85 1 69 -353 -161 -38 186 -16 -156 141 85 232 123 7 -223 -91 18 200 72 -136
6752 -136 93 17 34 -54 106 136 -69 -64 -23 -8 -87 -131 -91 72 -6 141 62 91 141 -167 98 -27 -103 30 -285
6777 -285 -31 155 -40 73 233 -186 1 -72 111 0 -79 174 -189 76 87 -8 62 40 -84 46 28 -229
6799 -229 -50 -148 -74 82 -164 -53 -121 -193 10 -128 149 23 -218 33 -153 68 -156 251 19 -187 -107 -16
6821 -16 57 -50 -26 23 63 -134 51 -306 189 -20 -98 16 314 256 44 -188 -101 -51 -34 -65 -209 37 -30 41
6845 41 -316 -92 -101 -41 201 -146 -134 -116 4 110 -221 142 -39 -126 -13 -64 -15 148 -135 -64 -96 -70 197 -5
6869 -5 42 -22 -96 16 -52 14 151 178 -54 -99 12 12 -41 -171 14 153 38 174 -69 87 25 -35 116 61 -211
6894 -211 255 -97 283 -98 93 -262 -309 5 -118 59 57 -122 168 -113 124 18 -108 -23 199 -141 -63 93
6916 93 -262 35 -51 -134 -138 40 -313 -153 -168 -23 -131 251 34 79 33 0 51 311 177 144 259 173 -196 191
6940 191 -214 82 28 -39 -107 10 175 92 -240 118 -192 32 -58 -136 177 68 85 -197 40 131 243 4 -130
6963 -130 15 82 24 -80 20 -20 7 244 -80 -34 -48 -49 29 -102 -207 -134 178 -96 -215 190 -28 -164 64
6986 64 -44 83 -73 183 -21 -12 -110 208 192 27 -94 -90 56 -208 -31 -270 -201 -79 14 25 46 123 -278 34
7010 34 39 -71 6 -340 151 -18 -65 47 -63 -4 78 -338 -26 -15 132 140 133 123 21 -131 -437 -128 -238 255
7034 255 45 40 -101 143 147 113 29 -56 106 30 -168 2 4 176 -5 128 252 -49 -12 135 187 11 26 -65 24
7059 24 -69 158 -128 -42 239 -350 -253 4 106 -37 27 -192 -45 6 63 7 109 -250 68 71 -357 -83 -110 -31
7083 -31 -15 249 20 -112 -401 -48 -251 28 146 -79 -52 -109 -139 -172 -5 -31 209 -76 126 -69 21 -465 56
7106 56 -173 86 162 -58 -66 0 -2 -4 -122 -179 -80 -33 112 -145 358 42 240 -216 47 -210 17 -107 14 -131
7130 -131 -29 163 39 -8 -4 173 -284 -15 31 -120 -85 72 15 75 119 -65 -40 -130 -157 -185 146 -55 -121 7
7154 7 38 79 -19 202 200 -97 69 -23 24 105 -3 -6 102 242 -165 184 -70 158 -59 -106 -106 136 149 62 -21 100
7180 100 -71 173 -163 -259 3 -13 77 21 -135 -75 43 -122 -43 -6 -11 60 60 -14 84 241 -7 -163 203 267 -115
7205 -115 23 -130 49 136 -103 -150 -23 -187 183 13 -82 128 33 112 -64 -75 86 213 234 34 -19 203 154
7228 154 -109 -136 110 15 131 -155 182 125 37 225 100 28 73 -18 147 210 -105 -234 -214 60 142 216 34 -20
7252 -20 9 -101 -170 16 -66 -18 123 154 153 -173 -91 39 119 86 -132 63 36 -147 -62 -31 15 167 -62 116 101
7277 101 -24 41 361 259 -142 -145 -159 -83 21 104 -16 -89 54 -83 -340 24 183 -142 123 -80 147 -123
7299 -123 -104 176 55 260 179 63 -93 9 83 180 170 -112 -258 -74 163 -134 9 -151 178 108 -43 19
7321 19 -235 200 -70 -60 210 30 77 7 -122 135 -72 -82 -81 73 -212 -127 18 -145 4 -11 218 174 -212
7344 -212 40 -118 -6 41 -113 -9 -40 -164 204 -123 144 -47 -155 186 -154 -113 -61 115 -148 119 233
7365 233 79 157 19 -122 -223 14 266 -93 136 -52 249 -34 137 -18 118 305 72 -113 -48 -178 -8
7386 -8 118 -180 -219 -104 -39 104 -116 -166 109 -21 -43 85 -134 -160 -113 143 -14 -50 89 -256 107 -113 -207
7409 -207 -238 38 3 115 112 -197 21 -8 39 -49 -266 -46 6 -160 148 -74 132 -167 105 41 -53 78 70 -11
7433 -11 36 -284 161 159 182 137 -80 71 9 -10 -54 73 -123 -153 -184 76 -220 -308 162 -34 192 320 -18 -347
7457 -347 -197 -85 -67 -53 -257 -39 54 -85 -95 -38 -66 53 -93 -25 162 -231 -121 -160 235 166 -119 32 -124
7480 -124 -1 17 -183 -97 -66 69 -121 -18 143 72 34 -157 74 70 123 -2 6 121 107 34 -16 -199 91 9 -117
7505 -117 -61 -77 -68 19 -17 -140 -133 14 31 43 -263 -54 14 56 -165 -244 177 -31 123 4 34 110 113 -49 110 111
7531 111 -46 56 71 163 -24 -30 23 -55 233 85 -63 -34 93 -83 -152 -142 32 -106 -75 -156 45 -28 145 -262
7555 -262 -239 -1 -26 294 -102 91 -298 59 157 52 101 97 259 193 -9 -152 -85 -58 97 -96 172 -149 -101
7578 -101 35 -29 176 4 -220 -66 -17 67 -6 -28 -412 53 110 287 -70 -73 -138 276 215 -2 63 92 100 89 -15
7603 -15 -101 -136 -253 -47 -2 87 -104 -180 -229 47 82 -19 -26 -82 153 23 190 32 199 -78 -52 4 18 -61 60
7628 60 103 -35 -234 53 -30 -126 134 161 103 158 -85 -259 -77 18 -152 12 162 -48 7 -125 -119 -100 62 18
7652 18 279 10 12 17 164 -181 -152 154 84 -35 91 -137 -46 97 34 1 99 -47 -327 -51 -251 20 -59 -53 -44
7677 -44 174 -135 -16 -179 43 -182 -61 -116 -304 16 -4 63 -174 94 20 -42 16 133 33 -21 201 16 106
7700 106 -75 67 -172 170 -13 -72 212 105 -193 56 99 68 44 -103 289 343 -14 95 81 -169 -97 36
7722 36 -66 -191 208 28 170 227 23 2 317 -83 -85 87 142 -9 50 -261 -137 107 -73 -130 -77 34 55
7745 55 33 1 70 111 -139 129 107 75 158 -83 -50 -180 126 3 -9 84 111 121 200 -116 22 59 53 180 72 14
7771 14 -190 52 -52 158 -79 -59 -21 76 40 47 -78 -163 -3 70 -247 -95 -239 -69 -70 -209 37 80 -192 -74
7795 -74 87 98 234 28 75 135 -134 -2 -123 -152 139 49 14 -236 -272 -296 -47 272 -104 -80 141 -76 73
7818 73 -152 -105 74 249 5 171 -38 -13 104 324 -155 136 -83 26 -34 210 -140 -92 20 68 -95 -177
7840 -177 234 -184 -85 4 178 98 -159 62 72 -123 -98 -52 -6 26 161 27 178 46 45 20 -41 144 48 -173
7864 -173 -141 0 -143 -222 8 -36 -173 91 228 202 -6 -1 -6 145 57 -130 203 195 -28 -227 -126 -78 30 112
7888 112 64 29 135 -18 -25 -147 11 21 -71 239 -64 -146 -30 -1 31 64 -132 74 41 248 208 -140 -36 142
7912 142 52 28 141 -47 106 77 252 107 74 -18 -138 5 -148 -245 101 111 -154 28 24 -116 43 -109 -42
7935 -42 32 49 -230 -134 -38 22 202 -325 -51 128 21 98 -136 186 22 -47 224 -194 43 117 -34 75 -93
7958 -93 -36 -87 1 83 177 64 -145 243 -13 -53 -181 133 -128 -68 107 -48 -8 7 212 -12 -62 12 -34 83
7982 83 62 75 -106 -134 203 -235 -222 -96 -138 -63 124 -104 118 -37 203 -124 -42 146 -137 5 352 221 -98
8005 -98 -20 19 60 -5 29 166 -169 -109 41 -86 -193 54 -92 179 42 22 17 -54 -154 220 31 333 -14 55
8029 55 274 27 -121 25 23 -197 -263 -58 -102 128 48 305 97 -247 -65 -93 -21 -119 -171 -67 -54 116 -57 67
8053 67 58 84 -82 -49 -42 71 -97 -225 -32 93 116 76 124 29 34 40 131 -102 -159 50 132 227 27 198 -29 101
8079 101 -41 30 -5 162 -47 199 -133 -88 -129 100 -13 -100 -72 -39 -21 25 -67 -102 -261 72 -58 -106 -141 -89 109
8104 109 -44 30 -36 -65 -205 -8 214 -48 -135 62 44 -121 -66 -123 -62 3 74 -283 -64 -84 123 195 -19 34
8128 34 2 -37 -126 65 -203 -37 -5 -55 -211 -206 254 -137 101 254 34 -246 77 29 12 238 -109 -147 -92 -68
8152 -68 97 205 -28 69 -175 -246 -4 134 -75 -30 82 191 -70 -88 60 18 114 1 -141 85 -106 23
8174 23 95 -136 -10 228 205 -144 -69 -7 165 -117 39 -127 75 -85 -71 -89 -43
8191d3
$$ Imaginary data points
##PAGE= N=2
##DATA TABLE= (X++(I..I)), XYDATA
0 0 0 0 0 0 0 0 8 0 0 0 8 -8 8 -13 16 -22 26 -32 33 -40 54 -64 72 -85 98 -117 134 -154 174 -200 231 -262
32 -262 293 -330 373 -419 469 -523 580 -646 719 -797 881 -971 1075 -1186 1308 -1439 1582
49 1582 -1745 1924 -2119 2336 -2582 2861 -3179 3541 -3964 4466 -5069 5808 -6738 7949 -9592
64 -9592 11941 -15551 21726 -34183 68474 -342127 -920472 585381 442044 -715899 81382
75 81382 621751 -498837 -210435 762766 -221986 -789801 520173 489290 -652937 -41059
85 -41059 654835 -307828 -412199 519234 51056 -606447 230550 464871 -397236 -149733
95 -149733 487441 -177642 -458145 392798 262679 -546431 -44735 557585 -120385 -370809
105 -370809 265402 77983 -354680 200796 309943 -428432 -141183 582641 -25630 -540370
115 -540370 190056 322398 -322306 -42241 340003 -218796 -203498 426021 4249 -495468
125 -495468 171374 362407 -324788 -135121 383751 -88637 -303228 259383 125468 -348177
135 -348177 39837 287446 -173754 -116931 272219 -47070 -278349 170235 204542 -242746
145 -242746 -107467 249823 34236 -161288 55044 51295 -132862 41383 161150 -133256
155 -133256 -155555 213286 130523 -245246 -71846 207634 -42733 -143515 140355 34474
165 34474 -189814 107644 180852 -232697 -110620 282444 -23744 -248674 177089 155704
175 155704 -260457 157 261192 -153759 -174529 245783 25756 -238796 149142 160521
185 160521 -270243 -32388 293526 -113086 -235965 205588 112119 -219118 37392 155745
195 155745 -171092 -57718 231498 -63314 -225214 164740 164534 -210377 -61195 199087
205 199087 -54130 -140679 149832 54646 -189661 58816 185314 -154087 -121637 212290
215 212290 14396 -216420 106511 164229 -196683 -59557 224452 -75517 -187210 181273
225 181273 73136 -234798 72815 207241 -206315 -111881 269265 -29937 -247743 159791
235 159791 145503 -227534 12153 218975 -158120 -130709 250161 1353 -250638 131216
245 131216 177828 -208607 -50336 216314 -81293 -157158 172005 51730 -201390 60361
255 60361 164350 -150026 -87984 184675 -13304 -172431 97893 113428 -152879 -30455
265 -30455 162750 -58607 -129755 131462 62392 -165917 29798 162897 -111151 -108893 170484
276 170484 25194 -179195 74553 137523 -151804 -47796 185118 -61459 -159802 152164
286 152164 75938 -199527 31231 178352 -134645 -102386 187641 -12318 -181085 117595
296 117595 109879 -182496 -4241 185630 -98063 -126410 166981 33831 -175777 68336
306 68336 135362 -136286 -51835 162074 -36112 -135465 108669 74414 -144617 1188 137880
317 137880 -72425 -98190 116518 30529 -133052 37652 109070 -99965 -60777 131698 -9394
328 -9394 -130733 78123 91713 -128161 -22118 144686 -55098 -113001 124138 47994 -152149
339 -152149 41339 137514 -116695 -72534 160819 -15360 -150800 100927 91377 -153456 -3813
350 -3813 151434 -86646 -102838 141728 16832 -153891 66907 112016 -128900 -40065 144057
361 144057 -41592 -114704 104321 53848 -129190 21104 117773 -80958 -69292 119566 9742
372 9742 -119518 53380 92150 -95408 -39565 113177 -20478 -100969 73798 60589 -109751
383 -109751 -5648 113108 -58182 -88472 103658 31755 -125360 32886 106275 -92856
393 -92856 -54741 124112 -17507 -115653 88462 69821 -130319 5137 133646 -76415 -88594
404 -88594 128138 19107 -134459 59190 99784 -114060 -31405 130628 -45704 -105591 103720
415 103720 45524 -129795 22427 111692 -83289 -66296 111942 1746 -109040 55721
425 55721 71775 -94784 -15819 105147 -41384 -84566 88676 44685 -108094 10376 102628
436 102628 -58330 -65142 94816 12090 -100995 48573 78084 -96707 -30515 117613 -31892
447 -31892 -106800 85408 58432 -118642 5159 111003 -71988 -70319 112187 2668 -116397
458 -116397 65809 80365 -114891 -15925 128913 -52081 -99105 105186 42723 -117539 28725
469 28725 94709 -84247 -37820 113147 -28156 -104707 84999 65160 -115877 -11045 110019
480 110019 -45308 -76819 80212 20020 -94015 35530 75862 -82852 -39031 104090 -10945
491 -10945 -98068 58315 65841 -88951 -14890 97673 -36453 -73758 79683 29809 -94984
502 -94984 31297 83471 -84319 -42421 116755 -12881 -114700 65390 77203 -98631 -17935
513 -17935 95990 -50609 -63881 98856 4749 -118306 54809 97029 -100466 -49103 112796
524 112796 -11761 -89595 65815 41036 -92698 20977 90154 -71215 -54673 101841 5838
535 5838 -99500 46687 73351 -81744 -28786 92196 -20161 -76121 58251 35665 -80590
546 -80590 13571 76081 -64853 -54023 96255 14775 -105652 25898 84436 -59251 -40006
557 -40006 73550 -16305 -61907 70738 30598 -101561 16912 105464 -58673 -74146 87312
568 87312 23583 -86921 34777 59944 -78696 -12855 92952 -41473 -77627 81636 33887
579 33887 -101209 17059 87827 -64112 -53924 85091 5084 -79838 39534 47498 -68833
590 -68833 20 77159 -46163 -61764 81221 33926 -90424 3868 77788 -33376 -41107
601 -41107 53760 -4369 -55273 49377 40526 -81502 -12914 90943 -23237 -78594 51272
612 51272 42017 -68937 2264 62346 -47492 -38084 74965 -2279 -78760 45201 58022 -76063
624 -76063 -16606 87495 -26844 -70637 62819 36235 -73014 11665 60318 -52452 -23669
635 -23669 77876 -21269 -79696 59495 57195 -80817 -21541 75160 -20026 -50138 49220 7837
647 7837 -63790 33471 55540 -66770 -32314 80559 -282 -72815 32956 48141 -53184
658 -53184 -10130 60336 -25889 -45487 56446 18376 -67661 19424 60725 -52565 -35642 73065
670 73065 360 -73529 32905 49472 -57510 -11837 59799 -33864 -44337 67533 9973
681 9973 -83566 27186 72697 -57502 -41071 70343 -1106 -58556 42248 29576 -65822
692 -65822 12118 69487 -47070 -47935 70684 15121 -71514 22630 52529 -50685 -19958 60631
704 60631 -17886 -51840 46913 24201 -64177 8713 60191 -42070 -42704 61379 11896 -64701
716 -64701 19906 48699 -44734 -17768 56754 -17331 -48836 50697 28233 -67847 4487 68058
728 68058 -33906 -45965 54781 12115 -56714 25770 40326 -55239 -10636 65158 -25606 -56115
740 -56115 52624 26369 -66513 8400 56942 -41310 -32187 58197 -3318 -56006 36667 36321
752 36321 -57614 -4259 62002 -26311 -46109 50629 20513 -55869 11250 46870 -35769 -22729
764 -22729 49632 -6861 -47376 33715 31126 -51519 -7709 52687 -19488 -41730 38747 16494
776 16494 -48433 10658 41740 -36642 -23369 50898 -3370 -50273 30631 36125 -47749 -9226
788 -9226 53158 -18001 -40002 41928 16966 -50376 13733 44432 -38622 -23040 51790 -5598
800 -5598 -49626 31029 30388 -48155 -4603 47591 -24561 -34379 42680 8718 -49528 17490 39742
813 39742 -38829 -18937 48615 -6427 -43503 30679 27753 -43233 -2335 45202 -20812 -32213
825 -32213 39812 12045 -45707 12996 39146 -33508 -21349 44484 -3853 -43216 26345 27064
837 27064 -43373 -4436 44987 -22230 -34769 40938 11699 -48233 14436 40157 -37074 -18984
849 -18984 48877 -7564 -43777 33134 27314 -46338 365 46823 -25736 -30892 43780 6939
861 6939 -47168 19514 35854 -39349 -14387 45539 -12114 -39655 31899 19590 -43827 3779
873 3779 39981 -27164 -25935 40418 3575 -42274 19543 32130 -35852 -11745 43011 -10137
885 -10137 -35845 30811 20135 -40159 3428 39427 -24139 -25613 39102 5075 -42218 17558
897 17558 31929 -35773 -13230 41356 -11773 -35999 30368 17115 -41936 5405 38252 -27787
909 -27787 -23680 40791 1262 -40740 21427 28721 -36442 -6286 41661 -15072 -31391 33774
921 33774 13947 -40022 9277 35807 -27933 -20128 38436 -885 -37697 20077 25097 -34487
933 -34487 -7064 36276 -14610 -29652 29585 12226 -37703 7219 33323 -25436 -19878 36484
945 36484 673 -35513 19759 25791 -32883 -5392 38308 -14330 -29548 31942 13291 -39080
957 -39080 8732 34697 -27317 -19747 37428 -2042 -36830 21666 22847 -36125 -3620 36637
969 36637 -18699 -27815 33390 8672 -38270 11769 31469 -28464 -14008 36140 -5811 -31111
981 -31111 25293 18037 -34451 2566 35113 -19896 -23724 33096 6839 -35498 12144 27570
993 27570 -26964 -12560 32266 -7338 -29865 23319 16331 -34283 183 32905 -18259 -24202
1005 -24202 29621 7022 -32367 11643 25148 -25792 -9340 33465 -8740 -28309 26436 16448
1017 16448 -34144 2351 33259 -18762 -21421 29974 3506 -31414 14921 22557 -29112 -7340
1029 -7340 32837 -12021 -28521 25400 14284 -32565 1858 28365 -17760 -16975 26921 326
1041 326 -27357 16779 19763 -27507 -5127 32424 -9070 -26109 22690 14490 -27700 2616 25510
1054 25510 -17245 -14762 27480 -776 -29628 15692 22286 -27874 -9307 30425 -7637 -26326
1066 -26326 19945 12900 -27375 3615 24605 -19364 -14406 29513 -1011 -30046 17024 22486
1078 22486 -26924 -7438 29860 -7958 -22017 21702 8386 -27169 9165 24631 -23493 -13971
1090 -13971 30897 -1106 -30403 14554 19794 -24311 -5720 24912 -11482 -19352 22821 6244
1102 6244 -28475 8350 25175 -20961 -14675 27802 1082 -25925 13647 17896 -21961 -2651
1114 -2651 24934 -11994 -18290 24539 6709 -29670 7642 26390 -20288 -16164 25644 393
1126 393 -24683 13777 13556 -24999 255 26648 -16053 -21393 26157 8685 -29346 6012 23785
1139 23785 -17964 -10675 24258 -4043 -21012 18530 12576 -25961 2196 27093 -14848 -18894
1151 -18894 24008 6484 -25777 7053 19467 -18612 -7937 22864 -7160 -21241 19230 11185
1163 11185 -27421 412 26417 -13002 -19217 20587 6563 -22062 8022 16834 -19216 -5264
1175 -5264 25563 -7127 -22523 19420 14416 -24679 -896 23986 -11572 -15144 20503 1810
1187 1810 -22685 11766 16464 -22943 -5759 25870 -8144 -22795 18125 12246 -24187 746
1199 746 21383 -13511 -12355 21102 -434 -21527 14249 16390 -22106 -5285 25455 -6165 -19974
1212 -19974 16484 10172 -19948 3332 17812 -15347 -9932 22168 -1957 -23271 12704 16235
1224 16235 -20814 -6552 22043 -6889 -17659 15995 7027 -21037 4896 19185 -15988 -10807
1236 -10807 22845 163 -22168 11989 16243 -18475 -4471 20963 -6806 -14682 17092 5130
1248 5130 -20816 6793 18294 -17310 -10415 21567 -1003 -21035 11070 12595 -18613 -2138
1260 -2138 18730 -10208 -14281 18358 4525 -21655 6325 18778 -14923 -9900 19926 -313
1272 -313 -17745 11433 11721 -17010 -892 18933 -9110 -13950 17771 5345 -20760 4963 17057
1285 17057 -14200 -9452 18218 -1933 -17683 11384 10432 -18903 -795 19243 -10156 -15110 17655
1298 17655 5726 -20023 5299 16753 -14053 -7482 19303 -2635 -16975 13343 11082 -18641
1310 -18641 -111 19219 -9682 -13737 17070 3942 -19022 6222 14369 -14990 -6622 18687
1322 18687 -4721 -17115 13165 9271 -19071 290 18250 -10235 -12788 16931 3737 -18111
1334 -18111 7409 15023 -14862 -6060 19141 -3520 -15863 13301 9798 -17977 594 17630
1346 17630 -10351 -11928 16606 2319 -18392 7403 13393 -15869 -5605 18564 -5529 -16115
1358 -16115 13769 8308 -18277 1811 17197 -11478 -10290 17727 1309 -17247 9224 13013
1370 13013 -15655 -3525 18484 -5884 -14122 14315 6926 -17658 2893 15548 -11473 -9397
1382 -9397 16114 -302 -16665 8823 10629 -16079 -3061 17047 -6728 -14079 13373 5888 -16786
1395 -16786 3762 14837 -11504 -8143 16630 -454 -15611 10221 11231 -15223 -2123 16958
1407 16958 -6334 -12529 13464 5099 -16354 3911 13625 -12130 -7469 15536 -2285 -15391 9840
1420 9840 9172 -15545 -1636 15257 -7461 -11473 13289 3424 -15322 5365 12672 -11793 -5645
1433 -5645 15954 -1850 -13960 10224 9250 -14154 -630 14750 -6916 -10449 12928 2918 -14958
1446 -14958 4572 11722 -11981 -6155 14121 -2689 -13820 9053 7996 -13960 -753 13850
1458 13850 -7298 -9706 12908 2561 -14536 5690 12155 -11724 -4995 15019 -2414 -12851
1470 -12851 9754 8022 -13472 141 13374 -7694 -9028 12754 1642 -14434 5381 10714
1482 10714 -11543 -5192 13395 -2933 -12199 9441 6446 -13393 698 12441 -7800 -8307 12805
1495 12805 1576 -13423 5828 10885 -10608 -4076 13753 -2654 -11492 9525 6575 -12741 941
1508 941 12452 -8155 -8462 12432 1200 -13958 5011 9998 -11246 -4494 12603 -3696 -11268
1521 -11268 9504 5163 -12850 1907 12069 -8515 -7682 13015 1362 -12625 6411 9916 -10959
1534 -10959 -2777 12802 -4015 -10031 10475 4473 -13128 2189 11893 -8799 -7705 12222 244
1547 244 -12446 5528 7910 -10732 -2044 11811 -5246 -9993 10263 4199 -12796 2596 11954
1560 11954 -7980 -6538 11844 647 -11123 6657 7955 -10680 -942 12518 -5575 -9983 10874
1573 10874 4291 -12951 2235 10638 -8068 -6431 10797 -1071 -10780 7020 6696 -11909 -902
1586 -902 12427 -5662 -9545 10225 4228 -11410 2690 9564 -7637 -3831 11275 -1836 -10048
1599 -10048 8471 6709 -11746 -603 11884 -4949 -8664 9205 2685 -10589 3035 8056 -9179
1612 -9179 -3675 11221 -2868 -11034 7863 6828 -11064 -1042 10770 -4605 -7311 8919 2103
1625 2103 -9961 4885 8209 -9351 -3111 11994 -2191 -10500 7244 6570 -9981 -616 9464
1638 9464 -5347 -6361 9397 233 -11063 5273 8019 -9997 -4103 11442 -2019 -10077 6504
1651 6504 5296 -9122 568 8595 -5988 -4988 10072 457 -10336 5145 8590 -8600 -3465
1664 -3465 10067 -1731 -7812 6376 3636 -9167 1842 8776 -7325 -6134 10038 617 -11250
1677 -11250 3810 7979 -8075 -3662 8933 -2475 -7456 6758 3015 -9529 2196 9509 -6611
1690 -6611 -6214 9824 1690 -9316 3822 7169 -6876 -1666 8764 -3528 -6782 8455 3066
1703 3066 -10451 1686 9463 -6390 -6118 8448 806 -9117 3963 5634 -8221 -1177 9117
1716 9117 -4020 -7628 8159 3946 -9843 1404 9096 -5298 -4928 8230 344 -7685 5380
1729 5380 5034 -8695 -595 9822 -4198 -7775 7771 3783 -9360 1147 7796 -6147 -4534
1742 -4534 8290 -1202 -8187 5827 5435 -9433 -1211 9604 -3703 -7381 7543 3121 -8110
1755 -8110 2328 7303 -5918 -2916 8854 -1772 -8001 6267 5383 -8866 -760 8666 -3684
1768 -3684 -6417 6923 1398 -8089 2747 6110 -7155 -3076 8750 -1812 -8250 5545 5065 -8061
1782 -8061 -666 7815 -3518 -5164 7131 1372 -7730 3556 6850 -6534 -2742 8627 -1504
1795 -1504 -7414 5339 4414 -7429 272 7351 -4567 -4892 7027 561 -8378 3161 5972 -6896
1809 -6896 -2934 7843 -1640 -6934 5421 3814 -7015 757 7311 -4411 -4420 7428 886 -7511
1823 -7511 3327 6081 -6091 -2210 7190 -1638 -6047 5274 3151 -7240 754 6466 -4820 -4673
1837 -4673 6844 342 -7555 3147 5049 -6433 -2252 7196 -2021 -5832 5595 3090 -7038 913
1851 913 6854 -4364 -4036 7248 777 -7159 3527 5346 -6353 -1867 7092 -2146 -5989 5235
1865 5235 2528 -6979 1092 6032 -4989 -4018 6812 -346 -7051 3547 4450 -6228 -1490 6757
1879 6757 -2696 -5330 5942 2586 -6961 1779 6480 -4572 -3222 6994 55 -6428 3956 4440
1893 4440 -5862 -675 6732 -2799 -5151 5551 1800 -6914 1614 5652 -5003 -3508 6321 -992
1907 -992 -6233 3833 3504 -6333 -160 6322 -3393 -4626 6095 1860 -6402 2223 5659 -4683 -2449
1922 -2449 6371 -800 -5332 4319 3272 -5961 75 6032 -3412 -4673 5369 937 -6380 1926 4628
1937 4628 -4724 -2131 5644 -1354 -5316 4329 3073 -5907 298 6101 -3281 -4008 5522 1625 -5566
1952 -5566 2423 4913 -4536 -1690 5933 -1372 -5211 4330 2765 -6001 -41 5564 -3087 -3870 4955
1967 4955 386 -5757 2157 4112 -5468 -1772 5808 -1562 -5049 4212 2926 -5627 527 5673 -3112
1982 -3112 -3200 5511 755 -5428 2902 4472 -4720 -1535 5937 -1577 -4936 4419 2544 -5528 216
1997 216 4778 -3561 -3320 5190 -99 -5617 2726 3596 -5079 -1361 5569 -1741 -4675 4381 2284 -5280
2013 -5280 1151 4762 -3552 -2568 5684 44 -5199 3251 3764 -5004 -1069 5521 -2207 -4392 4207
2028 4207 1547 -5422 749 4237 -3656 -2731 5114 -431 -5174 3108 3487 -5008 -596 5039 -2179
2043 -2179 -3788 4174 1884 -4865 1517 4543 -3813 -2054 5413 -249 -4584 3016 3242 -4676 -695
2058 -695 4806 -2209 -3639 4059 907 -5249 1298 4014 -4025 -2235 4762 -189 -4825 2909 2911 -4354
2074 -4354 -323 4522 -2231 -2955 4356 804 -4662 2120 4400 -3869 -1945 4745 -246 -4251 2898
2089 2898 2298 -4573 -43 4369 -2938 -3336 4199 515 -5094 1602 3556 -3662 -1809 4222 -778
2104 -778 -3812 2873 1979 -4308 688 4286 -2764 -2720 4454 732 -4368 1904 3597 -3114 -1242 3866
2120 3866 -1060 -3464 3281 1701 -4381 438 4088 -2955 -3284 4005 597 -4369 1294 2860 -3075
2135 -3075 -1084 3965 -1318 -3398 3463 1601 -4513 656 4372 -2344 -2564 3836 383 -3526 2100
2150 2100 2610 -3509 -505 4026 -1660 -3730 3537 1679 -4338 -95 3455 -2252 -2531 3250 21
2165 21 -3628 2027 2337 -3687 -147 4055 -1311 -3471 2919 2126 -3680 425 3424 -2347 -1531 3463
2181 3463 -288 -3640 2533 2742 -3803 -949 3900 -1304 -3550 2552 1586 -3584 483 2857 -2841
2196 -2841 -1681 3891 -746 -3934 2552 2635 -3412 -716 3887 -1007 -2435 2848 1064 -3174 1460
2211 1460 3109 -3190 -1415 4166 -271 -4017 2276 2689 -3256 -547 3165 -1823 -2405 3051 457
2226 457 -3924 1304 2811 -3320 -1803 3635 -329 -3546 1783 2216 -3096 -136 3126 -1796 -1947 3733
2242 3733 669 -3377 1526 3196 -2737 -1435 3568 -351 -2938 2041 1440 -3247 229 2966 -2368
2257 -2368 -2221 3275 463 -3871 1021 2718 -2574 -1295 3087 -704 -2517 2337 1196 -2928 606
2272 606 3234 -1884 -2243 3224 875 -3177 1061 2431 -2578 -792 2890 -1294 -2526 2326 1058
2287 1058 -3493 414 3003 -2006 -2155 2707 333 -2916 1061 2018 -2593 -215 3109 -974 -2411
2302 -2411 2354 1546 -2812 69 2893 -1163 -1660 2850 353 -2623 1562 1940 -2472 -467 3125 -1240
2318 -1240 -2600 2236 1273 -3043 209 2493 -1864 -1705 2465 -81 -2775 1441 1989 -2735 -534 2875
2334 2875 -765 -2124 2364 1554 -2693 594 2626 -1767 -1108 2744 -14 -2517 1624 1858 -2572 -588
2350 -588 2783 -912 -2379 2114 911 -2854 540 2389 -2142 -1348 2907 -105 -2717 1538 1751 -2811
2366 -2811 -380 2993 -953 -1790 2219 1013 -2315 622 2422 -1496 -1202 2713 -475 -2585 1650
2381 1650 1605 -2427 -252 2618 -1314 -2098 1925 490 -2723 945 1888 -2049 -918 2617 -164 -2463
2397 -2463 1778 1690 -2620 -80 2632 -1265 -1720 2094 554 -2587 1248 2286 -1724 -1023 2439 -405
2413 -405 -2466 1627 1356 -2268 -98 2202 -1436 -1701 2103 67 -2551 1002 2116 -2284 -868 2821
2429 2821 -609 -2355 1824 1352 -2474 277 2193 -1208 -1533 2444 370 -2503 926 1736 -1916 -780
2445 -780 2454 -744 -1994 1433 1035 -2587 284 1765 -1498 -1505 2428 -160 -2273 891 1454 -1953
2461 -1953 -631 2222 -712 -1629 1920 952 -2040 585 2181 -1412 -1269 2062 188 -2035 905 1416
2477 1416 -1760 -383 2085 -811 -1716 1763 543 -2391 473 1902 -1463 -1383 1832 -15 -2007 926
2493 926 886 -2021 -23 2136 -797 -1703 1928 970 -2098 566 2084 -1532 -985 2176 -104 -1905
2509 -1905 986 1319 -2005 -152 2052 -945 -1693 1604 639 -2193 241 1682 -1717 -997 1877 -93
2525 -93 -1825 1186 1299 -1550 -12 2368 -843 -1351 1792 759 -1949 614 1797 -1446 -860 1854
2541 1854 -388 -1969 1298 1399 -1932 -569 1742 -1022 -1332 1523 466 -1816 469 1404 -1311 -799
2557 -799 1984 -212 -1516 1429 1260 -1728 124 2195 -757 -1272 1551 282 -1773 729 1394 -1282
2573 -1282 -828 1928 -387 -1879 1125 1254 -1542 -323 1618 -1174 -1405 1562 265 -1630 666 1397
2589 1397 -1662 -308 1787 -458 -1275 1396 1086 -1418 256 1938 -1016 -946 1721 182 -1589 930
2605 930 1465 -1660 -666 1573 -495 -1734 972 699 -1600 83 1390 -1082 -892 1521 31 -1765
2621 -1765 750 1202 -1491 -506 1700 -334 -1205 1256 718 -1487 115 1593 -1098 -1130 1748 187
2637 187 -1842 777 994 -1470 -716 1325 -477 -1193 800 379 -1668 185 1318 -1381 -905 1281
2653 1281 223 -1525 1067 1180 -1038 -295 1380 -713 -754 1566 599 -1558 406 1661 -1060 -801
2669 -801 1658 87 -1378 699 787 -1201 -367 1559 -897 -1223 1297 127 -1605 203 1315 -1040
2685 -1040 -798 1205 218 -1317 701 930 -1260 49 1608 -640 -1021 1370 468 -1440 166 1284
2701 1284 -880 -641 1385 -254 -1261 597 785 -1716 -282 1360 -787 -1233 1155 479 -1456 329
2717 329 1212 -1101 -632 1531 -13 -1202 944 914 -1364 -60 1606 -465 -916 1285 455 -1406 347
2734 347 928 -1259 -360 1263 -397 -1524 763 721 -1590 -328 1367 -715 -860 1088 6 -1310
2750 -1310 732 1222 -1067 -477 1506 -446 -1224 905 730 -1094 160 1076 -485 -796 1185 123
2766 123 -1137 619 914 -1267 -791 1146 -387 -1201 623 714 -840 83 853 -969 -501 1175 76
2783 76 -1397 474 885 -987 -378 1161 -10 -804 786 189 -1049 238 1058 -1073 -557 1162 82
2800 82 -1219 663 936 -972 -437 1101 -281 -862 932 507 -1271 152 1008 -990 -765 1042 74
2817 74 -1131 530 935 -740 -273 1121 -480 -733 807 345 -1080 282 1013 -756 -514 1134 -49
2834 -49 -1217 538 477 -824 -117 1207 -682 -1047 713 16 -1274 196 1087 -871 -489 1322 -12
2851 -12 -1006 838 783 -835 51 996 -340 -742 934 205 -1053 456 854 -744 -486 948 -229 -839
2869 -839 730 323 -1232 -234 1035 -491 -791 1093 168 -1011 415 808 -919 -353 797 44 -765
2886 -765 638 727 -1015 43 949 -615 -640 1108 175 -696 438 455 -1053 -355 936 -579 -1254 703
2904 703 507 -1022 37 1046 -709 -687 802 91 -972 394 894 -630 -153 1176 -343 -795 842
2921 842 511 -820 57 1201 -509 -477 919 -223 -915 485 705 -733 -310 886 -454 -942 461
2938 461 206 -922 16 850 -739 -291 767 156 -931 499 584 -813 -139 1030 -143 -719 1007
2955 1007 531 -759 265 557 -544 -447 783 38 -926 571 522 -955 -349 456 -522 -480 680 284
2973 284 -813 230 761 -576 -313 967 73 -932 645 733 -764 -140 1028 -229 -638 652 170
2990 170 -624 211 768 -425 -406 747 -2 -729 -81 171 -815 -137 688 -584 -661 645 41 -1009 319
3009 319 597 -626 -286 758 -13 -828 230 657 -527 -25 895 -123 -474 665 153 -867 76 421
3027 421 -764 -562 789 -91 -526 600 418 -964 -83 779 -470 -373 662 9 -781 264 391 -712
3045 -712 -86 926 -249 -531 732 300 -452 87 647 -373 -258 752 182 -941 275 387 -588 -10
3063 -10 584 -390 -702 613 -117 -667 -123 671 -309 -387 590 3 -707 399 561 -516 -100 710 -343
3082 -343 -498 563 360 -583 141 606 -400 -373 528 -168 -523 81 498 -696 -254 549 -53 -692 685
3101 685 303 -899 49 571 -535 -281 592 31 -586 184 459 -571 3 690 -288 -462 421 103 -654
3120 -654 99 628 -548 -238 606 -56 -389 291 345 -552 -225 357 -198 -598 412 332 -635 -138 388 -222
3140 -222 -233 708 56 -361 504 387 -480 162 767 -197 -499 432 -292 -552 339 568 -405 -296 570 -132
3160 -132 -710 390 152 -723 -145 447 -328 -494 650 133 -590 412 478 -480 -30 609 -157 -437 494
3179 494 400 -635 -38 600 -278 -464 519 56 -526 87 377 -673 -147 480 -157 -672 230 496 -470 -39
3199 -39 717 -303 -413 673 94 -703 179 395 -603 -167 788 138 -588 308 286 -425 222 480 -307 -539
3219 -539 630 220 -404 335 316 -574 -232 800 -200 -514 93 103 -569 169 363 -349 -124 519 -318 -364
3239 -364 413 207 -533 -159 523 -125 -344 387 102 -543 151 412 -429 -353 526 107 -515 386 341 -452 -20
3260 -20 434 -250 -250 239 174 -518 89 467 -370 -256 457 -34 -331 128 113 -469 46 567 -447 -378 293 -197
3282 -197 -476 421 149 -341 -59 470 16 -454 339 173 -540 108 417 -273 -464 515 60 -139 164 495
3302 495 -106 -95 437 -192 -84 408 185 -132 -134 388 -378 -199 485 -202 -511 249 201 -280 19 575 -40
3323 -40 -771 167 362 -414 188 290 -182 -166 234 30 -230 220 410 -726 -336 633 -286 -147 440 192
3343 192 -433 133 322 -229 -117 287 11 -434 190 -20 -350 -113 538 -169 -413 312 -230 -359 -26 435
3363 435 -355 63 278 45 -361 317 178 -210 -14 497 -75 -338 343 243 -429 186 467 -7 -131 494
3383 494 -164 -415 411 561 -506 -226 311 -139 -242 191 -29 -526 117 204 -295 -325 466 222 -326 260
3403 260 441 -191 369 510 -88 -123 289 42 -592 128 237 -444 -300 372 -14 -704 389 251 -328 -259
3423 -259 560 -146 -217 334 92 -343 -103 112 -371 -380 404 -65 -197 390 307 -191 -45 247 -112 -463 482
3444 482 147 -567 475 3 -594 -221 320 -120 -502 58 233 -565 -55 357 -248 -165 475 -31 -435 187
3464 187 234 -353 -204 354 82 -192 310 426 -309 -106 273 -164 -120 375 -56 -240 316 373 -361 -278 113
3485 113 -93 -302 348 19 -260 -12 351 -260 -89 291 -57 -392 162 368 -151 31 414 -264 -129 236
3505 236 244 -148 116 268 -89 -247 609 -112 -128 415 96 -200 -119 478 -3 -160 33 160 -500 -167 510
3526 510 -219 -300 280 174 -157 226 231 -121 -199 433 1 -81 310 -21 -278 208 287 -238 -119 97 -320 -339
3548 -339 139 67 -494 -296 283 -398 -372 320 -4 -410 398 94 -122 -27 438 -80 -512 27 125 -386 226
3569 226 407 71 -339 359 49 -198 67 223 -571 -83 441 -276 -425 115 104 -383 46 49 -40 -8 257 -44
3591 -44 -249 223 282 -50 -58 222 -98 -226 144 172 -91 16 277 -134 -330 171 91 -224 -77 120 -178 -81
3613 -81 288 -181 -578 -185 -37 -270 14 139 -376 -254 152 124 -190 98 104 144 -209 156 181 -333 375 107
3635 107 -232 72 168 -322 -224 185 208 -361 115 12 -163 -283 430 -53 -375 146 43 -272 87 75 -264
3656 -264 -58 255 15 -246 351 289 -64 -52 232 -24 -64 169 45 -275 176 129 -267 92 61 -257 -300 242
3678 242 -34 -386 50 243 -38 -96 195 -196 -337 -145 -69 -98 165 327 169 1 77 244 -284 118 333
3699 333 -383 -11 280 -82 -205 198 251 97 -126 231 55 -496 63 -210 -385 -5 202 52 -104 66
3719 66 131 -145 -253 332 8 -61 171 -138 -393 456 132 -522 -62 407 -191 -127 298 -76 -192 11 255
3740 255 -282 -317 308 -131 -286 257 -177 -239 -137 138 -245 -221 14 148 -183 -45 -219 1 191 82 -75
3761 -75 -266 281 118 -8 54 392 -180 -30 322 173 -79 33 -9 -262 108 171 -292 -170 -61 25 -388 38
3783 38 386 -146 -160 321 -22 -35 295 246 -200 139 41 -192 -124 116 177 -350 83 248 -424 -157 -93 -367 -139
3806 -139 -75 -90 -566 -106 179 -186 14 -28 108 -231 -11 30 -321 -103 405 -20 -56 292 95 171 -22 153
3828 153 -81 -75 230 132 -275 78 205 -261 -134 76 -295 -333 -95 -6 -225 -167 74 -194 -472 38 -189 -287
3850 -287 -68 34 -340 -68 235 55 224 52 185 -263 -27 241 53 -49 142 -135 97 227 374 -229
3870 -229 -171 36 81 319 225 21 -228 -131 314 -228 -249 111 79 -228 3 251 -67 -28 386 -148 -88 291 41
3893 41 -159 -16 13 -184 -345 93 85 -444 -122 -18 -203 -106 192 113 -104 246 -97 -90 -79 198 -157 -55 274
3916 274 -83 -145 338 57 -139 41 136 -119 -135 86 -61 63 -169 7 11 -108 110 26 58 57 26 -233 -87
3939 -87 112 -173 -45 58 107 -45 -30 76 -20 -8 -58 -11 -72 -92 15 -117 3 218 -148 117 10 -264 -268 -30
3963 -30 54 -119 -221 -49 30 -74 61 -29 -68 -28 8 -214 159 160 326 -203 271 85 -301 3 125 252 -122
3986 -122 115 -127 83 54 175 -69 -157 112 70 -241 95 93 55 6 96 -107 -74 85 130 -263 -21 51 -133 97
4010 97 206 -84 -361 -132 173 -208 67 -41 57 -152 68 119 -241 -19 -9 -108 -34 75 120 -251 171 134 -24
4033 -24 50 -23 -136 -143 113 227 -92 10 57 -117 -132 453 -89 -124 420 241 -114 -162 111 70 -67 118 52 -325
4057 -325 174 108 -209 -106 132 -8 -268 190 -65 -4 -101 -51 -180 -118 -13 -19 -169 237 -45 -77 -49 72 81 34
4081 34 185 142 -95 1 134 15 160 323 -2 -34 141 133 -71 -69 132 227 64 72 116 -2 -52 20 -245 -254 50
4106 50 -112 -82 161 85 -114 -191 -164 161 -311 -128 46 -36 158 358 -3 -33 -276 127 -10 -20 74 -68 -32
4129 -32 -179 -544 33 0 129 141 109 67 72 -66 -113 199 -252 55 -22 -24 0 106 122 -192 -166 -20 -61 29 -119
4154 -119 10 -94 60 140 -35 197 37 137 7 64 -103 -125 -16 -137 -192 63 -80 -196 -143 115 207 361
4176 361 65 32 -192 -192 111 -227 -265 70 -1 -9 87 264 84 -39 271 -201 -166 -142 121 -109 -97 76 -148 99
4200 99 150 114 -208 99 334 142 166 347 -139 -208 153 178 207 -90 53 25 -121 262 -96 -30 154 -56 136
4223 136 -81 96 198 199 156 189 220 46 3 -212 -62 62 239 -195 -29 -8 212 -158 113 57 -17 150 288
4246 288 -123 76 107 -198 -174 36 105 114 -6 160 -95 -137 276 69 208 224 -183 -232 -183 -22 122 -16 -44
4269 -44 4 29 58 27 -61 64 398 -56 -11 -139 18 -138 -94 269 -292 -187 -54 74 -241 57 35 -147 -99
4292 -99 176 93 -78 96 -12 -90 5 315 31 -216 83 102 -107 107 154 16 -146 158 159 -251 214 -249 -102
4315 -102 88 -2 -96 -395 368 38 -269 -23 -8 -324 39 25 -152 -22 87 -31 -188 -9 -8 63 -125 103
4337 103 -155 1 139 432 -88 139 111 -208 49 138 24 -62 -180 264 -287 -166 58 14 -77 132 135 -183
4359 -183 -172 -157 -113 -124 137 15 71 121 408 -205 210 -20 -100 -170 124 43 -215 -53 59 -11 111 143 34 -33
4383 -33 -88 -100 -236 -193 -164 -41 -48 92 -165 -253 4 136 -166 -250 -27 -36 -211 155 -110 -180 36 104 -11 85 -1
4408 -1 -105 -44 79 -108 -143 97 32 75 -189 -150 9 21 -105 -208 -7 -67 341 115 -340 -27 219 -379 -324
4431 -324 157 -59 16 -45 95 7 -92 371 102 -165 161 154 -187 -38 -172 -184 431 170 46 15 69 71 -89 67
4455 67 172 -98 -180 373 63 -134 178 82 88 -278 97 -70 -126 262 20 -251 281 230 -121 -219 -244 18 -29
4478 -29 206 84 -97 -186 8 140 -16 -185 -121 -273 -122 37 -75 -136 -143 160 -136 89 -13 -48 -133 48 68
4501 68 -32 80 -15 -134 70 455 15 -100 -63 102 -265 -67 5 -167 82 95 22 -137 217 -17 -255 -34
4523 -34 69 -59 -151 86 -226 177 -57 -166 27 305 -70 169 119 -86 172 -196 97 -112 -94 -66 9 37
4545 37 -378 -140 80 -107 92 -191 110 -149 -95 -56 -78 -93 120 -30 59 -79 47 -212 -66 -39 171 -212
4567 -212 303 -166 -229 184 318 -122 -24 -108 19 -101 -77 315 108 164 91 -310 33 33 -116 -325 106 -172 -440
4590 -440 51 159 -6 107 -104 -51 -184 252 21 -12 -169 9 -40 -198 279 39 87 156 -78 -81 -323 165
4612 165 -107 35 78 217 -222 -251 112 -70 -139 -41 -78 87 58 146 5 -236 -26 -77 92 144 263 296 -69
4635 -69 82 59 -141 -13 204 -169 -54 -184 -112 -14 319 -130 -169 6 1 -161 28 -75 36 -188 52 97 -172
4658 -172 254 -85 -181 127 97 -29 193 114 -122 23 55 -138 71 23 279 -55 76 85 160 -221 -55 324 -87
4681 -87 -44 49 -22 -173 21 -89 -40 102 -199 -94 -38 -56 86 -26 111 1 -16 262 -229 -155 -33 259 132
4704 132 21 130 271 136 -171 245 18 132 -5 157 -254 -185 198 -2 -170 -116 27 94 -46 -178 -15
4725 -15 -54 95 120 55 263 240 -59 61 6 68 -147 -20 -287 41 -38 144 -54 148 -9 169 -232 0 -30
4748 -30 147 -61 -217 128 15 -133 50 -10 -369 351 -69 -202 -54 202 -216 -103 48 -126 13 -169 -181
4769 -181 -166 22 -174 140 -12 -38 -29 -115 -43 -213 -334 63 -96 -35 23 200 137 -217 -63 29 -48 -34 178 94
4793 94 -74 35 269 -34 -248 321 -317 -24 239 -25 -109 -5 -5 5 90 -51 109 -30 -105 140 -96 1 -43
4816 -43 -234 96 -76 -202 -12 117 48 48 185 195 55 55 182 24 196 148 68 -174 -11 205 -15 175 -83
4839 -83 100 125 83 -150 118 12 -28 111 -156 114 -42 -13 190 21 -88 -76 108 -39 -130 -59 190 214 -223
4862 -223 172 160 -146 -81 -138 -286 56 -46 59 -123 59 92 109 24 -61 -40 -223 -45 -46 -77 -82 201 -21 57 169
4887 169 -16 -47 -325 0 93 117 -144 121 207 7 126 284 -128 -133 -59 108 -322 16 -93 50 84 -222 -67
4910 -67 116 -220 -184 149 67 -31 -19 -56 -71 -156 -52 50 -117 -168 335 -14 19 47 -106 305 75 23 13 -5 47
4935 47 -7 154 22 -41 -56 -295 141 -37 98 228 -176 -119 209 -19 -8 -44 47 46 -14 -155 -42 83 -117 85
4959 85 3 301 166 -3 268 101 188 -186 92 -83 6 -207 282 -35 16 121 -61 132 55 -73 -15 166
4981 166 128 65 -146 -152 234 15 -9 204 244 30 -123 -43 -231 -72 238 58 -39 130 -49 -169 -85 -98 -135 -88
5005 -88 84 -195 193 3 152 -50 64 483 -178 187 205 -88 -200 130 77 -125 3 43 66 12 94 14 -14
5028 -14 -75 -209 71 -53 57 -258 -15 -121 56 93 -200 188 -47 8 112 -180 -62 146 149 66 25 18 -72 152
5052 152 151 162 135 6 131 148 -31 140 41 90 89 230 52 -90 29 53 -339 73 150 209 -43 10 -307 131
5076 131 175 -120 -11 -35 -161 193 107 164 74 102 -163 -232 73 -227 254 -50 -15 -174 110 53 213 -104 -26
5099 -26 81 95 9 -78 328 -151 -166 35 63 125 -28 193 -141 175 79 118 -64 -168 295 -7 -32 -222 -100
5122 -100 150 74 -77 186 -77 -68 -62 -31 -42 103 -97 -164 -85 -153 -347 0 -11 -200 -7 114 -185 -142 101 -235
5146 -235 2 -3 139 112 395 65 -197 188 109 204 -94 41 188 -215 58 43 -6 126 -126 114 -222 -205 -310
5169 -310 -109 17 90 116 73 -83 -68 20 257 -15 -111 -76 198 139 281 -78 -47 -19 -63 -14 -23 88 1 -276 42
5194 42 146 -34 -173 -49 -1 -37 58 -179 -35 -205 -161 -42 88 104 9 -141 4 3 92 -111 -30 -152 47 120
5218 120 -35 134 14 64 -25 -115 141 -7 61 -109 -70 -68 -93 42 -206 -110 -293 36 -68 97 -118 47 54 -13
5242 -13 141 -24 -215 -144 194 31 71 163 -63 206 -265 22 164 -28 5 197 -47 -64 135 -179 -76 128
5264 128 -73 -210 71 -44 252 -12 -75 -86 2 170 -24 23 -72 -185 85 121 29 207 -12 65 57 88 -3 42
5288 42 204 58 77 -39 -67 13 146 82 -167 -39 -245 164 191 56 119 -45 168 39 -175 16 68 -45 -67
5311 -67 -63 399 14 -39 2 -106 -196 56 -217 112 -23 55 -131 -113 -76 -59 -98 172 -106 -84 214 -62 22 60 -1
5336 -1 -128 14 -194 -130 19 -230 178 12 -76 -168 -190 35 119 156 -52 -51 38 118 -90 145 -21 -109 82 -66
5360 -66 320 210 -23 23 -239 -36 38 -164 -70 122 -58 137 23 167 -119 118 -131 108 362 109 -69
5381 -69 -121 192 25 97 114 85 -37 193 56 17 176 88 -83 -55 19 18 -165 70 -40 -13 -58 -129 80 -86 56
5406 56 -13 -151 154 75 -67 -53 197 -146 -5 -38 8 80 105 86 49 -72 -117 -39 -92 48 -146 -182 72 -71 -65
5431 -65 -104 -35 80 -117 253 -22 37 -37 -16 -229 18 142 -73 -91 60 27 180 41 -84 -101 -29 -149 113
5454 113 -164 -152 124 197 -90 -38 50 -130 -245 -48 145 156 158 36 53 -8 48 72 -75 -58 -92 274 -169 138
5478 138 -22 51 -110 164 37 -28 8 -130 -59 57 -69 -143 -92 -173 84 -165 -91 82 25 -15 -35 142 281 68
5502 68 -16 109 -213 36 32 -178 -194 -29 94 105 -12 189 -31 -144 -101 -275 -6 48 22 -255 79 40 205
5525 205 186 -145 47 163 -210 -86 -55 -137 -176 41 -38 59 -99 -166 -92 167 12 -66 -63 -2 -52 -172 139 120 -143
5550 -143 -148 -94 -98 -69 -50 9 -268 -176 -99 24 -37 -22 109 -71 45 108 31 157 -50 12 -304 67 40 -94 -86 197
5576 197 -46 29 -185 175 245 254 239 105 1 -57 91 -144 163 -131 -317 -96 -149 241 80 69 -191 -202 52
5599 52 -108 -103 153 -64 36 -36 169 -108 -18 -77 -260 -36 51 31 196 -58 -22 184 -31 87 -131 -228 -55
5622 -55 136 -22 -226 41 190 143 -166 9 -66 157 -5 143 181 -119 168 -220 1 139 130 97 58 208 -81
5645 -81 224 -131 -40 -3 111 73 185 256 101 122 -28 -69 49 89 -65 -82 16 -223 -264 -38 281 -75 221 -56
5669 -56 -201 -82 -4 170 -17 -48 67 -166 137 -118 259 124 -46 72 -79 -11 -105 -77 85 37 -80 -132 -230
5692 -230 -4 -92 8 -183 10 -82 131 -225 -167 308 209 -105 -355 113 -94 -9 148 -164 -131 -43 9 21 -142
5715 -142 15 -70 -30 151 -41 -316 104 31 -133 -273 -68 -263 169 -29 74 228 -63 -202 -159 -37 34 91
5737 91 8 138 -19 -41 -65 40 52 12 -39 77 -164 -9 -80 -96 -22 -170 -80 -143 -111 83 -1 134 -15 107 10
5762 10 -44 72 177 127 -76 -33 86 106 -65 10 -177 -62 144 334 -208 -7 43 104 186 -187 -83 34 -216
5785 -216 146 41 -63 -148 -54 -53 -14 106 -106 208 30 83 -25 86 50 63 -22 72 12 201 -28 180 -35 92
5809 92 102 -9 -133 40 152 -229 -123 393 -49 94 36 204 -106 -140 -113 -63 -133 -45 239 -19 20 117 44 1
5833 1 140 -9 -96 -41 -185 -139 234 10 171 39 -216 -91 48 51 -123 52 -28 137 50 18 -252 73 -179
5856 -179 -264 150 -58 88 -172 126 59 -21 79 218 11 -31 -46 180 -7 -96 98 122 -53 -115 94 223 36
5879 36 -30 -111 345 33 -108 236 -277 -50 -74 -22 47 120 192 310 89 207 41 39 52 -107 -13 -246 111 -163
5903 -163 -171 -98 -35 -18 -127 127 9 48 -100 210 104 -113 -82 -15 -188 179 -104 -144 -40 74 94 31 57 69
5927 69 41 77 -15 91 -81 87 236 -80 180 -17 -205 142 -3 52 -298 28 -50 -94 -196 69 -137 -55 -6
5950 -6 -198 -147 274 46 -99 -157 148 -117 24 -161 -16 -152 25 -86 120 62 5 247 -139 116 -61 211
5972 211 -113 1 -54 -176 113 -88 28 -147 224 249 -122 -101 82 -121 163 244 -11 -109 -106 63 202 50
5994 50 34 13 71 -3 -107 66 169 92 -96 1 -249 -197 324 43 -123 58 -270 -112 98 -225 91 98 -70
6017 -70 -203 104 -99 88 -161 11 48 -222 -46 -2 192 123 -2 -377 -35 121 -202 29 151 70 -28 -200
6039 -200 -162 -17 -13 110 -190 224 65 -75 73 153 81 -43 -110 -22 248 313 -42 -139 -185 231 -135 -202 50 -181
6063 -181 -65 135 144 -37 68 90 -68 -90 77 -69 50 -9 141 11 55 32 -137 -167 55 59 186 -12 56 -152
6087 -152 287 -95 -276 19 32 189 -111 74 -115 58 -270 13 7 65 -22 -3 -28 119 270 -72 150 52 -78
6110 -78 55 38 78 -109 -18 108 231 3 1 66 139 154 85 -222 175 278 129 416 -114 -96 203 18 88 -111
6134 -111 6 298 267 -175 125 84 -65 -81 79 101 -70 186 -134 -84 45 -72 -21 54 -274 -255 -55 166 -33
6157 -33 229 -76 -115 -118 79 127 61 142 197 24 -4 37 -150 2 20 -286 17 -227 -79 131 22 112 -108 -109 16
6182 16 77 215 134 124 55 -89 -2 -327 13 136 153 -167 -239 14 6 242 192 199 -21 126 14 22 -68 106 -159
6207 -159 -180 -59 156 -92 -88 -52 18 205 136 50 185 29 -25 138 -168 43 -3 54 111 55 -98 13 -12 101
6231 101 -11 195 -12 -51 -84 -164 -36 215 21 -179 31 87 147 -75 154 -1 17 4 -313 60 -88 1 88
6254 88 -112 116 83 -165 -311 -121 184 46 -18 -177 -119 177 -61 258 -105 -39 160 82 43 116 136 -186 6
6277 6 -15 92 -106 173 231 -129 -186 21 116 137 -198 195 9 -74 -120 -66 -30 36 -83 -35 -227 -41 66 -191
6301 -191 162 -40 -100 9 269 -188 132 77 -195 89 -41 24 66 -8 105 -156 111 -10 152 36 2 161
6323 161 30 22 -105 -7 -84 6 124 134 45 199 -134 -138 -79 9 -101 -7 -24 -390 -6 -68 5 -111 -98 -170 254 197
6349 197 -338 189 141 -84 25 -24 39 -126 -164 85 -94 53 105 10 -6 -171 -126 147 90 25 -176 -217 -79 -64
6373 -64 53 105 -169 6 24 -23 -383 10 -76 -199 -12 -189 77 32 17 153 48 129 147 -34 -70 278 -83
6396 -83 -164 58 -129 -334 71 143 102 -255 216 189 -168 -19 11 -268 -43 -44 16 -239 149 -132 -287 239 49
6419 49 79 12 64 170 27 -82 113 73 22 84 -98 33 -245 -61 62 204 211 270 8 -33 75 -9 -36 34 66
6444 66 -99 -21 45 17 180 184 -57 -111 -172 -24 -146 65 52 -134 81 27 -98 17 -50 43 -30 -239 -86 -168 -108
6469 -108 151 53 80 -19 10 -205 214 150 59 33 149 158 -17 35 -118 6 -182 -279 -192 125 61 -175 -177 -255 256
6494 256 10 165 427 -98 -74 -141 168 -41 -51 102 -239 -5 -14 38 -206 99 243 -95 238 196 -230 108
6516 108 -14 31 60 179 141 -138 76 -13 -77 171 -45 -117 61 -153 -38 102 -78 -201 21 -222 84 25
6538 25 -199 -47 -19 118 -72 -195 9 37 64 140 -192 -142 74 183 39 -234 -6 -158 -217 78 -83 106
6560 106 -113 132 -108 93 74 -106 -77 2 256 -143 88 -225 -10 -114 86 -153 98 -9 -180 -262 139
6581 139 -156 35 -124 75 -41 -217 100 -111 87 -33 244 -49 -4 25 -22 -101 46 73 100 12 29 120 306
6604 306 -28 -39 -112 -22 149 -323 -40 64 -132 -93 163 32 -32 131 -191 -86 82 111 194 -97 144 119 -165
6627 -165 32 71 15 52 -49 -43 115 -94 95 -177 -135 -128 46 36 138 -60 -39 -2 142 45 82 -66 84 -201
6651 -201 -65 -144 -54 -34 -68 -88 72 -15 -69 250 -16 -257 125 -264 16 45 3 -4 2 274 -38 -298 -161 73
6675 73 229 -79 75 173 -35 17 -99 84 -90 189 -213 -39 -15 101 30 -185 -95 -118 5 179 110 9 113
6698 113 241 82 57 102 181 5 -164 -152 77 45 38 127 -31 304 -9 -5 -286 205 -43 -189 -8 5 -137 -50
6722 -50 -4 -218 70 113 38 102 -18 -81 -146 62 -174 -24 40 -27 77 -315 39 58 -77 -170 -170 61 158 48 -149
6747 -149 68 -101 39 120 -77 -204 41 180 -69 -92 -199 157 103 -143 55 58 -199 -83 -59 -17 17 11 53 -50
6771 -50 254 222 100 -67 -243 135 -186 -179 -28 -94 -53 -19 -286 -250 42 -102 41 -150 -116 -169 -48 84 131 -154
6795 -154 -8 -170 51 207 218 117 83 -82 102 146 29 144 38 -26 201 104 31 -166 75 -55 -207 -152
6817 -152 -140 22 -183 -133 -21 -59 -9 -201 63 -59 104 -24 137 -91 205 -102 -187 -111 176 45 84 109 -34
6840 -34 105 22 -103 153 176 -113 148 -63 -30 -258 201 35 225 -113 44 -210 63 16 -48 216 32 -59
6862 -59 -38 43 -79 128 -169 -32 166 -175 37 -41 -197 -255 71 41 86 -48 4 72 -34 79 -25 126 -44
6885 -44 -132 196 157 -196 152 -93 104 51 -71 203 8 196 -120 -22 -189 67 -196 129 17 -56 -206 139
6907 139 -23 -140 -104 -33 83 142 16 -93 -62 10 127 90 27 -2 -83 -341 39 -41 -132 2 -212 217 -252 -169
6931 -169 337 -50 -44 26 -47 280 7 115 15 -159 -6 230 -101 172 -165 -83 -18 -139 87 -242 -72 33
6953 33 37 72 27 130 -188 -110 -119 52 94 144 -11 47 249 -53 60 55 -246 -64 157 173 -198 -58 26 11 74 -33
6979 -33 138 -79 -20 -76 73 -36 -119 -93 9 61 -44 9 -175 134 -5 118 82 138 99 48 -15 227 -94 -88 103
7004 103 112 -167 139 -174 77 59 -241 -108 41 45 36 -140 15 -116 135 -87 195 14 18 -31 -56 162 2 100
7028 100 -256 -36 103 -60 -233 85 -241 -107 82 -45 -13 153 -130 27 -101 136 62 131 98 55 -66 141
7050 141 -206 -16 178 130 -38 -44 70 43 206 -88 78 -52 -150 -82 -156 284 167 99 89 -37 -270 -52 -184
7073 -184 -215 42 -172 -182 -86 -128 -71 34 357 -10 288 -181 -83 -231 -7 160 -34 222 119 -162 -4 136
7095 136 -127 -172 102 -59 -115 275 175 42 -138 105 1 -4 80 181 -216 59 17 31 68 207 138 62 190
7118 190 -96 71 -90 147 -233 56 350 -177 18 16 53 30 -112 -77 -19 92 -2 -8 -84 -53 -10 107 -201 119
7142 119 -62 67 41 97 -96 -36 4 -124 282 35 9 -124 129 104 -92 14 85 82 -39 -112 147 -60 -114 -53
7166 -53 13 -129 -126 289 -50 -294 -92 97 122 33 106 -125 -68 108 -130 -45 -47 11 118 237 -222 -153 -114 -121 92
7191 92 -41 204 150 146 20 -118 13 6 -42 219 -46 221 -150 -250 -5 68 -188 124 -19 -7 45 -97 -94 46
7215 46 14 -14 95 -51 173 75 66 -105 47 52 71 95 -6 -112 -145 6 -52 41 -195 105 -149 -201 257 -116 -15
7240 -15 -188 -17 106 -213 -19 -214 -215 58 -72 30 -34 30 -127 -12 -94 -25 -91 -136 -147 73 119 -221 -47 27
7264 27 97 -159 26 -42 -7 -40 103 54 11 17 77 -113 -121 -29 -111 -119 35 152 -195 -167 -287 30 -21 124 192 1
7290 1 -206 107 -4 -141 -124 -188 -64 47 222 75 174 -96 64 -79 315 10 -144 -161 -15 -130 39 140
7312 140 -177 139 -184 25 60 83 90 66 167 96 185 -48 -4 -219 76 -18 123 149 -69 120 -31 105 135 -55
7336 -55 -196 -87 292 -54 50 75 -62 -115 -11 28 -164 50 16 43 -35 -74 -162 92 108 5 -134 9 105 -175
7360 -175 -49 33 145 186 -190 -176 143 -178 38 -36 -152 -169 8 41 -84 61 106 74 -105 247 -276 -14 42
7383 42 42 172 59 -65 -169 44 -82 -207 -106 -46 -209 -19 -133 40 -108 -69 -87 45 -118 -40 0 196 -95
7406 -95 1 22 -218 115 72 -8 -265 73 -43 -315 -67 -84 -199 95 137 -79 -210 -53 -8 -162 -141 91 -2
7429 -2 -24 -69 -27 -29 -58 167 -164 -72 -157 -173 -169 -118 53 32 104 83 -120 -17 205 -82 -75 -117 288 -42 52 146 -48
7456 -48 -109 -54 95 -11 221 -109 38 152 46 -116 -33 188 21 -69 -189 4 205 3 161 234 254 23
7478 23 72 169 -222 5 4 69 -75 -232 -58 146 121 -72 -148 14 25 -198 -57 -14 -154 -30 124 137 34 -71
7502 -71 161 -92 32 -74 93 331 -167 92 -66 8 129 -97 20 82 -129 -152 -310 98 247 -157 41
7523 41 -95 65 -132 -276 122 -107 173 162 17 254 64 224 -92 -153 -66 -148 -99 -100 -17 -10 190 254 -274 -46
7547 -46 16 -130 -186 161 25 -83 -19 -181 -233 -86 -11 -157 9 32 -310 -190 -135 -29 63 -114 -114 -28 149 -315
7571 -315 -40 40 -113 136 10 119 168 86 -38 63 170 48 226 -62 -27 -88 -140 3 -177 87 223 -141
7593 -141 174 134 4 234 -188 196 183 -38 151 65 -2 279 -137 57 41 81 -105 -28 105 87 8 38 -70
7616 -70 -89 -185 -105 67 5 -39 -180 47 -62 163 -161 -77 -53 -154 -98 170 41 0 78 -171 -14 15 -30 -22 73
7641 73 95 27 -19 283 -60 54 -14 -156 -200 32 -139 2 -114 -53 -23 -163 159 -21 -107 -203 70 -61 3 -87
7665 -87 96 95 -12 -42 84 232 137 -121 -93 -157 16 147 -10 -15 107 38 -47 -170 -1 -196 -65 42 108 -217
7689 -217 235 125 -107 43 15 -24 -168 -354 -59 286 -96 78 -37 -152 -131 -58 81 7 -3 45 42 -4 61 42
7713 42 67 117 -26 37 -54 -180 169 -125 256 -150 389 -122 129 217 -192 115 -4 -66 -21 68 159 167 -127 -62
7737 -62 -82 35 123 -152 -204 16 -25 98 100 41 -190 -305 -174 -61 6 -130 205 -65 -11 -59 -125 59 65 48 214
7762 214 -67 32 -63 66 23 12 74 15 169 29 177 -69 92 208 20 121 -194 -41 -267 106 203 -140
7784 -140 85 -25 -43 -125 -168 33 -55 -228 -123 100 -172 -194 66 64 68 132 215 224 55 66 -10 228 -201 98 -80
7809 -80 58 182 -75 181 -1 240 139 -398 -175 -31 -237 -116 -278 -165 95 97 88 -89 -53 116 -88 -27
7831 -27 -181 95 -5 148 94 -40 -47 -118 210 10 -169 -82 6 -136 138 -119 12 56 -106 34 -37 136 115
7854 115 8 -125 35 -61 6 182 -180 -63 156 77 214 229 3 51 -241 -126 -64 -86 -107 106 5 75 -3
7877 -3 -185 -36 -224 -35 107 -22 -52 -78 166 -8 -24 241 210 -83 64 -119 84 162 60 74 -129 -83 172
7900 172 -7 38 369 45 70 14 235 217 -106 16 -251 -146 197 85 149 29 -281 24 78 10 -49 -65 -187
7923 -187 -181 -49 -178 143 -18 -101 -47 86 29 47 -56 147 -101 61 -73 19 45 -38 282 57 108 -38 -61 -348
7947 -348 -174 62 -55 -146 -122 203 -138 -122 -7 221 15 -227 70 -129 -258 227 277 13 144 -34 14 -268
7969 -268 -297 -66 -146 -41 -183 191 -94 -145 -77 134 67 19 -177 94 223 116 -9 49 -3 -163 84 -131 9
7992 9 1 -165 259 73 309 69 16 -44 54 -271 129 216 83 -150 41 -148 -414 -174 151 -8 -106 57 22
8015 22 -123 -24 115 4 61 -34 -46 -9 -95 -8 9 78 125 -35 47 -68 -230 -69 246 32 130 -363 242 232 59
8040 59 -89 29 -200 132 80 26 -13 101 -12 47 3 62 186 214 83 -83 -36 -9 -42 74 -151 104 -49 56
8064 56 75 -36 77 -133 18 91 7 -213 -79 -17 20 88 156 -189 48 -62 -61 -38 -52 135 116 -16 112 159 338
8089 338 335 61 -136 -148 -217 93 58 -86 -112 -68 172 105 -78 -132 -313 -218 110 -162 59 17 -142 -193 -95 250
8113 250 -113 -44 133 -176 159 47 -188 -6 -111 -269 -37 -96 -45 144 -9 72 100 261 82 -46 0 209
8135 209 172 47 34 -130 37 142 156 -8 -205 -35 97 -108 -199 109 135 -151 63 126 -53 43 44 -17 172
8158 172 169 -26 14 314 -69 254 -31 -101 -139 61 102 -64 231 90 104 62 -260 -56 -170 51 38 -109 21
8181 21 -177 -186 -143 23 50 -81 55 -112 -198 201
8191B01
##END NTUPLES=NMR FID
##END=
