##TITLE=1H_Pr C5Am
 DMSO,8 sc, 
 1.10.2021
##JCAMPDX= 6.0         $$ Bruker NMR JCAMP-DX V2.0
##DATA TYPE= NMR FID
##DATA CLASS= NTUPLES
##ORIGIN= UXNMR, Bruker Analytische Messtechnik GmbH
##OWNER= root
$$ XWIN-NMR		Version 3.5
$$ Fri Oct  1 13:29:37 2021 Russian Standard Time (UT+4h)  she@DPX200
##.OBSERVE FREQUENCY= 200.1313468511
##.OBSERVE NUCLEUS= ^1H
##.DELAY= (6, 6)
##.ACQUISITION MODE= SIMULTANEOUS
##.ACQUISITION SCHEME= undefined
##.AVERAGES= 8
##.DIGITISER RES= 18
##SPECTROMETER/DATA SYSTEM= spect
##.PULSE SEQUENCE= zg30
##.SOLVENT NAME= D2O
##.SHIFT REFERENCE= (INTERNAL, D2O, 0, 15.7039)
##AUDIT TRAIL= $$ (NUMBER, WHEN, WHO, WHERE, WHAT)
$$ ##TITLE= Audit trail, XWIN-NMR		Version 3.5
$$ ##JCAMPDX= 5.01
$$ ##ORIGIN= Bruker BioSpin GmbH
$$ ##OWNER= she
$$ F:/spectra/data/she/nmr/H-F/1/audita.txt
$$ ##AUDIT TRAIL=  $$ (NUMBER, WHEN, WHO, WHERE, WHAT)
(   1,<2021-10-01 13:28:09.96 +0400>,<she>,<DPX200>,
      <created by zg, POWCHK disabled, PULCHK disabled
       configuration hash MD5:
       00 E9 B6 7A A2 85 ED C7 34 08 36 98 17 FE 4E 26
       data hash MD5: 16K
       8B CC 52 0A B3 A0 FE 67 3A 66 6E C2 D0 A5 52 CC>)
$$ ##END=
$$ 
$$ hash MD5
$$ 1B C7 8F 83 D3 E2 56 3C AD B5 A9 94 1E 7D 61 75
##$RELAX= 
##$RELAX= 
##$RELAX= 
##$RELAX= 
##$RELAX= 
##$RELAX= 
$$ Bruker specific parameters
$$ --------------------------
##$DU= <F:/spectra>
##$EXPNO= 1
##$NAME= <H-F>
##$PROCNO= 1
##$TYPE= <nmr>
##$USER= <she>
##$AMP= (0..31)
100 100 100 100 100 100 100 100 100 100 100 100 100 100 100 100 100 100 
100 100 100 100 100 100 100 100 100 100 100 100 100 100 
##$AQSEQ= 0
##$AQ_mod= 1
##$AUNM= <au_zg>
##$AUTOPOS= <>
##$BF1= 200.13
##$BF2= 200.13
##$BF3= 200.13
##$BF4= 200.13
##$BF5= 200.13
##$BF6= 200.13
##$BF7= 200.13
##$BF8= 200.13
##$BYTORDA= 1
##$CFDGTYP= 0
##$CFRGTYP= 5
##$CHEMSTR= <none>
##$CNST= (0..31)
1 1 145 1 1 1 1 1 1 1 1 1 1 1 1 1 1 1 1 1 1 1 1 1 1 1 1 1 1 1 1 1 
##$CPDPRG= <>
##$CPDPRG1= <>
##$CPDPRG2= <>
##$CPDPRG3= <>
##$CPDPRG4= <mlev>
##$CPDPRG5= <mlev>
##$CPDPRG6= <mlev>
##$CPDPRG7= <mlev>
##$CPDPRG8= <mlev>
##$CPDPRGB= <>
##$CPDPRGT= <>
##$D= (0..31)
0 1.2 0 0 0 0 0 0 0 0.06 0 0.03 0 0 0 0 0.0002 0 0 0 0 0 0 0 0 0 0 0 0 
0 0 0 
##$DATE= 1633080489
##$DBL= (0..7)
120 120 120 120 120 120 120 120 
##$DBP= (0..7)
150 150 150 150 150 150 150 150 
##$DBP07= 0
##$DBPNAM0= <>
##$DBPNAM1= <>
##$DBPNAM2= <>
##$DBPNAM3= <>
##$DBPNAM4= <>
##$DBPNAM5= <>
##$DBPNAM6= <>
##$DBPNAM7= <>
##$DBPOAL= (0..7)
0.5 0.5 0.5 0.5 0.5 0.5 0.5 0.5 
##$DBPOFFS= (0..7)
0 0 0 0 0 0 0 0 
##$DE= 6
##$DECBNUC= <off>
##$DECIM= 32
##$DECNUC= <off>
##$DECSTAT= 4
##$DIGMOD= 1
##$DIGTYP= 9
##$DL= (0..7)
0 120 120 120 120 120 120 120 
##$DP= (0..7)
150 150 150 150 150 150 150 150 
##$DP07= 0
##$DPNAME0= <>
##$DPNAME1= <>
##$DPNAME2= <>
##$DPNAME3= <>
##$DPNAME4= <>
##$DPNAME5= <>
##$DPNAME6= <>
##$DPNAME7= <>
##$DPOAL= (0..7)
0.5 0.5 0.5 0.5 0.5 0.5 0.5 0.5 
##$DPOFFS= (0..7)
0 0 0 0 0 0 0 0 
##$DQDMODE= 0
##$DR= 18
##$DS= 0
##$DSLIST= <SSSSSSSSSSSSSSS>
$$ [...]
##$SUBNAM2= <"">
##$SUBNAM3= <"">
##$SUBNAM4= <"">
##$SUBNAM5= <"">
##$SUBNAM6= <"">
##$SUBNAM7= <"">
##$SUBNAM8= <"">
##$SUBNAM9= <"">
##$SW= 18.0517286264689
##$SWIBOX= (0..15)
0 0 2 0 0 0 0 0 0 0 0 0 0 0 0 0 
##$SW_h= 3612.71676300578
##$TD= 16384
##$TD0= 1
##$TE= 0
##$TE2= 300
##$TE3= 300
##$TEG= 300
##$TL= (0..7)
0 120 120 120 120 120 120 120 
##$TP= (0..7)
150 150 150 150 150 150 150 150 
##$TP07= 0
##$TPNAME0= <>
##$TPNAME1= <>
##$TPNAME2= <>
##$TPNAME3= <>
##$TPNAME4= <>
##$TPNAME5= <>
##$TPNAME6= <>
##$TPNAME7= <>
##$TPOAL= (0..7)
0.5 0.5 0.5 0.5 0.5 0.5 0.5 0.5 
##$TPOFFS= (0..7)
0 0 0 0 0 0 0 0 
##$TUNHIN= 0
##$TUNHOUT= 0
##$TUNXOUT= 0
##$USERA1= <user>
##$USERA2= <user>
##$USERA3= <user>
##$USERA4= <user>
##$USERA5= <user>
##$V9= 5
##$VALIST= <valist>
##$VCLIST= <CCCCCCCCCCCCCCC>
##$VD= 0
##$VDLIST= <DDDDDDDDDDDDDDD>
##$VPLIST= <PPPPPPPPPPPPPPP>
##$VTLIST= <TTTTTTTTTTTTTTT>
##$WBST= 1024
##$WBSW= 4
##$XGAIN= (0..3)
0 0 0 0 
##$XL= 0
##$YL= 0
##$YMAX_a= 169217
##$YMIN_a= -428784
##$ZGOPTNS= <>
##$ZL1= 120
##$ZL2= 120
##$ZL3= 120
##$ZL4= 120
##$ABSF1= 10
##$ABSF2= 0
##$ABSG= 5
##$ABSL= 3
##$ALPHA= 0
##$AQORDER= 0
##$ASSFAC= 0
##$ASSFACI= 0
##$ASSFACX= 0
##$ASSWID= 0
##$AUNMP= <proc_1d>
##$AZFE= 0.1
##$AZFW= 0.1
##$BCFW= 1
##$BC_mod= 2
##$BYTORDP= 1
##$COROFFS= 0
##$CY= 11.3945322036743
##$DATMOD= 1
##$DC= 2
##$DFILT= <>
##$DTYPP= 0
##$F1P= 2.36226072786647
##$F2P= -0.459571619588291
##$FCOR= 0.5
##$FTSIZE= 0
##$FT_mod= 4
##$GAMMA= 1
##$GB= 0.15
##$INTBC= 1
##$INTSCL= 1
##$ISEN= 128
##$LB= 0.24
##$LEV0= 0
##$LPBIN= 0
##$MAXI= 10000
##$MC2= 0
##$MEAN= 0
##$ME_mod= 0
##$MI= 1.114404
##$NCOEF= 0
##$NC_proc= 0
##$NLEV= 6
##$NOISF1= 3.799351
##$NOISF2= 2.8
##$NSP= 1
##$NTH_PI= 0
##$NZP= 0
##$OFFSET= 15.70392
##$PC= 1
##$PHC0= -14814.39
##$PHC1= 36.20083
##$PH_mod= 1
##$PKNL= yes
##$PPARMOD= 0
##$PSCAL= 0
##$PSIGN= 0
##$REVERSE= no
##$SF= 200.130013532006
##$SI= 16384
##$SIGF1= 3
##$SIGF2= 2
##$SINO= 400
##$SIOLD= 16384
##$SREGLST= <1H.CDCl3>
##$SSB= 0
##$STSI= 0
##$STSR= 0
##$SW_p= 3612.71676300578
##$SYMM= 0
##$S_DEV= 0
##$TDeff= 0
##$TDoff= 0
##$TI= <>
##$TILT= no
##$TM1= 0
##$TM2= 0
##$TOPLEV= 0
##$USERP1= <user>
##$USERP2= <user>
##$USERP3= <user>
##$USERP4= <user>
##$USERP5= <user>
##$WDW= 1
##$XDIM= 8192
##$YMAX_p= 0
##$YMIN_p= 0
$$ End of Bruker specific parameters
$$ ---------------------------------
##NTUPLES= NMR FID
##VAR_NAME=  TIME,          FID/REAL,        FID/IMAG
##SYMBOL=    X,             R,               I
##VAR_TYPE=  INDEPENDENT,   DEPENDENT,       DEPENDENT
##VAR_FORM=  AFFN,          ASDF,            ASDF
##VAR_DIM=   8192,          8192,            8192
##UNITS=     SECONDS,       ARBITRARY UNITS, ARBITRARY UNITS
##FACTOR=    0.0002768,     1,               1
##FIRST=     0,             0,               0
##LAST=      2.2672688,     0,               0
##MIN=       0,             -428784,         0
##MAX=       2.2672688,     169217,          0
$$ Real data points
##PAGE= N=1
##DATA TABLE= (X++(R..R)), XYDATA
$$ [...]
1767h5P9J37p1r9p7m0J64j04J54k08r7J57O8q4p0J61j76J68k29R6n5R6J34M3r3
1792c1J83k15L0k1P9l3M0j35J1P0l5j98L52j72J49j54j23L05j49j61K51k94J76
1815g5k1K85k87J70Q4l51L16k68pJ74j92j65L53K97l22K2R1l7j54j9J47M2J07
1838A90r7j68j17l8L09O5l43J69q1nJ82n2j29J95j13J06k38Q9P5k4J68n4j17K01
1862A73l50J50kj58L26m6J3j60n0K10k9k83N6j01L44j28K0J25j55J7k05L1L13
1885A11k53O4J09J82r2k22p9J83r3k2K09mj15o1K73k17j7K09l51K39j86L06nj28
1909D0j22N8J07m4j64KO2N5r5j04R3J94j24O6r8k3J00J09j94J2k5J38j25P8j75
1934a79J29o6N0R9k10K32j74PJ4J05J94l48J84j51L85j38j86j3j14J11Q7o6N6
$$ y = [-85, -6, 131, 60, -39, -116, -156, 8, -96, 58, -150, -247, -90, -22, -106, -176, -15, -191, -23, -252, -156, -211, -115, 19, 62, -31, 152, -63, -33, -54, 25, -8, 32, -103, -92, -22, -57, -255, 97, -75, 74, -80, -203, 102, -47, -208, 43, -251, -75, -96, 189, -98, 72, 156, -195, 121, -147, -154, 20, -172, -337, 16, 313, -9, 13, 104, 67, -87, -106, 41, 83, 190, 93, -75, -192, -230, 79, 144, -199, -30, -111, -116, 66, 14, -115, 80, -33, 73, -165, -76, -1, -25, 143, 89, -28, 173, -177, -27, -29, -187, 139, 93, 106, -54, -104, 106, 77, -206, -150, -251, 93, -35, -15, 110, -45, -28, -233, -202, 111, -142, -78, 31, 213, 121, -101, -180, 3, -90, -112, 97, 93, -22, -83, 190, -27, -44, 165, -186, 53, -133, 173, 168, 40, -82, -24, 83, 39, -125, -123, -61, -6, -101, -205, -112, 82, -42, 24, -74, -97, 3, 112, -82, -70, -95, 43, -82, -4, -179, -50, -116, -66, 33, -177, 55, -119, -112, -98, 7, 201, -147, 37, -114, 271, 133, -53, -66, -180, -69, 18, -48, 8]
1957Hk8j42N7J43k6K7j17jJ43J09k96K15l93L85j86j67L52k6k27O5r0K76M6ok27
1982a06J18R0j62P0R5l11o9N69l82N9J67j26J30L0k38k1n6r7L31j12J86p1J46
2005B40j64m7k6j12K02j96R8j9m5j5K29j83r4m9J36M5j42K82l4o03N03j04K54
2028A56K2j47p8J96j31J35p0J1n3m1n5K04k07q1P5m5p6J42K45j01j37K24k49J84
2052A23q9n8L7j75J93J10m5J4j72r5K26k07K38k60N48l28j00j62K15j37JR5j34
2075a62K55n3r5J61r1J99l31J61k84K44Qj02K25k79J51j28K25j32k38L12k04M4
2097a14r6K25k24K42J32j33r6l2O3m4J38j16K04m3j65m4j75N90l44k05K94j24
2119f7j60o2K95M3j78p9L7J05R4J70j91j17K07j28m2N4K30j54J54kn50J61J10
$$ y = [8, -20, -162, -105, 38, 12, 39, -78, -79, 64, 173, -123, 92, -301, 84, -102, -269, 83, 57, -170, -105, -195, 81, 127, 121, -106, 12, 102, -60, 10, 105, -206, -275, 294, -88, -29, 138, 12, 142, 172, -66, -87, -143, -240, 91, -21, 165, 94, 240, 76, 29, 3, -109, 93, -103, -5, -24, -69, -84, 145, -38, -132, -181, -45, 0, -142, 140, 106, -497, 6, -98, 156, 178, 31, -47, 149, 18, 153, 83, 94, 41, 0, -55, 149, -58, -139, -64, -109, -185, -43, 202, 101, -36, 188, -61, 123, 34, -24, 13, -162, 31, 141, 96, 110, -62, -157, 69, -138, 100, -160, 388, 60, -40, -202, 13, -124, -123, -28, -162, 93, 40, -55, 106, 15, 214, -117, 44, -240, 4, 12, -90, 135, -144, 7, -121, 104, -28, -266, 46, -158, -114, -210, 15, -209, 33, 165, 32, -64, -96, -33, -77, 61, -55, 149, 106, -59, -103, -278, 312, -32, -237, 57, -67, -227, -289, 6, 49, -129, -208, -171, -66, 28, 198, 7, -110, 97, -31, -73, -19, 211, 57, 211, 209, -341, -180, -70]
2142g0M3r5j17J80m7r7N2J21r9J62J2j6N5O6j49K57j79k9k00J33k5j73M70l03
2166d8j20K04j7j5J01k7k48J99k53Q3L25k32qL9r7J72j07K08j59o3j01J7K88m37
2190b96K49K39j73K7P5k26K71l7j46j00L75j43k66J0K46K1j06J76j38n5k30J62
2212f5O2N8j68K45k2l07K60j04O7r1Q8j6O9J9k47J80j30J86n8J32j24k05ML08
2236A41k83J80K5J33k93R9Q8j84P8k22K16K39k60L45m46k4J25j0r6J98rl16L12
2259C6j59L06l51R4K47n2j7j19J08k50K08j19n3J1J0p2K22K24o03K15K28k15Q5
2282a6j43q5K24k3J6k73M27j53j63L37l29J9P0N4KJ3q4K39k77J96j55M26k05j55
2306c8jJ5O5q0J3M5n8j72K72O7nj88J10o6J5J48k55K19m0K17l25K55k67L0Q9N7
$$ y = [-70, -27, -122, -239, -59, -106, -203, -151, -30, -129, 33, 45, 29, 84, 150, 1, 258, 79, 50, -150, -17, -42, -215, 255, -48, -168, 36, 19, 4, 105, 78, -170, 29, -224, -141, 184, -48, -56, -17, -114, 58, -49, 159, 0, -63, -164, -147, 141, -296, -47, 192, 19, 46, 121, -105, 166, 129, -17, -117, 258, 115, -151, -141, 105, 126, 20, 196, 58, 3, -227, -65, -3, 55, -113, 132, 110, -197, 63, -41, 26, -65, 23, 7, 76, 95, -152, 28, -102, 84, 26, 158, 34, -171, -167, 141, -142, 38, 63, 196, -97, 2, 90, -94, -16, -238, -22, 217, -43, 302, -144, -168, -43, -53, -149, 49, 40, -276, 36, -123, 183, -168, -74, 173, 121, 104, -15, 93, -157, 51, -68, -121, -110, -100, -172, 50, 274, -329, -114, 114, -101, -16, -159, -244, -20, -43, -27, -300, 127, -26, -189, 148, -181, -162, -92, -38, -36, -23, -107, 132, -145, 51, -104, 322, 117, -38, -39, -24, 41, -39, -26, 19, -39, -211, 61, 128, 123, -65, 45, -21, -6, 142, -113, 106, 66, 283, -42, 213, -54, -24, 65, 122]
2332A22m4l76K39K04q8k41J57J04J22k01R8n7J06l02K40k28J03J7r2j0J4J23M0
2355E0J30k51J33k61K21k1M8j01N9k08K61j7nk97K74r9J14%j19K5j02K41L0j74
2379f9J97j84J59o1l4j12O7K18j11j92q4N7J57o0J17m4pr5L23j43j47J20J22Q0
2403B74l46J81j63J39k03J00J49k23j5Q2mQ5j45Q2n3J37M1p0j18J6K10k11m9k44
2427c48M85j05L2j14J60n7j03J36p9l62K38K33j85p9J38j87L89pj41J01j49N0
2449D6o0P2n7L41m23J91j9j66o1j2L88l45J61k04N0L08m2L57p06J45J18P8j94
2472c4j66K24j63J60J46k40J81J1q0J23k42O6J14m3r6K62l21L6J58j20j4J23K4
2495A09P6j49j74M40k14O2l2j72K7n2K14Lq9r6K5m8k28M39j35m4q2J8o0L99j97
$$ y = [122, 78, -298, -59, 145, 57, -184, -27, 77, 199, -2, 96, 39, 145, -157, 83, -145, -42, -25, -117, -127, -113, 10, 50, 180, -71, 62, -199, 22, 1, 49, -52, 7, -201, 60, 43, 38, -259, 15, -84, 30, 30, -89, -64, -166, 75, 105, -69, 128, -56, 103, 42, 8, -104, -37, 181, 70, -122, -206, -149, 8, -52, 65, 21, 14, -81, 242, 99, -48, 72, 194, 274, -72, 109, -54, 85, -118, -18, 131, -92, -107, -25, -29, 56, -89, -7, -60, 77, 118, 48, -70, -54, 156, -55, -104, -348, 137, 32, 64, -50, 110, 53, -50, 86, 7, -355, -117, 116, -69, -148, -10, -197, 192, 185, 44, 145, -4, 46, -14, 58, 1, 342, -81, 110, 91, -75, -136, -148, 240, -105, 56, -148, -98, 210, 168, 525, -181, -36, 82, 160, -34, -200, 24, -139, 21, 167, -73, 108, 119, 39, 162, -80, -14, 100, 57, -39, 223, -98, -62, 96, -24, -38, 85, 109, 185, 36, -138, 302, 88, 150, 118, -54, -27, -79, 135, 138, 49, -47, -22, -70, -298, 141, 6, -38, -120, -102, -162, 237, 40]
2520D0K5J27j49K5k32L05j30j55K52j47J10j74K45n3L0k02L2J77k17J03J35K8
2542A75m93K96j09K55J54n78M74m00J31K03O1o4j46P3j17J95j51k7l1J34J6j09
2564e8J10o8j87J15J9m4K09K07l94K13P5J7j94O8k8J64j96l46M51l50J37O0J90
2587A70l4oj22k7l5J51j32J24k49K18K37j70k98L6L23k50K92k87J95k41J41m0
2609dO2r9rJ24j24j06k1M61k08j20J39m6q9p6L48k44Oj42j91L70K08l02J35L6
2633A08k13K05Nk55P4K09l35M4L38m53J35K25O1k69Q9m5j81K27MO8o5o7J3K73
2657A95l48J47j36J65j5l8p0K75oj03j85J06J3j31R0K29j67p8P3j53L13O3k68
2680b9K87o9l34J14N1R9j05m4N1j5j09m0R4n0K23o9K7r0J7Q4p9M86n27m0J28j79
$$ y = [40, 65, 192, 43, 68, -164, 141, 11, -144, 108, -39, 71, -103, 142, 89, 119, -83, -51, 126, -91, 12, 147, 175, -318, -22, -131, 124, 278, -300, 174, -226, -95, 108, 169, 105, -41, 32, -85, 110, -41, -68, -99, 35, 51, -58, 52, -16, -203, -88, -69, -113, 96, 303, -91, 122, 197, 214, 20, 88, 60, 224, 28, -318, 133, -217, -80, -20, 170, 136, 130, 8, -19, -54, 97, -35, 89, -160, 58, 295, 125, -173, -137, 186, -64, 228, -59, 136, -105, 36, -4, 58, -41, -50, 74, -50, -156, -177, 284, 76, -44, 95, 49, -40, -116, 232, -12, -6, -148, -339, 31, 239, -63, 72, 108, -105, 100, 105, -150, -76, 133, -202, -158, 180, -273, -138, 87, 148, -121, -32, -77, -258, -31, -27, 41, -24, -91, -78, 195, -153, -6, -142, 23, 8, -30, -100, 175, 169, 66, -119, -13, 0, -131, -41, 188, 21, -57, 16, -137, 176, 239, -29, 258, 189, -145, -31, 20, 119, 14, -30, 21, 6, -103, -143, -49, -99, 124, 55, 82, -8, 9, 93, 14, 500, -27, -67, 61, -118]
2706a18K2L17rpj08j99ok49M59j22n1P6L6m2N1J1j44R7j98K14R5k37J13j14p4
2731a87J93O2Jo9J0j10K74l24L64l70J67r9J10m6l8O4l0K0j95K89j7j06R7j6n3
2756ij49J78J54r1k99J71j08J06r4K54p8j32K11j30j07K48j03J88j32Q7k49r8
2778a82J76n6O9J36k90M1J13p7p9K70j26Jj32J08jj5R6j58M14l02J30j25K1j56
2802a24n8j5K53J56l32J47R6k88J61M5R3l1N0j69r3J98j82q7J71n8o2J13K68l00
2826d8P2k19J91o3l8L3K77j63j2k42J71M5J19l41K06J4j44M86k99j9l08M45j01
2849F2j07Q1J9j5p1n2j09r2K63p1j5N9N8K4k76L55j36o5o8K13j7P6mk64Q5J58
2875I1j62l4K20k42k21L74J52k59j1J29j3R5j42M3J27J11o1m66L29K51l37K04
$$ y = [-118, -96, 221, 212, 205, 97, -102, -108, -357, 102, -20, -71, 5, 41, -1, 50, 61, -83, 14, -184, 30, 125, -112, 1, -113, -187, 6, 68, 69, 0, 10, -100, 174, -150, 214, -156, 11, -88, 22, -24, -62, 2, -28, -8, -203, 86, 69, -37, 60, 44, -9, -158, 20, 174, 83, -216, -45, -153, -47, -141, 113, 35, -97, 114, -16, -123, 125, 22, 210, 78, 165, -84, -182, -6, -62, 7, 143, -147, -106, 7, -70, -149, 121, -5, -4, -136, -28, -29, -44, 52, -106, 308, 6, 136, 11, 32, -124, -182, -197, 56, 212, -120, 27, 123, -165, -4, 41, 134, 103, 153, -16, -109, 89, -93, -180, -9, -67, -129, -16, 252, -48, 24, -195, -4, -67, -105, -72, 205, 42, 30, -212, -41, 4, 123, -218, -12, 2, -142, 344, 45, 26, -282, 163, 62, -45, 36, 55, 40, -31, -83, -192, -284, -21, -92, -107, -48, 10, 34, -242, 113, -23, -88, -156, 57, 40, 116, 112, -152, -67, 91, -71, -105, 115, -127, -348, 26, 178, -81, -92, 37, 24, 119, -23, 20, 147, 258, 197, -269, 60, 311, -26, 178]
2897A78k05p7k1J91p8O3k0Q6j4p0r2n0L67m06J3J47r3K58q7j7j45K13k31K02N5
2922A67n3M6k22M4K7R1j11J26k71Q0l9j00J12N9j14L85l61j33K25J10k9r6J05
2945D8j12K92r4k65J57K5J30k63J23j66n5J36M8J2J18m2k16L22j56j83L30m58
2967b69M07j11r9J69j50K32m81J62J49K12L7k04J08j73r5L86l88K3L98j89O1k86
2989a01k2J46j37K62k0J01k98K82q0k20o6J08Q2k8q3L7J51r4J14N8l89J65K02
3012A70j72M0l14J25L5J4J41k69J92K0L9P0n4Q1l03K30k1r3J91k37J78K1m18J65
3036a69K34j2r2K27k19O4r0K66m29J70O4K5L0J32j56j71J43j46Q8K01j48J2J42
3059A66k23j36q1L85k47k7R6J41j88r4K98l12L51k73J11j39N4j5K57k33k13N29
$$ y = [178, -27, -104, -125, 66, -12, 51, 31, 117, 103, 33, -59, -109, 258, -148, -135, 12, -81, 177, 90, 73, -72, 141, -90, 112, 167, 114, 160, -62, -18, 9, 100, -11, 115, -156, -76, -115, -215, -103, -44, -158, 227, -134, -267, -42, 68, 39, -57, 48, -64, 228, 134, -131, 26, 51, 181, -82, 41, -125, -180, -44, 4, 16, 134, 92, -124, 198, 42, -141, 189, -269, 138, 27, -72, 97, -53, 179, -302, -140, 9, 221, 258, 54, 162, -11, -106, 280, -108, -85, 313, 124, 185, -101, -123, 23, -114, 148, 128, 229, -69, 213, 133, -87, -153, -45, 37, 9, -74, -37, 114, 20, 134, 192, -197, -32, 170, -2, 38, -276, -151, -116, -102, 39, -230, -38, -18, 21, 91, 37, 118, -185, 45, 24, -69, 122, -115, 63, 84, -334, -169, 65, 53, -39, 188, -31, 33, -57, 209, -220, -50, 14, 39, 69, 201, 45, -126, 17, -129, -41, 160, 12, 24, 166, -57, -193, -274, 111, -136, -163, -67, 74, -114, -208, 90, -222, 129, -144, -33, -172, -118, -133, 124, -109, -322, 207]
3081B07k86L01l11n8J85r8O2j96Q7K29j33j1O3m11N46j21j83J94J07K7l63J55
3103hk1k09k5L59j11N3k30K66k55K68O2r8j24k12L12k7K1J05K62l36l3Q7kJ03
3127B07k01o4J83j87n0N1L7J61l1Qj55J93k44K11k22L85n88L56J41k26K3J18K7
3150A33l46L03r6j1j13j42J30K52k11k98M96k04P8JJ88j34J25j71J06q6o2K50
3172A88l27k7J11nJ57k69J83Q9O9l52K76q6k16J67k2J4J6j16J89n5n4K11j81j13
3196a53J57n0J9p9M0J0K11k59J11q5K5o1M4j00J93j7j18QR2K50j90J4K8j60K27
3221A57l35N9J10J68j44j34P3k7Mn4Q3p4K43m9J1l3o6J41j46j76L13k42k8K27
3245H1j69O7R5j32j38K49Jq8J36k34J85n0q8Q3m5J46m5n5J21k79L3K16K29l66
$$ y = [207, -79, 222, -89, -147, 38, -60, 2, -194, -107, 122, -11, -22, 41, -370, 176, 55, -128, 66, 173, 200, -163, -8, -29, -238, -263, 96, -15, 38, -192, 74, -181, 87, 149, 51, -73, -285, 27, 0, 21, 126, 388, 52, 19, 106, 104, 207, 6, -58, 125, -62, -112, -61, -24, 137, 106, 114, -41, 152, -92, 119, -103, 282, -306, 50, 191, -35, -12, 106, 133, -213, 90, -6, -17, -130, -272, -142, 110, -101, -399, 97, -107, -29, -28, 160, 26, 151, -20, 86, 0, -62, 188, -139, -166, -55, -60, 97, -172, 11, 100, 169, -183, 93, 7, -209, -42, -64, -50, -34, -150, 39, -16, -70, 141, -40, -153, 4, -46, -27, -106, -66, -56, 155, -104, 7, -78, -53, -114, -70, -170, 23, 6, -112, -104, -12, 238, 48, 62, 90, -70, 157, -178, -119, -9, 159, 15, -119, -46, -73, -69, -123, -40, -114, 129, 80, 91, 58, -8, 133, -13, -189, 124, -118, -146, 81, -88, -21, 74, -58, -196, 53, 54, -34, 102, -132, 53, 3, -85, -2, -47, 99, 54, -1, 120, -159, -126, 90, 319, -47]
3269d7J97j68J05k35Q3J74j64mJ62k11J11j49J85K29j48j97N3q7J3j46J75J5P2
3292A8j15K89j82m8J16j38J21p9o4J04o6J83j04L5k97J88k52K89O1j42K01o3j52
3315i7K18j58k6o8KN3K8J87k98K10k16J33J58o2j07J37J52k11k5n7J7K31k18j85
3339b02L06j28J24o1L4j80o4K45r7p5L11q4J16k47R0J13m24L97Rk41j14J14o8
3362a26P1K03k39k50L80k62J68J30p2K3J56j16M9j08j67J40K27j4j63Lm8r3K18
3385A10l14L07j94j50J38J75j41O4j9O6k07j4L64r4j16O9P2j24K4K03k91L70l44
3408d6j49K77j96J61K59j46q8J15j86J39k38K57l24K65j55J0M5j4J41j42M4o2
3430c3j38L0L9J71k16J53q3J80l7j4k16J99J30l95K74j64N5J75k33N8M6%K0k9
$$ y = [-47, 150, -18, 87, -148, -65, 109, -55, -59, 103, -108, 3, -146, 39, 268, 120, -77, -24, -111, -98, -244, -69, -54, 18, -97, 192, 10, -38, 78, -60, 61, -18, -82, 22, -44, 139, 35, 70, -227, -39, -291, -2, 59, -83, 118, 55, -97, 121, -37, -63, -131, -129, -76, -48, 139, -159, 51, -165, -32, 126, 64, -43, 94, 246, 35, 10, -47, -30, 201, -17, -202, 104, -24, 100, 39, 73, -107, -171, 74, -23, -98, 213, 129, 245, -2, 88, 201, -223, 174, 183, -58, -172, -58, -126, -55, 148, -91, -341, 39, -223, -55, 75, 3, 26, 182, 66, 115, 7, -160, -20, 207, 193, 30, 33, -15, -108, 110, -204, 103, -91, -241, -103, 72, -69, -5, -24, 42, -165, -179, 185, 91, -25, 44, 116, -8, 16, 219, -72, 298, -46, -195, 82, -114, 47, 306, 160, 72, 187, 1, 140, -98, 159, -165, 100, -55, -45, 0, -14, 127, -15, 29, -33, -171, -141, -102, 69, -147, 6, -77, 103, 66, 52, -164, 35, 165, -230, 44, -120, -65, 110, -123, -65, -19, -19, 1, -28]
3454b8j2k2P6k9J74k03R7N6j38l3R2j57Lk1K88j02j33q2K25l4K48j55k3r5M2J50
3480A84j74J34r3J08j87l6n8J38J91j18O8q5J44k61j0nJ3J88M5j3j90m0J68j47
3504c6j28K17kO8k96l5M23j21L27m61J37l53L06J08l1j55j79K12J62m7j74j9P9
3527Bq8J06R8m7r7K18k60J25J05k71nk66L38j92K76L51l91QLJ52k96j86M02j92
3551a07j3K45r9j3P6O6k56L16j95j77J12L9r8K26j12J71j75R3K8r7Kj04K14k24
3575h2M9N7Jj01M5M4j36J01L3J33k63J70J16j75K77o15J33J09P9k34J87J63k61
3598a70J52k65O06l28l8J06r6K3L2l2J7O7l23P8J29j08L67m00J82J21l81L93K38
3621C70k60R5j20q6q4J40J10r6r2J00k08N5j06K21L7j2K4j49qO2l41K41J97l1
$$ y = [-28, -40, -62, 14, -15, 159, -44, 53, 109, -29, -62, 30, -127, -124, -145, 143, 41, -92, -174, 51, 17, 265, 110, 87, -8, 34, 184, 10, 144, 51, 159, -28, -64, -122, 16, 207, 89, 157, 72, 216, -45, -55, -60, -47, 141, 186, 173, -17, -57, 111, -36, -164, 53, 51, 119, -177, -212, 211, 90, 417, -44, 93, -260, 46, 154, 123, -32, -211, 1, 163, 116, -58, -77, 2, -86, 20, 118, 71, -26, 192, -68, 57, 162, -109, -114, -380, -42, -234, 42, 393, 2, 10, 13, 165, -131, -317, 85, -107, -120, 125, 26, 13, 89, 155, -101, 215, 20, -157, -45, -6, -104, 122, 10, 181, 6, 99, 127, 30, 32, -72, 142, -82, -33, 24, 25, -76, -31, 13, -123, -22, 11, 144, -119, 51, 167, -8, 269, -346, -213, -104, -25, -259, -72, 91, -170, -18, -283, 323, -5, -43, 63, -33, -10, 22, -10, 7, 74, -249, -171, -42, -150, 217, -183, -1, 120, -261, 132, 370, 110, 205, 85, -1, -85, 55, 165, 69, -23, 77, -131, -76, -182, 39, 76, 64, 88, -61, -69, -7, -348, -107, 90, 59]
3645E9K03k34P0J33j99p6l88M16L64k31lk37J93k77j3J8J37m30M93k40L09K1r8
3668a0K43l02J65kl02K22k15Q6J96k18K39j80K3K02k76J52l0jJ22j09N3k55M05
3691B08j38r8R1K16k33K36j21k65L17l42o3K23j43L05k84m1K94j37p6L4j0j20
3713a47J8J41P5L5k64J82k29L28j29q6r6k9M98j96k23L61j73M1l14N3K20j86N3
3736f7J68Kk51l0Q3J47k94L10p2j43j3J81R9p3K6Q1j20k14J43oP9j59L67J55m27
3761b8j4p6QK4M2O6m3M3oM9Rk95J52l5J17P1kp5O5l7M3k7k0J65l56M4K93o8n8
3790E1L12j95j36nK3R0J81l29j10L27k20j52M93m31M00j76j98J47r0J88l42K07
3812C5q4j6J29k64J98l6m9R0R6m4Rk5j13L6j87M52l34m8m2J44k08J21R7K2J04
$$ y = [59, 262, 28, 98, 231, 32, -44, -432, -16, 348, 117, 114, -123, 70, -207, -220, -202, -65, -495, -2, -242, 67, 88, -10, 233, -69, 96, 94, -208, 14, -201, -115, 81, -137, 102, -78, -55, 147, -129, 23, -7, -8, 114, 5, 58, -197, 208, 70, -28, 63, 279, 46, 282, 161, -104, 213, -129, -192, 31, -112, 193, -91, -132, 162, 25, -51, -17, -27, -147, -129, 12, 87, 122, -142, 40, -189, 139, 10, -76, -172, -201, 297, 101, -122, 239, 66, 107, -207, -154, 66, -120, -67, 101, 103, -148, -178, -95, 52, -242, 68, -4, -147, -160, 21, 120, 47, 73, 154, 34, -180, -37, -43, 36, -123, 244, 399, -28, -42, -118, -110, -86, -44, 22, -21, 22, 16, 65, 74, -221, -69, -104, 13, 84, 82, 7, 72, 35, 78, 51, 31, 196, -160, -116, 177, 109, 51, 363, 168, 32, 27, 50, 140, 321, -8, -118, 209, -11, -163, 330, -101, 299, 123, -75, 72, -18, 170, -172, 35, -49, -65, 64, -200, -2, -38, -87, 3, 99, 55, 64, 39, -74, -38, -225, 227, -107, -155, -197, -53, -261, -140, -43, -21, 83]
3837H3k08L00j33Pp5J76m05M6J30J14N9k45L37m48O7L03J83n86L03L3k21J19J60
3860I9L1k21o8N7M0M9K23m08M61n1k01J55k45J37k71J59j07K89Qm38L3J63J57
3883E1j97N0L5N5K25j24J0J35k74J13j91J6K17n6r1j18M30j59j20R0m4n9j6J09
3907H7p7k6j80P6K13J64k39K5R0r0R9j8j73J05N6k10K54k21J0L1n2J64p7j1m9
3932d9j02J96K44j82j42J73L7J1j7nr8j5r4K05j14k50M1L06pl84J26Q6j9L94m88
3957a47k0J1J1j32K09J46j54K43K16n56J6K57K6j92J48J8k08K1j01K11q2O0r3
3980i2qQ8N2k2K2J5j31jK40k78P6k5P4M8j27j4m3j66K58M1j41J85J48k95O5j32
4006a63J10pL06j43Kp1r0L0r6K58k20J09n8j60K78l71K94J1l5K54k78k10K26J28
$$ y = [83, -125, 175, 42, 49, -26, 150, -255, -209, -79, 35, 94, -151, 186, -262, -195, 108, 291, -295, 8, 41, -180, -61, 99, 130, -91, -159, -102, -62, -13, 210, -198, 263, 212, 11, 166, -79, 58, -213, -54, -161, 128, 136, -302, -269, -106, 51, -146, -96, -61, -6, 219, 95, 105, 240, -34, 79, -112, -96, 121, 65, -26, -144, 286, 127, 7, 97, 53, -6, -22, 87, 10, -16, -196, -120, 93, 257, 18, 43, 133, 43, 142, 124, -49, 56, 112, -98, 156, -65, -55, -24, -76, 88, 11, 0, -49, -151, 45, 289, 107, -35, 138, 175, 186, 169, 164, 66, 51, -43, 162, 48, -202, -161, 145, 138, -246, -120, -34, -53, 341, -147, -167, -156, -145, -277, -68, 78, -76, 167, 383, -173, -157, 100, 126, -66, 82, 100, -108, -87, -188, 23, -59, 1, -92, -100, -12, 40, 18, 40, 55, -76, -77, 163, -115, -39, -64, 10, 58, -69, -83, -126, -292, -34, 7, -134, 51, 199, -96, -31, -163, -53, -60, 246, 103, 105, 34, -56, -26, -122, 136, -84, 25, -33, -193, 85, -286, 8, 19, -16, 238, -40, -250, -24, 104]
4030A04j42r2L22j44r1J80l61L59j78K39j53o6o7J6K12k32J75j97j93M85k50J68
4052I4j0L9j44J37p1J82m39K79k48Q1J28r2Q8l3M4K6r1o1K36r5L5k03J11L8J25
4077A56l13J05J14k1j28r3J15j3L36l19o2M74l45o8n8L26k35M0K3k5k0K52l38
4100i7J11k64J81q3K65p2M4j09o2P6J17j03J66k8l52N7J58k47J24PK8k1k7M12
4124B81j39p3q2K59l03k4J05l6q1J46j02Q9jJ96n04N32j29K2k24N4j78RL90l78
4148a71L17j12L0m04P0N7K38J98j63j53p6J99j29M0m7j30K18J86n21K87J25M9
4170A08j95k9j60K74K4k5R1l5N8N1J15l28J38O5r2k30K55j43k6J14J96l48P3j25
4194a74K70n9o0K53m42K8J99K98k37k53J47P2j77J64k65J31R2K01j74j3k09J93
$$ y = [104, -38, -130, 192, 48, -43, 137, -224, 135, -43, 196, 43, -23, -90, -74, 138, -94, 81, -116, -309, 176, -74, 94, 84, 123, -21, 116, 45, 227, -212, 67, -181, -100, 28, -64, 24, -9, 35, 61, -30, -91, 145, 50, 85, -118, -7, 31, 156, -157, -52, 62, 41, -87, -180, -65, -78, 258, -61, -123, 351, 6, -62, -120, 206, -29, 11, 34, 9, -11, 241, -97, 14, -250, -69, -152, 113, 41, 85, -24, -86, -10, 107, 4, 170, 142, -210, -153, 5, -242, -118, -111, -83, -104, -131, 281, 142, 69, -13, 246, -57, -81, 24, -12, -93, 53, -49, 40, 39, 235, -269, 263, 134, 156, -68, -14, -192, -183, 207, -171, 146, 34, 64, -340, -270, -213, 25, 223, 60, -93, -169, 30, -99, -59, -106, -236, -18, 168, -353, -66, 59, 108, -87, -116, -276, -2, 22, -3, 88, 53, 111, 162, 277, -51, 87, 152, 60, -170, 85, -58, -84, 30, 226, -122, -49, -174, 96, 37, -23, 230, -212, -184, 15, 313, 76, -177, -30, 42, -135, 29, -236, -105, -13, 188, 14, 1, -208, -15]
4216a5j33j3J35L3m4p0J40n2K08k15l00M43j02J44k72J20J01k15R2M8J11j09o1
4239b6o7J4j50K89n2M0j10N7M0l1N7q5j39L9Q6n3J02k36J78K98j04j59N9k00M8
4264a05K69l41J84O7m8j68J48K5j5J23j80J72k86K03K5j39K24k92O4N2L2J82k84
4287h8J12L2qo2j80K44J33rl92K54K02l53R8k30L76j16m4j42Kj08K77mkk0J46
4312A18j37J03J4kl00J12J56J6j07K4Q0j6J4l4p1o6J40l3o4j54J59L3J84l65L21
4337A25K09n53L63p1k15R2q7L37l50K68k03L5q7K38J6l28K60j39j03J75K91l54
4359h1L0K03k31L02k95J2J11J37j55j11M2J3k9R0q4Q9lL2j36L1J2J77j39r8jj15
4385a97L25k46K39P9j20k69J41o3J81RJ73l48J83k14J86j46K98j54k19J39K90
$$ y = [-15, -148, -161, -26, 7, -37, -107, 33, -19, 189, -26, -326, 117, 15, 159, -113, 7, 108, -107, -15, 33, 144, 35, -26, -93, -79, -229, 60, 8, 48, -62, -5, 35, 4, 61, -24, -163, -124, -38, -91, 11, -225, -47, 251, 147, -12, 47, -153, -105, 164, -177, 7, 74, 26, -142, 6, 31, 16, 139, -41, 131, -155, 48, 73, -66, 158, -134, -70, -18, 14, 196, -88, 24, 56, 48, -14, -194, 50, 183, 174, -218, 36, 238, -115, -17, -247, 129, 13, -31, -173, -171, -279, -2, -6, -8, -28, 118, -19, 84, 98, 96, -204, -92, 64, 80, -27, -3, 77, 61, 75, 41, -30, -96, 44, 11, -53, -207, -48, -15, 169, -196, 125, 334, -219, 144, 73, -142, -50, -137, 200, -150, 118, -85, -50, -137, 101, 117, -211, 49, -90, -193, -18, 273, -81, -51, 152, -79, 223, -72, -60, 51, 188, 33, -78, -36, -23, -52, 38, -46, 43, 40, 72, -64, -33, -21, 156, 17, -81, -82, -197, 128, -118, 121, 200, 80, -189, -48, -111, 70, 79, 252, -96, 87, -127, 59, -87, 211, 57, -162, -23, 267]
4406B67k63R1k07L48m42j54L80J17R6m05K92l15J14K4K10r2J57k18J06j41K3l
4428a5R9j63L87l37L3J84rK9j28l19K52m5j46M06m60M6L14P4j01j15j56k39M57
4451D8j34Lj62J46M55l85J27j6j19l9p6J74qJ45k99P7J28j92L08k3k93M8R9j27
4475a15K27Kj32M0J49k46j27K10m13L34N2rK14lK00m66J70j94K53k59O9j97J85
4498e6R9l60M81l86J29K03k65K1J40j42L61q2j26j78J64l5J74r3j73L70l57J44
4520C3l19J42J05K58n61J46J82O3J75l47L11j27j40o4l2M02k53j66M31k68JK5
4542cm5%m0L66p6l78K02k1P4K38j76K9k23n8L91J04k77j56K6J09j20o8J9j10K17
4567B4J00k72K54k48P1L16j69n7K1j84J95k5J53n52K19J16j69K36j04j1j04L09
$$ y = [267, 4, 95, -112, 236, -206, -360, 20, 137, 233, -172, 120, -195, -81, -57, 153, 61, 218, 0, 106, -35, -12, -15, 84, -79, 308, -29, 4, 188, 179, 208, 80, -239, 13, -32, -178, 228, -232, -186, 128, 202, 101, -14, -170, -409, 48, -86, -83, -245, -99, 356, -29, 98, 82, -37, -76, -152, 22, 14, 159, -140, -63, 65, -127, 181, 158, -135, -87, 12, -115, 112, 114, -18, 22, 171, -75, -202, 8, -405, -71, -19, -28, 186, 183, 383, -83, 87, -107, 146, -113, -44, -241, -56, 43, -317, 164, -222, -93, 110, -155, -134, 6, -136, 225, 143, 17, -161, 3, -32, 142, 49, -124, 246, -111, 33, -286, -144, -39, 219, -342, -196, -14, 49, 224, -123, 188, 61, -79, -143, -175, 227, -26, -192, 239, -29, -28, -3, -48, -48, -88, 278, 202, -176, 26, 5, 79, 317, 141, 170, -53, -111, 280, 384, 107, -49, -23, 86, -34, -102, -83, -193, 24, 124, -148, 106, -142, -71, 245, 76, 19, 40, -144, 51, 26, 179, -373, -154, -38, -207, 29, -75, -86, -190, 119]
4589A19k38J41r3m0J02p1L23k61J49n5o2K82j53j64Q3j61O4j39K95j14j72J89
4611B4J11l13K35j16K2K94m49OK49J09p2J2k29K6K7J38l3m1%M2J94j96j48N16
4635D08l59nl7K1j44j9J66n9l5J73l6N7O1l67L84n8N6j86j07J14n1J0J63l28J09
4660f9K08n4O3k50j41K76J77j41Q6Q7j63j38J47j2J31m2j94J7j6K70j75j07J80
4683A40L7k42J27j02K5J81K1k70K29o7r9k5n7K52j83K04m16K42l1p2M3M6P0J21
4707A74k66N9J60l22K11j62L44j99j67K36jN1N1l39q6M90k02J74%k93J60o6J4
4730B1O8r9KJ61o4J39L6j75o4j55J08J71K4K4k71o5j58K58J28j15J09M5j44J81
4754A65j79K01k33j47L77m31L41k26P1j89J33J79j27M2K3j17K45j41J33q3j25
$$ y = [119, -119, 22, -71, -111, -9, -80, 243, -18, 131, 76, 14, 296, 143, -21, 62, -99, -35, -174, 121, 7, -165, 24, 135, -178, 57, -59, -37, 257, -192, -186, 63, 172, 100, 112, -117, -91, -64, 74, 41, 0, 0, 42, 236, 40, -108, 408, 49, 44, 7, 28, -116, -135, 31, -28, -63, 110, 74, 131, 192, -175, 209, 151, 207, 21, -86, 28, -23, -13, 150, -178, -69, 139, 85, 148, -102, -243, 33, 210, 69, 155, 242, 79, -59, 88, 76, 207, 165, -29, -12, -28, 242, 67, -40, 140, 177, -65, 62, -40, -15, 166, 187, -83, 146, 79, -20, -45, -102, 150, -33, 171, -245, -3, -34, -106, -63, -17, 53, 174, -92, -33, 127, -195, 16, -146, 198, -1, -168, 68, 67, 118, 169, -170, -256, 234, 32, 206, 206, -87, 73, 7, 21, 89, -10, -8, 153, 89, 228, 264, 89, 25, -130, -22, 149, 173, 197, -74, -139, -297, -39, 89, -26, 83, 128, -16, 165, -14, 187, -46, -193, 184, -247, 94, -132, -61, -250, -117, 62, -65, -23, 0, -117, 128, -13, 120, 37, -88]
4775h8J19j28o7R8J40N7k04P1j3J15l06L5J30k0K18j86L9M0k40O6J20J64j86Q1
4799E5k43n7L5K11qN4K31k61k15K04j13N7k12K47l4j41P0K01J56m16L81k6p8p7
4823B1N7pk95J70J37j59r7L4P5P7L1j3J03j23J06K56n46K00Mj86Q1J30Q1j18j26
4848a07J48j9J9k39K45M3k61r8J54K81j48j49J07rj65NK23k32J72O3j03N4j22
4871a38M9P3K7m5J87k14qJ64L2l22Pm3L37q2P4p1j33J46qm9o8k15L89o0J00L6
4897A65k14Q1L6j79J4J14J51qk11m8J87J19l92J73J28j14k27L23k1j26J44J56
4919B51j83l78J72K10q5M1Q2l6j34K26j05O3p3j09J89l16L01J5k5n1k15K77l28
4942b11J49nj64K12R2j33N5L0O4j73O2J07j95q6K09k20K69j30K7J04q4K01k67
$$ y = [-88, 31, -97, -164, -66, 74, 131, -73, -2, -15, 100, -206, -171, -41, -61, 157, -29, 10, 50, -190, -124, -4, 160, -26, 55, -188, -245, -210, 1, -7, 47, 278, 17, -198, 6, -107, -50, -262, -15, -49, -190, -120, 81, 237, -179, 202, 176, 98, 21, 78, 71, -224, -54, 83, -76, -173, -139, -64, 13, 44, 31, 134, 11, 117, 373, -173, 27, 31, -155, -74, 56, 137, 19, -107, 41, 22, 41, -198, 47, 90, -171, -269, -115, 166, 18, -131, -24, -33, -198, -193, 30, -202, -30, 33, -70, -16, -138, -89, -16, 11, -34, 153, -61, -69, 95, 127, -195, -188, -231, 106, 24, 98, 27, -106, 40, 32, -17, -85, -300, 89, 29, 129, 165, -49, 32, 68, -111, -97, 17, 168, 160, -51, -99, 88, 207, -185, -12, 116, 2, -225, 98, 77, -49, 95, 251, 68, -310, -138, 72, -13, 28, 110, 74, -60, 166, 61, 124, 51, -58, 131, -185, 116, 131, 106, 55, -160, 117, -211, -62, -67, -231, -19, 73, -60, -5, 25, 89, -84, -22, 85, -110, -196, 13, -207, 62, -68, -41, 63, -21, 180, -87]
4965h7L37m07j54K50R2j9J74j24j97J22P6q7o9M0K10k89O0N8j22J14k2K2Q2j02
4989d2J86k35J09R3l15Q5R6J45k20r1K92j29r3J5P4l0K6p1L1o6J71K42k1l46K99
5014B05m10K2J68j29r6K33K44k26M0m7k69J32J14l32L84o0o8J91l9K4j7k0P3n0
5038F7J8K45n08l6j5K66J69k94K97j80j7k85K46L27m03R5L39k28r4J21k13q0J78
5061A5K12j97j7Op5K83q6j65lo5j11K09J61%j81R5N1j54l0R8k14K82j34p7M6o0
5087a11K44n8P4P4k61K81j71k15J16J31R0k79r2L2N0j29J7K71k57K46K08m51K04
5110A4J7K8j6J73l76Q0J59L6j51J56j56j93K54K9r4L15k24j16K80j45j29n0J54
5133D5k12J48o0J15l4M7q9j34P1J99j72kj4R6o1j18L3k6J85JL2o1qK32m06L09
$$ y = [-87, 250, -157, -311, -61, 31, 12, 186, 62, -135, -13, 63, -24, -93, -53, 157, -132, -72, -14, -136, -22, -44, -22, 60, -42, 144, -91, 18, 111, -204, -119, -23, 122, -98, -189, 103, -26, -119, -104, -30, -60, -34, -105, -74, -140, 31, 273, 252, -94, 205, -205, -183, -15, -144, -240, -7, 237, 11, 51, 4, -265, -133, -19, -351, 33, -27, -95, 96, 57, 81, 64, 44, 117, 67, 85, 330, -178, -214, -229, 37, 206, -88, 209, 29, 12, -273, -27, 300, -103, -8, 331, 103, 9, 130, -83, -163, 15, 227, 30, 13, 19, -56, 227, 141, -24, -27, -92, -203, 6, 167, 167, -14, 81, 132, -22, -52, 46, -168, 114, -20, -97, -51, -111, 133, 75, 149, 223, -38, 243, 72, -143, -27, 104, 194, -85, -177, -145, -95, -224, -207, 64, -193, 53, 261, -190, 14, 31, 59, 43, 216, -160, -80, 79, 115, -36, 120, -36, -229, 25, 54, -40, 275, 51, -65, 215, 70, -59, -109, 45, -167, -19, -79, 36, 2, 49, -40, -174, -103, 96, -76, -78, -92, 4, -57, -175, -142, -168, 17, 18, 50, -11, -19, 213, -193, 116]
5159A16R2J2l34J10On4r9J31r0N1l6J5J51j73J26k6Q6l8J94m79K62l34M41j29
5183AJ23j56J03J7j83N8o9J88m42M54j10j46J69j16J06n5k92L51N4j17J48k1j05
5206d0O5n3k6J51q5Rj3j59L55Qn63K92K53k0k49Q2l51J63L5k3M4LJ84L1J23k91
5232g5j16RQ2K67n4j8l20K43P6k29K42k29K0J53k48J57j0R6j06r2K99k98P3L41
5256B63l03mK37j95m8J24O4j78M9N2oJ74k67Q3j89J31M8P8o5LM8j69J84k71K36
5281G9P3N7o0j34j84K33m9l87N37j58j6l4m6L19j70k60J77p3P5l00M23J18j93
5304B7j5j11L2K64n35J37J08K60j94m4J00j14j27J56mJ39j57L20k25O3o9P1J02
5327A84l83L02q0j61J97J4l75L74j07P7mNR5k95Q7K11k3k93J17k0K36k04n1K0
$$ y = [116, 208, 220, -114, -4, 2, -52, -151, -20, -110, -59, -95, -80, 71, -102, 24, -2, 84, 46, 240, -239, 23, -311, 130, 1, 124, -32, 71, 88, -95, -37, -106, 82, -360, 94, -16, -162, 7, -109, -3, -58, -350, 1, 55, -62, 86, 65, -40, 25, -28, -54, 97, 12, 21, 8, -151, 204, 212, -351, -59, 194, 174, -75, 7, -344, -181, -146, -169, -125, -122, 62, 93, 216, -75, -191, -182, -100, 167, 113, 95, -225, 18, 94, -135, 107, -122, -102, 51, -197, -40, -50, 46, -60, -152, 147, -151, -78, 263, -40, -44, 193, -2, -50, 74, 138, -40, 9, 61, 55, 229, -38, 45, -144, -13, 35, 113, 48, 51, 99, -70, 114, -157, 79, 152, 209, 149, 15, -169, 64, 15, -372, 165, 7, -9, -43, -89, 230, 60, -200, -23, -96, -21, -321, 102, 220, 27, 12, -99, -67, 197, -338, -201, -93, 167, -27, -71, 29, -85, -212, -56, -60, 79, -78, 242, 17, 80, 11, 82, 184, -199, 103, 23, -138, 59, 73, -302, 72, -35, 42, 38, 43, 138, -157, -70, 141, 118, -175, -58, -78, 158, -46, -97, -77]
5351g7L68l12J12n9K93l26K1l5j16M02k60j1j15R0M2K42j6q5m25K60k21J62l4
5374a00p7P7J12j24K50k96J62M2J1K5k66R9K86l12q6J00L01l20k9K39j0oj62L10
5398B26j71J76k51kN8Rp1L22k09l66M07j16o0O8j91K13l7P7O0j20j66j98L76J33
5422A67p8k88L14j94J27l6rj0m1J55n6k13Q3M6K58k00o1k6J75k10J49j82P7J67
5446A14l52K72j95j01L08j62K64j82q9J50J9o6M8O9kk09L46l88R0N4k1r0R5N0
5470B2n0J33j85M0n5j05K97k82J87l3p7K73Q1Q8l56L4k9N8q6J19QP2j91O0p5j15
5496a67K04j73l3L2R7K18l92K40j12M28m2k10l6j49K82j68K93n34J43K05l60L12
5518G8j23j44J78n2M2J81j16r5Q6J26k60K5p3L00k29K62k85J29j60M8K14j61J39
$$ y = [-77, 291, -21, 91, 32, 325, -1, 20, -15, -131, 271, 11, 0, -115, -25, 17, 259, 243, 158, -267, -7, -228, -66, -100, -177, -100, 12, -112, 138, -158, 4, 46, 57, 82, -184, -85, 201, -111, -197, -97, 204, -116, -145, 94, 84, 78, -84, 226, 55, 231, -20, -22, 36, 45, -26, 296, 87, -279, 128, 12, -48, 20, -171, 42, 5, 82, 142, 22, -144, -342, 34, 167, 89, -199, 115, -79, 48, 12, 3, -7, -48, 107, 51, -162, -79, -33, 225, 25, -36, -62, 113, -97, 52, -130, -53, 114, -238, 34, -161, -262, 46, -116, 148, -34, -123, 27, 46, -20, 28, 97, 95, -114, 232, -156, -66, -12, -33, -123, -28, 22, -28, 105, -80, -40, -95, -200, 97, -185, 2, -31, -108, 165, 246, 334, -22, 12, -17, 41, -45, 74, 82, 154, -37, 23, -52, -167, 37, -136, -169, -137, -40, 178, -214, 26, -86, 342, 300, 90, 54, -95, 187, 19, 312, -222, -79, 126, -234, 78, -45, -189, -11, -63, -21, 160, 44, -51, 35, 161, -99, -74, -147, 153, -76, 186, -99, 30, -130, -82, 132, -29, 110]
5541A10j33j4MQ4j2o9J9k03j0M09m26M71k62o8K31j85K17k26Q9k09P5P5O0mJ15
5566A38r5Q3j71R4M3k35N7P3Q9mMk30R1O0rK64o4n7J31k46N2m0j11n8p8K51M2
5593G4J84J72n83L69l68K02k9j42K12J29j30k3j39O3M2Pj55J24p0Rj94L01O4j18
5617AO0Q1j01k59Q5M8J46j14J36q0j12rMO6n7P1K48q3j23R4k29K20k61J38J67
5642A37k75J88j53K25l36K49M3j88MJ85k6L0j93J97n2K14l51m5L1L50k84k51L17
5665A6K03j02j3j54J27r3O2k38R2M7m7L76l04J59q7J76k6l13m3K68L4j8j61r5
5689a34L12m58J76R2j05r6J42l9K20p9k32J66k6OO9K5K9r9JJ58j02r7O0k57Q2
5714a86K67k40K03L7R5r8r0J21j93k03Q5kK69Qpl57K81k45M95j47j68m1qK11k88
$$ y = [110, -23, -37, -33, 51, 39, -30, -11, -214, -224, 185, -241, 230, -32, -100, 131, -54, 163, -63, 26, -183, -108, -33, 27, 23, 138, 43, 126, -45, 49, 92, -143, -86, -13, 76, 72, 76, -154, -63, -3, -12, 252, 188, 131, 262, 16, 68, 28, -83, -141, -219, 32, 74, 258, 430, -153, 216, -152, 50, 21, -121, 91, 220, 90, 67, -72, -9, 33, 40, -115, 9, -61, -52, -246, 55, 119, 1, 61, 142, 41, -218, -133, -85, 61, -53, 83, 3, -109, -118, -114, -48, -105, -34, 214, 131, 8, 102, -127, 93, -168, -30, 137, -138, 50, -103, 122, -214, 35, 78, -110, -106, 79, 53, 83, -110, 87, 35, 249, -102, -147, -116, 234, -50, -301, 16, 219, 117, 104, -50, 77, -16, 46, -192, -100, -53, -100, 276, -28, 131, 44, 220, 194, -119, -162, 106, 140, 122, -39, -134, 178, -280, -104, -12, -117, -213, -71, -110, 110, 31, -201, -35, -61, -55, 14, 39, 68, -31, -30, 128, 26, -71, -11, -268, -186, 81, -159, 44, 81, 176, 78, -12, 109, -84, -287, -202, -204, 65, 73, 66, -291, -10, -255, 240, 93, -75, -116, -124, 87, -201]
5739b01K9o6M11Ok57J41Rm7jj26J06n5J24j97J5K65l08K7Pn9J06K05k73J23K50
5764B34k76QJ9K35k00J7p7k65L11K80l61OK28m3k69J59P0j20J39j63O3oO2j7P7
5789A11j13j85M8J75OM0q9Q0K7L5j49l83L38j09K85J39k49n6p7L48p9l16L0K18
5813G5k51J11O7K13n3k15N5l5kJ13k89M15k72R4j6j47k3L80q6l29L95k00J89k03
5837a4J6P8J71j67l4J27k95J63K26l78J03J29L6j40j38J64k84K84r7k45M22j85
5859e8l0K30k29J71r0q0J93j61L6k5K66j65p3K2j46J58q2M8J51j61J81j17M7j89
5883a03K32p7j35K33l44L40Nj39J4k19J95K00k95K20q0o8J96o8p9R6m7j82K72
5906A67k98P2r9K22j15J17N2Q0l12J07J09l26K83r2J88k80J13K79m22J47m0M2
$$ y = [-201, -172, -238, 173, 179, -78, 63, 72, 25, 24, -102, 4, -51, 73, -124, -109, 156, -152, -125, -118, -177, -71, 134, -139, -16, 234, -42, -34, -15, 220, 20, 37, -40, -305, 6, 286, -75, -69, 159, 116, -153, 6, 76, -44, 95, -68, -5, -11, 51, 34, 111, -2, -187, -139, 36, 42, 82, -7, 73, 100, 135, -14, -397, -59, -168, 117, 256, 7, -49, -126, 222, 143, -173, -143, 75, -176, -65, 2, 215, 162, -53, 2, -33, -35, 78, -211, 204, -68, 26, 10, -137, -160, 220, 134, -195, 200, 0, 189, -14, 2, 80, 251, 84, 50, 177, -118, 45, 271, -107, -4, 125, 161, 21, -117, 47, -237, 47, -50, -295, 127, -58, -88, 142, -87, 84, -6, -86, 107, -54, -18, -43, 223, 58, -15, 7, -139, 19, -63, -15, 136, -25, 156, 39, 86, -103, 129, 52, -83, 150, -194, 146, 151, 12, 26, -193, 2, 202, -93, 127, 47, -21, 175, 107, 28, 124, 77, -105, 167, -131, -59, -158, 64, -51, 66, 118, 198, -114, -7, 102, -224, 59, -33, 155, -125, -12, 267, -155, -8, -48, -6]
5928fl34K66m1J11j38L35k51O3k28j8J24J05j49J27NK40j08j52O3r1N4j36K04
5951D5j51J27j09R8p6J21j58Q0j02J39R8o2m5j98J59P5l30K36oJ43k36K18n4J78
5975A90l41r9mJ28K17r2Q6j82Q3L4q9q9K29k27L45j91n7Q6j8n1J72n1l09N6J18
6000e6O3j83J79o3j2L5J23n2L3L1k80L35m00L11n0j10K32j51q4J31j42k6M2L97
6024C03o21J67j29K59l45K19P0j52J93k9j35L70K2k34K7K47j27j98J96j41j31
6045a69J50J0j11K87j11N9k76J60J03J23k31q9k8K07j02j04O2Q8l6K10l34J40
6067HO1j52M4j28K14j17N3J35j67P8N7j92j4K8J53j12J56k82JK42k15J77r0K74
6091B12k45L45j24k34k9J72j11J16k88L6p9K20m14L83K76k58R3j66J01N3j80J85
$$ y = [-6, -340, -74, -115, -4, -142, 193, -58, 5, -223, -241, -117, -12, -161, -34, -29, 211, 103, -49, 14, -77, -23, -159, 45, -106, 21, -88, 10, -66, 55, -103, -23, -125, 14, 112, 50, 5, -193, -34, 41, -289, -53, -59, 84, -152, 66, 12, 190, -151, -250, -254, -126, 91, -1, 85, -97, -14, 20, -69, -158, 71, -156, 189, -2, -59, 27, 9, -42, 130, 79, -230, -174, -56, 7, -176, 3, -60, -72, -37, 86, 34, 67, 98, -182, 153, -247, 64, 14, -96, 136, -15, -99, 32, -110, -136, -94, 303, -318, -151, -280, -21, -366, -147, -77, -229, -36, -65, -200, 170, 192, -42, -15, 232, 105, -93, 103, -38, -169, -19, -9, -120, 167, 56, 115, -161, -1, 102, 225, -6, -95, -123, 84, -18, -122, -60, 28, -8, 202, -132, 8, 69, -83, -39, -167, 47, -70, -17, 118, -49, 29, 86, -106, -120, -92, 61, -51, 105, -177, -176, 66, -149, 28, -62, 212, -33, 312, 188, -46, -75, 97, -14, 102, -186, -150, -229, -9, -423, -40, 236, -22, 71, -95, 6, 59, -121, 64]
6113F4J59k96rK5P8P0o9j8r0N5m3p5L20k17J93k91K14p4J04o4j74J18j54J59m8
6138f3l5LJ27J99j82m6L7j81K01l66L60l7j76N9L48k25M6o9j9j55J04K41k59J39
6162E1j58j0L16l4j81m9j13L74j25rl3j84K22n2J6p9J51j27J4j02P3J94k63J70
6186F2k28Q2J37k08MJ60Q2j11n3P2j82K6K64K1j25J6q1n2L62j69j20O3j58m7K83
6211A00k14J09j89k9L16k05O9j18l3K37p4K1Q4r4M0j06K39l66J51Q1J33k49Q2
6234a5j92K37j28J56K6j15o5J23j60J86k09j67K40J10J61r9p3j02rJ6j27K93q4
6257Cj18K19j66j02L00k66J21P8k83K66k87K31r1J8QR7k79L56j24o2J07Nj70J15
6281b4j21R2O0p1J26J8j8k94K58P5J24m78M47k86L02k20j20K11j22m6R4K1k97
$$ y = [64, 223, -73, -82, -57, 21, 91, 22, 4, -86, -31, -74, -149, 171, -46, 147, -144, 70, -4, 100, 36, -138, -20, -174, -15, -63, -98, -95, 32, 231, 49, 3, 40, -141, 60, -306, 54, 17, -159, -100, 248, 23, 69, 0, -19, -174, -70, 171, -88, 51, -107, -117, 199, 165, -16, -65, -178, 196, 71, 62, 29, -155, 67, 15, 31, -48, 103, -24, -10, -112, -39, 155, -108, 62, -166, -84, 53, -155, -151, 9, 91, -20, -73, -1, -183, -157, 107, 128, 3, 19, -62, -114, 248, 79, -41, 22, -136, -183, 100, -114, -5, -194, -223, 93, -112, -43, -161, -194, 43, -31, -10, 74, -20, 20, -86, 153, -213, -62, 19, 152, -97, -15, -207, 30, -98, 58, 84, -31, -96, 27, -133, 53, -156, -323, -83, 27, 188, 89, 16, -86, -95, -79, -206, 87, 3, -115, 104, -62, -164, 136, -130, -9, 69, -214, 52, -235, -4, -95, -77, -69, 28, -251, 105, -19, -81, 26, 31, -139, -24, -145, -53, 7, -64, 62, 80, 62, -232, 26, 101, 225, -253, 194, -92, 210, -10, -130, 81, -41, -87, 7, 28, -269]
6304b69K24J22j32M6L67k76P3k62P7o4K10j21oL2j67J46O1o9j94K92j6o6J56k54
6328i0M7L3j18R1R8L0j47lK1J79k08J15R9j06J05n1O9l9j66K5J54l08J46K64l64
6353a24P2J65o6j37j40L47k42l9M74j17k70r5K02M3Q9K08k25l19L29j43K09j43
6375G8j14j35J94J28l62Q5K17J49l50K0R7p7j36J50J43k81J33L9R7j31J9P9j64
6398a22k5K37k93P1K36m91N93k43n0P0J10k61K58J69m43J71r9L46k92m1J63N3
6420A17j35NL45l40J41j60j71K05l31N39k3k54k36M17j36j17K80l80J15j1R6k06
6442b40P0K30q1p3mK46j67k12Q9K21r4J95k90K47o9j61J72K0p8L9j71J55k47J44
6466e9p2L0O4L42o8l44n6r3K16P0J17n47L73r5K92l20J23J14J05j96o9J14oP2
$$ y = [-269, -45, 77, -55, -9, 358, 82, 155, -107, -30, -94, 116, -5, -11, 21, -146, 0, 61, -8, -202, 90, 74, 8, 164, -90, -43, -10, -128, -37, 61, 91, -56, -59, -38, 141, -67, 48, 147, 41, 146, 95, 164, 125, -41, -16, 138, -170, -24, 240, -124, -52, 113, 47, -90, -230, 117, -125, -164, 310, 193, -77, -172, 30, 73, 162, 370, 145, -174, 155, 12, 221, 78, -36, -171, 23, 151, -211, -126, 91, 240, -110, -90, 7, -70, -206, -56, 87, -194, -61, -22, 75, -56, -37, 42, -122, -147, 90, -203, -132, 104, -387, 206, -37, -87, -17, 93, -168, 90, 259, -184, -13, -112, 234, -58, -99, 64, 117, -18, -13, 332, -8, 133, -27, -198, 7, -324, 215, 192, -62, -298, 119, -17, -134, 146, -234, -119, -130, -34, -240, -170, 60, -21, -94, -98, 148, -19, -231, -142, 79, -15, 180, -110, 137, 68, -93, 79, 99, 21, 60, -111, 44, -203, -59, -131, -101, -37, 305, 237, -107, -163, -256, -40, 30, 147, -400, -27, -122, 170, -150, -27, 87, 192, -4, -73, 41, 35, 107]
6490A07j12k1Q7j40L1p8J82J16k2k60L48l94K65p4J74k90Q1Rj33R7K9J03j83j12
6514a90L35m12L0J97N9N3Q4p4k47K04J1m2lk48M02oj34o9O3j55J52q1J79K1j24
6539Eq7K52q0k11J46Q9j98r6J39R8j7j40O5K05j70k4k73J73J58K92k03n8J56j64
6563E7R1q2J1n5k00qL2O5n9K88j54mJ27j14M5j32J44j06J07j5kl8r1K43l00%L5
6590a15J63nj91K20k56K56j9J02k48k6K78N1j31j7m7O5m0q0l5o8J08m0j88M3k1
6615b41K46L9O9m01L17k28K37Mj68K07j50K15o2j56K67k72j31L49p6Kk24L57o2
6638A38Rj5j51mj8K13R2j42j47K05m3j52J44m3m6j77J46m1J70l35J97M3KJ1j22
6663f6K98k20k09J37K8j95K14Q4lj09J94k29J79k83R7L8J06j1K3J07k6j76m0J35
$$ y = [107, -5, -26, 61, -79, -48, -126, 56, 172, 150, -110, 238, -156, 109, 35, 209, -81, 0, 9, -124, -27, 2, 105, -78, -190, 145, -267, -237, -40, 19, 72, 156, 82, -165, 39, 50, 8, 5, -243, 159, 153, 19, -50, 13, -142, 10, -71, 108, 129, 5, -82, 170, 90, -121, 25, 114, -84, -180, -41, 57, 40, -100, -35, 170, 0, -24, -297, -124, 34, 326, 123, 65, 221, 57, 148, 66, 77, 22, -178, -186, -154, -89, -148, 140, -14, -18, 109, -5, 40, -92, 52, -54, 53, 38, 36, -2, -93, 150, -150, -150, -115, 48, 43, -148, 72, -184, 72, 53, 155, -93, -119, 159, 210, 79, 62, 15, 80, 40, -40, -75, -143, -35, -75, -263, -220, -241, 5, 44, 113, -288, 29, -199, 38, 42, -126, 81, -69, 146, 84, -72, 195, -77, -208, 141, 65, 67, -157, 200, 138, 147, 132, -19, -23, -41, 172, 264, 122, -25, 180, 137, -15, 129, 86, 40, -137, 9, -32, 138, -197, 0, 43, 45, 56, -66, 232, 12, -197, -60, -32, -227, -13, 71, 68, -41, 153, -76, 103, -180, -83, -45, 61, 50, 73, 180, 154, -22, -62, 73]
6687G3j3k20K54m59L72R1k90j5J99R2Qj10k58J57J14j08J45r3Q4j15J77j57j88
6710b60L07j76L4k4K39r4j87J85K98k31p2r0k02L12j30QL18l51K33k35J56k28
6732a90J59m9j3qL01l7j7j09k07J23m5K71n2k56J05j24L27l76J39j41L16k57O
6755a34R4j10J05J48k03j9L17n86M07N9K0j07J44k53J6k2M72l42Q1j39Q9l9j6
6778a8J03O0j32R9k50J50r6J11K43k83J20Lj7k72K21q2J6N4n3l22M55NJ65k17
6802F3p8P8k60K29k3j02J00k45L09j11K34n78M80j65LJ40k80J95j80L12j47o5
6824i1o4K00j92L00k52O1l5J78k13j51N82l93R9l4R0J31k21j40J68j17J69K4j26
6847b7J20k9p5L51l37L3j33L3n0mn9L24j28k93L22l9J26o8J95k97J58k27Lj5L9
$$ y = [73, 60, -160, 94, -365, 7, 98, -192, -207, -8, 84, 92, -18, -276, -119, -5, -113, 32, -61, 23, -92, 85, -72, -260, 47, -129, -95, -119, 120, 26, -161, 24, 322, 91, 19, -71, -273, 39, -91, -83, 235, -116, 117, -118, 38, -190, -31, -80, -93, -101, 200, 163, 146, 37, -170, -47, -92, 179, 127, -129, -24, -148, 179, -197, -58, -199, 117, -140, -134, -40, -150, -45, 103, -100, -119, 198, -388, 19, 78, 98, -9, 135, -118, -102, -124, 348, 6, 87, -52, 37, -2, -18, 85, 145, 13, 112, -138, 12, -84, 27, 270, -13, 107, 110, 93, -179, 42, -40, -24, 30, -23, -345, 110, 115, 280, 63, -15, 63, -197, 32, 9, -93, 7, -238, 71, -40, 194, -384, 96, -69, -66, 74, -206, -11, -191, 121, -26, -91, -155, 45, -147, 153, -99, -38, -73, 105, -108, -259, 323, -70, 29, -5, 85, 216, -5, -145, 23, -94, 75, 99, -27, 93, 64, -11, 340, 3, 36, -97, -64, -114, -118, -177, 147, 19, -274, 48, 9, 135, 67, 262, -35, 123, -104, -101, -116, -77]
6872g7J31r3J10j5KN2q3k2K33l34K3J26j02L66l44m9O0k15M04j94k96M49J40m25
6896a53k6K24j68n4J47j32K96q5P2o3o9J40k05p8J29j2k9Q3L0k6Ro6j53J81J51
6921A43j16R0j54K17Q0j36o5q4L9M8J33j68j08L1J92j23N0N0k2J04p1l70L79j00
6945C9p8J23jk4n0n3M5o1L51k95Q3l4o2M9k97L70J29j46j88K6n5K26o8k00q9K74
6971A4k03R8R2qJ84O3l39J11J7J46l02K82k61j02L17o9k03J48N6o3O4K0J42j90
6995A4J00j93N8Kj11j17L07j26p3k44L29O2J14O8l42K27J68l2k49J34l6j40M5
7018c5J08k26L44q9r3J06N9l99J30J09R9O5k07j37L64k88P6j66J1NJ78j47M0L4
7042e9J68O3m0k78K40o6m5l46K43j4r6J81k9K24j32kK22l10J01j42K44l18M47
$$ y = [-77, 54, -39, 71, 56, 58, 110, 27, 5, 238, -96, -73, 53, -49, 317, -27, -76, -16, -231, 173, -21, -317, 132, 272, -153, -179, 45, -123, -177, -30, -162, 134, 49, 121, 58, -11, 129, -76, -154, -25, -37, -66, 17, 47, 21, 30, -36, -189, -8, 143, 27, 117, -37, 180, 260, 124, 59, -25, 14, 62, 195, 27, -81, -50, 142, 19, 69, 119, 97, 201, 130, -240, 139, 39, -39, 84, 83, 59, 9, -44, 1, -60, 291, -4, 79, 45, -17, 32, -265, 105, 234, 88, -100, -74, -129, 97, 29, -171, -260, 14, -189, -91, 1, -7, 177, 240, -99, 12, 29, 175, -127, 155, -106, -208, 109, 40, -163, -15, 41, -22, 42, 62, 204, 14, 114, -79, -21, -19, -130, -247, 60, -66, -139, -383, -54, 8, 122, 190, -152, 75, 243, 211, -38, 96, 60, -80, -35, 73, -153, 191, 102, 9, 115, 174, -225, -95, 14, 113, 178, -29, -166, 198, -90, -14, -180, -169, -164, 14, -133, -93, -59, 109, 172, 132, -146, 94, 28, -17, -363, -120, -134, -230, -49, -78, 146, 14, 12, 234, -76, 25, -117, 127, -191, 256]
7065B56m4j54q9rL4Q2k87J39l6K6N7O5m9R6pO4K6l30N96l33N3j97K72j31J34l51
7091a17Q8K13o7r3q2m9p2J86J50j79QK43l01J07j4N1k62M8J25O8p8J00M8k90P7
7116i2L2RL9k6o6L47k90j02R2J30j71J84m9k41J66J82M6k43j32J68J41l13J52
7139c7P2nK6l49K65j75L02K45q5j54q3p2j1m7j45K22j14RK4J78j85K07j44J72
7163A16p6k37M69j22j52M4q7J19j54J89m0r9J10k76J73j6k81N20k41p5J46l7J8
7186A1p6k6n4Q9KK74J05m43K04l0j75K10j5K32k12j98K18J33k95J00k67K16K06
7209B09p8o5k31l6N2j50K79k35K11J16j13J3l9j98L91Q7l01M73l05l3Pm9k91J80
7233a06l5K99n8M5m5l28j10J68K25o8k7M2l5K98l74M31l19j67J77J27j24J44j26
$$ y = [256, 212, 58, -31, -40, -6, 76, -211, -72, -108, -82, -25, 40, -9, 87, 80, 144, 170, -160, 436, 103, 156, -41, 231, 100, 234, -117, -29, 184, 117, 24, -58, -107, -179, 7, 157, -22, -14, 229, -72, 35, 21, 72, -190, -142, -17, 51, -27, 73, 121, -169, -92, -60, -51, -12, -38, -104, 243, -47, -149, -57, 73, -98, 86, 37, -204, -38, 144, 190, -53, -185, -17, 124, -189, -37, 35, 30, 56, -293, -28, -203, 99, 344, 259, 105, 22, -50, -61, -108, -253, -31, -145, -136, -112, 66, -119, 88, -56, 116, 40, -197, 272, 150, -2, 42, -45, 74, -80, 109, 69, -30, 80, -196, -23, -39, -320, 200, -41, -116, 30, -7, 11, -65, -91, -145, -56, -54, 220, 325, -118, 86, 56, -119, 91, 76, 308, 96, -102, 116, 249, -46, 54, -213, 3, 209, 131, 66, -165, -201, -149, -299, -20, -255, -44, 72, -41, -28, -67, -265, 126, 213, -88, 385, 80, 47, 54, 5, -286, -106, -141, 158, 100, 145, 100, -228, -338, -170, 55, -13, -40, 2, -33, 265, -109, 322, 3, -164, 13, 140, 16, 160, 34]
7256C4K7l7l31L24O1j53p7K07k81K96j26k85K85k01L01k28J24R5m7J9K50k36j51
7279a30J49P5k01mL00P2m47J40m2j63J66j78M13k00K55l44n5P1K78n6M9j23J24
7302A49j50J03l4j10J13j18K89k64P9R8j56Q4q3J06k64K25J35m3N9k26r5J11k83
7325b75L86Ok85J29k0q3j8K28K6n1l7j20Q5k38K16l57N54R5m10K66k41J22L3Q3
7349I4k18n7J84J17j39r3J69j44K31k83J05P6oo3rJ61j54P2k18J15P0o6j23Q7
7373i2L61l75oQ0r8K19J29N4j88J12q3j11r7P7R9j07P6K32m34o7K96OP7j51K80
7398B89l44J2K05j10j34J90N3j66m7M5k17K63J31j83J53qj47J0K60ll08P1kl9
7422b6j8J96l81K12J55k07j1K05j83K12j34P8p6j29J56L2o0k3J98L5l11J83J09
$$ y = [34, 61, 24, -307, 17, 78, -75, -152, 55, -226, 70, -56, -341, -56, -257, 44, -184, -60, 35, -12, 7, 257, 21, -130, 19, 94, -107, -111, 189, 261, -186, -46, -88, -251, -85, -263, 150, -50, 205, -139, -194, -123, 155, 99, 148, 25, 149, -1, 102, 68, -42, 71, -47, 242, -22, 57, 155, -1, 83, 0, 106, -158, 67, 202, 159, 218, -8, -103, 8, -275, 111, 117, -168, -39, -59, -142, -160, 68, 94, 43, 6, -114, -29, -267, -51, -408, 146, 241, -169, 97, -144, -22, 11, 94, -124, -181, 3, 120, -19, -112, 57, -87, 144, -139, -34, 42, 36, -27, -36, 125, -29, 43, -175, -60, 10, -56, -179, -92, 269, -106, -112, -32, -130, 89, 218, 272, 84, 196, 113, 2, -95, -18, 81, -26, 50, 282, -152, -219, 77, 83, 160, 9, 289, -55, -43, 162, 52, -82, 108, 161, -5, -52, -7, -224, 39, 170, -13, 140, 132, -15, -5, 255, 252, -56, 15, 13, -26, -44, 152, -229, -17, 138, -69, -80, 125, -58, 154, 20, 98, 22, -107, 49, 81, 21, -2, 196, 231, -80, 103, 212]
7445B12k08L0M6nk75J13L02k54k3M0p8M59l00P5j98J53o3J09k33Q3K39l25K53
7468A52l34K29j38j06J61J62j13j05%L05l21q1L70p5o4k13J27p9L2J06qj14J2
7491i5m1K72K4O2j23K7l05R3j5J80k30O3l7m6J93k89o1L64rK4l13N8l2K43K1m06
7517c78N03l42J60j78K59L6N2LL1j95P1Q9K0k80j6Q3J18J62k96K47l62J63j2M7
7541a5o3l6O4l8J49j31K13j68q4K98l29Q1J74k83K35j45p8P4J1K8l76K20K05p7
7565g1J65k77K10l7l2L8j05j14K34m8m8r2J08j10M19l51J21R1l6L2k89R3J43j56
7589a12k1P4j1j91L12p6J51k65K88k60O0J67j76K91k37j53K16k2j89r7J89om8
7612a16lK01p4r1K41J11M7m65K36m0j95m5M01j44N0m8J82l81J25m7O6J52j73k02
$$ y = [212, 4, 34, 80, 75, -200, -87, 215, -39, -62, -22, -100, 359, 59, 134, -64, 89, 26, 135, -98, -15, 224, -101, 152, -182, 47, -91, -197, -36, 126, 13, -92, -92, 213, -108, -189, 181, 106, 42, -171, -44, -123, -91, 15, 7, -107, -95, -136, 136, 160, 222, 99, 126, -179, -86, -101, 79, -151, -88, -125, -171, 22, -267, -328, 36, 27, 51, -262, -204, -236, 7, 28, -378, 125, -217, -57, -235, 24, 60, 112, 115, 146, -49, 22, 111, 131, -149, -165, -82, 36, 198, -98, 149, -213, -50, -62, -15, -78, -114, -50, -88, 61, -70, 143, -25, -109, 189, -140, -59, 115, -168, 67, -78, -156, -82, -71, -43, -419, -199, 6, -71, 94, -183, 27, -10, -42, -4, -109, -223, 11, -37, -85, -177, -69, -179, 240, -111, 10, 101, 65, 97, -192, -99, 44, -112, -133, -59, -70, -261, 51, -25, 126, -139, 149, -111, -51, 116, -60, 231, -6, -159, 57, 35, -154, -251, -62, -68, -116, -119, 82, 8, -83, 158, 269, 316, -149, 87, 47, -148, -193, 208, 64, 114, 66, 248, -133, -8, -55, 11, 163, -10, -212]
7636b12K59j53K75l01K95j51J10l52K06P6j10j8j59K03k05K80K62k24J59j04r7
7657C9oj46K68j98p6j50J75K0J07P2m63L42q3j17K33P9K3k52Q1K81k90M5J86L6
7681B06m24K71K2J12q8m5L07l33n3k3J68j75Q8k55K78j74j44J29J06J77j09l19
7703b78L9L09j90L12k69J68m4j4j49P6p7J33J66j37O8j73o7K36l7J76j98p9J53
7726A24j74J51q0m6P0l2J52k03o0K08k84J69J19n05J99J04L29k37P6r4M9K4n5
7749DLK0L4p3P9J67k08J14k83J6R6j45M27k24L9J73j3j38j4k63J98j31M3Q1k8
7774b6J30o4M3q5K63l08K07l79M31n20L60j39j0p7J45J42k85K06K4j32Oj50L05
7797H7M9l45K05r5K94l89K51J00N1l21L4O1o2K40j08j39N2j31J22N4J06pk13j04
$$ y = [-212, 47, -106, 169, -132, 163, 12, 122, -230, -24, 52, -58, -76, -235, -32, -237, 43, 305, 81, 240, 136, 39, 33, -113, 155, -43, -119, -269, -94, -74, 33, 105, -358, -16, -99, -216, 17, 96, 119, -133, -52, 229, -61, -16, 170, 206, -218, 53, 75, 187, 99, 54, 361, 28, -25, -48, 120, -55, 33, -222, 56, -118, -262, -133, -27, 150, 41, -278, -239, 70, -120, 192, -77, 91, 47, 33, -116, -40, -117, 16, 182, 45, 113, -60, -127, 109, 72, 248, 50, -29, 124, -50, 101, 21, -25, 45, 13, 165, -38, -98, 110, -174, -5, 114, -391, -192, -88, 241, 4, 80, -14, 35, 59, 4, 7, 27, 61, -12, 67, 234, 26, 140, -143, -127, -31, -176, 251, 27, 66, 239, 226, 88, 74, -189, 9, -122, -79, 2, -26, 104, 40, 83, -2, 261, -47, 160, -219, 212, -308, 52, -87, -97, -174, -29, 113, -172, 34, 58, -74, -68, -218, 87, 136, -209, -4, -99, 195, -194, 57, 157, 208, -113, -79, -18, -80, 160, 52, -87, -35, -166, -44, 10, 116, 109, -104, -208]
7821b08K06n7J29k89N9P6n6K83n9j61p0n7q9N59k00k18K9K13J7j26l03L86O9j46
7845a3oK53k52J07n4n3Lj24L26l36L36j18m8k93L37j0j46K45j68Q8j5r7l30K82
7869h6J15N3j7m0m0m7n2M0J6J75j94O7K02l22J53j15L9k8j71J82K3P2N0p2J2m5
7895c0P6n2k31L64j11j18P8k2k23L82o0r6J40j31J05NM0j2n5l01L05j19q4o8p4
7920b92L28j50J84J10n8j10p2J52o8j69O7L00j16k04m7J19J63l39M22k89J37M4
7942A12q5J9j66K24j28Oj60M05l42k4N9K66j42k0j10j63K33k30K55r6J66r2j41
7965a54J24J97j78J0K9l4j26M07k64j39M8J59L4r7k57K43l3P0L0j17K91k80j37
7988a74o4O71m19r9R2j85K69k00RJ15r1J68j06R4k5l73L89l4l3j70J36r0J09o5
$$ y = [-208, -2, -59, 70, -219, -160, -84, -140, 143, 84, -77, -147, -204, -293, 266, 66, -152, -123, 90, 107, -19, -322, 64, 133, -13, -19, 234, -18, 89, 35, -18, -15, -139, 187, -149, 187, 69, 21, -272, 65, 55, -91, 154, -14, 74, 59, -38, -368, -86, 29, 82, 65, 25, -15, -62, -114, -74, -58, 117, -77, -10, 192, -130, 23, -92, -53, -81, -252, -70, -47, 25, 75, 3, 15, -30, 46, -6, -237, 127, 16, -102, -24, -46, -269, 113, 53, -43, 97, -34, 71, 76, 116, 104, 49, -252, 53, -66, -150, -218, -292, 36, -114, 70, 180, 122, 12, -60, 92, 24, -145, -78, 222, 106, -98, -145, -26, 137, -202, 220, -69, 68, 112, 27, 46, -120, 104, -24, -18, -178, 227, -115, -139, -80, 186, 44, 24, -86, -249, -16, -246, 9, -87, 79, -13, -154, -30, 167, -11, -1, 28, -6, -132, 275, 11, -128, -80, 79, 113, 16, -241, 2, -31, 39, 69, -48, 243, -37, -174, -238, 433, 14, -85, 7, -178, 91, -109, -100, 15, -76, 92, -14, 80, 55, -318, 71, 37, 4, -166, -30, -120, -11, -76]
8012g6M8m5j7j19J54Q5k21J81J01k61R9J88p0n3q1j96K73l8o2J37J70k79n8k8
8036a68Q5L2o6L41j67k57k1L73q8j27J09M3J1j83j88L33j36R3P3R7k49J02jr4
8060e3J6J64MK14l38k44K89j65J55N3K9l27J90R3l34N0J49J34p5j67L68m07q5
8083b87K47k7j18L55j52k59J21P0R2N5j48L08j95j04O9p9k31L63P0K3k72M5L5
8106a9J15k57K95Q3m87L42j34L60l52K04j37K47k62J03J12l08j60P8J45j58J39
8127e1J08k03J28Q7J45l41J22M9J3j21M8j57J78Pj25L1jK58j86pJ23K10k56l72
8151c13K52m06M03pJ95K3j59r5L27l30K01K22j57j40J51j88j81J53j77N27l98
8172i7K84k45R4JJ40m1n7k82J31Pj11K55k58Q9J01K5P1j57K57
$$ y = [-76, -28, -73, -90, -209, -55, 30, -191, -10, 91, -170, -71, 117, 47, -6, -87, -283, -10, -48, -110, 27, 197, -82, -140, -168, -83, -51, -117, 224, 57, -200, -221, 152, 64, -63, 46, 89, 100, -83, -271, 62, -74, 19, 92, 189, -60, 42, 41, -53, -37, 127, 131, 345, 7, -237, 52, -113, 42, 95, 124, -203, -13, 80, -254, -204, -55, 79, 4, -163, 205, -202, -287, -40, -67, -185, 170, 18, -241, -120, -50, 42, 97, -51, 257, 62, -42, 27, -52, -283, 80, 150, 173, -99, -54, -19, 96, -161, 134, 217, -270, 72, -62, 298, -54, 150, 13, 260, -2, 101, 213, -95, -255, -177, -32, -190, -51, 57, -146, -18, 69, 214, -127, -5, 44, 57, -64, -16, -173, 5, 12, -113, -82, -83, 175, -11, -18, 105, 315, 59, -313, -61, -467, -64, -71, 124, 147, -12, -107, 220, -110, 91, 313, 156, 16, 167, -21, -202, -49, -226, 301, -97, 187, -58, 36, 37, 177, 136, 79, -203, -72, -65, -176, 79, -179, -90, 11, 36, 107, -50, 207]
8191B07
$$ Imaginary data points
##PAGE= N=2
##DATA TABLE= (X++(I..I)), XYDATA
0@%%%%%%%%%%%lJ1j6J6j6J9k7L2m0M8n6O7p5Q8j04J20j39J63j87K14k46K78l12
34a65L52l96M43m99N60o25O95p71Q55r45J044j154J274j405J549j707J881k072
52a086K283k517K782l082L421l812M267m805N452o247P251q565J0364j2991J7201
67I916k5008M4225j78434k79483L30714J96599k3330J9521J0798j59803m5315
78i9600O1428j5718L1939J64090l9302k02072Q825J45824l4495o6337O8405L6444
90E9431o1783j1378M912k7357L3419O2051m6574o2733L6427L6333l3565r913K7657
103F927P19j3358N737j168o655Q682J2467m207j3493m793J5968J1236k0752j3284
117a5974K5575R920k9000n882K1657j760r085M408j1312j826L3347l835n0213
$$ y = [0, 0, 0, 0, 0, 0, 0, 0, 0, 0, 0, 0, -3, 8, -8, 8, -8, 11, -16, 16, -24, 24, -32, 35, -40, 48, -56, 64, -75, 88, -99, 115, -131, 147, -165, 187, -209, 234, -265, 295, -330, 365, -406, 449, -496, 548, -606, 668, -737, 812, -895, 986, -1086, 1197, -1320, 1462, -1620, 1801, -2011, 2256, -2549, 2903, -3344, 3907, -4658, 5706, -7285, 9916, -15092, 29133, -149301, -428784, -98070, 98529, 75199, 94720, 105518, -54285, -99600, -38172, -53890, -21951, 142139, 102837, -99235, -90410, 55414, 20919, -45418, 22987, 59431, -2352, -13730, -8818, -36175, -2756, 59295, 12721, -50012, -13585, 22748, -10817, -20730, 6927, 7646, -5712, 25, -1143, -7798, 884, 13351, 9144, -4349, -9142, 6826, 18062, -2690, -15974, 9601, 19521, -9479, -15361, 6296, 4536, -4549, -141, -11453, -13279, 20068, 16233, -33980]
130c3980J2528N9596j7567n5771J9313M1571j2991k0216J082j591J6791J9978
142B8743l5598l1428M9264L3917n6731l0719N2051K3488l7966j7103J5852J0889
154D659Q940p372l0433M915M4885l060m7121M244M1635m507k9432M173J5839j973
168E392l738k661n982P656J1490j1064j3999J0966J1484r538p144O575J102m529
182c990M359L957o126l634O072M772m726m736L702M925k173m628K69M576J535
197D154l219n056J306P569J52j0988j397J2863K590j4062l279J3469L185j0525
211c238m445P635O144l414p435m59R727M678j1680p667J1675R698j0481j0564
225i826O978J1126l382j0012j650R020M994p707q529O699J0131n325j0209L759
$$ y = [-33980, -21452, 38144, 20577, -35194, -15881, 25690, 12699, -7517, -6435, -8026, 8765, 28743, -6855, -38283, 10981, 44898, -11833, -42552, 9499, 32987, -4979, -22082, -6230, 4659, 13599, 6227, -24206, -19291, 25594, 22534, -24587, -20343, 21292, 16785, -12647, -8474, 7365, 5392, 1654, -1007, -6989, 667, 12157, 1093, -12906, -1940, 9544, 6, -7138, -563, 539, -3990, 369, 4326, -1800, -5434, 638, 5410, 684, -4052, -350, 4575, 2402, -2226, -1957, 2619, 4154, 935, -4121, -2815, 4754, 4906, -6082, -7479, 5384, 7974, -6088, -9367, 4102, 7287, -3238, -7683, -48, 6096, 2682, -4753, -5212, 4515, 9193, -2487, -10154, 1521, 11219, 738, -9826, -2848, 8278, 4896, -5116, -6766, 2254, 7248, -459, -8988, -2289, 7842, 2517, -7692, -3933]
239c933R730j659p064j001N195K780l482m248K631N045j923n791K544N079k616
254A287m653J826L852j265l103L01K739J039l157j950L583L711m741m091M461
269a61M513l318m485K374M184m15m323j701L998L026l644m508L900M809l052m940
285c743J900M856j011m357m20M162J488l467k611L214L581k826m236K501M173
300C204k021l620R29L609qk988j128K632K142k528l125J896L853j569m110J140
316a692M247o93l820k33L697O27k960j843K652K759k307k964K004L029j279l433
332b209N67L352K21l255p37K638K012k477k684K074K934j779l009R82L030k83
348A377k870q9K664J012k488j620J699K260j368k598R58L068m33k782j59K502
$$ y = [-3933, 5797, 4138, -2926, -3927, 1268, 4048, 566, -3682, -1051, 3994, 2071, -3720, -1176, 3903, 1287, -3366, -1540, 2312, 1047, -2056, -1755, 984, 2023, -1134, -3084, 499, 4210, -531, -4622, -161, 4352, 1034, -3451, -1077, 3107, 2692, -1631, -3332, 666, 3692, 48, -4460, -560, 4249, 1197, -3743, -1843, 3013, 2002, -2355, -2775, 1387, 2875, -592, -3203, 11, 3592, 766, -3470, -969, 3204, 1183, -2437, -1508, 2101, 2093, -895, -2023, 609, 2751, 223, -2902, -1006, 2847, 1278, -2832, -1692, 2555, 1862, -1958, -2191, 1506, 2133, -827, -2670, -18, 2741, 434, -2530, -526, 2503, 1224, -2209, -1642, 1710, 1931, -1324, -2061, 577, 2589, 112, -2572, -498, 2436, 657, -2352, -1370, 1660, 1377, -1493, -1582, 1082, 2094, -394, -2014, -315, 1945, 577, -2021, -1063, 2005, 1572, -1210, -1369, 1133]
364A133P31k705j160J983K106j924k069J404K344p48k820N27K454j8k029q03K002
381D08J179j371j633R51J723m25k104J85K018K19j782p59J766P52j237r30Q72
398a68J208m20j759N13J100l0q28j60J098J37j057j89N87M32p04m43Q24P19q43
417A7p86P27Q43m88r90K89R25k66j152L99J312Q3j321o08J263Q98j125j453J253
436a80J549o06j766K4J886K59j957q52J915J285j067j965N61K193j0k017o82J964
454E34J021j965j321J700J603r44j939O77J581K17j248q10L46J316j80j383k52
471a047J776N63j872m29J179M78n69k32j67pQ43k34o83J05J034k08j265K81N78
490A24j04q8K87n50k43J017J92j515L37J327j09j343J69P21J34o3p61l30R56R47
$$ y = [1133, 1864, -841, -2001, -18, 2088, 164, -1905, -501, 1843, 1095, -1725, -1198, 1256, 1238, -791, -1594, 408, 1587, 216, -1417, -466, 1257, 832, -1272, -1087, 931, 1150, -632, -1391, 375, 1127, -110, -1040, -168, 1040, 620, -1139, -626, 474, 444, -384, -544, 554, 691, -366, -555, 32, 464, -240, -683, 141, 860, 17, -769, -42, 801, 313, -677, -388, 537, 271, -881, -482, 830, 913, -408, -1016, 247, 1145, 20, -1433, -180, 1369, 763, -1003, -979, 907, 1166, -791, -1643, 272, 1557, 490, -1475, -914, 1279, 1269, -748, -1430, 534, 1555, -410, -1731, -31, 1572, 628, -1311, -634, 947, 1164, -84, -894, -548, 768, 588, -795, -1047, 729, 1292, -580, -1009, 170, 648, 79, -153, -320, -327, 516, 282, -401, -296, 738, 530, -735, -454, 124, 20, -68, 219, -331, -574, 443, 635, -880, -543, 784, 675, -668, -499, 222, 356, 293, -468, -798, 158, 1105]
510A105j364j137J332J421r32j522Q00J352m82r96m44R29O72q54o87J44J194M42
528I73j246j018J216J509r60k013P10J848J13j972j13J371L33j24j137j73J194
545E11P05j545q85J117J125p07j256O58Q72l45l19m55k00P88R79j123p04J075
563B91O22j189l69Q45L34l85r5l59K12N57J52o19r14J104L20j012l45Q33L63l57
583a1k04J45J91Q3J51r15M8J141m6j332K78Q22J67n79m3K19M39J0o02m88O56M93
605F23o60o02O36N01n49o85M74L88J91k78n10J26P16no20k0M23K10l64k85K28
626f2N96j97l34k67K29L70q6p23K45L50J45n6m63P3M97j39l62J28n8p4J87J34
648A33m08L69K75n13r8L73j2k77j19L31J33m06K12K3j01j83N49j3l76K81j50r4
$$ y = [1105, -259, -1396, -64, 1357, 425, -1097, -297, 1055, 573, -423, -867, 62, 734, -120, -807, -663, 531, 973, -273, -1291, -75, 1434, 474, -1539, -829, 1019, 1132, -840, -953, 418, 751, 627, -510, -683, 511, 1216, -329, -1214, -97, 1028, 321, -935, -277, 595, 250, -69, -524, -724, 64, 1043, -80, -784, 291, 913, -276, -645, 200, 534, 149, 54, -305, -93, 464, 616, -3, -917, 187, 507, -505, -850, -17, 346, -11, -215, -70, 121, 204, 355, -560, -512, 629, 583, -749, -471, 351, 518, -61, -104, 115, 554, 564, -38, -526, 130, 623, -37, -639, -3, 498, -51, -736, -262, 126, 317, 39, -471, -345, 371, 366, -254, -274, 149, 359, -5, -290, -62, 534, 337, 3, -264, -35, 335, 249, -474, -229, 121, 266, 210, -253, -180, 317, 178, -184, -56, -114, -188, -1, 133, -275, 94, 369, -144, -242, 131, 119, -158, -277, 54, 187, -219, -7, 16, -85, -268, 281, 268, -108, 173, 23, -71]
670g1l2P2N4J2k12K40J43j9j54j63L65Q6l63J67k12q9M4R3r5R6K01q1q1j81N25
695C45k27n41K24K68P1j86j65L72JOR8m14J41R8l56J03K53l4j20O5j01K12L0J
719A44k02p9K51j2l53M21k33Q1L53j05k32N1kM8m7m2q9n5J27Q7j47j95L91Jk60
744i8J3L3L00l06rj45J04N35n48R5K84k89NJ8j92P8J71Lk04J81m7K40j44p5j15
769a12L27k48J20k12J62O2K5q1l0P9j3K46m57J17j07J98l7N2J0nj29R2K2m7q2
794d8L11j42m17M92j94P1j74j44K91j43j15K75o7J01J15k09R9k60J06J2J7J82
816A59j15j93J95Mj91m9K27J96k38l3j03Q5K2R8k20Q0J53Q2l13P1O5J22M0j41
840CK07k06lJ4P8l70L15j70K0o9NJ6r2L01j55NK31k7k41M2J20K28k5k94N5R3j85
$$ y = [-71, -103, -31, 23, 35, -177, 63, 206, 187, 33, -130, 235, 321, -42, 125, -87, -176, -132, -39, -134, -38, 163, 82, 1, -180, 345, 118, -423, -199, 69, 140, -46, -211, 161, 162, 168, 266, -148, -7, 91, -265, -162, 91, 57, -63, 2, -99, 113, 143, 144, -58, -137, 114, 102, -251, 170, -63, 18, 371, 266, 34, 85, 83, 131, 84, 42, -47, -102, 25, 112, -35, -230, 161, 162, -98, -85, -52, 248, -58, -67, -212, -108, 427, -121, -26, 258, -31, -26, -8, -200, -122, 49, 52, -152, 29, -18, 222, 78, 3, -112, 215, -33, 87, -125, 37, 99, 124, 43, 13, 92, 79, 325, -132, -15, -122, 76, 39, 91, 101, 96, -33, 59, 81, 34, -48, 263, 121, -296, 196, 2, 73, -101, -245, 46, -97, -212, 63, -4, 97, 212, 3, 102, -158, -52, -40, -23, 159, 44, -149, 46, 50, -141, -190, 37, 233, -5, -38, -141, -56, -34, 64, -156, -76, 77, 159, -154, -83, -18, 104, 144, 3, 210, 4, 1, 15, 93, -277, 38, -132, -112, -181, -176, -160, -252, 49, -106, -101, 130, 103, -138, -96, 24, 252, 227, -67, -12, 81, -104]
867a04K87n5p7L2J54r7l17K62n2J96m36L77j75J49j18J5Jk60K53j72L17l13j8
890a51K28l25J32K5K56j27j36l4J19K9J05p5J9j82l6j36J58j03J08K18K0k25N0
913f3K57j51l8L8K74l62m2j66L31k63RL30n6j0j92MMK04nl25N7K61%R2k40K48
939A96J91m53L71o13O45l45j03J15J91j54QJ14k70K10j14k20L36m80M29J17l00
960a29K56m3k8P0j05O6j34K06j88J1j18j08L85M9l57J07K66l1k22n4K47k54Q4
983b4j59K15O6j45K9K4j84M8K05R0kK7l31K31j39N3J4k38J86k4J83k53j02N38
1007C08k45p3J51l64J94r6J60k36L96l07J38K22k91K92j43j79m4j5N9L0J33K31
1029C21m16n6LK67p0l3pr8L5K3r8N50k79q1j02j00J72J77l95K90Q9N5j94l26L22
$$ y = [-104, 183, 128, 51, 83, 237, 140, -177, 85, 33, 229, -207, 170, -5, 144, 26, 41, 42, -218, 35, -137, 180, -133, -151, 77, -248, -116, -91, 165, 38, -98, -132, -13, 16, 121, 46, 65, -117, -153, -289, -131, -234, -126, 92, 112, -113, -63, 194, 43, 5, 43, 317, -45, -87, -253, 78, -185, -176, 154, 98, 88, -104, -100, -96, 108, 103, -222, -165, 96, 96, 188, -52, 196, 387, -66, 305, -308, 337, -8, -111, 4, 195, 41, 49, 163, -107, 103, -11, -231, 105, -375, 54, 171, -129, 127, 84, 56, 126, 21, 87, -47, 159, -29, -18, -136, -244, 141, 190, -167, -60, 206, 175, -47, -101, 146, -108, -24, -183, 32, 98, -47, -18, 6, -178, -130, 75, 165, 163, 190, -141, 90, -49, 4, 18, -220, -34, -58, 125, -128, -230, 308, 63, -10, 141, -223, -29, -125, 35, -201, 195, -112, 26, 248, -43, 249, 106, -73, -117, -132, -73, -43, 90, 321, -95, -151, -148, 119, 49, 16, 9, -89, -54, -31, -129, 421, 142, 61, -41, -141, 31, 208, -187, 103, 192, 247, 53, -273, 49]
1054D9J21j33J26k55K28j58J18J17j99l3R9l8j79R7r6J91J7LJ82n51L03J76l9
1077A46n59N52o8j91k88K49L4L69k34Q1j46r1J64J20j45j32N1N4m9K52k73L03
1099A99l8Q0l21j17L59j15j40P5J6J51J27n50J67N8k1J61J06l00N5Q1Q6L4l64
1122b11K10K46k45o3OK55l18j48k0K78J10l52L12J65l12J20q1j2Oo4j7K81R8r1
1146A53k65J70k47L21q7q3m6L54l59N9m3j45L3K13pJ43J9j87J62k98J78r3K80
1169B25j77k15J91k3P0j94K34J14k09K3j41Q8q1o3n6K16J19k17J3p3J27j31j88
1192c48M25J32j84j06pM7L23k70J23o7o9j12l7N6j23L22k5o8k10J37j16p9j3M11
1216A42j22n8k7J66j11k46K58p3jp3R9O4j27PJ56J06k30o0J27M1k54K01n7J76
$$ y = [49, 170, 37, 163, -92, 136, -22, 96, 213, 14, -19, 80, 42, -137, -40, -136, 55, 72, 75, 257, -294, 9, 185, 146, -413, 139, 71, -120, -408, -159, -125, 244, 10, 91, -55, -146, 18, 138, -7, -139, -88, -34, -83, 169, -104, 199, 161, 241, -80, -197, 162, 47, -93, -18, -2, 149, 276, -274, -107, -49, -70, 91, 197, -103, -48, 33, 119, 153, -211, -1, 245, 0, -63, -57, 198, -120, -268, -288, -10, 100, -252, 60, 225, -87, 33, -48, -60, -54, -118, -135, 146, 244, 153, -112, 58, -189, 132, 45, -38, -84, 270, -89, -30, -73, -218, -185, 28, 21, 164, 183, -4, 158, -140, 38, -55, 225, 48, -167, 24, 1, 71, -123, 111, 225, 16, 39, -102, -14, -95, -158, -214, 2, 121, -96, -83, -156, -29, -160, -348, 77, 209, 25, -81, -88, -41, 282, 12, 135, 68, -1, -113, -150, -94, -217, 105, 80, 12, -198, -61, -177, -256, -269, 142, 20, -38, -65, 101, -10, -256, 2, -71, -72, -145, -46, 18, -109, -102, 54, 160, -70, -130, -3, 38, -216, -15, -72, 104]
1240A04j26LlN8j91J91k21K08j58L61l3k71q3J61K95n07J8J31L15q5n3k78K13
1263D9K3j27n5P6o7KJ50p5j52K08K7J54j07Q0l09k7j4J94o6K1R4k65J87N9l80
1288c20L68J2j93K12j91J1j90M78k37P1j50O9J59Kj87K04j31j15J62j52K05k29
1310a42J69j54J66j74J99K6o9J34J41k79j0j42K95k18m9J40J32k15Q5j75N2J82
1332I4Rk61J07M9J46r7K17k72n3J10l2J07j93L06J2J2j05j27Q2m2r6j86K34Q6
1356A07mJ88l07J47k05P9j9O9P6M1o4j18j56L39k38k6l2n6j72L72j80J75L2j6
1380C2k04J06L9K6n1J61l40NJ02J27j70K43j51pLq6%Q1J52k91K51O3K47l46q8
1405i6Lq3K05J12j29N7l22M55l1j61K24k23J20j22o3k10K34K39j92lJ17j03n9
$$ y = [104, -22, -19, -22, 36, -155, 36, -185, 23, -135, 226, 193, -78, -161, 0, 295, -212, -194, -63, 252, 167, 114, -164, 49, 72, -55, -110, -34, -101, -99, 51, -24, -176, 32, 59, 213, 106, 186, -123, -150, -164, 30, -36, -15, 79, -186, 1, 60, -320, 48, 60, -133, 79, -112, -101, -291, 187, -50, 21, -129, -60, 99, 101, -86, 118, -13, -128, 34, -118, 87, -142, 27, -127, 39, -135, 64, 90, 21, 155, 296, 17, 7, -135, 160, -58, -107, 33, 165, -50, 35, -140, -88, 94, 103, -158, -51, -2, 144, 47, 264, -8, -61, 49, 17, 124, -69, 237, 249, 261, 156, 29, 111, 69, -27, -213, 21, 107, 103, 291, -16, 131, -74, 5, -14, 55, 131, 172, 108, -10, -166, 173, -65, -91, -123, -179, -351, 21, -159, 16, 48, 32, -172, -66, -27, -1, -52, 109, -231, -226, -124, 3, -167, 76, -75, -82, -79, -165, -165, -84, 68, -223, 28, 91, 338, -8, -96, -93, -176, 29, 141, 12, 69, -253, 202, 171, 10, 234, 11, 131, 9, -54, -264, -30, 209, 17, 14, 131, 28, -31]
1428c1R8J51k29J6O3j86R7l19K77Q2J0J63j73QJ20k0p8k1m3J34J23m36K24P5k95
1453a90R2J88m85M23n1J97J64k34M7N5j05M1l89j23N36k19R3J71m17M56l66j5
1475a31K50J23l23n8O9q3K48l3j54N7K10q9J03k65j63J27K96k10K56n06J99J11
1497C4J08j17P6L5l56M50l59R8R5k16Q1K35j62K82k41m9j96J86P3Jk12m6K98j43
1521d5n3L86m64L45j4q9j06j37J12K50q5O4p6k16M80l55k03M6L18k07j53L1O5
1544a06K66k46J81j67J11J95l23K98j74j62l4K52j28j50L7K75J8j75K82Ol72L58
1566B42k85J28k40K80k77J40k0j24M3J07Pj36K51l25K24j46K62J30l01j71K84
1587G3Lk65L15j54o9J70q4J6K3m1j71J68J70m80M40J10j01l17J67P3q3K94m97
$$ y = [-31, 67, 218, -11, 5, 68, -118, -21, -340, -63, 19, 29, 192, 19, 27, 147, 127, 49, 28, -15, 119, 242, -194, 30, 105, -190, -98, 90, -395, 28, -23, 174, 338, 104, 151, 206, 101, 142, -247, -370, 166, -53, 40, 211, -206, 250, -116, -131, 119, 242, -81, -139, -70, -153, 95, 62, -92, -35, 175, 86, 189, -76, -239, -112, 184, -26, 230, -276, -77, 34, 142, 25, 101, 136, -220, 230, -129, -31, 64, -152, -71, 164, 2, 284, 43, -6, -202, -16, 57, 58, -154, -200, 98, -45, -98, 288, -176, 169, 155, 66, -40, -177, -65, 185, 100, 164, 88, -128, 352, -3, -206, -160, 158, -49, -202, -171, -106, 160, -86, 95, -72, 39, 234, -89, 209, 35, -127, -161, 91, -37, -187, -150, 125, 143, -32, 250, 256, -116, 242, -43, 85, -155, 125, -152, -12, -32, -156, -113, -6, 1, -135, 116, -209, 15, -131, 131, 261, -40, -211, 73, 76, -189, 126, -28, -97, 73, -11, 5, 28, -13, -184, -16, 154, -326, 114, 224, 123, -194, -27, 46, -37, 257, -240]
1610b40J34M5J82K5l36J43J09j29j40L31j80p5L57m47J08J12K00j79p3P5R5j2
1632A05K5j04J58K68m88J23r7r0J04J31n1n1J4j58R7J24m5J40k71L58j45k75P8
1655e0R3J21nj07L8j30j2O6P8j96N6K55l87M56j91Rj30K77j93p6J50j87P0K63
1679B68k61Q8k5K33k91NK54m99J58K26m7j81J36Pm6N2l0M2j4l63L61%k74J95o8
1704g4lK81j24j57QK73k6j15N3k9j26m2Q6O6j43q6K40l5J43j94J48k47K02j98
1728i9l6K5J07J13O0j50K33Q7l88Q5j37k54M91r8j90L50k1Lk89J00j41L44m0n
1752A50n8Rm41K80N7K2J6n6k62J99J39m3l0q7J04k2J00Kj44P6l17L51K04k8l85
1777a64R4L1K24jp9l31J75J75j9j29Q2M6o9n4L29m89L22j47Q9k24j2J66P1P8j61
$$ y = [-240, -106, -61, 121, 146, -190, -47, 62, -67, -207, 124, -56, -131, 226, -221, -113, -1, 199, 20, -53, 22, 117, 105, 130, 26, 184, 452, -36, 87, -10, -100, 4, 135, 84, 33, 47, -111, -14, 110, 65, 205, -66, 292, 147, -128, -50, 43, 164, 159, 52, 90, -40, -52, 14, 92, -104, -48, 207, -180, 276, 85, 94, -36, 241, 48, -28, 122, -65, 5, 268, 7, 95, 70, 303, 12, 17, 271, -228, -70, 156, 109, -72, 64, 71, 25, 77, 47, 89, 75, -288, 73, 73, -201, -6, -74, -77, 204, 80, -77, -69, 204, 178, 63, 116, 87, -39, -81, 5, 71, -72, -158, 82, 47, 190, -4, 144, -103, 99, -99, -135, -110, -3, 110, 170, 20, 253, 340, -48, 37, -100, -354, 137, 39, -151, 199, 178, 181, -108, -8, -149, 195, 155, 150, 92, 101, -340, -60, -3, 19, 35, -21, -283, -84, 55, 12, -18, -105, -1, -23, 77, 79, -65, 11, -306, 45, 249, 221, -164, -70, -39, 185, 184, 105, -226, -51, 124, 105, -24, 58, 104, 35, -19, 310, -179, 143, -4, 85, -139, -151, 15, 86, 164, 3]
1802CR1Rj03k26J72J02o6R8k92L14k08J63J06r1p9o5J20L1r6K22k22pJ19o2K33
1827B66j52k62J80J5L9j28q5J01K69j56j45lo6M32m21J59j96R6J96p7n0p3J06
1850D5j3j21K69p3J2k47N5K02m9J97j08j39J31j59k1m6p9n1k4K41K2J4n3J2J30
1875A47k25j70L33p2m9K24l59J10J76Q6l80K94l2k2j40R2J81k53K00%J80m7l88
1898a14j60J28K89L8p0k07M78m28j04M21q7k1K8j08L3r5r5O7J46j55%M4k07J27
1922e2R5r2L5L60l41N5j57K18j28j23QQ7Q8K72l93J6p1M55m60L4J38j59K49k08
1946g4J39m9j72Nn1J05J23j29L09k73NJ29j44L47j17k93k92M50J83j23M2j60j9
1969e9M2n7j10J46J23j1n6J22k14J65j8j16P7j45L8J41j98m4J78L2J47j63O5p9
$$ y = [3, 94, 103, 0, -226, -54, 48, -18, 80, -212, 102, -106, 57, 163, 72, -7, -72, 48, 79, -17, 205, -17, -24, 95, 33, 266, 114, -148, 32, 47, 86, -42, -127, -26, 243, 87, -58, -61, -127, 305, -116, 43, -153, -57, 139, 62, 12, -61, 45, 32, -89, 180, 107, 119, -128, -73, 129, 80, 277, 169, 30, 161, 2, -19, -65, -144, -195, -219, 22, 44, 58, 5, 17, 147, -78, -248, 85, 13, -36, 188, -171, -61, 115, 201, -179, 115, 83, 61, -79, 13, 194, -59, 141, 141, 321, 274, -114, -274, -146, 143, 181, 111, -96, 382, -46, -150, 271, 184, 163, 191, 83, 116, 21, -74, -7, 139, -16, -16, 28, -179, -52, 43, -49, -14, 346, 5, 60, -97, 121, -7, -130, -122, -35, 53, 325, -68, -52, -123, 332, -128, -94, 44, -115, 134, -74, 65, 16, -156, -151, -202, -97, 26, -103, 206, -67, -62, 67, -77, 270, 153, -140, -432, 18, 201, 78, 120, -40, -59, -17, -74, -184, -38, 85, 74, 18, 140, -74, 91, 73, -43, 34, -111, -73, 68, -130, -174, 4, 36, 183, 20, 85, 6]
1993FJ01k48L52Ql81J72j58J90j00K38M6j47o6k03J38j10R3M7l7K9Q1M0M9j90
2017e0P8j88K55J07k88J15j61L5R1K92j53j05j92L15k57R4j3J2K30o0j69J14j78
2040g6OL4l0M4J21Mn3L02l83J04j59j0L21k25J78m3j84O6k73K2J77Q2M9J06j19
2065F1R6l66J74l6P8L78l54l5q2P0R3J66j24k16K38m04L67k7l19J52J43j24n2
2088a23q2J13Q6j24K32n7ML8l0k70K18m3P2m5r5K02l51K66n1j45L10k74J61K8
2112D0J06j87j0J74k62K05Q2k26K7J84k16%j19K48k2j14L1k1J74k29J60k02P4
2135a03j3J38j22K4N9O8j58J26j55j14K25o9N8J44p4j30K15k94L51k92K77k34
2157g3J60J6j67K29l09O5J3m5Q0j07K72j04J9QN1r5J4O1j05J01j67J63l3p0k70
$$ y = [6, 107, -141, 211, 219, -162, 10, -148, 42, -58, 180, 226, 79, 13, -190, -52, -162, -69, -22, -59, -30, 51, 91, 140, -50, 28, -160, 95, 202, -86, 29, -132, -97, -6, 286, 133, 28, -164, 151, -106, -12, -25, -13, 217, 157, -12, 102, -76, -70, -36, -66, -22, 99, 103, 50, 352, -31, 73, -86, -96, 225, 0, 178, 135, -49, 17, -256, -234, -57, 25, 74, 180, 61, 157, -209, -35, -71, 7, 385, 31, -4, -86, -16, 77, 243, 119, -97, 141, -263, 104, 77, -242, -90, 53, -71, -123, -205, -92, -6, -130, 102, 45, 49, 87, 57, -213, 5, -38, 34, -11, -106, 96, -255, 11, -40, -185, 125, -149, 12, 40, 146, -41, -51, 123, -139, 66, 148, -78, -51, 133, -83, -83, -202, 46, 24, -90, -59, -80, 94, -135, 25, -177, -103, -116, 22, -100, -76, -17, 51, -107, 19, -136, -250, -25, -94, -36, 108, 34, -96, 119, -175, 176, -116, 161, -73, 87, 103, -64, 165, -144, -79, -66, -111, -31, -138, 134, 30, 49, 57, 108, 13, 27, 88, -17, 84, -83, 80, 47, -23, -293]
2182b93M45l94J46J57p2n8Q3J78l56P7Q3j25K14l0M3k07K45k4m4L9k5J52k83K80
2206B31l30M55j41k22l5Q1q4j6K58l25M9J58k8j2k51K23j23J16j13J71m8J00j74
2229f0j5j56L88k50O6M6k55L86j21j41p3J18o5k0K22j53K1JK11j15N7j80K00J00
2253B12k69K26k61j23Q2M17m14k47L56p0Q6J06k68K66j32m1j28K91j48j63K81
2274E9j56R4j89M51j73k73J85J17k61J15k65L26j57L14k11j7R9O9j06Q8m7k04
2296a42K33Qpp5M0l31J73kL43j71j0K60l58jK6J18n5j23j23K41J66n05K80J22
2320A07k92N01r3l81K13j45m5O9K92j83n2oJ90k65K08j60k7KK1K63k09J56m6q1
2344C7m6j26J36J10O8k98L5j9%jN3NQ9J28k65K87j56P6Q9l10nJ48K6j19o8J41
$$ y = [-293, 152, -242, -96, 61, -11, -69, 14, 192, -164, -87, -4, -129, 85, 55, 98, -109, 136, 112, 68, 107, 82, 234, -49, 231, -99, 356, 215, -7, -42, 39, -45, -61, 197, -128, -79, 79, 51, 39, -212, 11, -112, 4, -109, 62, 14, 114, -60, -75, -231, 157, -93, -27, 19, -236, 150, 29, -112, -185, -67, -132, -152, 70, -83, -62, -61, 150, 35, 92, -88, 112, 212, -57, 169, -92, -215, -133, 284, -130, -377, -21, -91, -5, 101, -167, 99, -33, -74, -202, 89, -59, -222, 59, -97, -3, -192, 259, 86, -187, -2, 115, -146, -31, -296, 30, -127, 187, -24, -41, 58, 127, 21, 109, 62, -142, 91, 99, 92, 17, 57, -274, -101, -103, 240, 69, 59, 319, -39, -40, -14, 104, 49, -74, -197, 44, 210, -295, -15, 107, -185, 316, 223, -158, 55, -90, -135, -66, 226, 43, -9, -15, 175, -90, 118, -42, -69, -67, -46, 217, 8, 164, 118, 37, -9, -135, 1, 111, 179, -119, -84, -103, -103, -104, -51, -46, 43, 171, -94, 193, 37, 113, 202, -108, -113, 35, 61, -58, -126, 15]
2370A5R8q2jk65J76M15l52k13J42J38o4Rn9P3j12L0k5m9K55j60L8m6M6J06J72
2395B85j78j42J51QQ7k42R5k04K42L9j91j34J01K89j10l78L16J17r6l1r1J39o2
2418A0J3J71j9l32J49j21M2P3L3j61L5R8j23m3M22j08J02k61R9J66M3k61n6l13
2442c42L13L8pR2L0n2R0j62j49J76M0K15j41j42p5J60k30Q1J59o4L27l45j05R1
2466bj94K44J35k99J97j07k33L47J1k98K87n5p0n9O2jp6j2K49n1k65J64LP0k27
2491a80J05P4J07Q2k17J46R1m07K7q1K17j67K95r6p3q6J88Po7J51j26p0l34M67
2515E3l1R8n7n0k8K9M7k8r3o9K44j30R5N0J69n23K24K8j24O4m4L62m05J29n8r
2541e7j88J68L07j80Q5j59r4O7Q2J06m23L23J7Oj46Q4P2j71L00j94N9j45K66q2
$$ y = [15, 113, 31, 30, -235, -59, 356, 4, -209, -67, 71, 7, 16, -43, 30, -82, -52, -77, -126, 129, -31, 7, -39, 7, 113, 285, 107, -35, 116, 124, 211, -31, 64, -140, 102, 141, -50, -184, -83, 206, 96, -282, 34, 151, 55, 24, -67, 72, 10, 23, 194, 175, -157, -8, -129, -87, -14, 19, -142, -107, -9, -132, -175, 247, 139, 241, -20, 79, 245, 288, 27, -29, -342, -29, 9, 2, 94, 124, 72, 162, 0, -149, 27, 67, 282, 141, -1, -76, 84, -146, -65, 94, 30, 357, 12, -93, -2, -196, 48, 183, -116, 81, -26, -259, 88, 99, -199, 88, 33, -37, -96, -34, -35, -111, -123, 126, 75, -190, -26, -23, 47, -180, -75, -1, 106, 188, -29, 117, 208, -199, -172, -253, -36, -203, 92, -4, -77, -163, 25, 32, -35, 116, -10, -80, -414, 53, 22, 120, 63, 13, -15, 14, 61, 33, -60, -129, 115, -15, 80, 130, 299, -224, 0, 28, -96, -32, -76, 286, -119, 10, -48, -57, -245, -77, 230, 50, 135, -24, -118, -51, 31, 137, -286, 37, 54, 60, -86, -2, 70, -101, 199, 5, 64, -81, 185, 103]
2565A03j3Q5N9l99K59k58J22J00R2q8l45N38j11j78o9K81l00J11M8RJ32m9j56
2588b7R4k63K89k08J58k78R2K27k29R1Q4K54j72j50j22j35K73lR7O3Kk43L39k56
2612b3N0P8Ql1O5l33nK08m8k1J72k75J67K4l6m2J89k14J59nN6r3l50M73j08j84
2638a19r4K15N9k86K24L4L9k04N8N9L57l19m04L34J54j67J73m4j53K73j8l58L07
2661A20j87K51k36L04l42l5J18q5J16K9l2p6M8O7ko6O1k32l1J39Qm6jJ28p0K27
2687A75k17l4J11M6R3j50r8L41j86l45K94l77M27j10J28J50l03m7q0M0L04k02
2709d0O1m8J68N7r4Kk31J35j21K71j06j1pj67j3j5K43j1j6l09J72J17j10J34j02
2734d1RR6Np3q3J0j93M94k35J56k54K77k05K8r4J16j46O2J64K60k86j45J10O9
$$ y = [103, 90, 175, 234, -165, 94, -164, -42, 58, 150, 62, -283, 255, 144, -34, -103, 178, -122, -11, 37, 46, 178, 129, -27, 67, -196, 93, -115, 43, -235, -143, 84, -145, -54, 30, 284, 112, -38, -160, -295, -22, -25, 72, 135, 137, -106, 233, -23, 27, 105, 113, 82, 147, -186, -191, 17, -31, -52, 120, -155, 12, 36, 0, -42, 147, -67, 92, 87, 143, 50, -300, 173, 65, -119, -213, 2, 61, -225, -1, 33, 72, -132, -74, -15, 342, 23, -381, -47, 107, -60, 113, 69, -84, 189, 171, -187, 120, -67, 184, -52, 252, -90, -125, -7, -92, 24, 53, 21, -55, -7, 60, 58, -8, 53, -179, -210, -71, -63, -109, -110, 18, -52, 175, -42, -76, 35, 81, 174, 24, -74, 267, 81, -264, 30, -347, 80, -30, 98, 248, -55, -102, -182, -142, 162, -40, 21, -27, 141, 198, 104, 106, -125, 10, -111, 160, 54, 43, 36, -131, -144, -159, 84, 73, 57, -252, -80, 37, -73, 61, -41, -32, 64, 69, -4, -87, -77, -270, 224, -11, 145, -109, 168, -37, -9, -103, 13, -133, -71, 93, 353, 67, -78, 32, 101]
2758A01k10k0J15m1j27Ko1J50Q6J5K2L5j07R9p6j7K83l62L39km66J91p8J67o9
2783c1m1M7K9L6J24m69K79K04n2p4k8o4J69j98j01K7K23l2k71L8J13q7L00r9M3
2808H5j51L6L6m7K73j59J19j53r2J5J74k22lK86k17j98L8L75l10o9l7K3Q3QoP6
2834c7J11o1k82K51J38l14L12K30j66k68K9P3K92k80j09j2q4L66q9j6j06p4J42
2857D6K2r2J57j97K50k77j58K20j44J51j2M5K2Q0j22o1J28K2k24J46K87l60k6
2880i7m9L47j21J40m72M41o3k58J2K17M3k84L22k37J5J28qo4n0r6Q5R5p7K7M9
2905D5R3j13J72r1l13L01O0j55l8J33l06L12p3O2j93K69j95N4j3Q2j73mJ7j11
2929a78L63k14J3P9L2J4m9k99O9OJ78O0k03J83k27L47j17q3n7l5J93l7J51j29
$$ y = [101, -109, -129, -14, -55, -182, -180, -241, -91, -5, 10, 32, 67, -40, 59, -17, -34, 249, -113, 226, 224, -242, -51, -129, 38, -31, -72, -25, 4, 40, 164, -305, -26, 178, 126, 52, 24, -40, 129, -69, -170, -143, 80, 48, -223, -185, -72, -159, 141, 42, 85, -66, -30, 6, -41, 232, 73, 192, 39, -53, -38, 136, -86, -89, 197, -20, -218, -180, 195, -115, -184, -221, -198, -115, -107, -113, -37, 74, 13, -269, -18, 120, -194, 118, 348, 182, -86, -57, 16, 308, 28, -81, -93, -177, 189, 100, 84, -22, -96, 46, 68, -24, 133, -64, 186, -91, -249, -29, -173, -22, -34, 11, 33, 113, -9, -70, 58, 80, -144, 2, 289, -71, -97, -146, 201, 80, 220, -252, 189, 126, -132, -120, 97, 140, -144, 178, -59, -44, 84, 76, 12, -38, -134, -49, 46, -31, -4, 45, 138, 25, 197, 106, -207, 94, 154, -1, -39, 94, -212, 100, 27, 89, -104, 165, -30, 24, 11, 93, -80, -84, -67, -178, 185, -29, -16, 63, 95, 109, 60, -239, -170, -164, 14, 74, -129, 54, -173, 174, 57, -26, -83, -118, 75, 38, 189, 60]
2953F0Mj51jp5K67m7N5k59J13K4qk76L88p7J1k5o3n5N7J25j35K36p4k49nK46j19
2980c3J11j2J37l24J98l2m3N6lj14j00K93K6j19j58j88L14pK7N2l3J28m08J44
3004h8L06m95K72PNJ19m14K44L5j62J98j17L73k57j10n0M56j99j29J11k10j4l5
3027a54K97l31K49o9J5k5K2R4j16J61l77L31J56k26M7n3qj71Qm3j1R9o6L6J12
3052b3J5J05K8l77L06j23P6n2j12J16P7P5Q1j55j60K23k01K10l75J65K51j58p0
3075g8l53M80q1L25m83M0L72m1m4L6j16M4k52L52l65J73l3J22R6j99p3Rl2M4J56
3100I9J1k15J41o5n9R6n1J74j7j84J54L4j34P2O8o1j32P6l0N2J18k32j4j16R2
3125a23P8j1J29k53J21K39J8R3m49N9J99j84L09N2l01MM5K08k13L79l68R6k76
$$ y = [60, 64, -87, -88, -163, 104, 57, 112, -147, -34, -10, -18, -294, 94, 17, 28, 3, -60, -115, -58, 67, -68, 168, 94, -155, -160, 86, -33, 78, 66, 203, -121, 77, 45, 2, 58, 55, -59, -159, 134, 160, 41, -117, -305, 9, 2, 29, 81, 48, 176, -232, -88, 218, -277, -5, 2, 7, 126, -288, -44, -9, -171, 27, -90, 283, 26, -84, -134, 322, 123, -6, 105, -105, -119, -154, 143, -188, 61, -8, 7, -18, 4, 98, -18, 143, -234, 97, 253, 27, 74, 21, 13, -158, -150, -193, -204, -105, -171, -135, -23, -8, 97, 125, -252, 54, -69, 7, -45, -157, -41, 36, 111, 192, 37, -123, 100, -101, 109, -266, -101, 150, -8, -78, -431, 49, -32, 293, -190, -150, 222, 181, 137, 173, 57, 101, -151, 201, -164, 9, -24, 98, 194, -5, -78, -69, -101, -57, 99, 110, -105, 36, -29, -88, 8, -43, 131, 114, -70, 84, 118, -16, 56, 124, 63, -69, 7, -23, 29, 147, -85, -99, -215, -123, -45, -56, 73, -180, -59, 180, 198, 291, -158, -99, 100, -84, 225, 277, -24, -20, 25, 233, 20, 399, 31, 127, -149]
3148a49j9j02L15l2k32L62qk3k86K52k30J49j37K35j43q6K70q5J32j17j7J3k91
3171b29J12J05j14J25l8J22m8o9j07J42mKk09R8KN8K68q3j12J37j82N1j18J01
3195A0k75N47l61J08m1J07j9j96K67k76J80k4J82j42k05J94K7p4j82L26j97j12
3217a56R0L10k60Q7K0n6k1J34k20R6J33o5j03l14K67J46k2j14J14J02l4J10n0
3240A94k48n3j04J63J8J38j99J03j38P5J17j17k3K4K11j36m5k41K32r3J07j47
3262a62L25Q3j96k52Jk0K57J5j46n8Q9J26k01O9j50K87K06l24K61m00M9J87L4
3285H0J77l71m5J75J7j25N7k9N1M7j1o1q6k2p6k2K73L5m0k18K26j46J74K3j69
3310h6L21l10J44r7O9k22K66q9o9K04r0q4J28K70j27l81J59j00J51j81J42o1P4
$$ y = [-149, -168, -270, 45, 13, -219, 143, 135, 112, -174, 78, -152, -3, -140, 95, -48, -134, 136, 51, 183, 66, 49, 62, -229, -117, -12, -126, -1, -39, 83, 35, -34, -141, 1, -3, -1, -210, -112, -110, -52, 216, 133, 21, 158, -24, 27, -91, 10, -265, 282, -79, 29, -12, 95, 76, -120, 147, -129, 51, 27, 209, 67, -138, 56, 83, 9, -173, 153, -44, -156, -66, 244, -16, 71, 91, 35, 14, 148, -72, 24, 157, 92, -11, -325, -58, 88, 66, -48, 66, 168, 134, 244, 194, -54, -107, -211, -48, -30, 108, -91, 12, -126, -51, 66, -51, -74, -50, 161, 25, -20, -261, -29, -122, -15, -162, 163, 246, 50, -202, -201, -221, 36, 51, -95, -153, -64, 62, -139, -70, -220, 67, 273, -51, 210, -190, -141, 46, 80, 257, -114, -159, 16, 33, -92, -35, -64, -13, 34, 23, -38, -124, -146, -222, -244, 29, 64, 24, -194, 32, -114, 60, 83, -86, 235, -75, 69, -28, 41, -181, 85, -4, -73, 131, 41, -43, 85, 355, 228, -153, 6, -94, 57, -124, 18, -43, 31]
3333C1l2NJ85pj41K28k21J37j25p9J5J30k85M08p1k89K23q3n0J05k39K07n9j14
3357a21K14k3Q7J0R5j67mp4k29K53J16j44J53l36K16k4j8o3N3J1M8j41Lk2K24
3382A17j52j15Q2k2J42J07k12j13J27l1M9k0j35J09J3Q4j35J24%k07L59k34r0
3405a53M90l43Q4O2n3j60Q9Pq2J63m9j28L30k24J42n8l70L59K6Q0j60j24l2k4
3429a28J1L40k77N9J68j45o2K1m2O6Kj74K84k94K23m9M2J1j29l5N5np8K5J75J05
3455A69J04m93M8K80r0n6L0M2j50J60j55L36k78k16M24k24L18j17Q8p1j36r2J52
3478G3N1l8p1l6L1k37L87J1r4rj49pL31k45J1j61K49p1j15R0l36K43O6n4j16O2
3504a34Q0N7o4oJ43m40K01K46j59j56L74k25k1J08k34k1L43J23j60J55k37K0J66
$$ y = [31, -1, 4, 189, 182, 41, 269, 48, 185, 60, -19, -4, 126, -159, 249, 178, -111, 112, 29, -21, 84, -155, 52, -7, -121, 93, 70, 157, 167, 262, 95, 91, 17, -212, 41, 157, 13, 166, -170, 46, 22, 4, -59, -6, 5, 53, -88, -85, -107, 117, -35, -150, -68, -90, 52, 159, -53, -166, -39, -70, -21, -41, -176, -67, -54, 30, -105, 19, 19, -188, 171, -63, -153, 337, -6, 78, 140, 87, -73, 16, 23, -59, 104, 55, -73, 257, 33, 175, 117, -253, 106, 132, 212, 52, -72, -104, -128, -117, 223, -54, 5, 173, 28, -34, -13, -55, 11, 13, -161, 123, -171, 52, 3, 45, 56, -73, -108, -53, -58, -136, -111, 64, 169, 273, -220, -172, 108, 18, -38, -8, 34, -116, 44, -111, 225, -53, -269, 155, -69, 249, 132, 220, 149, 13, -79, 73, 124, 86, 15, -21, 10, -227, 160, 171, 77, 68, -81, -88, 243, -2, 9, -152, 97, 26, -89, 1, -335, -92, -26, -80, -196, -134, -54, 3, -61, -67, 76, -364, -163, 83, -76, -232, 142, -83, -104, 4, -230, -251, 92, 215, 55, 210, -27, -7, 159]
3527A59k04k7K7M5J8K5p3R1O9k18J80k0k1J10k12Q1l6O8j49J56j49J27n1j32J05
3552c1j36l0L17k47P3K19j65M6J22O3k07M8k73J64L0n0j27M66l34J28q0J56k43
3575i1K0j00J41j25LK04Q4j62RJ09Lj91O7N7J33j63J37j17j63L26k59L58k66j86
3599a72J99k38J56r7J3J19l8J41k28j6M01j57K2j32J9n9O1K5K85l72N2l22K72
3622f6r2J24M8K28j36l16K72m7P4k66J72k95L10N5j32k5m9j75M98m78L4K37Nl9
3646e9P8J06j76N7Q0j1j41R4j85J66l5J42j49O4N6j0j37m4K9J39o3j45K33k19
3670a30J43K09j19m8j88L38j1M4k63R3j7m2j43J80k2j21J78j84P0J96k60K05k50
3693a42P4J14j38K5J7K3j02%K08j12m9J69k76J48Q9J17k03K2n4K18j81R0J59O
$$ y = [159, -45, -72, -45, 0, 18, 43, -30, 61, 130, -88, 92, 72, 51, 161, -51, 30, -6, 62, -87, 69, -80, 47, -4, -136, -31, -167, -197, 120, -127, -54, 165, 0, 46, 168, 231, 24, 72, -201, -37, -7, -57, -184, 282, -52, 76, -4, 152, -91, -71, -171, -30, -155, -152, 52, 136, -26, -17, 92, 95, -96, -29, 28, 161, -2, 135, 18, -145, 181, -78, 280, 14, -172, 27, -211, -55, -152, -139, -20, -58, 83, -145, -161, 240, 83, 105, -27, -8, -67, -6, 19, 304, -68, -16, -338, -66, -158, -34, 14, 242, 106, -210, 62, 15, 89, -177, -5, -300, 10, 65, -67, -92, -141, -316, 182, -296, -262, -25, -20, -59, 19, 125, -51, 6, 86, 75, -66, 28, -157, 9, -26, 116, -33, 31, 87, 77, -60, -104, -75, 64, 1, -144, 89, -130, 13, 222, 103, 55, -133, 205, 194, 238, -25, 68, 51, 9, -134, 46, 24, -97, 81, -103, -33, 163, -97, 108, -142, -68, 46, -92, -67, -50, -27, -129, -129, 79, -33, -82, 87, -189, -41, 48, 165, -38, -16, -70, 148, -33, 57, 216, 222]
3717B22j15p6M1k19J73r5K61l26J09J54q5p6j21J92n1j22m8K37l0J83l55J75m7
3740a9J4m5j8L1k32K84L4j42k0J77n1J59N1l08J50k59K71j43M4m6lJ81J86k70
3764B6O3J57q8j10n8l6K81k06n1K24l58P9r9J58J57K5lk62J34m68M18O6o9R9j82
3789a03J59J8n6M2n0j43O5K06L34n74O7j2k81J66M9j82L11J17j54j5L04l55J7
3812g0J50j47j95M10j32j06q8L62j27L4l10K75k36P6pK43l07K20J89m03j08N45
3834B68l62L0l8N3L3J52j40k8j70J04R7l20K23q7L82j53j60K17l84J40J92j84
3856a35L8L03l92L76j92j78L53p7o8L4k6j02j00Q2p2J0J78k01L57l26J47K7%j8
3880A8j28L76l38p6NL13k35mJ6K9q8J93q4n8P5l11K42L5mK47m47L19o0j60J46
$$ y = [222, 107, 31, 72, -147, 26, -69, 192, -134, -25, 129, 44, -32, -153, 39, -12, -134, -182, 55, 25, 208, -147, 28, -19, -5, -50, -68, -37, -269, 15, 49, -93, -113, 64, 13, 172, 223, -85, 65, -194, 77, -66, -22, -68, -71, 110, 296, 26, 89, 246, 158, 48, -10, -46, 235, 29, -22, 202, -156, -77, -176, -18, 139, 164, 161, -101, 33, -435, -17, 49, -20, 79, -103, 56, 74, 18, 60, 10, -133, -68, 138, 472, -102, -35, -47, -328, -162, -113, -295, 16, 133, -21, -36, 268, -87, -70, 80, -67, -262, 148, 16, -90, -178, 184, 57, 91, -219, 56, -180, -104, -111, 132, -175, 45, 234, -169, -277, 268, -94, -64, -102, -49, -16, 136, -4, -32, -202, -98, -1, -321, -98, -185, 197, 44, -116, 101, -283, -143, 49, -135, -97, 206, -186, 190, -2, -180, 173, 96, 28, 62, 36, -66, -166, -84, -156, -146, 32, -169, 188, -138, 9, 36, 36, 18, -110, 266, -72, -148, -143, 170, -65, -69, -53, -24, -112, 81, -3, -61, 14, -297, -55, -20, -24, 223, -224, 95, 35, -125, 21]
3905B1O7k1l39K53J9K06j22k5p3j9J49k02Ro0L34Kj98RJ38q5j17rK86l34J19J62
3931A70j95k32J47m9N43m70p5M2K3K49l42K08j3M9k3k27K43kq1j11J82Oj00J15
3955E7q0M1M5j72Ll2J51P5M7k1OP0k48J38m41M88j96J29J86n8m1k89JK49k33K28
3981A03Mj38k2J03j74K85l98K90L6p5j9J25j26mL38j83k11J38j0k42K39m6K2O6
4005A01j9j24m5N5N1n6K8k57M41K0j28l6J2j49K02k16K57j96j21Q7p4K90j63j45
4029a85L67j06l34K66l2On3Q4j06K49m49M98k42k1L15l0j99p0K2k26J48N9L18
4052B79k61n8m4J64K11k25j08O7M2J49j52k16L74r3n9p4p3n4K39l1k1j32o9j09
4076b54K15R6q1J23q1M9o6k0r9J17K48l82J61K49l66Rl1K26j72l2j17J97L7j6
$$ y = [21, 88, 67, -272, -19, 0, 206, 84, 59, -14, -33, 116, -86, -77, -137, 197, 199, 1, 10, 148, 63, -54, -63, 223, -111, 8, 170, -25, -257, -110, -159, 384, -86, -161, -119, -96, 153, -189, 19, 6, 55, 32, -195, 48, 46, -35, -146, 36, 42, -58, 57, -23, 18, 63, -109, -106, -138, 13, 88, 135, 114, 120, 190, -58, 80, -361, 127, -69, 60, 246, 188, 147, -142, -141, 108, -125, 103, 107, -31, -53, 50, -124, 161, -237, 53, 89, 14, -5, 120, -6, -10, 328, 145, -66, 72, 62, -180, 59, 13, 35, 101, 82, -42, -87, -32, 19, -37, -9, -266, 175, 195, 67, 31, 43, -106, 96, -120, 137, -59, -180, -93, -167, 123, -40, -185, 182, 76, -258, 8, -24, -18, -71, 13, -93, 156, -293, 205, -37, -58, 257, 227, 28, -42, -20, -246, -98, -39, 279, 18, -40, -84, 80, 291, 66, -42, 25, 67, 216, 64, -152, 222, 129, 70, -4, -77, -131, 108, 77, 56, -76, -145, -254, -39, 57, -24, 99, 18, 67, 1, -19, -118, -1, 247, -135, 26, 275, -91, -82, -113, 113, -59, -91, -208, -11, 26, 10]
4100A0Q0PJ62m94K35L8o9OJ63l14qJ25o8L37l19j22L29j05J10ol23K27Q1J87j16
4125A53j98p8L82l03R2L3l04L99l78K43r8M1L7J28k57o9K01J79m33L40k15M10
4147C05m28Q9J19l67K17J33j77J97Rj07o5L6L7q8l4K83M8j91o8n4L65m52M07k89
4171g5J80j38J31l19n1K04rK9m9M3l8K69k55J10O8J01M5l43J50j57P8n1o8N0J70
4196G5j7pJ81j70j55nL40l57L5K26j88K02l26J68M6j93K38q2o4q3L10O0j10j95
4220g1l53L25N9j24K45m1J14j44J63k40m7Q9j98L65k24k9L5R6o1P0L0J21K8k99
4244i1K32j69k0l5k2j2L14j4k42j5N7r5L56j38j50J92J41k41P6l5r2J22k64K49
4268A04j96K29J12j70j33P7j00J77j33R6K9k7j01K58k19K32j01l02j10L22J57
$$ y = [10, 90, 97, 259, -235, 0, 38, -31, -25, 138, -176, -184, -59, -127, 210, -109, -231, 98, -7, 103, 97, -226, 1, 82, 269, 153, -45, -123, 259, -44, 48, 81, -223, 176, -202, 41, -57, -16, 21, 149, -108, -177, 24, 203, -230, 110, -105, 305, -123, -34, 85, -282, -65, 68, -109, 88, 97, -10, -75, -39, -2, -90, -124, 159, 207, 16, -52, -106, 259, -193, 214, -75, 105, -33, 98, -221, -272, -68, -77, -48, -97, -54, -92, 177, -78, 32, 100, 201, 246, -97, 53, -104, -26, -77, -145, -95, 75, 58, 51, 232, 62, -93, -98, 242, -115, -80, 146, -42, 160, -166, 2, 48, -145, 93, 11, -53, -136, 174, 234, 124, -71, -424, -99, -40, -164, 81, 40, 154, 10, 173, -67, -114, -25, -223, 142, -82, -111, -76, 20, -41, 29, 59, 180, 208, -91, 141, -28, -48, -83, -105, -117, 197, 183, -59, -74, -17, -112, 244, 106, -44, 148, 289, 48, 124, 89, -3, 119, -145, 104, -92, 137, 249, 79, -54, 23, -77, 100, -33, 63, 92, 65, -36, 222, 3, 235, 134, -168, -278, 44, 201]
4289B01l90J24L47k07o3O3o0J04l06L5K97m41K90J0J20k12k24N08l33J25J77j38
4311B7M3M7M1k75N5R3L4qk34K63L8R4k10j35O1j35J48J48l39K61o5l5ql5K4q2
4337a84L09N6j79j95lN6K29k68L78n2J7o5l70M04n8q3r9J38L3n3K33j03j07P4
4361A08j5O4l13m4J37K13k37J2J40j83pQ6j71L8J27R9m2r4Q1J28j74p6M12k82
4385Gj4k00K33O9N5j6o0j92rJ50p6J4N7m6p8K52l05J33LM7R2p4j47J52k65K40
4411B2r5K59j85K28j78J8j16K28k14j12J9N8M9K75k77L8O3k73M01l57J40O5r3
4434c7l6O3JlrJPQ3n3k4j89J36M5K6m3R2j52J83k50J88j22j25L64k5j02P0k0p7
4462hL78p13J32K64r1p8l2J74j60K24j26K24J89n10K97k55J21k87M26j84J99Q6
$$ y = [201, -189, -65, 282, 75, 12, 75, 15, 119, -187, -152, 145, -296, -6, 4, 124, -88, -312, 196, -137, -12, 165, 27, 70, 117, 158, -117, -62, 31, 65, 57, -177, 86, 124, 218, 8, -127, -66, -201, -53, 95, -244, 17, -48, -83, -91, -126, -102, -184, 125, 181, 2, -193, -196, -140, 89, -179, 199, 147, 164, 99, -271, 133, 75, -8, -107, 31, 64, 11, 244, 141, 34, 108, 93, 157, -156, -200, -63, 150, -87, -75, 65, -118, -125, -39, -210, -172, -45, 54, 12, -82, -1, 127, -47, -123, 289, 7, -7, -207, 26, 95, 150, 134, 74, -118, -127, 23, -53, -39, 18, -28, -106, 146, -159, -26, -23, 24, 116, 42, -105, 47, -218, 22, -73, 186, 1, 229, 51, 69, -47, 181, -33, -145, -126, -68, -19, 256, -21, 17, 80, -193, 208, -149, -9, 56, -37, -73, -10, -9, -12, -21, -20, -13, 70, 17, -7, -196, -60, -15, 11, -32, 60, -92, 91, -159, 29, -93, -218, 146, 121, 19, 89, 69, -8, 370, -343, -211, 53, -38, -116, -148, 26, -134, 90, -36, 188, 377, -133, 164, -91, 30, -257, 169, -15, 184, 270]
4484B70k25Q6j32N2J64n9j72p7J60m2m8k9j41J73j00J39J25P7r8k18J74k90J94
4507a7L6j11L4P3O7l13Q3J28K74k48j5O4k2P2R5l03P3k0j13P0K61K0l68K23n5
4532a2j03J26k22K62k7l9K21k51j74J40k3J2L68l30q4j60L52j69K50j17j14J76
4554H2j27J75j32j6J00K7l32K19l8K27j43n1J1q6j06P5J26p0L7q9J37j20J55j75
4578a14J30k29K67J68j65J25N1j8m21L18q4J11k28pK2j00R1J42J21r3mj28J5j50
4602a80J81J1j68P8R5M93k61k03k03j8J93j74K94l48L76m61M23nj40J15n4j38
4624i4n3K13k6j40P5J31r8j20j05K63O6j59q3n7Q3J77J60o0k63J9J34J20l32M66
4648C17l93p9M02j12m7r6K26k19K21j67j76L49j27j33J21k50L03M4k6p6j43k3
$$ y = [270, 45, 131, -1, 51, 215, 156, -16, -93, 67, 25, -23, -52, -193, -20, -120, 19, 144, 221, 123, -95, 79, -211, -17, 19, -92, -58, 15, 82, -231, -148, -20, 254, 6, -9, 55, 33, 105, 200, -103, -30, -50, -163, -93, 168, 188, -180, 43, -12, -115, 11, -211, 51, 24, -15, 206, -45, -219, -79, -102, -90, 278, -52, -136, -296, 56, -113, 137, 20, -94, 82, -45, 130, -2, -18, 82, 109, -223, -4, -42, 185, 42, -9, 2, -84, -190, -115, 11, -59, -22, -111, 26, -94, 61, -114, 16, -213, 54, 222, 57, 182, 233, 215, -206, 112, 28, 139, -89, -96, -74, -174, -83, 59, 180, 87, 83, -45, -30, -180, 1, 12, -156, -78, 17, 510, 249, 46, -157, -175, 18, -156, 138, -210, 166, -295, 128, 123, -17, 98, 44, -94, -147, 66, 40, -100, -25, 106, 8, -112, -217, 46, 112, -47, -130, -187, -104, 73, 233, 173, -90, -71, 63, 183, -149, 317, -76, -155, 247, 135, 88, -8, 218, -1, 220, 53, -123, 226, 99, -34, 87, -163, 140, 184, 158, 82, -61, -84]
4670h4J86m37L52p1j5K76j20j06R2j53q0K44lm2Lr5j01n7m3J77Q9J13l39J88J04
4695G8l16K98k18J70K38j02j9j82L5J59l12Q9J15Q1k29L48l06L5M4q8L6K48l85
4718a83J99M5j65J33nl30NK04Mk6m8J57o8k2J24J71k79j0k96K61M3J5J63l52p
4743b67L35j36q3P5K15j95J76k78J56K01k95j43L25l4r1j4Q9k3q4j10J49P7k88
4766b43J50J4J1k1J05J41j12j02K04j81J55n2n0M6o7J38n7Q5l98L25j02jk64J77
4790i9J83k27j43J69L47k54J23j09M4p9J79l39P2L0r8o3K37J4J77r4Lk20M31j15
4814A69l22J19K53k06Lk03R9J78j7j75k3L07l94lK76L7k90o8J03m6J88n7J63j82
4838i1K27j88k02L14k78J06J03L3K06l14O9J32k84N03l54j07rJ07j41J86O1m0
$$ y = [-84, 102, -335, 17, -54, -69, 207, 87, -19, 73, -80, -160, 84, 81, 39, 42, -53, -154, -211, -254, -77, 12, 125, -214, -26, 78, -238, 60, -158, 12, 250, 148, 129, -53, -18, 141, -171, -82, 33, 114, -115, 233, -73, -38, 6, -82, -46, 202, -183, 16, 61, -104, 29, 24, -306, -301, -97, -93, -119, -167, -10, -78, -100, 24, 195, -84, -94, -390, -129, -86, -71, 92, -260, -267, 68, -68, -151, -76, 139, -56, 120, -158, -2, 199, -96, -239, 86, 52, -39, -53, 36, 13, -71, -181, -32, 45, -243, -93, -79, -68, -89, 16, 157, 45, -57, 147, -34, 121, 69, 19, 65, -2, 136, 79, 164, -234, 91, -11, -12, -276, -99, 84, -143, -286, -117, 230, -24, 99, -10, 34, -45, 134, -205, -133, -103, -201, -264, -27, -13, 164, 70, 73, -147, 284, 169, -153, -34, 219, 13, 16, -187, -88, 90, 73, -102, -125, 182, -212, -215, 61, 98, -192, -260, -157, -203, -15, -72, 91, -91, 136, -52, -254, 60, -218, -112, -9, 24, 230, -84, -15, 117, -167, 336, -18, -125, -134, -27, -168, 18, 79, 39]
4860C9L1J35l45J25j6o7L0K16k38J16R3nj35k09L45o7j32J91L7l24n6L26K9r2
4884B7k02J45j38L17L6o06L91m3j31K79q5j29N6J2J18J4q5pJ0J06j81N05k57q9
4908F3j09K8J01n4m6k09L17j53J16j81J05J10l55M76om54L95j03m2J92j42R2r7
4931D4m4j55K73k12K17j46l6Q2J11j21NQ1l45R5K12j45RN9j9K7J87j08k93L58
4955A36k67rK04j27J52m3j21J05k7M3j43K07J03k10k41K13J21k71J33J66j13j72
4977a61L32k69M4j53K0n5J81K32l66K12K18j59R5k24L7J37j29k5j06o2L56p5j8
5000F2Q0j38j30J68oj1J07N5l17J05q1o7j9k7K98o7O0j92K87k32j83L9K49PO9
5025A16j79J50J5J0k97Q0J26J47p0j73R9K16j53k60Q8K05j95j7J06J18R5k68j51
$$ y = [39, 70, 205, -140, -15, -31, -98, -68, 148, -90, 26, 119, 114, -21, -230, 115, 48, -84, 107, 144, -180, -236, 90, 119, 27, -175, -30, -168, 149, 185, -421, -30, -73, -204, 75, -10, -139, -83, -71, 47, 61, -24, -31, -21, 85, -96, 409, 152, 63, -46, -18, 83, 29, -17, -226, 91, -62, 54, -127, -22, 88, -267, 209, 203, -251, 144, 41, -1, 191, 49, 141, 44, 0, -155, 118, -94, 123, -23, -59, 23, 134, 13, 18, 99, -246, -151, 61, -84, -75, -16, -35, -8, 179, 71, -222, 136, -131, -140, 64, -63, 89, 46, -75, 30, 3, 46, -97, 110, 213, 3, -238, -25, 96, -175, -42, 124, 11, -161, 171, -98, -54, -207, -187, -242, -61, 171, -195, 17, 235, 76, 171, -53, -16, 121, -8, -33, -139, -201, 155, 80, 62, 142, 4, -126, 42, 36, 25, 132, 187, -130, -25, -106, -173, -192, -219, 79, 12, 72, -120, 167, -65, -248, -209, 40, 47, 116, -63, 87, 102, 112, -185, -105, 21, 168, 98, -75, 24, 240, 87, -173, -85, 120, -75, -92, 14, 132, 227, -41, -192]
5048a92K03j29Q4K07j95j15k17L39J3k33K56P3p6O0M9j79p4N0p2k13M97k24q7
5071a75P6P0m7j34J85L8q3Q6J01o5k4k8J37k13K58j95j8N8J63j44m6K2J1q2K93
5096B44k08k39K02r3J65o5J1K33l96K56M3Mm6k09L12r7q5n4K06l79L61l14K3J26
5120AO2J55j25q0k8j39J99P9j65K61k92K72m02K07K81k36k73K94O1p9j53O0k5
5143f5J89n70L07J57O1k01J33j26LN2P7R0k93l5K96p6r7J85j41M4J23J76k07J23
5167B05n9j73n7O8j09R8J30k8r6k85L14r1n4L1J01N6k8M9k30J62j37Q3J71J21
5191B42l92K45k11p2L95l80K02j00R5j49L6J5J18J10m6J01j39Q0K7K9l88L77k90
5214i5qJ92m7j09J95k00L5K5j16J26n2l3J33m5j77N9J60Kk24L23j38K29k72k08
$$ y = [-192, 11, -118, -34, 173, -22, -137, -354, -15, -2, -235, 21, 94, 18, 78, 127, -52, -126, -76, -148, -361, 136, -88, -175, -99, -29, -76, -210, -25, 13, -70, 16, 117, 52, 28, 0, 137, -76, 182, -13, -31, 27, 190, 46, 0, 22, 33, -49, 244, 36, -203, -1, -94, 71, 6, 17, 250, -146, 110, 153, 157, 111, -98, 214, 117, 32, -22, 184, -195, 166, -148, -125, 1, 63, 218, 93, 13, -15, -154, 45, 124, -41, 220, -72, 200, -202, 5, 286, 50, -223, 71, 132, 53, -100, -40, -65, 124, -446, -139, 18, 79, -122, 11, -115, -112, -60, 17, 107, -186, -221, 75, -1, -98, 87, -54, -10, 113, 289, 82, 205, 146, -27, -84, -16, -125, -27, 103, 75, -21, -306, 8, -83, -137, -106, -5, 51, 23, 72, -158, 4, -133, -50, 121, 242, -150, 95, -116, -188, 207, -173, 29, -71, 24, -125, -89, -74, 44, 154, 108, 209, 70, 150, 177, 206, -182, 195, -95, -103, 89, 42, -67, 128, -72, -37, -12, -128, -2, -54, -87, 46, 1, -176, -117, 43, 45, -179, 144, 6, 235, -37, -245]
5238b45J07K62j2l79K88R7j54J54Q9l4m09J92K12m2j35oO3q9j2o0R2Q6j21j48
5262b04K73j17K29m9k94L55j01q7J01k48K4Q1R6N8p9K3j69N0O2L0q4R8o8J39J31
5287B50j45j06j64J97P2k97J76J72q2J98j33j52J51j45P0P4k59j36K32j3L8m8
5309e0kK31j06J92l10q5k7J64j37J62q9M1J38o2k82K86o1K47k34j93O4J49j85
5332a49J95m5K55k66J45j62p0L06k59J54k22j42K66K43o5j29l21J10J92O1N4m31
5354b80L56O3n85M85p2N9J25l02p0J73j86L91j93J89n4j07K34l51J43q9K25j85
5376c1k9J43m8l82L95K58l78J75k7j79R9J92k91K65k67N9K8J55j11l0L70l53J0
5399B3k97K98j93L48qj53M9j18R6k15J73k13O0J44N8q2J31j14K19k88P9P5k7m9
$$ y = [-245, -138, 124, 112, -267, 21, 118, -36, 118, 207, 173, -236, -44, 168, 126, -9, -15, 48, -41, -53, -113, -21, 65, -56, -204, 69, -48, 181, 132, -162, 193, 92, 5, 106, -142, -118, -37, 59, 117, 38, 61, -108, -58, 4, 34, -50, 48, -20, 119, 250, 105, -1, -165, 32, 104, -193, -17, 155, 73, 271, 138, -14, 137, -8, 62, 136, -123, -259, -27, -40, -2, -50, -52, 179, 73, 265, -45, -130, -157, 7, -130, 32, -57, -16, 122, 60, -222, 64, 3, 250, 16, -177, -113, 36, -149, 46, 1, 256, -10, 135, -27, -97, 209, -50, 104, -118, -260, 6, 249, 184, 55, -266, -156, 36, 97, 151, -280, 76, 139, -446, 39, -33, 26, 151, -151, -221, -48, -234, 157, -36, 153, 99, -8, 226, -125, 18, -71, 154, -31, -60, 83, 35, -347, 48, 306, -72, 103, 76, -103, -4, 188, -103, 162, -105, -46, -18, 137, 26, -4, 366, 13, 23, -274, 24, -169, 179, 171, 18, 67, -51, 45, -170, 3, -210, -150, -6, 52, -30, 101, -13, 206, -82, -3, 72, 45, -4]
5423dJ89k35o0P7J06j44L7PK5J0k7J88J66m09K77j55P9l25K82r6N9n0L2J9k06
5448a58J4J61q7O7Lp2n9J07RK9Q7l2j62J46q4k8j32L22j91J68O5q4J3l82K59P6
5474E5J5k82K81k62K13K52l87N8L5o6K60k69K42L1j93M2mr9Q7L8N7p5J4k28M00
5499B15k26O2r4J30m5j59M06l41P2J8j8k00P7L71j54j28k70L47j53O3M15j40j53
5522I5k73J44K02k40m7K67j70j55Q8K28j77L27l91J13M8l2J86J4j4j76M8l53M41
5545A73k7j41j93N4K8L2k10J53O6q4L42k37j41J06L7J31k03J57j34L0K23j56K39
5568B45J21j46q9k03J29O0j94K31k34k8J33q8n3J78k32K18O2k55K63m30L14J5
5590A7J3J3M2J24k62NO8j32ll4J07K21n6j47K1q8K77m30K09K20k05J7K09k51K34
$$ y = [-4, 185, -50, -110, -33, 73, -71, -34, -27, -2, 8, -19, 169, 335, -74, 203, 48, 127, -198, 84, -12, 47, -3, 29, 48, -158, -144, 17, -70, -3, 0, -72, -131, -24, -15, 14, 101, 69, -93, 53, -31, -59, -191, 131, -60, 108, 173, 89, 102, -280, -21, 55, 70, -212, 69, -193, 20, 272, -115, -57, -22, -88, 172, -97, 145, 176, -17, 25, 21, -78, 9, 47, 104, 29, 43, -185, 215, -11, 51, -43, 87, 42, -117, 289, -52, 20, 38, 20, -180, -103, 268, 114, -14, -284, 63, -90, -27, 388, 248, 95, -178, -34, 168, -72, -119, 148, -22, -177, -89, 139, -38, 289, -102, 11, 59, 27, 213, 227, 213, 37, 85, -268, 173, 146, 5, -188, -134, -106, -74, -284, -131, -65, -149, 193, -44, -185, -79, -42, 89, -114, 43, -91, -61, 162, 6, 245, 366, 220, 131, -72, 57, 117, -77, 154, -80, -108, 25, -63, -116, 62, -170, 48, 110, -145, 118, -312, 2, 17, 30, 43, 85, 209, -53, -48, 20, -112, -115, -149, -42, 179, 123, -24, -3, -91, 186, -244, -35, 185, -20, -3, 206, -45, 189]
5615A89n1l27K03j54J79L4j24m8J41r0j27k09K25J2K43m9m41M88j01K9j30J23
5637A5k91J06J08N6pj0j52K13N9j74L03p1j28l2P1k41J59j25P2M1M4j5l28L39
5661A2K12r2l4j03m3lK88k89j9J57n0k79j3N34j87k23K07m34K35R9o7J27j40J77
5685G2J18j01om4q0J44o1Pl69K24j76L26M5j26J48J17r3j77k11L64j51J36j78
5708g2J07nqo1L57m05R6j58O5m9l8L16p9Q3j22n0L1j31K66j48R3r2J58r3p5m1
5734e5J53r8n2K5j67L27j76K28j75M55m84P1J26L1j86P1J96k28J85k50j9j3k8
5757f3J21m1j65L29Jr2l47J98K60k91R2J2K25j03LQk07r2K85j87j85L77j66L6
5781Hk1N5m3o8Q0j42J67k28J29J91l89L01K13m15O4k8J09nJ01j82j91K77j0k3
$$ y = [189, 138, -189, 14, -140, 39, 73, -51, -99, 42, -48, -175, -384, -159, -147, 96, 47, -394, 94, -7, 22, -108, 15, -276, -170, -62, -6, -13, -23, -175, 38, 97, -77, 226, 155, 27, -5, 66, -175, -16, -141, -69, -28, 16, 1, -327, 12, 224, 132, 98, -5, -48, -51, 237, -52, -71, 86, 36, -243, -256, 278, 91, -132, 75, -359, -124, -25, -92, 35, -105, 72, 190, 89, 83, 39, -41, 103, 42, 49, -320, -96, -272, 54, 99, -27, 121, 238, 145, -32, -243, 121, -30, 106, -72, 35, 30, 22, -39, 318, -87, 9, -149, -84, -133, -171, 145, 66, 149, 27, -23, 8, -123, 143, -5, 88, -4, 154, 61, -14, -55, 98, 0, -52, -27, -194, 133, -43, 185, 10, 465, -19, 52, 178, 209, 23, 94, 290, 62, 247, -3, -22, -35, -63, 58, 17, -148, 181, 182, 90, -257, -59, 201, -90, 2, 14, 239, 136, 139, 147, -60, -152, 133, -54, -239, 138, -28, 8, -13, 42, -1, -69, 11, -131, 36, -192, -63, 128, -261, 40, 253, -162, -98, -126, -17, -22, 79, -103, -294, -17, -27, -50]
5805e0Q0j55Q6K89m56J44k52J84L0J4M48m19q1lJ22k46K57l7j98L68l12K94J11
5828B18j26j1l8j94K26k49L96l49J91p8P2r2L7j17K97j25p3O8J55j19k67L58j04
5851G6k02J08J71l43M6p4L66q2j63N2o1j22J27j11K36k17K99p7J85r5j71J16j51
5874h7l3K35j24j70k13M97k24J84q8q7J6J44p0k31L68k80M3K08k51L5J36Q8j45
5897d9n9J29n3m6r5J24K63k20J64j17L8m4j67J26J25k33l9K9K25j94J16r3r0K55
5921I5J34l60J35J2j80J88k11L08k50RQ0j69M14k46K2J93k14J54j17J33j42n4
5943f6k3J95k35K86K7l79Q9j30L28j13l3K16k38J06PM9l07J97J72k58K35j0q6
5966B9n0J44K78n83K75l26L49k9R4l07Q2Q6j17J32oj55P7j17j6L62k09L4k36M40
$$ y = [-50, 30, -125, -39, 250, -206, -62, -314, -130, -100, -86, 362, -57, -138, -141, -19, -265, -8, -45, -243, 125, -187, 107, 218, 92, 81, 43, -151, 75, -174, 222, -127, 64, -14, 58, -34, 3, -114, 183, 58, -15, 53, 208, 89, -178, 180, 76, -126, -18, 153, -190, -144, -218, 148, 66, -97, -45, -106, -228, -101, -212, 24, -193, 106, 29, 214, 119, -52, 64, -87, -120, 115, -9, -179, -392, 105, -119, 65, -23, -110, -94, 50, -20, -251, 117, -163, -120, 88, -163, -128, 8, 96, -49, -108, 21, -32, -78, -173, -49, 214, -6, 158, 41, 79, 35, -132, -6, 119, -114, -153, -124, 101, -93, 23, -70, -160, 95, 229, -131, 4, 16, -164, 24, -187, 121, -129, -120, -40, -209, 205, -41, -19, 174, -40, 114, -3, 130, -12, -66, -89, 106, -129, 157, 184, -195, -106, -236, 92, -21, -54, 162, -76, 30, 37, 86, -221, -24, 148, -110, 125, 115, 29, -21, 123, 401, -182, 93, -233, 116, 87, 181, -126, -44, 42, -75, 57, 51, -104, -27, -144, -160, 202, -7, 27, -209, 231]
5990B31n24r8M73k4p0J49k17k27O55k60k45R9R7p1J25K4k85K46o5k24K47l7K20
6013B19k81r5K61j09j12J98j22K72k75k17J52M4N1J51j60j62J97j3P7j09P6j06
6035f3k3lM6J12j4j92J56o6R9PP8k20j37L79j82K80n9q8k86K92%o3j46L20l35
6060a08L3J51k3j61l6M86l23j68M80m72L01k05r4J01k0N3n6R7K38k0j11p2j73
6083a02o1J08J69j32J2j79L05k27J26J59j98k43K62j9j94J64OM2M7o3R8M2j86
6106f4P3l3o5J46j73L5K6Q4l1j08P3K8l3M2K30j90k32J1R6J35o0K3J5Km7J26j28
6133a9K8r8J31J41j29M3k9j25J29k09K37r8j04K32Nq8k18J52J10p5o0q0L14k37
6157d7j52K50J72p2j85K68m45J85k4K24j02r8J10K4k97M1J23P0k32J83n1k6J68
$$ y = [231, -293, -391, 82, 58, -12, 137, -80, -307, 348, 88, -157, -58, 39, -32, 93, 117, -168, 78, 13, -211, 36, -1, 219, -62, -157, 104, -5, -117, 81, -41, 231, -44, -261, -109, -65, -14, 137, -23, -185, 12, -1, 76, -33, 43, -63, -86, -89, -43, 69, 55, -137, 19, -47, 52, 59, 137, -83, -220, 159, -23, 257, 198, 110, -176, 116, 116, 53, -93, 227, -108, -75, 76, 53, -108, -144, 342, 19, -149, 331, -141, 160, -45, -139, -38, -58, -5, -61, 36, 274, 254, 143, 71, -102, -163, -55, 114, -18, -6, -185, 120, -107, 19, 178, -20, -263, -1, -20, -214, -50, -44, -2, 45, -18, 80, 122, -64, 9, -24, -89, 57, -116, -81, -55, 29, -2, -110, -37, -9, -42, 0, 230, 40, -192, -181, -85, 50, -10, 13, 28, 30, -17, 109, -19, 9, -89, 42, 183, 54, 97, 68, -57, 72, -137, 100, 2, -102, 130, 135, 47, -171, -19, 91, 16, -44, -124, 190, -47, -199, 51, 223, 151, -34, 234, -211, -26, -50, 174, 72, -26, 84, 108, -189, -148, -25, 45, -187, -4, -55, -81, 87]
6180H7NK5l25J64R2j6J35j20j31K63j78k10J85m3J03j07J89n0k42M17k48o9m5
6203a19K70j85r1J85M5k41J81p8l9J16L5J62k47J07j52L5J14l38K36R7Q7M1J4
6226B35k79J38j05j87K28j40K34k27R5J93q4l5j12p6K1N2j18Q5J9Pj63K26K36
6249B43k33J08k02r8J09J65K4k12J71j46K15k52N9K51m31M26j18p5N3j4k06J92
6271B9J13o8m1j15K10k09p4Q4q0O4J02j3n1P6J39j75L74k93p6m7J03j7O7n4N5
6296A03K0l69L29j95l0Q3J10P1j92P8r2J6J57r6L7n6J99j98J37K5j34r7L70n6
6320B20P3l50j44K98l20J52J94j00j99m5j18M57k78J29M5Q1P6j98K82k49Q2J20
6342B08j56m0k81J61j82J1K38J03j61N3K80l64M7J89r1j33O4O0j99J04k57M75
$$ y = [87, 92, 117, -208, -44, 48, 32, 167, 47, -84, 179, 1, -209, -24, -67, 36, -71, 118, 68, -174, 243, -5, -74, -119, 151, -34, -125, 60, 105, -136, 45, -33, -72, 44, 79, 241, -6, 101, -51, -16, 98, -240, -4, 93, 180, 221, 235, -44, 94, -11, -198, 30, -110, 124, -103, -8, 185, 101, 66, -46, -122, -101, -49, -167, -82, -63, -56, -219, 7, 243, 10, 118, -84, -182, -73, 92, 116, -96, 75, -71, 144, -108, -49, 202, -229, 197, 79, 4, 57, 43, -163, 29, 142, 74, 33, -82, 128, -81, -155, -71, -151, -87, 15, 2, -49, 27, 166, -9, 365, 72, -4, -51, 52, 35, 102, 48, 103, 123, -246, 83, -112, -142, -59, 51, 122, -70, 8, -84, -68, 89, -7, 30, -26, 173, -25, 112, 137, 3, -94, 276, 220, 293, -57, -201, 97, -223, -71, 123, 23, -176, -221, -339, 118, -160, -31, 14, 95, 171, -27, 255, 6, 88, 208, 52, 12, -269, -108, -290, -279, -41, 62, -99, -46, 234, -130, -83, 106, 15, -118, -54, 6, -193, -89, -346, 129]
6364A29j45p5L95k81M6p6K0K02j98j07J29J10j04j16KM28m54O2L19j23K1m6k56
6387a18J51mJ04j81M3l6J52o1j84q2KJ72J5n6L07j43k30L98m17K22k36J93J46
6410A57j26J28j39j40K47j29j45L70l77M7m4J82m4J10K9k28K77q0n09L41j15L39
6432A51j86J16K4J73j60k49L48k20J88j91m0P6k47J14K66L2k41n9J49o0L39l85
6454f2m9J70o3P0O4n04J43L12j21J62M0N1k34j32J78k48K88Q6j10k8j9m6K5L4
6478Gj42K08k29L88k16J1m6M8k4M7j83R6qJ75k19J9K15Mj45k00J94J56l09P4K19
$$ y = [129, -16, -91, 304, 23, 69, -7, 13, 215, 17, -90, 39, 149, 45, -71, -69, 359, -95, -33, 286, 163, 184, 138, -118, 33, 29, 133, -48, -5, -41, 111, 50, -134, -216, -214, -42, -27, -83, 224, 81, -149, 249, -168, 54, -182, 11, 157, 31, 159, 20, -120, 127, -2, -147, 223, -154, -107, -151, 31, -13, 97, 126, -102, 175, 95, -414, -73, -188, 151, -35, 81, 105, 278, 118, -131, 217, -3, 185, -6, -46, 30, -217, -103, 163, 195, -46, -105, 44, -16, 323, -62, -111, 59, -4, 66, 130, -374, -231, 81, -40, 122, 162, 213, -21, -153, 25, -223, 65, 151, 41, 13, -6, -52, -27, 7, -135, 73, -156, 232, 16, 27, -19, 29, 5, 52, -131, -35, -43, 132, -87, -68, 147, 151, 6, -194, 0, 156, -153, -79, 140]
$$ [...]
8191B71
##END NTUPLES=NMR FID
##END=
