##TITLE=1H_Pr C5-i-Pr
 CDCl3, 8 sc, 
 27.2.2020
##JCAMPDX= 6.0         $$ Bruker NMR JCAMP-DX V2.0
##DATA TYPE= NMR FID
##DATA CLASS= NTUPLES
##ORIGIN= UXNMR, Bruker Analytische Messtechnik GmbH
##OWNER= root
$$ XWIN-NMR		Version 3.5
$$ Thu Feb 27 15:43:37 2020 Russian Standard Time (UT+4h)  she@DPX200
##.OBSERVE FREQUENCY= 200.1315
##.OBSERVE NUCLEUS= ^1H
##.DELAY= (6, 6)
##.ACQUISITION MODE= SIMULTANEOUS
##.ACQUISITION SCHEME= undefined
##.AVERAGES= 8
##.DIGITISER RES= 18
##SPECTROMETER/DATA SYSTEM= spect
##.PULSE SEQUENCE= zg30
##.SOLVENT NAME= D2O
##.SHIFT REFERENCE= (INTERNAL, D2O, 0, 15.7039)
##AUDIT TRAIL= $$ (NUMBER, WHEN, WHO, WHERE, WHAT)
$$ ##TITLE= Audit trail, XWIN-NMR		Version 3.5
$$ ##JCAMPDX= 5.01
$$ ##ORIGIN= Bruker BioSpin GmbH
$$ ##OWNER= she
$$ F:/spectra/data/she/nmr/H-F/1/audita.txt
$$ ##AUDIT TRAIL=  $$ (NUMBER, WHEN, WHO, WHERE, WHAT)
(   1,<2020-02-27 15:42:18.59 +0400>,<she>,<DPX200>,
      <created by zg, POWCHK disabled, PULCHK disabled
       configuration hash MD5:
       00 E9 B6 7A A2 85 ED C7 34 08 36 98 17 FE 4E 26
       data hash MD5: 16K
       5A 49 40 5D 12 FE ED 59 5D EC 2C 31 71 47 7D 61>)
$$ ##END=
$$ 
$$ hash MD5
$$ 9B 60 E3 48 EF 21 DA DC A4 AF 13 89 97 40 29 97
##$RELAX= 
##$RELAX= 
##$RELAX= 
##$RELAX= 
##$RELAX= 
##$RELAX= 
$$ Bruker specific parameters
$$ --------------------------
##$DU= <F:/spectra>
##$EXPNO= 1
##$NAME= <H-F>
##$PROCNO= 1
##$TYPE= <nmr>
##$USER= <she>
##$AMP= (0..31)
100 100 100 100 100 100 100 100 100 100 100 100 100 100 100 100 100 100 
100 100 100 100 100 100 100 100 100 100 100 100 100 100 
##$AQSEQ= 0
##$AQ_mod= 1
##$AUNM= <au_zg>
##$AUTOPOS= <>
##$BF1= 200.13
##$BF2= 200.13
##$BF3= 200.13
##$BF4= 200.13
##$BF5= 200.13
##$BF6= 200.13
##$BF7= 200.13
##$BF8= 200.13
##$BYTORDA= 1
##$CFDGTYP= 0
##$CFRGTYP= 5
##$CHEMSTR= <none>
##$CNST= (0..31)
1 1 145 1 1 1 1 1 1 1 1 1 1 1 1 1 1 1 1 1 1 1 1 1 1 1 1 1 1 1 1 1 
##$CPDPRG= <>
##$CPDPRG1= <>
##$CPDPRG2= <>
##$CPDPRG3= <>
##$CPDPRG4= <mlev>
##$CPDPRG5= <mlev>
##$CPDPRG6= <mlev>
##$CPDPRG7= <mlev>
##$CPDPRG8= <mlev>
##$CPDPRGB= <>
##$CPDPRGT= <>
##$D= (0..31)
0 1.2 0 0 0 0 0 0 0 0.06 0 0.03 0 0 0 0 0.0002 0 0 0 0 0 0 0 0 0 0 0 0 
0 0 0 
##$DATE= 1582803738
##$DBL= (0..7)
120 120 120 120 120 120 120 120 
##$DBP= (0..7)
150 150 150 150 150 150 150 150 
##$DBP07= 0
##$DBPNAM0= <>
##$DBPNAM1= <>
##$DBPNAM2= <>
##$DBPNAM3= <>
##$DBPNAM4= <>
##$DBPNAM5= <>
##$DBPNAM6= <>
##$DBPNAM7= <>
##$DBPOAL= (0..7)
0.5 0.5 0.5 0.5 0.5 0.5 0.5 0.5 
##$DBPOFFS= (0..7)
0 0 0 0 0 0 0 0 
##$DE= 6
##$DECBNUC= <off>
##$DECIM= 24
##$DECNUC= <off>
##$DECSTAT= 4
##$DIGMOD= 1
##$DIGTYP= 9
##$DL= (0..7)
0 120 120 120 120 120 120 120 
##$DP= (0..7)
150 150 150 150 150 150 150 150 
##$DP07= 0
##$DPNAME0= <>
##$DPNAME1= <>
##$DPNAME2= <>
##$DPNAME3= <>
##$DPNAME4= <>
##$DPNAME5= <>
##$DPNAME6= <>
##$DPNAME7= <>
##$DPOAL= (0..7)
0.5 0.5 0.5 0.5 0.5 0.5 0.5 0.5 
##$DPOFFS= (0..7)
0 0 0 0 0 0 0 0 
##$DQDMODE= 0
##$DR= 18
##$DS= 0
##$DSLIST= <SSSSSSSSSSSSSSS>
$$ [...]
##$SUBNAM2= <"">
##$SUBNAM3= <"">
##$SUBNAM4= <"">
##$SUBNAM5= <"">
##$SUBNAM6= <"">
##$SUBNAM7= <"">
##$SUBNAM8= <"">
##$SUBNAM9= <"">
##$SW= 24.9337058887773
##$SWIBOX= (0..15)
0 0 2 0 0 0 0 0 0 0 0 0 0 0 0 0 
##$SW_h= 4990.01996007984
##$TD= 16384
##$TD0= 1
##$TE= 0
##$TE2= 300
##$TE3= 300
##$TEG= 300
##$TL= (0..7)
0 120 120 120 120 120 120 120 
##$TP= (0..7)
150 150 150 150 150 150 150 150 
##$TP07= 0
##$TPNAME0= <>
##$TPNAME1= <>
##$TPNAME2= <>
##$TPNAME3= <>
##$TPNAME4= <>
##$TPNAME5= <>
##$TPNAME6= <>
##$TPNAME7= <>
##$TPOAL= (0..7)
0.5 0.5 0.5 0.5 0.5 0.5 0.5 0.5 
##$TPOFFS= (0..7)
0 0 0 0 0 0 0 0 
##$TUNHIN= 0
##$TUNHOUT= 0
##$TUNXOUT= 0
##$USERA1= <user>
##$USERA2= <user>
##$USERA3= <user>
##$USERA4= <user>
##$USERA5= <user>
##$V9= 5
##$VALIST= <valist>
##$VCLIST= <CCCCCCCCCCCCCCC>
##$VD= 0
##$VDLIST= <DDDDDDDDDDDDDDD>
##$VPLIST= <PPPPPPPPPPPPPPP>
##$VTLIST= <TTTTTTTTTTTTTTT>
##$WBST= 1024
##$WBSW= 4
##$XGAIN= (0..3)
0 0 0 0 
##$XL= 0
##$YL= 0
##$YMAX_a= 452878
##$YMIN_a= -349147
##$ZGOPTNS= <>
##$ZL1= 120
##$ZL2= 120
##$ZL3= 120
##$ZL4= 120
##$ABSF1= 10
##$ABSF2= 0
##$ABSG= 5
##$ABSL= 3
##$ALPHA= 0
##$AQORDER= 0
##$ASSFAC= 0
##$ASSFACI= 0
##$ASSFACX= 0
##$ASSWID= 0
##$AUNMP= <proc_1d>
##$AZFE= 0.1
##$AZFW= 0.1
##$BCFW= 1
##$BC_mod= 2
##$BYTORDP= 1
##$COROFFS= 0
##$CY= 11.3945322036743
##$DATMOD= 1
##$DC= 2
##$DFILT= <>
##$DTYPP= 0
##$F1P= 16.9975609425685
##$F2P= -3.02152046262296
##$FCOR= 0.5
##$FTSIZE= 0
##$FT_mod= 4
##$GAMMA= 1
##$GB= 0.15
##$INTBC= 1
##$INTSCL= 1
##$ISEN= 128
##$LB= 0.24
##$LEV0= 0
##$LPBIN= 0
##$MAXI= 10000
##$MC2= 0
##$MEAN= 0
##$ME_mod= 0
##$MI= 1.114404
##$NCOEF= 0
##$NC_proc= 0
##$NLEV= 6
##$NOISF1= 3.799351
##$NOISF2= 2.8
##$NSP= 1
##$NTH_PI= 0
##$NZP= 0
##$OFFSET= 15.70392
##$PC= 1
##$PHC0= -9796.966
##$PHC1= 27.40082
##$PH_mod= 1
##$PKNL= yes
##$PPARMOD= 0
##$PSCAL= 0
##$PSIGN= 0
##$REVERSE= no
##$SF= 200.130013532006
##$SI= 16384
##$SIGF1= 3
##$SIGF2= 2
##$SINO= 400
##$SIOLD= 16384
##$SREGLST= <1H.CDCl3>
##$SSB= 0
##$STSI= 0
##$STSR= 0
##$SW_p= 3612.71676300578
##$SYMM= 0
##$S_DEV= 0
##$TDeff= 0
##$TDoff= 0
##$TI= <>
##$TILT= no
##$TM1= 0
##$TM2= 0
##$TOPLEV= 0
##$USERP1= <user>
##$USERP2= <user>
##$USERP3= <user>
##$USERP4= <user>
##$USERP5= <user>
##$WDW= 1
##$XDIM= 8192
##$YMAX_p= 0
##$YMIN_p= 0
$$ End of Bruker specific parameters
$$ ---------------------------------
##NTUPLES= NMR FID
##VAR_NAME=  TIME,          FID/REAL,        FID/IMAG
##SYMBOL=    X,             R,               I
##VAR_TYPE=  INDEPENDENT,   DEPENDENT,       DEPENDENT
##VAR_FORM=  AFFN,          ASDF,            ASDF
##VAR_DIM=   8192,          8192,            8192
##UNITS=     SECONDS,       ARBITRARY UNITS, ARBITRARY UNITS
##FACTOR=    0.0002004,     1,               1
##FIRST=     0,             0,               0
##LAST=      1.6414764,     0,               0
##MIN=       0,             -349147,         0
##MAX=       1.6414764,     452878,          0
$$ Real data points
##PAGE= N=1
##DATA TABLE= (X++(R..R)), XYDATA
0 0 0 0 0 0 0 7 0 8 -8 8 -9 16 -24 24 -32 40 -42 54 -65 74 -87 103 -119 137 -160 184 -208 238 -270 303
30 303 -344 387 -432 486 -544 606 -673 747 -833 920 -1019 1132 -1249 1384 -1535 1702 -1888
47 -1888 2100 -2346 2625 -2955 3351 -3827 4420 -5187 6214 -7666 9897 -13782 22400 -81048
61 -81048 207493 448017 46531 -268698 -127429 214666 150567 -205264 -331407 -1285
71 -1285 322897 253580 -72272 -209967 -80502 67420 34000 -63815 -63579 49331 137788 115797
83 115797 -15147 -154916 -176081 -20953 160960 151397 -40643 -133499 19532 176447 42323
94 42323 -234952 -231750 112603 339036 123066 -228147 -213952 108910 225384 -45078 -273205
105 -273205 -87770 259145 268940 -68389 -278839 -103137 160918 139831 -82993 -145300 36975
116 36975 183341 85460 -114473 -161041 -29632 93635 86596 7429 -38484 -21936 21934
127 21934 40790 -5964 -84525 -81069 44940 153232 81247 -101289 -149543 7155 137334
138 137334 41450 -133214 -102535 110007 188823 793 -195995 -126168 99912 157635 -14562
149 -14562 -142190 -36291 132180 102412 -84445 -159550 -25224 120955 89611 -43610 -83529
160 -83529 848 62963 15408 -59368 -56980 10448 57341 44166 -4555 -44503 -42584 -1011
172 -1011 33308 16694 -29152 -31452 26049 62334 8506 -74655 -69182 24590 78650 21835 -57353
185 -57353 -42285 38971 59030 -19791 -83146 -33623 62565 71095 -12444 -64891 -19605 43019
197 43019 28121 -35262 -45972 12311 54202 24266 -28849 -35177 -1868 18576 6686 -9337
209 -9337 -5745 10981 17073 4629 -12525 -17567 -5920 9835 16040 7823 -3075 -3110 2924 3007 -4403
224 -4403 -9069 -1817 12185 17368 5742 -9748 -9936 2088 6232 -839 -4143 5722 13965 7524
238 7524 -6262 -9713 -859 5178 2404 -151 5097 9047 4075 -5164 -8819 -2342 6157 6630 0
253 0 -2216 5757 9376 -1350 -14501 -9669 9384 16912 1959 -12448 -4271 12622 8530 -12299
267 -12299 -17952 1739 19460 11474 -10109 -15918 310 12797 2853 -14235 -11175 8176 16772
280 16772 2655 -14943 -13356 2895 9815 15 -8744 -4308 5125 5917 -1400 -7770 -9652 -3530
294 -3530 6129 8511 -1113 -11220 -7280 6093 7850 -6766 -16670 -3640 15352 12055 -9765 -18967
308 -18967 -2845 13312 7265 -11472 -14735 3772 16747 4269 -15941 -14416 4923 13548 874
321 874 -12118 -6646 8239 9081 -4085 -10991 -2758 6125 4635 -559 -2166 -1154 323 1703 1646
336 1646 -1113 -3185 -140 5350 5397 -1500 -6603 -1347 7217 5285 -2992 -5182 2740 7924 3238 -5296
352 -5296 -5195 4155 8571 1902 -5238 -1061 7111 5260 -2880 -4567 2390 7194 2509 -3198 -816
367 -816 5754 3929 -3301 -2973 3166 5733 1350 -1960 246 3183 2418 -984 -1864 1758 3823 1952
383 1952 -148 -176 364 -45 757 1054 521 32 658 1315 1220 -608 -3331 -1644 3389 3781 -1572 -4426
401 -4426 -32 4487 1339 -5335 -5421 2222 6481 137 -6896 -4100 3669 3459 -3568 -6198 -1576 3604
417 3604 2404 -3175 -5654 -1414 2510 443 -3247 -3070 -641 761 -495 -2460 -3231 -1362 383 -265
433 -265 -1682 -1801 -1680 -834 489 -794 -3082 -2360 322 995 -1619 -2838 -1183 996 613 -2245 -2473
450 -2473 416 2173 -1015 -3125 -513 2235 1014 -2300 -2299 969 2890 258 -3508 -2078 3199 3876
466 3876 -1284 -3781 -755 3902 3899 -1291 -4009 -20 5426 3796 -2019 -3569 564 4937 4103 -1405
482 -1405 -4301 138 5889 5503 -1350 -4719 -124 6550 5961 -1429 -6469 -947 8549 7519 -3071
497 -3071 -8164 -839 9380 8267 -4034 -9595 -8 12017 8190 -6459 -11120 1714 13088 7651
511 7651 -7335 -11019 2074 13392 6320 -9264 -11208 3402 13477 5521 -9277 -10862 2829
524 2829 12578 4175 -9828 -9526 3549 11239 3710 -8279 -9798 1187 10381 4795 -7357 -10958
538 -10958 -8 10182 6645 -7594 -13315 -1478 12306 7884 -9694 -15329 -524 14310 8190
551 8190 -11774 -16837 1079 16621 6628 -15086 -16457 4560 17931 3358 -17937 -14236 8595
564 8595 16421 -1556 -17739 -7820 11279 11548 -5537 -13926 -3329 8977 6512 -5564 -8498 -546
578 -546 5132 2282 -2363 -3752 -1532 630 2949 1992 -1631 -4997 -2427 5197 6898 -2911 -10415 -2310
594 -2310 12192 9005 -8984 -13838 4059 17556 4604 -16332 -11550 13086 18947 -4484 -20315
607 -20315 -2808 20596 12211 -14099 -17250 8092 22052 2952 -18973 -9492 16942 17797 -8161
620 -8161 -19243 1314 20764 8909 -14701 -13210 10249 17900 -1602 -16063 -2564 14724 8227
633 8227 -8348 -7993 5569 8288 -2031 -5511 2891 6143 -2717 -5833 5284 10092 -3475 -13594
647 -13594 221 17829 8116 -17161 -17436 12042 26629 -1193 -31029 -13525 27953 28057 -17062
660 -17062 -38623 -325 40113 19394 -33388 -36616 16279 43386 3573 -42134 -22948 28112
672 28112 33688 -11510 -37025 -8195 27565 18707 -15847 -23916 620 16982 6749 -9347 -9672
685 -9672 -2144 2321 3909 5036 -1828 -13579 -9834 11099 20520 -3500 -30624 -14425 28030 31279
699 31279 -17504 -46001 -5655 46861 29207 -36872 -50493 12813 58162 14673 -52590 -40964
711 -40964 31405 55202 -3869 -55196 -24226 39947 42674 -16044 -46745 -8634 37212 25680
723 25680 -18727 -31171 -612 24419 14185 -9595 -15655 -3903 7423 11783 8006 -6439 -18870
736 -18870 -5728 23575 25003 -13279 -38031 -5208 42724 31373 -29492 -49468 7398 58639
748 58639 23392 -47930 -47785 25372 62352 7970 -56830 -35912 38730 55865 -7917 -56100
760 -56100 -19418 43804 41036 -17931 -44556 -5486 37183 24545 -17466 -27894 -339 21392
772 21392 13375 -5704 -13681 -8265 4512 16043 10847 -11931 -23543 -2115 28384 21082 -19975
785 -19975 -36929 1509 41511 21467 -33150 -40965 12428 49698 13666 -44455 -38275 24271
797 24271 50844 965 -49966 -27023 33845 41739 -12225 -45849 -12539 34561 27426 -17335
809 -17335 -33194 -3142 24656 14483 -12114 -19167 -3826 10966 11232 -1153 -12554 -11876 2980
822 2980 15262 8115 -13161 -20570 582 22872 12873 -18934 -26368 3466 29539 12296 -25473
835 -25473 -27800 11211 34150 5745 -32026 -22392 19711 31065 -3893 -31399 -12608 22408
847 22408 22633 -9050 -24282 -4386 18557 13373 -7976 -14947 -2002 11763 9519 -3313 -10331
860 -10331 -3773 6459 8593 1655 -6758 -6576 2534 10381 6005 -6276 -10285 1448 13529 8173
874 8173 -9439 -13351 3815 17609 6231 -13570 -11701 8667 16548 1336 -13578 -6699 9763
887 9763 12021 -1875 -10954 -3353 8584 8346 -1541 -7320 -2125 5900 6298 -1137 -5408 -1230 4410
902 4410 3738 -1053 -2924 -1189 1829 2688 1101 -1527 -2492 -216 3229 2783 -2452 -4605 15 4757
918 4757 1815 -4239 -3520 1892 3167 -711 -3524 -1744 1158 1546 -247 -1876 -1588 -467 372 261
934 261 -1558 -2176 -214 791 -303 -2053 -1213 242 -441 -982 -408 -373 -1493 -1477 -169 371 -480 -1636
952 -1636 -1049 127 -683 -1260 -514 -363 -702 -831 156 -193 -1965 -1382 1154 1314 -1486 -2281 -26 1826
970 1826 280 -2017 -1779 768 1323 -362 -983 -278 -239 380 967 261 -1322 -474 1504 1508 -484 -1435 180
989 180 1485 1084 -109 -567 198 691 1274 846 -321 -664 983 2712 1039 -1477 -368 2155 2426
1006 2426 -295 -527 988 1475 1072 -338 175 943 628 290 1601 1551 -508 -778 1478 2264 606 -1051
1024 -1051 -301 1484 1844 245 -1136 -495 1307 2081 366 -2144 -865 1521 2176 -349 -2333 -812
1040 -812 2339 1286 -1260 -1242 148 325 -195 -30 -197 -951 -837 632 1548 -14 -2758 -1724 2056
1057 2056 2258 -1796 -3296 -649 2681 1373 -2550 -3854 -898 2556 1837 -2800 -4383 -99 3626
1072 3626 1517 -3699 -4401 517 3603 467 -4193 -3243 1738 2608 -953 -3062 -2037 125 1836 423
1088 423 -1779 -2638 -686 1742 1302 -1954 -3229 -666 2793 2018 -2115 -3687 -239 3033 2065 -1700
1104 -1700 -3613 -914 3227 2890 -1421 -4059 -260 4074 3007 -2447 -3877 297 4549 2473 -2442
1119 -2442 -3548 1147 4099 1937 -2475 -2749 994 4003 2740 -2062 -3444 1033 4420 2080 -2345
1134 -2345 -2479 1925 4379 1397 -2615 -1936 2173 3250 611 -1290 -660 1595 1942 1148 -1058 -1373
1150 -1373 461 2320 1242 -770 -1135 -127 1896 1960 -197 -2018 -392 2230 2152 -409 -2511 -933
1166 -933 2877 3241 -2004 -3709 23 4097 1474 -3324 -3095 1545 4171 58 -4091 -1889 3255 2534
1182 2534 -1997 -3641 -234 2672 1189 -2561 -2793 529 2585 -441 -3310 -1047 1832 1096 -2135
1197 -2135 -1837 299 1277 -1055 -2191 -735 1114 -492 -2469 -949 1359 225 -2239 -1873 1036 1516
1213 1516 -1764 -2718 -520 2278 399 -3253 -2260 1641 2852 -1139 -3970 -745 3455 1661 -3272
1228 -3272 -3709 1400 4710 135 -4913 -2306 3711 3590 -2070 -4514 238 4536 1959 -3650 -3253 1785
1244 1785 4005 17 -3302 -754 3140 2296 -1143 -1923 447 2558 693 -843 -261 1881 1071 -831
1260 -831 -6 1501 988 -738 -574 1882 2461 -315 -2536 139 3901 2044 -2082 -2264 2460 4463
1276 4463 326 -3748 -1442 4110 4523 -1455 -4278 315 4932 2399 -3226 -3203 1929 4524 678 -4064
1292 -4064 -1574 3262 3165 -1488 -3370 -66 2994 1199 -1666 -2027 1246 2155 -226 -1910 -350 1265
1308 1265 343 -1662 -535 1011 523 -1118 -1328 533 1515 -538 -2445 -808 1866 885 -2776 -2640
1324 -2640 681 2104 -443 -3233 -1876 2225 2315 -2226 -3802 -255 2930 580 -3315 -2923 1387 2750
1340 2750 -1056 -4159 -1617 2858 1799 -2912 -3561 1176 3225 -501 -3748 -1397 3014 2038 -2810
1355 -2810 -3872 1195 3785 272 -3904 -1768 3145 2824 -2151 -3722 329 3653 1173 -3298 -2174
1370 -2174 2691 3186 -1554 -3269 344 3485 1268 -2883 -1667 2896 3087 -1790 -2832 1648 4347
1385 4347 -104 -3747 -643 4658 2910 -3192 -3309 2933 5472 -341 -5419 -993 6245 4182 -4021
1400 -4021 -5067 2498 7162 1361 -6244 -3328 5973 6302 -2295 -7038 694 7337 3057 -5340 -4118
1415 -4118 4117 5896 -1297 -5722 231 5270 1996 -4238 -2011 3378 2574 -2314 -3069 1689 3577
1430 3577 -1070 -4093 217 4799 1554 -5458 -3721 4405 5320 -2559 -7188 -558 7583 3453 -6986
1445 -6986 -7035 3977 8340 -1405 -9458 -3302 7460 5319 -5646 -8076 1723 7326 486 -7252 -4098
1460 -4098 4474 4196 -3089 -5198 85 3474 -19 -3708 -1774 2752 1477 -2884 -2597 2029 2503 -2802
1476 -2802 -4037 1108 4692 -622 -5770 -2361 5473 4531 -4697 -7070 2375 7813 606 -7843 -4137
1491 -4137 6070 6160 -3561 -7375 390 6933 2648 -5475 -4130 3373 5343 -588 -4720 -784 3635
1506 3635 2263 -2130 -2326 1677 2678 -572 -2360 1020 2681 -329 -2299 395 3606 1020 -3324
1521 -3324 -1854 4105 3885 -2423 -4511 1718 6425 1266 -5116 -2481 4530 4716 -1926 -4661 156
1536 156 4963 2772 -3414 -3092 2391 4244 -84 -2938 -1065 2513 2442 -1127 -2194 698 2510 -33
1552 -33 -2140 327 2085 70 -2015 1 2041 661 -2383 -1033 2462 2088 -1983 -3167 1010 3586
1568 3586 -134 -3746 -1728 2494 2040 -1832 -3203 205 2448 525 -2663 -2222 1075 1800 -786 -2550
1584 -2550 -610 1457 508 -1614 -2314 792 1518 -840 -1906 147 1449 -968 -2458 -646 1533 474
1600 474 -2191 -1627 922 1334 -1668 -2011 267 1773 -790 -1988 -1055 1230 663 -1116 -1347 308 850
1617 850 -11 -1374 -902 883 965 -564 -1252 12 1517 263 -1142 -695 1283 1413 -892 -1797 634
1634 634 2056 -53 -1557 -293 1972 731 -854 -949 678 1533 -118 -741 496 872 429 378 464 265
1652 265 -1 513 404 215 547 628 609 249 200 353 136 18 665 827 289 -701 -112 1591 666 -391
1672 -391 -702 937 1432 -196 -903 91 728 532 -137 -140 44 74 360 323 -33 -781 -402 969 905 -923
1692 -923 -1242 458 1473 -144 -1514 -808 615 741 -106 -1048 -715 386 737 -230 -1079 -682 205 853
1710 853 -517 -1502 -339 947 278 -1393 -855 237 -388 -721 -382 -99 -636 -920 -476 481 -77 -1703
1728 -1703 -1009 1267 932 -1295 -2119 307 1538 14 -1793 -1535 530 1489 -52 -1650 -1050 1066
1744 1066 1442 -440 -2006 -1072 1403 1597 -692 -1792 -117 1300 435 -1529 -417 1079 628 -104
1760 -104 -302 366 -125 -339 307 813 141 -1047 -90 1157 850 -695 -1110 314 1535 644 -653 -869
1778 -869 480 1834 1044 -746 -1128 975 2135 842 -1498 -973 1160 2121 37 -1560 -211 2169
1794 2169 1478 -279 -753 573 1124 888 194 -235 -332 710 983 283 -601 -659 636 1426 58 -943
1812 -943 -392 913 645 -243 -452 -180 31 212 170 -476 -789 43 1109 374 -1052 -923 255 703 127
1831 127 -785 -1155 244 837 63 -1022 -1418 -228 1505 720 -1740 -1868 469 1701 -333 -2321 -1598
1848 -1598 1320 1722 -1186 -2382 -444 1554 543 -1735 -1790 39 898 -146 -1107 -435 287 367 -308
1865 -308 -933 -290 232 -232 -654 85 176 -46 -968 -307 1069 395 -1300 -1267 1446 1879 -813 -2481 -139
1884 -139 2693 1339 -2042 -2018 1379 2839 -231 -2728 -564 2257 2092 -1227 -2270 410 2554 1223
1900 1223 -1456 -1718 1257 2436 -34 -1685 -170 2075 1266 -996 -601 1101 1595 -344 -1252 723
1916 723 1665 252 -1446 446 1912 593 -1338 -618 2042 2099 -302 -1964 -27 2572 1128 -1774
1932 -1774 -1975 1458 2678 42 -2337 -907 2461 2081 -1285 -2726 450 2906 666 -2568 -1579 1797
1948 1797 2192 -925 -2293 -325 1889 730 -1888 -993 1042 1182 -1181 -1474 72 1233 -421 -1500
1964 -1500 -622 931 384 -1223 -1378 405 799 -881 -1729 -392 1515 638 -1703 -1878 639 1893 -320
1981 -320 -2653 -991 1960 1316 -1817 -2333 559 2300 -95 -2344 -1323 1602 1380 -1013 -2206 -223
1997 -223 1505 74 -1613 -1359 614 1090 -313 -1804 -285 810 867 -985 -1092 359 1033 -89 -1113
2014 -1113 -293 1060 365 -852 -372 636 818 -575 -507 463 1042 -369 -1104 46 1281 1070 -407
2031 -407 -697 636 1913 132 -1500 -510 1269 1651 137 -1507 127 1958 1384 -1117 -1341 1057
2047 1057 2483 531 -1365 -851 1427 1527 113 -1419 -231 1800 1069 -392 -1133 84 1172 367
2063 367 -797 -571 403 881 36 -182 -26 331 588 66 306 253 -684 -619 526 696 90 -1051 -541 1130
2083 1130 995 -851 -1811 -145 1760 867 -1381 -2504 207 2126 489 -2436 -1567 1182 1770 -614
2099 -614 -2574 -1237 1510 1374 -964 -2295 -329 1699 584 -1694 -1651 252 1220 -206 -1271 -879
2115 -879 280 606 -269 -730 -16 -312 -336 -57 126 -330 -1369 -814 1032 1045 -621 -1830 -527 2045
2133 2045 1244 -1606 -2192 592 2501 798 -2634 -1624 1624 2561 -292 -2643 -823 2382 1858 -1396
2149 -1396 -2222 231 2062 953 -1177 -1569 1056 1695 12 -1018 -150 537 643 25 399 416 69 -232
2167 -232 594 890 -45 -683 17 1979 1628 -533 -1302 600 1928 1016 -1568 -1201 1237 2292 28
2184 28 -2106 -861 1938 1763 -775 -2045 450 2017 1125 -1348 -1393 666 1706 82 -1259 -621 839
2201 839 535 -403 -341 585 186 -77 -91 329 185 -843 -375 858 570 -650 -727 -125 960 510 -987
2220 -987 -1026 304 1210 4 -1919 -1158 1001 1008 -696 -1784 19 1258 237 -1293 -1080 567 871
2237 871 -855 -1159 11 663 -490 -871 -309 764 139 -956 -619 65 364 -844 -758 -99 543 -36
2255 -36 -960 -668 45 396 -402 -668 -31 680 -119 -873 -629 527 419 -910 -804 485 1057 -393 -1017
2274 -1017 -103 1223 663 -1338 -639 1110 1195 -907 -1271 346 1349 423 -979 -1006 856 1547 192
2291 192 -831 -268 762 1071 153 -391 66 910 777 102 -379 247 535 168 56 482 229 -108 290
2310 290 792 363 -588 -542 1011 1593 -254 -1469 245 1881 1218 -1245 -1228 502 1844 817 -1343
2327 -1343 -825 755 1587 202 -1339 -1040 1057 1133 -84 -990 -458 759 859 105 -662 -95 -34 349
2345 349 175 34 -470 -578 127 775 -206 -1278 -871 953 1064 -840 -2173 -486 1460 1001 -1382 -1666
2363 -1666 266 1587 57 -1635 -1281 69 1209 100 -1449 -1472 384 922 -310 -1175 -824 167 519
2380 519 -196 -742 -397 19 50 208 66 -866 -1117 381 1199 -255 -1239 -1007 1118 1377 -704 -1755 -476
2399 -476 1576 979 -1037 -1147 285 1262 406 -1029 -684 287 1253 285 -597 -704 471 1106 241 -591
2417 -591 -155 632 155 120 313 627 -129 -570 703 725 -230 -910 568 1741 773 -1490 -828 1039 1825
2436 1825 112 -1285 -214 1501 1107 -432 -757 313 1215 844 -492 -617 220 701 434 -431 -90
2453 -90 246 324 -103 -17 260 301 -571 -83 793 705 -485 -954 664 1450 -216 -1553 -438 1502 1233 -989
2473 -989 -1296 0 1218 470 -1214 -1203 262 1305 -117 -852 -749 254 986 27 -956 -677 465 199
2491 199 -323 -412 155 -235 -389 91 134 -60 -1175 -514 519 752 -915 -1811 268 1594 180 -1879
2509 -1879 -1122 618 1273 -490 -1606 -969 1112 1315 -421 -1727 -447 1074 1138 -686 -1674 -281 1310
2526 1310 387 -1048 -666 446 887 -307 -516 -235 283 -163 239 566 -136 -358 -315 847 861 -533 -989
2545 -989 365 1375 775 -815 -887 864 1604 749 -956 -953 815 1654 249 -1225 -589 1357 1541 -140
2563 -140 -1471 -5 1776 1118 -790 -1065 727 1169 258 -448 -244 551 202 269 430 -72 62 150 467
2582 467 160 -248 -475 -34 625 508 -185 -680 160 588 185 -498 -1155 230 1541 565 -1543 -1114 1080
2601 1080 1493 -360 -2011 -393 1304 1114 -934 -1468 264 1218 -94 -812 -563 -93 425 2 -327
2618 -327 -771 -69 329 -22 -458 -366 87 -165 -157 -110 -75 -456 -291 270 466 -411 -1119 -247 871 479 -1216
2639 -1216 -1420 553 1066 -182 -1547 -588 1217 1044 -398 -1394 -303 971 649 -449 -983 -258 939
2656 939 561 -430 -650 257 654 24 -517 -134 713 382 -342 42 149 180 -206 57 896 73 -766 -158
2676 -158 1087 1078 -679 -1119 239 1543 763 -835 -1217 683 1448 131 -1138 -701 595 1481 187
2693 187 -1076 -769 990 1550 -119 -1189 -89 920 685 -209 -552 139 557 324 361 -35 -184 -252 274
2712 274 846 339 -765 -678 1148 1324 -239 -1468 -631 1582 1213 -486 -1781 -510 2012 1544 -894
2729 -894 -1877 -26 1886 816 -1657 -1880 80 1986 469 -1626 -1277 726 1068 83 -1062 -922 -6
2746 -6 566 327 -425 -1026 -369 676 955 -72 -1692 -1030 509 1265 -226 -1915 -1367 1337 1886 -493
2764 -493 -2605 -1315 1976 2537 -790 -2966 -983 2458 2076 -1586 -3334 -412 2686 1256 -1733 -2366
2780 -2366 323 2206 1243 -1415 -1846 384 1945 1057 -970 -1338 -369 1545 1411 -500 -1575 -754 1304
2797 1304 1731 11 -1855 -1207 1280 2304 308 -2780 -1818 1927 3031 -58 -3097 -1358 2527 3058
2813 3058 -507 -3142 -866 3106 2850 -1206 -2986 -500 2897 2313 -1134 -2516 -349 2667 2113 -670
2829 -670 -2003 -479 2281 1745 -756 -2107 -368 1624 1761 -331 -1927 -949 1238 2685 364 -2297
2845 -2297 -1752 1359 2891 458 -2584 -2072 1398 2886 272 -3029 -1853 1500 3133 36 -2810
2860 -2810 -1599 2064 2793 -360 -2854 -1531 2221 2547 -603 -2806 -1206 1692 1895 -527 -2336 -967
2876 -967 1663 1416 -423 -2020 -997 624 1610 72 -1745 -1698 537 1619 443 -1329 -2087 196
2892 196 1963 1261 -1670 -2286 265 2257 1065 -2094 -2519 327 2556 820 -2417 -2495 747 2578
2908 2578 472 -2391 -2167 1042 2630 170 -2166 -1534 1101 1800 101 -1577 -868 704 1266 183
2924 183 -724 -768 12 1391 1177 243 -1417 -932 1052 1887 238 -1805 -738 1398 2409 -27 -2505
2941 -2505 -1186 2214 2428 -836 -2754 -646 2333 2222 -944 -2319 32 2337 1665 -1234 -1794 231
2957 231 1777 789 -799 -845 258 1122 582 116 -220 -441 -376 1292 1249 -672 -1735 -341 2014 1509
2975 1509 -1460 -2161 140 2827 1298 -2225 -2814 1000 3107 421 -2643 -2147 1744 3027 -326 -2901
2991 -2901 -1441 2066 1953 -727 -1812 -725 989 772 -299 -648 -727 19 521 793 -172 -1552 -785
3008 -785 851 1873 -164 -2098 -1275 1668 2262 -719 -3017 -1289 2601 2408 -1652 -3435 -304 3325
3024 3325 1764 -2718 -2996 753 2933 398 -2336 -1791 797 2108 -373 -1409 -1049 421 854 322
3040 322 -612 -663 -614 391 1011 228 -1162 -1442 875 1894 427 -2082 -1416 1522 2254 29 -2707 -1432
3058 -1432 2092 3040 -691 -3008 -576 2798 1926 -1558 -2259 618 2545 1161 -1286 -1469 764 1346
3074 1346 385 -888 -269 224 682 520 241 -417 -664 574 845 1094 -457 -1223 312 1509 1151 -1366
3092 -1366 -1702 216 2418 569 -1953 -1551 1345 2280 -311 -2436 -606 1866 1314 -1033 -1629 490
3108 490 1684 353 -1041 -595 559 675 -479 -398 -112 -15 -130 -314 184 392 -366 -890 -79 702 -115
3127 -115 -1219 -805 803 1354 -124 -1750 -1080 1133 1160 -906 -1218 145 1588 297 -1124 -873 840
3144 840 418 -745 -837 349 580 -483 -751 -98 638 -32 -1087 -342 801 245 -722 -1091 538 1307
3162 1307 110 -1353 -990 724 1341 -760 -1518 -322 1365 628 -990 -1260 657 1149 -70 -986 -460
3179 -460 751 293 -226 -269 281 -6 20 -175 523 317 -509 -328 1118 749 -395 -1184 254 1465 987
3198 987 -780 -1194 382 1808 706 -1577 -1392 1297 2114 -87 -2007 -761 1879 1752 -554 -1935
3214 -1935 -376 1846 1056 -894 -916 99 982 432 -214 -461 -194 150 541 461 -542 -606 325 808 556
3233 556 -577 -1052 73 1311 947 -498 -1654 -143 2060 954 -1481 -1871 851 2039 316 -2168
3249 -2168 -1392 1277 1929 -248 -1996 -901 1100 1379 -704 -1403 -174 697 563 -351 -1138 -204 411
3266 411 648 -614 -564 -556 170 52 56 -495 -688 -231 540 535 -243 -1362 -224 1258 667 -1359 -1916 345
3286 345 1696 596 -1802 -1532 611 1679 -70 -1811 -978 1232 1378 -309 -1586 -445 1188 1254
3302 1254 -477 -1601 -381 1356 962 -776 -704 341 605 307 -578 -347 93 -115 211 267 -129 -708
3320 -708 -338 497 1124 -275 -1052 -334 1332 1188 -899 -1061 422 1588 773 -1087 -1087 843 1820 363
3338 363 -1412 -985 1072 1759 -438 -1738 -550 1791 1142 -959 -1208 345 1080 464 -901 -757 398
3355 398 780 9 -516 -259 457 197 -42 408 -103 -192 -431 524 368 -370 -822 -209 909 798 -785 -1262
3375 -1262 -174 1451 701 -1510 -1879 770 1839 342 -1791 -1217 1464 1514 -1049 -2033 -570 1778
3391 1778 1090 -1399 -1706 40 1176 437 -885 -1059 298 715 103 -660 -643 86 352 -149 26 -12 -809
3410 -809 -361 433 789 -211 -1395 -351 1153 1482 -1034 -1956 146 2232 1107 -1907 -1986 854 2084
3427 2084 203 -2363 -1128 1420 1897 -279 -2373 -799 1765 1598 -509 -1818 -102 1657 1077 -1017
3443 -1017 -1108 212 669 233 -480 -324 116 89 419 747 -251 -1318 -222 967 1300 -312 -2024 -403
3461 -403 2310 1792 -1450 -2030 187 2525 1086 -1898 -2026 950 2752 888 -2118 -2185 1358 2755
3477 2755 162 -2500 -974 1371 1880 -479 -1794 -390 1196 991 -417 -687 -658 164 741 337 -402
3494 -402 -1015 -389 1114 1148 -445 -1966 -394 1694 1589 -799 -2374 -234 2083 1824 -1325 -2590 -51
3511 -51 2247 1412 -1687 -2823 596 2715 795 -2191 -2170 1027 2417 473 -1753 -1548 751 1641 113
3528 113 -1179 -1067 531 1155 375 -754 -1224 5 1140 1013 -642 -1569 -926 669 1086 -584 -1937
3545 -1937 -623 1534 1624 -460 -2250 -809 1780 1701 -1027 -2633 -592 1960 1438 -1199 -2455 -270
3561 -270 1996 1344 -1725 -1942 106 1930 967 -1150 -1756 227 1620 1115 -840 -1285 -141 1344 1153
3578 1153 -483 -1543 -462 1229 1218 23 -1174 -961 651 1405 229 -1201 -1175 1072 1815 272 -1712
3595 -1712 -684 897 1834 36 -1719 -893 1226 1746 -607 -1613 -685 1506 1823 -486 -1666 -704
3611 -704 1369 1576 -288 -1170 -395 971 1014 31 -743 -528 463 1051 47 -781 -760 65 1222 634 -574
3630 -574 -1096 -82 1336 882 -836 -1266 -155 1698 953 -931 -1465 158 1522 735 -1317 -1313 540
3647 540 1512 644 -1610 -1228 748 1391 65 -1053 -899 575 898 42 -595 -656 251 181 387 -200 -776
3666 -776 -610 490 726 4 -1009 -1107 503 1049 71 -1402 -989 1012 1581 -206 -1898 -581 1233
3683 1233 1568 -726 -1857 -5 1358 1129 -486 -1339 -100 1316 543 -791 -614 356 706 249 -322
3700 -322 -242 65 239 371 256 -12 -654 -234 1049 755 -475 -1285 123 1460 1092 -975 -1161 180
3718 180 1947 623 -1804 -1037 845 1743 51 -1795 -790 1085 1403 -59 -1303 -238 1062 740
3734 740 93 -716 -28 522 267 -207 -171 -139 -130 501 678 -200 -665 -501 650 1116 -14 -1312 -563 1268
3754 1268 1481 -197 -1715 -216 1327 783 -1210 -1646 153 1554 523 -916 -1174 397 1342 29
3770 29 -1380 -487 725 501 -439 -580 -25 182 301 141 327 -207 -283 -95 265 418 -418 -894 -170 920
3790 920 235 -826 -1148 686 1360 39 -1183 -555 869 1107 -626 -1562 -442 1118 378 -762 -891
3807 -891 35 804 49 -614 -190 444 268 -1 18 72 125 -75 -9 -32 -282 -299 -223 615 329 -399 -677 129
3829 129 853 -93 -511 -314 283 832 15 -981 -341 551 714 -210 -671 79 709 429 -288 -330 330 635
3849 635 -159 -147 41 495 166 149 275 56 -101 -96 196 459 -246 -652 -100 611 529 -267 -227 194 689 31
3871 31 -127 -332 191 214 351 -451 -107 529 -18 -159 -523 574 428 15 -78 128 473 505 -534 -136 236
3892 236 233 -590 -308 317 424 -92 -644 -60 383 -31 -501 -400 366 250 -283 -315 -197 276 -145 -380 -134
3913 -134 130 156 -220 -296 -86 253 45 -472 -374 415 181 -343 -631 362 552 -51 -932 -282 780 310 -402
3934 -402 -530 353 434 162 -512 -397 488 313 -385 -759 -89 163 298 -246 -100 92 -71 -205 -271 -39 323
3955 323 -214 -175 62 340 -202 -367 114 444 243 -500 -655 181 770 57 -497 -349 806 592 -135 -623
3975 -623 -123 742 397 -280 -457 -17 384 255 -266 -42 365 424 71 -372 -78 268 258 -80 -262 171 335
3996 335 64 251 254 90 -198 165 470 282 -262 -128 282 293 139 -470 -198 147 610 -197 -393 -197 195
4017 195 628 -40 -487 -303 215 293 -60 -819 -402 402 639 -695 -631 -108 467 257 -303 -415 53 228
4037 228 -31 -322 -321 157 329 -173 -592 -507 64 -37 -286 -375 -93 159 17 -163 -106 254 -354 -438 -83 201
4059 201 -291 -492 73 539 -112 -517 -266 312 605 -370 -884 -204 434 106 -428 -672 160 511 476 -861
4079 -861 -692 423 989 265 -733 -472 730 804 -294 -921 100 681 525 -650 -738 230 266 417 -222
4098 -222 116 108 202 -61 42 81 -143 -198 182 289 -235 -309 -1 702 633 -408 -729 -65 806 718 -227 -977
4120 -977 332 1163 485 -646 -525 493 1066 -4 -1300 -602 876 924 -464 -1078 -309 1163 590 -423
4138 -423 -834 -156 650 193 -160 -598 -217 88 210 219 -315 -246 292 477 467 -193 -568 -609 970 539 -443
4159 -443 -1202 -22 1186 461 -937 -1188 141 1190 384 -1326 -1046 626 1100 -84 -1213 -976 715
4176 715 549 -65 -1090 -613 579 703 -177 -1059 -529 611 455 -405 -621 -584 240 251 -43 -508 -524 -135
4196 -135 705 506 -532 -905 -339 917 521 -388 -1023 103 947 720 -882 -1354 331 1290 714 -723
4214 -723 -1083 169 1416 343 -915 -867 578 1400 407 -1009 -687 304 1011 164 -618 -578 861 585
4232 585 235 -457 -563 104 670 294 -245 -487 -13 490 680 -62 -775 -327 457 787 6 -1146 -319 839
4252 839 788 -15 -1115 -487 1077 689 -541 -1172 81 1065 577 -942 -839 271 1095 757 -724 -1089
4270 -1089 109 687 511 -546 -917 71 784 416 -274 -578 -17 636 224 7 -262 -403 227 580 -168
4289 -168 -688 -1076 504 996 93 -1317 -607 680 866 152 -1283 -730 759 986 -107 -1149 -255 830
4307 830 940 -374 -1319 -62 723 526 -102 -717 -226 439 338 -180 -547 -122 417 499 -41 -702 -533 65
4327 65 738 461 -372 -834 43 985 444 -721 -1171 267 1068 432 -1082 -1278 452 1108 -158 -1154 -927
4346 -927 625 1209 182 -791 -509 420 894 -89 -853 -141 314 735 -22 -339 -429 115 596 428 -299 -512
4366 -512 -142 517 520 -479 -714 -190 1077 957 -625 -793 -10 966 800 -829 -1212 58 1326 545 -583
4385 -583 -494 633 1080 214 -698 -647 286 768 31 -541 -386 181 591 265 -425 -419 -260 593 735 326 -729
4406 -729 -394 618 642 -164 -931 -653 334 1043 -186 -1076 -661 829 1227 -261 -1223 -177 705 813 -534
4425 -534 -1115 -344 1095 487 -591 -976 -152 736 395 -548 -338 170 80 398 -202 -457 -4 -8 604 295
4445 295 -533 -660 -174 385 110 -982 -696 268 1066 49 -916 -441 232 1229 145 -981 -728 381
4463 381 1154 -169 -995 -409 782 1031 -28 -670 -408 432 299 -145 -151 -418 458 489 154 -235 -551 21
4483 21 707 312 -223 -339 -85 629 162 -226 -603 124 876 844 -553 -557 290 857 519 -757 -817 5 828
4504 828 458 -397 -666 218 774 232 -583 -397 318 614 288 -368 -634 569 661 272 -502 -507 305 566 294
4525 294 -487 -236 125 406 356 -209 -250 71 545 413 -475 -288 -117 543 165 -349 -538 -159 450 443 -196
4546 -196 -826 -84 557 670 -389 -778 -367 707 750 -285 -1030 255 473 516 -458 -889 -42 683 346
4565 346 -369 -739 195 338 17 -295 -571 -126 530 -16 -269 -277 -47 153 101 32 -157 50 139 115 -139 -444
4587 -444 -461 338 314 -199 -566 -391 492 638 113 -613 -409 301 863 -175 -855 -298 853 467 -186 -666
4607 -666 83 505 342 -621 -793 52 308 60 -425 -480 36 146 -61 -131 174 153 119 403 -287 -108 -383
4628 -383 207 525 37 -124 -280 -85 374 307 -417 -380 298 852 361 -643 -396 828 670 -121 -619 -164
4648 -164 973 682 -556 -752 -399 652 250 -55 -789 241 516 13 -331 -401 190 179 432 -426 -518 373
4668 373 62 -137 -20 113 -11 98 199 -174 -232 -109 442 235 100 -470 -379 227 678 178 -599 -250 528
4689 528 458 132 -498 -547 355 62 -146 -613 33 314 147 -141 -385 101 139 -10 -377 -362 72 75 28 -176
4711 -176 -120 233 -100 70 -279 -188 -30 113 180 -104 -211 -225 62 -25 102 -358 -380 3 43 252 138 -434
4733 -434 163 -41 47 -68 -184 -123 362 151 -342 -281 389 552 -21 23 28 348 142 115 -276 -51 180 232 -78
4756 -78 -125 -381 429 -250 123 184 423 95 63 -130 -122 105 -93 -91 -69 187 264 348 119 367 -32 -145 -143 12
4780 12 195 20 31 -19 323 75 -205 -44 185 233 112 -208 -174 530 355 -146 -399 -271 202 356 -47 -282
4802 -282 -131 225 95 -308 47 240 30 -261 52 46 201 -172 -162 33 165 139 -208 -42 182 163 -381 -8
4824 -8 -475 187 -45 -157 -200 15 363 -107 -397 -399 296 100 -173 -343 -66 89 154 -347 65 27 381 -254
4846 -254 -289 404 75 -237 84 298 313 7 -19 -217 374 -89 -213 -296 -71 452 106 -553 -132 281 657
4867 657 -160 -523 -219 233 347 -165 -435 353 333 269 -229 -416 376 97 273 115 178 139 302 185 -187
4888 -187 7 52 159 -9 -200 -51 115 -1 -40 164 -19 -304 -44 233 63 -129 -132 63 388 372 -235 85
4910 85 419 615 -107 -346 -145 226 693 -207 -137 -27 283 47 -190 -44 36 301 63 -262 -350 -297 128 -16
4932 -16 103 -208 -227 -27 211 -87 20 -301 -177 381 5 -290 -183 -113 81 -69 -164 -325 -316 426 39 -291
4954 -291 -218 71 455 -249 -540 -178 197 214 -316 -508 -236 231 63 -167 -526 94 366 207 205 -37 -157
4975 -157 -131 17 -62 37 -194 45 198 390 -240 -141 397 436 37 -306 -158 96 90 423 -243 -76 -15 302 -67
4998 -67 -505 -245 -130 308 178 -418 -359 351 367 -42 -319 7 378 102 156 31 -31 -168 138 129 -333 27
5020 27 -123 64 177 -67 -256 -75 242 434 97 -273 -369 522 197 -225 -207 -152 259 255 -337 -311 318 281 244
5043 244 -397 -57 587 -26 -315 -463 -29 376 57 203 -385 -167 33 -41 -26 217 -13 292 96 -115 290
5064 290 -100 -379 -391 488 162 -353 -691 667 305 -14 -381 -267 313 519 -367 -806 36 440 140 -788
5084 -788 -340 402 467 -194 -384 -257 368 84 -154 -646 -43 119 -34 -194 2 -70 4 -183 -221 0 359
5105 359 -347 -333 -62 128 -268 -592 65 395 340 -536 -299 77 352 -22 -474 -88 514 481 -15 -384 -320
5126 -320 334 -70 -115 -202 2 297 300 -225 65 317 290 -76 -362 268 399 -29 -205 285 357 -120 -86 -113 506
5149 506 409 -60 -219 487 248 -294 -414 1 558 379 -369 -509 184 271 17 -378 188 76 551 50 -374
5170 -374 -156 218 207 -242 -241 149 323 22 73 -54 370 -51 -159 -165 83 -100 -144 -56 10 269 -264 -274 118
5193 118 316 -184 -540 -62 389 337 -282 -448 -284 419 236 -487 -380 -209 156 -19 -70 -374 -209 234 153
5214 153 -11 -286 63 35 -231 -307 -262 97 20 -251 -123 -314 71 163 205 83 -217 159 -128 -74 -131 34 -133
5237 -133 -97 -66 58 -36 -57 -97 -26 -144 -43 -166 289 106 -27 -213 -339 293 308 -131 -540 -400 300 13
5259 13 -8 -408 43 276 198 -124 -279 -64 527 417 -305 -25 257 267 37 -51 256 -32 201 35 -287 0
5281 0 120 -136 -34 -160 98 21 -148 282 303 207 -443 -105 386 180 -198 -72 63 352 304 -398 -396 459 216
5304 216 -214 -433 -50 489 16 -482 -339 143 476 44 -442 46 456 211 -183 -145 0 445 188 -79
5324 -79 52 174 22 -65 -46 60 247 9 -41 -7 260 -451 -448 -103 195 299 -421 -247 99 373 109 -624
5346 -624 -105 375 351 -526 -326 -337 312 -19 -538 -314 -58 302 67 -377 -118 122 38 -148 -173 -162 103 -253
5368 -253 -28 127 73 -67 70 239 -94 -110 -84 143 358 121 -241 -99 -161 188 517 -238 -412 408 131
5389 131 -121 -71 -28 337 343 -251 -251 16 437 170 -294 -26 243 369 -33 -52 93 274 25 259 208 79 363
5412 363 53 17 87 182 86 -128 161 -140 -115 55 129 114 84 -175 -68 -2 249 -248 -139 -74 248 67 -166
5435 -166 -82 -104 100 -24 -85 59 93 74 185 -55 -268 -155 85 -86 87 95 119 69 -33 80 80 -69 85 151
5459 151 -268 -11 141 -15 91 -89 -300 -111 50 -134 -159 -43 86 -316 15 -116 -93 -84 -7 -85 -191 -188 -253
5482 -253 -165 -18 -163 -157 -136 18 170 -1 -177 -89 26 40 16 -288 -281 168 199 -278 -69 75 -50 236 -4
5505 -4 -386 110 285 -36 -210 -329 136 -78 -60 -147 49 251 -178 -217 -192 92 453 -32 -62 20 -28 -66 40
5528 40 122 163 228 -141 -20 55 -142 -35 208 4 134 47 -145 -1 351 206 266 -326 -20 164 -63 63
5550 63 -49 191 171 7 -25 385 -53 -103 106 -218 217 123 270 9 -82 156 -18 90 101 254 -143 148
5572 148 8 -24 -74 -356 -86 42 223 243 -265 -292 227 59 -49 -247 -237 -32 -45 -123 -397 55 143 3 -356
5595 -356 -113 223 243 -245 10 -64 21 -358 -90 -210 -47 96 29 171 -105 -353 -28 208 -61 -263 -237 -168
5617 -168 46 225 -84 -149 -230 158 121 100 -335 -50 131 156 -53 -315 -95 337 16 -263 -182 -29 296 -154
5639 -154 -449 -184 45 100 -82 -269 -74 23 166 -59 -51 389 -79 -208 -61 429 90 -326 308 15 320
5660 320 19 -217 254 299 133 -232 28 2 546 -167 -153 83 139 154 -97 -183 -250 275 102 -279 -172 -38
5682 -38 271 -32 -7 -41 145 105 -488 -38 194 34 72 -209 331 -127 123 -536 -11 46 90 -352 -236 -56
5704 -56 212 6 -574 125 413 268 -265 -439 259 130 -103 -428 -300 -5 224 -207 -525 -54 333 14
5724 14 -165 79 169 393 -318 -119 357 356 -102 -688 190 303 -46 -250 -278 -138 527 -399 -212 85 419 63
5746 63 -159 -429 136 238 62 -316 -309 352 194 -173 -437 -42 346 72 -303 -236 241 363 -247 -283 42 348
5768 348 -148 -250 -367 92 -158 -340 -259 126 460 -287 -102 14 437 187 -265 -395 336 438 3 -272
5788 -272 -76 267 306 -176 -241 141 888 224 -259 -142 449 424 126 -136 53 213 59 -120 -204 346 -66
5809 -66 15 -3 147 506 -62 -183 -337 143 275 -52 -135 449 57 -11 -326 -45 75 386 -463 -280 230 486
5831 486 -257 -723 83 379 103 -321 -161 5 557 158 -378 -359 95 459 -98 -534 -256 276 200 -499 -356
5852 -356 -67 -41 -178 -280 116 -75 100 -267 -178 22 -12 -346 -247 235 -76 -6 -430 -71 145 224 -404 -280
5874 -280 103 458 73 -439 -242 246 354 -139 -257 -286 241 444 -161 -275 -260 335 311 -320 -323 363 330 -211
5896 -211 -174 -55 154 105 -73 -70 151 101 240 143 -65 204 77 145 -110 -39 215 -67 68 92 143 90 -225 -268
5920 -268 336 303 -310 -282 39 467 -38 -241 -23 271 554 235 -209 -140 449 242 -200 -381 203 574 335
5941 335 -350 -130 89 362 8 104 30 364 50 -164 -32 166 155 -154 142 141 150 -362 -75 110 168 254 -617
5964 -617 46 438 439 -341 -494 27 30 201 -377 -460 134 29 45 -260 -326 261 333 -276 -178 319 263 151 -252
5987 -252 -236 119 20 164 -318 158 430 -318 -93 -112 94 -292 -392 17 119 5 -9 -59 32 36 -337 5 -245
6010 -245 314 -7 175 -507 -227 136 367 -269 -386 23 307 228 -491 47 -48 297 -121 -199 100 247 129
6031 129 -374 119 392 393 -97 -32 23 -1 39 19 154 -9 -162 -71 34 85 274 -91 -371 143 274 -24 -298
6054 -298 -71 256 51 82 -240 -30 235 397 -279 -343 362 122 104 -93 -245 98 340 78 -327 65 157
6075 157 117 2 19 -79 53 81 108 -72 -244 34 194 -37 141 -40 80 75 -15 50 -274 -48 306 158 68
6098 68 -197 -140 -8 109 63 -328 -189 54 -112 -187 -60 -59 290 55 -140 -309 -10 55 -80 69 -54 60
6120 60 238 -252 -88 -159 29 178 62 -235 -435 -274 -105 7 -167 -184 -152 140 38 -164 -199 -11 -111 113
6142 113 -114 -235 -295 -89 477 -97 -168 -85 -47 279 -309 -106 55 222 143 -194 -179 -168 83 241 204 -149 -207
6165 -207 67 287 120 -263 -81 -87 224 -68 -220 -85 142 568 37 65 -104 87 335 155 -320 -147 -37
6186 -37 419 273 -462 -100 389 199 -161 108 107 80 399 -75 -130 113 38 188 123 -117 79 40 370 5 -59
6209 -59 -64 -229 120 -107 248 -106 289 210 127 -242 160 93 270 -19 -279 -165 -128 113 85 -158 -115 250 240
6232 240 -68 -171 -123 208 19 -10 -220 -102 282 180 121 -220 -197 -17 277 191 -289 -205 108 224 233 -137 -525
6255 -525 -99 199 329 -299 -353 59 163 -89 -171 -15 71 83 59 -256 -154 -141 40 -5 -72 -387 394 469 80
6278 80 14 -164 210 262 98 17 -334 -57 129 144 -90 -190 169 -58 379 -195 -111 -25 9 -119 -25 -184 108
6301 108 369 181 216 -39 -208 427 142 31 22 -87 460 -17 -25 -301 105 68 113 -57 -58 342 8 399 43
6324 43 -187 -36 336 133 49 -290 -291 -4 144 138 -30 68 140 169 -207 -148 43 244 131 -149 74 105 245 373
6348 373 122 -128 -347 185 131 -44 -105 292 -217 80 18 -207 86 -123 -27 -84 194 -469 206 -61 -167 -215
6370 -215 -326 38 389 140 -53 9 2 54 -40 -49 -206 158 80 -39 -79 20 129 -83 -75 -20 182 249 -46 2 92
6395 92 172 -314 -334 66 299 -105 -224 -270 -55 -25 -132 -133 62 206 120 -313 -211 75 -25 -145 -371 -194 57
6418 57 27 -137 91 70 149 73 -335 100 154 74 219 -316 235 120 -132 -144 119 120 313 -161 -69 -4 -101 103
6442 103 -170 274 -122 74 -66 -399 293 -23 -232 -45 285 -28 217 -234 41 164 92 161 136 58 4 132
6464 132 -61 -46 130 204 80 89 326 224 178 -166 -101 89 168 -130 -114 123 596 -37 -214 81 168 -14 106
6487 106 -80 -140 65 43 -134 59 35 40 24 -131 -17 110 221 -111 85 23 73 -23 -197 -94 -33 -27 46 -320
6511 -320 146 42 -116 -57 0 5 -129 -5 -203 31 56 110 -138 -141 390 -36 -656 86 89 407 49 -320 -354 399
6535 399 54 -149 -144 157 255 68 -145 -261 67 116 69 -164 81 17 99 -7 -221 -165 62 176 -51 94 161
6558 161 127 -254 -102 427 225 4 -275 -25 348 77 130 -42 211 459 -378 -119 210 510 -242 -74 9
6579 9 145 469 91 -168 -45 -3 233 -124 -96 -71 198 -152 -68 -118 66 52 -161 94 3 30 58 7 -262 352
6603 352 266 18 -10 240 8 -211 -144 332 337 82 -306 -84 -31 219 -122 -145 101 418 155 -307 -352 83 0
6626 0 226 -315 -131 445 374 -236 7 70 -42 66 -110 99 52 242 -212 -295 202 235 -108 -45 -7 43 -190
6649 -190 -118 14 266 168 -162 -198 57 80 -92 11 -170 -143 494 -66 -172 -171 314 26 -204 -230 129 322 -168
6672 -168 -97 12 -77 -102 55 110 -45 127 253 76 -233 94 170 -38 42 192 166 166 281 248 189 63 1 80
6696 80 94 133 137 176 -208 425 109 -24 -197 262 197 7 -212 -44 411 -242 -123 -147 -149 190 238 -75 3 -36
6720 -36 84 11 -90 157 -160 160 93 36 64 -79 197 -176 -80 333 -89 -46 -341 12 -153 -26 53 299 117
6743 117 -129 -196 -185 104 -14 296 -287 -98 141 -113 -214 -169 62 109 -18 -209 34 -51 -9 -156 -247 -134
6765 -134 140 -196 -77 -134 20 44 72 245 45 225 -209 46 -83 17 -148 5 -12 -409 -274 -103 -37 291
6787 291 -221 -337 -49 -23 61 183 -251 -394 352 84 23 -205 12 -24 -168 7 27 314 22 148 -39 66
6809 66 35 377 175 131 132 179 23 -7 -148 -230 15 -143 278 22 -207 -54 70 279 92 -147 -351 121 202
6832 202 47 -207 -83 181 483 -30 -267 64 114 255 -197 268 -4 6 253 -113 22 -65 594 43 -239
6853 -239 -17 66 -45 191 270 -205 33 139 193 -57 -2 -189 28 211 -77 29 -136 -134 -114 88 -234 -318 180
6876 180 227 109 -316 -68 273 277 397 35 -161 364 -40 -263 -334 91 82 28 -87 7 51 219 9 -253 101
6899 101 -107 -88 -41 -188 67 -145 175 33 8 -255 -32 -98 -37 245 -32 -96 60 243 162 -258 -57 178
6921 178 150 -86 -178 -230 371 20 -54 209 -7 -121 162 -104 -68 18 236 141 -197 -32 -104 115 282 199 -65
6944 -65 39 94 -19 -36 -5 -377 383 -28 -352 31 -7 -180 -137 197 447 -135 78 -119 251 72 -132 57
6966 57 104 94 -88 -56 -206 62 99 -195 -479 316 -29 218 153 -104 100 3 168 14 -96 107 129 -161 -73
6989 -73 73 -81 204 -257 289 -42 -133 -23 -14 271 -11 -206 -4 -146 18 -140 -365 -64 100 0 -266
7010 -266 -253 -174 16 -141 -154 200 267 229 -162 -81 -238 -203 29 -44 -204 -124 189 135 -311 -158 -168 -41 78 41
7034 41 -160 -19 -152 164 -202 -152 -45 -135 10 -110 120 -183 105 335 245 378 -322 -66 369 76 -199
7055 -199 -251 128 442 60 -165 -349 136 371 200 -106 -11 -93 -102 -42 -19 -62 -97 -18 -80 -133 -103 -61 -19 103 102 -76
7081 -76 -184 149 -44 120 -155 127 196 331 35 -331 -230 -78 340 -100 -318 -160 247 118 24 -22 221
7102 221 161 45 -172 -186 240 270 86 -237 -85 231 101 45 -70 -239 98 -216 -112 -154 -159 216 -73 -137 7
7125 7 34 -161 17 432 -19 -28 138 118 -230 -84 -58 9 -270 261 -79 -261 65 63 217 -132 -264 40 61 62
7149 62 -67 -207 -78 142 -40 -336 -224 -151 95 -178 -85 -392 184 227 140 -54 -3 -163 -267 -16 -132 -138 -54
7172 -54 249 -160 61 218 454 -245 -84 -469 36 36 135 190 -161 -184 -45 29 -228 -89 -263 -109 7 226
7194 226 -180 24 -254 -61 25 205 -99 70 264 140 255 -297 -23 -159 -45 -254 -249 29 209 60 -62
7215 -62 93 251 269 -19 -104 104 -102 -86 -8 -190 -154 -115 -103 -13 -142 -117 -149 112 246 41 -232 21 189 -24
7239 -24 11 9 -178 231 146 -3 -9 -300 102 65 -39 -146 176 21 -11 -158 -227 -204 247 -150 -43 -346 73 94
7263 94 197 -145 4 243 133 -119 -183 215 -4 -44 18 63 -265 -72 -111 189 139 -341 -134 178 307 91
7285 91 -135 20 -142 120 380 53 122 -61 345 -27 53 45 11 174 -114 -51 45 278 -119 -125 -221 66 237 91
7309 91 -18 169 30 -162 -87 -127 172 -379 -218 101 135 -101 -220 -51 296 -28 -38 -449 -122 525 289 -162
7331 -162 -78 106 238 -2 6 -121 -45 305 383 -253 -242 313 -229 84 45 159 272 171 132 101 101 -115 -40 214
7355 214 -163 -112 16 101 341 2 -418 -90 106 74 103 -228 61 259 -126 -3 -443 -65 84 264 -92
7376 -92 -295 125 298 278 6 -148 123 22 -161 -268 -129 -154 65 -5 -195 -29 -344 -1 -209 34 -316
7397 -316 -327 60 83 90 -144 154 -85 367 202 -306 -183 65 394 97 -265 -350 280 268 69 -70 28 95 468
7420 468 -26 -393 -158 69 153 -301 -234 -81 156 123 9 -365 -129 164 198 -59 -193 -96 -13 268 -90 16
7442 16 -88 215 226 20 -131 -255 152 -58 -119 -312 -243 -71 209 98 -31 -297 6 148 194 8 20 256
7464 256 194 -22 206 -18 -150 208 19 -237 -182 8 116 37 -147 -5 141 230 -200 49 -231 -24 380
7485 380 -27 90 -108 60 179 340 189 -114 -321 -30 156 22 -105 -79 -6 112 53 -204 -375 -148 506
7506 506 219 -294 -276 231 110 -109 -85 155 9 284 118 -163 5 -48 -15 30 -332 -177 -288 -257 -281 -256 42
7529 42 -146 -35 48 63 -45 197 228 157 -90 -126 -41 222 -14 -29 -230 93 221 -65 -435 -106 -85 267 -70
7552 -70 -179 -206 -182 -94 100 -32 -77 16 -97 -98 89 57 -174 120 -96 -258 23 -24 261 -211 63 -388 -389 62
7576 62 -119 -77 -492 -110 -107 36 110 109 -200 -3 120 -9 -172 -57 257 125 -16 101 -22 -20 -141 -9 -232
7599 -232 -204 46 -83 -103 124 4 -56 7 -366 293 136 -200 68 368 175 59 59 -115 -128 -60 -203 -4 111
7622 111 112 77 -115 131 63 71 8 50 163 176 211 -42 -179 188 158 404 -163 -83 161 90 265 12 32 -99 -94
7647 -94 157 -210 97 -149 146 502 281 -312 -144 368 -80 51 149 -17 190 19 -70 -2 -94 6 139 165
7669 165 50 364 -13 195 192 -273 -106 208 102 -27 40 11 -37 174 34 -46 83 -90 38 -5 -146 -117 220
7692 220 -89 -125 -115 -63 95 124 -26 -101 -165 -177 108 90 -213 -58 -37 221 189 -199 -189 158 325 -100 -373 -29
7716 -29 225 203 -95 -287 -199 116 120 -67 -393 -65 -30 -65 -19 -77 -259 90 358 157 14 -95 96 120 368
7739 368 -184 -24 -146 165 299 -259 86 -53 216 124 -256 -326 41 232 166 -76 -411 13 314 265 -73
7760 -73 -123 30 330 65 -115 -253 -45 389 65 -376 -53 15 190 56 -373 -213 27 120 -17 102 -403
7781 -403 -298 480 307 172 -406 -13 422 -5 -288 -163 0 173 135 -92 -333 233 100 357 -231 -402
7801 -402 -161 367 -52 -399 35 46 238 240 -443 -573 84 212 90 -123 -225 -233 112 130 -358 -438 161 206 160
7824 160 -128 -241 -17 406 219 -414 -156 434 193 105 -25 -175 70 5 203 -201 151 -54 313 -83 -137
7845 -137 28 -10 602 -35 -164 -330 91 62 208 -132 -20 168 213 236 -321 -531 -11 301 243 -92 -114 225
7867 225 232 129 23 -80 206 297 212 -95 21 40 256 -32 17 -25 79 167 -111 -158 -300 -23 248 212 252 -138
7891 -138 45 131 437 -127 -269 236 354 170 -33 -379 228 638 333 -323 -164 -24 312 395 -418 -449 -27
7912 -27 39 384 -94 -265 250 268 201 -73 -63 29 45 210 -138 -142 54 124 -164 -267 8 -61 378 184 -96 -298
7936 -298 -176 92 -78 -3 -297 -85 313 388 -242 -308 -55 27 102 -244 -120 63 375 182 -5 -369 -98 142
7958 142 183 -246 -491 97 336 195 -98 -196 -203 157 208 154 -220 -119 170 99 335 -218 -202 39 587 315 53
7981 53 -228 84 233 -46 -109 -301 313 174 -136 -433 -262 32 495 -224 -172 283 147 88 -149 -350 89
8002 89 -65 4 13 99 -112 143 359 -182 -259 -58 389 198 -45 -12 -50 -124 273 142 22 -249 -213 345 172
8025 172 -121 -360 49 220 78 -265 -329 367 376 -165 97 -239 201 36 90 -291 -207 88 557 -22 -170 -235
8047 -235 -35 232 133 -445 -136 135 423 38 -29 -371 116 554 70 60 -469 -32 68 165 -129 -357 -204
8068 -204 272 30 -227 -444 -132 73 275 -243 -311 137 97 273 -263 -132 -15 433 -33 -191 -161 -98 103
8089 103 93 -140 -227 -231 190 -36 -261 -295 -176 162 228 -202 -43 38 169 43 -337 -133 -555 365 172 -69
8111 -69 -86 187 163 176 -89 -262 -218 216 376 -243 -638 -87 362 187 136 -411 -139 333 -63 -26 -207 -6
8133 -6 552 310 222 -155 -134 245 504 -203 -136 -237 192 191 20 -328 -55 312 25 -122 -210 73 376 328 75
8156 75 -146 -72 -92 -56 132 -60 -109 322 94 -4 -53 165 400 162 -201 -243 48 137 310 -264 -128 -27 350
8179 350 372 -260 -197 -116 -64 -91 135 -239 77 -125 272 -31
8191c1
$$ Imaginary data points
##PAGE= N=2
##DATA TABLE= (X++(I..I)), XYDATA
0 0 0 0 0 -2 8 0 8 -9 10 -16 24 -25 32 -40 49 -57 66 -81 96 -113 132 -153 175 -205 235 -267 306 -347 392
29 392 -444 501 -559 627 -703 783 -872 969 -1079 1194 -1322 1468 -1623 1795 -1990 2204
45 2204 -2444 2718 -3033 3387 -3805 4301 -4897 5630 -6565 7793 -9486 11997 -16096 23947
59 23947 -44468 209154 452878 -88715 -349147 -125204 229330 112510 -215025 -242235 138080
70 138080 365665 156927 -211637 -263231 -38085 132240 65389 -44590 -28767 80738 113985
81 113985 30197 -103321 -165074 -93409 83952 198854 111282 -94471 -147109 19901 141903
92 141903 -6634 -217219 -128774 202688 313659 11445 -300820 -189952 157960 218329
102 218329 -76609 -244996 -6110 287703 187126 -178330 -300904 -34073 223056 134276
112 134276 -112065 -137232 64974 167056 16275 -168267 -141278 40269 141481 74715
122 74715 -36214 -67420 -24309 21941 23305 -22684 -66679 -30993 78990 127914 14445 -143268
134 -143268 -130564 48865 145775 19923 -134330 -67754 128598 146397 -66690 -210193 -72604
145 -72604 152458 152192 -51946 -151344 -13065 135779 64727 -118719 -140037 31355 151121
156 151121 67404 -81829 -93391 15078 69079 4849 -63735 -36230 40383 65121 20466
167 20466 -35562 -53480 -25228 21672 42127 12952 -28200 -20965 30364 46165 -14082 -74944
179 -74944 -40033 55280 82019 2991 -67885 -33766 47272 49470 -32141 -72351 -3236 80726
191 80726 58969 -36505 -71301 -6745 53815 25505 -36710 -33910 28705 55476 8159 -43387
203 -43387 -32976 12474 29388 8407 -9793 -3307 12103 12407 -4022 -17062 -12024 5099 17729
216 17729 15557 1395 -8869 -6280 1804 2637 -3367 -4768 4066 13771 11638 -3477 -15476 -9778
230 -9778 5238 8916 16 -3787 4330 8995 -67 -12337 -10903 1338 8079 3118 -1718 1363
244 1363 3935 -2416 -9481 -7986 493 7683 5082 -3000 -5260 1278 3286 -6119 -14279 -5358 11856
259 11856 13325 -4510 -16502 -5418 10660 4302 -14487 -14486 7212 18850 4336 -16900 -16489 3025
273 3025 12611 97 -14109 -7500 11112 13630 -4334 -18405 -10425 7600 11130 -1327 -9471
286 -9471 -2672 6573 4198 -4610 -8801 -5057 2577 9046 6615 -4015 -10534 -3581 8559 7452 -6712
301 -6712 -12437 2573 17344 8445 -13131 -16097 3123 17242 5998 -11597 -10100 8886 17164
314 17164 662 -16534 -8989 11629 15953 -827 -11636 -2640 11178 8828 -5298 -9533 1834
327 1834 10172 5726 -1527 -2822 585 2077 2813 2191 -332 -971 2139 6075 4037 -2468 -5584 1102
343 1102 8159 4680 -4154 -4103 4023 7243 580 -6461 -4131 5228 8011 -68 -6563 -1103 6743 3175
359 3175 -4808 -4564 3141 6666 478 -5433 -1969 4384 1896 -4601 -4018 3145 4324 -1329 -4485 -1360
375 -1360 1605 339 -2875 -2666 780 2324 -412 -3295 -1997 -949 -891 -785 -526 -894 -1503 -959 -777
392 -777 -855 -2170 -3612 -1746 2359 1807 -3940 -5711 -189 3436 -692 -5941 -4417 3070 5270 -1837
408 -1837 -7721 -3323 4323 3001 -4409 -5627 322 4616 1201 -4302 -5243 142 3811 377 -3463
423 -3463 -2049 1426 2257 51 -1901 -1657 462 2355 827 -434 -440 104 877 1684 579 -1356 -349
440 -349 2611 2396 -524 -1179 941 3010 1827 -848 -819 2262 3626 232 -1421 1070 3984 1905
456 1905 -1109 -787 2621 3941 722 -2316 -158 4469 3956 -1164 -2794 1306 5114 3101 -1592 -3194
472 -3194 1752 5759 2599 -3135 -2837 2054 5690 2737 -2787 -4020 1230 5862 3362 -3821 -5188
487 -5188 930 6384 3187 -4127 -6257 543 8013 4080 -6255 -8175 883 9166 4377 -7254 -9598
502 -9598 1732 10816 3532 -10553 -10748 3897 12106 2209 -11543 -10623 4149 12004 1288 -12839
516 -12839 -9688 5879 11557 234 -12910 -9396 5363 11112 -871 -12793 -7970 5915 9808
529 9808 -946 -11393 -8565 4123 9832 851 -10031 -8870 3013 10355 2989 -10135 -10965 3023
543 3023 12840 4255 -12045 -12780 4570 15097 4090 -13961 -13250 6435 17063 2601 -16637
556 -16637 -12060 10137 17816 -903 -18355 -8721 13544 16147 -4896 -17626 -3356 15534 10885
569 10885 -8000 -12827 1683 12784 5963 -6854 -7095 3032 7771 2497 -3223 -2529 1062 3602
583 3602 3439 1907 -1711 -3074 1057 6408 5710 -3239 -8117 1474 12466 6254 -10290 -10819 7883
598 7883 17139 1101 -16488 -7539 15803 16426 -8047 -19401 1639 21612 8086 -17063 -14711
611 -14711 11684 20499 -1990 -20681 -5865 18755 14294 -12538 -18911 4943 20986 3964 -18216
624 -18216 -11703 12549 15884 -6492 -17716 -928 15228 5260 -12352 -9167 6496 7982 -3805
637 -3805 -7597 1511 4890 -3730 -6603 3174 7037 -5465 -12588 1260 15311 2892 -19050 -13678
651 -13678 14193 21388 -8117 -30297 -6823 29344 19757 -24491 -35076 8134 39909 8974
663 8974 -38667 -29632 24574 40398 -7281 -44354 -14341 35412 28630 -20965 -37143 754 33305
676 33305 13956 -22368 -22798 7347 20891 3343 -13782 -8986 3328 6638 3807 884 -4322
689 -4322 -9549 -3296 13484 15713 -7950 -25960 -4419 31249 23264 -23869 -39166 7031 48806
702 48806 17884 -42754 -40499 26719 56696 1468 -56678 -28015 44446 50372 -17297 -56281
714 -56281 -10245 50015 35609 -27827 -45634 4130 44494 19532 -27927 -29242 9750 29955
726 29955 9377 -17078 -15881 3075 13438 9898 738 -9530 -13288 1984 23117 15844 -19745
739 -19745 -32190 5312 42554 18660 -37776 -41400 20083 56388 8130 -55233 -36896 38064
751 38064 56839 -9041 -61853 -23083 49156 47519 -23924 -58245 -6742 51260 31446 -31999
763 -31999 -45226 5180 41888 15378 -28573 -28355 7838 25600 7308 -14899 -15748 -2408 9726
776 9726 12549 1863 -16162 -18906 4937 26288 10627 -26112 -30626 11097 39845 8858 -39877
789 -39877 -32987 23327 46308 -361 -49753 -27660 35070 45589 -12760 -52791 -15589 42843
801 42843 35568 -23966 -46052 -967 41274 20656 -26971 -31902 6422 29894 9538 -19098
813 -19098 -18279 3541 15990 8688 -6415 -12947 -5605 8769 14689 2376 -14647 -14682 8076 22990
827 22990 6872 -21646 -19976 12466 29753 4639 -27976 -20275 19517 33108 -1940 -33659
839 -33659 -14155 27666 28522 -11370 -31538 -4051 28582 19432 -15349 -23721 2882 22853 10157
852 10157 -12577 -14103 3394 15013 7282 -6994 -10082 93 9649 7532 -1647 -7650 -3693 5415
866 5415 9540 2225 -8304 -7592 4936 13150 3308 -12034 -10826 7245 16403 1263 -16579 -9566
880 -9566 11442 14854 -3728 -15569 -4351 12257 9888 -6055 -12173 -1080 9834 5924 -5531
893 -5531 -8414 -1142 6551 4208 -4233 -6896 -779 4718 2187 -3397 -4365 -991 1713 1412 -954 -2924
909 -2924 -2780 188 2248 1092 -3867 -4655 233 3969 425 -5198 -2918 2161 2730 -1762 -4049 -1397
925 -1397 1586 1356 -1046 -2079 -1334 -204 853 -183 -1305 -1506 203 1086 -301 -1856 -625 993
941 993 -58 -648 -255 14 -36 -248 589 1205 160 -914 -193 898 510 -380 -76 652 503 386 681
960 681 506 -400 -172 2055 2187 -571 -1393 1297 2813 1067 -1160 -514 2173 2028 177 -648 891
977 891 1082 693 1215 479 -792 395 2086 1579 -610 -620 960 2104 981 -426 -123 633 1334 929
995 929 267 -229 -227 993 1982 401 -1629 -492 2035 1708 -1100 -1210 733 1382 -187 -840 -198 557
1013 557 -36 -263 326 163 -1419 -1578 543 1301 -903 -1977 -342 1088 573 -1221 -2117 -912 1067
1030 1067 529 -1035 -2552 -1515 975 921 -1236 -3181 -1089 1685 593 -2211 -1961 101 498 -839
1046 -839 -1123 -615 -1116 -893 421 456 -1267 -2791 -1194 2031 1464 -2454 -3254 368 2940 872 -3226
1063 -3226 -3002 741 3044 849 -2920 -3123 1436 3843 1039 -3967 -3079 2328 4003 245 -4006 -1759
1079 -1759 2985 3037 -779 -2778 -755 2142 2660 579 -1539 -1625 912 2787 1484 -1685 -1903 749
1095 749 3770 1932 -2030 -2389 1769 3930 1952 -1842 -2290 1075 4036 2654 -1858 -2965 1190 4805
1111 4805 2337 -2965 -3423 2312 4798 1806 -3368 -2290 2396 4655 607 -2999 -1800 1990 3893
1126 3893 1524 -2932 -2963 2186 4323 575 -3398 -2016 2456 3908 -401 -3709 -1736 2484 2551 -840
1142 -840 -2683 -771 1232 1251 -95 -1963 -1520 775 1570 -256 -1925 -1677 -159 1334 150 -1630
1158 -1630 -2471 -547 1569 808 -1711 -3179 -636 2345 1396 -3009 -3758 297 3522 438 -4297 -2839
1174 -2839 1923 3118 -1391 -4669 -1692 3383 2093 -3005 -3804 247 2905 365 -3218 -2527 1518
1189 1518 2637 -873 -3053 -653 2206 855 -2338 -1767 993 1606 -592 -1951 -149 1688 111
1204 111 -1576 -291 2142 530 -1859 -1177 1668 1572 -1186 -2070 1062 3020 594 -2476 -1560 3078
1220 3078 2852 -1443 -3092 504 4128 1864 -2969 -2412 2788 4560 -282 -4298 -904 4809 3328
1235 3328 -2513 -3573 1617 5079 1401 -3429 -2179 3392 3992 -489 -3139 294 3572 2072 -1479
1250 -1479 -1721 1411 2625 354 -1365 16 1860 856 -1210 -149 1493 677 -1328 -788 1531 1671
1266 1671 -1203 -2634 204 3307 647 -3255 -2489 2514 3644 -936 -4212 -1100 3647 2896 -3255
1281 -3255 -4713 611 4442 764 -4433 -3637 2119 3443 -1134 -4639 -1564 3274 2227 -2811 -3560
1296 -3560 -55 2530 -1 -2834 -2175 900 1690 -1073 -2642 -627 1047 64 -2018 -865 945 153
1312 153 -1512 -1333 565 963 -672 -2363 -317 2011 726 -2712 -2057 1651 2289 -993 -3301 -802
1328 -802 3057 1985 -2334 -2923 1028 3470 584 -3246 -1822 2611 3275 -791 -3500 -115 3523 2067
1344 2067 -2874 -2368 2468 3382 -600 -3563 -175 3905 2290 -2647 -2813 2296 4518 -46 -3619 -166
1360 -166 3734 2685 -1803 -2656 1814 4308 1111 -3429 -1326 3879 3272 -1680 -2927 1235 4040 1042
1376 1042 -3067 -1163 3459 2802 -2405 -2648 2165 3641 -631 -3666 333 4413 1806 -3809 -2867 3351
1392 3351 4748 -1772 -5626 14 5918 2336 -4995 -4990 3245 6441 -920 -6744 -2340 6245 4972 -4632
1408 -4632 -6911 1469 6994 641 -7029 -3990 4597 4850 -3006 -6115 100 5245 893 -5001 -2276
1423 -2276 3139 2007 -2955 -3399 1598 2763 -1821 -4134 61 3858 -10 -5505 -3051 4084 4105 -3962
1439 -3962 -6424 500 6991 1515 -7781 -5793 5127 7559 -2698 -9577 -989 8367 4230 -6590
1453 -6590 -6856 3141 7441 -529 -7266 -2591 5873 4087 -3777 -4817 1632 4645 -7 -3576 -1236
1468 -1236 3336 1474 -2649 -1839 2819 2468 -2309 -2882 2670 4807 -799 -4774 -607 6322 3839 -4548
1484 -4548 -5461 3770 7816 -539 -7529 -1700 7544 5629 -4535 -6326 2248 8005 1970 -6227 -3377
1499 -3377 4680 5423 -1467 -4724 170 4803 1764 -2499 -2278 2211 3089 -736 -2146 984 2566 -380
1515 -380 -2550 598 3379 310 -3321 -1245 3962 2977 -3103 -4073 2244 5547 -296 -5751 -1923 4697
1531 4697 3262 -3260 -4921 1014 5010 1265 -4543 -3092 2704 3419 -1305 -4040 -799 2836 1581
1546 1581 -2313 -2599 939 2051 -690 -2694 -191 1565 -708 -2172 -649 1450 -228 -2712 -1448
1561 -1448 1868 1585 -2695 -2868 1126 2883 -966 -3880 -993 2706 1491 -2448 -3004 375 2436 78
1577 78 -2897 -1943 1786 1855 -1196 -2086 -399 1951 624 -1864 -1322 1021 1476 -892 -1999 512 2069
1594 2069 -322 -1755 111 1844 666 -1571 -796 1883 1760 -1114 -1692 1148 1954 8 -1721 205
1610 205 1996 1099 -894 -837 849 1392 511 -971 -30 1293 1170 -530 -803 699 1784 469 -1101
1627 -1101 -74 1717 1630 -898 -1232 1290 2363 -165 -1640 272 1848 676 -807 -644 1186 1078
1643 1078 -280 -868 454 990 -70 -256 -149 157 -107 352 336 23 -5 -176 28 9 -55 -26 -302 -130
1663 -130 44 341 -417 -776 -370 845 371 -1313 -1097 546 576 -669 -1736 -273 722 -137 -968 -696
1681 -696 -304 -122 -234 -89 -571 -1192 -714 266 120 -1194 -1355 319 738 -617 -1705 -765 951 458
1699 458 -489 -1138 -408 583 342 -1007 -1325 -204 230 654 -710 -1230 -396 975 77 -1112 -693 830
1717 830 281 -553 78 329 -156 -448 16 921 15 -1066 -153 1333 1145 -1227 -1114 840 1932 60
1735 60 -1300 -668 1206 1814 2 -1455 -180 1533 1546 -226 -1428 118 2061 1457 -755 -1368 700
1752 700 2174 352 -1078 -271 1245 823 18 35 432 340 25 527 872 144 -314 -10 1396 876 -774
1771 -774 -968 942 1652 314 -1029 -556 768 1083 21 -1195 -990 591 1791 -16 -1882 -902 1437
1788 1437 1613 -641 -1989 -247 1810 577 -1327 -1209 302 823 236 -546 -965 -749 375 480 -379
1805 -379 -954 -709 294 613 -657 -1618 -294 726 422 -1179 -960 -345 -250 3 31 -770 -886 -159 485
1824 485 -166 -1141 -999 116 717 -663 -1360 -846 517 569 -568 -1409 -968 144 1120 379 -1744 -1818 1100
1843 1100 1698 -525 -2238 -1052 1887 1465 -1331 -2009 178 2303 622 -2016 -1079 1046 1566 -253
1859 -253 -1070 -296 830 928 -183 -633 259 892 295 67 193 871 68 -155 75 1203 710 -1177 -381
1878 -381 1812 1878 -982 -2228 641 2892 664 -2270 -1593 2276 2660 -496 -2702 -95 2975 1513
1894 1513 -1629 -2181 957 2814 690 -1842 -1214 1735 1989 -422 -1853 115 2060 872 -1358 -687
1910 -687 799 1318 -645 -1467 605 1412 -197 -1829 53 1741 96 -2078 -664 1570 1086 -1560
1926 -1560 -2242 218 2170 414 -2591 -1745 1672 2091 -940 -3045 -729 2433 1494 -2241 -2714 615
1942 615 2816 198 -2949 -1149 1667 1486 -1564 -2395 173 2042 142 -2092 -1142 1206 843 -1362
1958 -1362 -1561 240 1157 -581 -1556 -441 760 117 -1060 -1285 949 1118 -855 -1935 -31 1696
1974 1696 282 -1683 -1529 995 1730 -756 -2378 -321 2501 1151 -1864 -1873 1425 2351 -172 -2367
1990 -2367 -759 2039 1566 -1221 -1572 664 1999 651 -1384 -766 1256 1892 -47 -1448 -291 1667
2006 1667 744 -826 -796 980 1269 -190 -596 148 1240 628 -315 277 934 614 -502 -532 825 816 -3
2025 -3 -797 153 1486 917 -610 -602 715 1135 56 -1283 -108 1601 1238 -716 -1479 173 1650 604
2043 604 -1631 -1540 1172 1720 -424 -1893 -811 1525 1055 -655 -1908 -203 1426 455 -1442 -1059 429
2060 429 1188 -344 -1043 -776 96 399 -224 -836 -514 262 -14 -339 -84 -86 -417 -290 74 248 -368 -1149
2080 -1149 -629 621 575 -1181 -1615 28 1417 379 -1637 -1897 712 1601 -66 -2331 -1527 1694 1830
2097 1830 -1268 -2555 -225 1893 1382 -1430 -2059 133 1880 559 -2155 -1208 862 1500 -20 -1203
2113 -1203 -334 892 686 -372 -437 196 649 -1 232 796 -309 -762 -167 1677 970 -719 -1268 242
2131 242 2033 789 -1642 -1689 1464 2694 -89 -2141 -683 2424 2279 -780 -2154 42 3000 1833
2147 1833 -1339 -1627 1106 2530 661 -1604 -1168 1428 1751 -145 -1280 -150 1458 423 -666 8
2163 8 278 110 -55 586 585 -266 -1056 -134 1317 432 -1024 -1686 1050 1821 -16 -1994 -1230 1347 1859
2182 1859 -741 -2363 -569 1855 1416 -1529 -1839 220 1617 586 -1882 -1332 741 1223 -519 -1669
2198 -1669 -405 839 117 -939 -513 175 86 -420 -440 -84 -67 -834 -307 532 359 -811 -1192 204 1047
2217 1047 -11 -1431 -1002 629 1063 -455 -1747 -652 1084 668 -1044 -1333 47 1221 289 -1336
2233 -1336 -806 883 675 -719 -975 424 903 -174 -593 73 718 314 -423 -135 934 734 -32 -459
2251 -459 496 956 149 -519 -6 739 515 -156 -438 439 881 272 -664 61 715 724 -20 -316 808 984
2271 984 -227 -634 471 1071 497 -1003 -220 1681 1010 -748 -1085 698 1516 561 -875 -439 857
2288 857 1277 -76 -1154 -382 966 1076 -322 -863 144 955 504 -467 -503 245 346 -2 -513 -25 -384
2307 -384 -166 -35 573 -34 -938 -674 649 929 -746 -1651 -117 1443 562 -1687 -1440 893 1457 -215
2325 -215 -1862 -956 924 971 -439 -1537 -675 802 724 -739 -1503 -746 409 616 -753 -1007 -448 217
2343 217 163 -405 -608 -600 -526 388 570 -505 -1390 -448 1398 935 -1036 -1784 138 1819 595 -1784 -1259
2362 -1259 738 1586 128 -1495 -978 646 1467 63 -1166 -724 651 1043 -141 -974 -374 661 748
2379 748 -176 -602 188 464 506 567 187 -196 -389 835 1341 -423 -1429 -225 1742 1238 -922 -1477 491
2398 491 2157 743 -1338 -837 707 1573 287 -842 -690 581 1627 121 -787 -163 641 1041 -103
2415 -103 -374 50 474 544 117 207 351 -73 -371 636 798 -600 -927 360 1508 315 -1655 -1104 923
2434 923 938 -678 -1647 -267 1111 529 -812 -1370 67 729 238 -874 -982 309 815 -205 -909 -536
2452 -536 538 190 -104 -260 392 -208 -640 -570 690 483 -1103 -940 684 1299 -762 -1661 -467 1294
2470 1294 585 -1432 -1706 341 1247 23 -1499 -889 775 918 -110 -1307 -724 654 1022 -232 -1108
2487 -1108 -431 653 190 -499 -486 264 269 -430 69 310 -217 -589 -38 1005 894 -1069 -1099 848 1844 19
2507 19 -1513 -440 1348 1360 -733 -1276 -245 1494 1231 -902 -1471 204 1739 1079 -918 -1116 794
2524 794 1681 505 -1321 -569 1061 937 -392 -452 206 755 105 190 395 -84 -475 309 1147 715 -523
2543 -523 -1098 810 1286 178 -1245 -416 939 1769 -145 -1131 -693 977 1398 -126 -1873 -524 1467
2560 1467 1284 -678 -1560 79 1859 580 -1488 -1093 802 934 -345 -1184 -186 250 336 -245 -314 -394
2578 -394 -75 -10 35 47 -476 -524 -162 678 -106 -861 -470 127 482 587 -914 -1309 351 984 25 -1513
2598 -1513 -831 1171 1353 -881 -1847 -248 1472 499 -1299 -1591 494 1572 -67 -1265 -556 293 486
2615 486 -205 -437 -558 269 236 -79 -130 -175 245 199 57 247 79 -399 -98 382 641 -476 -751 76 1112
2636 1112 402 -1198 -1196 883 1421 -196 -1240 -119 1260 1413 -528 -820 392 1310 1103 -410 -815
2653 -815 291 1187 834 -499 -485 682 1114 290 -411 261 662 508 -30 183 154 465 -68 260 651 167
2673 167 -783 -113 1173 583 -695 -1041 486 1322 359 -1152 -641 718 1117 -203 -1247 -565 991
2690 991 1057 160 -1195 -490 1023 922 -913 -1208 71 1014 60 -899 -796 229 531 -78 -187 -463 -348
2709 -348 -522 121 586 -141 -1141 -653 1054 887 -549 -1686 -247 1093 512 -1315 -1942 -2 1753
2726 1753 692 -1648 -1711 573 1817 721 -1799 -1786 787 1782 -25 -1909 -965 1383 1218 -394 -1406
2743 -1406 -443 650 886 -152 -850 -705 -31 640 651 -504 -1331 -337 1356 1515 -693 -1790 -36 1652
2761 1652 1624 -779 -2288 -489 2523 1790 -1398 -2657 92 3120 1832 -1891 -2541 1108 2887 756
2777 756 -2335 -1613 1384 2595 639 -1655 -1736 1095 2190 646 -1018 -1279 510 1839 1041 -641
2793 -641 -1542 -95 1716 1646 -276 -1892 -497 1762 1920 -449 -2646 -658 2721 2665 -1204 -3292 -112
2810 -112 2871 2391 -1643 -3335 94 3422 1942 -2097 -3223 668 2979 1266 -1837 -2693 387 3081
2826 3081 938 -2038 -2393 4 2112 1064 -1541 -2160 -141 1576 1182 -1367 -2032 -970 1808 1863
2842 1863 -682 -2608 -1237 1914 2181 -586 -3219 -1300 2005 2557 -1033 -3447 -1098 2473 2211 -1332
2858 -1332 -3227 -568 2611 2551 -1184 -3178 -611 2589 1844 -1651 -2856 -565 2400 1911 -1196 -2439
2874 -2439 -41 2479 1671 -1079 -2079 -872 1386 1330 -578 -1703 -835 784 1593 28 -1791 -1387
2890 -1387 1174 1959 289 -2033 -1574 1016 2446 474 -2355 -1406 1367 2800 491 -2474 -1638 1699
2906 1699 2583 46 -2399 -1130 1827 2337 -363 -2396 -817 1788 1865 -179 -1644 -550 1229 1288
2922 1288 42 -1012 -328 549 740 798 -493 -793 -313 1364 1858 -536 -1594 -566 2022 1900 -795
2939 -795 -2492 -640 2380 1824 -1429 -2620 -73 2435 1368 -1824 -2398 546 2706 637 -1910 -1499
2955 -1499 855 1787 -68 -1343 -837 38 905 400 -571 -197 -330 -32 1001 539 -993 -1702 308 1624
2973 1624 489 -1995 -2312 819 2527 631 -2708 -1936 1505 2720 -80 -3334 -1853 1782 2403 -977
2989 -977 -3088 -648 2223 1747 -1053 -2160 -366 1172 724 -673 -1238 -509 272 760 343 -482 -1240
3006 -1240 -417 1500 1133 -1053 -2091 -483 1993 1811 -1417 -2580 -124 3155 1663 -2130 -3012 795
3022 795 3397 1053 -2715 -2154 1594 3213 -116 -2621 -1078 1967 2007 -133 -1809 -592 1125 984
3038 984 -39 -875 -414 291 1164 968 -38 -1041 -607 1105 1726 -78 -2075 -597 1969 2314 -605
3055 -605 -2622 -650 2787 2222 -1501 -2829 394 2856 1427 -2171 -2209 1334 2793 477 -2172 -949
3071 -949 1502 1679 -330 -1272 -585 553 601 328 -452 -115 -261 191 849 -195 -635 -1125 169 1294
3089 1294 336 -1265 -1232 769 1846 185 -2387 -1581 1641 2029 -799 -2423 -531 1844 1025 -1427
3105 -1427 -1662 553 1720 -106 -1464 -576 626 572 -356 -824 65 -23 -281 -477 98 82 -144 -469 11
3124 11 1107 137 -1065 -803 1004 903 -385 -1574 -276 1411 846 -1286 -1334 679 1363 -153 -1491
3141 -1491 -387 1182 393 -899 -836 336 580 -410 -603 363 861 -434 -860 264 883 121 -797 -725
3159 -725 959 1246 -55 -1075 -444 1556 1357 -788 -1384 209 1564 368 -989 -736 1009 1211 -88
3176 -88 -1074 -164 1110 573 -654 -400 255 754 -66 55 427 37 -283 57 798 555 -757 -1300 366
3195 366 1308 230 -1184 -1334 768 1685 456 -1558 -952 1426 1901 -569 -1895 -507 1639 1251 -1335
3212 -1335 -1537 301 1615 415 -1065 -1021 512 930 317 -590 -481 -302 350 266 76 -567 -614 -25 622
3231 622 358 -1092 -1159 16 1309 376 -1352 -1405 182 1496 523 -1736 -1872 760 1888 -353 -2386
3248 -2386 -890 1260 1682 -973 -2200 -371 1556 944 -1208 -1708 62 965 807 -544 -757 -183 895
3265 895 535 -690 -387 101 300 208 24 -488 -343 -11 414 313 -479 -987 117 1414 648 -1433 -1683
3284 -1683 806 1997 254 -1850 -1020 1388 1746 -415 -1868 -510 1402 1278 -601 -1631 -162 1455
3300 1455 652 -713 -1334 539 1745 748 -786 -730 526 1035 -153 -552 -93 92 400 303 148 96 -572
3319 -572 99 752 797 -482 -904 381 1370 467 -1139 -987 615 1547 251 -1198 -1149 1241 1682 -291
3337 -291 -1468 -770 1663 1676 -782 -1612 -285 1618 885 -1441 -1522 865 1437 59 -1209 -718 775
3354 775 611 -193 -666 -384 144 26 -149 103 -42 -364 -226 489 140 -401 -814 -341 580 379 -826 -1268
3374 -1268 237 1621 198 -1400 -1119 1219 1783 -230 -2302 -819 1669 1580 -1078 -2221 144 1736
3390 1736 646 -1373 -1473 626 1351 285 -1312 -991 770 1026 -129 -858 -469 303 475 -153 -95 123
3408 123 -406 -478 187 741 -502 -1087 -226 1473 977 -1263 -1415 734 1921 388 -2236 -1477 1466 2066
3426 2066 -316 -2165 -614 1916 1872 -924 -2124 -265 2176 1616 -1207 -2014 569 2095 537 -1057
3442 -1057 -999 561 1359 332 -607 -334 236 336 348 351 -278 -571 -335 1133 1109 -540 -1667 -110 2308
3461 2308 958 -1355 -1943 501 2514 157 -1927 -1540 1564 2661 13 -2708 -1364 1918 2068 -773
3477 -773 -2764 -949 2048 1486 -1229 -2021 -101 1935 713 -1023 -1238 -233 387 452 -124 -846 -937 24
3495 24 654 581 -764 -1562 53 1720 998 -1306 -2223 32 2264 1175 -2096 -2484 406 2520 859
3512 859 -2247 -2391 1563 2645 -78 -2703 -1748 1610 2186 -318 -2242 -1256 1479 1666 -370 -1524
3528 -1524 -725 783 1117 312 -961 -910 212 1478 694 -876 -1228 13 1593 1057 -865 -1553 -289
3545 -289 1738 1189 -840 -2115 -57 2214 1440 -1273 -2182 553 2608 1173 -1980 -1979 761 2214 763
3562 763 -1605 -1689 651 2055 422 -1377 -1361 451 1846 465 -1195 -1443 299 1243 879 -568 -1317
3579 -1317 170 934 278 -471 -1264 -250 1024 1382 -144 -1364 -809 1482 1445 -494 -1960 -509 1638
3596 1638 1407 -523 -1882 -355 1512 1386 -846 -2109 -120 1416 1388 -797 -1796 -327 1404 1104
3612 1104 -510 -1573 -547 1254 650 -561 -1023 -361 694 499 -295 -965 -768 472 1082 19 -994
3629 -994 -1068 95 965 352 -1650 -1003 265 1374 432 -1324 -1262 565 1886 129 -1754 -1082 582
3646 582 1543 -128 -1522 -998 871 1447 -331 -1341 -629 524 530 -534 -706 -159 263 944 182 -567
3664 -567 -556 -244 491 700 -259 -909 -387 1009 826 -133 -1435 -772 1377 1133 -532 -1939 -524 1735
3682 1735 1438 -1040 -1135 376 1569 1015 -690 -1342 387 1492 310 -1168 -664 407 753 185 -567
3699 -567 -403 255 623 493 112 -296 -417 401 1062 446 -769 -1112 441 1466 599 -1210 -1077 811
3717 811 1846 397 -1488 -654 1112 1649 -211 -1776 -515 1499 1202 -872 -1574 41 1209 549
3733 549 -590 -935 66 773 153 -110 -396 -126 255 227 276 -150 -639 -650 462 633 -540 -1254 -403 1218
3753 1218 798 -1121 -1956 -410 1386 768 -1314 -1556 591 1410 271 -1498 -934 1183 1119 -299 -1513
3770 -1513 -304 558 363 -507 -731 -34 313 82 -79 -348 -512 -302 -255 300 -121 -917 -581 396 766 142
3790 142 -1084 -392 825 1107 -417 -1018 -79 1417 785 -731 -1159 10 1204 426 -632 -834 427
3807 427 968 -32 -773 -267 700 669 -170 -98 39 43 -218 375 438 -81 -332 198 444 360 -520 -816 463
3828 463 652 78 -870 -84 394 1010 -45 -594 -163 712 596 -633 -444 307 777 156 -647 -453 390
3847 390 180 16 -269 -28 330 -221 -161 128 -12 -204 -185 69 293 -188 -651 -186 370 218 -623 -533 249
3868 249 664 -51 -676 -66 421 291 -152 -458 -4 308 201 -443 -557 -43 204 -450 -151 -98 42 -431
3888 -431 -581 -288 310 91 -632 -142 448 -5 -414 -646 166 533 -230 -395 -185 552 -8 -282 -648 78
3908 78 318 102 -515 -348 448 233 -296 -401 2 583 26 -342 -268 568 96 -348 -181 467 483 -126 -866
3929 -866 154 903 154 -611 -325 590 562 -144 -719 44 440 263 -148 112 450 389 96 -129 531 259
3949 259 149 -93 -185 308 139 60 -213 187 155 -175 -383 -207 683 319 -773 -663 488 946 238 -660
3969 -660 -37 861 578 -451 -272 285 639 144 -583 -192 288 115 -136 -343 -55 393 565 -115 -288 45
3989 45 148 33 -197 -540 -132 -176 -283 -162 323 -23 -138 -9 378 340 -418 -372 -86 272 12 -366 -128
4010 -128 241 123 -614 -428 59 176 453 -121 -651 -97 284 190 -425 -442 -171 725 378 -240 -540 88 332
4031 332 133 -473 -69 256 493 -271 -658 53 272 207 -71 -533 53 359 60 -66 -292 20 241 500
4051 500 -106 -103 99 -156 188 79 153 -99 -214 407 328 -110 -556 -68 438 481 -395 -636 147 879 247 -512
4073 -512 -461 160 733 116 -431 -382 496 738 -167 -905 -366 1015 755 -161 -885 -1 775 322 -567 -283
4093 -283 513 882 -108 -263 260 164 351 179 53 -69 -150 -157 258 236 -153 -325 -209 821 352 -749 -323
4114 -323 146 942 274 -663 -667 323 1089 221 -1087 -886 809 1080 -281 -1182 -363 1199 492 -613 -1165
4133 -1165 -36 861 341 -571 -705 382 322 54 -239 -426 -24 160 -15 -461 -532 -207 482 152 -127 -309
4153 -309 -722 -58 249 313 -390 -782 57 1096 358 -1171 -989 473 1232 -287 -1087 -318 813 1168 -366
4172 -366 -1172 -449 915 844 -495 -1278 -53 716 916 -476 -1130 -22 939 505 -166 -453 68 397 439
4191 439 132 -321 -34 179 419 398 -288 -592 260 1153 521 -874 -772 526 1163 424 -845 -703 438
4210 438 1193 395 -1180 -720 507 1251 420 -1021 -813 915 1069 83 -1105 -457 942 969 -215 -1165
4228 -1165 -393 700 590 -19 -531 -245 256 661 473 -468 -403 102 677 234 -506 -710 27 739 290 -324
4248 -324 -1045 32 697 780 -697 -1286 155 1170 839 -967 -1220 97 1166 116 -1181 -1002 592
4265 592 812 119 -697 -676 220 961 413 -1099 -633 338 640 -50 -467 -577 187 537 220 -587 -595 -108 269
4286 269 295 308 -816 -597 386 918 -220 -1088 -404 784 1021 -342 -1304 -267 1192 925 -724 -1341
4304 -1341 -112 1125 656 -643 -567 453 872 677 -556 -704 -176 560 426 -453 -523 -30 591 550 -227
4323 -227 -620 -165 508 958 265 -481 -682 329 1056 239 -763 -799 615 1329 -3 -831 -568 858 1290
4342 1290 -188 -981 -280 803 1026 -587 -797 -30 860 983 -78 -549 25 879 532 -60 -446 -438 357
4361 357 517 178 -59 -729 -122 412 446 -526 -774 192 708 539 -643 -1160 229 1018 526 -1104 -1091 442
4381 442 1202 253 -795 -592 836 764 111 -791 -922 398 694 62 -1002 -395 328 279 37 -542 -455 -148
4401 -148 262 373 -136 -934 -486 316 505 -589 -1236 -630 724 730 -371 -905 -462 868 578 -617 -1399
4420 -1399 -14 1077 453 -837 -1021 -43 1277 318 -761 -698 146 734 18 -275 -436 180 248 424 -209
4439 -209 -384 -150 265 327 121 -575 -410 344 596 328 -707 -783 493 891 190 -1004 -389 654 1022
4458 1022 32 -929 -316 632 948 -115 -1170 91 1244 787 -422 -538 -195 990 766 -155 -781 -386
4476 -386 555 438 199 -424 -505 555 562 28 -424 -359 606 672 294 -621 -363 339 611 404 -687 -673 354
4497 354 883 210 -800 -551 401 935 150 -851 -604 417 789 -12 -800 -310 398 787 280 -734 -463
4516 -463 516 554 -401 -487 -594 245 450 -181 -404 -412 73 453 116 -515 -525 190 314 -80 -389 -750 148 339
4538 339 402 -447 -422 -67 372 345 -771 -838 -142 606 1 -528 -806 -62 653 108 -498 -511 441 578 187
4559 187 -643 -643 10 658 102 -657 -292 235 821 11 -782 -278 187 861 156 -501 -382 402 559 -119 -37
4580 -37 -624 -115 383 499 27 -148 66 467 533 -138 -474 -139 407 504 -188 -1087 -260 636 484 -435 -523
4601 -523 -52 753 625 -444 -1060 418 957 420 -374 -568 296 632 147 -661 -369 210 183 64 -405 -508
4621 -508 -70 -126 208 -111 -22 61 435 243 161 -203 -196 377 201 -124 -506 -179 454 411 -200 -618 -146 465
4643 465 583 -233 -945 -19 748 494 -646 -634 172 572 239 -571 -343 73 659 -70 -465 -265 308 87
4663 87 -235 30 -204 -83 67 -237 -126 -423 -179 41 -98 264 -167 -75 259 311 50 -526 -283 453 403
4684 403 -197 -577 -45 352 307 -286 -438 -159 523 297 -187 -643 211 288 -79 -309 -385 265 347 -55 -224
4705 -224 -194 304 612 -32 -239 -154 183 103 -144 142 87 -188 149 -59 -176 -150 -155 271 231 52 -183 96 218
4728 218 43 48 -337 -258 415 123 -17 -159 73 160 210 -147 -314 6 261 331 -311 -136 191 370 60 -152
4750 -152 -500 52 314 -16 -300 -175 118 291 302 -108 36 92 164 -11 -86 46 9 185 52 -24 149 -18
4772 -18 -240 -360 85 -37 -65 -97 -60 276 -356 -272 -221 -55 -216 -200 -307 51 -1 335 -333 -151 -167 142 -48
4795 -48 -423 -186 176 110 -136 -110 4 244 -92 -419 80 170 93 -64 -33 245 -81 -482 -316 155 -54 124
4817 124 -91 -234 64 287 -205 -459 479 66 -47 -353 -131 -109 51 274 -353 -12 299 594 -205 -312
4837 -312 -42 492 -32 -202 -105 129 51 -114 -118 133 168 284 104 204 73 -115 3 259 498 30 -153 -38
4859 -38 135 333 128 -228 -101 340 623 -249 -13 159 683 488 -245 -470 -130 603 -96 -181 -112 267 226
4880 226 -89 -96 186 -172 441 -115 -173 -164 348 3 20 -230 -88 276 -178 290 18 -120 25 -6 315 159
4902 159 -166 -70 -105 514 -49 -489 47 139 179 -161 -394 -41 -11 56 -173 -270 229 311 73 -218 -506 -66 257
4925 257 -85 -182 -546 -76 124 147 -248 -276 135 128 -46 177 -264 22 -233 284 -243 -219 -271 -6 439 -62
4947 -62 -632 -191 466 369 56 -473 -251 161 390 -205 -448 -30 313 310 -106 -496 136 644 210 -290 -123
4968 -123 -56 370 284 -27 -207 242 352 219 121 -212 -215 79 225 194 -158 -273 146 528 80 -403 -292 113
4990 113 409 -24 -266 88 417 447 181 -326 -203 601 378 87 -731 253 583 13 -89 -374 48 51 -62
5011 -62 -350 172 -123 268 52 213 -127 -549 -132 -154 102 -277 -272 -71 21 449 62 -572 69 131 110 -482
5033 -482 -237 96 426 260 -422 -258 66 185 -68 -452 -210 281 206 -221 -431 220 175 11 -333 -176 95
5054 95 97 -251 -113 -16 -164 -63 110 89 -50 -349 -158 -217 172 -117 -367 -424 90 241 -345 -538 -226 590
5076 590 455 -475 -237 92 525 34 -659 -300 162 224 -130 -564 -142 264 75 -345 -253 169 16 40 42 23
5098 23 312 233 -128 189 161 37 -52 -63 172 313 -226 -351 114 354 82 -689 -663 349 444 165 -666 -67
5120 -67 528 281 -379 -217 195 579 -109 -595 35 157 72 -127 -53 117 262 45 -192 -108 278 136 211 -28
5142 -28 280 96 75 -169 409 467 -81 -395 -253 203 482 -186 -363 11 531 -53 -566 -291 43 388 -47
5163 -47 -589 118 512 325 7 -288 -19 0 179 -25 -269 126 368 -235 -366 16 8 9 20 -299 243 -236
5185 -236 -185 323 -164 -239 44 -179 -60 146 16 -414 -313 124 355 -535 -103 66 244 -181 -357 -22 -131
5206 -131 473 -17 -489 -128 175 233 111 -389 -142 368 272 26 -24 -47 43 -156 -60 -274 128 110 158 120 -125
5229 -125 273 56 -113 -357 132 315 -7 206 -12 -100 67 228 137 330 51 -146 -109 279 378 238 -112
5250 -112 -122 142 373 -94 -386 -63 359 207 -217 -151 98 538 271 -268 -225 119 411 -56 -749 -215 172
5271 172 341 -169 -238 -82 406 1 -387 144 202 -104 -76 -171 -11 5 -255 -41 64 120 -113 -113 90 325 176
5294 176 -502 -498 243 311 -236 -400 -4 383 126 -123 -303 -115 522 268 -609 -114 147 121 -118 -429 -99
5315 -99 269 342 -187 107 223 -17 287 -190 -73 109 247 -102 -21 136 313 -234 -488 -15 192 -291 -304
5336 -304 -58 249 320 -507 -350 359 588 -135 -316 94 273 212 -17 -240 -126 416 -13 -352 -207 324 312
5357 312 131 -559 109 170 151 6 -21 81 21 -145 -442 13 185 144 -74 -109 386 96 121 -88 -60 154 -67
5380 -67 -320 267 182 67 -282 -111 138 123 -90 43 -346 59 348 -155 3 -139 451 48 -126 339 92
5401 92 102 70 73 -5 266 209 8 -179 28 78 66 80 -173 108 -216 147 145 -267 34 114 -219 132 123 -192 -128
5426 -128 64 -82 -119 -118 86 155 -93 -291 -29 106 -65 51 -394 -121 -43 11 25 -179 52 157 -84 12 -231
5449 -231 -51 -123 -96 -160 -22 -20 123 183 -147 -164 -395 165 -33 20 44 342 -130 -254 -342 -118 92 116 228 53
5473 53 -40 134 210 -24 62 -224 203 -42 -59 311 336 108 -334 -309 -248 96 -3 245 182 64 139 -1 -39 -70
5497 -70 180 -169 1 -80 -93 -16 -47 -310 7 345 316 -43 -28 164 50 -125 51 101 163 -119 -131 189 138 -191
5521 -191 -89 -184 101 191 81 -118 136 105 33 -147 -5 261 5 -299 -77 164 185 -45 -63 -319 385 -179
5543 -179 -89 -98 -176 200 32 52 -65 248 306 -140 -315 -113 -60 -35 -209 -192 401 -238 -81 -237 -198 71 180
5566 180 35 -178 127 279 161 -42 -52 66 -5 -115 -122 -177 29 -319 -135 106 142 -77 -470 -138 -54 -14 -204
5589 -204 -235 36 329 156 -265 20 -94 103 -217 -187 0 37 -263 140 77 -401 220 -74 0 -160 219 -23
5611 -23 -33 20 -184 171 119 238 205 425 -56 87 67 161 173 -200 232 400 425 -330 67 277 468 162 173
5634 173 175 288 218 248 66 143 292 238 -86 -263 -26 210 165 -41 124 403 10 57 -222 278 430 -49 -186
5657 -186 254 104 -24 -445 -102 464 96 -250 45 157 327 -106 -307 29 278 -54 -402 -148 134 101
5677 101 -55 -370 78 3 210 -180 -314 174 13 269 -275 -316 270 -36 -134 -365 35 -7 27 -380 -48 383
5699 383 -250 -220 2 372 362 -52 -247 -87 262 233 -71 -283 133 211 35 -227 -105 -120 176 -216 -321 116
5721 116 202 -14 -441 -374 211 -222 -213 -6 166 505 -136 -425 21 104 19 -317 -145 321 127 -171 -281 263
5743 263 389 398 -264 -63 249 290 -233 -264 -377 264 442 -121 -376 154 522 141 -257 -85 421 96 -371
5764 -371 -464 108 97 -278 11 140 14 -165 -39 28 111 64 -76 -92 344 419 188 -339 -155 184 578 -142
5786 -142 -474 58 224 205 -482 -209 330 516 36 -357 -93 266 349 -219 -69 -64 232 32 -378 -231 -134 165
5808 165 -249 -160 94 84 91 -8 -110 -25 169 -111 -217 144 -56 -92 -241 -112 272 273 -722 -343 424 127 -237
5831 -237 -325 -29 312 -134 -284 -224 59 396 -101 -378 -315 361 97 12 -270 169 244 415 -259 -150 110 337
5853 337 -65 -84 -470 70 275 -417 -113 217 92 -316 203 428 312 -212 -16 119 177 -138 -656 -293 156
5874 156 641 113 -377 120 336 294 -199 -237 77 335 393 -529 -100 236 176 197 -367 -355 5 306 216 -24
5896 -24 293 237 312 187 -185 84 52 -20 141 38 253 125 71 -57 321 -31 -55 -140 21 182 4 0 246
5919 246 246 108 -359 -691 186 323 -52 -352 76 539 26 -131 -560 -15 228 193 -239 -242 159 192 -198 -442
5941 -442 -430 271 102 -352 -95 30 101 -19 147 210 10 491 -197 -66 -104 -114 -83 -320 161 124 179 -89 78
5964 78 306 87 -164 -242 -44 237 -130 -319 -222 -54 527 -62 -337 -142 184 452 -222 -170 -125 535 -360 -216
5986 -216 -146 149 246 -231 -408 273 -13 64 -189 -7 349 -36 -117 -147 505 -25 -276 19 1 310 -192 -131
6008 -131 -136 177 294 -172 -147 21 254 -112 -319 22 548 432 -377 -234 -37 273 244 -358 -295 16 360 38
6030 38 -35 -193 -191 29 -184 -95 130 -41 390 94 -175 163 -104 -7 29 132 129 -44 -165 293 86 225 -374
6053 -374 36 159 384 -77 -479 -13 176 315 -298 -127 104 269 -382 -485 -222 283 321 132 -94 -97 176
6074 176 -164 95 -171 -49 124 3 175 -148 95 -1 125 -21 -33 -60 -339 -126 198 -83 -63 -99 39 263
6096 263 -26 63 1 -86 138 -65 -192 -71 -107 -59 -111 -338 215 119 251 -211 -300 -10 -176 -199 -26 -195 -165
6119 -165 95 -47 -192 -336 -55 34 75 -175 137 -49 -7 -20 -323 170 57 -83 -82 -123 -277 292 318 118 114
6142 114 -20 18 294 167 -44 -163 206 299 373 -48 -169 256 160 146 30 73 -34 193 94 -12 214 36
6164 36 244 257 228 -171 48 103 319 -30 -134 53 -32 -243 -140 -136 -90 264 -156 111 -359 -305 275 174 -87
6187 -87 87 159 236 62 -96 -155 -237 331 203 207 -236 -250 82 180 135 37 0 -188 -70 13 -97 -259 -133 520
6211 520 -89 -195 -31 276 300 -237 -252 -354 98 2 61 -359 18 27 -87 -258 -466 58 -44 58 28 -238
6233 -238 -234 80 29 116 -146 -159 112 -16 -2 -439 -20 30 48 54 -197 -155 53 111 119 -326 -190 -168 358 128 -143
6258 -143 -151 -55 145 325 67 -216 236 68 299 23 -14 185 256 -110 -79 -232 368 87 67 -8 54 354 101
6281 101 145 -196 -361 -5 240 -58 -417 -94 -165 229 176 -43 -225 145 136 95 -300 -25 263 259 76 -231 41
6304 41 210 149 39 49 89 -158 67 18 -141 -166 247 159 169 12 158 192 82 -135 -58 -183 -88 151 -10 -345
6328 -345 -375 31 419 260 23 -320 -141 79 45 66 -397 282 432 -293 -251 76 -11 190 211 -6 15 45 188
6351 188 67 -95 -275 -28 -104 -17 187 159 115 119 159 -20 -207 27 -114 -170 -318 16 -131 -177 221 90 -78
6374 -78 165 233 289 -216 -191 -216 39 -53 -198 9 188 40 -48 -88 -263 -132 78 374 34 -56 164 416 64
6397 64 -65 34 -132 -173 -170 187 -143 -104 110 133 254 -81 -173 82 307 130 4 -51 -107 287 30 -88 38
6420 38 83 19 41 -264 18 330 -32 -184 -92 75 143 -307 85 234 45 242 -64 298 124 116 -293 109 -140
6443 -140 186 -283 -228 -14 1 68 -296 -371 -93 166 -122 210 -40 111 142 -84 -312 -288 89 293 -69 2
6465 2 -53 -6 -15 -103 -78 435 381 -328 25 244 -4 -198 -98 60 235 37 -93 126 203 14 -117 -354 42
6488 42 194 -40 -359 -408 217 225 -61 19 -32 180 22 -36 -87 -25 172 -27 -161 -49 -107 232 -221 -281 227 -24
6512 -24 -307 -76 258 316 85 84 21 -159 296 288 -91 18 129 270 -352 -278 -33 163 -59 -230 99 92 278
6535 278 10 -56 -94 370 284 -75 171 -69 -161 -87 174 230 104 -106 30 -157 163 -33 70 -195 -11 187
6557 187 -64 217 -84 391 33 -349 -10 171 201 131 34 -211 448 221 -348 -128 331 133 184 -431 210
6578 210 241 148 4 -261 -11 221 -85 -143 -47 327 18 131 -96 -1 96 52 -147 116 212 232 -144 -239 -5
6601 -5 -97 -51 -447 98 95 107 -25 92 -274 32 4 -171 -263 161 70 -251 -278 28 60 58 -255 -75 221 204 -97
6626 -97 -241 -146 -90 170 -161 -266 104 246 45 -290 -91 291 87 74 -81 166 -160 -161 272 249 -34 97
6648 97 56 -61 -39 10 318 -7 251 230 -129 -339 68 37 127 44 -355 68 299 540 -170 -37 405 316 -57
6671 -57 -70 -3 410 -108 -14 -349 271 251 -216 -157 410 135 -137 178 59 -171 -13 -124 -322 -210 295 256
6693 256 -63 -394 154 180 -102 33 93 466 143 -239 -139 -69 -56 -50 -326 43 209 330 -82 -5 -40 -86 -273
6716 -273 29 -5 228 81 -326 48 -233 114 8 -134 88 45 5 -256 175 -14 -97 97 -25 28 -229 64
6738 64 -133 -72 -105 60 -364 -218 40 -110 -146 -149 -31 54 -125 -22 -208 134 94 27 137 -139 -87 -117 -109 -92 15
6763 15 41 -39 55 -277 -66 105 -190 42 -49 -253 -164 -197 -130 -150 -62 -45 -114 164 -83 -64 37 165 82 -85 -386
6788 -386 -332 -162 168 107 -282 13 -43 -104 160 -380 -5 406 247 -221 -42 133 64 27 95 -103 227 90
6810 90 18 102 34 6 -34 149 -129 24 86 244 218 -262 -66 68 25 301 -121 -138 -145 15 343 16 66 81 -94
6835 -94 -46 109 49 -38 152 204 -247 -149 123 -246 148 -87 -19 79 234 -59 -305 15 143 -114 252 39 -83
6858 -83 188 -38 401 -245 -61 -12 -61 -61 78 -163 -291 -11 19 -48 -377 -266 284 -67 -43 -154 -101 169 142
6881 142 20 -230 292 182 133 -105 -168 -101 46 -162 -50 -56 0 36 -240 -139 58 245 158 307 -314 55 -39
6904 -39 189 28 -259 -198 -242 314 82 3 74 100 194 260 -52 -343 -167 42 85 -110 -147 95 53 57 123 237 154
6929 154 13 19 75 -108 -100 79 44 -258 -91 -109 -2 -18 33 -90 -39 178 -42 141 -57 -139 -91 60 -59 113
6953 113 -208 -231 210 267 -93 -294 44 60 107 -131 -137 16 148 98 159 125 75 216 -28 -79 -194 78 95 188
6977 188 120 -111 259 -203 6 -60 7 152 -80 175 -87 -66 -37 132 -10 -158 158 -268 183 54 -158 -130
6999 -130 -39 127 171 -189 -329 -350 -40 272 29 -68 -380 182 314 -425 -61 -66 101 156 -80 -443 72 -88
7021 -88 237 -140 -111 24 -199 -99 -34 -69 -170 154 294 -309 28 -162 229 84 100 117 -280 -148 -62 280
7043 280 228 58 16 71 -38 187 -160 -140 381 118 -77 -344 49 366 -16 -181 -223 280 161 -90 -249 -222
7065 -222 -268 266 2 15 81 0 191 -233 23 1 234 17 81 136 204 -72 387 167 -302 -91 -242 48 128
7088 128 -180 -330 18 70 372 -162 -599 333 165 -74 -200 -418 -52 220 1 -386 -339 -19 -61 169 -429
7109 -429 -173 168 56 -56 -268 119 -249 229 25 -213 -19 92 370 11 98 -215 -168 -41 -154 139 -409
7130 -409 -175 235 49 120 127 160 209 -222 -274 -82 -136 87 209 -27 -266 -89 -33 -76 -161 146 -58 -71 -76 -371
7154 -371 -250 265 -59 -128 50 -141 293 165 67 -155 59 16 113 99 -311 -229 25 2 247 -97 -117 225 81
7177 81 -320 -195 47 140 2 -17 -112 128 118 -26 -116 -114 -38 201 9 143 -249 -313 186 296 337 183 -41 98
7201 98 267 235 -195 -16 265 -135 21 -227 -5 262 -80 -108 -420 -57 470 219 154 -227 -157 106 -55 -165
7223 -165 -89 -124 25 208 129 -109 -70 -164 67 9 20 -183 -173 40 -315 -157 252 -278 153 198 298 34 24
7246 24 97 97 -145 82 -210 -191 255 -239 143 -21 132 14 -143 -327 -285 303 -72 -113 -107 174 311 -367 -86
7269 -86 24 -48 -292 32 33 -41 178 134 147 60 -50 -320 32 -109 -39 -192 -205 -73 85 40 -209 28 -102 83
7293 83 -14 -118 198 96 201 -30 -120 31 41 -27 -180 -389 -23 165 -3 -402 -353 2 -88 56 213 -5
7315 -5 -386 -246 213 102 191 -150 74 147 67 -245 23 -100 219 228 -150 153 56 314 133 -237 -129 188 335
7338 335 -22 -179 -162 20 290 -7 -338 -340 63 206 -346 -194 -201 -18 71 201 -141 -252 -342 245 -21 15 -171
7361 -171 -170 382 199 -200 -406 -377 323 385 162 -248 -21 163 174 -176 -281 157 52 235 -187 -261 135 160
7383 160 63 48 -110 207 178 1 -126 -332 -174 279 434 -168 -334 -20 43 125 -76 -446 -173 11 216 3
7405 3 -315 -303 320 2 -150 -242 -210 160 -42 -102 -814 -12 2 116 -39 -211 11 65 -72 -288 93 -73 273
7428 273 -44 37 -360 -66 187 249 -89 -285 6 76 162 -2 -458 -246 90 470 -161 -264 -190 54 174 21
7450 21 59 -65 205 330 -33 -87 45 214 330 142 -393 73 249 369 -16 -175 29 338 28 152 -493
7471 -493 -127 42 386 20 -135 -139 123 107 -51 -145 -242 29 -132 51 -112 -4 -30 163 92 -297 -233 -59 27
7494 27 -193 -75 -151 -177 -24 101 -256 -96 -318 -115 342 -258 42 -77 68 136 196 -131 -34 -165 5 -24
7516 -24 -483 111 83 -125 92 -73 -101 89 300 12 20 -107 199 439 -259 -150 -183 40 393 269 41 -111
7538 -111 212 161 74 -295 -215 67 322 -307 107 -337 -173 43 -60 -184 145 -177 159 -141 54 -107 -160
7559 -160 -140 110 -213 23 12 -233 -28 131 -130 -3 133 217 -267 82 -103 -118 65 -136 -241 -163 207 371
7581 371 31 -252 52 90 126 149 -6 289 190 132 -212 -171 200 -175 -72 91 22 96 154 -135 -261 -331 -249 228
7605 228 181 11 -103 94 -171 115 264 -267 -70 176 140 -190 -249 -24 2 -22 9 -33 156 82 353 -131 -109
7628 -109 226 101 -1 -27 -205 -114 454 -61 73 -111 71 183 121 31 -3 71 -288 35 -95 234 -99 154
7650 154 45 212 -220 -40 -11 -112 87 -86 -128 170 43 146 -66 -165 123 -297 170 135 106 -154 -62 -218
7672 -218 -61 -27 114 17 43 -197 -231 -127 -80 78 -32 -218 163 140 -63 290 259 -55 -58 -151 -147 -237 -104 136
7696 136 81 60 -277 -289 -69 63 192 -272 -9 -40 89 5 -513 -156 156 423 -249 76 -227 106 163 -92
7718 -92 -151 -40 251 216 91 16 117 205 -44 231 -42 -73 187 278 238 -228 -340 209 167 217 75 -106 -35 173
7742 173 -148 -242 -476 99 138 -148 -117 3 54 484 -15 -322 -400 212 295 10 64 -226 -150 -63 -75 -390 -325 103
7766 103 141 105 -69 -179 332 367 200 -380 -49 52 327 102 -234 -71 35 387 250 -277 -315 1 448
7787 448 34 15 -385 159 586 56 -169 -191 168 81 9 -167 -344 313 516 64 -158 -338 8 17 -34 -102 -63
7810 -63 135 292 88 -190 -532 -24 48 80 -86 -74 128 17 -77 -43 -344 50 255 145 -87 -229 125 118 -81
7833 -81 145 -123 105 421 275 -306 -101 211 223 452 -205 -190 122 398 -240 167 -227 45 265 89 68
7854 68 -84 294 559 42 -358 -228 266 553 76 -291 -17 300 78 23 -115 -44 160 337 -101 -334 -307
7875 -307 -1 286 68 -178 -293 -25 539 -48 -392 -133 299 146 -240 -184 -695 178 247 83 -189 -168 -6
7896 -6 -2 228 -470 -237 -67 294 86 -536 -130 121 390 204 -379 -561 307 306 -100 -273 -194 328 696 -116
7918 -116 -193 -51 132 407 -79 -190 -88 92 191 159 -147 -362 -77 312 176 -100 -244 -10 231 64 -56
7939 -56 -364 -232 208 185 -272 -619 -82 344 135 -452 -164 25 206 352 -37 -256 27 415 -3 -58 -96
7960 -96 229 91 358 -37 -148 8 128 -36 43 -17 119 281 458 -24 -176 116 221 316 -175 -57 -298
7981 -298 169 311 -260 -88 46 474 539 -214 -490 -1 282 189 -63 -252 160 285 207 -376 -57 22 315
8002 315 242 -32 -298 79 201 386 -231 -410 -1 274 168 135 -51 -69 107 123 207 -258 -132 -6 296 -6
8024 -6 -518 -359 -51 162 -27 -639 -429 6 387 -14 -491 -117 341 90 256 -217 -62 15 -10 181 -116
8045 -116 -167 155 250 -65 -47 -345 -106 385 36 -16 -377 -242 182 -390 -278 -246 57 337 192 -37 -128 120
8067 120 528 111 -318 -153 176 120 -61 -407 -275 219 361 114 -240 -47 -124 124 245 -9 -161 -46 380
8088 380 96 -132 -121 -24 407 73 -250 -271 129 428 278 -153 -22 169 167 161 -228 -255 172 166 -32 -326 -452
8111 -452 -117 131 -112 -88 -217 -174 213 118 -87 -376 138 449 193 -149 -268 -73 241 73 -146 -183 150
8132 150 91 273 -140 -279 -31 63 -54 37 214 -168 -80 -162 -521 -66 28 255 362 -89 -230 5 294 177
8154 177 -23 -123 -152 273 100 -291 -290 -264 407 430 -285 -525 -24 334 -86 6 -394 -239 -116 22 -25 -205
8176 -205 433 38 169 -225 -253 -97 118 251 -153 -125 9 210 158 -160 -327
8191c27
##END NTUPLES=NMR FID
##END=
