##TITLE=1H_Pr C5-Eth
 CDCl3
 8 sc, 
 16.12.2021
##JCAMPDX= 6.0         $$ Bruker NMR JCAMP-DX V2.0
##DATA TYPE= NMR FID
##DATA CLASS= NTUPLES
##ORIGIN= UXNMR, Bruker Analytische Messtechnik GmbH
##OWNER= root
$$ XWIN-NMR		Version 3.5
$$ Thu Dec 16 13:56:18 2021 Russian Standard Time (UT+4h)  she@DPX200
##.OBSERVE FREQUENCY= 200.131346
##.OBSERVE NUCLEUS= ^1H
##.DELAY= (6, 6)
##.ACQUISITION MODE= SIMULTANEOUS
##.ACQUISITION SCHEME= undefined
##.AVERAGES= 8
##.DIGITISER RES= 18
##SPECTROMETER/DATA SYSTEM= spect
##.PULSE SEQUENCE= zg30
##.SOLVENT NAME= CDCl3
##.SHIFT REFERENCE= (INTERNAL, CDCl3, 0, 15.7039)
##AUDIT TRAIL= $$ (NUMBER, WHEN, WHO, WHERE, WHAT)
$$ ##TITLE= Audit trail, XWIN-NMR		Version 3.5
$$ ##JCAMPDX= 5.01
$$ ##ORIGIN= Bruker BioSpin GmbH
$$ ##OWNER= she
$$ F:/spectra/data/she/nmr/H-F/1/audita.txt
$$ ##AUDIT TRAIL=  $$ (NUMBER, WHEN, WHO, WHERE, WHAT)
(   1,<2021-12-16 13:55:05.90 +0400>,<she>,<DPX200>,
      <created by zg, POWCHK disabled, PULCHK disabled
       configuration hash MD5:
       00 E9 B6 7A A2 85 ED C7 34 08 36 98 17 FE 4E 26
       data hash MD5: 16K
       27 BA 9D 12 7E 27 97 F8 B6 29 33 4F 2F 01 BC BF>)
$$ ##END=
$$ 
$$ hash MD5
$$ D2 CC BE CA 83 5E C6 CC CA 87 7C 48 63 CC 74 3E
##$RELAX= 
##$RELAX= 
##$RELAX= 
##$RELAX= 
##$RELAX= 
##$RELAX= 
$$ Bruker specific parameters
$$ --------------------------
##$DU= <F:/spectra>
##$EXPNO= 1
##$NAME= <H-F>
##$PROCNO= 1
##$TYPE= <nmr>
##$USER= <she>
##$AMP= (0..31)
100 100 100 100 100 100 100 100 100 100 100 100 100 100 100 100 100 100 
100 100 100 100 100 100 100 100 100 100 100 100 100 100 
##$AQSEQ= 0
##$AQ_mod= 1
##$AUNM= <au_zg>
##$AUTOPOS= <>
##$BF1= 200.13
##$BF2= 200.13
##$BF3= 200.13
##$BF4= 200.13
##$BF5= 200.13
##$BF6= 200.13
##$BF7= 200.13
##$BF8= 200.13
##$BYTORDA= 1
##$CFDGTYP= 0
##$CFRGTYP= 5
##$CHEMSTR= <none>
##$CNST= (0..31)
1 1 145 1 1 1 1 1 1 1 1 1 1 1 1 1 1 1 1 1 1 1 1 1 1 1 1 1 1 1 1 1 
##$CPDPRG= <>
##$CPDPRG1= <>
##$CPDPRG2= <>
##$CPDPRG3= <>
##$CPDPRG4= <mlev>
##$CPDPRG5= <mlev>
##$CPDPRG6= <mlev>
##$CPDPRG7= <mlev>
##$CPDPRG8= <mlev>
##$CPDPRGB= <>
##$CPDPRGT= <>
##$D= (0..31)
0 1.2 0 0 0 0 0 0 0 0.06 0 0.03 0 0 0 0 0.0002 0 0 0 0 0 0 0 0 0 0 0 0 
0 0 0 
##$DATE= 1639648505
##$DBL= (0..7)
120 120 120 120 120 120 120 120 
##$DBP= (0..7)
150 150 150 150 150 150 150 150 
##$DBP07= 0
##$DBPNAM0= <>
##$DBPNAM1= <>
##$DBPNAM2= <>
##$DBPNAM3= <>
##$DBPNAM4= <>
##$DBPNAM5= <>
##$DBPNAM6= <>
##$DBPNAM7= <>
##$DBPOAL= (0..7)
0.5 0.5 0.5 0.5 0.5 0.5 0.5 0.5 
##$DBPOFFS= (0..7)
0 0 0 0 0 0 0 0 
##$DE= 6
##$DECBNUC= <off>
##$DECIM= 32
##$DECNUC= <off>
##$DECSTAT= 4
##$DIGMOD= 1
##$DIGTYP= 9
##$DL= (0..7)
0 120 120 120 120 120 120 120 
##$DP= (0..7)
150 150 150 150 150 150 150 150 
##$DP07= 0
##$DPNAME0= <>
##$DPNAME1= <>
##$DPNAME2= <>
##$DPNAME3= <>
##$DPNAME4= <>
##$DPNAME5= <>
##$DPNAME6= <>
##$DPNAME7= <>
##$DPOAL= (0..7)
0.5 0.5 0.5 0.5 0.5 0.5 0.5 0.5 
##$DPOFFS= (0..7)
0 0 0 0 0 0 0 0 
##$DQDMODE= 0
##$DR= 18
##$DS= 0
##$DSLIST= <SSSSSSSSSSSSSSS>
$$ [...]
##$SUBNAM2= <"">
##$SUBNAM3= <"">
##$SUBNAM4= <"">
##$SUBNAM5= <"">
##$SUBNAM6= <"">
##$SUBNAM7= <"">
##$SUBNAM8= <"">
##$SUBNAM9= <"">
##$SW= 18.0517287032376
##$SWIBOX= (0..15)
0 0 2 0 0 0 0 0 0 0 0 0 0 0 0 0 
##$SW_h= 3612.71676300578
##$TD= 16384
##$TD0= 1
##$TE= 0
##$TE2= 300
##$TE3= 300
##$TEG= 300
##$TL= (0..7)
0 120 120 120 120 120 120 120 
##$TP= (0..7)
150 150 150 150 150 150 150 150 
##$TP07= 0
##$TPNAME0= <>
##$TPNAME1= <>
##$TPNAME2= <>
##$TPNAME3= <>
##$TPNAME4= <>
##$TPNAME5= <>
##$TPNAME6= <>
##$TPNAME7= <>
##$TPOAL= (0..7)
0.5 0.5 0.5 0.5 0.5 0.5 0.5 0.5 
##$TPOFFS= (0..7)
0 0 0 0 0 0 0 0 
##$TUNHIN= 0
##$TUNHOUT= 0
##$TUNXOUT= 0
##$USERA1= <user>
##$USERA2= <user>
##$USERA3= <user>
##$USERA4= <user>
##$USERA5= <user>
##$V9= 5
##$VALIST= <valist>
##$VCLIST= <CCCCCCCCCCCCCCC>
##$VD= 0
##$VDLIST= <DDDDDDDDDDDDDDD>
##$VPLIST= <PPPPPPPPPPPPPPP>
##$VTLIST= <TTTTTTTTTTTTTTT>
##$WBST= 1024
##$WBSW= 4
##$XGAIN= (0..3)
0 0 0 0 
##$XL= 0
##$YL= 0
##$YMAX_a= 347256
##$YMIN_a= -701775
##$ZGOPTNS= <>
##$ZL1= 120
##$ZL2= 120
##$ZL3= 120
##$ZL4= 120
##$ABSF1= 10
##$ABSF2= 0
##$ABSG= 5
##$ABSL= 3
##$ALPHA= 0
##$AQORDER= 0
##$ASSFAC= 0
##$ASSFACI= 0
##$ASSFACX= 0
##$ASSWID= 0
##$AUNMP= <proc_1d>
##$AZFE= 0.1
##$AZFW= 0.1
##$BCFW= 1
##$BC_mod= 2
##$BYTORDP= 1
##$COROFFS= 0
##$CY= 11.3945322036743
##$DATMOD= 1
##$DC= 2
##$DFILT= <>
##$DTYPP= 0
##$F1P= 2.36226072786647
##$F2P= -0.459571619588291
##$FCOR= 0.5
##$FTSIZE= 0
##$FT_mod= 4
##$GAMMA= 1
##$GB= 0.15
##$INTBC= 1
##$INTSCL= 1
##$ISEN= 128
##$LB= 0.24
##$LEV0= 0
##$LPBIN= 0
##$MAXI= 10000
##$MC2= 0
##$MEAN= 0
##$ME_mod= 0
##$MI= 1.114404
##$NCOEF= 0
##$NC_proc= 0
##$NLEV= 6
##$NOISF1= 3.799351
##$NOISF2= 2.8
##$NSP= 1
##$NTH_PI= 0
##$NZP= 0
##$OFFSET= 15.70392
##$PC= 1
##$PHC0= -15871.42
##$PHC1= 11.60079
##$PH_mod= 1
##$PKNL= yes
##$PPARMOD= 0
##$PSCAL= 0
##$PSIGN= 0
##$REVERSE= no
##$SF= 200.130013532006
##$SI= 16384
##$SIGF1= 3
##$SIGF2= 2
##$SINO= 400
##$SIOLD= 16384
##$SREGLST= <1H.CDCl3>
##$SSB= 0
##$STSI= 0
##$STSR= 0
##$SW_p= 3612.71676300578
##$SYMM= 0
##$S_DEV= 0
##$TDeff= 0
##$TDoff= 0
##$TI= <>
##$TILT= no
##$TM1= 0
##$TM2= 0
##$TOPLEV= 0
##$USERP1= <user>
##$USERP2= <user>
##$USERP3= <user>
##$USERP4= <user>
##$USERP5= <user>
##$WDW= 1
##$XDIM= 8192
##$YMAX_p= 0
##$YMIN_p= 0
$$ End of Bruker specific parameters
$$ ---------------------------------
##NTUPLES= NMR FID
##VAR_NAME=  TIME,          FID/REAL,        FID/IMAG
##SYMBOL=    X,             R,               I
##VAR_TYPE=  INDEPENDENT,   DEPENDENT,       DEPENDENT
##VAR_FORM=  AFFN,          ASDF,            ASDF
##VAR_DIM=   8192,          8192,            8192
##UNITS=     SECONDS,       ARBITRARY UNITS, ARBITRARY UNITS
##FACTOR=    0.0002768,     1,               1
##FIRST=     0,             0,               0
##LAST=      2.2672688,     0,               0
##MIN=       0,             -701775,         0
##MAX=       2.2672688,     347256,          0
$$ Real data points
##PAGE= N=1
##DATA TABLE= (X++(R..R)), XYDATA
0@%%%%%%%Qj6J6j6K4l2M0n3O1q0J04j20J44j76K14k54K97l53M16m84N62o50P48
30D00q57R80j117J265j430J615j818K039k284K553k844L164l514L894m311M769
46B504n268N811o406P057p771Q561r435J0402j1481J2695j4065J5624j7422J9522
60A0328k2009K5012k8724L3446l9687M8372o1375Q3248j29321L92786m72949m03643
72e64516P34203K983k4588l67377R9338L27706k55601P3439O6999m16650M27817
83A03753J41792l62201N5807m0066J96310J46588n13005J76762K59179k13047
93d8128J16400j45936m9387L27766k18277J6305N6281k89317L33155J04697l21871
104a18312J13742p5286P0316J79180k76047J11776N0607k05473K96765j08227
$$ y = [0, 0, 0, 0, 0, 0, 0, 0, 8, -8, 8, -8, 16, -16, 24, -29, 32, -48, 56, -64, 80, -96, 118, -136, 161, -192, 224, -260, 302, -348, 400, -457, 523, -594, 671, -759, 856, -962, 1077, -1207, 1346, -1498, 1666, -1848, 2046, -2265, 2504, -2764, 3047, -3359, 3698, -4073, 4488, -4947, 5455, -6026, 6669, -7396, 8228, -9194, 10328, -11681, 13331, -15393, 18053, -21634, 26738, -34637, 48611, -80710, 312076, -160873, -564516, 169687, 172670, 148082, -219295, -119957, 207749, -47852, 25587, 92586, -324064, 103753, 245545, -116656, -60849, -100915, 95395, 241983, -271022, -94260, 164919, -48128, 68272, -77664, -127051, 200715, -17562, -1257, 55024, -234293, 98862, 203559, -118312, -4570, -79856, -9540, 169640, -106407, 5369, 55976, -149497, 147268, 39041]
114C9041k10953K79709r6923k3220L7023k03199K79291K358k68614K50432n4569
125C0376j00816J36273j43854J27212L323k00885L02746j01074k63737K76101
135F5665q574m3844O49j63952K58237o850k47975K28970p3224j06701J79364j29538
147d7773N4001M0291j61438K14109o8288j73091K26953q5241l5363J08938j41522
158f8424J14263k4913j45319K38518j03153j19548K07430j24316k006Q5055j15745
169e8158J35452p0278j20335K05460j08397k7090J26854j74026R5975O5366j50033
180g9210J32442o9167n1977J74105j55943J8163J18300j54637Q1955j1456o7089
191f4514J71197j55416l0449K07413j44029l971L7998r1890J46903o5580o6466
$$ y = [39041, -171912, 107797, 10874, -12346, 24677, -178522, 100769, 103127, -165487, 84945, 30376, -70440, 65833, -78021, 49191, 52514, -148371, 154375, 53301, -210436, 65665, 57091, 13247, 13896, -150056, 108181, 101331, -146644, 82326, 9102, -97599, 81765, -47773, 6228, 46519, -114919, 99190, 30902, -142189, 84764, -477, -35840, 73098, -68424, 45839, 20926, -124393, 114125, 10972, -108576, 98854, -25462, -27468, 57587, -58158, 77294, 7016, -113319, 92141, -16256, -43346, 83508, -90518, 5457, 70823, -79210, 53232, -15935, -67912, 106193, -49750, -31587, 86713, -67924, 14031, 2575, -64514, 106683, -48733, -79182, 128231, -15798, -19769, 18229, -73661, 73242, 7662, -58804]
202e8804J49202j49124K1613J20124j58063R3016K8470j10934J18813q1603o210
213c3500J29613j67897M4777Q9125j21481R4727l8825n1502J41618j27390J3812
224b6923J13581j57965P4469M7345j02476J05044p3993k7359J24030j26654N4219
235C318N9902j51585J15543Q217q1612J11877j03471q47J01793j30188P9828L2863
247D5638j13359J21027n4415n0746J12759j09733N3536O8053j50432J05139J0999
258C8466j03733J01621n9151J7990Q2555j50701O8509N2502r8265J12878o5217
269b546p2451J32827p8322J2894M8940j15198J08324J640j03566J07799n6181
280a5840n353Q9716j22790N7109M0744j09939J08898l1912o7686J13837p4894
$$ y = [-58804, 90398, -58726, -37113, 83011, -75052, 17964, 46434, -64500, 54313, -27290, -33500, 96113, -71784, -27007, 62118, -59363, 35364, -3461, -54963, 86655, -40735, -26923, 86658, -71307, 3162, 50507, -51969, 53075, -20918, -48277, 75753, -50901, 3318, 63220, -88365, 27178, 35395, -46217, 65660, -37811, -38658, 63135, -67053, 12775, 45638, -67721, 53306, -1109, -51855, 60904, -48829, 4707, 72760, -77672, 27467, 38466, -65267, 36354, -22797, -4807, 77748, -72953, -4444, 48058, -50207, 62671, -2546, -74997, 57830, -20492, -7598, 41342, -73856, 34468, 36108, -67458, 40341, -15840, -21193, 68523, -54267, 2842, 43586, -66353, 42545, 10633, -57053, 56784, -18110]
291a8110O495N2566j00241J04029l034j13151J03720m9146p363J01939j23852
302d6148K3696N5283p7276R2080n1283o2575J30527p0692q658N1272j01513R1881
314B6594J0414j01164J03985m3709k7590R2533r8047L1482M9253q8943P8489l4253
326i56m9853J19350q2260j8346O9315q8855P0863K0519r1566Q0695l7975j5640
338b4709Q6599j03217K0321N8266p7845P3821k7360o2992J09071n6499j5979O4343
350D3820q6527N2170K2276p6866Q2140l7051l0833P9574q8850K5110O3400q7106
362c8743N9586o466n8253Q8809n5808j7128O2680p7929N5314K6860q6499O9993
374B2416k7582k6674Q7939p9618M558N8179p3265N4966m266o1340Q0580m5519
$$ y = [-18110, -11615, 40951, -59290, 44739, 41705, -71446, 32274, -16872, -24235, 77704, -46148, -22452, 32831, -44445, 47635, -3648, -66223, 64304, -6388, -15046, 36226, -65287, 26594, 37008, -64156, 39829, -3880, -31470, 61063, -36984, -5502, 43751, -45192, 33297, -956, -50809, 68541, -13719, -32065, 37250, -51605, 19258, 39777, -51789, 28906, -9069, -24709, 61890, -41327, -21006, 37260, -40585, 33236, 5876, -57116, 51955, -4544, -20523, 43820, -42707, 9463, 31739, -45127, 37013, -38, -30871, 48703, -40147, -15037, 48363, -38743, 20843, 14377, -43876, 44933, -10875, -28003, 34677, -43252, 12062, 38922, -47577, 22416, -5166, -31840, 56099, -23519, -18961, 39218, -34047, 20919, 16653, -44687, 35893, -9626]
386i626j1788O5614p9157L8215L0517p6862P0454j7099m6275O9506n6984J2245
398a1240N1191p6927M7639L504n7244P7247l7740k0046O4968p1373K8151L6850
410C4980p2291N4318j2873l7157P3477n2719o14M8738p0111M6779J0650o2577
422c9400O8832l2268k5775O9002o0253J2271K8369o3234O4638m607m9344O1848
434C0079m7803L092N6044p4043L3880K0328n7775O2300k4142k7380O2714n6735
446a9441J3078L5717o2638N2467n725m9053O9408l8226j5150M8451o3158L4668
458C98K9288n6340M8409k5639k7123O7155n0252L962L4843n9944N0908K285n4818
471c6868O2894k6625j6899M6849n5937L1470K4729o1990M9104j1620k7985N7857
$$ y = [-9626, -21414, 44200, -34957, 3258, 33775, -43087, 27367, 10268, -36007, 33499, -23485, -11240, 39951, -36976, 10663, 14167, -43077, 34170, -3570, -23616, 41352, -30021, -1870, 34980, -37311, 17007, 4134, -33023, 40454, -12265, -12879, 35859, -34252, 12527, 23177, -39400, 29432, -2836, -28611, 40391, -19862, -7591, 20778, -42456, 22182, 17575, -31769, 30079, -17724, -14632, 41412, -32631, 1249, 21577, -36198, 26102, 1960, -25420, 37294, -19441, -6363, 29354, -33284, 19183, 13458, -35595, 33813, -4413, -19563, 28888, -34270, 398, 29686, -26654, 21755, -3884, -31007, 36148, -14104, -10142, 24701, -35243, 15665, 17950, -36868, 26026, -599, -17498, 29351, -26586, 4884, 29613, -32377, 16727, 5107, -22878, 34979]
483C4979n7271K514N4558n4207L2127j361m9550O4165k4542j9952M5307n5404
495b8637K9615K8497o4820M8759o499l3727N8908m5017j491M7623n5860K9503
507F854O566m4112N7410k9463j9606N5578n3171J7652L1898o1096M0251O53k9462
520b0048N0552m7448k276N0538n3406K5596J0459m6247N4142k0998k0798N1484
532C1550n1318J1403L6834n1864L2703o778k7809O0551m1027j3152M5074m7689
544b1522K7825J1722m9215N4105j5810l0014M5027m1665J5345L1808n5415L4037
556F228l1k8220N5514m3686j6381N3195l8209J8147M549m6374N5785j0260k9729
569a9472M2299l9597J1043L1826m9648L5698N24l9231M8997k6276j2959L9386
$$ y = [34979, -22292, -19778, 34780, -19427, 12700, 11339, -38211, 25954, 1412, -18540, 26767, -28637, 978, 29475, -35345, 13414, 6915, -26812, 32096, -12921, -14412, 33211, -22649, 6854, 13420, -30692, 26718, -2745, -22351, 33227, -19944, -2292, 29606, -31490, 8761, 9414, -20048, 30504, -16944, -19220, 31318, -22088, 3508, 13967, -32280, 21862, 864, -19934, 31550, -19768, -8365, 28469, -23395, 9308, 2530, -25279, 35272, -5755, -18907, 26167, -21522, 6303, 18025, -31190, 22915, 7105, -22909, 22118, -19547, -4202, 27606, -27809, 6228, 6197, -22023, 33491, -10195, -26576, 26619, -11590, 6557, 11106, -35268, 20517, 10257, -19472, 22827, -16770, -5727, 26099, -23549, 12149, 12673, -26558, 22439, -3837, -16796, 22590]
581B2590m1813K2014J4437m5590M5940j0782k9382M2441l3686Q512L0791n0708
593b5236L0068O717l6942M6167j9814j6074L2814l7341K8109J6905n4482L7336
605H227j399k3210M1129l7116o5L4996m0361K5388K972l6410M4355j8593j5960
618a6047L6497l7742J7289J9879m7542L5946J175k6541L5242l0082M880L4506
630B7460m5045J9190Q349l1870M2403j9108j9234L9579l3647Q040K1907l8203
642b0179K9790l053k5283L9273k8290m472L2559l8788K0100J2244l5280L4143
654A2764j3327j5323L9823l3041J602K2558l3401K8480k183k7413L8996k3442
666c907p984L2606l6329J5501J5749l3194L0512j1702j7570L7205l2426K609K6633
$$ y = [22590, -19223, 2791, 17228, -28362, 17578, 6796, -22586, 19855, -13831, -5319, 25472, -25236, 4832, 11549, -25393, 20774, 960, -15114, 17700, -19641, 8468, 25373, -29109, 8227, 6828, -16382, 24747, -12369, -12434, 22562, -17799, 7589, 10561, -25849, 18506, -87, -16047, 20450, -17292, -3, 19876, -27666, 8280, 9455, -17086, 18156, -11926, -7046, 27460, -17585, 1605, 9954, -21916, 20487, 1379, -17855, 21724, -11923, -3883, 18024, -20179, 9611, 6558, -18725, 20548, -7742, -12214, 20345, -18443, 1657, 13901, -21379, 12764, -563, -15886, 23937, -9104, -7502, 15056, -18345, 10135, 7952, -19461, 19535, -3907, -11891, 20715, -15614, -113, 15636, -17558, 12954, 1252, -16318, 20887, -11539, -8930, 17703]
679A7703l4136K3673p94k8978M1491j7794j4380K8792l1938J7341J7131l6315
691a8204K6651p058j5581L6297l1621j039K9763l3079K1035L912l1011L3523j3299
704B89j2155K8366l1256J3580J8323l5427K5901l674j9998L4419k6502l681K9490
717A7675k9539J7313L044l0689L4415r214j2989K6859l1272J2793K2578l6858
729a5884K0688n37j9612L4431k2795p832K5732k7267J9353N452l3358L2310q005
742B676j5325K9367k8805Q242K1913l4956J9268J623j8337L3167k3006p746K8351
755A6432k7495J4804O746l1906L3010m240j8503K4912k5185O857K2153l1748J8192
768D029J078k0997L3078j8865j0725K6911k6690J3117J0605l0221K6909l534j5758
$$ y = [17703, -16433, 7240, 6446, -22532, 18959, 1165, -13215, 15577, -16361, 980, 18111, -18204, 8447, 1389, -14192, 22105, -9516, -10555, 19208, -13871, 7164, 11076, -19935, 13588, 289, -11866, 16500, -14756, -1176, 17147, -18280, 7621, 3947, -16051, 18368, -8134, -11815, 17675, -11864, 5449, 8493, -22196, 12219, 3005, -9984, 16875, -14397, -1604, 20974, -15884, 4804, 4267, -15345, 19086, -3709, -11541, 14191, -13076, 6277, 11729, -21629, 10681, 2676, -12649, 16718, -12087, -3845, 18068, -16888, 2380, 4003, -14334, 18833, -4173, -11919, 16432, -11063, 3741, 10487, -21419, 11591, 7351, -11152, 13760, -11425, -4568, 17585, -14163, 4029, 5107, -15890, 17188, -1677, -12402, 14509, -12181, 936, 11541, -18680, 8229, 4695, -11063]
781a1063K6088k5122M446K2573l0970J7341L117k0452L1387j8598j3670K8814
793A3891k1509J0528P902k9245K7878k240j8334K4078k4076M030K4562k9892J4581
806B154M449k1426K8671j4951j1818K6217k2617J0102J1865k8858K3801k236j7868
819a2515K5931k0633J031K2802k7214J2152N388j9554K6253j4519j2030K5538
831A2630k0489P969J2475k8714K0858O20j7446K3485j7554o57K1971k4994J1385
844A539M746k1344K5459q952j1562K3882k1224N450J4560k5648J7927R77j7042
857a1232K2559j6196j650K1649k5458R768Q513k1131K2849q543j2908K4396j8088
870e472K812J3220k4754J7795K087j7273K3130j3839n247K0000k2185J0204R311
$$ y = [-11063, 15025, -10097, -5651, 16922, -14048, 3293, 6410, -14042, 17345, -1253, -14923, 13891, -7618, 2910, 10812, -18433, 9445, 7205, -11129, 12949, -11127, -7097, 17465, -12427, 2154, 6603, -14823, 13848, -1103, -12921, 13296, -9321, 781, 12646, -16212, 7589, 5353, -12515, 13416, -7217, -6186, 16616, -10598, 1554, 6942, -12612, 13641, -878, -12908, 12630, -7859, 110, 12585, -16129, 4729, 5349, -12097, 11388, -6166, -6823, 15148, -9846, 1539, 6285, -15059, 10400, 1448, -10114, 13768, -7456, -2006, 12554, -13094, 4833, 5810, -11232, 11327, -4869, -6519, 15130, -10328, -560, 7953, -13178, 9671, 1128, -11780, 12616, -5472, -2660, 10560, -14194, 3601, 5688, -11585, 11545, -2294, -7541, 12459, -9726, 478, 9789]
883I789k2530J9722l766j2071K0606j8402K126J5512k1965J5086K414j7927K1373
896I967j1213p082J9591k0303P538J0251k0486J8670m341j2941K1138j6035N18
909d728J6145k1331J2944L736j8092K1366r373q913J7758j7710Q376J0649k1794
922a0967J6505k330j3050K1047j6115k597J7892j7842J0488K823j8709K0373o984
935E34q568J8610j7292N004J1800k0303J4580j283j3411K1763j4091m786J7823
948A0380j6242Q713K792j7907K0474n575j1447J7322j4961N002J2694k1296J1529
961A478J308j2363K0009j2483n610J7371j6464Q129N096j8888J8741l201j0875
974g752J7486j4929K371J3660j9702J1107K183j3150J8657j1516n754J7472j6967
$$ y = [9789, -12741, 6981, 3215, -8856, 11750, -6652, -4526, 10986, -10979, 4107, 6521, -11406, 9967, -1246, -8328, 11263, -9040, -1502, 8749, -11737, 6933, 2592, -10349, 10789, -5246, -4728, 11417, -9914, 3030, 6766, -11326, 10040, 667, -8246, 9512, -8198, 178, 10827, -10967, 5538, 3208, -9842, 11205, -4910, -7507, 10385, -7457, 3031, 5854, -12855, 7518, 534, -8034, 10576, -6716, -1712, 10088, -10215, 4365, 3082, -10329, 11434, -2657, -7443, 10380, -5862, 2851, 5643, -12264, 8210, 2635, -8812, 8510, -6451, -1449, 11245, -10051, 1478, 2786, -9577, 10432, -2051, -7661, 9710, -6754, 1375, 6471, -12417, 6324, 3123, -7752, 9734, -5195, -2824, 10836, -8866, 2241, 4424, -8726, 9931, -1585, -7339, 10133, -6834]
987f834P374O645j9495J7342p55j1335J4783j4537L719J4352k0242R063M006j2415
1001h329J7758j0589o335J7126j5997O055Q266j8623J5457l24j0781J4621j4091
1014e786J942J4858j9289Q480M958j2706J5989r901p051J6878j3226M295O851
1027F292j7222J5212Q9j1864J4201j1940J577J4589j8800P420N976j2742J5058
1040G846q388p549J6453j2937M024Q283j6970J3881o73j2438J5347r910j116J3102
1054H955j5963P557M184j3575J5168o487q079J6190j1484K444P353j5565J3654
1067D352M27j3028J4382q386j406J2478j4643O655M171j3397J4502m984q438J4813
1081G498j0905J331Q429j4105J0880L9j1479J4767p860k837J1938j3413N450N064
$$ y = [-6834, 540, 7185, -12310, 5032, 4277, -7058, 7725, -6812, -3093, 11259, -8983, 80, 4086, -8329, 9429, -1160, -7495, 9631, -6366, -311, 7955, -10668, 4789, 4465, -6316, 8305, -5786, -3844, 11014, -8275, 205, 5163, -7543, 8446, -1455, -8506, 8372, -4854, -559, 6292, -10930, 4282, 4371, -7493, 6708, -5232, -3655, 10934, -7866, -446, 5530, -7212, 7846, -542, -8091, 8362, -4575, -551, 7732, -9238, 4643, 3970, -8468, 6879, -3031, -4147, 8955, -7008, 549, 4733, -8842, 6326, -161, -8240, 7950, -3534, -1090, 6263, -9302, 4352, 4779, -8249, 6133, -2253, -3659, 8819, -5824, 831, 5002, -8395, 6107, 1123, -7315, 7498, -3407, -2076, 6353, -7752, 3128, 3167, -8312, 6455, -1405, -4242, 7696, -5717, -267, 4797]
1095D797j2517J3092m324q085J4515r747N23P997j3854J0121J636j0973J3300
1108F481p350l733J2729j3376M299O432j2782J1221k683p139J3255j0625K9R896
1122F654j2753P337K125j0200J2757o432m687J2521j1975L387O563j1186R911
1135D022j944p821J2015r483k32J0630j2370O048L223j0246J1233n222m954J1313
1149F212j0643L676O625j2666Q932K74p534J0887q924r73J1323j1402M800L286
1163C873r770J0918m700n497J0942r652L386O673j2475Q578P78q488J0075o976
1177b335j198J0088j1099M693L772j0790J1133k863p184J0792q161K701O667j3058
1191f842P622K284p883R622o352k259J0762j0534L728L677j0169J0758k185p870
$$ y = [4797, -7720, 5372, 1048, -7037, 7478, -2269, -1746, 6251, -7603, 2518, 4154, -6819, 6481, -869, -4602, 8127, -5249, -950, 5482, -7300, 3921, 1238, -5901, 7354, -3271, -3242, 6654, -6099, 1238, 3363, -6837, 5920, -512, -5199, 7322, -4653, -1266, 5297, -5889, 4022, 2078, -5743, 6272, -3211, -3443, 7187, -5183, 865, 4088, -6158, 5075, -147, -5101, 6212, -4431, -755, 5870, -6796, 2136, 2410, -5124, 5763, -3161, -4134, 7189, -4213, 587, 3873, -5897, 5021, 321, -5176, 5766, -3886, -500, 6173, -6302, 2276, 3054, -5434, 4641, -2335, -3533, 6555, -4544, 149, 3921, -6869, 4264, 1401, -5783, 5009, -3152, -451, 6216, -6842, 780, 3064, -4819, 4803, -1549, -3808, 6954, -3580, 148, 3825, -6344, 4414, 2229, -5641]
1205e641J0362o531P32O276j1224P232K112q497R526n569k775J0305r646K365
1219i73M114r746J0887j692q181R665o082J222O583j1599O388L375q646R950o371
1234a106l625J0890q459J242M251q930R604j661q003J0479o268l67P049j0618
1248e522N708L312q228R090n184l950J0344q015J579M367q490Q651j366q063R823
1263D056n338m91P398j0159M449L539p286P436m826l414J0509p960N23N236q442
1278d770P356m45p535R143m965j111P339r218M213L669p785P460l747l727R767
1293E644p872R95N328q541O706J81p159P843m589l29P210r578L699L846p573O513
1309B324k322l824Q826o925K01N616q286O196J92o369Q334m770j490O870q078
$$ y = [-5641, 4721, -1810, -1078, 5198, -6026, 1206, 3318, -5179, 4347, -1222, -3997, 6308, -3338, -973, 3141, -6605, 4282, 2590, -5591, 4074, -2008, -786, 5797, -5802, 586, 3961, -4685, 5265, -1106, -4731, 6159, -2300, -1058, 3193, -5737, 3867, 2206, -5797, 4682, -1586, -1953, 5096, -5522, 186, 3498, -4730, 4360, -824, -4774, 5570, -2445, -866, 3501, -4989, 3662, 2296, -5767, 4056, -1282, -1773, 5625, -4534, -85, 3454, -3832, 3604, -1222, -4636, 5873, -2087, -1564, 3672, -4770, 2586, 2141, -5394, 3749, -1216, -2327, 5012, -4206, 7, 3676, -4109, 3351, -396, -4123, 5644, -2228, -1233, 4095, -4446, 2260, 2441, -4718, 3125, -1464, -1793, 5417, -4161, -462, 3384, -4189, 2324, 2, -3822, 5004, -1921, -1720, 3896, -4390, 1806, 1998, -4371, 3963, -807, -2297, 4573, -3505]
1324c505L379L722p633O723k027m460Q187o009M40M543p906N669J526o802P226
1339C073l356k427O861p458K451L885p040O525j459m609P323n501K01N541p566
1354c556M344J571o165P313l509l029O675o133K464K967o973O283q69n272P133
1369C244m690n06N390p093M034K140o211O366k839k779O348n343J754L357o757
1384c585N339j76m736O271m682l14N867o490K705J823n312O102k718l199O554
1399C449n114Q00L965o875M937O41m971N807l665q91N822o487K329K701n459N546
1415B535k652l272O811m524O37L422o594M815Q60m977N484l509j123N976n981
1430b092J440K240m764N553j845l713N988l975L78L329o096M731J071n441N390
$$ y = [-3505, -126, 3596, -4037, 2686, 659, -3801, 4386, -1623, -1183, 3360, -4546, 1123, 2649, -4153, 3073, -283, -2710, 4151, -3307, -856, 3029, -4011, 2514, 1055, -3554, 3769, -1732, -1531, 4010, -3556, 788, 2359, -3806, 3507, -2, -3031, 3644, -2489, -25, 2942, -4031, 2252, 1383, -3889, 3244, -1446, -1952, 3438, -3655, 379, 2519, -3692, 2674, -165, -2944, 3404, -1939, -185, 3172, -3585, 1754, 1578, -3158, 3113, -1569, -1883, 3984, -2506, 199, 2022, -3290, 2812, 94, -3105, 3449, -1665, -865, 3100, -3775, 1162, 1803, -3168, 2639, -1026, -1917, 3905, -2582, -253, 2448, -3011, 2535, -117, -3389, 3422, -1102, -465, 2957, -3637, 1178, 2038, -2939, 2545, -964, -2087, 3889, -2092, -652, 1588, -3176, 2377, 532, -3181, 2807, -1168, -790, 2539, -3557, 1174, 2245, -3196, 2194]
1445B194k664j152N397n687J070L156m878M759j434l998O149l587r6L561o518
1460c728M083J900m827M731k918j413N485n352J095K779m713M958j380m176O293
1475B817l624j55L564n655L817J668n155M353k239j176N449n579J041L204n054
1490b724M564j124l905N788l584q9L646n524K866K037m429M171k450j219N455
1505C479n087N06L343m462L829m66m036N090k909k42L923n575L180J215m256M082
1521A614k035j768N482m811N08L039m552L841p17l556N169k674p74L831n220K932
1537C09J608m283M051j825j934M978l927M72K410m049L620l09l787N200l059o76
1553a201L815n014K615J403l985L844j339k148M379l666M41K785m229L334K08
$$ y = [2194, -470, -1622, 3775, -1912, -842, 2314, -2564, 2195, 761, -3237, 2912, -675, -771, 2790, -3728, 355, 2255, -2572, 2159, -759, -2172, 3313, -2039, -944, 1835, -2878, 2080, 700, -3476, 2817, -807, -962, 2602, -3053, 764, 2432, -2723, 1630, -609, -1785, 3664, -1915, -874, 2330, -2724, 1840, 716, -3189, 2599, -985, -1074, 2572, -2952, -86, 1951, -2478, 1693, -757, -1976, 3479, -1608, -1102, 2241, -2221, 1608, 1142, -2894, 2196, -713, -955, 2968, -2607, 573, 1788, -2468, 1614, -421, -2189, 3293, -1518, -1010, 2029, -2523, 1318, 601, -2955, 2214, -460, -1234, 2597, -2623, 309, 1917, -2366, 1685, -140, -2074, 2904, -1023, -551, 1859, -2190, 1430, 1121, -2666, 2534, -525, -1201, 2614, -2400, 215, 1618, -2367, 1477, 138, -2010, 2369, -1297, -856, 1929, -2300, 1034, 1242]
1568A242l458M192k255r82L912m472J603J828l610L860j242k638M597l756K31
1583i48K995m340L048L48l263M054k478r51L673m052K121J293m089M049p91k439
1599a770L978l308M78K721l941K605N84l417L669k081r36L932l819J198J789l812
1615b130L569j112k374L885k940J93K852l896K300O94k822L392k061j170L561
1630A941l192P14K158l702L306j30l274M090k277j36K708m002J681J548l175K988
1646A246j533j671M080l196L31K090l129K602r4k704L672k583K4L146m003J546
1662a76J402k834L092j466j792M134k968J85J999l608L146Q3l132L219j606n71
1678h93L162l997J372J705k959K756r22k032L746k769P0K063l371K991M00l049
$$ y = [1242, -2216, 1976, -279, -1261, 2651, -1821, -218, 1610, -2000, 1860, 618, -2020, 2577, -1179, -948, 2047, -2293, 755, 1103, -2160, 1894, -584, -1535, 2138, -1914, 207, 1500, -2589, 1460, 669, -1770, 2208, -1100, -622, 2099, -1842, 763, 1347, -2070, 1599, -482, -1418, 2514, -1305, -107, 1682, -2130, 1439, 327, -2047, 1838, -1102, -909, 1943, -1953, 347, 1041, -1781, 1611, -450, -1620, 1941, -1251, -537, 1621, -2081, 1225, 1095, -2179, 1911, -366, -502, 2206, -1796, -115, 1433, -1742, 1246, -287, -1958, 2122, -1074, -743, 1347, -1782, 820, 726, -1978, 1694, -889, -865, 2281, -1722, -176, 1226, -1608, 1484, 18, -1774, 2360, -608, -423, 1576, -2032, 1114, 1197, -1935, 1284, -322, -893, 2269, -1728, -356, 1349, -1610, 1146, 224, -1808, 1938, -831, -761, 1302, -2069, 922, 1322, -1727]
1694a727L117j937n09L462l959J240J660k893K827r50k231L633k147k03K037k992
1710a572K026R56l369L143j136j199L097l558J015J994l102K660n73k148L382
1725A616j959k88K148k799J911M66k718K793j317r26L068l189P51J730k783K336
1741H40o99k061L580j949m19K152k996J786J089l322K641m02j216K710k831N52
1757e45K000k825K118k45k102L451j927q27K336k544J393R04k468K343j218j020
1773a176K952k732L71J773k853K236l45k006L151j752p52K731k958J487J163k807
1789a517K451p11j131K628k430L0K232k902J907K02k245K889j563q36K638k859
1805a217J246Q63k280K417p81j377K381j907J69J856k780J916K50k297K592j457
$$ y = [-1727, 1390, -547, -1056, 2406, -1553, -313, 1347, -1546, 1281, 331, -1900, 1733, -414, -617, 1420, -1572, 454, 1410, -1959, 1184, 48, -1151, 1946, -1612, -597, 1397, -1705, 955, 382, -1766, 1616, -343, -631, 1517, -1282, 629, 1095, -1623, 1170, -147, -1073, 1995, -1194, -443, 1287, -1496, 840, 141, -1920, 1660, -289, -708, 1444, -1552, 234, 1323, -1999, 642, 240, -976, 1734, -1097, -545, 1455, -1370, 748, 503, -1599, 1852, -75, -902, 1434, -1110, 283, 1187, -1281, 1062, -156, -1176, 1776, -956, -585, 1188, -1665, 571, 226, -1780, 1371, -381, -1133, 1598, -1360, 127, 1290, -1517, 934, 223, -908, 1720, -710, -680, 1552, -1350, 557, 759, -1486, 1403, -160, -996, 1642, -1217, 29, 892, -1388, 1029, 248, -1129, 1252, -655, -486, 1370, -1410, 506, 756, -1541, 1051, -406]
1821d06m78K359k564J257J229k905K494n05j755K757k151J04K068k670J628K86
1837G48k106K467j386o89K180k314Q24J147k347J936pk055K718j338o01K093k425
1854a155J542R07k527K198q73j232K627k299N96J106k136J931m49j492K480j375
1870a51l57J665k378J278R01k257J664n27o86K187k152K88J725k144J540K51k245
1887a398K423r99n51J703k076Q10J245k236J937p02j197K421j875j06J438k101
1903a264J819K5j856K436j159o81J831k064P61J146k007J751p26j072K356j651
1919c55R9J401k270J748K22j785J555n73q56J907j827O01J140j990J608n39j393
1936a307K419j270o12J859k127J383O79k142J810o97q15K020j897N80J392j976
$$ y = [-406, -884, 1475, -1089, 168, 1397, -1508, 986, 481, -1274, 1483, -668, -564, 1504, -1166, 462, 748, -1358, 1109, -277, -966, 1214, -1100, -276, 871, -1476, 460, 453, -1602, 1116, -222, -823, 1270, -1155, 387, 1294, -1233, 965, 92, -1140, 1487, -812, -216, 890, -1246, 685, 236, -1256, 1224, -151, -508, 1157, -1221, 57, 958, -1299, 365, -162, -848, 1339, -813, -525, 1200, -944, 596, 847, -1398, 1025, 26, -525, 1178, -898, -88, 1157, -1079, 858, 156, -1041, 1380, -495, -601, 837, -1264, 555, 580, -1276, 1160, 1, -680, 1151, -913, -152, 994, -1013, 738, 12, -1060, 1296, -355, -256, 1145, -1125, 623, 845, -940, 615, 42, -814, 1093, -734, -133, 1007, -983, 625, 86, -1307, 1112, -158, -770, 1089, -1038, 345, 1024, -1118, 692, -5, -820, 1200, -697, -117, 1275, -701]
1952g01R28K04j601K517j519l85J631k255J698K95k184K137q31q21J859j876M81
1969d23J502j962J337k48j450K101j159M6J222j939J200P12j888J228m0j114K353
1986A478j947r6J539j896J241%j532K280j094p54J705j801J016O84k035J652R7
2003E37j255J882j601kJ352j855J311L27j492J458o67n94J660j787P38P26j589
2020h51J188j47j003J981j512o2J226j717J147Q3j276J737j157l15J572j643Q97
2037A48M10j396J438l11j026J571r49n09J253j314J025J08j285J582p79q19J900
2054A047j666M17Q34j227R74k19j056J857j079l70J051j237Q24O74j577J314l29
2071B32q95J500j305J79J137j644R48K7p81J321r03p2J118j407O15M66j064J033
$$ y = [-701, 227, 431, -1170, 1347, -172, -557, 1074, -1181, 517, 812, -1372, 765, -66, -887, 972, -904, -423, 1079, -883, 454, 206, -1244, 857, -302, -256, 966, -973, 227, 939, -949, 279, 239, -875, 1478, -469, -565, 974, -922, 319, 319, -1213, 1067, -27, -781, 924, -877, 139, 823, -1212, 440, 537, -718, 1164, -437, -439, 913, -942, 369, 696, -796, 662, -5, -599, 1061, -726, 12, 738, -851, 337, 190, -813, 1168, -344, -406, 820, -897, 250, 333, -943, 794, -363, -678, 894, -749, 148, 558, -838, 600, 289, -737, 834, -115, -624, 629, -685, 340, 448, -837, 745, -34, -853, 1047, -619, -202, 632, -595, 379, 160, -896, 961, -118, -488, 563, -674, 150, 824, -753, 561, 232, -663, 837, -468, -289, 848, -796, 152, 179, -602, 719, -184, -256, 862, -545, 70, 536, -528, 505]
2089E05m73n18J237j092N5J129j517J077l44q05J380o07o47J260j267N50Q12j267
2107e32Q98j57p18J461j230j0J005r03K64J69r01J335o17n16R46j194O07N73j341
2126h61J363m02j008J704j149J22Q96j253Q45L52j453J481n37o70J355j230N06
2143F1P44j643R88O9j095J914j175k61J009j023Q12j48j036J275m08n72J104j191
2161e76L21Q60j419P52M15j030J280o63l41J370j247P20j38q31P60n0o31J325
2179H77j153l4Q26j077Q03q9r42J469p51m47J154r94L91J57r09J180l57p33J379
2198G50j256N21Q82j172M86L5q87J205p66l56J314j078L24N11j173Q48j64o83
2216f59J218q94L2R26r58M17o7n96J063p19k41J141j012L10L73r66J042j92r14
$$ y = [505, 32, -486, 751, -341, -286, 843, -674, 403, 59, -746, 634, 27, -620, 640, -627, -77, 735, -532, 366, 209, -509, 952, -278, -288, 717, -186, 78, 247, -654, 681, 64, -452, 494, -700, -93, 480, -861, 502, 100, -908, 796, -353, -231, 665, -588, 257, 609, -844, 637, 100, -570, 785, -445, 61, 805, -838, 150, 219, -876, 1038, -137, -398, 611, -412, 400, 252, -784, 491, 83, -489, 615, -576, -255, 605, -814, -62, 353, -677, 603, -60, -401, 969, -278, 442, 304, -527, 233, 183, -448, 877, -276, -310, 516, -561, 242, 153, -789, 680, -71, -518, 636, -358, 33, 190, -719, 461, 104, -629, 750, -506, 15, 897, -275, 211, 246, -641, 564, -202, -558, 756, -322, 2, 513, -660, 188, 24, -659, 559, -335, -303, 623, -335, 82, 15, -581, 482, -237, -478, 663, -349, -39, 334, -632, 410, 218, -696]
2235f96J170q57L40P25j225P00J94n17O54n78k89P93p65L20O18j305Q48L74j003
2254d99J042q13j38Q49p99N53K87r42O25L8m03M78o09J06Q04j211Q34k9p19R17
2274C71l43m71J007r46M05M74q19N88j21m94Q88o16k18J041j127L61K85q85J323
2293G03q68m3Q08q01L33N6p19N14K48m72Q68r73K16Q20j032M93M5j032J261m37
2313a2r7N44p61J92M87q77R86m34m26O42n73J69O83p04O1M84r29Q42k25l93N06
2334A65k81O5M50p52N40K84q56Q86p62J01N81p44K61K98n30L82k0k75M35n28L61
2355F1L19o52N27j49j84L56n89J92P16p24l8M31l04M56j03n17M55m54r8N41o62
2376d20O42k84m09P39l91j22N29n32L42J50p19O34j46k23M34m58P9O43o95J27
$$ y = [-696, 474, -383, -43, 682, -543, 157, 351, -166, 488, -90, -379, 414, -351, -31, 587, -718, 130, 504, -499, 543, -270, -408, 441, -358, 195, 482, -460, 165, 203, -200, 278, -331, -225, 579, -632, 202, 173, -546, 371, 28, -443, 564, -382, 23, 497, -322, 266, 145, -349, 539, -77, -295, 746, -381, -20, 265, -620, 703, -165, -208, 600, -201, 132, 188, -531, -17, 231, -241, 627, -346, -130, 690, -342, 151, 196, -836, 425, -12, -109, 435, -326, -134, 353, -524, 462, 28, -398, 244, -329, -160, 523, -181, -120, 364, -565, 277, 52, -341, 165, -116, -51, 399, -353, 187, 471, -385, 501, -261, -160, 421, -323, -62, 236, -294, 88, 68, -207, 228, -300, 61, 380, -272, 255, 106, -78, 278, -311, -119, 597, -127, -165, 266, -38, 418, 315, -202, 253, -201, -299, 242, -420, 222, -62, -471, 268, -123, -245, 284, -248, 94, 244, -475, 159, 13, -210, 224, -234, -155, 488, -207, -80]
2396h0K26l94O09l12k17P32p16J53K81p68M55N1k43L43l00Q7M63o82K80K18m63
2417b77M56j99p6L96l66J57K10q60N67Q7k78M24m54K07L17l50o7L18l51M70n6
2438B75n04N47m70K7M20o74O50k73m02N82k36K5M08m91K20J9m33O17k71n65Q66
2459C37l96J5L5p9K50J39n96M96l44j68O24n72M27k50r3K40P0n78O54l86k22P03
2481C06p26N00p8j6M8j13r9M32k16j40M69o08N98k65k79L76m74M89j98m42O64
2502B28l49m59O95l56K12K82nk63K93n97M29j87k22N66j57j03J67m74L01J31j35
2523cN09o07R0J57l29p4L11k06J32K98m39M40n59K32K12n29M38o8l14K96o7j30
2545b10M36m27P5L47m87K14J29l95N99m15L23j96k36J61K66l34Q8K69k89L06l45
$$ y = [-80, 146, -248, 361, 49, -168, 564, -152, 1, 282, -486, -31, 20, -223, 120, -180, -93, 370, -312, -32, 186, -277, 179, -20, -96, 300, -66, 91, 301, -559, 8, 95, -183, 241, -213, -6, 311, -39, -106, 212, -139, 331, 275, -229, 318, -152, -125, 295, -379, 271, -2, -404, 178, -58, -33, 375, -116, 104, 123, -310, 307, 36, -529, 337, -59, -44, -9, -88, 162, 301, -295, 201, -143, -311, 313, -259, 168, -82, -175, 65, 135, -443, 211, -175, -397, 306, -420, 80, 2, -14, 34, -79, -178, 254, 38, -102, 367, -241, 357, 92, -187, 189, -285, 204, 6, -436, 228, -121, -580, 115, -241, -29, 253, 248, -15, 278, -319, 110, -77, -299, 267, 110, 7, 174, -300, 1, 132, -3, 506, -101, -11, 146, -183, -257, 54, -152, -20, 278, -161, 279, -280, -48, 164, -365, 73, 5, -309, -13, -80, -210, 226, -201, -126, 221, -266, -52, 77, -318, 281, -134, 189, -7, -243, -82, 184, -150, -62, 207, -82, 224, -121]
2566a21K0J93m51M01J33j40O3J73l22J64m12J12L52n02P01l95J10Pl42J38K90
2587A72j28j21Q3r4N24l87n56M95k41N78l24k07J00J66O8J83m70j95M82l1j85
2608h8K59k68J79k96K75J84j96q9K51l50J69M28m45J29r5k1j8P4L2J73l02R6k27
2631a46k71N74j97M6K6j99K41L3l49K03P2M6J0j80p1L05P9o0l28l7L71n7r5J14
2655A30l71K38j60J39J28j40P2J34m94J55K99r4J27q0J26Oq9k66M25l65K07J5
2677A42k28L4J36k07K64k25j72R1J4M42k50K8q8K26j06J38k66J38l4l17L49qq1
2700B0J64l13J12J94j82l4m2K22r8J78r8k40J6K30k85J79j07j24O0J54j28L43
2722B21pj01j90m3J97j41p9K58o3k22M3K16j63jn6jl8J42R6j98N4K66j11l04r4
$$ y = [-121, -101, 92, -359, 42, 175, 35, 98, 271, -51, 113, -299, -187, 165, -337, 364, -31, 79, 86, -256, -118, 172, 44, -77, 6, -88, 436, 49, -507, -12, -253, 325, 1, -206, -106, 60, 128, 311, -159, -354, 128, 97, -88, 171, -97, 82, -214, 61, 245, 49, -40, 211, -139, 30, 458, 13, 142, 47, 26, 8, 82, 114, 287, -15, 81, -146, -417, 157, -40, 6, 32, -167, 74, 107, -242, -39, 33, 79, 89, -91, -162, 143, 222, 162, -166, -203, 168, 111, 16, 130, -241, -3, -163, -24, 104, -36, 36, 170, -324, -169, 130, 36, 163, 83, 209, 215, 126, -140, 285, -80, 127, 142, -86, -52, 84, -123, 141, -84, -256, -165, -151, 291, 41, 69, -19, 207, 101, 239, -27, 111, 77, -240, 109, 101, 20, 184, -129, -17, 177, -5, -39, -81, 141, 43, 221, 123, -117, -101, 129, -156, 23, -84, -208, -148, 6, -122, 221, 214, 113, -77, -120, 77, -64, -143, 115, 52, -170, -127, 89, -74, -75, -131, -132, -170, -28, 68, -130, -76, 190, 79, -225, -319]
2747c19J43j8K69l8J10r2n7J26O4j47J9nk4qj57L88j51j60K30l02K24J10n42M40
2771A03k16r2J77q8K42j93J11M1k3k66K22M14k99n3j89J99j7k95J47O7j69J56
2793b1J23j81J80j89J11n4j01K21r1J62q8j09L00m20m6K78J19m56L07m6N3k8L8
2816F2J29R3l22J75J26l04j4K30k86J94k10K88k1l39J70mrj71M9J28J40j72L50
2839B82j72k31K48l42N2L10j27KRk38J7o2K64K48n53L69j04M5m5J1L0p8m6P0K29
2864A88m19K5P2L76k96j09O3K23k42L03j30K8pl2o9K11l01K79o6l94K55J7J63
2887A38r9k20M73j61k33J04j83J89p9L3r1K70r9L2k54J02OL40n66L92R6l64P7
2910i7J63k75K98J03q8l74K19J65j0j50K13k35r7K07j30J37j83P1K0O3J05j41
$$ y = [-319, -176, -194, 75, 37, 147, 55, -2, 124, 188, 41, 60, 55, 31, 23, -134, 254, 103, -57, 173, -129, 95, 205, -337, 103, -113, -205, -28, -116, 126, -67, 44, 85, 62, -204, 18, 432, 133, 80, -109, 90, 73, -222, -75, -8, -177, -21, 102, -79, 101, -88, 23, -31, -132, 89, -2, 160, 72, -37, 263, -157, -203, 75, 194, -262, 45, -1, 52, 24, 62, 191, 284, -38, 137, 263, -41, -55, 175, -111, 83, -127, 161, 140, -199, -29, -33, -42, -213, -164, -36, 104, -68, 282, 110, -121, 127, -215, -163, 147, 20, 22, 31, -207, -190, -252, 12, 260, -293, 76, -28, 17, -28, -17, 13, -65, -111, -41, 188, -231, -206, -134, 242, -54, -163, -100, 123, -119, 184, 54, 82, 75, 43, -26, 185, -116, 163, 97, -297, -42, -25, 138, 39, -181, 292, 131, -102, 2, -181, 8, -71, -38, -129, 141, 42, 74, -180, -78, -72, 268, -298, 94, 190, -174, -97, 66, -209, 89, 192, 104, -270, -51, 114, 104, -46, 167, -68, -165, 42, -88, 49, -134, -63, -43, 20, 125, -16]
2932a6k05L82n55L59j3K08m61L34k13J17L20n01J42p6K75j31k2L2L8J8L11l08
2954C5j52R1Q2j08n7K00r5K4L6R3k10J46j68K9K3j0J79j45M3j22J73q0m9J75l49
2979b16L69ok48K54j60K2N0j02j02P1J1J74k22j5L19l59p6L44q1J69k33k30L96
3002A29j63J17j56J02J72k35l2J75j32K11j17l13K66J01k4N1k67m3J69q1M3rK7
3025il8K92m08J97j19J03J7r4J26%q6q8M6j6J48J5pN2n3R9j95J15k6r9K45k34
3051a7j58K61K31j06O9j67k98K88q3k12L64p4j07J83k37J69j07L5K3j16O0j43
3073a42M7K35j5n16M42O1j0j79Q1Q6lj97J40j77L5N1N7k09J96R2j35J25j75J04
3097fj51Q9J24j1j15J04j96M39r8m27L52j03K35l38L5J24j91J76m4r0K7K9m8R8
$$ y = [-16, -221, 161, -394, -35, -48, 160, -301, 33, -180, -63, 257, -244, -102, -178, 97, -34, -56, -24, 14, 32, 343, 35, -117, -26, 56, -52, -109, 91, -4, 20, 56, 149, -61, 85, -83, -54, -31, -41, 138, -7, 36, -86, 87, 7, -42, 133, -216, 153, 147, -101, 153, -7, 15, 65, -37, -139, -68, -57, 117, -105, -120, 199, -160, -236, 108, 27, 196, -37, -267, 129, -34, 83, -73, 29, 201, -34, -66, 109, -23, 188, 71, -242, 24, 125, 101, 152, -115, -158, 11, -70, -27, -36, -9, -47, 245, -163, 34, -85, 18, 35, -59, 67, 67, -19, -107, -61, -77, 71, 86, 79, 131, 78, 177, -18, 97, 71, -28, 217, -17, -175, 86, 317, 211, 280, 113, -185, 103, 20, -192, 172, 98, -9, 174, -63, 106, -1, 34, 57, -59, 1, -142, -95, 140, 125, -391, 51, 112, 102, -77, 4, 90, 87, -110, 30, -147, -112, -61, -4, -213, -17, 75, -60, 65, -110, -6, -157, -68, 56, 45, -70, 34, -162, 277, 179, -248, 104, 1, 236, -102, -67, 57, -134, 42, -2, -92, -65, -36, -84, 14]
3121A4kk67J77R5j16J71j56r0J28k94K94J09J24k67j4p7O8K72k79K97k43j3n1
3144a20J47o1kJ16N4m06J52K36P8o4k00J5J64j0k58K06k14R6j86K00O0j91M0J81
3168C3k07P8L40j83N7m4j55L03j34M6j37K29l28K65l82K41j66J34J23r7j4k3J8
3191cj24J15mq1J41j49J71p6j05j9J62O0J94l69L00l84J8L18j77pq0Q3r3K12P5
3216A78j39M0M3l3l89L54j41k1K0P0Q7j93L60Jk92J04O5k53q9kK7L75j92N8K3
3241F1J8j32J64O8k69K63j11k02J35j78J43J42k87K10PK7n6L6l5j48J44J4l9k22
3265b47K66j78LJ67L9J42M3m73N18m90K66O1j40q7K37j31M6p3j71L16j45j35M02
3288B36l02K84m76K32J02j5p5k24J6J90MK19j73J46m65M99O4j50o2j05K74q8k53
$$ y = [14, 12, -255, -78, 17, -99, 72, -84, -174, -46, -340, -46, 63, 187, -80, -94, -171, -103, 169, -110, 187, -56, -69, -120, 27, -34, -36, 80, 134, -272, -120, 116, 194, 130, -70, -55, 109, 99, -159, 47, -167, -71, -257, -57, 3, -188, -148, 33, -174, -96, 244, 61, 118, 74, -81, 222, 88, 134, -3, 226, -102, 163, -219, 22, -144, -10, 113, 16, 2, -21, -3, -127, -12, -16, -97, 44, -105, 66, -10, -115, -134, 28, 88, 282, -87, 213, -171, -153, 165, -12, -19, -99, -16, -109, 103, 178, 39, 79, 122, 89, -300, 54, -87, -108, -88, -18, 69, -124, 236, 237, -55, 49, 114, -139, -228, -230, -203, 172, -20, 38, 61, 79, -53, 111, 179, -90, 173, 62, -140, -5, -183, -40, 102, -185, 25, 32, 59, 3, 39, 4, -144, 0, 14, -25, -247, 19, -159, -156, 11, 50, 192, 235, -238, 280, -210, 56, 117, -23, -110, 127, -4, 42, -31, -202, 114, -31, -166, 236, -66, 218, -258, -26, 76, 61, -14, -238, -222, -32, -28, 191, 18, 164, -301, 198, 262, 112, 50, -55, 219, 131, -122]
3311a22j77J24J63L77m75L03j11o0j80L35p8k21P5lJ85k96K10J57j34RP9j54J19
3334A25k5r5j14M33L5k10j70K06k09k1J48l65M61j40n3%j82J57J48j52O7K9p5
3357bj28R9j01J46l1P6K9j15k6N6Q2j85K35j59o4k35M90k28RK7K76j75J3k64K07
3382C2mj08J45K5k23J25K0j78J37j54L16l4l09J06O8J60j52O7j29J91P5m55K48
3405c1K4K66m38Q8K03R8k34o9j46k2K95O5k04J10o5J24k17J33J2R6j30J3Q9r5
3429c5mj94N40l55kJ61K65m72J85M8k32M3K68o0r3oq7J20j55k20j5N53k37J1j70
3454a43N9p2J48L2J11j44k60K22J42k19K02r5K16m7j54R1k94J03j77K30J62j2
3476A01l9J21k15j6m8J97M2jk24O2j68j4L13k04L14j13k23j36K46r2J80r5O7m0
$$ y = [-122, -299, -175, -12, 365, -110, 193, 82, 22, -158, 177, 99, -122, -47, -50, 135, -161, 49, 206, 72, 81, 160, 6, 125, 100, 5, -109, 324, 359, 149, -21, 185, -24, -45, 103, -262, 199, 59, 6, 6, -176, -19, 129, -23, 44, 73, -2, -130, -31, -132, 14, -17, 59, 88, -27, -53, 3, 85, -100, 135, -24, -88, -323, 167, -61, -52, -25, 251, 76, 89, -175, 32, 28, -80, 65, 90, -133, -8, 12, -166, -29, -183, 133, 99, -210, -104, -36, 124, -28, 39, -90, 101, 176, -279, -31, -7, 259, -179, -91, 112, 210, -24, -93, -239, -261, 34, 99, -105, 5, -60, 64, -153, -20, -8, 88, -42, -29, 60, -35, -39, -233, 307, -48, -50, 111, 376, -96, 89, 137, -95, -52, 216, 156, 63, 57, -30, 90, -65, -285, -300, 253, 16, 27, -143, -84, -156, -8, 24, 135, -9, -269, -47, 95, -124, 78, -17, 199, 152, -2, 89, -205, -102, -279, -49, 113, 101, 62, 183, -32, -48, -96, 101, 143, 142, -82, -20, -188, -202, 111, -93, 221, 108, -115, -251, -5, -97, 83, -12, 55, 15]
3500A5Q1m9k10J45J63l59J69L5N3o5m3J31N8k2j69R0J03j87JJ35k59K81M32n50
3524b1J89j75R8P3j23K7k71J62n7J55Q4N7j99L12r5K4p3j00r6J70k00r4N8L9L3
3549b3l1J03J62l46K83j68J44q8l9Q0l10L06J04j71j23J20j56K79o6k0q3N5O5
3572G7l05K62j3j01K22l45K37lL0j19n7J81k49J56j19J13k12L48r6J43p4j66J51
3595F1J47r4j58R2o1k7J62j56K7J46o9j02K5K7J21j74J16j81J90k22O9%r2J62
3619Ij66K07J77Q4m02M00m35K57j68j10K3L39k20K72k18j60P7J00j60p5mL16j58
3642a5K2R6l9k23K88o3k89K92k98L85J15k85J23j73l29P68k25k43k8K17k14p5
3664a93K70J06p9J2k8K1j73m0L27m29J51j4K08k00k15K93J94j1j91k65M49k10
$$ y = [15, 96, 47, -163, -18, 145, -214, -45, -10, 43, -22, -65, 66, 124, 102, -67, 23, 126, -61, -60, 75, -184, 97, 529, -21, 168, -7, 91, 164, 41, 68, -203, -41, -98, 57, 141, 198, -1, 311, 216, 240, 167, 67, -29, 141, -59, -153, -95, -56, -23, -54, 49, 211, -135, 148, -20, 124, 36, -3, 77, -233, 73, 177, 6, -117, 3, -153, 126, 60, 40, -43, 12, 77, -228, 34, 21, -80, 142, -203, 34, 31, 61, -58, -115, 66, -183, -27, -146, -33, -245, 103, 7, 150, 76, -90, 61, 208, 114, -44, 48, -13, -40, 122, -34, -7, 139, 70, -32, -7, 20, 141, -33, 83, -98, 92, -130, -61, -61, -153, 9, -157, 50, 227, 311, -91, 309, -126, 131, -37, -147, -124, 215, -5, 267, 49, -111, -34, 66, -94, -169, -173, 143, -15, 7, 103, 64, -159, 129, 66, -223, 69, -229, 156, 271, -14, 109, -64, -393, 375, 150, -93, -121, 96, -118, -193, 77, 183, 104, 116, 88, 109, -64, -104, 223, -206, -55, -69, 139, -61, -276, 17, 211, 200, 9, -256, 193, -17]
3686a7o6N3l1K27j05j54N4j32K99j60j5K6p2K62k15J13j99O4N14m31J44j38M2
3709F3m3k0L08l52p6K02K5l15K83j48m7J61N7K22l46K24j33j25p7j5J46J54K89
3732D37l67m1j62J84K2K5l96M18p3q4J77k85K61k16J45J35j15m7K5j42L49l28
3754g8L5J26l1j24L33m30K54k8kk3k01J1K88l6k9rp1K9R7k19J81n3l5oP7R5q1
3781G0n5J36k00L19o5j43q9J02p3r3K22j9M9k79K25Rp1k6Q1J12m9k12L22j3n08
3806b48L33r8k5k39J66N3Jk2J79j64j80L66j76j53K44k5p0K38k05qK74j67p2J56
3830A58j80J64M8j21mj52N4m0J96j37J30l29J47j0J10Q4k38k65L95j79p0K08j90
3853b21L44j15K23N0k54J51p5j90J1Q0k58K29k42K60j41jM06m30J67o6J11N3N1
$$ y = [-17, -83, -30, -61, 166, 61, -93, -39, -171, 128, -32, -47, -21, -93, 169, -46, 67, -132, -68, 446, 15, 159, 21, 63, 20, 0, 308, -44, -120, 82, 107, -208, 75, -73, -120, 41, 98, 320, -26, 198, 65, -60, -137, -152, -6, 148, 437, 70, 29, -133, 51, 73, 98, -298, 120, 47, -37, 140, -145, 116, -100, 45, 180, 65, 18, 43, -99, 250, -78, -43, 83, 52, -72, 261, -169, 85, 57, 55, 32, -169, -158, 130, 94, 65, 56, -15, 14, 111, -108, 73, 20, -15, -21, 56, 151, 70, 15, 151, -49, 270, 205, 62, -27, 75, 2, -91, 131, 112, 161, -118, 107, 116, 45, 19, 100, 212, 163, -49, 273, 260, -248, 85, -13, -38, -277, -111, -58, -57, -79, 100, -64, -244, 122, -54, -207, 37, 12, -58, 180, -25, -33, 241, 74, 2, 158, -22, 142, 190, 69, 65, -87, -33, -73, 123, -14, 116, -213, -66, -76, 34, 118, -120, -385, 10, -169, -239, -31, -221, 123, 8, 231, 281, 27, 178, 103, -87, -76, 4, -254, -25, -267, -7, -148, -149, 257, -173, -6, -72, 39, 92, 143]
3876A43k96Q3J83k21Q6k70L79j74J97J41k59K50k68O8k35K38P3r4O1k39M34j91
3898H9k98L38j53n3on0L08j27l36J36K3o1J30J31o3J09M6k00n6K5J42no6O9j13
3923d1L56m93j51O13l09Q4l5nr0m3K8P8J16k53L5K48j54Nq3Lq0O9M4k20K32P2
3949B6M5%J06j55j26R2n2Q9n3M4O3j77J17O5N0m8j10o1J64J55j21q5j98J28L09
3974B67l13J78j98O0j8K49j2k69k19K18K95k49m9J47k37j07M10k47M04k18q6j96
3996a90K72j35j36K88P2q7j1j39P6K45j62k56L14mJ5l14K65r1N1K1j64K6J61k65
4020a48J34p8K57l15J44O8k50J48J4K98k58j20J29L70n95K23k1j82L45k94L14
4041A83k05j35j8J9k49L30J57l22J60j52K60O6J43N4k74K49k03k30J35K4%J8P3
$$ y = [143, -153, -70, 113, -108, -22, -292, 87, -87, 110, 251, -8, 242, -26, 42, -193, 45, 118, 24, 85, -154, 280, 89, -209, 129, -24, -77, -83, -133, 175, 48, -288, -152, -129, -190, -60, 71, 8, 117, 163, -37, -93, -68, 74, 69, 3, 72, -41, 315, -178, -329, 284, -25, 59, 24, 19, -71, -114, -86, -8, 108, -145, -110, 138, -16, -11, -94, -91, -171, -102, -58, -278, -46, 26, 71, 71, 177, 22, -104, -12, -64, 25, -28, 16, 79, -98, 19, 84, 134, 86, -24, -85, 79, 234, 113, 28, -170, -42, 267, -46, 132, -66, -6, -24, 225, 213, -56, -275, -57, 238, -11, -60, 87, -150, -257, 153, -94, 310, 92, 6, -190, 82, -53, -189, 99, 171, 84, 73, -66, 10, 255, 93, -163, 151, 147, 162, -152, 113, 22, 73, 94, -70, -44, 117, -148, -14, -92, 165, -150, -6, 62, -188, -40, -26, 272, 14, -106, 23, 393, -202, 21, 0, -182, 163, -131, 183, -22, -157, -175, -156, -405, -75, 82, -240, -80, -232, 28, 94, 237, 291, 17, 266, 63, -167, -32, -8, -8, 10, 83]
4064H3r1L1Q9j10k6LM1l5Q1j05m3o7J08j13K29j08j64L31j49n9m1n7L9Q7n7L28
4090B25j60J16K90l99o1j51J69p2L90m57r7L98j87Q5Q0j05q9n7L51j66k02k9J23
4113ej80k5K26J73j08k47R8J15k30K71k19J7K08jJ03o0Nj46Q6J50%l07L23l07
4137f0P0J0J50j06j63K32j5j73p0K18l2J36l69M9R6j54N1M65n01K49J6k27L6J34
4161D2m45K65J28J17m14P11m32J58j80J35K0K4j71rL32k19j77J80J06n1j37Ql7
4184d6K62k43j67L35j01j24K2J87K3k02m2p5J69j3j28K28k5M4l27J05L31m58K55
4207A0m7J34j14k0J90k85J36J15Nj82K95j82j40J3K02Q2l89P9L22j44O0p0k79
4230b09J18M1k58J98K63j03O4J19j47o9r1K77l20J12R4j75p0J60P6l0K52l22J49
$$ y = [83, -8, 23, 112, 2, -24, -21, 20, -15, 66, -39, -82, -149, -41, -154, 75, -33, -197, 134, -15, -74, -115, -172, -133, -46, -103, 225, 65, 181, 471, 72, 11, -140, 29, -43, 347, -110, -207, 191, 4, 89, 169, 64, -25, -82, 269, 103, -99, -128, -5, -185, -210, 16, 189, 81, -166, -68, 47, -183, 88, -131, -114, 94, 93, 196, 136, 141, -5, 81, 231, 231, -76, 247, -60, 10, 20, 170, 64, -99, 133, 118, -55, -125, 93, 61, 197, -172, -123, -27, -181, -130, 335, -166, 83, 99, -128, -92, 42, -403, -138, -10, 107, -307, 404, -28, 130, -50, 85, 105, 129, -42, -51, 281, 62, -115, 65, 171, 120, -17, -9, -46, 216, -27, -194, 141, 40, -84, -62, 125, 148, -54, -96, -171, -2, -15, -143, 85, 60, 104, -223, -118, 213, -245, 10, -37, 97, -17, -37, 153, -132, 4, 119, 124, -58, 237, 55, -85, -72, 130, 212, -177, -98, 224, 80, 140, 70, -209, -91, -50, -308, -110, 153, 50, 114, 233, 86, 17, -74, 203, -117, -5, 89, -86, -156, 4, 80, 50, 302, -20, 129]
4253A29j89J89L6k72J09P8j64m1L14l92L52l04n9K10k4q0K22l29K89O1r9j62J55
4276B9m1O2J85j48K08j80j92n5J61m8mR2L4M1o8L5M3o7r0Q3K3j51N0K4O7n7j18
4303h2o2J2K30k85L36k62j57L2K32pj69L43k66J84n6J20l8n8p2j34K99m0J20o7
4327A53j48k74J76J25r7K32k00O2j53jK05J46k02j8j02j5J85L2j43r0J66o2j07
4350a30J73J32nK0L2l04J53q8m3J04l25J92L8r8M16l44R3K01k98J49l2L0J9j19
4374c4p0N0k76M74k20j0K35j56j1J53K4m53K65J6J42j31j81J27J07Lj88M28j32
4397A62l13K25k53R7K82k00j84K78j49M9O6j18j70L85k50k82M88l05K84k13K13
4418I2MK41k81j17J92k54K05j56pM9k69M53L4m38K22j55K73k35l7J81j95K52K0
$$ y = [129, -60, 129, 165, -107, 2, 80, -84, -125, 189, -203, 149, -155, -214, -4, -28, -108, 114, -215, 74, 135, 36, -126, 29, -12, 50, 235, 87, 295, 115, -77, -132, 29, -19, -23, 69, 103, 144, 76, 111, 154, 87, -3, 80, 103, -48, 2, 26, 93, 36, -82, -144, -132, 98, -187, 149, -113, -270, -238, -6, -13, -182, 161, -105, 79, 23, 143, 105, 47, -25, -159, 140, 100, 220, 153, 5, -269, -93, 32, -65, 167, -33, 29, -124, -125, 80, 226, 24, 6, -96, -111, 74, 106, -37, -127, 39, -23, -130, 43, 175, 170, 190, 222, -82, 71, -17, -60, 44, -281, -89, -51, -149, 267, -77, 16, 217, -81, 68, 36, 66, 85, -34, -104, -54, -330, 144, -76, -86, 149, -7, -18, 135, 159, -294, -29, -13, 129, -2, -183, -56, 51, 54, -134, 294, 162, -151, 74, -179, -82, 200, 0, -184, 94, -55, -6, 60, -58, -228, 157, -93, -375, 113, -192, 92, -121, 92, 96, 337, 56, -61, 131, -123, 82, -74, -81, -32, -301, 152, 186, -252, -30, -185, 88, -147, -184, -3, -198, 54, 74]
4441G4J47j93Kj19J95j38P1j6q4O0J37k00k8J82j35K81l38K94J13l77J26r6J30
4464H8j99J72qk2j04o7M48m66L69o3k13L26j8k29k02qR4j3K27k01k0J72R8n1l90
4489b80K52O1M1j47J93k55M2j7R0m2J27j5j51j7PJ61j17o9J18m5J30R2k58J61
4513F2j66K8Lj34J23J14O8l8Q4p5j17J8k3Q6k07J67j75K52K07k75J05k46n3J49
4537d3Q3r2p4m4J59k92K24O8j92L55m6k98J76j50K62k14J76J16j80K54k4j72m6
4560FP4j39J15r2J46n8j64LK63j54k01J72p9K17j58J93N6k02k16M22j54J3j33
4583g0J46m8k8M1l06L60j76K08j39K97k48M6l56J31JK15j12j41J40j07P7j77K27
4606a9J63l77j6K08k62K65j89J95J10K7oj47L9P6j71k10L95Kk66J27L2P3Q3j40
$$ y = [74, 221, 28, 30, -89, 106, -32, 39, 23, -61, -1, 136, -64, -92, 90, -45, 236, -102, 192, 305, -72, 54, -42, 88, -111, 61, 53, 31, -73, -140, 308, -158, 211, 148, -65, 261, 243, 14, -188, -196, -102, -115, 112, -89, -109, 63, 161, 110, -280, -28, 33, 74, -73, 120, -135, -93, -110, -20, -62, 65, 50, -101, -118, -111, 50, -67, -136, -18, -63, 67, 159, -99, 62, -104, -76, -73, -207, -84, 30, 98, 60, 144, 69, -48, -30, -53, 33, -174, -7, -182, 70, 277, 2, 107, -139, -192, -43, 40, -52, -126, -170, -11, -303, -79, -11, -203, 152, 106, -192, -16, -166, 96, -118, 58, 174, -6, 248, 224, 52, 6, 80, -59, 56, -36, 110, 52, -112, -109, 154, 0, -201, -29, -108, 109, -49, 144, 200, -2, -218, 204, 50, 63, -70, 76, 28, 0, 41, -265, 95, -81, 127, -12, 285, 37, 83, -273, -142, -141, 74, -38, -179, -39, -146, -69, -246, -19, 144, -233, -249, -41, -303, -38, -227, -32, 78, 105, 99, -48, -9, 67, -104, -314, 81, 83, -183, -56, -24, 49, 132, -8]
4630hJ48K8j56K48o62K63L54k34L6n6M2Pj48P2K12j06p9j19J13J97l65L16j13
4653a0l1N6J81k4k44J28R3k82J03J5k34J64J96j62p8R0J25p6N1k02J69Q3m59M96
4677A48j32k68K27k20L11JQQ6j34MJ2k31J03K09j51j22J06L29m04K22j44R4J88
4700B42j65J27j70J10k02Q9k15J70J1L45l25J09o4Ok42M2J38J70J26o55K61K1
4722g1l04K55o4J52K02O3k11k49L21k12m5L8J70Q3l32L9M8K08r0J0N2J8k06L3
4746i2m6J44r0Oo6J25o9k05L72j26j64K45J15j23N0m8M6l37O27l16K10l74Q4J13
4770H1j25L09j44j67K00M3q3j3J4m10L17j18K58k45K80k94J95N3l55K56P1Mm86
4793c59N43q3p4N8J7n7l28J43j41K63L2q7J72j13K29j80P9jk40j15K82j35J23
$$ y = [-8, 140, 168, 12, 260, -402, -139, 215, -19, 17, -39, 3, 10, -138, -66, 146, 40, -39, -158, -45, 152, -213, 103, -10, -41, 15, 196, 172, -72, 56, 149, -133, -30, -15, -249, -85, 111, -51, -129, -39, 86, 10, 61, -141, 28, 111, -348, 148, 16, -252, -25, -245, 66, 67, 75, 161, 27, 31, 43, -188, -85, 124, -27, -149, -43, 286, -118, 104, -40, 54, 242, 77, 204, 34, 144, -58, 31, -184, -14, -3, 342, 17, 126, 62, 68, -174, -132, 6, 176, 302, -353, -92, -71, -375, -120, -184, -32, 170, 233, 22, -227, 94, -118, -163, -125, 45, 128, -204, -165, -117, 91, 1, 11, 63, 81, -125, -92, -138, 6, -84, -78, -144, -19, -88, -293, 79, -47, -211, 34, 149, 26, 76, 28, 74, -263, 364, 48, 258, -116, -32, 81, -44, 265, 121, -46, 154, 197, 114, 101, 115, -295, 22, -96, 162, -83, 197, -97, 98, 151, -204, 52, 123, 127, -359, 184, 101, 27, 85, 102, 45, -283, -140, -281, -18, 14, -73, 99, -14, 215, 35, 114, 113, -127, -242, 40, -95, 28]
4816B8K01l50K93O2l27M7L28m35L40l77J85J49k58L19k27J0J33M6n6Q9P2l56o3
4839a47J39Q1m8J11k46J04J1j69O4l7L9k03K03L2J47L9l5j59j76K78J11j70N4
4862B3p3qk5rK28q6k83K72m2j7J16j63m0J47j93N0L76j19k98L0J04r8j47L77j1
4887A11l71L19k13Q7J62l8m46L49j63K04j14M64l87J39Ko0l48J72K83k14J00R3
4909A31j67J20j94J99jo1k12K62n0Q2j88J3J91k09J2l8j34M12k20J21j00KJ09
4932H0J9j68J12R5m70L47r2M35k76M9j64N5q4P0J05l55J98j57K7L45j46M3l1j10
4956g3l4J64K65k01R9q5j76J3j77L94k84j59N07k68J92l6j15J1p1N0K50j58k45
4979a37J08o8J41k48J78L3p5K30j45O6k88K15p1J13j36k35L58m9J48j63Ml9oL7
$$ y = [28, 229, -121, 172, 234, -93, -46, 282, -153, 187, -190, -5, 144, -114, 205, -22, -12, 121, 167, 111, 200, 272, -84, -147, -8, 73, 25, 136, -110, -6, 5, -164, -100, -137, -98, -301, -98, -66, 81, 120, 85, -74, -250, 28, 139, -31, 23, -50, -58, -83, -92, 136, 50, -233, 39, -3, -20, 96, -67, -107, 40, -153, -103, 273, 154, -144, -114, -10, -108, -255, 122, 111, -260, 59, -154, -67, 95, 57, -389, -40, -203, 1, -113, 351, -36, 103, 105, 45, -303, -131, 152, -62, 38, 131, -36, 84, -110, 89, 88, 27, -185, 77, 27, 109, -79, -66, 125, -84, -72, -110, -244, 168, -52, 69, -31, -29, 80, 99, -69, 43, 138, -332, 15, -77, 358, 82, 131, -33, 22, -62, 8, 113, -242, -44, -201, -174, 171, 25, 68, 37, -73, -107, 57, 322, 121, 220, 135, -41, -28, -205, 189, -95, -254, 253, -15, 177, 141, 26, 37, -34, 16, 266, 108, -137, -29, -97, 44, -204, -26, 7, -68, 162, 17, 83, -205, 10, -61, 52, -84, -319, 39, -10, 138, -25, -21, -60, -66, -29]
5003b9p5K29j14P0l93M04K8j0rj10j75K09Q4q8O1l14L1O04l69j83J39p8m1OK28
5028A05Rk12J28l72K81J00m4l05M29k13R1j88M3K22k70K37m9p0j03J82O0J97l33
5051g5mJ2J15Q6k54O1j4K14k83n8K89k07K93l76L36k09R2j10J80N7j57k20J70
5074f2J14j71J85j96K13j52O5r0J59j16K00k41m0J11m9J42J61j57k10RrK05k06
5097a35M1o4J23k02L8j42L40K43l04L04m13L57k72K81n91M02K33j54q2K02k77
5118g2K32k58J65m3n5P2J44k78K00j24pk9j70L18l61K92j81Q4K7J56L7j20K1O7
5142A17l06J65L20m24k00L96L5j58Q0k68L03N2l95M57J9j85J66o8Kl5k74J92r6
5165a05J72j95J47P1l5j28k1j33J92J45m5K2j53Lr2L16j25J41j56K7J72k59n9
$$ y = [-29, -104, 125, 11, 81, -312, 92, 120, 110, 101, -9, -184, 25, 109, 21, 82, -232, -201, 403, 34, -149, -10, -88, -129, -123, 105, 114, -98, 30, -342, -61, 39, -5, -310, 119, -94, -3, -191, -148, 74, -196, 41, -8, -78, -181, 1, 61, 258, -75, -79, -67, 48, 134, -120, -59, -73, 141, -142, -200, 89, -118, 175, -201, 135, -74, 18, -92, 88, 145, -12, -232, -62, 52, -119, 66, -130, 83, -69, -4, -94, 65, -51, 149, -92, -132, -21, -70, 72, 233, 76, -134, -125, -134, 71, -135, -94, -158, -35, -237, -199, -341, -1, 242, -62, 242, -171, 186, -86, 195, -396, 6, 239, 85, 3, 205, -72, 160, -98, 67, 24, -31, 41, 185, -93, 107, -17, -24, -53, -223, 95, -266, 26, -155, -71, -44, 112, 149, 29, 50, 117, -189, -24, 296, -128, -328, 68, 103, -55, 25, -243, 60, 112, -283, 174, 193, 8, 174, 106, 108, 73, -201, -9, -105, 67, -128, 19, 90, 55, -73, -94, -227, -35, 110, 65, 87, -66, -63, -155, 161, 36, 177, 21, 48, 220, -39, -98]
5188i8K07N2o6k34J28m0n4mn5Q4J0pP2j48K87k25K2r7J43RR4k30J38LL8k45J06
5215a10J75M8l47M47l56J22L4J03k75K78q3K9j72Q8P6p9O5j65K12k36M91m20Q7
5238A2J06k04j4R3k02P0K18ro6k25J57P1P7o8J10P0k61K41l19j00L98j15J84k93
5262f9J74j96K0k55J98J85k44K29O0j60j32K03k79J96M0P2l1j92K16jk25J28L
5285f0J9L1r0K48k2j72Q7noK43m30J84J62j81j56J99mj77m3K32K2k16N0j08K92
5310I9p0L8J14k95j01K48q0K04q2l8n8j03J53j4R0j91J21Rp3J5q4o6j30K42q2
5335a34J05K32l37K1L21j47J28J5j55K8R6l09k9J37j57J55k33Q2K73M1j90J66
5357A09j64q0L37j75M1O9j56K22j52j64l1j00R9L7J04J35k23J4n1RJ50O5j96J15
$$ y = [-98, 109, 161, 95, -139, -11, -51, -105, -109, -164, -80, -70, -77, -5, -153, 134, -91, -69, -166, -23, -14, 80, -150, -12, -9, 29, -216, -110, 65, 113, -234, 213, -143, -21, 13, 116, -159, 119, 36, 65, -107, -19, 57, -22, 43, -122, 90, -146, 345, -75, 12, 118, -86, -100, -7, -209, -139, 79, 70, 4, -221, -64, 7, 84, 16, 126, 196, -65, 176, -143, -243, 155, 40, 224, -69, 105, -91, -71, -326, -128, 57, -187, 42, 102, -58, -190, 13, -266, -70, -30, 42, 11, -181, 35, 34, -191, -63, -60, -41, -10, -100, 148, 126, -46, 41, 36, 30, 273, -157, 27, 189, 8, -148, 51, 47, -130, -173, 59, 81, -135, -85, -193, 99, 29, 67, 181, -114, -215, 33, -47, 157, 75, 37, -21, -124, 29, 15, 105, -86, 35, 44, -29, -14, -98, -164, -294, -52, -134, -29, 203, -134, -113, 208, 61, 189, 204, 49, 77, 173, -136, -165, -28, -185, -30, -263, -181, 92, 133, -57, 109, -55, -135, 202, 27, 68, 137, -19, 203, 51, -113, -144, -244, -145, -108, -4, 131, -92, -78, -129, -120, 30, 95, -101, 14]
5381A4L10m75J76K82o63M77K9k72m7J47J3q5m8J31P2LO3j76n8K03l51M2L72k05
5405d6J13O4j66n2J86j18P4k44o2M36j37n0JJ25j70J4Q9j44m7J13o5J28o6J33
5429A09p8j58l60L98OK65L7k76K26j89j47J01J04K08q1K42m17J72J06n95L58q7
5451e6O5R0j14K28l68P5K28l8k45m1R1L32k69mnk60J35M9M8J7K14m19M85k44J7
5476A1o9J01qr9K75l62l1K88ol75N72l48P4k74J76L3M3M0m9k3K82k25p5J76r1
5501C6k9K25l36j45P4J16Q9k95L83n4K84j56k84J53j27LQJ65l70L02q1r5K44p
5525A03P0O9k16j6j10J15k3r0J08j92O7J17k7l47K78K80j46j45j99K34J20k72
5547b22P1l1J48J53j50J74j10J0m7P3l1p0l3K24k71L53k82K33l28J00m4o3L42
$$ y = [14, 324, -151, 25, 307, -356, 121, 150, -122, -169, -22, -9, -94, -142, -11, 61, 64, 127, -49, -107, 96, -255, -213, 159, -46, 67, 131, -35, -87, 99, -19, 55, -189, -251, 185, 48, -2, -1, 124, -46, -32, 57, -87, -134, -21, -86, 42, -24, 109, 31, -127, -487, -89, -83, 182, 219, -57, 169, -20, -167, -66, 38, 246, 165, 407, -10, 162, 268, -327, 31, -56, 9, 99, -15, 213, -155, -80, 148, 110, -135, -176, -85, 247, -22, -26, -31, -291, -156, -107, -59, -42, 172, -247, 238, -6, 11, -58, 43, 35, -64, 211, -151, -182, 106, 100, -275, 297, -51, 23, -251, -75, -42, 1, 41, -8, -31, 251, 26, -49, 127, 36, 7, 232, -104, -249, -175, -59, 30, -265, 118, 64, 348, 192, -92, 61, -66, -63, -55, 110, -260, 42, -39, -134, 110, 103, 173, 242, 26, 10, -100, 15, -8, -98, 10, -182, -115, 2, -25, -372, -94, 186, 40, -105, -304, -70, 50, -222, -151, -182, -34, 119, -31, 143, 33, 43, -4, 69, 38, -32, -65, 159, -112, 241, -41, 192, -136, -36, -80, -143, 199]
5570A99o3j15j00J41j7k35J88J87j89J08l6l1j28R1P0j82N1j26J21Q2J09j63q6
5593a24J27Ok16L98k20j16M60j80k69q2P19m04j29J82p2O1q4m7o0j39J80j8j83
5616b10k5K25R0J13q5ok2k17OJ09J5k0J46k48K28J12j90J62k84p9J84J55k10J57
5640A06M9k34k66J35J80n8K75l00K71q7n8Rn0J32j82qK07k7r4j36J30j87L19n1
5664G5n9R1k46K79R7j3o6j96J58j47P8M07o12M3J14r9L34k74J71k33L66m43L22
5687A47j35r3p5j03J95J68j14J48j52o8Q9OO5p1J05J99m13m4L18j41K1l17M28
5710A63n7o0nJ13l92J36R4L7j69J6K56l55J82j60L48k76J77j89K30j94J68j09
5732d6p7kK23j27j65L01m2p6k05L66j16L1k18p2M3M55k03o0j22l5J01K84k50Q8
$$ y = [199, 136, 21, -79, 62, 45, -190, -2, 185, -4, 104, 68, 37, -91, 0, 70, -112, -61, -187, -66, 16, 125, -38, -124, 3, 9, -207, 191, -29, -145, 315, 135, -134, -216, 503, 99, -30, 152, 80, 141, 57, 10, -50, -189, -9, -27, -210, -235, -10, 80, 193, 108, 102, 80, -137, -131, -22, -7, -27, 119, -129, 99, 211, 21, 183, -101, -180, 4, 159, -51, 106, 155, -79, -345, -210, -30, -88, 187, -113, 158, 71, 13, 22, -28, 104, -78, -86, 121, 94, 0, -136, -6, -193, 126, 75, 16, 107, -139, 140, 237, 224, 158, -38, 120, -27, 51, 458, -154, -111, 3, -96, 238, -36, 135, -98, 268, -175, 147, 12, -81, -156, -259, -64, 104, -10, 138, -14, -82, 7, 13, 78, 7, 112, 311, -102, -146, 172, 31, 52, -265, 163, 106, 46, 41, 154, -238, -102, -8, 29, -140, -124, 132, -223, -41, -201, 147, -129, 48, -141, 89, -105, 63, -46, -123, -125, 98, -29, -194, 107, 65, -11, -216, 150, 34, 65, -153, -225, -182, 273, 70, 10, -112, -147, -46, 238, -12, 76]
5756G6j35J47k10J93o7lR1j23q1K39j13K61l53O3m3QK04l34J47N1l00M29j20j1
5780A6J10l46K87j34J0j56K53J44k67j75M54k00k30K21L4M8o1M1L3k2J52j55j98
5803a41J3K79M8l9j8j77j29K07q2o9J21l4l40M66r5j30Q6J88j04q1J29L6j9j29
5827a4q4M12k47k0k49O9J45k14j9K53M6J4n18M13k47J4J84P1J6p3mJ60j15K44
5851B37k75K21k98J92J54j83j04J92j14K0rj86J50J67j30j41j09M39j98q8J99
5872A36j59O3J4j83K21m4k40R4K89j11r1j2J52k36Q7j23L40j86rK16m36K76K0
5895G8j52J74J79l20n3K91j56j91L93l20K24l76L14j99m9K25K09l13k6J63J5j24
5917a4K91m57Q9%M95k93k52J15L11l23M9J16P3k71J85j36l1P0k19J99j56r8O1
$$ y = [76, -59, 88, -122, 71, 4, 1, 92, -31, -112, 127, 14, 275, -78, -15, -58, -50, 154, -180, -33, 18, -282, 147, 27, 16, 126, -220, 67, -67, -57, -213, 40, 184, -83, -258, 196, -4, -234, -13, 21, 69, 8, 49, 82, 60, 212, 57, -141, -128, 151, 199, 160, 142, -35, -164, 43, -39, -108, 13, -21, -361, 105, 10, -120, -34, 154, 50, -31, 98, 134, 115, -14, -98, 314, 67, 47, -202, -133, 12, -202, -221, 32, 78, 92, -426, -13, -260, -246, -62, 9, 25, -48, -52, 108, -7, 237, -38, 183, -115, 77, 231, 48, -56, 136, 22, 42, 33, -153, -3, 164, 34, -107, -216, 223, 25, -63, 136, -23, 40, 54, -129, 92, 48, -192, -98, 191, 80, -11, -23, 129, -107, -20, -143, 197, 11, 2, 218, -218, 58, 78, -74, 100, 279, -41, -94, 197, 41, -150, 243, -77, 147, -229, 85, -114, -163, 62, 271, -42, -68, 95, 110, -14, 277, -180, -91, -91, 404, 111, -141, -26, 285, -38, 11, 127, 200, -71, 114, -22, -53, 17, -202, -3, -159, -257, -196]
5940a96K87j19J58l22n0J87J95n5l24J13J76q9m0%k0j09K23P7j43o7K70PJ06k42
5964B3J7l0r9Q3kL0J26K8j26j7j54K12J02m39K37J67j89J19p3P2lO9l10M4K05
5989I2M3l3k47J97j54J13%r0K45q9N4n6J10n6j40M07l12o1l2Q8n6K23k69R4N6
6014A27k27J48L05m46n7p3J1K09j05m0q8J43R2m0l4J3Q7N6L16l12k83L81k28j15
6038a60p5N58k54l1j66K78j15K8J97l88q1K98j35j60kJ04J13m1k6K50k62M3O9
6061D2L9M5j27J58j32k60J86K62k50q5R3l4J01R6k07J11q4J50j38K47k98J96J57
6084B68k50j05K80j39p9j49K72j45O0N7k15N2j08N03j56k9j1K5r8k46N0J73j59
6107a49L89l37o5L71j97N0J52j08j81lKj62K26J07l72J54R3J60j61l7J03R1J9
$$ y = [-196, 91, -28, 130, -192, -242, -55, 140, 85, -239, -126, 50, -39, -79, -79, -99, -208, 15, 92, -51, -118, 152, 159, 265, 23, 40, 10, -89, -6, -8, 22, 148, 176, 50, 33, -121, 91, 193, -246, -9, 158, -31, 88, 15, 87, 84, 153, -157, -113, 92, 135, 102, -145, 52, -102, 11, 11, -79, 166, 77, 131, 75, 185, 129, -11, 396, 84, 23, -9, 79, 23, 246, -23, 71, 127, -100, 48, 353, -93, -150, -223, -212, -3, -108, -148, -236, -93, -1, -41, -75, -62, 25, 81, 397, 85, -198, 183, -45, -160, -235, 323, 69, 38, -128, 150, 35, 63, 260, -128, -209, 89, -46, -206, -208, -104, 9, -32, -58, 192, -70, -27, 42, 81, 126, -1, 157, 25, -235, -49, 213, -37, -122, -29, -63, 38, 134, -73, 38, -46, 104, -34, 213, -85, 111, 268, 18, -87, 193, 54, -25, -174, 98, -47, 13, 70, -145, -93, -201, 302, 146, 117, 106, 131, 33, -213, -163, 10, -149, 240, -97, -162, 209, 12, 62, 214, 106, -75, -78, -76, -238, -12, 95, -277, -123, -30, 130, -31, -68, 35, 126, 145]
6130A45K4Pk24j83K39J04r5J53k79K77j87q7j07K12j50N4M09k40L04o67L17J76
6152B02m3j12o5l5K05j50P9j41O8J17j40J16k24j11L4N79l62pj16q8J97O8J14
6175A85j85J26q9nK12l50j3K59j73K5q2r9J28nk0R3J54k5j14j09J8q0K63j96K5
6200e7J36j88K3J93j27j28M08j69k18K40N7j91J51j52l1L0O0p9K29k10K48j62
6222F3m8J29m14N9J68M4j7K1j1O6Kj38j24L98j02K2l9j45J93j42L7o4J24J4j00
6247dJ66j98k14K40j14J97r1nJ97j47k86K28k41J92L2K58j56j40J31k17J65k53
6269b60J31K6J75j65L67l89m3M37k86j79K52k55j62J36Q1J84k37K46k00O6k0K01
6291A06r1p4K93n06K77J19L2j45M7J36j04j21M6J42k30R8K28k22k87K95L39m11
$$ y = [145, 169, 176, -48, -231, 8, 112, 17, 170, -109, 168, -19, -106, -213, -1, -151, -97, 312, 72, 376, -291, 26, 202, 159, 47, -18, -53, 152, 2, 81, -60, 8, 125, -15, 101, -123, -234, -200, 379, 17, 10, -106, -194, 3, 71, 185, 0, 126, 37, 32, 244, -106, -119, 140, -33, -8, -90, -189, -61, -66, -86, 7, 161, 136, 22, -87, -69, -149, 114, -82, -57, 79, -109, -86, 107, -20, -148, 260, 91, -127, 113, 170, -21, 130, -22, -53, -23, 37, -42, 187, -23, 225, 63, 15, 144, -270, -211, -43, 1, -16, 5, -6, 60, 62, -76, -200, 198, 96, 118, 79, -66, 127, -15, 22, -42, 82, 96, -4, 162, -36, -250, -10, -124, 73, -18, -23, 174, 27, -259, -31, -272, -80, -48, 210, 54, -86, 45, -172, -7, -260, -129, -103, 72, -93, 274, -115, -158, 279, -7, -186, 66, -189, -351, -215, -134, 50, -187, 59, -141, -75, -95, 106, 15, -59, 234, -272, 5, 124, 156, 11, 58, 194, 90, -31, 15, 157, -73, 25, 253, 31, -256, 39, 378, -33]
6313c3q9K73k04L18l45N6J91q7R9j97LK29l91R0J68j64n3Q2J36J2oj58K15j70
6337b5J87M0j27J87m10K03J07j40j90L3J5M4N0q7K52J78k10k17K10l95L64PP6
6360A52k37j85K59K9L00j82j73J04rk48K44j02J72n01O24p5l35K39l65K43K73
6381B27j97J4j61K99l13K31l91L27J13k86O1M0r1J49o9K07k07k11J10k36O24k03
6403C7N7q9k2n7l3O8J46k4k7n2o2N4J87j51N5j82J0K11j60j88K9M18l55n9N6M6
6429h7O6k51K05j25K60j6j62j0L4K7J15O7j03k33N5Q5K67j13o8K2k11L23k28J67
6453H6j16J35k58M57k86o5J09n3J36j82J4j17L6J65k43KM3J41J56m94K58r4K06
6476C6j3J20j01m45M61j28J03k47M16l34M06j26J25l34n9L7J50J36k14K8mMO5
$$ y = [-33, -122, 151, -53, 265, -80, -24, 167, 80, 179, -18, -15, 214, -177, -87, 81, -83, -136, -54, 82, 94, 88, -70, 145, -25, 162, 202, 75, 262, -148, 55, 162, 22, -168, -135, -120, -76, -26, -113, 139, 317, 107, -110, 100, -295, 69, 76, 152, -85, -270, -11, 18, 318, 136, -37, 67, 58, -190, 54, -48, 124, -377, 247, 172, -163, 76, -289, -46, 227, 30, 44, -117, 182, -131, 100, -291, 36, 149, -137, -76, -36, -127, 22, -47, 160, -47, -258, -148, -384, 240, 37, 94, 5, -17, -74, -107, -39, 107, 83, 56, 4, -58, -4, 183, 32, 87, -95, -85, 126, -34, -222, -193, 225, -130, -189, -133, -87, -21, -272, -67, -192, 68, 52, -110, -120, -86, -59, 56, 123, 20, -213, -158, -73, 194, 81, 13, 35, -176, 147, -81, 86, -30, 105, -153, 304, 18, -47, 62, 9, 145, -37, -23, -140, -104, 61, -182, -180, -137, 4, 160, -334, -76, -170, 36, 23, 143, 42, -403, 58, -70, 33, -214, 202, -132, 274, 148, 273, -61, -120, -83, 67, 203, -11, 17, 13, 17, 82]
6499H2j49J49j19p8m9J14O5k8K1j00j9J76n5K9K5J5m4K7k07p3K65K34j66k59J07
6524c7K09j50l8o7n5J2k18L03J28j05J64J32l58M0j35K04R5N2j73kk0q9K40o7
6548F5q1q4K12k70K31j95R1J10J38l05O8J77o7j89Q7J35k16K60k58L62m65L87
6570A93k1l51J53m4J29m2Nm8j67J65P4j96K0m3j54J92R4K38k0Oj36R2l39L88n4
6595A34j50k04o9J83K97l9j54o2j1N9j15O0M3J49j78J56Q3j34J96k70Mo8J46J06
6619A62l7r8j24M09n26J4K35O0lj84n3n3L01Jj87R9J97l12K76k23k1L1J9p7j44
6644b38Q0K19k02K18PQm7k54J18JJ63J19L4l47J87Q8l68K08J79j90P1k77L77k08
6668e4J45R7Km00J85j70L24J13j10M8o8j91R9q0j94lK05k4O9J0oj9j24J73j4p6
$$ y = [82, -67, 82, -37, -115, -164, -50, 15, -13, 8, -92, -111, 65, 10, 39, 64, 79, 35, 62, -145, -218, 47, 281, 115, -144, -37, 172, 22, -16, -83, -138, -126, -344, -41, 87, -18, 146, 278, -80, -40, -175, 29, 124, 176, 3, 1, -19, -108, 132, 65, -16, -100, 112, -158, 73, -122, -31, 79, 217, -88, -20, 157, 90, -99, -12, 123, -93, 167, -91, 271, -194, 193, 172, -179, -26, -70, 59, 17, 22, -26, -193, -28, 46, -150, -130, -173, -327, -135, -41, 197, 177, 183, 47, 139, -200, 188, 134, -16, -220, -289, -106, 191, 152, -2, -64, -75, -16, -131, -71, -28, 121, -57, 99, 182, 48, 244, -26, -22, -90, 56, 162, 125, 27, -97, 312, -214, -200, 35, 95, 92, -92, -145, -198, 103, 104, -83, 16, 213, -99, 177, -46, -67, -36, -17, -94, -238, -158, 61, -141, 77, 84, 92, 45, -209, -91, -90, 73, 192, 226, -121, 66, 154, -214, -6, 173, -17, 54, -223, 154, -54, 91, 188, 190, -210, -25, -195, 129, 242, 132, 180, 112, -79, 20, -60, -254, -257, -52, -76, -7, 3, -3, -22, -146, 27, 13, -63]
6694f3J9o3J24k79J16%l6j5J61J29Q4k31K9J54j41J80j9o2k01J52l3J18N4j15
6718F2l5J26j42K6J42K48m22p8k5k9J01j57LJ65l6R1p4R6l72L58m5k17K37K64
6742B87m02M3J40j76J47M8j61J01nq9Q8K4k1Q7J8m53L33n62O65n1Q5j06j5L53
6766C78n68M1m8K2J61J09r4J21o3l27L68j14J13J73l52J16o2j4K43J8l8j73J64
6789A74Rk37K12np8J51j49J27j84J62Mr4KMo0L0J3J22p5k03L25m87L34j31K9Q
6815CQ4p1j69QK2J93J21j31k50L49k00M2p8l2K50k57K02L2r2o4j33J8M11j06p
6840A45j08L8J37k19j07K01M4j51J21j17M2Q5j10l2J23j19J3P7r5j2j19K47J60
6863B44m71N3l3J82J60rK08k10q7j74K19k06N6k5J45O2l7nj01J26j08J36n0M8
$$ y = [-63, -44, -107, 17, -262, -146, -146, -182, -197, -36, 93, 177, -54, -25, 129, -12, 168, 149, 87, -114, 38, 5, 123, 177, 62, 27, 153, 11, 37, 179, 427, 5, -73, -98, -127, -26, -183, -180, -15, -51, 40, -34, 62, -310, 48, 3, -214, 23, 287, -115, -72, 68, -108, 39, 87, -74, 27, 22, -67, 21, 45, 24, 111, 129, -324, 9, -553, 112, 61, 146, 40, 25, 378, -190, -149, -197, -175, -14, 95, 1, 122, 59, -268, 100, -14, 99, 272, -80, 36, -26, -40, 203, 221, 183, 10, 174, 183, -54, 158, 153, 75, 226, 77, 204, 20, 182, 186, 92, 94, 98, 38, 68, 81, 203, 128, -75, 250, -237, 97, -34, -5, 3, 87, 16, -153, -145, -123, 70, 191, 60, -190, 159, -41, 1, -77, -109, 141, -116, 86, 118, 26, -38, -171, -153, 258, 152, 145, 37, 75, 212, -7, -114, 87, 131, -20, 101, -16, 26, 111, 1, -31, 92, -27, -14, 63, -32, -44, -163, 84, 244, -227, -174, -207, -25, 135, 126, 334, 124, 37, -137, 82, -124, -68, -93, 52, 114, 77, 72, -29, 97, -11, 125, 75, 123]
6887A23k03K37q8j86J92j32P3K8n3K89l17p6m6L31l8Q8j68l1J18j63j14J01j75
6910b10K49q9M8m9J10j21p3M4J62r8J00OK7m9k04L24j14J8j07k5j45K85j74O3
6934b2J46r7J2p0J0N8K3kR7l5j52J5j40N3j02J56l6j3K71k72R9j73P4j4J86j47
6960g5m6J91n6K55k30l1p6l4J99L2l1k56l6L97l54q4J53K1K60n5j77N7Q4k10J70
6985F8j45j17K66j73K39Pj88O4J53J15k0l88P2PR1mj71O0J27J11j79j95J68l26
7009c58N60k7l01L32q4N8j99J50J43l03Q2ljj90K66k29Pp0qK8J75L7j83K4N5O
7035c3J68k29K87j86j06K95k38j54J80j88J62k45L14kq9L23m47L33K0q6k7r5K6
7058a7J12j55k7Kj7J33J03m13L79j17J15l8k82K48l31L06O3k34K39l30J46J74
$$ y = [123, -80, 157, 69, -117, 75, -57, 16, 44, -9, 280, -37, -113, -159, 172, 134, 222, 54, 23, 141, -22, -136, -35, -210, 39, -50, -2, -51, 59, -62, -135, -91, 71, -27, 73, 79, 106, 57, -147, 177, 63, 81, -26, -51, -196, 89, -85, -22, 124, 27, 39, -31, -21, 37, 60, 58, 155, 120, -32, -17, -157, -104, -206, -50, -86, -99, 172, -100, -1, -174, -100, -114, 72, -75, -121, 70, 14, 269, 39, 8, -68, -102, 97, 129, 98, -158, -194, 203, -151, -235, -82, -61, 199, 144, -33, 24, 108, -102, 68, -77, -194, 72, -101, 138, 145, -43, 21, 174, 289, 269, -119, -47, -40, 51, 47, -124, -64, 63, 174, -5, -200, -32, -358, 202, 175, -126, 206, 122, 180, -19, 131, 274, -29, 53, 50, 49, -141, 125, -104, -97, -167, -175, -147, 28, 65, -118, -94, -39, -33, 135, -94, 193, 7, -99, 196, -42, -196, -16, -204, -42, -287, 27, 25, -64, 259, -188, 145, 165, 79, 52, -43, -17, 95, -60, -87, -85, -102, 31, 134, -279, 100, -17, 98, 60, -222, 26, -305, 1, 64, -170, 69, -261, -115, 59]
7080E9J2j27j0K96n31K80R6j35k80K56J37k52M2k9L38j13l6K41m53N04k87o7Q0
7103B1R3k16M5m0NJ96k40L11l68J82N7j39J75J41l11K03j98l9KP5N6N1P0m19R6
7128a91K16mj1o9L2o3J45P2mq1J45j58K94k51r3Rp2J48K83m31O9P7Oq4j07K10
7154H7L5n9n50P07l9R1k23m1j06K8K76o6Pk51L1o8j1M31k23l09L08j0J92k97%
7179f0J38m3k27O8J42J25k30p2M7N2L2K15k44J99j89N4L6J32j01k41K08J04k54
7202a09k3M4rJ5j58r8M34r2m00N78j79m98N06J53l49J25k3O3J23j62J53j38K7
7225a7R3j61K60j80l8J77l88J39J49k49K70O9k8q5j08j6R3J49j15j95L69k44J9
7248c7J18k3k64M26l38J34J75k14J0p7j08K08j79q0J71oJ18Mr4J67r5P7Q2j22
$$ y = [59, 71, -56, -66, 230, -301, -21, 75, -60, -340, -84, 53, -199, -157, -186, 152, 39, 3, 244, -209, 295, 8, -59, 21, 114, -102, -57, -97, -92, 104, -136, 175, -193, -11, 46, -93, 82, 223, -88, 115, -83, -122, -120, -45, 11, 62, 132, -287, -191, 25, 21, 10, -59, -27, -90, 55, 127, 123, 42, 187, 29, 323, 72, -21, -12, -84, 64, 347, -84, -15, 62, 68, -16, -123, 87, 122, 63, -487, 220, 181, 272, 49, 8, -98, -70, 206, 140, 147, -104, -73, -141, -152, 279, 56, -253, 55, 45, 237, -60, -60, 78, 35, -192, -124, 18, 143, -87, -159, -112, -60, -28, 187, -57, 142, -47, 7, 43, 175, 74, -167, 41, 145, -109, -132, -88, -97, -82, -240, -338, 96, 4, -396, 182, 3, -495, 11, 164, -185, -60, -83, -20, 103, -59, 94, -44, -17, 76, -85, 175, -5, -43, 134, -254, -115, 34, -215, 55, 124, 96, 11, -97, -113, -20, 129, 14, -181, 188, -56, -37, 81, 58, -206, 220, -118, 16, 191, -23, -13, -90, -198, 10, -169, -249, -78, -84, 34, 38, -56, 111, 16, 93, 175, 53]
7272E3Ll6J95k68o4J62k90L47l20L46P6m84J88p7J55m6J51j29K26j93J01k28J11
7295b1R4k49P8K77n9j9M6k35l5J18J4Q8%n9k7J91r7j68k3L8K14j91K74o9j83k6
7321b9j15j2P8j23K36o8N6K82ol60J89j00j60J32j75R4Q4n5o2J09k15K08Q6o0
7345A4J33j17R9j01o3J23m4K05k10N1k06O9K26j19j65K5L4p8J73J23m6j11l21
7368c06K11n1J4N9K67p5j34j78j28L56Q2rl39J63L3J14j79M2Jl7K52j92J36k4
7392G8j90P5N5j4K57j12j61j20R9L07m64P5K89j77pK7j57L13k83J54k20J47k17
7415b46M32j42J31r5P6J16l83J05k64L17j8m7J25j35K01l24p1K1M01N9q8o8kk8
7439G3j23j00K17j43j09L78k38k9Qj01M13j32l61J94mL16J03k83j22J0j41K17
$$ y = [53, 56, 20, 215, -53, -117, 45, -245, 102, -218, 128, 204, -280, -92, -169, -14, -60, 91, -38, 188, -5, 96, -132, -21, 73, -176, -98, 179, 120, 101, 147, -88, -123, -5, 9, 97, 97, 38, 11, 202, 105, -63, -86, -48, 166, -25, 249, 180, -3, -29, -144, -156, -78, -201, 35, -33, 23, 305, 299, -61, 128, 28, -132, 0, -175, -81, 3, -52, -114, -5, -220, -12, 74, 14, 147, 30, 129, 28, -35, 88, 44, 249, 39, 90, -116, -47, 179, 60, -105, -80, -46, -124, 49, 172, 126, 15, -306, -95, -146, -132, -73, 194, 119, -15, -193, -321, 35, 117, 108, -231, -68, -35, 79, -100, -58, -57, -94, 158, -34, 102, 78, -112, -37, 18, 4, 261, 149, -12, -132, -33, 274, -190, -115, 174, -3, -10, 17, -140, 173, -110, 44, -176, -29, -246, 186, 44, 175, 80, 156, 272, -111, -6, -270, 47, 29, -18, 107, -28, 173, -151, -222, -201, 200, 259, 171, 103, 101, 73, -50, -150, 67, -76, -185, 193, -45, -74, -66, -167, 246, 114, -247, -53, -57, 259, 362, 79, -43, -33, -174, 43]
7461D3K46j54k26K40k97K25j59L51l61p4J43n6n1m1J44K7J36j07K15m00q8nM04
7484A55l2J15k74k7L7O5j90J02J93j17k26K64J1M8J3k82R1K64l58J17J09l04M78
7507B52N5n39L04r5j98M2J93O9k9O6q2j55J40R2j4j24k5j28J66j98K56k4O7k82
7531a91K17o5l8K21%qK1j89J44%j55L41l47l7Q2q6J05J64k6k63L58l05O8O3j28
7556e4N11l07q6j69l0j01L98j85o2k0j19J85n2J43J26j75j67K88om6K9l1j0J15
7580A75j63m6o7o8M2K61j9j31mo2oJ87J43o7j45j87K82j2k35qj89O3J62m8K03
7605F1J5j30k3K86m48L04j00J74m30L82j39M7k4L40k01k60K83m09N45l06r0J53
7627C0K4J55j23q0n4K01n7k03Q3k03K35k7j10n4J89m00L76j59K22K5k03K14O3
$$ y = [43, 289, 135, -91, 149, -148, 77, -82, 269, -92, -166, -23, -79, -130, -171, -27, 0, 136, 29, 244, -156, -244, -249, 155, 123, 238, -36, -63, -26, 39, -151, -49, 144, 27, -199, 65, 76, 124, 137, -145, -54, 210, -148, -31, 78, -226, 252, 307, -232, 72, -23, -221, -179, 14, 83, 54, 120, 38, -117, 23, 115, 101, -23, -48, -176, -10, -208, 48, 24, 91, -191, 26, -39, -77, 144, 144, 136, 157, -32, 112, 112, -43, 298, -49, -86, -4, -90, 15, 179, 153, -110, 248, -57, 11, 74, -54, 457, 150, 64, -105, -135, -236, 162, -23, -85, -105, -224, -39, -91, 52, 178, 3, -164, 124, 118, 72, 101, 70, 60, 175, 12, -34, -101, -169, -127, 134, 115, -16, -20, -82, -88, 99, 242, 175, 30, -157, 125, 113, -122, -130, -319, -256, -94, -142, 61, 76, -54, -77, 209, -239, 65, -35, 139, -291, 91, -48, -1, -25, 315, 114, -146, 137, -272, 273, -33, -123, 30, 54, 209, 86, 6, -48, 153, 96, -107, -24, -227, 8, -19, -129, -183, 6, -394, -18, -177, 45, 70, -133, 81, 144]
7650A44l3k82R0K62k54j2j52L66j69P5q8kj97J70p9J28K58j60p9j5J16q1j09J90
7674H7r8L99l22j43L40k12N8j05J19k96L55j49J11j97l7L2j17q8L52j55P0j88
7696a84Q8N4n4j93R7j37K72N8J97o5j10n1o1K08j25J52k86K28j24K23k37J62j27
7719a5N5n0K59j72k29qK92n7k22J14n9m9K17N1j12j9J16j32N0k2J16j07q4K00
7743A33l42k2L47p4j27J36k15K79j40K66j78l9l9j40J14j77J05L64k91K4J55l22
7765a83N01l25O7j53mJj3J79k25q4L53k2K19k95j10J85k19n0jL93j44j47J58j15
7789c4L3J45k07P4k56J36N9N0K30l38K78r2j73K04k1q0r5m0J81j82j62L03J41
7812A54k23q9K77m72M36K67m25L68l47N5O0M4q7L09m31P2J76J33l14j3R7k9j1
$$ y = [144, 111, -171, -81, 181, -73, -85, -237, 129, -40, 35, -53, -55, -252, -82, -161, -33, 225, 65, -14, -29, 87, 6, -103, 87, -11, 388, 66, -77, 263, 51, 109, 4, 123, -173, 182, 33, 144, -53, -90, -58, -175, -263, 89, -66, 4, -184, -96, -42, -96, -289, -192, -329, -57, 1, 198, 133, 23, -28, -89, 119, -6, 146, -140, 88, -36, 187, -50, 112, -15, 40, -10, 249, 77, -152, -160, 132, 75, -147, -33, -92, -141, 76, 127, 15, -4, 112, -20, 30, 8, 124, 17, -67, 133, -209, -231, 116, 42, -85, 51, -164, 115, -25, 241, 63, 24, -15, -155, -41, -218, -113, 251, -40, -16, 139, -183, 318, -7, 60, -93, -97, -96, -109, 70, -155, -239, 114, 92, 311, 16, -94, 91, -128, -178, -179, 214, 70, -77, 81, -34, -1, 144, -63, 11, -245, -109, -50, 0, 230, -108, 170, 78, -95, 109, 88, 8, -87, -127, 54, -128, -290, 13, 154, -69, -158, 119, -353, 83, 350, -75, 293, -54, 1, 61, 105, 18, 327, -104, -32, 144, 277, -37, -50, 47, 18, 7]
7835GmJ05k9j8M5o4j21L78k91j24J80j03J41Ro4k34J85p4J97k7n3q3M32m53J04
7860D1L2j4l20L22l5J03l72K04j78J30P7k7K56m5j00k90M1j29R1K62Q7j87k24
7883b75K34n2P4q8J3K24j90M5n0k6p5J20m3P1K39k05O4j44k5n7J08K72k68J29
7907I5j27L7Q4q8J98k63K22j87N1m7n1L4l1J58j7j94N2Q5j9L13m62K50J2l25J89
7932c1o1K97m27K34K6O2j19j05K21j80J61P1k49J10m24K98J07K12j80j90J03j5
7954g9qK8q8L91k01l65P0K08o0P2Nk3J43J00j87J36j54O4j14M5R5j83l5K89k4
7979A25k07K03j26O1q5K10j75L0M0j1M6r9J4j70K26j24j31J85M0L15l66K32l13
8002h0r4K92j91J3j41K00j4M3J73k30q2q5J89J88k84M3J56l12L05L7k61j51L32
$$ y = [7, 3, 108, 79, 61, 106, 42, -79, 299, 8, -116, 64, -39, 102, 111, 47, -187, -2, -76, 121, 94, 41, -42, 390, -63, 41, 73, 59, -261, 61, 26, 129, -243, -39, -217, -87, -10, -37, 219, 174, 74, -216, -175, -304, -213, 49, 136, -51, -275, -41, -93, -19, -107, -94, 130, -60, -15, -65, -91, -166, -46, -89, -18, 221, 16, 80, -64, -89, -146, -38, 234, -34, 95, -32, 5, 89, 1, 199, -64, 158, -29, 22, -25, -76, -42, -73, 85, 68, -126, -74, 11, -8, 305, -157, 93, 105, -220, -31, -92, 205, -222, 12, 38, 100, -19, -124, 97, -83, 78, 149, -100, 10, -414, -116, -9, 203, 23, -167, -64, -79, -87, -59, -147, 244, 43, -322, -252, -44, -104, -32, -27, -50, 93, 193, 6, 142, -12, 52, -62, -17, 78, -105, -140, 149, 125, -82, 121, -5, 56, -29, 181, 6, 36, 76, 65, 111, 12, 26, -144, 82, -42, -173, 12, 52, 367, 1, 233, -80, -174, 118, -73, -60, -201, -1, -15, 28, 201, -29, -111, -196, -7, 181, -103, -60, 96, -216, 89, 126, -135, -286, 46]
8025D6K84l76p2K66k38L20k28k7J64k35K12j62J3L2K23k11J32p3J31j88J54K15
8047C82k57j56O4j08J67J7j55ON5l5pR9Q2j7m6k49J7J11j43J82K3J00j39J48k38
8072i7J80j22J0m6K20j65O6k6n3J38j37J29j63p3J02j01M7J48l8j52O2J06j29
8095i4J00R5M47n28j37J02J7J80k13k12K85O4o0K0J36l00K20Q3K05m56J8J6p3
8118h5J19l0l2J8k44J57L03M5l15M7J99j32p2L8J07m0Q0l22J52q3R9J83l16J8
8142a06J11k26m0L39l8j09K13o7o9k61L60j66O8k18J43J25k04m6J16o9l0K43k0
8165D9J7j37K54l49K66r7j68K42j65Q0K41l72J5K81k35J25K0p4p5l12K43R0J67
8188A06L4j40J66
$$ y = [46, 330, -46, -118, 148, -90, 230, 2, -25, 139, -96, 116, -46, -33, -1, 222, 11, 143, 70, 201, 13, 167, 382, 125, -31, 33, -75, 92, 109, -46, -40, 15, -20, -27, 72, 154, 137, 91, -158, -141, -30, -173, 9, 32, 132, -7, 141, -97, 83, -39, -29, -75, 145, -20, 46, 20, -33, 105, -32, 97, -66, -139, -37, -138, -91, 57, 19, -133, -71, 35, -94, 6, 101, 548, 20, -117, -15, 2, 182, -31, -243, 42, 106, 46, 66, 202, -98, 122, 205, 410, -46, -28, -12, -85, 34, 4, -28, -10, -254, -97, 206, 251, -64, -17, 182, 50, -22, 16, 123, 83, 163, -159, -7, -90, 9, 192, -124, -106, 5, -221, -261, 78, 40, -69, 144, 77, 8, -253, 107, -59, 9, -209, -66, 59, -145, -191, -75, -144, -174, 69, 49, 66, -71, 183, -166, 100, 3, -165, 77, -88, -8, 233, -139, -124, 157, -78, 47, 67, -7, -82, -394, -151, -61, 106, 140, 0, 166]
8191A66
$$ Imaginary data points
##PAGE= N=2
##DATA TABLE= (X++(I..I)), XYDATA
0@%%%%%%%%%qJ6j6J6j6K4l2M0m8N6o9Q2r8J14j33J57j81K06k38K77l16L57m06
32b16M61n20N86o59P37q25R20j022J136j261J396j543J705j883K075k284K515
49A318k770L052l362L706m091M524n016N580o232O999p913R022j0401J2165j4506
64g925J7765k2603L0476m5279Q1806l19387m36628R62060Q6971l14456k02994
75a70194p995M01948j80950j58775K44285l25245J97314L10528m75067J3624J83201
86C2674K6711J72116m14879r066M35894k64150l7115O6370j42953L04253j15607
97E4248k02697K00300j97098J64853K56239l98112L9251J17613p7469J87130k09592
108f5334m3289K27486k13287J51856O8732l21933K48364M6017j83267J33074j36520
$$ y = [0, 0, 0, 0, 0, 0, 0, 0, 0, 0, -8, 8, -8, 8, -8, 16, -16, 24, -24, 32, -37, 45, -53, 61, -72, 85, -96, 110, -128, 149, -167, 190, -216, 245, -275, 311, -348, 389, -436, 484, -538, 598, -663, 733, -810, 895, -988, 1087, -1197, 1318, -1452, 1600, -1762, 1944, -2147, 2377, -2639, 2941, -3291, 3708, -4205, 4817, -5584, 6581, -7925, 9840, -12763, 17713, -27566, 54240, -265147, -701775, 260285, 347256, 32800, -170194, -178189, 223759, 42809, -115966, 128319, -196926, 388, 310916, -164151, -150527, 32674, 59385, 231501, -183378, -192444, 243450, -20700, -57815, 8555, -134398, 169855, 54248, -148449, 51851, -145247, 19606, 275845, -122267, -83016, 34597, -42872, 144258, -65334, -108623, 118863, -94424, 57432, 126164, -195769, 52595, 98612, -84655, 48419, -88101]
119h8101J19768J38053l43962J57273J17799k16151J59839m7996k1762J22832
129I7592k20892J69626P9388l35200K39424J15761k03651N2327j00254J37377
139C1498J29759l00961J49394R2005k19435J73822l3052p8849J37411j52159R6479
150B5912O4360k51116J85862M5014j55464J53273q3202m122R0115j83087J55427
161D2972L5286k19019K03841j7722j28205J45957r6865L3723N3801j64803J77161
172F6127N290j54510J54373j06086k3815J60358j61929N4742N5071j35054J58765
183G3332o4335r8355J81988j17488j2794R6134j22328J15280m2630j32127K27342
194A04019p5545j15587J27045q1176P0556L0977j43264J41877n0715q7459J71757
$$ y = [-88101, 31667, 169720, -174242, -16969, 100830, -115321, 44518, -3478, -25240, 97592, -123300, 46326, 125714, -209486, 29938, 145699, -57952, -5625, -105879, 31498, 161257, -139704, 9690, 101695, -117740, 56082, 23030, -55819, 81592, -70567, 25912, 90272, -160844, 25018, 70032, -85432, 67841, -15361, -19483, 70632, -112455, 42972, 78258, -140761, 63080, 45358, -82847, 63110, -33755, -32, 53769, -111034, 66127, 71417, -83093, 71280, -34806, -58621, 101737, -60192, -5450, 49621, -85433, 73332, 8997, -89358, 92630, -24858, -37652, 58482, -63846, 51434, 8804, -123323, 104019, 28474, -87113, 39932, -41244, 29312, 60289, -82975, 58902, 8187, -79272, 92485]
205I2485j23360j4093J21837j37573P2991K3001r3903J39238j02134n6084J63776
216H6181j14796J4765N7458j12043J17604m5517q6387J60824j06374j6740J31843
227H6818j25646M4453J8975r6614J34145o2045m7936J24862j35659L6214J00787
238G8354j31680Q0697j2326q0259J36153q8930j7530J07429j30732O1448L9666
249D2290j16630J15026m0835m4309J23008j28615K5502J01758j38454O7299K0933
260B6973o7667J02584j02645r596J32281j13406M2510K5109j23238J29718q230
271C4393p5262R2861r2003K9467P5400j37493P5436K9086p7536J04162p6466k5916
283d3871J07342j11702M6604N2952j16418R7270j1995p1950R3039p3810L0195
$$ y = [92485, -30875, -44968, 76869, -60704, 12287, 35288, -58615, 80623, -21511, -77595, 86181, -28615, -13850, 43608, -68435, 49169, 3652, -82735, 78089, -28285, -45025, 86818, -38828, 5625, 24600, -72014, 62131, 86, -47850, 77012, -58647, -22433, 78354, -53326, 27371, 15045, -65214, 70939, -17991, -35521, 71908, -58824, 2624, 42290, -74340, 40686, -149, -44458, 78550, -50065, -24563, 77195, -61259, 6040, 26973, -40694, 61890, -40755, -50351, 81930, -31476, 11034, 36143, -87095, 42623, 34393, -40869, 51992, -40011, -10544, 64856, -72637, 2799, 31885, -45651, 58511, -17955, -43871, 63471, -48231, -1627, 51325, -65093, 32177, 20182, -51768, 41271, -32539, -2344]
294b344P0783j37361P2465L6274q0234J02559p3992m8712J15994p6696K6959K4489
306C0184j05541J16143p326q5443Q9531o7477J9480P5516j25968O2333L4509q8748
318e2807R5172m7193m0749R8846q3429K4678M3348q8767R8233k1911q9021J00560
330C6960n2536O1P5935j06569M3051L3153p0095Q5604n3783m2627J05444p0167
342a5569J1431L6427r4353Q6003L117p8492Q6026m9494q070P4129q7310M1804
354E649K6717p8251P9865l7187l8133R7951p5796J700N5230q0403O4838K050p1001
367d6771Q0907m3399p910P0433r3353K9976L6778o9033P7611l1751n2518R2328
379D3298n4952O06M8306q1130N5986J0177o2380P6656m4527j9476P3368p6900
$$ y = [-2344, 68439, -68922, 3543, 39817, -40417, 62142, -11850, -60562, 55432, -21264, 5695, 30184, -75357, 40786, 33460, -51983, 37548, -29929, -10449, 65067, -60901, 1432, 35941, -52807, 42365, -4828, -45577, 53269, -30160, -5482, 37866, -50901, 47332, 25421, -63600, 36960, -15576, -15515, 60420, -46149, -3098, 30055, -40040, 45564, -8219, -50846, 54598, -15569, -4138, 32289, -62064, 23939, 27056, -51436, 34590, -14904, -22974, 51155, -36155, 5649, 32366, -45885, 33980, -3207, -41340, 56611, -19185, -17485, 37745, -42658, 22180, 24230, -46771, 34136, -9263, -17173, 53260, -40093, -10117, 26661, -42372, 35239, 3488, -49030, 43298, -11654, -11048, 37258, -43872, 12114, 22291, -40089, 36567, -7960, -27436, 45932, -30968]
391c0968K7621L9323p6981O1417q225m0989P2219o0742l241N3520p1224M9410
403A1140J3734o5189O9880l4219k4911P2148o6556J3640L9154o4017N7542j0062
415A2284m9981O9652m6274j291N5580p2953L9306K0357o2969O7567k5044l7098
427c0864O1056n4422K1722M0143p4966M6896Q70m1793O9625m9568j4978O2287
439C6008o2882K9264K2582o1577N8520k0467l2812O4310n0782J1985M0061o8231
451c4021M9434N907n6546N9827l3114j0289O1111o2339J5132K1927n3047O2239
463B6221j4710m0960N8148m5084P912M1869o9327M0533J6196n2966N2863k7237
475f542j1862N5837o1247J7800L2958n4446M7597j7437l7824P2493l9814j2165
$$ y = [-30968, -3347, 35976, -41005, 20412, 12187, -28802, 43417, -17325, -20566, 32954, -38270, 11140, 24874, -40315, 29565, -4654, -29565, 42583, -23973, -10333, 28821, -35196, 22346, 12284, -37697, 31955, -14319, -15610, 39970, -32983, 6323, 26680, -36289, 31278, 6234, -30864, 30192, -24230, -2508, 37635, -37331, 9565, 10435, -31358, 38267, -11301, -26279, 36008, -26874, 2390, 24972, -36605, 21915, 1448, -31364, 32946, -17836, -5851, 34210, -34021, 15413, 21320, -35226, 24601, -8513, -18802, 42309, -20030, -4898, 17029, -36018, 26221, 11511, -29449, 28699, -16385, -8473, 33396, -35931, 4602, 20798, -32168, 20695, -6542, -18404, 37433, -23814, -6014, 26944, -27502, 20095, 2658, -35166, 37327, -2487, -14652]
487a4652L7985n6170M2575J6624n5581M9841k5174j3474N6015o2387J3452L7058
499B6112n6479M5059o295m0097O2051l7096j0266M3324n1860L3645J1240n2119
511c2781N6972k2822k5679N6747n1606Q008L9612m8623L6124j0036l7126O3616
523C2406l5659j4918M3329n0371K8656J7235n0727M9947k0140k6025N7813m3482
535a1936K76L1030m3741M3530o829m7662N6851k5208j0583M2180n1541K7789K1490
548B5646n4677M2629r803k1982M9930m7408K506L6548m4760L6928p325m6495O2651
561B4388j8053k0733L2909m5642L1284K3503n5968L7311q152k2137M9591m0024
573a1723L231L4101n0642L2926Q153m1354M5126k1295j2040L8744m5523J9502
$$ y = [-14652, 23333, -32837, 9738, 26362, -29219, 20622, -4552, -18026, 37989, -24398, -10946, 26112, -30367, 14692, 8397, -31700, 30351, -6745, -17011, 26313, -25547, 8098, 19338, -32781, 24191, 1369, -24310, 32437, -19169, -11161, 28451, -20172, 15952, 5916, -31210, 32406, -3253, -18171, 25158, -25213, 3443, 20678, -30049, 19898, -242, -26267, 31546, -11936, -11660, 19370, -24371, 19159, 12330, -35332, 21519, -3689, -14272, 27908, -23633, 4156, 25646, -29031, 13598, 3795, -18187, 31743, -15665, -13159, 23389, -21371, 15557, 8232, -38263, 24388, 6335, -14398, 18511, -27131, 4153, 27656, -28312, 8999, 847, -21290, 28301, -11723, -8492, 25609, -25033, 7893, 16046, -25308, 19818, -1477, -13517, 25227, -20296, -794]
585g94K3057m9294L7280l658k4231M4250l9265j207L7451m5076K6667J0291m1424
598b5953L7795j5241n465L7641n1726J3782L3207m1755L0686q399k8508M7751
610B3815k8185n959L0753m2525K7384J2131l9938L8322j5904j4162L9259m3110
622a8119J0383L0664m2672K5460k056k2658M3524l2015r043L6109l5634K2708
634F651R458m0895L8956j0975k0764L8331l1201N486K3984l7380K8395j278k9635
647b0867M0225k3295q337L3595l7882J5369J4809l3901L5550j1801k4538L7640
659A6567k4860M011K2751l8229K6871K853l1709L7968j9358j0204L4918l3377
671a1798J0899J5159l3188L2542r410k2661L9157k6167j939K3353l5900K6972
$$ y = [-794, 22263, -27031, 10249, 6591, -17640, 26610, -12655, -13862, 23589, -21487, 5180, 15471, -25953, 11842, -3399, -8864, 28777, -22949, -9167, 24040, -17715, 12971, 4572, -23936, 23815, -4370, -10329, 20424, -22101, 5283, 17414, -22524, 15798, -106, -14268, 24991, -18119, -7736, 22928, -19744, 5716, 3660, -18998, 24526, -7489, -16532, 19577, -16057, 6651, 16109, -24786, 14170, 3195, -17569, 20762, -10439, -4953, 19031, -18349, 10046, 8768, -20867, 19358, -3937, -12274, 21321, -16561, -1192, 13617, -20284, 15266, 3465, -21073, 16567, -8293, -4282, 18469, -19760, 7111, 9964, -21745, 16223, -3135, -13339, 21579, -11798, -899, 14260, -18928, 13614, 4204, -18457, 20700, -5467, -7406, 15947, -19953, 7019]
683G019P053l5629L2413j3147q695L3133l5502P838J8696k9978K9123r266k4485
696b1427M0089k2004m780K5735l4984K0104J1248l0634K9012j2993j1125L2769
708B1010l2520N553K0930l1688K5684k983k5287L6871j8649p913K3373l3114K0361
721A628J3816l2344K6024j1625j0823L5904l2458M62K4166k8549K3861j217k8322
734a9477L2674j4509n187K3514l4593J7685J5835l1944K6617r188j5393L3579
746A9613k8887o59K3842k6680K1057j552k7191L3585j4040q722K4599l0787J6770
759I48J7243l3708K1675n506j3706L2091k5467j929K2593k7410K1431K018k8501
772a8228L0031j1771r294K5615k9446J0943J6830k9312K1265n747j5478L1597
$$ y = [7019, 14072, -21557, 10856, -2291, -10986, 22147, -13355, -5517, 13179, -16799, 12324, 3058, -21427, 18662, -3342, -8122, 17613, -17371, 2733, 13981, -16653, 12359, -634, -11759, 21010, -11510, -5957, 14973, -16715, 8969, 5986, -19301, 17570, -1079, -8992, 14381, -18733, 1628, 15444, -16900, 9124, -2501, -13324, 22580, -9878, -9416, 14750, -13799, 10062, 8845, -19477, 13197, -1312, -6499, 17015, -17578, 107, 15942, -16002, 10615, 1427, -13966, 19613, -9274, -9933, 13909, -12771, 8286, 6734, -20457, 13128, -912, -9634, 14965, -15822, 948, 18191, -15517, 6158, 652, -13054, 19037, -6430, -8359, 14234, -13176, 8255, 10273, -18228, 11803, 32, -9262, 16353, -13093, -2150, 14680, -14632, 6633, 886, -14592, 17005]
784A7005k2943k743K3113k6597J8685J930k9533L1353o800j1781K2061k6899J2143
797a006J7631l0122J8993l605j5123L1823k1743o362K2783k5467J6120M950k6674
810a7802K7538q284j0667K4013k5809P718J6717k7581J9625j521j7619K9069j8587
823c190o430K2672k2913J3860M433k4968K6530o647j1913K2892k4691N636J8609
836A3880k6264J6988M2j7208K6519j6569o517K0518k2865J3243Q451k4676K2724
849H266o877j2644K4510k1225L104J8166k4523J5495R68j6875K4792j5746p149
862i738K2440k1609R949R089k3954K1950m253j4436K1652j8615K478J7899k3723
875a0871J4321K267j9233K2926j1445o504K1293k1597P489J2261k1854J7304m320
$$ y = [17005, -5938, -8681, 14432, -12165, 6520, 8450, -21083, 10270, 3470, -8311, 13750, -13149, -1006, 16625, -13497, 5496, 1891, -13232, 18591, -3152, -9514, 13269, -12198, 3922, 8872, -17802, 9736, 1452, -9215, 14798, -11011, -3293, 13424, -14157, 5468, 3947, -13672, 15397, -3190, -9620, 13052, -9861, 3999, 8432, -16536, 9994, 3347, -8566, 14326, -10365, -4729, 13880, -12384, 4604, 4646, -12562, 13957, -2612, -9129, 11389, -11476, 1767, 10218, -14458, 8266, 1389, -11255, 13255, -7970, -4866, 13300, -11223, 4272, 5240, -11635, 13157, -2589, -9738, 12702, -8907, 1042, 10131, -13823, 8127, 3874, -10562, 11090, -7525, -5047, 12852, -10871, 3450, 5717, -13516, 9410, -2035, -8539, 12754, -8843, -1354, 10907, -10947, 6357, 2037]
888B037j2902K2689j6244k94J7125k2446J2717M726j9290K0639r023q201K0388
901A1921j8831N615J0516k1644J7189j771j3886K1639j4479j896J6707k0841J1835
914B074N712k0027J8675o016p266J9492j9741L845J2907j9703J5757j821j5634
927a1746K2545j0986n023J4720k0064J1580P403j9540J7929o105r333J9902j7306
940f024J965J2914j9064J5040J27j7530K1110p629o203J3671j7920J1275Q166
953I898k0748J5881k656r335J8337j6755n29J4747j6455J2287N88j6871J9533
966G922p753o160J4935j8227Q727J0279j9578J4515l021j0655J9285j4566r74
979e271J4786j7064J1372J470j6233J8977p580o902J6075j7515P014J1693j9326
$$ y = [2037, -10865, 11824, -4420, -4714, 12411, -10035, 2682, 7408, -11882, 8757, -266, -8467, 11921, -6910, -1295, 9221, -12423, 4766, 2995, -10891, 10748, -3731, -5627, 11080, -9761, 2074, 7786, -12241, 6434, 418, -6848, 12644, -7097, -3252, 9655, -10048, 5709, 3888, -11746, 10799, -187, -5210, 9510, -10554, 1026, 8429, -11111, 6818, 713, -8620, 11282, -6024, -4059, 8855, -10209, 4831, 4958, -12572, 8538, 909, -5294, 8377, -9543, 1732, 9898, -10850, 5031, 2375, -6960, 11377, -5378, -5907, 8840, -7615, 4672, 5260, -11611, 7922, 169, -5991, 8944, -9283, -556, 9723, -9855, 4660, 1639, -9016, 10269, -4297, -5271, 9515, -7549, 3823, 5293, -10940, 8037, 457, -6445, 9630, -7885, -871, 10822, -8504]
992h504J1723k377q573J9261j5321l253J6132j5656R437J770j6131J8271o560
1005B19p173J6379j6043M484J1898j7347J0824k201r220J8956j3398l976J5669
1018I071j4877P935K580j5646J8004m818q467J4322j4689M912J1488j8538J0431
1031A708O0r441J7832j3366m114J6230j4138O628L379j5296J6498m329p911J5038
1045H778j4360L950J0352j7146J0862J510j1275J5857j0268l670J3453j4715P485
1058H13M925j5680J5503k938r029J3300j2516L857J0406j7320R771K918j0977
1071f967J4318q845l858J2769j3529O981N702j5145J3280j979r110J3484j0957
1084c856J349R876j5130J0053K288j1746J3384p120m551J2451j2541N764N506
$$ y = [-8504, 3219, 842, -7731, 11530, -3791, -7044, 9088, -6568, 2869, 4639, -11492, 6779, 219, -6954, 9425, -6618, -2134, 9764, -7583, 3241, 1040, -8180, 10776, -2622, -6598, 9071, -5806, 2129, 4709, -10937, 7067, 2249, -6218, 8104, -6585, -1673, 9815, -8723, 1708, 1768, -7673, 10159, -3207, -7321, 8909, -5229, 1399, 4778, -10518, 5980, 1651, -6260, 8778, -5582, -1632, 8720, -8426, 2436, 3946, -7329, 8528, -1740, -5410, 8043, -6672, 813, 5738, -9942, 5561, 2623, -6406, 6894, -5622, -1765, 8641, -8679, 1092, 4010, -6967, 7351, -1494, -5352, 7417, -6112, 869, 6571, -8574, 4706, 2727, -6383, 7101, -3856, -2507, 7369, -7761, 2292, 4580, -7166, 6218, -902, -5453, 6998, -5543, 221, 5727]
1097E727j4357J3066j555r844J2607r508R90J0613j3954Q117K156j1413J3498
1110F143o310n243J2564j1370L648O410j2587J0905k426q875J3836q787j682J0029
1124F255j2059P151K682j1803J2559m757n833J2791j0300K284O820j2271R495
1137C014j060q414J3100q171k440J0619j1477N687L209j0994J1619m032n230J1835
1151G265j1258J517Q382j1266P314n02q151J3307p386l546R982j0218N090L818
1165D348j1122J0536k710n703J1287j0439J383Q897j1515O495J292q243J1599
1178F105o639l572R904j0390M691M995j1672R313j084n655R944r803L68R783j0595
1193d307N550J076q302J1458n659m308R664r313M855N057j2055Q665J26o650R260
$$ y = [5727, -8630, 4436, 2881, -6963, 5644, -3864, -2874, 7739, -6215, 1902, 4058, -7355, 6143, -167, -5410, 7154, -4216, -568, 5842, -6745, 4160, 1734, -7141, 6695, -2092, -3774, 6255, -5804, 1347, 4029, -7774, 4785, 28, -5805, 6986, -3314, -1030, 5790, -6481, 3014, 1954, -6460, 6640, -1531, -3971, 6648, -4829, 858, 4067, -6927, 4692, 660, -4570, 7265, -3993, -2476, 5906, -5360, 1954, 1452, -6699, 6608, -778, -4324, 5658, -4560, 530, 4348, -6774, 3762, 1052, -4651, 6636, -3803, -2420, 6477, -5038, 1457, 2749, -5494, 6105, -534, -4106, 5798, -4592, 99, 5094, -6578, 2735, 1651, -4004, 5940, -3863, -3495, 6288, -4307, 1243, 2319, -5983, 5475, -184, -4492, 5172, -4141, 714, 5771, -6284, 2381, 2507, -4143, 5117]
1208E117q164K21R263j0794N127K045q587J0862m994m995R437q343M105N299j2037
1223f438P373J224o050Q505p813J28R638j0376M728J981r160J1008k998o264R053
1238D539p589L370M758j1211P987P35p179R245o816q98Q858r616L952K511q965
1253f319J0170k551n977Q838p054K654N433j1226P016J558o337Q913o601k072
1267c555Q930p911K856K179p872R874l079n953R139o793J206N666j0016O582J150
1282B403o405Q168n265k303Q370q197L136K751p846R102k687n721Q827o285Q64
1297a088N640r057N588J345n934Q065n791k244Q666q082K403L360p560P950k107
1312A154n631Q164n855K60O004q266N364J099o512P819m624k283P967p305K112
$$ y = [5117, -3047, -2826, 6437, -4357, 770, 2815, -5772, 5090, 96, -4899, 4538, -3805, 300, 5599, -6438, 935, 2159, -3891, 4614, -3199, -3071, 6567, -3809, 919, 2900, -6260, 4748, 1750, -4514, 4539, -3050, 320, 5078, -6133, 1854, 2589, -4590, 4655, -2161, -3059, 5799, -3817, 135, 2646, -6319, 3851, 1300, -4677, 4161, -2893, -239, 5194, -6032, 984, 2542, -3795, 5118, -1483, -3555, 5375, -2536, 320, 2499, -5373, 4501, 1422, -4531, 4608, -2185, -979, 4687, -5329, 1253, 2403, -4002, 4166, -1099, -3402, 4968, -3229, -93, 2658, -5188, 3914, 1227, -4494, 4333, -1952, -1088, 4552, -4505, 1083, 2428, -3506, 4559, -1232, -3476, 5190, -2892, -489, 2871, -4689, 3261, 1154, -4477, 3687, -2168, -1908, 4096, -4170, 1194, 2293, -4219, 3600, -1024, -3307, 4660, -2645, -533]
1327e33L929p502O853j234n138P273n533N58O091q223L954J907o213P079l888
1342f20k583P469o920K209L798p639O353j102m879P546n174m6N571p364L971K029
1358B619o633O518k256k922O580o391K016M241p795N395Om780P104m888p37N647
1374C724o378K841K406o568O317j917l570O720n952J400M354o754M222P51m924
1389c328O770l796k128N788n684L002J918o440O058r16m173O114m986N69M800
1404C568o685L830Q68m802O252l703j953N801n424K500K221o290O004r01m033
1419b747N553m412K75M910o423L234J040m231O318l546k636N880m972J911K574
1434B728o603N538o9m296N085m424P52M937o640L065J452m362N649l027k674N975
$$ y = [-533, 3396, -4106, 2747, 1513, -3625, 3648, -1885, -1327, 4764, -3459, 495, 2402, -3811, 3268, -620, -3203, 4266, -2654, -445, 3353, -4286, 2067, 965, -3914, 3632, -1542, -1588, 3983, -3381, 590, 2619, -4014, 2504, 248, -2674, 3906, -2485, -469, 3772, -4023, 1372, 1378, -3402, 3702, -1186, -1923, 3724, -2654, 187, 2593, -3975, 2342, 425, -3145, 3575, -2377, -977, 3377, -3377, 845, 1596, -3328, 3442, -354, -2482, 3306, -2378, 624, 2542, -3898, 2160, 1244, -2929, 3185, -1801, -1232, 3568, -3117, 713, 1581, -3221, 3031, -672, -2625, 3176, -2248, 252, 2473, -3817, 2187, 1286, -2747, 2806, -1606, -1331, 3579, -2844, 390, 1430, -2801, 3517, -29, -2665, 3215, -1757, 154, 2728, -3875, 1663, 1594, -2702, 2383, -2041, -1289, 3648, -2992, 73, 1525, -2837, 2812, -215, -2889, 3086]
1450C086m651J535K604o107M913Q8l902N082m272J02N383o054K198J359m178N656
1466B842k639l160N936m356J211K504n990M772K38l877M914m065K32N040o052
1481b450K073J810m006N182k675k763N829m163O76K847n471M291L88l652M471
1496B387l793k35M979n176J644J595m097N414k657l111N762l990Q14K625n352
1511c191M510L82l993M658l294o02M535m997K187J517m247M730j557l182N032
1526B488l500M13L023n445M175J26l701M457k990p62M481m634J864J675m214M652
1542B108j417l032M616l388O32L088n360L632P68m140M450k191j321M397m671
1557a829J844K107m454L701j008k545M260l216O40K739m870L146P32l624M364
$$ y = [3086, -1565, -30, 2574, -3533, 1380, 1468, -2434, 2648, -1624, -1522, 3861, -2193, 5, 1364, -2814, 2842, 203, -2957, 2979, -1377, -166, 2338, -3652, 1120, 1358, -2519, 2395, -1670, -1438, 3602, -2450, -377, 1433, -2573, 2609, -66, -2829, 3000, -1163, -487, 2360, -3111, 1180, 1568, -2084, 2387, -1406, -1641, 3338, -1838, -194, 1401, -2696, 2718, 61, -3050, 2712, -1278, -464, 2161, -3191, 1319, 1701, -2292, 2366, -928, -1530, 3005, -1992, 195, 1712, -2535, 2195, 638, -2544, 2488, -1012, -599, 2424, -3021, 1154, 1280, -2421, 2036, -954, -1716, 2765, -1869, -5, 1670, -2544, 2108, 691, -2341, 2275, -1113, -481, 2607, -2753, 879, 1647, -2493, 1957, -234, -1555, 2842, -1829, 15, 2122, -2332, 1369, 361, -2184, 2076, -1140, -500, 2239, -2631, 515, 1247, -2377, 1987]
1572A987k527j148M160l900J362J993m353L971r93k691M490l312M39K689m131
1587a964K397Q00l475L677j688j280L742l863J620J998m475L550l78k447M143
1602B357l060r2L187m502K374P58k968L742j827j473L431l242P79K626m127K948
1618I11j96k601L890k604m77L057l707K065P98l199L480j226j768L535l054P84
1634c12K014l906K890J96k660L472k510l29L111l043R96J371l297L588j154k215
1650a788L542k713P32K142l524K039M85k503L255k418o92L437l054R42J188l482
1666b412L723o34k569L288k393O11K402l890K043Q20k521K957j819j000L459k944
1682h79P56J425l321L373p71k478L567k508M23K515l991J540J404k635L168j682
$$ y = [1987, -540, -1688, 2472, -1428, -66, 1927, -2426, 1545, 552, -2139, 2351, -961, -522, 2167, -1964, 433, 1233, -2242, 1435, -253, -1533, 2209, -1654, -34, 1964, -2511, 1039, 661, -1786, 2357, -703, -795, 2392, -2110, 264, 1022, -1946, 1796, -31, -1504, 1927, -1315, -536, 2090, -2037, 911, 715, -1886, 2004, -600, -1077, 1980, -1727, 338, 1136, -2063, 1417, 191, -1577, 1958, -1096, -312, 1702, -2204, 686, 882, -1778, 1694, -816, -1145, 1966, -1077, -81, 1290, -2007, 1581, 427, -1788, 1754, -959, -227, 1915, -1609, 430, 915, -1588, 1667, -751, -1443, 1994, -1060, -118, 1070, -2412, 1311, 677, -1892, 1396, -997, -386, 2016, -1874, 169, 989, -1532, 1425, -394, -1394, 2065, -879, -123, 1302, -2019, 1354, 583, -1895, 1672, -836, -413, 2102, -1889, -349, 1055, -1580, 1588, -94]
1698i4j416L330k668P92J472l287K962j60k455L143k259K4K758l722J692J154
1714A266k549K742j610j422L563k875M00J807l454L074j27k470L063j921j87K641
1730A941l392J288J379k886L173j572j597L620k821O75J791l531K745J46k599
1745a640K869j842m8K520l434J442J469k720K619j223j505L151k305M3J800k868
1761a672K375L62k639K913j978l83K544k685J127J413k610K461q24j942L225k239
1777e52J15J893k822J835M55k568K901j508p18K656l023Q98J557k496K405q15
1793B13j543K819k190K32J889k715J518N30k092K444j500m15K426k613Q42J152
1809I97k428K148k89k050K757j447l28J990k866J686P79k485K476j125p67K367
$$ y = [-94, -1510, 1820, -848, -56, 1416, -1871, 1091, 931, -1524, 1619, -640, -616, 2142, -1580, 112, 1266, -1283, 1459, -151, -1573, 1990, -885, -485, 1322, -2132, 942, 815, -1655, 1408, -513, -700, 1941, -1451, -163, 1216, -1670, 1503, -69, -1666, 1954, -867, -192, 1599, -1932, 813, 959, -1640, 1229, -613, -661, 1859, -1575, -133, 1336, -1384, 1235, 12, -1493, 1658, -647, -604, 1196, -1672, 703, 1065, -1574, 1339, -639, -1022, 1522, -1163, -36, 1377, -1233, 1228, 404, -1538, 1687, -552, -437, 1456, -1366, 469, 924, -1644, 1257, -251, -969, 1687, -1336, -438, 1119, -1377, 1028, 213, -1330, 1489, -701, -469, 1420, -1295, 223, 753, -1339, 1105, -395, -810, 1616, -997, -155, 997, -1431, 717, 428, -1622, 1135, -312, -640, 1350, -1516, 170, 949, -1536, 940, -185, -952, 1415]
1825A415k202M50J338k345J959k34j770K621j997J7J826k366J314Q73k264K593
1841A228j242r63K264j991L51J529k507J900m3j802K459j503l78J995k347J216
1857A66N36k066K225r08r03K494k270L67J823k744J787k7j588K034j134m55K214
1874A551k326P98O81k144K499j019j331K086j645O95J032k140J481N50j913K311
1890A166j331q19K133j965O90J091j854J908p50j717K422j522M86J261k314J193
1906G8P04k105K149q46j028K152j811N57Q29j828J826l59j664K223j122p5J717
1923A397k291J055Q21j816J608q47o17K065k022L71J076k065J824j19j594K276
1939A122j007m76J348k204J301O02j675J386l81p30J946j739J22J427k103J872
$$ y = [1415, -787, -337, 1001, -1344, 615, 381, -1389, 1232, -765, -748, 1078, -1288, 26, 899, -1365, 1228, -14, -977, 1287, -704, -353, 1176, -1331, 569, 526, -1276, 1183, -320, -698, 1297, -1050, 166, 702, -1364, 861, -47, -950, 1544, -726, -359, 1464, -1280, 507, 480, -1108, 926, -208, -663, 1551, -775, 23, 704, -1440, 1059, 40, -1291, 795, -850, -155, 877, -1263, 218, 768, -1145, 1166, -165, -984, 1149, -816, -126, 965, -889, 1019, 269, -1448, 974, -548, -62, 1199, -1115, 78, 782, -1323, 826, -20, -1048, 1104, -707, -150, 679, -1149, 677, 318, -1346, 877, -245, -320, 1397, -894, 161, 982, -834, 774, -73, -690, 1375, -647, -276, 800, -1265, 559, 440, -1154, 1122, 115, -361, 987, -1217, 84, 686, -989, 397, 16, -714, 1232, -507, -385, 1042, -1061, 811]
1955H11l33j771K239j131p40J815j775P43J061j899J616p80o13J855j540M5J220
1972H23j976J539J07j846K170j089k11J604k053P08R89j970K072r84r76K351j702
1989d44q4J395j932J516K93k162K194q91m88J645k057R92Q45j810J640l82j373
2006a103J753j053j70J211j618J448R6j667J921q80n90J696j630M88R50j569J468
2023G51o48j031J981j212j66J511k282J296L89j571J632r12k22J344j483M26Q12
2040F15j499J448k04j024J374q43k99J216j616J125M16j429J250m54p19J416j384
2057f11L97R93j622J080L19j492J628q66p2J022j510P46Q53j778J469l30j031
2074h05J584j149j2J017j616J306K53j390J387q78j46J215j034M15M49j174J089
$$ y = [811, 478, -1293, 946, -185, -925, 890, -885, -142, 919, -980, 636, -144, -757, 1098, -442, -397, 823, -1153, 386, 493, -1353, 817, -272, -483, 1121, -932, -224, 765, -1205, 867, -117, -1093, 1258, -444, -528, 867, -1065, 451, 744, -1418, 776, -115, -603, 1042, -1015, -23, 822, -988, 652, 270, -1103, 650, -403, -573, 638, -980, 468, 564, -1103, 818, -62, -652, 1044, -586, -98, 852, -717, 751, 103, -928, 1053, -159, -325, 1186, -1096, 200, 589, -982, 650, -262, -484, 860, -623, -197, 615, -884, 564, 360, -664, 710, -133, -432, 784, -832, 293, 709, -720, 530, 76, -643, 773, -611, -214, 779, -843, 237, 556, -936, 692, -174, -246, 776, -734, 12, 865, -913, 556, 226, -805, 779, -370, -382, 635, -981, 325, 578, -812, 575, -303, -449, 766, -268, 147, 596, -578, 511]
2091E11m03p39J210r80K11Q78j555J064J73j394J512n99m89J395j416N35O96j253
2109f43R07j95n08J017q58J38P02j107M52O74j280J241n23m75J219j155L57P02
2127F65j289P43L6q57J446p76j67P85j310P98P08j434R75j73p78J589j316Q0R60
2146F85j130P19O6j085J466q15k56R87j205J030J08j405R84L2o93J273j163K46
2164a56P66j174R68j79j011J251l64k63Q05j350R06L40j236J349n45n49J142r65
2182b65Q9P37j222Q37J52j054J462o68l59R70j348P99K28j137J176j41p91J212
2200F77q63j63R98j117N65no10R03m17k65J002j255M62P45j256R48p3q97J132
2219E11q59K09P21j264Q42J90j187J145m23l14P71n59K64L19o13M46K91q78J033
$$ y = [511, 108, -631, 579, -401, -190, 688, -867, 197, 370, -1024, 488, -111, -600, 795, -621, -86, 610, -643, 264, 69, -439, 578, -280, -142, 560, -547, -95, 579, -701, 540, 17, -458, 761, -394, -37, 665, -624, 119, 155, -702, 744, -32, -199, 586, -724, 74, 782, -652, 323, 150, -628, 961, -355, -275, 685, -445, 274, 340, -745, 721, -94, -350, 637, -568, 462, 570, -835, 149, 181, -512, 761, -402, -156, 610, -564, 404, 225, -786, 465, 101, -162, 643, -707, 199, 539, -697, 652, 107, -442, 700, -265, -176, 561, -661, 176, 328, -726, 736, 68, -291, 679, -669, 130, 358, -779, 397, 256, -535, 677, -186, -349, 649, -468, 97, 92, -518, 385, -32, -297, 705, -550, -88, 657, -599, 349, 276, -621, 511, -348, -139, 582, -682, 160, 350, -837, 308, -115, -429, 342, -217, 47, 366, -247, 199, 490, -388, 645]
2238F45r25J25Q10j035O20J32r55Q44j81l29R48j161M75L41p30O17k67o27J217
2257E64r06J87P24j123N87L69j143J271n15n24J133r09O8N90q11M81K37p09J047
2276F18o23l71Q26r50L81M35o76M38j03m64J062p22r7P32j001O18K13q29Q81m66
2296i8j28P18p69K97J67l95O65k01q78Q96l83J41O85j196P83K1r01R15m74PO17
2317D89q98L16M59r81J056j98p69R27k99m20O31n88K81L59p83N08nm81O79p31
2337d48K73L88n89O51j99l59M38k90q7O27n42K66K11q00O36j06m42O98o18J30
2357a62L34l30K69n3m61Q81o51k85P77o62L38J54m29N71j24p30R39m48K47q2k80
$$ y = [645, -280, -155, 655, -380, 240, 372, -583, 261, 80, -249, 699, -462, 13, 354, -376, 241, -26, -653, 564, -342, -155, 569, -554, 33, 402, -741, 530, 15, -509, 624, -285, -217, 373, -438, 43, 280, -429, 618, -5, -376, 450, -500, -119, 316, -360, 78, -25, -489, 573, -149, -246, 486, -515, 103, 316, -513, 368, -98, -226, 492, -277, 20, 187, -208, 457, 256, -622, 274, -109, 32, 717, -479, 304, 325, -576, 339, -135, -128, 489, -409, -93, 366, -615, 441, 243, -526, 401, 102, -318, 313, -275, 6, 365, -418, 90, 85, -396, 283, -448, -175, 213, -376, 275, 76, -283, 155, -135, -222, 405, -137, 129, 340, -460, 176, 70, -372, 326, -292, -162, 172, -158, 111, 58, -403, 478, -173, -458, 319, -343, -5, 149, -280, 291, 167, -563, 376, -72, 175, 93, -187]
$$ [...]
8191i7
##END NTUPLES=NMR FID
##END=
