##TITLE=1H_Pr C5-8
 CDCl3
 8 sc, 
 10.11.2021
##JCAMPDX= 6.0         $$ Bruker NMR JCAMP-DX V2.0
##DATA TYPE= NMR FID
##DATA CLASS= NTUPLES
##ORIGIN= UXNMR, Bruker Analytische Messtechnik GmbH
##OWNER= root
$$ XWIN-NMR		Version 3.5
$$ Wed Nov 10 10:13:14 2021 Russian Standard Time (UT+4h)  she@DPX200
##.OBSERVE FREQUENCY= 200.1313468511
##.OBSERVE NUCLEUS= ^1H
##.DELAY= (6, 6)
##.ACQUISITION MODE= SIMULTANEOUS
##.ACQUISITION SCHEME= undefined
##.AVERAGES= 8
##.DIGITISER RES= 18
##SPECTROMETER/DATA SYSTEM= spect
##.PULSE SEQUENCE= zg30
##.SOLVENT NAME= CDCl3
##.SHIFT REFERENCE= (INTERNAL, CDCl3, 0, 15.7039)
##AUDIT TRAIL= $$ (NUMBER, WHEN, WHO, WHERE, WHAT)
$$ ##TITLE= Audit trail, XWIN-NMR		Version 3.5
$$ ##JCAMPDX= 5.01
$$ ##ORIGIN= Bruker BioSpin GmbH
$$ ##OWNER= she
$$ F:/spectra/data/she/nmr/H-F/1/audita.txt
$$ ##AUDIT TRAIL=  $$ (NUMBER, WHEN, WHO, WHERE, WHAT)
(   1,<2021-11-10 10:12:07.20 +0400>,<she>,<DPX200>,
      <created by zg, POWCHK disabled, PULCHK disabled
       configuration hash MD5:
       00 E9 B6 7A A2 85 ED C7 34 08 36 98 17 FE 4E 26
       data hash MD5: 16K
       5D 45 A6 D2 7C 53 96 76 A5 32 38 FA F9 1A CB 8F>)
$$ ##END=
$$ 
$$ hash MD5
$$ 96 51 58 8A EC 7E 65 05 8A 1F DA 2D CF DA 0C D8
##$RELAX= 
##$RELAX= 
##$RELAX= 
##$RELAX= 
##$RELAX= 
##$RELAX= 
$$ Bruker specific parameters
$$ --------------------------
##$DU= <F:/spectra>
##$EXPNO= 1
##$NAME= <H-F>
##$PROCNO= 1
##$TYPE= <nmr>
##$USER= <she>
##$AMP= (0..31)
100 100 100 100 100 100 100 100 100 100 100 100 100 100 100 100 100 100 
100 100 100 100 100 100 100 100 100 100 100 100 100 100 
##$AQSEQ= 0
##$AQ_mod= 1
##$AUNM= <au_zg>
##$AUTOPOS= <>
##$BF1= 200.13
##$BF2= 200.13
##$BF3= 200.13
##$BF4= 200.13
##$BF5= 200.13
##$BF6= 200.13
##$BF7= 200.13
##$BF8= 200.13
##$BYTORDA= 1
##$CFDGTYP= 0
##$CFRGTYP= 5
##$CHEMSTR= <none>
##$CNST= (0..31)
1 1 145 1 1 1 1 1 1 1 1 1 1 1 1 1 1 1 1 1 1 1 1 1 1 1 1 1 1 1 1 1 
##$CPDPRG= <>
##$CPDPRG1= <>
##$CPDPRG2= <>
##$CPDPRG3= <>
##$CPDPRG4= <mlev>
##$CPDPRG5= <mlev>
##$CPDPRG6= <mlev>
##$CPDPRG7= <mlev>
##$CPDPRG8= <mlev>
##$CPDPRGB= <>
##$CPDPRGT= <>
##$D= (0..31)
0 1.2 0 0 0 0 0 0 0 0.06 0 0.03 0 0 0 0 0.0002 0 0 0 0 0 0 0 0 0 0 0 0 
0 0 0 
##$DATE= 1636524726
##$DBL= (0..7)
120 120 120 120 120 120 120 120 
##$DBP= (0..7)
150 150 150 150 150 150 150 150 
##$DBP07= 0
##$DBPNAM0= <>
##$DBPNAM1= <>
##$DBPNAM2= <>
##$DBPNAM3= <>
##$DBPNAM4= <>
##$DBPNAM5= <>
##$DBPNAM6= <>
##$DBPNAM7= <>
##$DBPOAL= (0..7)
0.5 0.5 0.5 0.5 0.5 0.5 0.5 0.5 
##$DBPOFFS= (0..7)
0 0 0 0 0 0 0 0 
##$DE= 6
##$DECBNUC= <off>
##$DECIM= 32
##$DECNUC= <off>
##$DECSTAT= 4
##$DIGMOD= 1
##$DIGTYP= 9
##$DL= (0..7)
0 120 120 120 120 120 120 120 
##$DP= (0..7)
150 150 150 150 150 150 150 150 
##$DP07= 0
##$DPNAME0= <>
##$DPNAME1= <>
##$DPNAME2= <>
##$DPNAME3= <>
##$DPNAME4= <>
##$DPNAME5= <>
##$DPNAME6= <>
##$DPNAME7= <>
##$DPOAL= (0..7)
0.5 0.5 0.5 0.5 0.5 0.5 0.5 0.5 
##$DPOFFS= (0..7)
0 0 0 0 0 0 0 0 
##$DQDMODE= 0
##$DR= 18
##$DS= 0
##$DSLIST= <SSSSSSSSSSSSSSS>
$$ [...]
##$SUBNAM2= <"">
##$SUBNAM3= <"">
##$SUBNAM4= <"">
##$SUBNAM5= <"">
##$SUBNAM6= <"">
##$SUBNAM7= <"">
##$SUBNAM8= <"">
##$SUBNAM9= <"">
##$SW= 18.0517286264689
##$SWIBOX= (0..15)
0 0 2 0 0 0 0 0 0 0 0 0 0 0 0 0 
##$SW_h= 3612.71676300578
##$TD= 16384
##$TD0= 1
##$TE= 0
##$TE2= 300
##$TE3= 300
##$TEG= 300
##$TL= (0..7)
0 120 120 120 120 120 120 120 
##$TP= (0..7)
150 150 150 150 150 150 150 150 
##$TP07= 0
##$TPNAME0= <>
##$TPNAME1= <>
##$TPNAME2= <>
##$TPNAME3= <>
##$TPNAME4= <>
##$TPNAME5= <>
##$TPNAME6= <>
##$TPNAME7= <>
##$TPOAL= (0..7)
0.5 0.5 0.5 0.5 0.5 0.5 0.5 0.5 
##$TPOFFS= (0..7)
0 0 0 0 0 0 0 0 
##$TUNHIN= 0
##$TUNHOUT= 0
##$TUNXOUT= 0
##$USERA1= <user>
##$USERA2= <user>
##$USERA3= <user>
##$USERA4= <user>
##$USERA5= <user>
##$V9= 5
##$VALIST= <valist>
##$VCLIST= <CCCCCCCCCCCCCCC>
##$VD= 0
##$VDLIST= <DDDDDDDDDDDDDDD>
##$VPLIST= <PPPPPPPPPPPPPPP>
##$VTLIST= <TTTTTTTTTTTTTTT>
##$WBST= 1024
##$WBSW= 4
##$XGAIN= (0..3)
0 0 0 0 
##$XL= 0
##$YL= 0
##$YMAX_a= 251057
##$YMIN_a= -373923
##$ZGOPTNS= <>
##$ZL1= 120
##$ZL2= 120
##$ZL3= 120
##$ZL4= 120
##$ABSF1= 10
##$ABSF2= 0
##$ABSG= 5
##$ABSL= 3
##$ALPHA= 0
##$AQORDER= 0
##$ASSFAC= 0
##$ASSFACI= 0
##$ASSFACX= 0
##$ASSWID= 0
##$AUNMP= <proc_1d>
##$AZFE= 0.1
##$AZFW= 0.1
##$BCFW= 1
##$BC_mod= 2
##$BYTORDP= 1
##$COROFFS= 0
##$CY= 11.3945322036743
##$DATMOD= 1
##$DC= 2
##$DFILT= <>
##$DTYPP= 0
##$F1P= 2.36226072786647
##$F2P= -0.459571619588291
##$FCOR= 0.5
##$FTSIZE= 0
##$FT_mod= 4
##$GAMMA= 1
##$GB= 0.15
##$INTBC= 1
##$INTSCL= 1
##$ISEN= 128
##$LB= 0.24
##$LEV0= 0
##$LPBIN= 0
##$MAXI= 10000
##$MC2= 0
##$MEAN= 0
##$ME_mod= 0
##$MI= 1.114404
##$NCOEF= 0
##$NC_proc= 0
##$NLEV= 6
##$NOISF1= 3.799351
##$NOISF2= 2.8
##$NSP= 1
##$NTH_PI= 0
##$NZP= 0
##$OFFSET= 15.70392
##$PC= 1
##$PHC0= -15511.04
##$PHC1= 14.20082
##$PH_mod= 1
##$PKNL= yes
##$PPARMOD= 0
##$PSCAL= 0
##$PSIGN= 0
##$REVERSE= no
##$SF= 200.130013532006
##$SI= 16384
##$SIGF1= 3
##$SIGF2= 2
##$SINO= 400
##$SIOLD= 16384
##$SREGLST= <1H.CDCl3>
##$SSB= 0
##$STSI= 0
##$STSR= 0
##$SW_p= 3612.71676300578
##$SYMM= 0
##$S_DEV= 0
##$TDeff= 0
##$TDoff= 0
##$TI= <>
##$TILT= no
##$TM1= 0
##$TM2= 0
##$TOPLEV= 0
##$USERP1= <user>
##$USERP2= <user>
##$USERP3= <user>
##$USERP4= <user>
##$USERP5= <user>
##$WDW= 1
##$XDIM= 8192
##$YMAX_p= 0
##$YMIN_p= 0
$$ End of Bruker specific parameters
$$ ---------------------------------
##NTUPLES= NMR FID
##VAR_NAME=  TIME,          FID/REAL,        FID/IMAG
##SYMBOL=    X,             R,               I
##VAR_TYPE=  INDEPENDENT,   DEPENDENT,       DEPENDENT
##VAR_FORM=  AFFN,          ASDF,            ASDF
##VAR_DIM=   8192,          8192,            8192
##UNITS=     SECONDS,       ARBITRARY UNITS, ARBITRARY UNITS
##FACTOR=    0.0002768,     1,               1
##FIRST=     0,             0,               0
##LAST=      2.2672688,     0,               0
##MIN=       0,             -373923,         0
##MAX=       2.2672688,     251057,          0
$$ Real data points
##PAGE= N=1
##DATA TABLE= (X++(R..R)), XYDATA
0@%%%%%%%%%%qJ6j6K3l1L2m0N6o4P2q8J12j36J60j91K23k56K96l44L93m50N15
$$ 0 0 0 0 0 0 0 0 0 0 0 -8 8 -8 15 -16 16 -24 32 -32 40 -48 64 -72 88 -103 120 -136 160 -184 209 -241 274
32B74n87O66p53Q49r54J071j199J340j495J664j847K045k262K502k764L048l359
$$ 274 -313 353 -400 449 -505 566 -633 707 -788 876 -971 1074 -1188 1314 -1450 1598 -1761
49a761L700m075M489m947N457o027O664p383Q207r156J0266j1586J3181j5160
$$ -1761 1939 -2136 2353 -2594 2863 -3164 3500 -3883 4324 -4832 5434 -6152 7029 -8131
63h131J7692k1054K5765l2894M5066p1309K28473k15606k52108N16125p7266k92205
$$ -8131 9561 -11493 14272 -18622 26444 -44865 183608 -31998 -284106 232019 154753 -137452
75a37452J57270J07967k96744P5508K32132j63548j42939K26013J1463j59435
$$ -137452 19818 127785 -168959 -93451 138681 -24867 -167806 58207 69670 -89765
85h9765O7627R0396r6833M1M3659n9941J2858J02114r4602r1114J72863P3598
$$ -89765 -22138 68258 -28575 -28534 15125 -44816 -31958 70156 -24446 -115560 57303 130901
97A30901j91819J5751J70847q7732j14572J29375J8526j41524N0291P5115j35323
$$ 130901 -60918 -45167 125680 37948 -76624 52751 71277 -70247 -19956 55159 -80164
108h0164J7794J76901r7243j45137J39425P9507r3323P319J631q2189P9775R0448
$$ -80164 -62370 114531 17288 -127849 11576 91083 -2240 5079 6710 -75479 4296 94744
120I4744j60577o8458J83436L702j45492P8899Q9288r8127M308R9313n7518o1168
$$ 94744 -65833 -134291 49145 52847 -92645 -13746 75542 -22585 -18277 81036 23518 -37650
132c7650Q9048J0779j14333J4475J00916l8436p9816K9258M2507n179j0421j1444
$$ -37650 51398 62177 -52156 -37681 63235 24799 -55017 -25759 16748 11569 1148 -10296
144a0296n190J6793j57k8784J6657L3510n1521l0280P9259J5656n9214K7503K7277
$$ -10296 -15486 1307 1150 -27634 -10977 22533 -28988 -59268 19991 35647 -23567 3936 31213
157C1213n2910L0248P8245p6819q8974R3375N9162r4291k4296N0171j4792M675
$$ 31213 -21697 8551 86796 9977 -78997 14378 73540 -20751 -45047 5124 -9668 -4993
169d993K8550m1494r176O0137j2134m9649L2894K3125m4278R034K7425m7536L129
$$ -4993 23557 -17937 -27113 33024 20890 -28759 4135 27260 -17018 -7984 19441 -28095 -24966
182b4966O6231l7425o1569N8176M5071n7249j9951N3847o234m5491L0735L1705
$$ -24966 41265 3840 -57729 447 45518 -11731 -31682 22165 15931 -29560 1175 32880
194C2880m0635j2187L1807k119r929J4523o650k2940J7839K2319k3035j1469Q210
$$ 32880 -7755 -19942 11865 9746 -183 14340 7690 -15250 2589 24908 1873 -9596 -1386
207a386j4196J6120K6702m7306k5026O3042R578o0375J2761M8615l1216k3392
$$ -1386 -15582 538 27240 -20066 -45092 17950 27528 -32847 -20086 28529 -2687 -26079
219b6079M4646o221l7507L3374J6844m1587M072L3983j0845j9403Q449M465j126
$$ -26079 18567 12346 -25161 8213 25057 -16530 -12458 21525 10680 -8723 -274 4191 3065
232C065R779q995j8473J9357J2212k5656J637K0658j7370j5461K3909R712l0951
$$ 3065 12844 3849 -14624 4733 16945 -8711 -7074 13584 -3786 -19247 4662 14374 -16577
245a6577m989L1949p885k3948K2476R085k7154Q636K7519j3728j9206J7654J1179
$$ -16577 -21566 10383 2498 -21450 1026 10111 -17043 -8407 19112 5384 -13822 3832 15011
258A5011j3009J013L017q869J2513L746k3041P633J8444j8320p263J7916p920
$$ 15011 2002 3015 6032 -2837 9676 13422 -9619 -1986 16458 -1862 -9125 8791 871
271H71j7473J9356R173l0830J97L1020j0893k0913J5383Q355r211J954O504l047
$$ 871 -16602 2754 11927 -18903 -18706 12314 1421 -19492 -4109 4246 -4965 -3011 3493 446
285D46l335P298K697n968K110J304k529O229j926q721M851N908p958n393Q726
$$ 446 -2889 4409 7106 1138 3248 4552 2023 8252 6326 -2395 2456 8364 406 -4987 3739
300C739J563j4996M670J4926j5009r482J6963K04j3220L783O562n402J3Q647m446
$$ 3739 5302 -9694 -5024 9902 -5107 -14589 2374 2578 -10642 -6859 -297 -5699 -5686 2961 -1485
315a485n390J2417J987p906N758N94m693O888j074j0555L075Q260n784q333P729
$$ -1485 -6875 5542 7529 -377 5381 5975 1282 8170 7096 -3459 -384 7876 2092 -6241 1488
330A488M400r660K945O330q925p02O603m869o142K660L980m789k216P339K32k741
$$ 1488 5888 -3772 -827 5503 -3422 -4124 2479 -2390 -8532 -5872 -1892 -6681 -8897 -1558 -1326 -4067
346d067O302J364j495L686j154k033K414Ln238j806N856q97o869O305L971o905
$$ -4067 2235 3599 2104 5790 4636 2603 5017 5020 -218 -2024 3832 2935 -3934 2371 6342 -563
362e63L700M479p632k146M611k009q717j002N406l928k162N696l20O71O572k9
$$ -563 3137 7616 -16 -2162 2449 440 -8277 -9279 -3873 -7801 -9963 -4267 -4587 -3916 2656 2627
378B627l26L121j309k083N25J211l819k946O138l66m116O995K061n022L014K676
$$ 2627 2301 5422 4113 2030 2555 3766 -53 -2999 3139 2773 -1343 5652 7713 2691 5705 8381
394H381n126m362O74j693p663k75L694m255P33M355P45N053M126k799J548L143
$$ 8381 3255 -1107 -433 -2126 -9789 -10064 -6370 -10625 -9892 -5537 -4792 261 4387 1588 3136 6279
410F279m05k806j537N06l339o96N322j870j687M028P10K81J305j051k489n535
$$ 6279 5874 3068 1531 2037 -1302 -1998 3324 1454 -233 3795 4505 4786 6091 5040 2551 -2984
426b984l18K655n031m062J171J681M146J217j159L927K488L65j302l5J504n760
$$ -2984 -3302 -647 -5678 -9740 -8569 -6888 -2742 -1525 -2684 1243 3731 4096 2794 2759 4263 -1497
442a497l624M021j172j15L300l460J654Q731J617l210j146M47q57p25k232p997
$$ -1497 -5121 -1100 -2272 -2387 913 -2547 -893 7838 9455 6245 5099 5546 4689 3964 1732 -6265
458f265j212M983n323k115R173j216n035N237N326O64j870l767q92K934L068m065
$$ -6265 -7477 -2494 -7817 -9932 -759 -1975 -7010 -1773 3553 4217 2347 -1420 -2312 622 3690 -375
474c75m797L785M110J331R96k454J590K930m517q86N84l354j792m191j182O392
$$ -375 -5172 -1387 2723 4054 5050 2596 4186 7116 2599 1713 2297 -1057 -2849 -7040 -8222 -1830
490a830K810o281k010Q348O479l368k396p91q29N123k475r202L886K220o904L186
$$ -1830 980 -5301 -7311 1037 7516 4148 1752 961 132 5255 2780 -6422 -2536 -316 -7220 -4034
506d034M510j829k0K206k073K294Q146l406j1316N065R226n195l846o93J6N083
$$ -4034 476 -1353 -1373 833 -1240 1054 9200 5794 -5522 -457 8769 3574 -272 -965 -949 4134
522D134o62n389J993K275k954k904k89K300M13l938n034L928J0355k920q080M029
$$ 4134 3472 -1917 76 2351 -603 -3507 -3796 -1496 -1083 -5021 -10055 -6127 4228 1308 -6772 -2743
538b743M838L554K986q307l915R873J808o859j930J818j42j336m16N35K539j052
$$ -2743 2095 5649 8635 328 -3587 6286 8094 1235 -695 1123 981 -355 -771 -236 2303 1251
554A251p643L595J0754o061p392L223k40K547M627q727o163Q623N551o349l570
$$ 1251 -6392 -2797 7957 1896 -5496 -2273 -2513 34 4661 -4066 -10229 -1606 3945 -2404 -5974
569e974M443K238p30o54j100O192M146r897j052R870J161l743l823l310N095M737
$$ -5974 -1531 707 -23 -677 -1777 4415 8561 -1336 -2388 7482 8643 4900 1077 -2233 2862 7599
585G599p123o554L473K886k540j313n30k383L667p3o499O400O177p104j816N384
$$ 7599 476 -6078 -2605 281 -2259 -3572 -4102 -6485 -2818 -2891 -9390 -2990 3187 -3917 -5733 -349
601c49M420L395m351n328P181P656o846p018N537M97n603K726j333o515O265J415
$$ -349 4071 7466 3115 -2213 4968 12624 5778 -1240 4297 4794 -809 1917 584 -5931 334 1749
617A749r431L449Q596m917o234J733N301J833l737o017J393R384J56p232R45M027
$$ 1749 -7682 -4233 4363 -554 -6788 -5055 246 2079 -1658 -7675 -6282 3102 3258 -3974 -3029 998
633I98K074K476l448k707N704o76l350K079o63j064J84k480j400N430J139q967
$$ 998 3072 5548 2100 -607 5097 4421 1071 3150 2487 1423 1607 -873 -2273 3157 4296 -4671
649d671n81Q159k015m908J093k518J740M138o170j188Q775j128n608M566M835
$$ -4671 -5252 2907 892 -4016 -2923 -5441 -3701 437 -5733 -6921 1854 726 -4882 -316 4519
664D519j282Ok58l388L984N790p642n665N562J276n15j401m323K161M518l856
$$ 4519 3237 3243 2985 -403 3581 9371 1729 -3936 1626 2902 2387 986 -3337 -1176 3342 -514
680e14k746K912N1k689P5Q94p09K044j136l964N139L880n265K5L774j373K237
$$ -514 -3260 -348 -297 -2986 -2911 -2017 -2726 -682 -1818 -5782 -643 3237 -2028 -2003 1771 398 2635
697B635L7l533K441L106l000j705K651r8k021R93n60k428M169j146o697L971L205
$$ 2635 2672 -861 1580 4686 1686 -19 2632 2534 513 1506 946 -1482 2687 1541 -5156 -1185 2020
714B020m411l76P6q62L672o36m303J321M603j111k811L738P04k194L707m09k531
$$ 2020 -2391 -2767 -2691 -3553 119 -517 -4820 -3499 1104 -7 -2818 920 1624 -570 3137 2728 197
731A97L005K83k684J382o18n21J063k150j240K589L11l211J76K846k495j673K156
$$ 197 3202 3485 801 2183 1565 1044 2107 -43 -1283 1306 1617 -1594 -1418 1428 -1067 -2740 -584
748e84j270r67J455k741M02M026k870p95M007m59l22L390n01k509K220L174m163
$$ -584 -1854 -2821 -1366 -4107 -3705 321 -2549 -3344 663 204 -118 3272 2771 262 2482 5656 1493
765A493j149L111j946j093J643k614M33K492l579M1J982k585r30J178m8k868Q29
$$ 1493 344 3455 1509 416 2059 -555 -122 2370 -1209 -1168 814 -1771 -2701 -1523 -1571 -4439 -3610
782c610K053j179K28K098o49J674J401j241K216Q4k869K452Q09l490K80J762q92
$$ -3610 -1557 -2736 -2508 -410 -1059 615 2016 775 2991 3075 206 2658 3467 -23 257 2019 1127
799A127j291J099O60j379P16r9j675J858j341k904J875j3l029K008J069j888P51
$$ 1127 -164 935 1595 216 932 833 -842 1016 -325 -3229 -1354 -1367 -4396 -2388 -1319 -3207 -2456
816b456K121M99q29J634L97q34J086M78j926J128k70j000K779n71j936J598K20
$$ -2456 -335 164 -665 969 1366 532 1618 2096 170 1298 1028 28 2807 2236 300 1898 2118
833B118l62m70r01n43l25n25r44r14R82p17p31J832l60K43J772j394P92K247j132
$$ 2118 1756 1286 385 -158 -483 -1008 -1952 -2866 -1884 -2601 -3332 -1500 -1860 -1617 155 -1239 -447 1800 668
852F68q24J374jo50J37R58o81j26J280o49o61J852j749r26J534j926j03N58j754
$$ 668 -156 1218 1217 567 704 1662 981 855 2135 1486 825 2677 928 2 1536 -390 -493 65 -1689
871a689m40R63J33j076q42K234J0j093J130K22j33J210q10O25O40r67P09N90o03
$$ -1689 -2129 -1166 -1033 -2109 -2951 -717 -707 -1800 -670 -448 -581 629 -181 444 1084 117 826 1416 813
890H13P67N43o75K40l05O80r21j004N44m65l66p33j026J503j149k118K279L54
$$ 813 1580 2123 1448 1688 1383 2063 1142 138 682 217 -149 -882 -1908 -405 -1554 -3672 -1393 -1039
908a039j888P81J325k5k54M91J189n89M51J093r64O69O17q13J626p70j156J725
$$ -1039 -2927 -2146 -821 -846 -1100 -609 580 -9 442 1535 571 1240 1857 1044 2670 1900 744 2469
926B469N6j655j55J11k5k019m16J562k169j439J817N34p12o52J008J513m98P2
$$ 2469 2525 870 715 826 801 -1218 -1634 -72 -2241 -3680 -1863 -1329 -2041 -2693 -1685 -172 -670 -598
944e98J468q58L74N64j99K40m81j45J547l73o15Q79P35m41j893Q07J738k971j624
$$ -598 870 12 386 950 751 991 510 365 1912 1539 924 1803 2538 2097 204 1011 2749 -222 -1846
963a846J671n33j281L9L28n3r52J226J314j349P57N43o38O80P8K27J14r45J042
$$ -1846 -175 -708 -1989 -1950 -1622 -1675 -2627 -1401 -87 -1436 -679 -136 -774 -94 -16 211 325 -620 422
982D22J806l29r60j57K079J066k902k88J589j948q88O2r77j69k14J00l77l35K186
$$ 422 2228 1899 939 782 2861 3927 1025 737 2326 378 -510 -448 -1425 -1594 -1808 -1708 -2085 -2420 -234
1001b34n15j234J187O74O26o88j940J392K288j358p11J177P72k9o65J443P18k166
$$ -234 -749 -1983 -796 -122 504 -184 -2124 -732 1556 198 -513 664 1436 1407 742 2185 2903 737
1019G37K27J09m78L5q89l05j095M26K396j112k861J757J638o58j030q78J652R2
$$ 737 964 1073 595 630 -259 -564 -1659 -1233 1163 51 -2810 -1053 585 -73 -1103 -1981 -329 -237
1037b37j672L00J091O10o55o64K393j1n04J925j607j108L237m4l146n56J716P79
$$ -237 -1909 -1609 -518 92 -563 -1227 1166 1155 651 2576 969 -139 3098 3054 -92 -648 1068 1847
1055A847k044q09Q10K94n45j229M72J829k161j110K271l02r37Q36p74k95K027
$$ 1847 -197 -1006 -196 98 -447 -1676 -1204 625 -1536 -2646 -375 -677 -1614 -778 -1552 -1847 180
1072A80J042p76j331R77K478l11j865m29K088Q45l684J17L608j899k266J018O97
$$ 180 1222 446 -885 92 2570 2259 394 -35 2053 2898 -786 -669 2939 1040 -1226 -208 489
1089D89J93q10j082M7j01Q13J52r20j333N13K561q77l144K424L253l058k41K443
$$ 489 682 -128 -1210 -1163 -1264 -451 -299 -1219 -2552 -2039 522 -355 -3499 -1075 2178 -880 -1121 1322
1107A322K69o98n91O29J730p49j612M6J903o92j887J250m16k020K353K74m113
$$ 1322 1591 893 302 931 2661 1912 300 346 2249 1557 -330 920 504 -1516 837 1111 -3002
1124c002J185K306j657j301K86J547P93j807r55K270J856j796j366K521Q82j642
$$ -3002 -1817 489 -1168 -2469 -2183 -636 157 -1650 -2605 -335 1521 -275 -1641 880 1762 120
1140A20J671l95j661K020O98j679j18R3N23J02j950J89J216r69k214J062K726
$$ 120 1791 1396 -265 1755 2453 774 656 749 1272 1374 -576 -387 829 -140 -2354 -1292 1434
1157A434k402k395K528L83o80O47j047J81J727o72R2R48n55M83J060p46j017J939
$$ 1434 -968 -3363 -835 -452 -1132 -485 -1532 -1351 376 -296 -204 744 189 672 1732 986 -31 1908
1175A908J002l378k72L584j605j494M98n68P08J46k077K74J415j089o92R47k93
$$ 1908 2910 -468 -740 2844 1239 -255 243 -325 383 529 -1548 -1274 141 -948 -1640 -693 -986
1192i86j021J692L2j993J565K325k361l57K161n98K81L64q68J682l3k044Q60J367
$$ -986 -2007 -315 -283 -2276 -711 1614 -747 -1104 1057 459 740 1104 236 1918 1885 -159 701 2068
1210B068r38j851J593P4j511J353l85k193J537N96k109K35J45L36Q00j088j117
$$ 2068 1130 -721 872 946 -565 788 403 -1790 -253 343 -1766 -1531 -1386 -1050 -250 -1338 -2455
1227b455K235J020j779m65K491l10j071J844P3j374J301O3j236J407o76p28P92
$$ -2455 -220 800 -979 -1444 1047 737 -334 1510 1583 209 1510 1573 337 1744 1068 340 1132
1244A132n65j212J364k40k083Q18J668j745j397J908J68j381O98n57K09J595j323
$$ 1132 567 -645 719 479 -1604 -786 882 -863 -2260 -352 -184 -1565 -867 -1424 -1215 380 -943
1261i43j20K000o61o53J468j88m35J018M65j515j51J992j286j001Q41n97J16L96
$$ -943 -1063 937 276 -377 1091 903 468 1486 1951 436 285 2277 991 -10 831 234 350 746
1279G46j883N07J373k130k57J386q23q63J146N39j529M45J174p29P29J160j111
$$ 746 -1137 -630 743 -1387 -1644 -258 -1081 -1944 -798 -259 -1788 -1343 -169 -898 -169 991 -120
1296a20Q06L86j026J575M82k564J085J554j090j029O01L81j100oM03r72J47k6
$$ -120 686 1072 46 1621 2103 -461 624 2178 1088 59 660 1041 -59 -65 338 -634 -487 -513
1314e13j155J472o57j344J533M3j157J257P39q34j38J143L80o46O68J58m28R43
$$ -513 -1668 -196 -853 -2197 -664 -621 -1778 -521 218 -616 -754 389 769 123 791 949 521 1464
1332A464q59m59J861j095j303J716n01j216Q54j06p70K4Q0m76n76O90m62k75R55
$$ 1464 605 146 2007 912 -391 1325 824 -392 462 356 -414 -390 -310 -786 -1362 -672 -1134 -1409 -454
1351d54q30j08J520q76l02J687m45l42J095l19p9L75L40n33J76L76n40l36O74
$$ -454 -1284 -1392 128 -748 -1050 637 192 -150 945 626 547 922 1262 729 905 1281 741 405 1079
1370A079o61l57R05j723K12P01j406L70O88r91r9L90N89q22J54N99j27K84N40
$$ 1079 418 61 966 -757 -545 156 -1250 -880 -192 -1183 -1282 -892 -303 -1125 -971 -372 -499 -215 325
1389C25m47N09Q08j100P53N89j137N44K44l09J60j46j41m06j65K56o21k04L90
$$ 325 -122 387 1195 95 848 1437 300 844 1088 779 939 793 652 246 81 337 -284 -488 -98
1408i8o37L9j44j000J191N3r74J061J69l08L61J28M6L62J26N78j39q3K85l95L85
$$ -98 -735 -696 -840 -1840 -649 -596 -1570 -509 -340 -648 -287 -159 -113 249 375 953 814 731 1016 621 1006
1429A006k20k65R13p10p58K99J80n45l84j72K48m29J41J22k64n0R4m52R94l87
$$ 1006 786 521 1434 724 -34 265 445 -100 -484 -656 -408 -837 -696 -574 -838 -888 -794 -1246 -252 -639
1449f39j58J117j80n17J156j49j81j70P13J82l56j57P7J84k78k15k31N07q34l17
$$ -639 -797 320 140 -377 779 630 449 279 992 1174 818 661 738 922 644 429 198 705 -129 -446
1469d46N76q32j2J31o14L34k80K85M04o03M72l4L16K30L2J92M32n22N71O30n68
$$ -446 130 -702 -714 -583 -1197 -863 -1143 -858 -454 -1057 -585 -619 -303 -73 -41 151 583 61 632 1262 694
1490F94m5L26q6J98p49j9L01n12J22l07l40L60o42K90j67o68N73N90j132K08M82
$$ 694 649 975 889 1087 338 319 620 108 230 -77 -417 -57 -699 -409 -576 -1244 -671 -81 -1213 -1005 -523
1511e23K03M1m73P27L04k42J51M31m8J60k97K48J55l20M63Lq12K77k63k40K93
$$ -523 -320 -279 -752 -25 279 37 188 619 571 731 434 682 837 517 980 983 171 448 185 -55 238
1532B38m33Jl35p37O33M93n94l84k91J215l6p69M82K98J53K41K06k4M30k79L56
$$ 238 -195 -194 -529 -1266 -633 -140 -734 -1118 -1409 -194 -230 -999 -517 -219 -66 175 381 357 787 508 864
1553H64m30J11P41m63l64J44l51N91p33n86O33k30o67j85J93K98l42m88Q12n70
$$ 864 434 545 1286 823 459 603 252 843 110 -476 157 -73 -740 -925 -732 -434 -776 -1264 -452 -1022
1573a022O1O74n31M72M61j76O3j5N19M52l17n70O05O14j93j031K33Q00q88k41
$$ -1022 -961 -287 -818 -346 115 -61 2 -13 506 958 641 71 676 1290 1097 66 299 1099 211 -30
1593c0L62p51J31J08m75jk08K56k69k01L82J99pl6k16O79P97p61j75R96Nj66k60
$$ -30 332 -419 -288 -180 -655 -656 -864 -608 -877 -1078 -696 -497 -504 -540 -756 -77 720 -41 -216 780 785 619 359
1616C59L25N01n91k59P19n64j97o0j59J30n06K25k25p69M46O69o02l96k34L21
$$ 359 684 1185 594 335 1054 490 293 233 74 204 -302 -77 -302 -1071 -625 44 -558 -954 -1188 -867
1636h67N63o04K60O99J12m55k03R69k45m41O53K95m29O51j37o85P27j07j39P4
$$ -867 -304 -908 -648 51 163 -292 -495 474 229 -212 441 736 307 958 821 136 863 756 617 691
1656F91p70K19J39o42n09K27P32r51p51J130l8n60K44L49K59O08l34lJ88J37P2
$$ 691 -79 140 279 -363 -872 -645 87 -864 -1615 -485 -523 -1083 -839 -490 -231 377 43 40 228 365 437
1677D37N15p13j58P88K53j122J82J155q55k96L45j50j87k25m85K05K21j087L79
$$ 437 952 239 81 869 1122 0 182 1337 482 186 531 381 194 -31 -516 -311 -90 -1177 -798
1696g98N35l06L4L84j88m08N17O72j306M86R64p19R3N71K29M38m15m00N53N03
$$ -798 -263 -569 -535 -151 -339 -747 -230 442 -864 -378 586 -133 -40 531 760 1198 783 383 936 1439
1716A439n51p55L80l8p89K26k39n96J62K61o33J59K49J8M94m25m05J247j84n38
$$ 1439 888 133 513 475 -314 -88 -327 -923 -761 -500 -1133 -974 -725 -707 -213 -638 -1043 204 20 -518
1736e18J93R09R0r70P83K82q1J21R0m33P18n21m34N10q28k22N88p50k65M64J13
$$ -518 -325 584 674 -296 487 769 688 809 899 466 1184 663 229 739 -89 -311 277 -473 -738 -274 -161
1757a61n44k79Q34j35o43L76lj07O68p34J59Q88k62l05J048j46j52O34J64p59
$$ -161 -705 -984 -150 -285 -928 -552 -555 -662 6 -728 -569 319 57 -248 800 654 502 1136 1300 541
1777E41K43L86n79n71L37l94o7J24n83K21M23r96L8R04o08o18L42N17n57L38L12
$$ 541 784 1170 591 20 357 -37 -104 20 -563 -342 81 -915 -877 27 -581 -1199 -857 -340 -897 -559 -247
1798b47l44N52O76l20L88K22o10O19j18p18M14P32j036j13J13m7m68L8K06l02
$$ -247 -591 -39 637 317 705 927 317 936 818 100 514 1246 210 97 210 163 -305 -267 -61 -363
1818c63J46n2k56M23k36n13N71k07l57O63J61l50M05L87j22l43N71M7l31M19j44
$$ -363 -217 -269 -525 -102 -338 -851 -280 -487 -844 -181 -20 -370 35 422 300 -43 528 575 244 663 519
1839E19l36O47l08l54P07n55m50N29k61l60L30k16l70k1K91l30l47L52J44r2N34
$$ 519 183 830 522 168 875 320 -130 399 138 -222 108 -108 -478 -499 -208 -538 -885 -533 -389 -481 53
1860E3o63J69Q44l55p4O39j58j85N83n9k41j07L18j81j68J42p17L72K60q68J18
$$ 53 -610 -441 403 48 -26 613 455 270 853 794 553 446 764 583 415 557 -160 212 472 -396 -278
1881b78L52p29r2P20p58r6P3K24J5K36N21o15K98J72l5R1O52p01M93K78m46L66
$$ -278 74 -655 -747 -27 -785 -881 -808 -584 -569 -333 188 -427 -129 43 8 99 751 50 543 821 375 741
1903G41j1m68K07J95l97l66M06l28k39J7J30l88O9M4o07N70K25p71M87K9R3J73
$$ 741 730 262 469 664 267 -99 307 -21 -260 -243 -113 -501 -432 -388 -995 -425 -200 -971 -484 -455 -362 -189
1925a89J70P7KL55O6j51J69M8k86O21m45k03L94n35l91R34o70J7p2r0j06m02J88
$$ -189 -19 58 60 415 481 330 499 547 261 882 437 234 628 93 -298 636 -34 -17 -89 -179 -285 -687 -499
1948d99rL3J5n45L09N47r2k04N67j87k75N12K61l00K57K37q0K48l99M49l58kj23
$$ -499 -508 -475 -460 -1005 -696 -149 -241 -445 122 -65 -340 172 433 133 390 627 547 795 396 845 487 485 362
1971C62k92J97p5n52M52n76l04O66n39N2K07J39k52J00k7Q7K57n9k3M32L7O2j57
$$ 362 70 267 192 -360 92 -484 -788 -122 -661 -609 -402 -263 -515 -415 -442 -355 -98 -157 -180 252 289 351 194
1994A94P81n19r0N75m66Q5l9m05J25J03m61K00j89Q6l00k24M51n06L75j02o78
$$ 194 975 456 366 941 475 560 521 116 241 344 -117 83 -106 -20 -320 -544 -93 -599 -224 -326 -1004
2015a004M50J79R9p9J41O0M01q7m3K27n9J00K72l61L73m60J80kl84K70O9k19j22
$$ -1004 -554 -375 -276 -355 -214 -154 247 160 117 344 285 385 657 296 669 209 389 387 3 273 342 123 1
2038Ak90L14k45k56l2O8l3r5k19J59L38l80O68J28N9J9K22n6K28l34M36J18n03
$$ 1 -289 25 -220 -476 -508 -440 -473 -568 -787 -628 -290 -670 -2 126 185 204 426 370 598 264 700 818 315
2061C15J64l2m62N04k32J89n56j63J23M2m63N69o18J05K3k60N57j51j54M93k22
$$ 315 479 447 -15 489 257 446 -110 -273 -150 -108 -571 -2 -620 -515 -492 -752 -195 -346 -500 -7 -229
2082b29J50M27j31M80o02K15O7J6l42N77j80k1j41O4K96l21n09N62n42K74k33
$$ -229 -79 348 217 697 95 310 377 393 51 628 448 427 286 350 646 325 -184 378 -164 110 -123
2103a23n10O0j66l4L11r4l25M61p6J44k2N73J46o33L91M36J4ml14L17J97m65J59
$$ -123 -633 -573 -739 -773 -462 -556 -881 -420 -496 -352 -374 199 345 -288 103 539 553 549 235 552 749 284 443
2126D43J80l40N8j04l04Q4m38J89k52j90L82r7j14n6M77J77J73m89M13M00q28
$$ 443 623 283 341 237 -67 17 -421 -232 -484 -674 -292 -389 -503 -559 -82 95 268 -221 192 592 -236
2147b36J04L46l05L49l90M40k4n3O4J12k10N2K08N6j66m67M5K13n86K98J00N7
$$ -236 -132 214 -91 258 -132 308 284 231 295 407 197 249 457 513 347 -120 -75 138 -448 -150 -50 7
2169Gn73j45O48l57R0J77j81k54N61n36O41m9m3J71J81k40L36L61l79j51n3M75
$$ 7 -566 -711 -63 -420 -330 -153 -334 -588 -27 -563 78 29 -14 157 338 98 434 795 416 265 212 687
2191F87n88l22L39k6l2l59M1O2j92k28J61M5J4K99l74J91J8J54k7j75q4O94N2
$$ 687 99 -223 116 90 58 -301 -260 -198 -390 -618 -457 -412 -398 -99 -473 -282 -264 -110 -137 -312 -396 298 350
2214C50l38K58k40O96n57l0K80K03k29j72J32Lj35p7R0m05M6J01n69J39K6j94
$$ 350 12 270 30 726 169 139 419 622 393 221 353 356 221 144 234 -171 -125 -24 -593 -454 -428 -622
2236f22K5r7mM77j08l18N06J39J56j84O38K56n92N00o8j61J93j10l57Ol62K87
$$ -622 -597 -694 -698 -221 -329 -647 -141 -2 154 -30 608 864 272 772 704 543 736 626 269 275 -87 200
2258B00k06m66J92l4k43J64m74M72J14l07J04K93j27K51j75K82L37l43J3K80k50
$$ 200 -6 -472 -280 -314 -557 -393 -867 -395 -281 -588 -484 -191 -318 -67 -242 40 377 34 47 327 77
2279G7K84L31q7j40o7J40j39k78N9j04l23L29m62J93K90q61K68K96k22j32L87
$$ 77 361 692 605 465 398 538 399 121 180 76 -247 82 -380 -187 103 -758 -490 -194 -416 -548 -161
2300a61l3l44O8K84rl04Q49l49M80R7l61N68j43k98J56K72m68r4J9n7k75j52J81
$$ -161 -194 -538 -470 -186 -195 -499 350 1 481 578 217 785 642 344 500 772 304 210 229 172 -103 -255 -74
2323g4l23p9O0j61J08J89k79M24Q5m56L13P8j58M10J24j12K57Q4O2m02J31j3J29
$$ -74 -397 -476 -416 -577 -469 -280 -559 -135 -50 -506 -193 -115 -273 137 261 149 406 490 552 150 281 268 397
2346C97K1k82k47M77k44k52J43q0j68M6J04m18M49k41K14l65J5P4K7J75j80LN08
$$ 397 418 136 -111 366 122 -130 13 -67 -235 -189 -85 -503 -54 -295 -81 -446 -431 -357 -330 -155 -335 -332 176
2369A76j22K52Q7m82L60j3L76k99nJ89l60R5J15j17m29M03n92N4K80m99K09N52
$$ 176 54 306 393 -89 271 258 634 335 330 519 159 254 369 252 -177 226 -366 -312 -32 -531 -322 230
2391B30p64j00M09k47L90n30P17l36K28M8j75M70J82l63l3L79l86L23L4m89N4
$$ 230 -534 -634 -225 -472 -82 -612 105 -231 -3 45 -130 340 522 159 126 505 119 442 476 -13 41
2412D1O24m09k64J82k42k0k12J29j51J02j00k60J90N3j73M53O2l50L40J53J1j19
$$ 41 665 256 -8 174 -68 -88 -300 -171 -322 -220 -320 -580 -390 -337 -510 -57 5 -345 -5 148 159 40
2434D0J13L22j19J2L09j94qj89Q4j5K6m35K23p9m66O14l19l14K25k9j09j28J76
$$ 40 153 475 356 368 677 483 475 286 370 355 381 -54 169 90 -376 238 -81 -395 -170 -199 -308 -436 -260
2457b60L2l9K27k17O2M31k18J36N03p20K05M25k80M5Q1l5J5l87K45j03j65M34
$$ -260 -228 -267 -40 -257 -195 236 18 154 657 -63 142 567 287 332 413 378 393 6 251 148 -17 417
2479D17m78j21J66k73R4K87m30K59l45r1j26M65R9j28J46L5J37J36j7Q2JK35n66
$$ 417 -61 -182 -16 -289 -195 92 -338 -79 -424 -515 -641 -176 -77 -205 -59 -24 113 249 232 314 315 550 -16
2502a6K78J53j44L05l33j36J74R9j69M8k55j76J31j09j85k00M22j6m37N12l9j42
$$ -16 262 415 271 576 243 107 281 380 211 259 4 -172 -41 -150 -335 -535 -113 -129 -566 -54 -93 -235
2524b35J26j6J13O2j31K93R4R6j72lJJ76l96L80l84j2K28j20k68L09k95K04j49
$$ -235 -109 -125 -12 50 -81 212 306 402 230 227 228 404 8 388 4 -8 220 100 -168 141 -154 50 -99
2547i9j3j50j3J58l75R7K08j14N7K21L9k05J91j05L95J45K2m2j0J66o2j13k84
$$ -99 -112 -262 -275 -117 -492 -395 -187 -301 -244 -23 16 -189 2 -103 292 437 459 417 407 573 511 398 114
2570A14J72j80k4J52j24j17k47n3q5j30L5J73o3o7k2M6L44K21k67K57q1K27n0
$$ 114 286 106 82 234 110 -7 -254 -307 -392 -522 -487 -314 -377 -444 -466 -420 -76 145 -122 135 54 281 231
2593B31J27K55l63j4L21k25j5J97k61M13q08J13o4l13J81k6n9J04k96L12J06l17
$$ 231 358 613 250 236 557 332 317 514 253 666 -142 -29 -93 -406 -225 -251 -310 -206 -502 -190 -84 -401
2615d01o1K29j57J53K39j16K97k39R8J92n3K54j88K34K60n24j18L14k84J63j21
$$ -401 -462 -233 -390 -237 2 -114 183 -56 42 234 181 435 247 481 741 217 99 413 129 292 171
2636A71o3N8m30M7k6j49K8J54m12J85q7L93k73Q4J20K48R8l7K47j58J73k13K76
$$ 171 108 166 -264 -217 -243 -392 -364 -210 -622 -437 -524 -131 -404 -320 -200 48 146 109 356 198 371 158 434
2659D34j18m1M9j12o9j70J34m1q4k10p2N9k01L44J00k64J15l04M07n3R9J05l85
$$ 434 316 275 324 212 143 -27 107 66 -18 -228 -300 -241 -442 -98 2 -262 -147 -451 -44 -97 2 107 -278
2682b78J86Q3j63L11j63L38j30M1r3J33q3O8j94J42K57k00l03m5j04L24k23r8
$$ -278 -92 -9 -172 139 -24 314 184 225 132 265 182 250 56 198 455 255 -48 -93 -197 127 -96 -194
2704a94l5R9m91N50k30j83M54k54K10J62j10j45J22m3K75j73O6R2K57N7J8l54
$$ -194 -229 -130 -621 -71 -301 -484 -30 -284 -74 88 -22 -167 -45 -88 187 14 80 172 429 486 504 150
2726A50K42l17r5K15k7k95L18o07K75k24K58j20q1K73k58J43N7l64M57N2k09J2
$$ 150 392 75 -20 195 168 -127 191 -416 -141 -365 -107 -227 -308 -35 -293 -150 -93 -457 0 52 -157 -145
2748a45K35k38L91k89k88O62j07J42r8K2L3J3j90M7k07J78l39k5k7J5R5j7k62
$$ -145 90 -148 243 -46 -334 328 221 363 265 287 320 333 143 190 -17 161 -178 -203 -230 -215 -120 -137 -399
2771c99M00n17M22k53M05k27K7J43l99O62m04K49L13k66J96J55l23k3R3r1j08
$$ -399 1 -516 -94 -347 58 -169 -142 1 -398 264 -140 109 422 156 352 507 184 161 254 163 55
2792E5K07j30J7l69J29J1j32K4K0o3P4k6j66K46j26M2J03M5m4J65O4j20K64j06
$$ 55 262 132 149 -220 -91 -80 -212 -188 -168 -231 -157 -183 -349 -103 -229 -187 -84 -39 -83 82 146 26 290 184
2816A84K1L23n82L78l1j04q4Q7N1k9j25J73j34j97j53Q8o2O6r7k13K37N7k28K49
$$ 184 205 528 -54 324 293 189 105 192 243 214 89 262 128 -69 -222 -134 -196 -130 -227 -440 -203 -146 -374 -125
2840a25j01J25J78K70l40j8K9L50R5l91L63j84NO6k38P2k0m0j01l3j41J65k95
$$ -125 -226 -101 77 347 7 -11 18 368 463 72 435 251 256 322 84 156 136 96 -5 -38 -179 -14 -309
2863c09J63o3O8j38J18N4l02M1L73p2K68l2n08K89J90n7N9L72l26j65L28j1k54
$$ -309 -146 -209 -141 -279 -161 -107 -409 -368 5 -67 201 169 -339 -50 140 83 142 514 188 23 351 340 86
2886H6k13J94j9j5r2l01L45j07j71J37K34k39O4K1j98J44K79l02K77j17K22N7
$$ 86 -127 67 48 33 -59 -360 -15 -122 -293 -156 78 -161 -97 -76 -274 -130 149 -153 124 7 229 286
2908B86l39M59l57p3L16k19J45J60l82K43j21j30K98k61qO8k19J85j72O7K4m53
$$ 286 -53 406 49 -24 292 73 218 378 -4 239 118 -12 286 25 17 85 -134 51 -121 -54 -30 -483
2930d83K67k2j28K37J82j93J51O2k64M88k02L8K2K93n9j92K38o6j04J3O8m03J66
$$ -483 -216 -238 -366 -129 53 -140 11 73 -191 297 95 133 155 448 389 197 435 369 265 278 346 -57 109
2953A09l38J79j53K79r8o5j21j44K4J10P4l90L67L17j88k6q7K40J31r2j24M77
$$ 109 -229 -50 -203 76 -22 -87 -208 -352 -328 -218 -144 -534 -167 150 -38 -64 -151 89 220 128 4 481
2975D81l29J73j76j5L14l68N4p2%J0l08J48L25l69Q2K1l54M5K06m06L41J50K9
$$ 481 152 325 149 134 448 80 134 62 62 72 -236 -88 237 -132 -50 -29 -383 -338 -132 -538 -197 -47 -18
2998a8O9j25K37l80J93J70o7j89K57J7K01j43k99L55k67J71J2k21J96k82J7J55
$$ -18 51 -74 163 -217 -24 146 79 -110 147 164 365 222 -77 278 11 182 194 -27 169 -113 -96 59
3020E9l41J36Qj87N7M05m86J69N5l80N55o0K1J57n6j04r9M17j92L59l19L6j98
$$ 59 -282 -146 -138 -325 -268 137 -349 -180 -125 -505 50 -10 11 168 112 8 -91 326 134 493 174 210 12
3043A2R2L44k29j4k21K7k7J27j86O9k75k0K19k48J40j72M43k82J10J36Q1p9M8
$$ 12 104 448 219 205 -16 11 -16 111 -75 -6 -281 -301 -82 -330 -190 -362 81 -201 -91 45 126 47 95
3066I5J08n09O27j20J41J8o0p8j85J9J38j65J82l76K29J51k50n1L2p9J85l98m1
$$ 95 203 -306 321 201 342 360 300 222 37 56 194 29 211 -165 64 215 -35 -86 -54 -133 52 -346 -387
3089c87J71J66K3P5k54J57M3O1j59P1J33Mp2J4J72P0M3l38J0J27q1J34j46M2j39
$$ -387 -216 -50 -27 48 -206 -49 -6 55 -104 -33 100 104 32 46 218 288 331 -7 3 130 49 183 37 79 -60
3114f0j71J57l02P3R6P2j83L41l18K42j20Q5j23J93N9m1J91k32K31j24O5R9j6
$$ -60 -231 -74 -376 -303 -207 -135 -318 23 -295 -53 -173 -88 -211 -18 41 0 191 -41 190 66 131 230 214
3137B14P3j85j11M1K67k36K5P5m96J72j72L78l01J68o7j23J55K8l6J8l4J71j9
$$ 214 287 102 -9 32 299 63 88 163 -333 -161 -333 45 -256 -88 -155 -278 -123 -95 -131 -113 -147 24 5
3160EM3K48n2j10K16J88l28J69k27P8J11p6l04J89k08N7j4j18J30j83k24L01j08
$$ 5 48 296 244 134 350 538 210 379 152 230 341 265 -39 150 -58 -1 -15 -133 -3 -186 -410 -109 -217
3183b17m1j90J95p3Q7RM19j00J12K3M0j02j5k93L18J80k36P4q5k35k5M34j07j85
$$ -217 -258 -448 -253 -326 -239 -230 189 89 201 224 264 162 147 -146 172 352 116 190 105 -130 -155 279 172 -13
3207a3o4R3j00J48j55j92K96l39K47P7l74M53k39o4L36j75L39j93o3j81J20J41
$$ -13 -77 16 -84 64 -91 -283 13 -326 -79 -2 -376 77 -162 -226 110 -65 274 81 18 -163 -43 98
3229I8J60j84O0J89l13p8J55m7K14l30K13l1l42nK19m7J83o4k83K25k20K41k68
$$ 98 258 74 134 323 10 -68 87 40 254 -76 137 106 -236 -241 -22 -69 114 50 -233 -8 -228 13 -255
3252b55K05K4j03k7L86J65l60J83k14j30j4L07L08l54N1l51n1L7K65n54L85r1
$$ -255 -50 -26 -129 -156 230 395 35 218 4 -126 -140 167 475 121 172 -179 -230 -193 72 -482 -97 -188
3274a88J22j7J55r7J55m11M3J76Oj08O8R2j04n4L71j74k2J30M0o8K7q7J64J7j07
$$ -188 -66 -83 72 -25 130 -281 -238 -62 -56 -164 -96 -4 -108 -162 209 35 13 143 183 115 142 55 219 236 129
3299A29J33j71o8J08k72N0j18M6k4K27k44N1K10k22J52K6j48K25q0J81j57k8L72
$$ 129 262 91 23 131 -141 -91 -209 -163 -187 40 -204 -153 57 -165 -13 13 -135 90 10 191 34 6 378
3322C78k32L36m82K25L59k46k04J9j01O6J46m32M55o83K46J1r1J13j27L8pJ31
$$ 378 146 482 0 225 584 338 134 153 52 118 264 -168 287 -396 -150 -139 -230 -117 -244 -206 -213 -82
3344h2NQ5j76K5K80Jk79M45j84P6j73K9K06k31K73k49j35J87j55P3J0q1l2K8j
$$ -82 -77 8 -168 -143 137 138 -141 304 120 196 23 52 258 27 300 51 -84 103 -52 21 31 -50 -82 -54 -55
3369e5k40l22L37K88L9l14K46k49M17p8o9P1l9K63k59J84L40n82k9K22P6k51K42
$$ -55 -295 -617 -280 8 47 -267 -21 -270 147 69 0 71 32 295 36 220 560 -22 -51 171 247 -4 238
3392B38m4k11l3j71K83q9Q5k4l32K62j05o2j78M70j90q3J39P3o6q3Q8q5K49J71
$$ 238 194 -17 -50 -221 62 -27 58 34 -298 -36 -141 -203 -381 89 -101 -184 -45 28 -38 -121 -33 -118 131 302
3416C02j94j25J99R1r4J0k22K18J52n84M02n1q8k18J36J51L4j64J9J3O0l01m7
$$ 302 108 -17 182 273 179 189 -33 185 337 -247 155 104 16 -202 -66 85 119 -45 -26 -13 47 -254 -301
3439c01J21k28K49j43J93kL55K5k69K33p1r1k20NM20k00J91l15k09L61K4n1M3
$$ -301 -180 -408 -159 -302 -109 -111 244 269 0 233 162 71 -149 -144 276 76 267 -48 -257 104 128 77 120
3462A20k93J77j56J01J5m3j23pO0J46k15J17Pk6L08R6l82P3J84j31J6l4K47k47
$$ 120 -173 4 -152 -51 -36 -79 -202 -209 -149 -3 -218 -101 -94 -120 188 284 -98 -25 159 28 44 10 257 10
3486A0L67n75L46J9j66N4M6Mn34K26L47m40J68l3R5k21J36K33J01k41J28j48k7
$$ 10 377 -198 148 167 1 55 101 105 -429 -203 144 -296 -128 -161 -66 -287 -151 82 183 -58 70 -78 -105
3509a05lL20R1j16k52J61K48k71Q4J51j38J3j76Oq3k2N3J61K5k48mM4o6j70K26
$$ -105 -108 212 303 187 -65 96 344 73 157 308 170 183 7 13 -70 -92 -39 122 147 -101 -105 -61 -127 -297 -71
3534g1j3J1j87M13j43MJ27pJ89j66R8P7k86L93l81Q9l53L55j47q3Q7J48l67J01
$$ -71 -84 -73 -260 153 10 14 141 134 323 157 255 332 46 439 58 147 -206 149 2 -81 6 154 -213 -112
3558a12L03k36N2m1l59M44j84k16K42K2l5N4j39K63r8K01O4k8m2J29k43M1R7j07
$$ -112 191 -45 7 -34 -393 51 -133 -349 -107 -85 -120 -66 -205 58 -40 161 225 197 155 284 41 82 179 72
3582G2J03J15k32j87L17r0k87M5K10j51j77M3p7K55pk50R4r2P3K3J61j83K86N3
$$ 72 175 290 58 -129 188 98 -189 -144 66 -85 -262 -219 -296 -41 -48 -298 -204 -296 -223 -200 -39 -222 64 117
3606A17m5N0L13k52N5k82L46m49K48J42j80k07Q3M7J89k51m5R1l29K32K7j15R6
$$ 117 72 122 435 183 238 -44 302 -147 101 243 63 -144 -61 -14 175 -76 -121 -30 -359 -127 -100 -215 -119
3629a19o4K98j91P4J26j97K71J51m40J24J65p0o3j06J5J8o7L0k4P0j89L50k02
$$ -119 -183 115 -76 -2 124 -73 198 349 -91 33 198 128 65 -41 -26 -8 -75 -45 -69 1 -188 162 -40
3652d0j8L7p5k16J32j87M13L3l22Q7R5J15j72J66j41K01J63n8j60L60j38l61K42
$$ -40 -58 -21 -96 -312 -180 -367 46 79 -243 -156 -61 54 -118 48 -93 108 271 213 53 413 275 -86 156
3675A56Lk9j87K7O9k19J35N9j49J21j06P5J3J4j37j74J94O4o1j53M88j69Ql2j13
$$ 156 159 130 -57 -30 39 -180 -45 14 -135 -14 -120 -45 -32 -18 -155 -329 -135 -71 -132 -285 203 34 42 10 -103
3700a03L32k08J40j2p2J03q4P0j36K16o7J5k10J6o8J8o9R1j4m9J12j84J02m8R2
$$ -103 229 21 161 149 77 180 96 166 30 246 179 194 -16 0 -68 -50 -119 -28 -42 -91 21 -163 -61 -109 -17
3725a7j62q6L45m3j03j01J66J30q6J32j5k30m5J58p0J34K7j2m6J47j10l55K60
$$ -17 -179 -265 80 37 -66 -167 -1 129 43 175 160 -70 -115 43 -27 107 134 122 76 223 113 -242 18
3748A8l63O07m02J19N0q9j59J49nJ82l38K15K44k09J3O6l1j14R6O8J75j92j01
$$ 18 -345 262 -140 -21 29 -60 -219 -70 -75 107 -231 -16 228 19 32 98 67 -47 49 117 292 100 -1
3771aL46k9j70P6k77N2N4o1j62j1R9k8l9l31L09J01p2J80J61l63J60K3j64J08
$$ -1 345 316 146 222 -55 -3 51 -10 -172 -183 -84 -112 -151 -482 -173 -72 -144 36 197 -166 -6 17 -147 -39
3795c9Q7j01J26J9J1J55k41K27mj56J44l86K48k39K18L2o7k56Q2%J64k3k28K05
$$ -39 48 -53 73 92 103 258 17 244 240 84 228 -158 90 -149 69 101 34 -222 -140 -140 24 1 -227 -22
3819b2j2j83L69k36K60J05l04j09J59K87k09J10p4J21k88K68k44M2o7p5r6R1Q3
$$ -22 -34 -217 152 -84 176 281 -23 -132 27 314 105 215 141 262 -26 242 -2 40 -27 -102 -198 -107 -24
3842b4K1J20k31J77R8j34k44L26m78N01k16L7K07j96K2J24k38K40O8R6K7M4k17
$$ -24 -3 117 -114 63 161 27 -217 109 -369 132 -84 -47 160 -36 -14 110 -128 112 180 276 303 347 130
3865A30j1j62J12R8l71M65k73k90L65o5p4K02j19j31m3J08R8r2j90O9K03PM5K66
$$ 130 119 -43 69 167 -204 261 -12 -302 63 -2 -76 126 7 -124 -167 -59 39 -53 -243 -174 29 36 81 347
3889C47o2n03L79M5j42P6J83l11N2j86q8J94j62K40J7o0k83M77p6j23k96Q2K76
$$ 347 285 -218 161 206 64 140 323 12 64 -122 -210 -16 -178 62 79 19 -264 213 137 14 -282 -200 76
3912G6q9n7j2J34J35n5m3po3j38J97R2L8k23J13m3J34m25M74k70K24K4k59M0j09
$$ 76 -13 -70 -82 52 187 132 89 82 19 -119 78 170 208 -15 98 55 189 -236 238 -32 192 216 -43 -3 -112
3937a12J88l78M7J03K79m36p3M49l13R4J87l20J41K67j76m4L42j38l6o7j43N04
$$ -112 76 -302 -255 -152 127 -309 -382 67 -246 -152 35 -285 -144 123 -53 -97 245 107 71 4 -139 365
3959C65M4j77j65K50l61J15P7k34m2k7k3J85j12Q4j88L5J18n4l7K69m5q5Q4r3
$$ 365 409 232 67 317 -44 71 148 -86 -128 -155 -178 7 -105 -21 -209 -174 -56 -110 -147 122 77 -8 76 -17
3983a7Q9L91j40k27J09k59J93n2j15j00J59K94k91j76n8J17P5jl9P5J70k58R5
$$ -17 72 463 323 96 205 -54 139 87 -28 -128 31 325 34 -142 -200 -83 -8 -9 -48 27 197 -61 34
4006C4k2k35J92m0j4j71L57k24K46J53k45q0L08k99L67k69J08J3q8m0J65k31j49
$$ 34 12 -223 -31 -71 -85 -256 101 -123 123 276 31 -49 259 -40 327 58 166 179 91 51 216 -15 -164
4029a64J67j04Q3P2k38K80o3j11L5j13Q9j97J75R5j89K62J14l63M5L53M3q7q4
$$ -164 3 -101 -18 54 -184 96 33 -78 -43 -156 -67 -264 -89 6 -183 79 193 -170 -125 228 271 184 100
4052A00j10K57L6k23j61q0L2K34j09MK1m2j84K93O0k23k28L87k31J49m6KR8k51
$$ 100 -10 247 283 60 -101 -181 -149 85 -24 -20 1 -41 -225 68 128 -95 -323 64 -167 -18 -64 -62 36 -215
4076b15n7K45K59m08R7K19j96K65M7r8k96L82k62N8j1J51j77k6q0M5q8P8j12N7
$$ -215 -272 -27 232 -176 -79 140 -56 209 256 158 -138 244 -18 40 29 180 3 -23 -103 -58 -146 -68 -180 -123
4100a23j73K20l3j90L70j78p2P2J10O1O9j8l9m5L0M17l32O5L3j79J09k06L8K9
$$ -123 -296 -76 -109 -299 71 -107 -179 -107 3 64 133 115 76 31 61 478 146 211 244 65 174 -32 6 35
4124C5J88k18O7j03l17L67j91L27m8k9l29K63O7J9o9p2R3Q2M4j29K9K14m61J4
$$ 35 223 5 72 -31 -348 19 -172 155 107 78 -251 12 79 98 29 -43 50 132 176 47 76 290 -171 -157
4148a57J98J54J7j09j00J8O4J73r2l77J00o1N9L31l15N8j18J70j01K30j41l38
$$ -157 41 195 212 103 3 21 85 258 166 -211 -111 -172 -113 218 -97 -39 -157 13 -88 142 1 -337
4170c37L62K7J70j32J42l73L99L9k86k48M97j74j3J39m5Q1k26L5j0k27P8L6j47
$$ -337 25 52 222 90 232 -141 258 297 11 -237 260 86 73 212 167 248 22 57 47 -180 -102 -66 -213
4193b13J83rq2K92j91j23J17O3J07k70k81M49K15k41p2qK95j17J5j2J2m0J90l31
$$ -213 -30 -39 -121 171 -20 -143 -26 37 144 -126 -407 42 257 16 -56 -64 231 114 129 117 129 89 279 -52
4217e2%K65j87Rk03K8K67j18j87J30k33K75k42J36N1q7K88l54L59r2j15n6M3J12
$$ -52 -52 213 26 35 -168 -140 127 9 -178 -48 -281 -6 -248 -112 -61 -148 140 -214 145 53 -62 -118 -75 37
4241C7J69j33m1Q5j66L54l36j03K71n6O3j93m4K14k64k52N51j78L6j56o1K87j51
$$ 37 206 73 32 117 -49 305 -31 -134 137 81 144 -49 -93 121 -143 -395 156 -22 14 -142 -203 84 -67
4264f7J47L7j99o9K8K60J69k19n6J25m1j68M7K61j21q0K60k77J11k78K83k21r3
$$ -67 80 117 -82 -151 -123 137 306 87 31 156 115 -53 -6 255 134 54 314 37 148 -130 153 -68 -161
4287a61j98L14n1k16R8j11L69l22J78jPK14o5j4J04j27K24k25J91j21N7J0j67
$$ -161 -359 -45 -96 -312 -214 -325 44 -278 -100 -101 -94 120 55 41 145 18 242 17 208 87 144 154 -13
4310a3J87o5l2J18k07k3R1J03l31J88j03m1j87J72M7P8r3J40J68k24K33k95L2
$$ -13 174 109 77 195 -12 -35 56 159 -172 16 -87 -128 -315 -143 -96 -18 -111 29 197 -27 206 -89 -57
4333e7J21J05J24k26P7M3k51l5J95l58Q3K18j86J36Q4l30K35N1k42J93r5l0P9
$$ -57 64 169 293 67 144 187 -64 -99 96 -262 -179 39 -147 -11 73 -257 -22 29 -213 -20 -115 -145 -66
4356f6pP4K7J9p4J23k36J38p6O4N8Q2p1O2j35K7k15J90o5R6Q9J04j04j10q3L7
$$ -66 -73 1 28 47 -27 96 -140 -2 -78 -14 44 126 55 117 -18 9 -206 -16 -81 15 104 208 104 -6 -89 -52
4382e2mLL6J22j20k66L04m95M00J87r9j24J8j34J39K63k73K39j12P1J7l70L08
$$ -52 -56 -53 -17 105 -15 -281 23 -472 -72 115 16 -108 -90 -224 -85 178 -95 144 32 103 120 -250 58
4405E8R5p9k2o4M9j8n2l15M81m79L92l0pK2j58j28J62N7r3J93j03K91l35J39L4
$$ 58 153 74 52 -12 37 19 -33 -348 133 -346 46 16 9 31 -127 -255 -93 -36 -129 64 -39 252 -83 56 90
4430I0Q0j81L34k25k50J83J33Kl06l1L02J42j71j07J42r6n6k81N9Q9O8j0J79p7
$$ 90 170 -11 323 98 -152 31 164 166 -140 -171 131 273 102 -5 137 41 -15 -296 -237 -148 -80 -90 89 12
4454A2J06j04j60J57J26N7n7j13N2M8j24L34l22k65L34p5o3K3N4j2J52m5m9k64
$$ 12 118 14 -146 11 137 194 137 24 76 124 0 334 12 -253 81 6 -57 -34 20 8 160 115 66 -198
4478a98J94k8l7QN1j75K35j75j9J26k00M41k19m4L14k51K09p2o0J73l22K0rJ12
$$ -198 -4 -32 -69 -61 -10 -185 50 -125 -144 -18 -218 223 4 -40 274 23 232 160 100 273 -49 -29 -38 74
4502G4k66L08m89N56m12J9j7J09o9J53j59L20k39K0L0K39n2J2k02J75j5j40J15
$$ 74 -192 116 -373 183 -229 -210 -227 -118 -187 -34 -193 127 -112 -92 -62 177 125 137 -65 110 95 -45 70
4525G0J81j84k02r6K77M8jq9N5r7J24l49J12J02l8j63L10o2j22N7j16K72j94J85
$$ 70 251 67 -135 -231 46 94 93 4 59 -38 86 -263 -151 -49 -87 -250 60 -2 -124 -67 -183 89 -105 80
4549H0j08K6m8J42L6L0j8M1p1m25L11k6K50l07N2J09M7lk01n3J42k21K5N2J6J2
$$ 80 -28 -2 -50 92 128 158 140 181 110 -315 -4 -30 220 -87 -35 74 121 118 -83 -136 6 -215 -190 -138 -122 -110
4575a10J9j07L1J11q6O4J38J10r0k4q1J93L0k88L07j89m5j0j12J56J33j60k3J
$$ -110 -91 -198 -167 -56 -142 -78 60 170 80 56 -25 168 198 -90 217 28 -17 -27 -139 17 150 -10 -33 -32
4599c2j4l70K85p5n3K15p9Qj48K67j52J04p5J84k41L32j26n7K7M9J19k62L09k77
$$ -32 -46 -416 -131 -206 -259 -44 -123 -115 -263 4 -148 -44 -119 65 -176 156 30 -27 0 49 168 -94 215 -62
4623f2R4K4j35j3J39r3L7Or5K40l51j76L61M2n4j84J48M0P3j79M1p2K43l8k39
$$ -62 32 56 -79 -92 47 -46 -9 -3 -98 142 -209 -385 -24 18 -36 -220 -72 -32 41 -138 -97 -169 74 36 -203
4648b03O6J55RK43l47K22N8l50K97k56M6J74q6k74M14J93n87J0m6M24k12J0N3
$$ -203 -137 18 27 270 -77 145 203 -147 150 -106 -60 114 28 -246 168 361 -226 -216 -262 162 -50 -40 13
4671A3j79O8P5M2l50K60n3L88j14q8J75k51K52l10K73k95K48q0j20L13n2k11j41
$$ 13 -166 -98 -23 19 -331 -71 -124 264 150 62 237 -14 238 -72 201 -94 154 74 -46 267 215 4 -137
4694a37K35j15n4q6J78j11qO0O1k33J44J15k00L37k45j3R5RK9J06l5j24K90k33
$$ -137 98 -17 -71 -157 21 -90 -98 -38 23 -210 -66 49 -151 186 -59 -72 23 32 61 167 132 8 298 65
4718F5O7k33J78K13j48k27o3K8M09l58q6J46M4j82J23k75R2KM58n43L92K5m4K1
$$ 65 132 -101 77 290 142 -85 -148 -120 289 -69 -155 -9 35 -147 -24 -299 -207 -205 253 -290 102 127 83 104
4742A04o7J69j93L04j54j35P7k2J08k14r3J06O0N2j13n4k3o0o4J29j31K94J3j14
$$ 104 37 206 13 317 163 28 105 83 191 -23 -116 -10 50 102 -11 -65 -88 -148 -212 -83 -214 80 93 -21
4766b1m1K0p2J82j86l5K52j9J04j70J13k5M7k24J21J13J94j64k45K25j75N4p7
$$ -21 -62 -42 -114 68 -118 -153 99 80 184 14 127 102 149 -75 46 159 353 189 -56 169 -6 48 -29
4789b9pk4J08k1j91K3K77q7j81n1l4p8L35k84k5k8M70l0l20K51q5K70l01j01K70
$$ -29 -36 -60 48 27 -164 -141 136 49 -132 -183 -217 -295 40 -244 -269 -297 173 143 -177 74 -11 259 -42 -143 127
4814A27j54k3J17r7J40O5M3k20K6J14k63q3J66l3j53M41l23M4L8j31K63k20K91
$$ 127 -27 -50 67 -30 110 175 218 -2 24 138 -125 -208 -42 -75 -228 213 -110 -66 -28 -159 104 -116 175
4837A75l51J77K31j74q3P4M4j10J80l00K09L0j15J34q4j60q5j22M38m37J90P4
$$ 175 -176 1 232 58 -25 49 93 -17 163 -137 72 102 -13 121 37 -123 -208 -330 108 -329 -139 -65
4859f5K44j33K00j33J9m03K89j65%M52k44J04k46K42Q8j46k9N2k0j60J14J7o4
$$ -65 179 46 246 113 132 -271 18 -147 -147 305 61 165 -81 161 249 103 74 126 106 -54 60 77 13
4882A3n3j90n6K33j80l2N22m37K04k18l1qJ26K40r1P8k03j74j3K55M4J28j03j67
$$ 13 -40 -230 -286 -53 -233 -265 257 -180 24 -194 -225 -233 -107 133 42 120 -83 -257 -270 -15 29 157 54 -113
4906a13M7j4P9O3o8j72j24L92O0K1l27K40R6j86o5j50L35j38L9M6N7k76Q3L03
$$ -113 -66 -80 -1 62 -6 -178 -302 90 150 171 -156 84 180 -6 -71 -221 114 -24 15 61 118 -158 -75 228
4930B28l48J60j50J30K18k82K00M8oj04j8l2Q6j77J67j15M5j42J86J2r0n7l77
$$ 228 -120 40 -110 20 238 -44 156 204 198 94 76 44 130 -47 120 5 50 -92 94 106 16 -41 -418
4953d18L29K2R8P9j58oL8j37m2J84J69k28N2J91j89K17j27Kk4J77k52P5j70J18
$$ -418 -89 -67 31 110 -48 -54 -16 -153 -195 -11 158 -70 -18 173 -16 201 74 76 52 229 -23 52 -118 0
4977@j08l1k7K60j97J53j38P5j32o2M50m4k19j99K34J15j54q6J76K18j2j37k8
$$ 0 -108 -139 -166 94 -103 50 -88 -13 -145 -207 243 199 -20 -219 15 130 -24 -110 66 284 272 135 107
5000A07j2j81K78k59j19L62k69J37r4N4O1k33j2j34L47J02j88Q0k30J99p4K02
$$ 107 95 -86 192 -67 -186 176 -93 44 -50 4 65 -168 -180 -314 33 135 -53 27 -203 -4 -78 124
5022A24p4M7o3J74j03J0J6np1J7N6J96n20J09m5J9K48l15K42k22J94j49K15l18
$$ 124 50 97 34 208 105 115 131 126 55 72 128 324 -196 -87 -132 -113 135 -180 62 -160 34 -115 100 -218
5046b18n4j18M84l85K04j7J56j40J4o1l0J34j58J46Jj67P5L03j93p2J96J5J2j34
$$ -218 -272 -390 94 -291 -87 -104 52 -88 -74 -135 -165 -31 -189 -43 -42 -209 -134 169 -24 -96 100 115 127 -7
5070gj50K39J52j61j05J74l29K32k98J54J16j22P5K08k26r3j84N02j56k6QL05
$$ -7 -157 82 234 73 -32 142 -187 45 -253 -99 17 -105 -30 178 -48 -141 -325 177 21 -5 3 308
5092C08m17j0P4J94J33j90O4n90N93k01K30j25j3J9j3l21l6J92J85J29m98L89
$$ 308 -109 -119 -45 149 282 92 156 -434 159 -42 188 63 50 69 56 -265 -301 -109 76 205 -293 96
5114I6m04P0J06J55K55k84j20L92k20j3J7j47L20k58j48J24Jo8L39p9j16L4l72
$$ 96 -308 -238 -132 23 278 -6 -126 266 46 33 50 -97 223 -35 -183 -59 -58 -126 213 134 18 52 -320
5137c20LL95k29J92R7m32p2Q5J01K25rl02M6J08K91j12J64j38l36J79J02J8j32
$$ -320 -317 78 -151 41 138 -294 -366 -281 -180 45 36 -266 -220 -112 179 67 231 93 -243 -64 38 56 -76
5160g6p1K42p2m6j9K1j18O0j56K01L9P1j54Q7KM5K21l30P1K9P7l57J78J38J02
$$ -76 -147 95 23 -23 -42 -21 -139 -79 -235 -34 5 76 -78 9 11 56 277 -53 18 47 124 -233 -55 83 185
5185A85k20O3l8P8J92k70l5J42q2k2M9Nj43j20Q2J57J50m04L7QJ32Q6j30K10j62
$$ 185 -35 28 -10 68 260 -10 -45 97 15 -7 42 47 -96 -216 -134 23 173 -231 -194 -186 -54 32 -98 112 -50
5210e0K27l15m5M1oJ73k1J07pJ61m98N20l40J16j22O1L1j51L64l29J39J14J94
$$ -50 177 -138 -183 -142 -148 25 4 111 104 265 -233 287 -53 63 -59 2 33 -118 246 -83 56 170 364
5233C64l25o9k1K51k53J33k79K37J03k22n3J16j21P9q6R7M5Q0K53n2m67N02l64
$$ 364 39 -30 -51 200 -53 80 -199 38 141 -81 -134 -18 -139 -60 -146 -49 -4 76 329 277 -190 312 -52
5256e2j8L28k40j64L12k66l8K8P0r9m3R7K19m70K70j94J72J40l81M3P3J57j71
$$ -52 -70 258 18 -146 166 -100 -138 -110 -40 -139 -182 -85 134 -336 -66 -260 -88 52 -329 -286 -213 -56 -227
5279b27L74j13K47q5l8r4K7p1J46l07J79j7K52m00J61k41L45p2q4j6j9K19k91
$$ -227 147 34 281 196 158 64 91 20 166 -141 38 21 273 -127 34 -207 138 66 -18 -34 -53 166 -125
5302a25m6M8K08J6k93J69N5k01O3J00l09M49k1k71L07l12lM12j27q6lL17j66j45
$$ -125 -171 -123 85 101 -192 -23 32 -169 -106 -6 -315 134 113 -158 149 -163 -166 246 119 33 30 347 181 36
5326C6M4k39J82p7Ol5J65l30L26p9R1l3k09J52J99j41p1r6J16m5l2J17p1j63N3
$$ 36 80 -159 23 -54 -48 -83 82 -248 78 -1 90 57 -152 0 199 58 -13 -109 7 -38 -70 47 -24 -187 -134
5351a34J71q8O7L4k53K79r2J67l19J30p4M2j4J82k56L2q6L79j37J51j91N5n7K5
$$ -134 37 -51 16 50 -203 76 -16 151 -168 -38 -112 -70 -84 98 -158 -126 -212 167 30 181 -10 45 -12 13
5375A3J51p8R9j96p3J50k7j16J88k54J41j0P9k15RM3J18j1J86l06M6p3R3M0o5
$$ 13 164 86 185 -11 -84 66 39 -77 111 -143 -2 -12 67 -148 -139 -96 22 11 197 -109 -63 -136 -43 -3 -68
5400f8q2J03k8q3J62J08k76O0J3O9J50k85J83mJ45m4K9j35j40PK08j47P4o3Q5
$$ -68 -150 -47 -75 -158 4 112 -164 -104 -91 -22 128 -157 26 22 167 123 152 17 -123 -116 92 -55 19 -44 41
5425D1OL14n00K16k11N3K54m0J08l69n1L41l09K31j1j41M0o9J17l7k4J46o4k24
$$ 41 47 361 -139 77 -134 -81 173 133 241 -128 -179 162 -147 84 73 -68 -28 -97 20 -17 -41 105 41 -183
5449a83L28J13j15l98J17o1L47l78J3L68k18qQ2j54L2K21l8k9J3K3k16k6J92P8
$$ -183 145 258 143 -255 -138 -199 148 -230 -217 151 -67 -75 7 -147 -115 106 68 39 52 75 -141 -167 25 103
5473A03J58j42k39J4P6J79k22O9j07J66m6o5J14L7k40M3L4n6J60j27J90j35J46
$$ 103 261 119 -120 -106 -30 149 -73 -4 -111 55 9 -56 58 95 -145 -102 -68 -124 36 -91 99 -36 110
5496A10k38J08j13J98j75J46r0K33r5k10J94J80j17m38L76j29L55k56j13qJ84
$$ 110 -128 -20 -133 65 -110 36 -54 179 84 -126 68 248 131 -307 69 -60 295 39 -74 -82 102
5517A02k38P6J45ql8n0k50K62k90N0L81j20k79L07MJ66L4L3m41K17J1J1q3l5J46
$$ 102 -136 -60 85 77 39 -11 -261 1 -289 -239 142 22 -257 50 54 220 254 287 -154 63 74 85 2 -33 113
5542A13J11j17j51J44n8R6k09J05k35K45J1j3J98n43K47n7N05l91k77K67K5lr0
$$ 113 224 107 -44 100 42 138 -71 34 -201 44 55 42 240 -303 -56 -113 392 1 -276 -9 16 13 -77
5565g7K17k25p9J0L01J0o0j71J94J01k1j75k04j27J35K60L5l10K48J24j77j57
$$ -77 140 -85 -164 -154 147 157 97 -74 120 221 200 25 -179 -306 -171 89 124 -186 62 186 9 -148
5587a48J80J45j81j96K47m3j54M79m22K09k4r5J84k76J78LQ2k2j47m4NJ89o9j02
$$ -148 32 177 -4 -200 47 4 -150 329 -93 116 92 -3 181 -95 83 86 168 146 -1 -45 -40 149 80 -22
5611b2J33j59J06L8k98p6K31K3p4K89k63N5k18J31Q9J07r0k17P4K23J57m04M70
$$ -22 111 -48 58 96 -202 -278 -47 -24 -98 191 -72 -17 -235 -104 -15 92 2 -215 -141 82 239 -165 305
5634C05j37j34j4K36l14J14k28q4K21o3J68j70j09L36l54L19p6k54J95j22M04
$$ 305 168 34 20 256 -58 56 -172 -256 -35 -98 70 -100 -209 127 -227 92 16 -238 -43 -165 239
5655B39k56k22J44N4K58k33OJ75k15J37Q3k3m74N79k45n6O7R4k57J88j6j44K52
$$ 239 -17 -239 -95 -41 217 -16 -10 165 -50 87 170 147 -327 252 7 -49 18 112 -145 43 27 -117 135
5678A35j48J82k32m9K09l18M72k24l2Q2p6J52k06K27k60K51j8J20j80l0r8J44
$$ 135 -13 169 -63 -112 97 -221 251 27 -5 77 1 153 -53 174 -86 165 147 267 87 57 -41 103
5700A03rl07L75l85K94m39L61K3J9j29J0J24l5J55j92j84J86J1J85J41k98m2p1
$$ 103 94 -213 162 -223 71 -368 -7 16 35 -94 -84 40 5 160 -32 -216 -30 -19 166 307 9 -33 -104
5723a04J23j11J61j05J37j00j8n5l3J34K92l46o7O6j49K07j59l9Qn6J10O3J99
$$ -104 19 -92 69 -36 101 1 -17 -72 -105 29 321 -25 -92 -26 -175 32 -127 -166 -158 -214 -104 -41 158
5746A58J1j68j45r0L09K00j75k9k19J97L0l12L12J11p1j93r2O1k20L59k40j1J49
$$ 158 169 1 -144 -234 75 275 100 71 -148 49 79 -233 79 190 119 -74 -166 -105 -325 34 -206 -217 -68
5769f8j35M65m47L44k31j63r7L75j20J49r1q8k40L23q1l7J28n7J35j01Q4k16L28
$$ -68 -203 262 -185 159 -72 -235 -332 43 -77 72 -19 -107 -347 -24 -105 -142 -14 -71 64 -37 47 -169 159
5792A59q7k41K11P2j44q5M02l55K81j85M7J45k61jJ65r1mk7q7J93l62P3J94J59
$$ 159 72 -169 42 114 -30 -115 287 -68 213 28 75 220 -41 -42 123 32 28 1 -86 107 -255 -182 12 171
5816A71j73j5J19j12n0J53m21L98QrL7p6j14J17p6J05K2m9j21R4j7p7M7j68K55
$$ 171 -2 -17 102 -10 -60 93 -328 70 78 69 106 30 -84 33 -43 62 84 35 -86 8 -9 -86 -39 -207 48
5841D8p5j6PJ9m0j22L45j07L5j4r9P9J22k13K03j80N4R4k99J91m9R0k83K27j37
$$ 48 -27 -43 -36 -17 -57 -179 166 59 94 80 -19 60 182 -31 172 -8 46 140 -159 32 -17 73 -210 17 -120
5866a20Q7o9K31j87o2j7P4p9O4q6n4J39J78j2K4m1Q8r3k52L41k54k02K80q4j3
$$ -120 -33 -102 129 -58 -120 -137 -63 -142 -78 -164 -218 -79 99 87 111 70 158 65 -187 154 -100 -302 -22 -106 -119
5891a19J69k63m8J03J99j12K00kk14K4k97M36J1j77J26M0k10j14L78q3l85K01
$$ -119 50 -213 -261 -158 41 -71 129 127 -87 -63 -360 76 87 -90 36 76 -134 -248 130 47 -338 -137
5913a37K85k51L4K28l2k2j65P8j11q8K51o5p3J96r0n5l5l8k1J21N2jp5j54N46
$$ -137 148 -103 -69 159 127 105 -60 18 -93 -181 70 5 -68 128 38 -17 -52 -90 -111 10 62 61 -14 -168 378
5938C78l70j58J15K14j44l4l8L5k55K65j25L55l06J02j15R7J77l13Q8J8j87J04
$$ 378 8 -150 -35 179 35 1 -37 -2 -257 8 -117 238 -68 34 -81 16 193 -120 -32 -14 -201 -97
5960i7R6M3j70J21k64N15m33Q4pk00L19L4kJ5O2l45O67l04O7n6K9k12K44k21L3
$$ -97 -1 42 -128 -7 -271 244 -189 -105 -112 -312 7 41 39 54 116 -229 438 134 201 145 174 -38 206 -15 18
5985A8j20Q6j73J19J06p8j18J65J3l08J87K27r5k64K5J27J12O2N4k36O6O1j75
$$ 18 -102 -16 -189 -70 36 -42 -160 5 18 -290 -103 124 29 -235 -210 -83 29 91 145 -91 -25 36 -139
6008a39K53O9k75l2K94k2k08j77K29Mn8q1m2lJ60N4K3J96L9k82n8M5P3j28m3K71
$$ -139 114 183 -92 -124 170 148 -60 -237 -8 -4 -62 -143 -185 -188 -28 26 49 245 284 2 -56 -11 62 -66 -109 162
6034A62j36j9p4J54j35PK33j35J54J7k57K11j70j6R2k81M65l02r5M04l99q7P6
$$ 162 26 7 -67 87 -48 -41 192 57 211 228 -29 182 12 -4 88 -193 272 -30 -125 279 -120 -207 -131
6057a31L1j5J30J6j42l5K61j14n7K02j79K62l65q2N32m22J12R7J26k32r8K19j64
$$ -131 -100 -115 15 31 -111 -146 115 1 -56 146 -33 229 -136 -218 314 -108 4 101 227 -5 -103 116 -48
6080d8J12R2k43K05l03%J83Q9m4k44L92p9j28R2m27J90K84K5j20l9J30n1o2K33
$$ -48 64 156 -87 118 -185 -185 -2 87 43 -201 191 112 -16 76 -351 -161 123 148 28 -11 119 68 6 239
6104B39O0l72n1nj3j3L70n9l3n0J14k60O7k23K66j03O0O4r0r3J40k9RJ53j12o2
$$ 239 299 -73 -124 -129 -142 -155 215 156 123 73 187 -73 -6 -229 37 -66 -6 58 -32 -125 15 -14 -5 148 36 -26
6130b6K2j78r5K72K15l19P8P5N1L6j88L14l94J29K7p5M8J79J3m86L56k21K27j83
$$ -26 -4 -182 -277 -5 210 -109 -31 44 95 131 -57 257 -137 -8 19 -56 -8 171 184 -302 54 -167 60 -123
6154a23p4K77k93M41k54j73j7M18n07J25J35n7J67j89K07R0j27J49k72O9M0J28
$$ -123 -197 80 -213 228 -26 -199 -216 202 -305 -180 -45 -102 65 -124 83 173 46 195 -77 -8 32 160
6176A60r4q5N7j38O8K20j91j21M9K3qq4L18k35K12j69j26J36J46l00J89k89N03
$$ 160 66 -19 38 -100 -32 188 -3 -124 -75 -52 -60 -144 174 -61 151 -18 -144 -8 138 -162 27 -262 241
6199B41m17L11Mk45J30j7M6R1nL5j41J57k78j8J24J81j97J43j09r1k9L6kJ13K0
$$ 241 -176 135 139 -106 24 7 53 144 139 174 33 190 -88 -106 18 199 2 145 36 -55 -84 -48 -50 63 83
6224H3o4l9j50L06q9M5J52k75q8J44j36j24J54K31k06L50l91Q1m7l66K93K2K1
$$ 83 19 -20 -170 136 47 92 244 -31 -119 25 -111 -235 -81 150 -56 294 -97 -16 -63 -429 -136 -114 -93
6247i3Q5N5n7L8P5j08j04l7L56o8O5rl37K31k16J54K0Mj57L66l0l45L65k20p2
$$ -93 -8 47 -10 28 103 -5 -109 -146 210 142 207 198 -139 92 -124 30 50 54 -103 263 233 -112 253 33 -39
6272c9L32l81m9J58Q2J10l45K7Q1P2q6K0j10K56m51M05R0j21J55o1j12J82k30
$$ -39 293 -88 -137 21 103 213 -132 -105 -24 48 -38 -18 -128 128 -323 82 172 51 206 145 33 215 -15
6295a5K33l53J98Q7k69J42j9K89o92N47m59K85l7J42j4j17R7j68Q1l7J03j68J72
$$ -15 218 -135 63 150 -119 23 4 293 -399 148 -311 -26 -63 79 65 -52 45 -123 -42 -79 24 -144 28
6318B8j56J09J5K48l38n9K69r2k2m0R9m3j49K36j79N0oJ75m7o8k30R4Q5J92l43
$$ 28 -128 -19 -4 244 -94 -153 116 24 2 -38 61 18 -131 105 -74 -24 -30 145 98 30 -200 -106 -21 171 -172
6343a72M5K21l85L19r1l9mj52K13K86j69M1r7K2N2o9J22j38j12J65p3j21O7J87
$$ -172 -127 94 -291 28 -63 -102 -106 -258 -45 241 72 113 16 38 90 21 143 5 -107 58 -15 -136 -69 118
6367A18j91J31j65Q2M5j65K29J15l22N4n7j1J20p7L53l34j5J98J1j34j02K78k3
$$ 118 -73 58 -107 -25 20 -145 84 199 -123 -69 -126 -137 -17 -94 259 -75 -90 108 119 -15 -117 161 138
6390A38n3j01K29j17j39O2J03q0KN7l76N69m16j33K53k56J28R9O4O7opl61K54
$$ 138 85 -16 213 96 -43 19 122 42 44 101 -275 294 -122 -255 -2 -258 -130 -31 33 100 94 87 -274 -20
6414b0j1O3P4l06M85n55L11q7K52k42K24J37l53M4l3M9k06N0R3Q6J09k06k16K13
$$ -20 -31 32 106 -200 285 -270 41 -46 206 -36 188 325 -28 16 -17 32 -174 -124 -31 55 164 -42 -258 -45
6438d5j1j50R0J31O4k7k26K88k84N12n50Q1L21k18k4K8R5J29Pk66R8L1j70j22
$$ -45 -56 -206 -116 15 79 52 -174 114 -170 342 -208 -127 194 -24 -48 -20 75 204 211 -55 43 74 -96 -218
6462b18J40J96o7Q0K20m91N7J86k17K61l50K87R4l26J87K25k22j01J09j26J18
$$ -218 -78 118 51 131 351 -140 -83 103 -114 147 -203 84 178 -148 39 264 42 -59 50 -76 42
6483D2K9J6j1N5j54l11R8M97j39r0J58jQ7k27r2R6j47K78k23o1J98m2O2k80J15
$$ 42 71 87 76 131 -23 -334 -236 261 122 32 190 189 276 49 -43 53 -94 184 -39 -100 98 56 118 -162 -47
6508d7K07J05l00j35R5J35j01J03r1J50j81L1l6J92P4k97K30p4O3k80J64N3j66
$$ -47 160 265 -35 -170 -75 60 -41 62 -29 121 -60 -29 -65 127 201 -96 134 60 123 -157 7 60 -106
6531a06pK52l79J2L40k81K63p5J3j9k28L35Q1j71J19m11L86j66L9m1q1J25J00
$$ -106 -113 139 -240 -228 112 -169 94 19 32 13 -215 120 201 30 149 -262 124 -42 -3 -44 -125 0 100
6554A00m6j07K23jk74K77k32J81on7l06L25j1k01J72j84L46j38o4O0l9o8J67j00
$$ 100 54 -53 170 169 -105 172 -60 121 115 58 -248 77 66 -135 37 -147 199 61 -3 57 18 -50 117 17
6578A7j4J71r0J16j05m00K19JK11k43q5K81nL4j44k06J89m3Q9q4J8M0KJ61M9j15
$$ 17 3 174 84 200 95 -305 -86 -85 126 -117 -202 79 74 108 -36 -242 -53 -96 -7 -91 -73 -33 -31 130 179 64
6604F4q1pJ53q8j3p2j04J33p2J47q8R5M7O2j99J67j67j88L42q9kk54L12j91K64
$$ 64 -17 -24 129 41 28 -44 -148 -15 -87 60 -28 67 114 176 -23 144 -23 -211 131 42 40 -214 98 -93 171
6629A71K0r9j05J59j00l1j06J95l2O5m13L89o7J01l1N3k7J61k98K31k63l61M86
$$ 171 191 92 -13 146 46 15 -91 104 72 137 -276 113 46 147 116 169 142 303 5 236 -27 -388 98
6652I8l10K27k67j52L77K85m17J77n9J17j33J30J60l35J01oJ60l3j32r7j2m0K69
$$ 98 -212 15 -252 -404 -27 258 -159 18 -41 76 -57 73 233 -102 -1 -7 153 120 -12 -109 -121 -161 108
6675A08j05J5m5j45J29J15l2J28k62K24l31K68j11J04J9l4K8o4j22J1J5L6Q4p3
$$ 108 3 18 -27 -172 -43 72 40 168 -94 130 -201 67 -44 60 79 45 73 9 -113 -102 -87 -51 33 -40
6699d0K0J77r9l17K12k5K02j49K76j53L7j00J04j17J58j54r9j64J70p1J57J1j8
$$ -40 -20 157 58 -259 -47 -72 130 -19 257 104 141 41 145 28 186 32 -67 -231 -61 -132 25 36 18
6722A8J95k40o0r9K25op6k0r0K41Qm6j54K84j95k53N04k43K9J4K2M5m4l7K7M7
$$ 18 213 -27 -87 -186 39 33 -43 -63 -153 88 96 50 -104 180 -15 -268 236 -7 22 36 58 103 59 22 49 96
6748I6p3j96J27J10k2l48K2M84l09J50j11m4m6J31j21K08j48L20l37J76o6j84
$$ 96 23 -173 -46 64 42 -306 -284 200 -109 41 -70 -114 -160 -29 -150 58 -90 230 -107 69 3 -181
6770a81K00q9N7Q2J7M1j03l67L03J6J60J82j59j62j48j62M82k65%K85k56j62N40
$$ -181 19 -70 -13 69 86 127 24 -343 -40 -24 136 318 159 -3 -151 -313 169 -96 -96 189 -67 -229 311
6793C11k04j2j38K59m7k4P4k25J5j42o4J86j0j33K39j94Q4j6J75q9m49M03K21
$$ 311 107 95 -43 216 169 145 219 -6 9 -133 -197 -11 -21 -154 85 -109 -25 -41 134 45 -404 -1 220
6816B20l36r9J72J05K0j67L0M22l52L7O8j50J17K59l06m5L1K2r4K96k28L1q4j1
$$ 220 -116 -215 -43 62 82 -85 -55 367 15 52 120 -30 87 346 40 -5 26 48 -46 250 22 53 -31 -42
6840d2K8K5k56R2K27j29r7p4L2K84j05j65K52k5q2J95k32M1K92j1l43p5J32O8
$$ -42 -14 11 -245 -153 74 -55 -152 -226 -194 90 -15 -180 72 47 -35 160 -72 -31 261 250 -93 -168 -36 32
6864C2J46p7j0QK28l75k07K19K4o7Q2J22j56K01l21K39r8r4j6M3J48j53%K68K0
$$ 32 178 101 91 99 327 -48 -255 -36 -12 -79 3 125 -31 170 -151 88 -10 -104 -120 -77 71 -82 -82 186 206
6889B06j55n3r1K28k16J44l84K74K68j60k32Q3j3K40k75L34l26K76j58j28P3P0
$$ 206 51 -2 -93 135 -81 63 -321 -47 221 61 -171 -88 -101 139 -136 198 -128 148 -10 -138 -65 5
6911EL5q7R1m2L3k34K30j08q5J20k88J28L35j32L4n1J31j05J78k15L16l61j04
$$ 5 40 -47 44 2 35 -199 31 -77 -162 -42 -330 -202 133 1 35 -16 115 10 188 -27 289 -72 -176
6934a76J37J2J24j90j42L46J7k89K39K9Rk90J99n8or3L9P7J18m3m1R4K7n5m0R1
$$ -176 -39 -27 97 -93 -235 111 128 -161 78 107 116 -174 25 -33 -39 -132 -93 -16 102 59 18 112 139 84 44 135
6960A35m0j13P6k13j13N05l42J94q7O0L2q5l68N78l06kQ6j4J32J73l58l3J88q2
$$ 135 95 -18 58 -155 -268 237 -105 89 2 62 94 9 -359 219 -87 -89 -3 -17 115 288 -70 -103 85 3
6984CP5J9k31L68n01M71j11K6Lj23J26l3j38j58J97J51j69j16QJ44j52J44R4J71
$$ 3 78 97 -134 234 -267 204 93 119 122 -1 125 92 -46 -204 -7 144 -25 -141 -133 11 -141 3 97 268
7008B68m47o4L71m19J36J15MJ56J67k66j02nJ36j84N8J99k04P2n3J06K00j36R3
$$ 268 -179 -243 128 -291 -155 -40 -36 120 287 21 -81 -86 50 -134 -76 123 -81 -9 -62 44 244 108 201
7031B01j03k32L23k10P3j54J58qn4l4j9J87J6j24K7r1PK14j44m8J21k48j37K46
$$ 201 98 -134 189 -21 52 -102 56 48 -6 -40 -59 128 144 20 47 -44 -37 177 33 -15 106 -142 -279 -33
7055c3r3K28j69M36l44m7k2N6k15j08M10O0j68m1L8J93j17j74K04p0j72M6K17
$$ -33 -126 102 -67 369 25 -22 -44 12 -203 -311 99 159 -9 -50 -12 181 64 -110 94 24 -148 -102 115
7078A15j18O6Q0QM5k90K45L7l19j3J3J17M5K24j4p6l29J50k05K28J78J37l13r2
$$ 115 -3 63 143 151 196 -94 151 188 -131 -144 -131 -14 31 255 241 165 -164 -14 -219 9 187 324 11 -81
7102h1l1K45j84l5J89O0j46J68m7k7l13J30Q8j17N4K17l7p8OK47l76n4K33J4l90
$$ -81 -112 133 -51 -86 103 163 17 185 138 111 -202 -72 16 -101 -47 170 133 55 61 308 -68 -122 111 125 -265
7127b65J89J97j14p3K26k14K69l24j27J33K43P3l22L3J38p8J66j47J13%j45J72
$$ -265 -76 121 7 -66 160 -54 215 -109 -236 -103 140 213 -109 -76 62 -16 150 3 116 116 -29 143
7149A43k29L38o1l60O0J25J96k80j73J29K03J20j79R4l97L10l38K45Q6O5k49J45
$$ 143 -86 252 191 -169 -109 16 212 -68 -241 -112 91 211 32 126 -271 39 -299 -54 32 97 -152 -7
7171gJ6J08ook07K17k32MJ37J51m6k27l02L55J62k98M08k44j18Q4R8K97m10j26
$$ -7 9 117 111 105 -102 115 -117 -113 24 175 129 -98 -400 -45 117 -181 227 -17 -135 -51 47 344 -66 -192
7195a92P6N5L9K0j62L38k83J41J16j35j6J03K6kL8k51L19k68j2K71o8l6k02J28
$$ -192 -116 -61 -22 -2 -164 174 -109 32 148 13 -3 100 126 124 162 -89 230 -38 -50 221 153 117 -85 43
7219D3m5K4J59m00J46K32k68K09j33k06L00j4J38r0k61p7K76J83j51p4P6N5q1
$$ 43 -2 22 181 -219 -73 159 -109 100 -33 -239 61 47 185 95 -166 -243 33 216 65 -9 67 122 41
7242D1p0J10R5o6K18n4l93J86k29O7Q4O7k45K21m6p8JJ24k41L05J3o9j03p7K25
$$ 41 -29 81 176 110 328 274 -119 67 -162 -95 -11 56 -189 32 -14 -92 -91 33 -208 97 110 41 -62 -139 86
7267H6m2l56M15j15J2k6N8J53n4l2J81k60J72j97%K6J9J16j92n7j97Q0K82O3O9
$$ 86 44 -312 103 -12 0 -26 32 185 131 99 280 20 192 -5 -5 21 40 156 -36 -93 -290 -210 72 135 204
7292B04m09L1n2L06k86J63J81j65k8L09j11J10j79K81l65k92M32j37o6K38r9N4
$$ 204 -205 -174 -226 80 -206 -43 138 -27 -55 254 143 253 74 355 -10 -302 130 -7 -73 165 66 120
7314A20k96N2K59q7p8N5j12K17j6k80L64k07j20K59J21j94j21K70k56%J96j72
$$ 120 -176 -124 135 48 -30 25 -87 130 114 -166 198 -9 -129 130 251 57 -64 206 -50 -50 146 -26
7336b6l0j00K12o8J80j50Q4j42n5L45q7l06J74r0J3r4P7J04k29r7J11J15n2j07
$$ -26 -56 -156 56 -12 168 18 102 -40 -95 250 163 -143 31 -59 -46 -140 -63 41 -188 -285 -174 -59 -111 -218
7360b18L60Rj83J47m6J01l04J41r0J69O3j59p6J25Q8J77m39J40L3L6J37m33L28
$$ -218 142 151 -32 115 69 170 -134 7 -83 86 149 -10 -86 39 127 304 -135 5 38 74 211 -222 106
7383A06R4l4J5j40R8l18K87j37p8n0K39n9l66L19L9m3qR3N6o9l71K72K33j52m6
$$ 106 200 166 181 41 139 -179 108 -29 -107 -157 82 23 -343 -24 15 -28 -36 57 113 44 -327 -55 178 26 -20
7408b0L47j86l61j1K94kj48M4m9J19o9j40K39l6k62K45j23L42j73J91j97O8L3
$$ -20 327 141 -220 -231 63 61 -87 -43 -92 27 -42 -182 57 21 -241 4 -119 223 50 241 44 112 145
7431A45J24n1k10q9J95j83j98K24j7J27j26o1k8J34K61m34K73J65l26R9oPm7j42
$$ 145 269 218 8 -81 114 -69 -267 -43 -60 67 -59 -120 -148 -14 247 -187 86 251 -75 24 18 25 -22 -164
7455a64N6j2k4J52J26J20k03j77J67n1J4K33l41J42r3J16j71J91j33P5M8k91L50
$$ -164 -108 -120 -144 8 134 254 51 -126 41 -10 4 237 -104 38 -55 61 -110 81 -52 23 71 -220 130
7478A30j86j98K05J0m7K16k48k16M36k35K65j24j25K90k84K34q9k27K43Q3n4l9
$$ 130 -56 -254 -49 -39 -86 130 -118 -334 102 -133 132 8 -117 173 -111 123 34 -193 50 133 79 40
7500D0j62K69o8k5j35J9j98K4J36J3K22j21j79n6K37L4p3n4N4R2l37J59o1J53
$$ 40 -122 147 79 54 -81 -62 -260 -236 -100 -87 135 14 -165 -221 16 50 -23 -77 -23 69 -268 -109 -170 -17
7524a7K1K40l08K10Rk60K69k12K62n2m7l72P5K1K20q8j35Mr0K13K42j36o5R5M0
$$ -17 4 244 -64 146 155 -105 164 -48 214 162 115 -257 -182 -161 59 -29 -164 -160 -250 -37 205 69 4 99 139
7549A39l87J25j78J18J10q2L26k5k41N2L6Rq5J64q5J4j27K00J15l89J84J69k28
$$ 139 -248 -123 -301 -183 -73 -155 171 146 -95 -43 -7 2 -83 81 -4 10 -117 83 198 -191 -7 162 -66
7572f6N4N4q9l1k8R0O4q5J5j27K80j6r0N5k3lm94M67O3J77l40J62j70r5m5R5K13
$$ -66 -12 42 -47 -78 -106 -16 48 -37 -22 -149 131 115 25 80 57 54 -440 27 90 267 -73 89 -81 -176 -221 -126 87
7599H7j15N9O6l09K65jp8j07J4Q8j92K59r1K66k68K36k93J1K47K0k11l1J2KK01
$$ 87 -28 31 97 -212 53 52 -26 -133 -119 -31 -223 36 -55 211 -57 179 -114 -103 144 164 -47 -78 -66 -64 137
7624A37m58N50ml21J12O5J12l34K13l8L8MPn8J41k76J56j11k10k8j9L12N3j01
$$ 137 -321 229 225 -96 16 81 193 -141 72 34 72 76 83 25 166 -110 46 -65 -275 -303 -322 -10 43 -58
7648e8r6K84l20L13k44K13j02j19J54M5Q1k67oJ56k22K60j62J24j56Q8j9j32J68
$$ -58 -154 130 -190 123 -121 92 -10 -129 25 70 151 -116 -122 34 -188 72 -90 34 -122 -34 -53 -185 -17
7671a7n8J51r6J9k9J15J01k27L08l10J30J32l92K83k95Q5N51l29j63j1K14l41
$$ -17 -75 76 -20 -1 -30 85 186 -41 267 -43 87 219 -173 110 -185 -100 451 122 -41 -52 162 -179
7693a79l0K42j82K38N2L8J25l99O6l63N12j35J3m9j76K88l1l13L66k03P4J5j76
$$ -179 -209 33 -149 89 141 179 304 -95 -29 -392 120 -15 -2 -51 -227 61 30 -283 83 -120 -46 -31 -207
7716b07L71l17J28j23K49j78k7M33n05L52j29k53K00Kj05J99j39O1Q4k17L61m71
$$ -207 164 -153 -25 -148 101 -77 -104 329 -176 176 47 -206 -6 -4 -109 90 -49 12 96 -121 240 -231
7738b31L75k33L5KJ51l12J04K79l48K16M0O0k59J12LR8P7k35o1K53l77K86R0o6
$$ -231 144 -89 -54 -52 99 -213 -109 170 -178 38 78 138 -121 -9 -6 92 169 -66 -127 126 -251 35 125 59
7762E9R3k34NK87j33o7M4J0j50J04j48J85K3OQj91N8K1K9j7j64K50J29k06J79
$$ 59 152 -82 -77 210 77 10 54 64 -86 18 -130 55 78 84 92 -99 -41 -20 9 -8 -172 78 207 1 180
7787A80J9k70J46J67n07K02k3j8o4J04N3J47J0j14L5Jk11J05k31K08j18K16o2
$$ 180 199 -71 75 242 -265 -63 -86 -104 -168 -64 -11 136 146 32 67 68 -143 -38 -269 -61 -179 37 -25
7810b5j58J53J38P9k44O0N5J67k32kJ31j52J48j51lK89k71o3r6J91J39l31Q1O6
$$ -25 -183 -30 108 187 -57 3 58 225 -7 -9 122 -30 118 -33 -36 253 -18 -81 -177 14 153 -178 -97 -31
7834c1j35K32j88J44J56j75J3Ok07L83j28NJ01j81J43j1L6m10M76l53J13J14p
$$ -31 -166 66 -122 22 178 3 16 22 -185 198 70 75 176 -5 138 127 163 -247 229 -124 -11 103 96
7857I6r7m1L8L6K03l39j6J04K59l65K52k2r3m0j54K12j16M2o7O2L60k00n1J02
$$ 96 -1 -42 -4 32 235 -104 -120 -16 243 -122 130 108 15 -25 -179 33 -83 -41 -108 -46 314 114 63 165
7881A65k8j80l3j35J21q7J70J07op4j47Q8M0K01m49L81j36K5o0J0O1K3J40m52
$$ 165 137 -43 -76 -211 -90 -177 -7 100 94 20 -127 -39 1 202 -247 134 -2 23 -37 -27 34 57 197 -255
7905b55L89k6k24L13n0l63L44j87K15j33l8K83n57M51j08J93j55l7J14j48j39
$$ -255 134 108 -116 197 147 -216 128 -59 156 23 -15 268 -289 162 54 247 92 55 169 21 -118
7926a18J19j46L24k28nJ72k04OL4J00m77K75L30m96L24j02J31lk0J31j77j28P4
$$ -118 1 -145 179 -49 -54 118 -86 -80 -46 54 -423 -148 182 -314 10 -92 39 36 16 147 -30 -158 -84
7949h4M1n7J34R4j59K6m5J83j23R6k22K49l33L90q7m1j58K97p9j14o5J14K18l47
$$ -84 -43 -100 34 128 -31 -5 -50 133 10 106 -116 133 -200 190 103 62 -96 201 122 8 -57 57 275 -72
7973g2K5J61m78M06k41K27j12J14K42k90K3R6l4p4L2k73L77k02l2K12k90L17M0
$$ -72 -47 114 -364 42 -199 28 -84 30 272 -18 5 101 67 -7 25 -248 129 -73 -105 107 -183 134 174
7996A74r3j20j95J20k14J68J01j89K50j00K29m61L44J22k13J93j18Mj9NJ26j0
$$ 174 81 -39 -234 -114 -328 -160 -59 -248 2 -98 131 -330 14 136 -77 116 -2 2 -17 -12 114 104
8018A04l41K50n8O7J51k43n1J20K7j55J93l0j08K52k72J24M8o0K26p5j54K18j61
$$ 104 -237 13 -45 22 173 -70 -121 -1 26 -129 64 34 -74 178 -94 30 78 18 244 169 15 233 72
8041G2N5J34k29j17j00J88k94N60l69j26P9K06m5k08K60J34m2J6n2J03k71J57
$$ 72 127 261 32 -85 -185 3 -291 269 -100 -226 -147 59 14 -194 66 200 158 174 122 225 -46 111
8063A11k00PP4K63l97Q2J87J36l03l39K41J68l70O30n61J69K19l29M31k18JK83
$$ 111 -89 -82 -8 255 -142 -60 127 263 -40 -379 -138 30 -340 290 -271 -102 117 -212 219 1 2 285
8085B85m7k76J00q7K41j42RJ13l43l5M11k65L6R7j63M4q4L4L17j94k01J7M02m37
$$ 285 238 -38 62 -25 216 74 83 196 -147 -182 229 -36 0 97 -66 -22 -106 -72 245 51 -150 -133 269 -168
8109a68J98L5O3j94J75j71m2J40p2J97j64k97J84J0PJ68j99P7J59j57J09J76k19
$$ -168 30 65 128 -66 109 -62 -104 36 -36 161 -3 -300 -116 -106 -99 69 -130 -53 106 -51 58 234 15
8132A5r8J1j4Q1N2j6M3j07J22m06N60j47j63J07J2N5j70K43k74K16J32j38J32
$$ 15 -83 -72 -86 -5 47 31 74 -33 89 -317 243 96 -67 40 52 107 -63 180 -94 122 254 116 248
8155B48j53k04K53k72L12j72K80k59o5M2k05K20r4N4j26P0mN3k6j03L22m16M17
$$ 248 95 -109 144 -128 184 12 292 33 -32 10 -195 25 -69 -15 -141 -71 -75 -22 -48 -151 171 -245 172
8178A72l28J06k2L7J17n1n0M4j25nN2J39j50
$$ 172 -156 -50 -72 -35 82 31 -19 25 -100 -105 -53 86 -64
8191f4
$$ Imaginary data points
##PAGE= N=2
##DATA TABLE= (X++(I..I)), XYDATA
0@%%%%%%%%%%%%Nj3J6j6J6j9K7l2L9m7N5o3P2q7J00j13J30j49J70j94K19k46K76
$$ 0 0 0 0 0 0 0 0 0 0 0 0 0 5 -8 8 -8 8 -11 16 -16 23 -24 31 -32 40 -47 53 -60 70 -79 91 -103 116 -130 146
35A46l09L49l92M35m85N40o00O65p34Q10q93R86j088J198j320J453j600J765j949
$$ 146 -163 186 -206 229 -256 284 -316 349 -385 425 -468 518 -570 628 -692 761 -839 926 -1023
54a023K154k388K656k965L329l762M284m934N769o873Q411j0701J4447k1563L9433
$$ -1023 1131 -1257 1399 -1566 1763 -1999 2285 -2649 3120 -3753 4658 -6043 8404 -13159 26274
69B6274j59568k40629N48171P6809l81915J19946K08484k54393j5635K57596j37322
$$ 26274 -133294 -373923 174248 251057 -130858 -10912 197572 -56821 -72456 185140 47818
80D7818k09599J99372O8611j97467L6572J34740q8084l7915P4111l4398k5126
$$ 47818 -161781 37591 106202 -91265 -54693 80047 -8037 -45952 28159 -6239 -31365
91c1365P8414o2598j07075J32191Q8102j85820k3789J96858m0995j35548J23361
$$ -31365 47049 -15549 -122624 9567 97669 -88151 -111940 84918 43923 -91625 31736
102C1736P3007j40036J3174J08673j04138l9962J54504o7453j71807J28804J21552
$$ 31736 104743 -35293 -22119 86554 -17584 -57546 96958 29505 -142302 -13498 108054
113A08054j17082k7615N7879m3769M2029R0632j29865r4570J68054K8686j80463
$$ 108054 -9028 -36643 21236 -22533 19496 110128 -19737 -114307 53747 82433 -98030
124i8030L3823J17685r2895l6154J11216k4591p2290Q4188M2613r9720L806J09141
$$ -98030 -64207 53478 -39417 -75571 35645 11054 -61236 22952 65565 -34155 -30349 78792
136G8792l2561r6838L3101N8172j8790k5073l009K483J6728N705k3202L564K7275
$$ 78792 46231 -50607 -17506 40666 21876 -3197 -6206 -3723 13005 18710 -4492 -928 26347
149B6347l9032l9907O2509K0910p6074N704M8741l5595Q097P4479m9037q1277
$$ 26347 -12685 -52592 9917 30827 -45247 -39543 9198 -26397 -18300 56179 7142 -74135
161g4135R1286P8983r9683m6346P1585k568k7098K2107k7726k1198N5550J612
$$ -74135 17151 96134 -3549 -49895 21690 19122 -7976 14131 -13595 -34793 20757 22369
173B2369n4497K6608M0376l9401p395L7973l1160j5843N7568k3894o7963M9423
$$ 22369 -32128 -5520 34856 -4545 -11940 26033 -5127 -20970 36598 12704 -55259 -5836
185e836N4192n8924l2440N6206Q218n0091K0102L9027l8701k2437L7913M282k0674
$$ -5836 48356 -10568 -43008 13198 21416 -28675 -8573 30454 -8247 -30684 7229 11511 -9163
198i163R589K544j7652J5366K6236k0173j7791J8167j390J397K1425l4848l0244
$$ -9163 426 2970 -14682 684 26920 6747 -11044 7123 5733 7130 28555 -6293 -36537
211c6537N5599J6708o4889L34N5702k2562l7150M0189Q922m3250K1761K8705l9907
$$ -36537 19062 35770 -29119 -28785 26917 4355 -32795 7394 16316 -26934 -5173 23532 -16375
224a6375n044L9294q628k6119J0762J2320m260L914l107j4553J4957J7537k3142
$$ -16375 -21419 17875 9247 -16872 -6110 6210 1950 5864 2757 -11796 3161 20698 -2444
237b444n565K4075j0113j7852K1057J1866k8660r052L1494k302l0765J4376J5633
$$ -2444 -8009 16066 5953 -11899 9158 21024 -7636 -16688 14806 12504 -18261 -3885 11748
250A1748k7349j45K7948j2178k3076J6613J7113j4866m143J0452n377N645Q678
$$ 11748 -15601 -15746 12202 24 -23052 -6439 10674 -4192 -8335 2117 -3260 2385 11063
263A1063j8182K163K2761j2894j2873J9109m25j7786J3550J2941k6701o507L1420
$$ 11063 -7119 -4956 17805 4911 -7962 11147 10722 -7064 6486 19427 -7274 -13781 17639
276A7639p491k8970J3155J3555j3556k970P366k988m353N434L757o362L62N388
$$ 17639 10148 -18822 -5667 7888 -5668 -8638 -1272 -4260 -8613 -3179 578 -5784 -5422 -34
290c4k344L900K123p368M626Q300n697n172P891L788j1903M46J5519j0455j3593
$$ -34 -2378 1522 3645 -3723 903 9203 3506 -1666 6225 10013 -1890 -1444 14075 3620 -9973
305i973J6700M191j6313J322Q511o153m744N788l020q587Q739M173j0226L576
$$ -9973 6727 10918 -5395 -4073 4438 -1715 -6459 -671 -3691 -12278 -3539 634 -9592 -6016
319f016O477m185N402L334q521L516R089m520r026O129O642r162o89R134n987
$$ -6016 461 -3724 1678 5012 -3509 7 9096 4576 -4450 1679 8321 -841 -1530 7604 1617
334A617k600R008k269o680K790L426n251n628L967m67p115L138K566l647L123
$$ 1617 -983 8025 5756 -924 1866 5292 41 -5587 -1620 -2087 -9202 -6064 -3498 -7145 -4022
349d022K146q69M097J637l056l87M274rp641K693N617o735J099P169l769j226
$$ -4022 -1876 -2745 1352 2989 -67 -454 3820 3811 -3830 -1137 4480 -2255 -1156 6013 2244 1018
365A018P617Q32o332r14N434m303p594K277j813n238L596o53j903M045J505j80
$$ 1018 8635 9467 3135 2221 7655 3352 -4242 -1965 -3778 -9016 -5420 -6073 -7976 -3931 -2426 -2606
381b606K496K718k159k898L743M15p149L188L839m985L428O840j339p38M877J707
$$ -2606 -110 2608 449 -2449 1294 1709 -5440 -2252 1587 -3398 30 6870 5531 4793 9670 11377
397A1377m614j844K474o181o424J565l372j313J839l236J358O335J659p67J158
$$ 11377 6763 4919 7393 1212 -5212 -3647 -7019 -8332 -6493 -9729 -8371 -2036 -377 -1144 14
412A4K512j203k051L021k302m867K760J524l22L030J225R98J19K122M372l858
$$ 14 2526 1323 -728 2293 -9 -4876 -2116 -592 -914 2116 3341 4339 4458 6580 10952 7094
428G094o454O84q66j870k445m011J053K745O29N29K456L838j710k547M158n85
$$ 7094 640 1324 458 -1412 -3857 -7868 -6815 -4070 -3441 -2912 -456 3382 1672 -875 3283 2698
444B698m748q4m130j898O430N99l649J901N192L650J913R55l295j194M693m351
$$ 2698 -2050 -2134 -6264 -8162 -1732 -1133 -4782 -2881 2311 5961 7874 8829 5534 4340 9033 4682
460D682p730N240k511r188L527N941j078k264m47J890M032J882m114n914K936
$$ 4682 -3048 2192 -319 -9507 -5980 -39 -1117 -3381 -3828 -1938 2094 3976 -138 -6052 -3116
475c116L440k571j021j265J830N613p27P38M069r37j299j225k297K968p21r186
$$ -3116 324 -2247 -3268 -4533 -2703 2910 2183 2921 6990 6053 4754 3529 1232 4200 3479 -5707
491e707m049O807M934m887l048L907K423N049J169p525K779M935p556j457M411
$$ -5707 -9756 -2949 1985 -2902 -5950 -2043 380 5429 6598 -927 1852 6787 -769 -2226 2185
506B185m385l349J890o87M98O255j861q894N373J1399n058o349K356Q67L621K28
$$ 2185 -2200 -5549 -3659 -4346 -3848 2407 546 -8348 -2975 8424 3366 -2983 -627 240 3861 4089
522D089n743K270M304j875j675J489K155p61m532m159K628O022m670j1321L507
$$ 4089 -1654 616 4920 3045 1370 2859 5014 4253 -279 -4438 -1810 4212 -458 -11779 -8272
537h272P347j95L68m614l022J1083M542p527j904M556J052j633m17L99P50j105
$$ -8272 -925 -1120 -752 -5366 -8388 2695 7237 -290 -2194 2362 3414 1781 1364 1763 2513 1408
553A408n065K165J0173n098r704N794L529n66L013o525n993Q504N292q263n366
$$ 1408 -3657 -1492 8681 3583 -6121 -327 3202 2636 5649 -876 -6869 1635 6927 -1336 -6702
568f702M897K337l782r91p84L056L479p858k316J2026J980o577o69J055N882M954
$$ -6702 -1805 532 -3250 -4241 -5025 -1969 1510 -6348 -8664 3362 5342 -1235 -1904 -849 5033 9987
584I987o093n919N178M743l157l107P57j838Q94Q64o844J973N360q554n170O723
$$ 9987 3894 -2025 3153 7896 4739 1632 2389 551 1445 2309 -4535 -2562 2798 -5756 -10926 -4203
600d203K317n69l569l788P593Q564n587n834P451M797m766J620K256n973K995
$$ -4203 -1886 -2455 -6024 -9812 -2219 6345 758 -5076 2375 7172 2406 4026 6282 309 3304
615C304L831r176P60Q769n285p401L650N353j40m817m427J539P577j316r586L8
$$ 3304 7135 -2041 -1281 7488 2203 -5198 -1548 3805 3665 -1152 -5579 -4040 3537 2221 -7365 -7327
631g327N549M68J84k210k373O033K215m009K486J633j256J061j089o85L685J046
$$ -7327 -1778 -1310 -1126 -3336 -5709 324 2539 -1470 1016 2649 1393 2454 1365 680 4365 5411
647E411p191j052R688m85p521J780R03r63L059n316m315O541j183p569K583N096
$$ 5411 -1780 -2832 6856 6371 -1150 630 1533 570 3629 -1687 -6002 539 -644 -8213 -5630 -534
663e34k098j850J632k22K935O082n226n574P716L251l577p72k385J366N029l510
$$ -534 -2632 -4482 -2850 -3072 -137 5945 719 -4855 2861 6112 2535 1763 -622 744 5773 2263
679B263l661L624J122l121J54J177j161m15o31l530K158M320n914k188M927o49
$$ 2263 -1398 2226 3348 227 381 1558 397 -18 -649 -4179 -2021 2299 -3615 -5803 -876 -1525
695a525m54J068k657J587M121k351j673K857R72j716J191P89j800L021Q67o215
$$ -1525 -1979 -911 -3568 -1981 2140 -211 -1884 973 1945 229 1420 2209 409 3430 4297 -1918
711a918L051M877m758k257K172j028J359k16m651M89M207j673m628K440J553k831
$$ -1918 1133 6010 1252 -1005 1167 139 1498 1282 -3369 -2880 1327 -346 -4974 -2534 -981 -3812
727c812J965J329k823K274K341k438J535J197p11J412j002j368K691M11k736p7
$$ -3812 -1847 -518 -3341 -1067 1274 -1164 371 1568 857 2269 1267 -101 2590 3001 265 188
743A88L290j136k830K617J81k241J445j799j808L172k659l415L179l34k541K500
$$ 188 3478 2342 -488 2129 2310 69 1514 -285 -2093 1079 -1580 -4995 -1816 -2150 -4691 -2191
759b191O08k498K120L864k300j866M318J38k204K263j027m71K779k106r66L080
$$ -2191 -1583 -4081 -1961 1903 -397 -2263 2055 2193 -11 2252 1225 754 3533 1427 461 3541
775C541j028j793J845qk691k93J700k414j752J043j349k72J290j146O89K192j891
$$ 3541 2513 720 2565 2557 -134 -427 1273 -1141 -2893 -1850 -3199 -3471 -2181 -3327 -2638 -446 -2337
792b337K119K487k989K23K366k88k240J294P77p30j24J519j114J146J196k642
$$ -2337 -218 2269 -720 -497 1869 1581 -659 635 1412 682 558 2077 963 2109 3305 663
808F63J330J419l692K78J172l033p93J504m16j591O74J021q71Q65J423j397O32
$$ 663 1993 3412 -280 -2 1170 -1863 -2656 -1152 -1568 -3159 -2485 -1464 -2335 -1470 -47 -1444 -812
825h12R27j276K019k53k285J817J441o14N66N17Q1P39j81l14r39M60j077j239
$$ -812 115 -1161 858 605 -1680 137 1578 964 1530 2047 2128 2867 2686 2372 1433 1893 816 -423
843d23K22n84j811J427m71j441K482n69j466J970J97p81M05O18m06n05J278j05
$$ -423 -201 -785 -2596 -1169 -1640 -3081 -599 -1168 -2634 -664 -467 -1248 -843 -225 -631 -1136 142 37
861C7l23J828n22r72K224J59j357J503j072p21J266m31j744n24O81lj930O81N83
$$ 37 -286 1542 1020 48 2272 2431 1074 2577 1505 784 2050 1619 -125 -649 32 29 -1901 -1220 -637
880f37j162M82l87L12N42p93K62Q28j035P11R11q01O62M07N77J89n0Q89L35k93
$$ -637 -1799 -1317 -1704 -1392 -850 -1643 -1381 -553 -1588 -877 34 -767 -105 302 879 1068 1018 1907 2242 1949
900A949l1p05J044J4k546J255P32k996k8R60q28p24j72O98k54m76J274p14l00
$$ 1949 1918 1213 2257 2271 -275 980 1712 -1284 -1312 -352 -1180 -1904 -2076 -1378 -1632 -2108 -834 -1548 -1848
919a848J142k54M90M18j160J997J169j246K35J671L68p70n16J530q08k753J709
$$ -1848 -706 -960 -470 -52 -1212 785 1954 708 943 2614 2982 2212 1696 3226 2418 -335 1374
936A374K95k260p18j91Q00o41j182J340k32o08J404m85K57J50o32J469m02j086
$$ 1374 1669 -591 -1309 -1500 -700 -1341 -2523 -1183 -1415 -2023 -619 -1104 -847 -697 -1329 140 -262 -1348
954a348J180R71n99k69P01K614j135j717K320K37j711l46L7l83j508qJ227j404
$$ -1348 -168 803 204 -65 636 3250 2115 398 2718 2955 1244 898 935 552 -956 -964 263 -1141
972a141n11J074o49M03J11R6m39j008K08J580o61j285O14J320J758k028M14K906
$$ -1141 -1652 -578 -1227 -824 -713 -617 -1056 -2064 -1856 -276 -937 -2222 -1608 -288 1470 -558 -144 2762
990B762k87r77J554n64p20l30l06q27j102R81m56j882J082J126l41n51j467J261
$$ 2762 2475 1498 3052 2488 1768 1438 1132 305 -797 184 -272 -2154 -1072 54 -287 -838 -2305 -1044
1008a044J959k087j187J145P40m65m82J019J209j201L91J717k78J15j93l75j5
$$ -1044 915 -1172 -2359 -1214 -474 -939 -1421 -402 807 -394 -3 1714 1436 1551 1358 983 968
1025I68j08J232r56l191J482K535j335j403o1J312P12j715q50J194j98r62j288
$$ 968 860 2092 1136 -2055 -573 1962 627 -776 -837 475 1187 -528 -1378 -184 -382 -1344 -2632
1042b632J356M60j293J201j00j292L385J345l396N37K510Q29j739j316J563L16
$$ -2632 -1276 -816 -2109 -908 -1008 -2300 1085 2430 -966 -429 2081 2910 1171 -145 1418 1734
1058A734p21p04J67R83q15j962K015M83k056L73l65j071J312L92j367j191N25
$$ 1734 1013 309 476 1459 644 -1318 697 1180 -876 -503 -868 -1939 -627 -235 -1602 -2793 -2268
1075b268K626m01k003O97K032J226k694m51M098r45l106J624J212k01m24r08P38
$$ -2268 358 -43 -2046 -1349 683 1909 -785 -1236 2862 1917 -1189 435 1647 1446 1022 114 852
1092H52L19J81j39j147o41N03J391j213l426J204L443l236j665L358r6j651J39
$$ 852 1171 1352 1213 66 -575 -72 1319 106 -3320 -2116 1327 -1909 -3574 -216 -312 -1963 -1824
1109a824R91J628n47j460R07J833R3j545P79O88j369J644J065l401M80L153k111
$$ -1824 -833 795 248 -1212 -305 1528 1621 76 855 1543 174 1818 2883 -518 -38 3115 1004
1126A004j915O96R39L15k394q75J767J188k064k040K656R84k151P95P70j758K008
$$ 1004 -911 -215 724 1039 -1355 -2230 -463 725 -1339 -3379 -723 261 -1890 -1095 -325 -2083 -75
1143g5J694k118K08J088K11M45q15pJ590m81k024O36K821j869l358K390J239j982
$$ -75 1619 -499 -291 797 1008 1453 638 631 2221 1740 -284 352 3173 1304 -2054 336 1575 -407
1161d07l05n49m60J366m71j222J327n53j2M90j0q05J432J684k393m66L898n51
$$ -407 -712 -1261 -1721 -355 -826 -2048 -721 -1274 -1286 -796 -806 -1611 -179 1505 -888 -1354 2544 1993
1179A993k708J446M94J37O00j694j98J734q63j202Q50R2j211K61O90j852K13J964
$$ 1993 -715 731 1225 1362 1962 268 70 1804 941 -261 589 681 -530 -269 421 -1431 -1218 746
1197G46k181q06J893j96j016Q20j87N91Q12j601N56K106r49r54J264P04q90M92
$$ 746 -1435 -2241 -348 -544 -1560 -740 -927 -336 476 -1125 -569 1537 588 -366 898 1602 712 1204
1215A204N74k055R91J673k297m20R85l81J78p74j609J421J132k361n48J782K89
$$ 1204 1778 -277 714 2387 90 -330 655 274 452 -322 -1931 -510 622 -1739 -2287 -505 -216
1232b16j999J276J036j650J228R42j538J200O76j251J521J99j145J244L20j823
$$ -216 -2215 -939 97 -1553 -325 617 -921 279 955 -296 1225 1424 279 1523 1843 20
1248B0M63J919j418j796J711M20k164P39o8o76R27r74j084J646o09r88R82K66
$$ 20 483 2402 984 -812 899 1319 -845 -106 -174 -850 77 -897 -1981 -335 -944 -1932 -950 -684
1266f84p82J082P07j007j85J893m25j064J563k77L1Q45j090j23J836j572q63J633
$$ -684 -1466 -384 323 -684 -869 1024 599 -465 1098 821 852 1697 607 484 2320 748 -115 1518
1284A518m67j660P11N96j642m41J415j095o58J126o88qQ07p22O34J108j689M84
$$ 1518 1051 -609 102 698 -944 -1385 30 -1065 -1723 -597 -1285 -1293 -486 -1208 -574 534 -1155 -671
1302f71K218q05j114Q94J044q76OJ058q13O1N21j205M69L14j555O86K91j973N28
$$ -671 1547 742 -372 522 1566 690 696 1754 941 1002 1523 318 787 1101 -454 232 523 -1450 -922
1321i22Q42j297k01O63K91p40L26L73k00P11P6o64J131J39j321J499M52j043N60
$$ -922 -80 -1377 -1578 -915 -624 -1364 -1038 -665 -865 -154 -78 -742 389 528 -793 706 1158 115 675
1340F75P61o32O3K92l88k18K81l32q72N02k73j199J205o66q69J298m67r62J033
$$ 675 1436 804 867 1159 771 553 834 502 -370 132 -141 -1340 -135 -801 -1670 -372 -839 -1801 -768
1359g68K48j46j03N44m7j95Q81j91o9P06J42m58Q56o21l48J146p00p60J151j029
$$ -768 -520 -666 -769 -225 -272 -467 414 223 154 860 1002 544 1400 779 431 1577 877 117 1268 239
1379B39j73R3Ln46m62M46m16j00N09p67k58J140p25j73J214p70j7J251l76P2O20
$$ 239 66 159 162 -384 -846 -400 -816 -916 -407 -1174 -1432 -292 -1017 -1190 24 -746 -763 488 112 184 804
1400H04j28k5K57L43l08m42N79l85m3K80r67M1N51j344J05N08r66J73Pmk4J14
$$ 804 676 651 908 1251 943 501 1080 695 652 932 -35 6 557 -787 -682 -174 -1140 -967 -960 -964 -988 -874
1422h74J95K5k06P44j32L22%m03J254k12o53Q56K61n10L2L00j41k93m85O18k92
$$ -874 -679 -654 -860 -116 -248 74 74 -329 925 713 60 916 1177 667 699 999 858 565 80 698 406
1443D06m67M5p64P99m36j178J139j97p11P58p9l69L13L67K57l33L8P22o8P5J41
$$ 406 -61 -16 -780 19 -417 -1595 -456 -653 -1364 -606 -685 -1054 -741 -374 -117 -450 -412 310 242 317 458
1464D58K29L88k31p18J156j41n27K20k82l79K06l80K0l87m99O55m31k07K21m04
$$ 458 687 1075 844 126 1282 1141 614 834 552 173 379 -1 19 -368 -867 -212 -643 -850 -629 -1033
1484a033N56p30J15J215p67n36J411k86K67J25M3N67j72j93K02R8J14k18l30J24
$$ -1033 -477 -1207 -1092 123 -644 -1180 231 -55 212 337 380 947 775 582 784 882 996 778 448 572
1504E72l97M4L65r74j73M88n01J05o38K22O89p88k54R48j72L6k20L08L69n0K08
$$ 572 175 219 584 -390 -563 -75 -576 -471 -1109 -887 -198 -986 -1240 -292 -464 -428 -648 -340 29 -21 187
1525A87L47m15P39J03m00M89l36K06po47N13K18p81l67k53O13N9j190p2M36k32
$$ 187 534 119 858 961 561 1050 714 920 913 266 779 997 216 -151 -404 209 268 -922 -994 -558 -790
1546g90N5k3j4J69K1O0J38PO83j91m10R06J87M6K57n55M74r2n00n9M42p4o36l50
$$ -790 -735 -758 -772 -603 -582 -522 -384 -377 306 115 -295 611 798 844 1101 546 1020 928 428 369 811 737 101 -249
1570b49L70j60o51M56m28l13O00m29j93n6J37P36m51l76O31R44j90q07J41J615
$$ -249 121 -39 -690 -234 -662 -975 -375 -804 -997 -1053 -916 -180 -631 -1007 -376 568 378 -429 -288 1327
1590A327l31q24P12j71j4n0O7k50j31mj45k84j36K36m28l12j54L95L47j024k81
$$ 1327 996 172 884 713 699 649 716 466 335 331 186 -98 -234 2 -426 -738 -892 -497 -150 -1174 -1455
1611a455Q61J05l77K58L31N18k02k58R51k5m15Q8rM31k52K19R2j144O52Q76j101
$$ -1455 -594 -489 -866 -608 -277 241 39 -219 732 707 292 380 371 802 550 769 861 -283 369 1245 144
1632A44m99K85L86k14r17l02J085k57o93n5M81J71o60O01M89o05P57K25r79O99
$$ 144 -355 -70 316 102 -815 -1117 -32 -289 -982 -1037 -556 -385 -1045 -444 45 -560 197 422 -557 142
1652A42L20l9N8J5M2P57n63m35M89N24p06j095Q85L6j045p3J72m18O77n58k25
$$ 142 462 423 481 496 538 1295 732 297 786 1310 604 -491 394 430 -615 -688 -516 -934 -257 -815 -1040
1673a040P01k08K9R2k09K03M34P4n61MJ116j1q39N51N36m00L99l10M2M93o96n80
$$ -1040 -339 -547 -518 -426 -635 -432 2 76 -485 -481 635 624 -215 336 872 472 871 561 603 1096 400 -180
1695a80O28l73n29L5N72q25L03L55p13m18J084o48m95P69k72L67m0m03N41J158
$$ -180 448 75 -454 -419 153 -672 -369 -14 -727 -1145 -61 -709 -1204 -435 -707 -340 -380 -783 -242 916
1715I16o75p6O15M11k69j56L77p65N32J31j050k6L71n23Q6l12k59K23N9o04P1
$$ 916 241 165 780 1191 922 766 1143 378 910 1041 -9 -35 336 -187 -101 -413 -672 -449 -390 -994 -923
1736i23M76J14r69K25P26l37L16L24K9O55L2l07O51j51p9K54l71n83N26J18n20
$$ -923 -447 -333 -1302 -1077 -351 -688 -372 -48 -19 636 668 361 1012 861 782 1036 665 82 608 726 206
1757B06o52Q11J09j150M07K60j31K54p06n13O59r2r86R46j25k74M24N09k92j71
$$ 206 -446 365 474 -676 -269 -9 -140 114 -592 -1105 -446 -538 -1524 -578 -703 -977 -553 -44 -336 -507
1777e07J339j88n78R49l14m5K93o56P5L85p50k06R23m38l94N5R4n46j79M86o53
$$ -507 832 644 66 1015 701 656 949 293 368 753 3 -203 720 282 -112 -57 37 -509 -688 -202 -855
1798h55j37M60o98J22P30l60N35N02p27O28O55m63m25P85J17n42j11N34p77L00
$$ -855 -992 -532 -1230 -1108 -378 -738 -203 299 -428 200 855 392 -33 752 869 327 216 750 -27 273
1818B73J18k97K87J1o30K45J02o06L37J98j017K18L38Q3o42K11O01m95N86J58
$$ 273 391 94 381 392 -238 7 109 -497 -160 38 -979 -761 -423 -340 -982 -771 -170 -665 -79 79
1838G9k91O59l90o75J174J02o33O76K83n49L78k25j57r7L31l02p23M45k26k15
$$ 79 -212 447 57 -618 556 658 25 701 984 435 813 588 431 334 665 363 -360 85 -141 -356
1858c56M32o66l83N12j8n17Q43m63K7M74J99l08Q4J70J45o3N99l29m3P14n15k34
$$ -356 76 -590 -973 -461 -479 -996 -153 -616 -589 -115 84 -224 -140 30 175 112 711 382 339 1053 538 304
1880C04P33o74j46K50m65k00L18r6l27r3j9j37O5J67m40J97L36k39k49Q71l28
$$ 304 1037 363 217 467 2 -198 120 24 -303 -396 -415 -552 -487 -320 -760 -563 -227 -466 -715 156 -172
1901a72J6J78l10K85P33m68k5L15J99k77j44J54q2m3K57p63K88M76r79J21J72
$$ -172 -156 22 -288 -3 730 262 237 552 751 474 330 484 402 359 616 -147 141 617 -362 -241 -69
1922f9o28K98l3j64J9J56J29n00M74R1Lq0N01n7Q8M84o14O29m1l12K05j54j10
$$ -69 -697 -399 -432 -596 -577 -421 -292 -792 -318 -227 -224 -304 197 140 228 712 98 727 686 374 579 425 315
1945C15K29l25M1q2j39n3m9k2m27j36L69m07l48R32k87m79N93J23j05j9K87J27
$$ 315 544 219 260 178 39 -14 -63 -85 -512 -648 -279 -686 -1034 -102 -389 -868 -275 -152 -257 -276 11 138
1967A38N0m8K13j99O43l47l02O68l75k50L55n14j28L83k82j2k57o2L10l06l21
$$ 138 188 140 353 154 797 450 148 816 441 191 546 32 -96 287 5 -7 -264 -326 -16 -322 -643
1988f43L1K14j09j03J60L00j52j60L92j59K81K43L46K6M5m59L38j85K23j35k08
$$ -643 -612 -398 -507 -610 -450 -150 -302 -462 -70 -229 52 295 641 667 712 253 591 406 629 494 286
2009B86J46m06Q1K74n78j1L16n63K04l00J11k25p8J92L50j93J4J68K34K08l31
$$ 286 432 26 107 381 -197 -208 108 -455 -251 -551 -440 -665 -743 -551 -201 -394 -380 -212 22 230 -101
2030a01N4P24p06L98J30k61L50j09P1J21m90K82K8l92j69O0K5k29m83O2J94k56
$$ -101 -47 677 -29 369 499 238 588 479 550 671 181 463 491 99 -70 -10 15 -214 -697 -635 -441 -697
2052f97K40j39j32M11k85N80J45j19K32q3k59M53J51M2l7l91L27J83l73M83k76
$$ -697 -457 -596 -728 -317 -602 -22 123 4 236 153 -106 347 498 540 503 112 439 622 249 732 456
2073D56k78K46o13L16m23j45K70m38j09K44qk7j58K50M22k36j26L68M5o7j67J07
$$ 456 178 424 -189 127 -296 -441 -171 -609 -718 -474 -482 -509 -667 -417 5 -231 -357 11 56 -11 -178 -71
2095g1O03p1l18O05j73L1K55n83L6L00l37k68j62l3q1k60k28K33j91L60l44J15
$$ -71 532 461 143 748 575 606 861 278 314 614 277 9 -153 -186 -267 -527 -755 -522 -713 -353 -697 -582
2117e82M93l6k76O3J78K30k1j34M20K32p7O9j92O4K25o4l37L8j5j05n96j14L54
$$ -582 -89 -125 -401 -338 -160 70 49 -85 335 567 490 559 367 431 656 592 255 293 278 173 -423 -537 -183
2140a83j17L94o54J02O29l88k35L73k92K19M4l31P8L3K35K0j54K30o5L90j1k58
$$ -183 -300 94 -560 -458 171 -217 -452 -79 -371 -152 -108 -439 -361 -328 -93 -73 -227 3 -62 328 317 59
2162E9L94Q0l17RM27p9p40r2N83O5o14K08n0k36Q7k30j56K95q4M0J3P9j34L57
$$ 59 453 533 216 225 652 573 -167 -259 324 389 -225 -17 -67 -303 -216 -446 -602 -307 -391 -351 -338 -259 -393 -36
2186c6q2K25N1J52q4l41O99M8m64K27p6J84j44m37K81r0k32O2n6P1l25r3K11L6
$$ -36 -118 107 158 310 226 -115 584 632 168 395 319 503 359 -78 203 113 -119 -57 -113 -42 -367 -460 -249 -213
2210b13k58L32l55n5O2j8O76o4o13N92K5k04l0L05j0N1J30J27k2j91K68j56K13
$$ -213 -471 -139 -494 -549 -487 -505 171 107 -506 86 111 -93 -123 182 172 223 353 480 458 267 535 379 592
2233E92j74p3r9l79J04K2m29n77O08j83j12j56J71L48m33L27M51j95K6L67j29
$$ 592 418 345 246 -133 -29 -7 -436 -1013 -405 -588 -700 -856 -685 -337 -770 -443 8 -187 -161 206 77
2254G7N27R1n24P24l17l37M30j26l70k26P5J00k18j31l7j37K03j72j9L40l31j52
$$ 77 604 695 171 895 578 241 671 545 175 -51 24 124 -94 -225 -262 -399 -196 -368 -387 -47 -378 -530
2276e30J97l05K5L75K65j07P6M43j85j54J05L97k95J71J55j16P1l08k30M79n75
$$ -530 -333 -638 -613 -238 27 -80 -4 439 254 100 205 602 307 478 633 517 588 280 50 529 -46
2297d6K19k82J96j86j91P3n06J3K96j6l34L28j24lN37k52K35N09l46Q8N52k91
$$ -46 173 -109 87 -99 -290 -217 -723 -710 -414 -430 -764 -436 -560 -563 -26 -278 -43 466 120 208 760 469
2319D69J16k79L94l02j00R3K1l65j20l40K60k7l87M90N1n57J52K33j12J08k16
$$ 469 585 306 700 398 298 391 412 47 -73 -413 -153 -180 -567 -77 -26 -583 -431 -198 -310 -202 -418
2340d18K22p7K0K87j22J90j15o6M06K0l43P01k04j49J46J03l07l73J53L7Mk1j66
$$ -418 -196 -273 -253 34 -88 102 -13 -79 327 347 4 705 501 352 498 601 294 -79 74 111 115 94 -72
2363g2j55K11m31p2J03l20r8P59K8j37l3J71j29M07k21J63l7L58k1k14M00j38
$$ -72 -227 -16 -447 -519 -416 -736 -834 -75 -47 -184 -217 -46 -175 232 11 174 137 495 474 260 660 522
2385E22j72K85p22K4O33n39l9K04l07Kk56K07k82L00k52J47j70K8j01L08K00l16
$$ 522 350 635 -87 -63 570 31 -8 196 -111 -109 -365 -158 -440 -140 -392 -245 -415 -387 -488 -180 20 -296
2407b96J0N85m51J45L34O9J2M7j2l57L48J84n04J3J71m79J89J20j58r9p9l20L50
$$ -296 -286 299 -152 -7 327 396 408 455 443 86 434 618 114 127 298 -181 8 128 -30 -129 -208 -528 -178
2430a78j29k66L79M8o7l29J47J16J94ML56L9P6k45Q8j76M97l72J71j3l03J32m6
$$ -178 -307 -573 -194 -146 -213 -542 -395 -279 -85 -81 275 314 390 145 233 57 554 182 353 340 37 169 123
2453A23J0j74M5j96p3j0J7m14M27k63j09N13k46j06L61j29q9L78l4j69O93k93
$$ 123 133 -41 4 -192 -265 -275 -258 -672 -245 -508 -617 -104 -350 -456 -95 -224 -313 65 31 -138 555 262
2475B62j95K80j54J28k98N52k04l20M04M2l42J81l14k09K40k74j29O1j88J77k4
$$ 262 67 347 193 321 23 575 371 51 455 497 155 336 22 -187 53 -221 -350 -289 -477 -300 -324
2496c24J07R4l15L99p6L6M0L1n9L89J2k13R2N3l2J94O6q1k95L52l20j07km17J1
$$ -324 -217 -123 -438 -39 -115 -79 -39 -8 -67 322 334 121 213 266 234 428 494 413 118 470 150 43 41 -376 -365
2521c65J78l0J14m5k85L35m19L15J58l00J63J99Mj57J31J33K94m09k4N30n56N50
$$ -365 -187 -217 -103 -148 -433 -98 -517 -202 -44 -344 -181 18 22 -135 -4 129 423 14 -10 520 -36 514
2543E14l6r0J18k50j12K34j16l61M0j45J4j09P3j17j74M3K29j45M6K3K92k90J3
$$ 514 478 388 506 256 144 378 262 -99 -59 -204 -190 -299 -226 -343 -517 -474 -245 -390 -344 -321 -29 -319 -306
2566c06K20K19j05K33N1J37o3J3J92J09n07r2O1J11J52m01O3k70l63K66l06J8
$$ -306 -86 133 28 261 312 449 386 399 591 700 193 101 162 273 425 24 87 -183 -546 -280 -586 -568
2588e68Q8J17J64j10J56l02L41j88N61k39k57P10l42L90k03K08m09J97J55k74
$$ -568 -480 -363 -199 -309 -153 -455 -114 -302 259 20 -237 473 131 521 318 526 117 314 469 195
2608A95J99k67O7j02O1j49l86K08P8m89L38J3j96K23K63m19J1J02J86k16J99j04
$$ 195 394 127 194 92 153 4 -382 -174 -96 -585 -247 -234 -430 -207 56 -363 -352 -250 -64 -280 -81 -185
2630a85KL56O1J26j75m9L14J81k18K64m07j38J74l32j75O7j38K57m61R0J23r2
$$ -185 -183 173 234 360 185 136 450 631 413 677 270 132 306 -26 -201 -134 -272 -15 -476 -386 -263 -355
2652c55q5K63j43k27M67N7L1K53p9K78l06N5P4l7J55k87K49j14j88Q0Q0l18J34
$$ -355 -440 -177 -320 -547 -80 -23 8 261 182 460 154 209 283 246 401 114 363 249 61 141 221 -97 37
2675C7k62L32m45R8j16P4L71k25j27J69J17n28L90J45n91K80L00j50oJ94K91o3
$$ 37 -225 107 -338 -240 -356 -282 89 -136 -263 -94 23 -505 -115 30 -561 -281 19 -131 -137 57 348 285
2697B85k44L55lj23r5k42J83L49k65j40J39k94J70k84O8k00L5p6p8r5N01k07k21
$$ 285 41 396 393 270 175 -67 116 465 200 60 199 -95 75 -209 -141 -341 -306 -382 -460 -555 -54 -261 -482
2720d82M97K17j60N7oK89k77l9J39K33k12k38m1K38j59j59K41j69n9L30k76M6
$$ -482 15 232 72 129 123 412 135 96 235 468 256 18 -23 215 56 -103 138 -31 -90 240 -36 10
2742A0l05PL13k79j6l9Q8r6q7L59j14j25m8L22J28J89k85L08j02q4r5M73o15J52
$$ 10 -295 -288 25 -254 -270 -309 -221 -317 -404 -45 -159 -284 -332 -10 118 307 22 330 228 144 49 522 -93 59
2766E9L54p5k05j60M4J9n9q4J81m1m07J14R6j50k8P5J51k2l0K34j00k1r3K89J38
$$ 59 413 338 133 -27 17 36 -23 -107 74 33 -374 -260 -164 -314 -342 -267 -116 -138 -168 66 -34 -55 -148 141 279
2791B79k25M7K40k04J14J35j81ok38K16J42n33J24rl06K05J32q9k8q9j25J36K
$$ 279 54 101 341 137 251 386 205 199 -39 177 319 -214 -90 -99 -405 -200 -68 -157 -185 -274 -399 -263 -261
2814b61K6K69k37M33j36K1m4m2K46J75j35j29o6L20k59N9q5L74o89K81k43J8Q5
$$ -261 -235 34 -203 230 94 115 71 29 275 450 315 186 120 440 181 240 155 529 -160 121 -122 -104 -19
2837a9k85J38o6k45J54p8K65j01Q2M8n0o8l2o7L3M17j28L08j20K0K37j90o9L32
$$ -19 -304 -166 -232 -477 -323 -401 -136 -237 -155 -107 -157 -225 -257 -324 -291 126 -2 306 186 206 443 253 184 516
2861E16l33L5j30R6k2l31K2J31j35J58k72l92M26k10j4N10j78j30J74PJ47J66
$$ 516 183 218 88 184 162 -169 -147 -16 -151 7 -265 -657 -231 -441 -455 55 -123 -253 -79 -72 75 241
2883B41j97O6j2O2j85K11K44j65o2J20j05L7L9l32N2m1j12J62O9J39j69m49L56
$$ 241 44 110 98 160 -25 186 430 265 203 323 218 255 294 -38 14 -27 -139 23 92 231 62 -387 -31
2906c1l23Q8M84n00J22J43k4O3O3j69N2L34k08j54K47j0k0O9r6M8j7l0j52K37
$$ -31 -354 -266 218 -282 -160 -17 -41 22 85 -84 -32 302 94 -60 187 177 157 226 130 178 161 131 -21 216
2930B16q4k69O2O0j86o0q6q3O6k6k00K75K33j82OK77K9K14j5m02J20L42j24j74
$$ 216 132 -137 -75 -15 -201 -261 -347 -430 -364 -390 -590 -315 -82 -264 -258 19 48 262 247 -155 -35 307 183 9
2954IK58J69l12QJ52j53O3k65j5oNj40l2L5j26M5K60j49k57L25J29j08K87k62
$$ 9 267 436 124 132 284 131 194 -71 -86 -92 -87 -227 -259 -224 -350 -305 -45 -194 -451 -126 3 -105 182 -80
2978h0k1K93P4r4k24J35K8J71Qk58O0J29m5j0Rl96k7L36n00L62n02J98Q3J15k20
$$ -80 -101 192 266 172 -52 83 111 282 290 32 92 221 176 166 175 -221 -248 88 -412 -50 -552 -354 -271 -156 -376
3003c76K04J34j09Rm9K21j68K40k16O6L5K66k16J92k11J33J62m5J79m27o1K61
$$ -376 -172 -38 -147 -138 -187 34 -134 106 -110 -44 -9 257 41 233 22 155 317 272 451 24 -37 224
3025B24k77O8k00m2j18J46j6Q4o5j97J80O4o8K0L3p7J62J80L0j64K57R3j22O5
$$ 224 -53 15 -185 -227 -345 -199 -215 -131 -196 -393 -213 -149 -217 -197 -164 -241 -79 101 131 -33 224 317 195 260
3049B60Rm82N94l30P9L1k27j25P5p4n7J11Kj32j83L39N3j47K08j69J19R8r2N0
$$ 260 269 -213 381 51 130 161 -66 -191 -116 -190 -247 -136 -134 -266 -449 -110 -57 -204 4 -165 -46 52 -40 10
3073A0O9q1J78n07L33M8L14l06J25N1l4l27J69L01l79K13l9k7j59j79J99j19j5
$$ 10 79 -2 176 -331 2 50 364 58 183 234 200 -127 42 343 -36 177 138 111 -48 -227 -28 -147 -162
3096a62%mm7j87J36n5J32K67k41M47j90j63K86j98K42M4r3K23m8k14Q6l10O2q1
$$ -162 -162 -166 -213 -400 -264 -319 -187 80 -161 286 96 -67 219 21 263 307 214 437 389 175 261 -49 13 -68
3120f8j64L41l87j39K87k65L77l31J80J25k36L4J70j44L21k29J19K77k42j6J98
$$ -68 -232 109 -278 -417 -130 -395 -18 -349 -169 -44 -280 -246 -76 -220 101 -128 -9 268 26 10 208
3141B08k34M08n9j47j76K24m29M84l10K10j89j79l9L9J86J14l64Q0K26l61J40
$$ 208 -26 382 323 176 0 224 -205 279 -31 179 -10 -189 -228 -189 -3 111 -253 -173 53 -308 -168
3162a68J31N7k42Q6J11L3R1J72Orr4k34J40L12k56J49p0q5k59K72m02J33Q9l0
$$ -168 -37 20 -222 -136 -25 8 99 271 277 268 174 -60 80 392 136 285 215 130 -129 143 -259 -126 -37 -67
3186f7j46qK35qm65K62R9p8L4lJ85j11L4K47J92l26l1j02J68j0n6j30K26N4p3
$$ -67 -213 -221 14 6 -459 -197 -98 -176 -142 -145 40 -71 -37 210 402 76 45 -57 111 101 45 -85 141 195 122
3211A22J30j40l08K27M3j01J20J05l60O9k17J19J59j60r8K35J93l93L14j00K27
$$ 122 252 112 -196 31 74 -27 93 198 -162 -93 -310 -191 -32 -192 -290 -55 138 -255 59 -41 186
3232A86j07J36j83J06j60M27P3m51j20R6M7K55k27J8k11L1p4N2k16J37j73J03
$$ 186 79 215 32 138 -22 405 478 27 -93 3 50 305 78 96 -115 -84 -158 -106 -322 -185 -358 -255
3254b55J86R5j47l4P1j64L27L7k12L01j77l6J35M6m9J23l65O9O49o19K36j3K35
$$ -255 -69 26 -121 -155 -84 -248 79 116 -96 205 28 -8 127 173 124 247 -118 -49 600 -19 217 204 439
3277D39l24l62K41q2p7K3j43QJ06L9J22j70m8L5p1K41Q9m1mJ58k25K16j3M7lJ11
$$ 439 115 -247 -6 -88 -165 -142 -285 -277 -171 -132 -10 -180 -228 -193 -264 -23 66 25 21 179 -46 170 157 204 201 312
3303C12Rl73j31M69k09p3l1R8j56j99K75j02J8k7L9r9j1l0K77l24M44j00K14k73
$$ 312 321 -52 -183 286 77 4 -27 71 -85 -284 -9 -111 -93 -120 -81 -180 -191 -221 56 -268 176 76 290 17
3327A7Q7j4nL57k69K83j57j18M3l42K53k20j03K91r7j19r8J89q4j29q0n1K18J03
$$ 17 104 90 85 442 173 456 299 181 224 -118 135 -85 -188 103 6 -113 -211 -22 -106 -235 -315 -366 -148 -45
3351d5k32K53r4j28M6J29j35L84j87K9P4j56L17M8p0j31k30K36j12J22j87J17
$$ -45 -277 -24 -118 -246 -200 -71 -206 178 -9 20 94 -62 255 303 233 102 -128 108 -4 118 -69 48
3373D8j40o5J39j42k22L70L7k97O7Q4j62J68j19L80q5r0o1K43m4J31r2Rj07O7
$$ 48 -92 -157 -18 -160 -382 -12 25 -272 -205 -121 -283 -115 -234 146 61 -29 -90 153 109 240 148 157 50 117
3397A17j1K01j45J7n7j20J84j3j92j49m3J7j96K92l8n9J80r0k7j17L75k14m8K43
$$ 117 106 307 162 179 122 2 186 173 -19 -168 -211 -194 -390 -98 -136 -195 -15 -105 -132 -249 126 -88 -136 107
$$ [...]
8191d
##END NTUPLES=NMR FID
##END=
