##TITLE=1H_Pr C4
 CDCl3,8 sc, 
 23.9.2021
##JCAMPDX= 6.0         $$ Bruker NMR JCAMP-DX V2.0
##DATA TYPE= NMR FID
##DATA CLASS= NTUPLES
##ORIGIN= UXNMR, Bruker Analytische Messtechnik GmbH
##OWNER= root
$$ XWIN-NMR		Version 3.5
$$ Thu Sep 23 13:39:10 2021 Russian Standard Time (UT+4h)  she@DPX200
##.OBSERVE FREQUENCY= 200.1314
##.OBSERVE NUCLEUS= ^1H
##.DELAY= (6, 6)
##.ACQUISITION MODE= SIMULTANEOUS
##.ACQUISITION SCHEME= undefined
##.AVERAGES= 8
##.DIGITISER RES= 18
##SPECTROMETER/DATA SYSTEM= spect
##.PULSE SEQUENCE= zg30
##.SOLVENT NAME= CDCl3
##.SHIFT REFERENCE= (INTERNAL, CDCl3, 0, 15.7039)
##AUDIT TRAIL= $$ (NUMBER, WHEN, WHO, WHERE, WHAT)
$$ ##TITLE= Audit trail, XWIN-NMR		Version 3.5
$$ ##JCAMPDX= 5.01
$$ ##ORIGIN= Bruker BioSpin GmbH
$$ ##OWNER= she
$$ F:/spectra/data/she/nmr/H-F/1/audita.txt
$$ ##AUDIT TRAIL=  $$ (NUMBER, WHEN, WHO, WHERE, WHAT)
(   1,<2021-09-23 13:37:50.48 +0400>,<she>,<DPX200>,
      <created by zg, POWCHK disabled, PULCHK disabled
       configuration hash MD5:
       00 E9 B6 7A A2 85 ED C7 34 08 36 98 17 FE 4E 26
       data hash MD5: 16K
       A8 99 F2 0E 4E 6B 8D 40 29 AF 18 7F 4B BB 15 5B>)
$$ ##END=
$$ 
$$ hash MD5
$$ 1D 90 02 16 C6 CD 07 14 FC 0F 9E AC 1E 63 ED 51
##$RELAX= 
##$RELAX= 
##$RELAX= 
##$RELAX= 
##$RELAX= 
##$RELAX= 
$$ Bruker specific parameters
$$ --------------------------
##$DU= <F:/spectra>
##$EXPNO= 1
##$NAME= <H-F>
##$PROCNO= 1
##$TYPE= <nmr>
##$USER= <she>
##$AMP= (0..31)
100 100 100 100 100 100 100 100 100 100 100 100 100 100 100 100 100 100 
100 100 100 100 100 100 100 100 100 100 100 100 100 100 
##$AQSEQ= 0
##$AQ_mod= 1
##$AUNM= <au_zg>
##$AUTOPOS= <>
##$BF1= 200.13
##$BF2= 200.13
##$BF3= 200.13
##$BF4= 200.13
##$BF5= 200.13
##$BF6= 200.13
##$BF7= 200.13
##$BF8= 200.13
##$BYTORDA= 1
##$CFDGTYP= 0
##$CFRGTYP= 5
##$CHEMSTR= <none>
##$CNST= (0..31)
1 1 145 1 1 1 1 1 1 1 1 1 1 1 1 1 1 1 1 1 1 1 1 1 1 1 1 1 1 1 1 1 
##$CPDPRG= <>
##$CPDPRG1= <>
##$CPDPRG2= <>
##$CPDPRG3= <>
##$CPDPRG4= <mlev>
##$CPDPRG5= <mlev>
##$CPDPRG6= <mlev>
##$CPDPRG7= <mlev>
##$CPDPRG8= <mlev>
##$CPDPRGB= <>
##$CPDPRGT= <>
##$D= (0..31)
0 1.2 0 0 0 0 0 0 0 0.06 0 0.03 0 0 0 0 0.0002 0 0 0 0 0 0 0 0 0 0 0 0 
0 0 0 
##$DATE= 1632389869
##$DBL= (0..7)
120 120 120 120 120 120 120 120 
##$DBP= (0..7)
150 150 150 150 150 150 150 150 
##$DBP07= 0
##$DBPNAM0= <>
##$DBPNAM1= <>
##$DBPNAM2= <>
##$DBPNAM3= <>
##$DBPNAM4= <>
##$DBPNAM5= <>
##$DBPNAM6= <>
##$DBPNAM7= <>
##$DBPOAL= (0..7)
0.5 0.5 0.5 0.5 0.5 0.5 0.5 0.5 
##$DBPOFFS= (0..7)
0 0 0 0 0 0 0 0 
##$DE= 6
##$DECBNUC= <off>
##$DECIM= 32
##$DECNUC= <off>
##$DECSTAT= 4
##$DIGMOD= 1
##$DIGTYP= 9
##$DL= (0..7)
0 120 120 120 120 120 120 120 
##$DP= (0..7)
150 150 150 150 150 150 150 150 
##$DP07= 0
##$DPNAME0= <>
##$DPNAME1= <>
##$DPNAME2= <>
##$DPNAME3= <>
##$DPNAME4= <>
##$DPNAME5= <>
##$DPNAME6= <>
##$DPNAME7= <>
##$DPOAL= (0..7)
0.5 0.5 0.5 0.5 0.5 0.5 0.5 0.5 
##$DPOFFS= (0..7)
0 0 0 0 0 0 0 0 
##$DQDMODE= 0
##$DR= 18
##$DS= 0
##$DSLIST= <SSSSSSSSSSSSSSS>
##$DSPFIRM= 0
$$ [...]
##$SUBNAM2= <"">
##$SUBNAM3= <"">
##$SUBNAM4= <"">
##$SUBNAM5= <"">
##$SUBNAM6= <"">
##$SUBNAM7= <"">
##$SUBNAM8= <"">
##$SUBNAM9= <"">
##$SW= 20.0188988654967
##$SWIBOX= (0..15)
0 0 2 0 0 0 0 0 0 0 0 0 0 0 0 0 
##$SW_h= 4006.41025641026
##$TD= 16384
##$TD0= 1
##$TE= 0
##$TE2= 300
##$TE3= 300
##$TEG= 300
##$TL= (0..7)
0 120 120 120 120 120 120 120 
##$TP= (0..7)
150 150 150 150 150 150 150 150 
##$TP07= 0
##$TPNAME0= <>
##$TPNAME1= <>
##$TPNAME2= <>
##$TPNAME3= <>
##$TPNAME4= <>
##$TPNAME5= <>
##$TPNAME6= <>
##$TPNAME7= <>
##$TPOAL= (0..7)
0.5 0.5 0.5 0.5 0.5 0.5 0.5 0.5 
##$TPOFFS= (0..7)
0 0 0 0 0 0 0 0 
##$TUNHIN= 0
##$TUNHOUT= 0
##$TUNXOUT= 0
##$USERA1= <user>
##$USERA2= <user>
##$USERA3= <user>
##$USERA4= <user>
##$USERA5= <user>
##$V9= 5
##$VALIST= <valist>
##$VCLIST= <CCCCCCCCCCCCCCC>
##$VD= 0
##$VDLIST= <DDDDDDDDDDDDDDD>
##$VPLIST= <PPPPPPPPPPPPPPP>
##$VTLIST= <TTTTTTTTTTTTTTT>
##$WBST= 1024
##$WBSW= 4
##$XGAIN= (0..3)
0 0 0 0 
##$XL= 0
##$YL= 0
##$YMAX_a= 125565
##$YMIN_a= -57583
##$ZGOPTNS= <>
##$ZL1= 120
##$ZL2= 120
##$ZL3= 120
##$ZL4= 120
##$ABSF1= 10
##$ABSF2= 0
##$ABSG= 5
##$ABSL= 3
##$ALPHA= 0
##$AQORDER= 0
##$ASSFAC= 0
##$ASSFACI= 0
##$ASSFACX= 0
##$ASSWID= 0
##$AUNMP= <proc_1d>
##$AZFE= 0.1
##$AZFW= 0.1
##$BCFW= 1
##$BC_mod= 2
##$BYTORDP= 1
##$COROFFS= 0
##$CY= 11.3945322036743
##$DATMOD= 1
##$DC= 2
##$DFILT= <>
##$DTYPP= 0
##$F1P= 2.36226072786647
##$F2P= -0.459571619588291
##$FCOR= 0.5
##$FTSIZE= 0
##$FT_mod= 4
##$GAMMA= 1
##$GB= 0.15
##$INTBC= 1
##$INTSCL= 1
##$ISEN= 128
##$LB= 0.24
##$LEV0= 0
##$LPBIN= 0
##$MAXI= 10000
##$MC2= 0
##$MEAN= 0
##$ME_mod= 0
##$MI= 1.114404
##$NCOEF= 0
##$NC_proc= 0
##$NLEV= 6
##$NOISF1= 3.799351
##$NOISF2= 2.8
##$NSP= 1
##$NTH_PI= 0
##$NZP= 0
##$OFFSET= 15.70392
##$PC= 1
##$PHC0= -14072.98
##$PHC1= 6.600879
##$PH_mod= 1
##$PKNL= yes
##$PPARMOD= 0
##$PSCAL= 0
##$PSIGN= 0
##$REVERSE= no
##$SF= 200.130013532006
##$SI= 16384
##$SIGF1= 3
##$SIGF2= 2
##$SINO= 400
##$SIOLD= 16384
##$SREGLST= <1H.CDCl3>
##$SSB= 0
##$STSI= 0
##$STSR= 0
##$SW_p= 3612.71676300578
##$SYMM= 0
##$S_DEV= 0
##$TDeff= 0
##$TDoff= 0
##$TI= <>
##$TILT= no
##$TM1= 0
##$TM2= 0
##$TOPLEV= 0
##$USERP1= <user>
##$USERP2= <user>
##$USERP3= <user>
##$USERP4= <user>
##$USERP5= <user>
##$WDW= 1
##$XDIM= 8192
##$YMAX_p= 0
##$YMIN_p= 0
$$ End of Bruker specific parameters
$$ ---------------------------------
##NTUPLES= NMR FID
##VAR_NAME=  TIME,          FID/REAL,        FID/IMAG
##SYMBOL=    X,             R,               I
##VAR_TYPE=  INDEPENDENT,   DEPENDENT,       DEPENDENT
##VAR_FORM=  AFFN,          ASDF,            ASDF
##VAR_DIM=   8192,          8192,            8192
##UNITS=     SECONDS,       ARBITRARY UNITS, ARBITRARY UNITS
##FACTOR=    0.0002496,     1,               1
##FIRST=     0,             0,               0
##LAST=      2.0444736,     0,               0
##MIN=       0,             -57583,          0
##MAX=       2.0444736,     125565,          0
$$ Real data points
##PAGE= N=1
##DATA TABLE= (X++(R..R)), XYDATA
$$ plain form
0 0 0 0 0 0 0 0 0 0 0 0 0 0 0 0 0 8 -8 8 -8 8 -14 16 -16 23 -24 29 -32 40 -41 48 -56 64 -72 82 -95 105 -119
37 -119 133 -149 166 -184 204 -226 251 -279 307 -338 374 -412 453 -501 551 -607 670 -740 821
56 821 -910 1015 -1135 1280 -1451 1663 -1931 2282 -2763 3470 -4618 6791 -12456 65446 125565
71 125565 85641 99848 85826 68436 48714 39206 19722 12893 -7659 -20863 -19791 -23874 -44701
84 -44701 -40397 -36019 -47013 -53800 -50211 -56213 -54793 -54140 -57583 -47609 -31652 -34052 -25533 -2726 4754
99 4754 5616 19705 28038 29041 30715 27183 25283 27591 16018 5410 11252 8686 -3776 -1258 3527
114 3527 -2746 -4669 -3898 -7979 -7601 -9703 -17323 -14967 -10170 -17930 -18731 -10142 -9017 -8954 -2295 1505
130 1505 6112 10693 7346 8093 13081 5786 -3137 638 -1363 -11233 -11791 -10267 -13888 -15237 -15667 -16908
$$ packed form
0@%%%%%%%%%%%%%%%Qj6J6j6J6k2L0l2L9m7N3o1P2q1Q9j04J20j36J54j77K00k24
37a19K52k82L15l50L88m30M77n30N86o45P12p86Q65r54J052j158J277j410J561
56H21j731J925k150K415k731L114l594M213n045O233q088J1409j9247P7902O0119
71A25565l9924J4207j4022j7390j9722r508j9484o829k0552j3204J072m083k0827
84d4701M304M378j0994o787L589o002J420O53l443R974J5957k400Q519K2807P480
99D754Q62J4089Q333J003J674l532j900K308j1573j0608N842k566j2462K518M785
114C527o273j923P71m081L78k102p620K356M797p760q01Q589J125O3O659L800
130A505M607M581l347P47M988p295q923L775k001r870n58J524l621j349m30j241
$$ plain form
146 -16908 -13243 -13659 -18159 -14332 -11079 -16531 -16651 -11670 -12853 -11640 -6476 -4137 1111 8060 8243 11327
162 11327 19589 18932 16189 20878 21452 17133 16356 15093 12584 11898 8224 5853 9599 7775 2989 5247
178 5247 6370 599 -1492 -987 -5164 -7214 -7839 -10761 -10176 -8758 -11411 -10914 -6348 -6496 -6434 -2331 -1036
195 -1036 -624 855 -467 -682 1625 -858 -2274 2211 3207 471 3585 6485 4872 5358 6946 6726
211 6726 7160 6729 4583 5516 5281 1820 1502 2837 693 206 2655 1513 1042 2599 561 -613 909
228 909 -579 -3031 -857 -1107 -3888 -2840 -2347 -2882 -2275 -2294 -1911 163 -57 -1718 238 168 -2913 -2903
246 -2903 -1025 -2928 -3557 -1778 -2352 -2402 -1631 -2049 -1958 -427 -855 -1269 771 198 -585 72 -587 -682 694
265 694 489 -12 2507 2770 1213 2601 3865 1898 1775 2880 2198 1477 1904 979 371 -213 -1331 -1195
$$ packed form
146a6908L665m16m500L827L253n452j20M981j183J213N164K339N248O949J83L084
162A1327Q262o57k743M689N74m319p77j263k509o86l674k371L746j824m786K258
178E247J123n771k091N05m177k050o25k922N85J418k653M97M566j48O2M103J295
195a036M12J479j322k15K307k483j416M485R96k736L114K900j613M86J588k20
211F726M34m31k146R33k35l461l18J335k144m87K449j142m71J557k038j174J522
228I09j488k452K174k50k781J048M93n35O07j9L83K074k20j661J956p0l081J0
246b903J878j903o29J779n74n0P71m18R1J531m28m14K040n73p83O57o59r5J376
265F94k05n01K519K63j557J388J264j967j23J105o82p21M27r25o08n84j118J36
$$ plain form
283 -1195 -520 -1271 -1095 157 -949 -1577 -710 -1413 -2203 -871 -1144 -1611 -542 -81 -1002 -547 337 -270 222
302 222 736 1071 1706 1338 467 1273 938 -811 375 1373 228 131 1111 201 -339 245 153 -353 47 162
322 162 -194 51 -334 -698 -957 -774 -1166 -58 -369 -806 410 25 -1253 -712 6 -1362 -857 513 -223
341 -223 -693 -36 -576 -705 -671 -704 -89 357 236 409 762 14 -93 868 375 -82 1260 1443 717 970 1597
362 1597 357 415 1010 897 466 795 882 785 456 -416 10 208 -899 -146 517 -557 -683 103 -557 -976
382 -976 -482 -231 -847 -339 -163 -365 -505 -402 -496 -238 -296 -266 636 406 -111 611 334 -568 -60 549 -214
403 -214 44 698 -14 -616 113 -509 -642 -462 49 -23 -174 -183 -131 259 -264 -133 544 497 263 1134 519 413
425 413 707 429 189 38 743 510 91 304 351 -239 -392 -346 -462 -369 -507 -16 243 -101 -259 333 75
$$ packed form
283a195O75p51J76J252j106o28Q67p03p90J332k73m67J069M61r21M55Q84o07M92
302B22N14L35O35l68q71Q06l35j749J186R98j145r7R80r10n40N84r2n06M00J15
322A62l56K45l85l64k59J83l92J108l11m37J216l85j278N41P18j368N05J370p36
341b23m70O57n40j29L4l3O15M46j21J73L53p48j07R61m93m57J342J83p26K53O27
362A597j240N8N95j13m31L29Q7r7l29q72M26J98j107P53O63j074j26P86o60m19
382i76M94K51o16N08J76k02j40J03r4K58n8L0R02k30n17P22k77r02N08O09p63
403b14K58O54p12o02P29o22j33J80N11p2j51rN2L90n23J31O77m7k34Q71o15j06
425D13K94k78k40j51P05k33m19K13M7n90j53M6j16R3j38M91K59l44j58N92k58
$$ plain form
446 75 -494 389 713 331 658 902 514 510 594 242 631 487 699 733 192 -658 -235 -597 -1138 -928 -399 -1358
468 -1358 -1265 -873 -1245 -1730 -1146 -823 -1147 -303 70 62 333 427 974 604 504 1033 1256 864 759 767 365 -319
490 -319 -599 -298 -1171 -925 -726 -1158 -1806 -1778 -2003 -2032 -2265 -1438 -2725 -1520 -817 -717 -169 -372 -317 564 861
511 861 911 2105 1988 1505 2075 2046 1583 1019 741 962 1366 286 1117 99 -271 -564 -1302 -1989 -1384 -699
531 -699 -699 -1059 -1335 -993 -727 -1242 -253 558 344 634 1346 1866 1093 1466 1850 1622 1437 1748 1991 1258 1003
552 1003 905 391 -168 215 426 -163 -117 283 -414 -953 -948 -602 -382 -315 32 445 760 834 1394 1387 1002 1613 2216
575 2216 2184 2066 2335 1797 1240 866 751 268 117 -158 -97 -735 -851 -1016 -1239 -1590 -1541 -1209 -1461 -1677 -1210
596 -1210 -1365 -1759 -1641 -1318 -1569 -1554 -654 -504 -631 -312 -46 -267 -39 120 356 305 273 596 -62 -406 -211
$$ packed form
446G5n69Q83L24l82L27K44l88mQ4l52L89j44K12L4n41q50M23l62n41K10N29r59
468a358R3L92l72m85N84L23l24Q44L73qK71R4N47l70j00N29K23l92j05Qm02o84
490c19k80L01q73K46J99m32o48K8k25k9k33Q27j287J205P03J00N48k03N5Q81K97
511H61N0J194j17m83N70k9m63n64k78K21M04j080Q31j018l70k93p38o87O05O85
531f99%l60k76L42K66n15R89Q11k14K90P12N20p73L73L84k28j85L11K43p33k55
552A003r8n14n59L83K11n89M6M00o97n39NL46K20O7L47M13L15P4N60pl85O11O03
575B216l2j18K69n38n57l74j15m83j51k75O1o38j16j65k23l51M9L32k52k16M67
596a210j55l94J18L23k51J5R00J50j27L19K66k21K28J59K36n1l2L23o58l44J95
$$ plain form
617 -211 -95 -614 -726 -369 -229 -583 -396 -334 -344 -771 -447 -146 -2 -72 -29 -248 -604 -875 -634 -1068 -1122 -648
639 -648 -646 -917 -903 -872 -876 -802 -1054 -17 -216 10 332 48 78 0 634 156 366 287 750 776 604 1052 938 639
663 639 733 1018 809 999 1190 832 565 468 313 -221 -222 -305 526 -105 20 430 348 35 279 641 689 667 729
686 729 1102 440 136 244 118 -219 64 274 -183 -209 -556 -294 -605 -429 -319 -848 -486 -446 -456 -631 -381
707 -381 -194 -398 -282 -6 687 469 297 1032 903 880 1203 1243 1110 1044 1219 981 731 408 503 -81 -575 -397
729 -397 -190 -467 -737 -659 -975 -1388 -1390 -850 -1019 -1167 -822 -601 -940 -881 -178 -296 -544 33 567 489 618 232
751 232 731 179 342 683 79 344 318 467 65 -55 171 -47 -279 -58 -363 -110 -285 -103 22 -299 -659
772 -659 -356 -220 33 215 371 267 245 366 452 16 132 631 280 -203 239 -45 -219 -193 -22 -499 -329
$$ packed form
617b11J16n19j12L57J40l54J87O2j0m27L24L01J44p0M3k19l56k71K41m34n4M74
639f48Kk71J4L1mP4k52J037j99K26L22k84L0p8O34m78K10p9M63K6j72M48j14k99
663F39R4K85k09J90J91l58k67r7j55n34jq3Q31o31J25M10q2l13K44L62M8k2O2
686G29L73o62l04J08j26l37K83K10m57k6l47K62l11J76J10n29L62M0j0j75K50
707c81J87k04J16K76O93k18j72P35j29k3L23M0j33o6J75k38k50l23R5n84m94J78
729c97K07k77k70P8l16m13kN40j69j48L45K21l39N9P03j18k48N77N34p8J29l86
751B32M99n52J63L41o04K65k6J49m02j20K26k18k32K21l05K53j75J82J25l21l60
772f59L03J36K53J82J56j04k2J21Q6m36J16M99l51m83M42k84j74K6J71m77J70
$$ plain form
793 -329 -90 42 -229 -574 -558 -395 -421 -695 -100 -133 -19 78 106 187 -11 46 -48 -71 470 410 319 -107 527 277
817 277 105 430 389 448 160 498 96 -491 -332 219 -394 -523 -372 -154 -125 -287 -319 -275 -465 -337 -264 -413
839 -413 -70 -15 104 -238 -93 248 453 -109 289 513 129 -54 597 261 -78 4 190 408 279 461 215
860 215 97 -364 -76 -197 -563 38 93 118 -96 188 -248 -363 -183 226 -71 44 153 346 -17 -167 223
881 223 95 -289 -100 59 3 -180 -29 46 -483 -160 -39 -158 41 -24 104 -214 -228 103 -256 -221 85 88 -147
904 -147 -124 8 28 -521 -65 252 163 -7 296 135 -56 -110 355 -9 115 211 293 35 -492 -33 168 -134
926 -134 7 323 170 387 -6 279 -90 -141 74 -20 -347 -39 218 -108 82 137 97 -284 -362 -41 212 53
948 53 22 289 -110 122 75 -139 -37 188 380 192 -75 140 53 -301 -16 251 -181 131 212 224 -273 -32
$$ packed form
793c29K39J32k71l45J6J63k6k74N95l3J14R7K8Q1j98N7r4k3N41o0r1m26O34k50
817B77j72L25m1N9k88L38m02n87J59N51o13j29J51K18K9j62l2M4j90J28P3j49
839d13L43N5J19l42J45L41K05n62L98K24l84j83O51l36l39Q2J86K18j29J82k46
860B15j18m61K88j21l66O01N5K5k14K84m36j15J80M09k97J15J09J93l63j50L90
881B23j28l84J89J59n6j83J51P5n29L23J21j19J99o5J28l18j4L31l59L5L06Lk35
904a47K3J32K0n49M56L17q9j70L03j61j91n4M65l64J24R6Q2k58n27M59K01l02
926a34J41L16j53K17l93K85l69n1K15r4l27L08K57l26J90N5m0l81p8L21K53j59
948E3l1K67l99K32m7k14J02K25J92j88k67K15q7l54K85K67m32L12Q1J2m97K41
$$ plain form
970 -32 306 -155 -431 -188 16 -13 -222 -56 46 -379 -120 -226 267 74 322 318 172 138 -92 -48 -267 177
992 177 60 191 261 79 -39 -252 -4 -14 -227 -286 286 170 -307 -285 -14 15 -362 12 133 370 -102 112
1014 112 30 -63 -280 56 106 180 266 140 14 263 238 -259 -189 83 274 -86 -96 64 130 -266 -165 -353 103
1037 103 -133 15 548 96 -114 260 55 -37 34 261 244 -38 184 326 -19 -48 64 128 13 46 263 92
1059 92 47 -173 -101 -52 -50 60 -180 -186 17 -29 92 -269 -45 113 -12 199 154 -115 161 148 230 -188 -247 -89
1083 -89 230 -313 130 -49 -392 -278 -161 -302 -266 -134 -17 -162 31 -3 -337 -279 -83 59 -16 -400 286 -38
1105 -38 -158 -317 40 -165 -231 -2 186 -140 -282 -83 70 -517 -22 195 98 -38 -78 -136 -114 -391 -66 -48
1127 -48 -38 -28 109 93 155 -35 256 290 -163 320 117 13 359 297 -256 -301 -109 -89 -346 -155 150 -165 -74
$$ packed form
970c2L38m61k76K43K04k9k09J66J02m25K59j06M93j93K48mj46l4k30M4k19M44
992A77j17J31P0j82j18k13K48j0k13n9N72j16m77K2K71K9l77L74J21K37m72K14
1014A12q2r3k17L36N0P4Q6j26j26K49k5m97P0K72J91l60j0J60O6l96J01j88M56
1037A03k36J48N33m52k10L74k05r2P1K27j7k82K22J42l45k9J12O4j15L3K17j71
1059I2m5k20P2M9KJ10k40oK03m6J21l61K24J58j25K11m5k69K76j3Q2m18n9J58
1083h9L19n43M43j79l43J14J17j41L6J32J17j45J93l4l34N8J96J42p5l84O86l24
1105c8j20j59L57k05o6K29J88l26j42J99J53n87M95K17r7j36m0n8K2k77L25J8
1127d8J0J0J37j6O2j90K91L4m53M83k03j04L46o2n53m5J92K0k57J91L05l15R1
$$ plain form
1150 -74 96 54 -237 -346 343 345 -58 101 178 63 -302 -32 31 -59 210 206 334 19 281 138 311 62 367
1173 367 98 102 340 24 89 -416 139 -114 -397 49 39 92 -35 222 -161 12 -74 309 363 -67 144 161 175
1196 175 -250 -118 24 -43 -149 22 29 -291 126 -85 -54 -154 143 215 -65 63 -121 -278 -36 -240 -203 -361
1218 -361 -224 104 4 50 -58 -131 196 8 31 184 -190 167 10 127 -93 -68 -41 -212 150 -122 47 -315
1240 -315 -76 -43 -60 27 330 -115 -185 133 213 -195 -229 66 -54 -229 -49 -64 96 51 352 285 -156 116 -134
1263 -134 109 126 65 98 8 -62 132 -71 -155 276 231 -200 -307 -27 -75 -163 -302 -126 127 51 493 56 114 -137
1287 -137 248 78 -163 -57 236 124 -188 66 121 -25 -211 -62 231 -6 185 -116 52 -75 -74 87 46
1308 46 71 138 49 -454 35 230 -351 -94 -51 -40 -251 -99 179 52 -83 -68 55 -41 -7 -157 134 54 -149
$$ packed form
1150g4J70m2k91j09O89Km03J59P7j15l65K70O3r0K69mJ28l15K62j43J73k49L05
1173C67k69MK38l16O5n05N55k53k83M46j0N3j27K57l83J73q6L83N4m30K11J7J4
1196A75m25J32J42o7j06J71Pl20M17k11L1j00K97P2k80J28j84j57K42k04L7j58
1218c61J37L28j00M6j08p3L27j88K3J53l74L57j57J17k20K5K7j71L62k72J69l62
1240c15K39L3j7Q7L03m45p0L18Q0m08l4K95j20j75J80j5J60m5L01o7m41K72k50
1263a34K43J7o1L3r0p0J94k03q4M31m5m31j07K80m8q8j39J76K53p6M42m37N8k51
1287a37L85j70k41J06K93j12l12K54N5j46j86J49K93k37J91l01J68j27JJ61m1
1308D6K5O7q9n03M89J95n81K57M3J1k11J52K78j27j35J5J23r6L4j50K91q0k03
$$ plain form
1331 -149 148 -86 -329 19 -185 191 -181 -4 157 -337 -252 74 222 71 -14 216 26 168 -102 -148 -348
1352 -348 -232 101 -296 287 352 38 -263 6 13 -8 -457 88 -25 200 60 -60 -44 -272 -9 -171 -88 53
1374 53 369 19 -51 13 100 -336 -94 92 154 59 -39 83 -193 -158 84 162 -72 279 316 357 -273 282 464 66
1398 66 -6 257 15 -56 197 -121 48 -252 75 -87 -267 -76 247 -22 172 -186 -130 -187 -258 212 -34 118
1420 118 -173 86 -76 50 361 211 -42 190 18 -3 139 -21 0 -103 -70 185 -65 -186 28 85 -258
1441 -258 -189 133 -36 -131 -84 118 16 69 40 -176 -210 -191 100 285 -34 -54 111 -117 76 226 33 -62 46
1464 46 161 -214 -108 -19 -267 29 -65 4 251 -133 58 290 57 -262 -189 199 81 -25 166 14 -149 134
1486 134 273 -15 -341 319 -33 -497 49 130 -278 -214 82 -204 9 219 -67 313 -312 97 20 -45 -28 159
$$ packed form
1331a49K97k34k43L48k04L76l72J77J61m94Q5L26J48j51q5K30j90J42k70m6k00
1352c48J16L33l97N83O5l14l01K69Pk1m49N45j13K25j40j20J6k28K63j62Q3J41
1374E3L16l50p0O4Q7m36K42J86O2r5r8J22k76L5K42P8k34L51L7M1o30N55J82l98
1398F6p2K63k42p1K53l18J69l00L27j62j80J91L23k69J94l58N6n7p1M70k46J52
1420A18k91K59j62J26L11j50k53K32j72k1J42j60K1j03L3K55k50j21K14N7l43
1441b58O9L22j69r5M7K02j02N3k9k16l4J9K91J85l19k0J65k28J93J50j93r5J08
1464D6J15l75J06Q9k48K96r4O9K47l84J91K32k33l19P3L88j18j06J91j52j63K83
1486A34J39k88l26O60l52m64N46Q1m08O4K96k86K13K10k86L80o25M09p7o5J7J87
$$ plain form
1508 159 168 116 -4 66 -82 -151 165 98 70 123 -148 65 -256 42 142 -205 -80 240 -293 102 54 77 33 45
1532 45 -274 -37 -141 -160 37 230 172 -72 -136 47 10 -116 -52 37 225 88 122 45 -60 -103 -295 -13 15 95
1556 95 79 113 58 6 70 -43 131 -110 -198 158 103 -235 2 -94 78 71 340 172 -29 -244 -14 131 -125 159
1580 159 214 -62 81 314 -214 -63 -14 1 -27 65 -35 14 91 218 222 94 -33 274 188 -179 11 33 30 37 -57
1605 -57 -68 -415 58 171 249 216 -357 -130 -93 -160 -25 208 50 -221 -129 24 97 215 -222 -347 -85 -25 94
1628 94 116 -156 -41 -281 -28 138 83 258 314 204 122 10 222 -63 92 47 -208 -17 -219 -64 -59 -1 -351
1651 -351 -14 -31 112 -107 -103 -51 75 -132 82 -67 -119 -155 155 1 84 207 -317 -14 -12 169 56 10 86 240
1675 240 239 -12 -295 -210 206 -79 -162 -125 -120 13 -265 -207 -62 57 -17 137 280 -116 45 -28 -102 -3 -181 130
$$ packed form
1508A59Rn2j20P0j48o9L16o7k8N3k71K13l21K98J00l47J25L20n33L95m8K3m4J2
1532D5l19K37j04j9J97J93n8k44o4J83l7j26O4Q9J88j37L4p7j05m3j92K82K8Q0
1556I5j6L4n5n2O4j13J74k41q8L56n5l38K37r6J72pK69j68k01k15K30J45k56K84
1580A59N5k76J43K33n28J51M9J5k8R2j00M9P7J27Mj28j27L07q6l67J90K2lPr4
1605e7j1l47M73J13P8l3n73K27L7o7J35K33j58k71R2J53P3J18m37j25K62O0J19
1628I4K2k72J15k40K53J66n5J75N6j10q2j12K12k85J55m5k55J91k02J55NN8l50
1651c51L37j7J43k19MN2J26k07K14j49n2l6L10j54Q3J23n24L03KJ81j13m6P6J54
1675B40jk51k83Q5M16k85q3L7NJ33k78N8J45J19p4J54J43l96J61p3p4R9j78L11
$$ plain form
1699 130 120 12 192 -224 -74 -132 52 -73 -105 106 -19 75 -87 -360 -184 -206 69 -20 -321 220 236 -150
1721 -150 65 -320 -97 94 -306 -27 101 206 178 -15 38 -38 23 56 -60 98 -50 92 -108 -78 -269 -293
1743 -293 -145 95 -73 18 -315 -107 220 82 41 285 119 103 178 -5 99 -82 -328 -65 -6 -261 -27 257
1765 257 19 -32 27 -342 228 154 46 -39 167 27 -147 -137 -61 -150 -297 94 117 18 -159 -3 -91 -202 -104 244
1789 244 -149 -18 63 298 253 121 113 -104 -218 -205 -126 34 76 90 -106 128 -181 90 38 106 128 -14 -75 -13
1813 -13 -17 -94 120 -167 23 -17 -234 -192 -179 -145 -105 -37 191 189 -3 150 -61 -140 -2 104 87 -177 -98 124 -105
1838 -105 16 116 7 -31 335 -9 11 38 220 21 13 21 107 126 -119 352 -156 -180 171 17 -296 -19 147
1861 147 179 69 81 -46 57 -33 74 151 50 3 250 -7 9 -176 18 -3 122 209 -47 247 28 -35 94
$$ packed form
1699A30j0j08J80m16J50n8J84j25l2K11j25R4j62k73J76k2K75q9l01N41J6l86
1721a50K15l85K23J91m00K79J28J05k8j93N3p6O1L3j16J58j48J42k00L0j91k4
1743b93J48K40j68R1l33K08L27j38m1K44j66j6P5j83J04j81k46K63N9k55K34K84
1765B57k38n1N9l69N70p4j08q5K06j40j74J0P6q9j47L91K3r9j77J56q8j11R8L48
1789B44l93J31Q1K35m5j32qk17j14J3P9J60M2J4j96K34l09K71n2O8K2j42o1O2
1813a3mp7K14k87J90m0k17M2J3L4M0O8K28kj92J53k11p9J38J06j7k64P9K22k29
1838a05J21J00j09l8L66l44K0K7J82j99qQQ6J9k45M71n08k4L51j54l13K77J66
1861A47L2j10J2j27J03r0J07P7j01m7K47k57J6j85J94k1J25Q7k56K94k19o3J29
$$ plain form
1884 94 -152 115 -134 -16 -203 55 145 -347 -180 -137 113 -217 9 361 308 -107 247 55 171 257 138 31
1906 31 69 57 -181 32 15 -91 -37 52 -9 112 84 13 253 147 -161 165 -17 -19 -106 -45 318 -83 233 13
1930 13 -203 16 -183 -24 32 -201 199 225 -37 -137 -14 180 -252 338 -2 -242 -233 204 -39 0 73 -172
1952 -172 -7 2 413 208 -58 -33 221 -86 -119 -32 -12 -71 5 -126 -11 -155 -41 7 -28 80 117 48 44 -271 150
1977 150 -116 20 -35 -181 40 114 -75 28 200 61 -19 -14 -50 211 371 4 -80 213 74 -147 74 76 45
2000 45 74 -10 22 26 55 147 153 77 39 193 159 14 126 -32 177 -95 126 -354 -196 104 -31 -136 50 191
2024 191 -122 -14 -27 -53 104 -48 -256 -164 -89 -100 30 -114 41 78 180 -70 175 98 59 175 220 3 -50
2047 -50 -173 -3 33 22 -11 29 170 -59 -49 -237 -105 -185 -33 -83 49 180 -113 -269 90 2 -59 60 -16 -122
$$ packed form
1884I4k46K67k49J18j87K58R0m92J67M3K50l30K26L52n3m15L54j92J16Q6j19j07
1906C1L8j2k38K13j7j06N4Q9o1J21k8p1K40j06l08L26j82kq7O1L63m01L16k20
1930A3k16K19j99J59N6k33M00K6k62j00J23J94m32N90l40k40RM37k43L9P3k45
1952a72J65RM11k05k66K5K54l07l3Q7K0n9P6j31J15j44J14M8l5J08L7o9ml15M21
1977A50k66J36n5j46K21P4j89J03J72j39q0Nl6K61J60l67q4K93j39k21K21Kl1
2000D5K9q4L2MK9R2Op6l8J54l4j45J12j58K09k72K21m80J58L00j35j05J86J41
2024A91l13J08j3k6J57j52k08R2P5j1J30j44J55L7J02k50K45p7l9J16M5k17n3
2047e0j23J70L6j1l3M0J41k29J0j88J32q0J52n0J32J31k93j56L59q8o1J19p6j06
$$ plain form
2071 -122 205 -190 -105 -50 -253 -450 45 42 5 241 14 73 -146 47 100 53 -69 72 -20 -266 60 -15 -121
2094 -121 -22 148 178 -41 -76 22 -18 -24 179 -213 -33 -1 -9 48 47 226 -206 -143 -189 6 144 105 42 -152 92 -308
2120 -308 -68 238 124 -145 143 252 -77 4 -118 273 -173 65 27 -230 52 219 -12 -35 162 108 -154
2141 -154 59 -44 -58 -90 -70 47 207 -158 -100 -53 -198 193 112 107 119 71 213 -131 -33 14 261 48 128 -48
2165 -48 -82 -157 33 -210 135 -76 39 8 34 -145 -304 -8 28 201 173 71 169 0 39 -17 5 94 -79 178
2189 178 0 123 94 130 -138 -270 -216 11 -28 -116 278 -49 -123 51 -34 -53 264 109 167 -74 -103 53 102 -197
2213 -197 -52 -111 107 2 226 14 53 119 194 -268 116 111 141 44 -19 -83 48 -138 -214 -322 -20 26 6 201
2237 201 145 110 35 232 -180 75 271 -60 153 -299 -77 66 148 74 -119 37 78 -4 -45 -228 -102 169 -139
$$ packed form
2071a22L27l95Q5N5k03j97M95ll7K36k27N9k19J93N3m7j22J41r2k46L26p5j06
2094a21R9J70L0k19l5R8m0oK03l92J80L2qN7jJ79m32O3m6J95J38l9o3j94K44m00
2120c08K40L06j14k69K88J09l29Q1j22L91m46K38l8k57K82J67k31k3J97n4k62
2141a54K13j03j4l2K0J17J60l65N8M7j45L91q1nJ2m8J42l44R8M7K47k13Q0j76
2165d8l4p5J90k43L45k11J15l1K6j79j59K96L6J73k8j02R8j69L9n6K2Q9j73K57
2189A78j78J23k9L6k68j32N4K27l9q8L94l27p4J74q5j9L17j55N8k41k9J56M9k99
2213a97J45n9K18j05K24k12L9O6P5m62L84nL0r7o3o4J31j86p6j08L02M6k0J95
2237B01n6l5p5J97m12K55J96l31K13m52K22J43Q2p4j93J56M1q2m1j83J26K71l08
$$ plain form
2260 -139 17 334 -64 -55 -74 74 -234 -88 -29 -83 176 -70 19 -29 160 99 -49 33 50 -136 -134 -240 61 119
2284 119 -169 86 44 -26 -47 -76 219 -81 -30 -345 -106 -110 -177 -53 9 246 65 -166 -99 -241 117 206 -129 38
2308 38 424 -159 -64 -52 -281 28 -81 -128 132 3 -217 -104 62 -93 344 -216 -26 -70 -39 -5 44 103 -111
2331 -111 -96 -31 39 -74 108 99 -22 -151 -99 -138 208 -71 -105 -133 12 115 169 -19 -145 86 -82 -76 110 202
2355 202 35 -44 -176 -128 -214 48 90 -4 63 41 -64 112 -2 80 59 -72 50 66 141 -45 -8 107 -50 34
2379 34 -162 127 -77 -91 81 45 -96 -331 117 243 -102 219 -38 -68 -1 -104 11 -156 -50 138 41 -142
2401 -142 126 -9 -139 39 -7 -70 84 -39 62 -113 -9 -7 -64 -127 125 -170 -112 70 69 -15 138 -17 95
2424 95 91 7 94 -8 -131 -114 144 14 -271 -153 81 324 78 -13 -19 -116 -69 156 146 112 -49 71 74 -21 -174
$$ packed form
2260a39J56L17l98Rj9J48l08J46N9n4K59k46Q9m8J89o1j48Q2J7j86Kj06L01N8
2284A19k88K55m2p0k1k9K95l00N1l15K39mo7J24O2K37j81k31O7j42L58Q9l35J67
2308C8L86n83R5J2k29L09j09m7K60j29k20J13J66j55M37n60J90m4L1L4M9N9k14
2331a11J5O5P0j13J82rj21j29N2l9L46k79l4k8J45J03N4j88j26K31j68OJ86R2
2355B02j67p9j32M8q6K62M2r4O7k2j05J76j14Q2k1j31J22J6P5j86L7J15j57Q4
2379C4j96K89k04j4J72l6j41k35M48J26l45L21k57l0O7j03J15j67J06J88r7j83
2401a42K68j35j30J78m6o3J54j23J01j75J04Kn7o3K52k95N8J82jq4J53j55J12
2424I5mq4Q7j02j23J7K58j30k85J18K34K43k46r1or7M7K25j0l4j61J20Lr5j53
$$ plain form
2449 -174 -4 -119 22 -84 -85 -68 80 83 -9 19 106 -43 314 181 426 66 -97 234 268 -268 266 93 -76
2472 -76 -219 -148 77 -58 -117 -138 165 107 69 152 59 -144 -165 -15 18 30 18 -83 -197 -226 -98 -48 102 143 230
2497 230 -174 71 -154 -2 240 -88 -194 -149 161 -9 -75 141 -132 139 -74 13 154 -100 -282 -138 -121
2518 -121 184 -13 -196 39 93 -93 -38 93 110 194 62 103 317 -48 -206 -177 -347 -21 43 -242 266 123
2540 123 -319 97 -309 135 -47 -93 111 -312 6 -69 150 42 -86 -136 233 -41 -256 2 -52 -83 -82 134
2562 134 234 -165 97 158 -287 105 73 -199 -79 79 169 125 159 -195 -89 -204 52 245 37 -147 32 156
2584 156 80 -20 84 -160 -130 17 -227 122 -218 -248 -20 -4 171 -245 57 51 28 -241 -26 -1 -22 72 -67
2607 -67 -3 -145 -136 114 221 68 -36 -18 -122 12 67 20 102 -95 -39 233 37 51 188 -188 -70 89 -39
$$ packed form
2449a74J70j15J41j06jJ7J48Lr2K8Q7j49L57j33K45l60j63L31L4n36N34j73j69
2472g6j43P1K25j35n9k1L03n8l8Q3r3k03k1J50L3J2j2j01j14k9J28N0J50M1Q7
2497B30m04K45k25J52K42l28j06M5L10j70o6K16k73K71k13Q7J41k54j82J44J7
2518a21L05j97j83K35N4j86N5J31J7Q4j32M1K14l65j58K9j70L26O4k85N08j43
2540A23m42M16m06M44j82m6K04m23L18p5K19j08j28n0L69k74k15K58n4l1JK16
2562A34J00l99K62O1m45L92l2k72J20J58R0m4L4l54J06j15K56J93k08j84J79J24
2584A56p6j00J04k44L0J47k44L49l40l0K28J6J75m16L02ok3k69K15K5k1R4j39
2607f7O4j42RK50J07j53j04J8j04J34N5m7Q2j97N6K72j96J4J37l76J18J59j28
$$ plain form
2630 -39 214 217 90 274 -103 174 -185 -126 15 -107 -38 68 105 220 95 -63 31 4 -93 -37 321 -101 -82 -134
2654 -134 -65 -152 -136 66 -35 -182 -6 106 -1 -80 -74 -60 -7 11 -31 -56 -18 -78 76 -111 80 -184 -113 -46 37
2679 37 116 -71 -300 -42 114 -49 -56 -111 -104 -49 116 -26 124 -16 -63 -69 -5 -9 14 18 82 243 107 -128 -47 -72 -116
2706 -116 -60 60 -141 -75 -101 -104 130 0 85 -91 -180 -262 -27 -328 -308 242 114 60 -95 179 236 -135 36 -83
2730 -83 4 181 9 52 98 34 -93 -281 -151 23 105 -19 -258 209 94 195 30 175 -41 -4 157 -14
2752 -14 66 -244 163 226 52 -23 178 -211 9 -63 -115 43 -55 -14 209 9 167 71 -152 -50 -141 166 170 -273
2776 -273 -178 108 -132 174 24 72 183 -1 -84 98 -88 -21 93 -19 107 130 109 -208 -260 187 205 108 -122
2799 -122 -240 -216 81 -43 -87 -11 69 -96 -70 -279 94 -73 20 269 -113 111 69 -303 368 120 -145 -307
$$ packed form
2630c9K53Lj27J84l77K77l59N9J41j22O9J06L7J15j25j58R4k7r7N6L58m22J9n2
2654a34O9q7J6K02j01j47J76J12j07p9OJ4N3J8m2k5L8o0J54j87J91k64P1O7Q3
2679C7P9j87k29K58J56j63pn5PN5J65j42J50j40m7oO4mK3MO4J61j36k35Q1k5m4
2706a16N6J20k01O6k6lK34j30Q5j76q9q2K35l01K0N50j28n4j55K74N7l71J71j19
2730h3Q7J77j72M3M6o4j27j88J30J74Q2j24k39M67j15J01j65J45k16L7J61j71
2752a4Q0l10M07O3j74p5K01l89K20p2n2J58r8M1K23k00J58r6k23J02r1L07Mm43
2776b73R5K86k40L06j50M8J11j84q3J82j86O7J14j12J26K3k1l17n2M47J8r7k30
2799a22j18K4K97j24m4P6Q0j65K6k09L73j67R3K49l82K24m2l72O71k48k65j62
$$ plain form
2821 -307 -22 94 72 22 -33 174 66 68 175 -1 -3 -74 159 62 4 -231 152 -114 -17 116 55 145 84 -123 -89
2846 -89 180 -282 188 -32 -167 -108 30 73 137 66 -90 -24 -125 124 -198 -68 -91 -163 -196 153 94 19 97 -63
2870 -63 -97 -70 -186 -58 -26 60 159 -60 -84 -84 -57 -51 162 -82 -28 26 126 110 -147 -173 62 -86 -52 179 -55 107
2896 107 230 -101 -47 10 -174 -41 182 -118 -9 60 35 -152 27 253 34 -64 -290 -31 150 29 185 161
2918 161 163 -131 22 -251 -68 133 -136 175 137 201 206 -60 133 254 -83 -127 -55 -53 80 278 -54 -236 -100
2941 -100 -182 -105 -98 191 -137 172 -72 129 -129 -239 8 117 -35 139 -33 -39 229 -116 -70 151 -241 -13
2963 -13 214 -103 208 166 -225 -44 -86 137 109 -198 -38 38 158 -268 21 8 62 1 167 47 228 -246 101
2986 101 -21 -237 -257 161 134 -66 46 -145 -122 122 10 -121 -11 -108 -126 -46 34 -40 -39 -156 -235 -148 139 -136
$$ packed form
2821c07K85J16k2n0n5K07j08KJ07j76kp1K33r7n8k35L83k66R7J33o1R0o1k07L4
2846h9K69m62M70k20j35N9J38M3O4p1j56O6j01K49l22J30k3p2l3L49n9p5P8j60
2870f3l4K7j16J28L2Q6R9k19k4%K7OK13k44N4N4J00j6k57k6K35j48L4K31k34J62
2896A07J23l31N4N7j84J33K23l00J09O9k5j87J79K26k19r8k26K59J81j21J56k4
2918A61Kk94J53k73J83K01k69L11l8O4Nk66J93J21l37m4P2KJ33J98l32j82J36
2941a00q2P7PK89l28L09k44K01k58j10K47J09j52J74j72oK68l45M6K21l92K28
2963a3K27l17L11m2l91J81m2K23k8l07J60P6J20m26K89j3N4o1J66j20J81m74L47
2986A01j22k16k0M18k7k00J12j91K3K44j12j31J10r7j8Q0Q0p4Jj17p9Q7K87k75
$$ plain form
3010 -136 86 266 161 0 -334 -22 97 177 -80 143 -95 -77 278 -57 27 -112 186 168 0 215 15
3031 15 94 167 -36 -92 -3 -107 -211 -79 -138 285 -98 146 -132 3 -233 186 -42 -99 118 23 -177 -225 173
3054 173 19 -95 -90 0 43 54 -125 -51 -119 278 -43 121 148 -225 -62 -235 48 -83 255 -63 2 205 83
3077 83 73 174 -119 102 164 59 148 -186 196 43 118 78 -77 85 92 7 233 51 -36 85 -51 -33 -61 116
3101 116 -208 -238 34 314 178 -34 2 26 254 -52 65 69 88 195 78 28 -48 -146 100 163 37 -160 -17
3124 -17 -7 180 74 -29 -293 -65 138 -59 116 -2 -94 92 38 -90 -136 24 -54 196 -273 95 -88 -145
3146 -145 -80 -93 -141 -98 -151 -38 -17 -178 181 -193 5 -144 -49 58 -97 5 73 14 -157 -41 186 22 201
3169 201 100 -36 91 -107 -89 -121 -148 -81 54 -51 3 -39 17 229 -123 -42 -212 -42 -293 175 -35 -87 40
$$ packed form
3010a36K22J80j05j61l34L12J19Q0k57K23k38J8L55l35Q4j39K98j8j68K15k00
3031A5P9P3k03n6Q9j04j04J32n9M23l83K44k78J35k36M19k28n7K17r5k00m8L98
3054A73j54j14NR0M3J1j79P4o8L97l21J64K7l73J63j73K83j31L38l18O5K03j22
3077H3j0J01k93K21O2j05Q9l34L82j53P5m0j55J62Pq5K26j82q7J21j36J8k8J77
3101A16l24l0K72K80j36k12L6K4K28l06J17MJ9J07j17n0p6r8K46O3j26j97J43
3124a7J0J87j06j03k64K28K03j97J75j18r2J86n4j28m6J60p8K50m69L68j83n7
3146a45O5j3m8M3n3J13K1j61L59l74J98j49R5J07j55J02O8n9j71J16K27j64J79
3169B01j01j36J27j98J8l2k7O7J35j05N4m2N6K12l52Q1j70J70k51M68k10n2J27
$$ plain form
3192 40 -95 -85 -246 104 120 97 -82 159 -159 -276 -28 -141 -123 9 37 -5 -125 199 130 29 330 197 0
3215 0 -96 127 62 185 69 60 -316 58 227 51 -10 136 -37 -212 -94 28 -131 150 -50 -51 -99 114 -267
3238 -267 69 131 116 42 -64 97 17 -68 -278 -244 65 164 49 135 411 45 -117 -53 164 -38 -139 -37 -202
3261 -202 -75 -30 -343 226 153 -3 114 105 177 61 -71 130 16 -83 3 -40 102 -2 140 43 30 -36 -307 195
3285 195 -85 178 165 70 15 28 79 48 87 -5 39 82 -56 101 -41 -58 -17 -57 21 -227 -60 -22 -133 -160 -56
3310 -56 61 195 -95 30 150 -40 192 216 -60 -159 128 47 -181 -145 34 -11 106 178 190 -88 -43 142 267
3333 267 -187 3 -87 -18 -5 78 -77 -373 210 -343 28 -77 128 -14 -77 146 6 -117 -123 224 -90 -125 -2
3356 -2 -103 122 67 124 -153 26 -156 167 -32 -73 -121 247 146 -58 53 106 -93 19 102 22 -3 -162 83
$$ packed form
3192D0j35J0j61L50J6k3j79K41l18j17K48j13J8J32K8m2j20L24o9j01L01j33j97
3215@r6K23o5J23j16rl76L74J69j76o1J46j73j75J18J22j59K81k00jm8K13l81
3238b67L36O2j5p4j06J61q0q5k10L4L09R9j15Q6K76l66j62O4K17k02j01J02j65
3261b02J27M5l13N69p3j56J17rP2j16j32K01j14r9Q6m3J42j04J42r7j3o6k71N02
3285A95k80K63j3r5n5J3N1l1L9r2M4M3j38J57j42j7M1m0P8k48J67L8j11k7J04
3310e6J17J34k90J25J20j90K32K4k76r9K87q1k28L6J79m5J17P2J2k78M5J85J25
3333B67m54J90r0O9J3Q3j55k96N83n53L71j05K05j42o3K23j40j23oL47l14l5J23
3356bj01K25n5N7k77J79j82L23j99m1m8L68j01k04J11N3j99J12Q3q0k5j59K45
$$ plain form
3379 83 45 84 -31 -32 171 -99 -153 -15 -104 -172 -43 -247 -56 -214 -49 213 199 33 35 -115 275 222 81 -71
3403 -71 182 138 -219 87 170 66 -47 -236 -97 120 180 112 -25 0 20 -101 23 0 -33 58 -61 -71 9 43
3427 43 -216 -70 39 -41 -26 -89 -54 -246 134 -20 224 -47 -42 29 -119 -118 35 147 -126 -100 54 -80 -97 69
3451 69 -4 -411 45 31 -93 -142 206 177 91 36 97 44 -111 161 39 42 18 109 72 -73 47 -48 -216 -11 227
3476 227 102 -272 -97 -125 9 -212 -103 13 -107 119 184 -273 -41 188 161 63 -17 -71 82 53 60 -48 -199
3499 -199 -181 -59 -194 -41 151 242 -166 -276 -63 49 72 36 194 200 -249 188 23 -68 12 179 96 -179 71
3522 71 -41 -27 115 -187 -50 143 -96 -230 -3 -144 -177 -111 -69 175 89 4 -202 279 49 12 145 142 60 30
3546 30 -43 -65 70 21 65 21 20 47 111 78 -2 113 -31 -155 18 31 195 -177 -8 26 -112 21 -35 -95 -94 -102 238
$$ packed form
3379H3l8L9j15jK03k70n4J38q9o8J29k04J91j58J65K62j4j66Kj50L90n3j41j52
3403g1K53m4l57L06Q3j04j13j89J39K17O0o8j37K5K0j21J24k3l3R1j19j0Q0L4
3427D3k59J46J09q0J5o3L5j92L80j54K44k71NP1j48JJ53J12k73K6J54j34j7J66
3451F9p3m07M56j4j24m9L48k9q6n5O1n3j55K72j22Lk4R1l7j45J20r5j68K05K38
3476B27j25l74J75k8J34k21J09J16j20K26O5m57K32K29k7r8q0n4J53k9Pj08j51
3499a99J8J22j35J53J92R1m08j10K13J12K3l6J58Om49M37j65r1Q0J67q3k75K50
3522G1j12J4J42l02J37J93k39j34K27j41l3O6M2K44q6q5k06M81k30l7J33lq2l0
3546C0p3k2J35m9M4m4jK7O4l3q0J15j44j24J73J3J64l72J69L4j38J33n6o0JqL40
$$ plain form
3573 238 -117 -188 26 19 -25 51 83 -75 -18 -167 43 121 114 188 -28 67 6 -21 -210 152 413 -182 131 15 -219
3598 -219 -73 197 211 -59 182 323 -208 -165 337 -59 98 78 -147 -276 -82 80 48 -127 -80 76 63 -31
3620 -31 299 -134 172 146 149 74 35 -130 -187 88 -70 94 -18 -329 -211 -5 31 -31 76 -111 -194 162 159 -90
3644 -90 40 157 128 -237 -65 -90 -155 -108 -83 -249 -95 -64 195 -247 181 -75 -17 49 -123 -87 -185 -184 94 -11
3668 -11 57 221 15 147 3 -82 136 89 -84 -128 74 81 -206 175 21 63 -248 -202 -243 14 -187 -136 33 76
3692 76 -14 18 -71 -50 184 -25 -123 -207 -17 -91 194 187 143 -152 128 45 216 60 -132 226 243 -119 -183 -295 220
3717 220 -96 -94 -174 37 -218 -72 14 -347 -132 -203 -169 235 83 187 -155 -18 131 227 31 173 -54 -109 -88
3740 -88 -104 -136 -206 247 -41 175 91 -59 -22 17 -245 -215 23 92 -215 9 -278 69 114 -48 73 48 -56 181
$$ packed form
3573B38l55p1K14pm4P6L2j58N7j49K10P8pP4k16R5o1k7j89L62K61n95L13j16k34
3598b19J46K70J4k70K41J41n31M3N02l96J57k0k25j29J94J62l2j75M7J56j3r4
3620c1L30m33L06k6Lp5l9j65n7K75j58J64j12l11J18K06L6o2J07j87q3L56lk49
3644i0J30J17k9l65J72k5o5M7K5j66J54L1K59m42M28k56N8O6j72L6r8JK78j05
3668a1O8J64k06J32j44q5K18m7j73m4K02Pk87L81j54M2l11M6m1K57k01N1J69M3
3692G6r0L2q9K1K34k09r8q4J90p4K85pm4k95K80q3J71j56j92L58J7l62o4j12N15
3717B20l16Kq0K11k55J46Q6l61K15p1L4M04j52J04l42J37J49R6j96J42k27n5K1
3740h8j6l2p0M53k88K16q4j50L7L9k62L0K38O9l07K24k87L47M5j62J21k5j04K37
$$ plain form
3764 181 28 3 163 -74 30 67 -201 58 92 135 38 8 -46 -62 -115 -233 30 -58 27 22 76 -105 128 -33 -31
3789 -31 41 -213 -129 -318 -25 -13 -234 54 -213 -205 -171 -219 120 -120 145 169 36 -250 -79 -207 -86 -47 -27 -58
3813 -58 113 -1 -82 241 44 31 -143 110 -114 -4 -148 52 -39 -24 -43 -62 204 1 115 54 171 -108 -6
3836 -6 24 57 -85 -20 -6 83 50 -151 17 43 24 215 -96 225 123 -104 -141 92 -110 17 -139 -36 -416 173
3860 173 64 93 -29 -297 -134 -140 108 56 124 -59 -147 199 -21 41 56 -14 -155 238 -82 -118 -106 -66 -171 -124
3884 -124 100 67 -93 -148 61 -56 89 -96 -30 -111 -3 -16 381 -54 -42 398 -153 94 -12 -111 148 138 301
3907 301 -220 -26 -20 -53 -37 94 -58 176 -168 10 -128 141 70 -75 11 -81 -41 -145 25 -41 -41 124 108 285
3931 285 -11 26 -222 52 30 -102 163 -92 -148 13 -11 -160 102 -87 -107 231 -83 -231 45 -29 -152 -318
$$ packed form
3764A81j53k5J60k37J04L7k68K59L4M3r7l0n4j6n3j18K63q8Q5nN4j81K33j61K
3789c1P2k54Q4j89K93J2k21K88k67QL4m8L39k40K65K4j33k86J71j28J21L9K0l1
3813e8J71j14q1L23j97j3j74K53k24J10j44K00r1J5j9j9K66k03J14o1J17k79J02
3836fL0L3j42O5J4Q9l3k01J68K6j9J91l11L21j02k27l7K33k02J27j56J03l80N89
3860A73j09K9j22k68J63oK48n2O8j83q8L46k20O2J5p0j41L93l20l6J2M0j05M7
3884a24K24l3j60n5K09j17J45j85O6q1J08j3L97m35J2M40n51K47j06r9K59j0J63
3907C01n21J94Ol3J6J31j52K34l44J78j38K69p1j45Q6r2M0j04J70o6%J65j6J77
3931B85k96L7k48K74k2j32K65k55n6J61k4j49K62j89k0L38l14j48K76p4j23j66
$$ plain form
3953 -318 312 105 -32 118 23 141 -169 27 -113 11 -7 281 68 -178 -79 -174 -63 -239 -7 29 158 -47
3975 -47 48 -70 158 54 164 -77 -218 -51 179 -6 -128 -208 -168 170 119 -57 101 -99 -146 -28 218 -36
3997 -36 -339 61 152 -9 -16 69 55 -209 -19 -200 147 -67 -56 -42 85 49 -55 9 139 -86 68 109 276 -20
4021 -20 -6 175 -248 -41 251 -35 -40 -105 -108 -11 117 -24 17 -52 -141 -340 -164 -131 -127 147 22 -127 16 135 180
4046 180 114 95 90 -12 -101 140 -86 -69 132 -243 38 161 63 -127 -205 203 2 180 -231 207 -11 39 -18
4069 -18 53 8 -15 331 290 -125 71 -18 -98 35 86 67 -172 141 165 123 -96 -126 -125 -47 73 -234 68 -15 52 -51
4095 -51 -111 -83 90 7 33 122 63 -270 90 -71 104 202 -99 -363 -60 40 -2 45 -67 -154 75 -177 -41 130
4119 130 -205 380 -79 111 -41 13 -198 -219 60 130 125 20 178 127 75 81 -123 -221 -42 -374 -119 97 65 44
$$ packed form
3953c18O30k07j37J50r5J18l10J96j40J24j8K88k13k46R9r5J11j76K32L6J29k05
3975d7R5j18K28j04J10k41j41J67K30j85j22q0M0L38n1j76J58k00m7J18K46k54
3997c6l03M00R1j61pQ5j4k64J90j81L47k14J1J4J27l6j04O4J30k25J54M1J67k96
4021b0J4J81m23K07K92k86no5lR7J28j41M1o9q9j99J76L3MK74j25j49J43J19M5
4046A80o6j9nj02q9K41k26J7K01l75K81J23r8j90p8M08k01J78m11M38k18N0n7
4069a8P1m5k3L46m1m15J96q9q0J33N1j9k39L13K4m2k19l0JP8J20l07L02q3O7j03
4095e1o0K8J73q3K6Q9n9l33L60j61J75R8l01k64L03J00m2M7j12q7K29k52J36J71
4119A30l35N85m59J90j52N4k11k1K79P0nj05J58n1n2Ok04r8J79l32K55K16l2k1
$$ plain form
4143 44 127 25 59 143 -55 -30 -97 -148 -183 188 -29 -55 -56 -322 -75 274 -79 215 270 132 -133 263 -266 -110
4167 -110 10 179 170 -174 -147 -263 89 -63 -123 -246 -30 -106 -16 -104 87 -6 -37 -140 -109 -164 119 246 81 163
4191 163 181 13 -139 -135 -20 189 257 -129 32 -75 12 77 -75 122 -10 -111 230 40 136 307 -31 -49 174
4214 174 -135 118 -6 -9 193 60 85 -78 -221 -69 54 -55 102 187 103 85 212 -38 -121 71 298 -312
4236 -312 -35 -107 -85 90 -67 -56 -24 170 -166 170 108 53 38 115 -18 -132 -136 -191 54 -18 -104 -9 146 -125 -68
4261 -68 -72 -108 30 -2 45 28 36 -85 -49 102 -33 13 -11 -180 -205 79 74 -109 -83 143 184 -25 111 131 17 -166
4287 -166 127 16 -227 119 -219 106 -69 -114 -27 90 289 164 123 104 25 123 171 -26 91 85 332 3 212
4310 212 200 -200 26 -31 57 -86 166 -266 66 55 -97 -31 -136 -24 153 244 -185 -46 -6 -135 -44 -83 177
$$ packed form
4143D4Q3j02L4Q4j98K5o7n1l5L71k17k6jk66K47L49l53K94N5j38k65L96n29J56
4167a10J20J69rl44K7j16L52j52o0j23K16p6R0q8J91r3l1j03L1n5K83J27j65Q2
4191A63J8j68j52MJ15K09O8l86J61j07Q7O5j52J97j32j01L41j90R6J71l38j8K23
4214A74l09K53j24lK02j33K5j63j43J52J23j09J57Q5q4j8J27k50q3J92K27o10
4236c12K77p2K2J75j57J1L2J94l36L36o2n5j5P7j33j14mn5K45p2q6R5J55k71N7
4261f8ml6J38l2M7j7Qj21L6J51j35M6k4j69k5K84nj83K6K26M1k09J36K0j14j83
4287a66K93j11k43L46l38L25j75m5Q7J17J99j25m1j9p9R8M8j97J17oK47l29K09
4310B12j2m00K26n7Q8j43K52m32L32j1j52O6j05J12J77R1m29J39M0j29R1l9K60
$$ plain form
4333 177 90 -107 32 -196 126 98 159 30 -118 -156 -52 -55 111 181 125 -106 -203 -60 123 42 153 188 -36 -119
4357 -119 -123 110 -57 -10 71 327 14 -156 157 -54 -236 185 -78 -318 73 -87 -112 -176 289 -29 -348 93
4379 93 68 -37 -143 93 247 108 94 59 -231 -106 51 -314 -39 50 180 -33 221 9 87 133 22 -84
4401 -84 48 -155 173 -258 -367 58 -32 -117 -64 87 -127 40 31 -127 -66 -112 142 -26 -149 -72 -93 -208 -176 -3
4425 -3 -223 215 196 -205 6 272 -121 -210 -52 -290 87 -51 268 80 -90 88 -48 147 -150 -122 33 18
4447 18 -105 -150 -11 115 -286 -44 82 -124 86 -49 189 -182 79 -87 3 79 136 1 -51 -30 -102 58 195
4470 195 55 -52 -2 -178 220 -11 -90 -31 146 -45 140 -7 -59 -181 66 -224 80 -79 -202 -100 174
4491 174 112 195 -87 -59 239 76 -109 -180 -111 -45 73 54 218 172 101 57 268 -236 -108 73 -63 -81 -209 -123
$$ packed form
4333A77q7j97J39k28L22k8O1j29j48l8J04lJ66P0n6k31r7J43J83q1J11L5k24q3
4357a19mK33j67M7Q1K56l13j70L13k11j82M21k63k40L91j60k5o4M65l18l19M41
4379I3k5j05j06K36J54j39j4l5k90J25J57l65K75Q9J30k13K54k12P8M6j11j06
4401h4J32k03L28m31j09M25r0q5N3J51k14J67rj58O1m6K54j68j23P7k1j15L2J73
4425ck20M38j9m01K11K66l93q9J58k38L77j38L19j88j70J78j36J95k97K8J55j5
4447A8j23m5J39J26m01K42J26k06K10j35K38l71K61j66R0P6N7j35n2K1p2J60J37
4470A95j40j07N0j76L98k31p9N9J77j91J85j47n2j22K47k90L04j59j23J02K74
4491A74o2Q3k82K8K98j63j85p1O9O6J18j9J64m6p1m4K11n04J28J81j36j8j28Q6
$$ plain form
4515 -123 -209 51 76 32 97 -27 -38 -14 -65 -36 -76 57 80 -130 291 -55 -134 -271 39 -48 43 99 315 -19 14
4540 14 227 -43 -74 -14 269 154 205 -8 170 82 101 -121 -8 -241 -59 -156 -34 -63 -16 45 8 159 -12 -61
4564 -61 118 -21 -213 78 109 -14 225 108 96 107 -92 95 -10 151 70 31 -1 68 -278 -175 -113 -15 -171
4587 -171 50 105 -63 4 -148 218 153 -130 -10 -114 197 137 -357 -103 228 14 -13 305 243 -68 134 179
4609 179 95 -132 74 -285 301 298 193 39 -101 219 -144 0 -139 57 -180 213 35 -131 -102 -20 -265 -123
4631 -123 193 39 70 -96 80 -118 -50 -180 -142 112 -74 -123 185 112 -112 85 229 -63 131 -112 -17 129
4653 129 150 60 -89 -147 -145 19 51 93 -90 -117 -27 204 -221 1 116 63 -21 212 42 36 -71 122 230 53
4677 53 -71 12 97 48 87 -97 36 -150 84 -155 191 -50 -2 -46 54 21 26 159 -47 -106 242 128 80 -61
$$ packed form
4515a23q6K60K5m4O5j24j1K4n1K9m0J33K3k10M21l46p9j37L10q7R1N6K16l34L3
4540A4K13k70l1O0K83j15N1k13J78q8J9k22J13k33J82r7J22k9M7O1l7J51j71m9
4564f1J79j39j92K91L1j23K39j17j2J1j99J87j05J61q1l9l2O9l46J03O2R8j56
4587a71K21N5j68O7j52L66o5k83J20j04L11o0m94K54L31k14k7L18o2l11K02M5
4609A79q4k27K06l59N86lj05j54j40L20l63J44j39J96k37L93j78j66K9Q2k45J42
4631a23L16j54L1j66J76j98O8j30L8K54j86m9L08p3k24J97J44k92J94k43R5J46
4653A29K1r0j49n8KJ64L2M2j83k7R0K31m25K22J15n3q4K33j70oj07J93J08j77
4677E3j24Q3Q5m9L9j84J33j86K34k39L46k41M8m4J00l3NJ33k06n9L48j14m8j41
$$ plain form
4701 -61 -284 -288 158 162 284 195 80 4 -115 -43 -60 44 -292 -135 -44 -234 147 -171 296 18 -215 64 -33 -136
4725 -136 -256 69 -99 111 179 -33 -22 3 15 -14 -107 -46 152 246 -147 133 195 -33 -201 158 -71 -222 66
4748 66 -100 -239 436 131 18 -297 -173 -59 -1 -93 242 42 -37 -35 -17 46 -368 158 34 -138 -17 65 -117
4771 -117 226 -66 -15 16 422 212 23 226 80 -258 79 163 161 -188 5 145 -239 44 -110 -92 -98 204 142
4794 142 -249 -203 5 8 -10 42 78 61 -111 -175 -146 244 -30 -39 280 14 26 -177 15 157 -14 -118 -238 205
4818 205 -10 2 -123 -365 289 228 195 -46 299 -55 -116 221 55 19 13 4 183 -55 -96 -118 78 49 -87 -20
4842 -20 127 4 68 51 47 -167 367 -143 157 -26 203 50 45 212 -114 78 123 218 161 -103 -92 -24 44 126 -114
4867 -114 149 -19 24 91 -5 -6 -52 -107 28 75 -122 143 60 -128 -182 33 -107 52 -119 3 192 -16 198
$$ packed form
4701f1k23mM46MJ22q9j15p6j19P2j7J04l36J57R1j90L81l18M67k78k33K79r7j03
4725a36j20L25j68K10O8k12J1K5J2k9r3O1J98R4l93K80O2k28j68L59k29j51K88
4748F6j66j39O75l05j13l15J24J14N8r2L35k00p9KJ8O3m14N26j24j72J21Q2j82
4771a17L43k92N1L1M06k10j89K03j46l38L37Q4kl49J93J40l84K83j54J8oL02o2
4794A42l91M6K08Lj8N2L6j7j72o4K9L90k74rL19k66J2k03J92J42j71j04j20M43
4818B05k15J2j25k42O54o1l3k41L45l54o1L37j66l6orJ79k38m1k2J96k9j36O7
4842b0J47j23O4j7mk14N34n10L00j83K29j53nJ67l26J92M5R5n7k64J1O8O8Q2k40
4867a14K63j68M3O7r6jm6n5J35M7j97K65q3j88n4K15j40J59j71J22J89k08K14
$$ plain form
4890 198 -151 -94 -160 -74 135 -74 -129 -142 -15 287 293 -71 51 -137 -119 13 42 -113 156 22 -32 58 37 117
4914 117 -107 275 -40 -216 280 16 31 -8 -182 -113 -134 -41 37 18 111 -23 42 -280 -53 301 -46 55 115
4937 115 122 -161 -52 -113 52 207 -65 170 83 108 -207 -256 -150 -202 -104 -138 -172 58 75 227 -94 -39 -209 34
4961 34 116 29 -61 7 -46 20 -60 -105 -30 -176 67 -186 -65 -193 -104 -45 -2 131 -130 -49 -247 24 -352 -16 181
4986 181 27 342 -177 95 112 -13 -124 72 3 40 69 121 -118 27 -266 -73 -164 -94 -18 23 151 81 76 -40
5010 -40 254 241 -129 -16 -99 254 102 17 -120 235 -70 -143 337 161 -62 32 37 -261 76 126 218 125 -27 176
5034 176 131 69 146 -261 300 -180 -356 -102 -85 -99 -57 -48 219 -25 29 93 -157 45 -147 111 -181 -145 72 78
5058 78 -107 -238 254 -333 -57 300 -12 94 -7 84 152 108 15 -64 82 52 166 247 -269 -37 -23 28 25 54
$$ packed form
4890A98l49N7o6Q6K09k09n5j3J27L02Ol64J22j88J8J32K9j55K69j34n4R0k1Q0
4914A17k24L82l15j76M96k64J5l9j74O9k1R3P8j9R3j34O5l22K27L54l47J01O0
4937A15Pk83J09o1J65J55k72K35q7K5l15m9J06n2R8l4l4K30J7J52l21N5j70K43
4961C4Q2q7r0O8n3O6q0m5P5j46K43k53J21j28Q9N9M3J33k61Q1j98K71l76L36J97
4986A81j54L15n19K72J7j25j11J96o9L7K9N2k39J45k93J93r1P0P6M1J28p0nj16
5010d0K94j3l70J13q3L53j52q5j37L55l05p3M80j76k23R4Nk98L37N0R2r3j52K03
5034A76m5o2P7m07N61m80j76K54J7j4M2RK67k44N4O4k50K02j92K58k92L6K17O
5058G8j85j31M92n87K76L57l12J06j01R1O8m4r3p9J46l0J14Q1n16K32J4N1lK9
$$ plain form
5082 54 120 313 -74 51 174 171 143 108 132 10 -77 119 17 51 -180 120 159 208 -38 172 -64 108 -182 102
5106 102 59 -280 221 214 124 86 -158 128 57 284 125 255 139 -215 167 105 -27 -157 89 -11 -174 11
5128 11 -58 39 130 24 20 64 185 196 1 43 -474 -348 -175 0 203 -264 -66 -202 30 80 -40 102 -68
5151 -68 -98 184 52 114 -231 -40 -47 136 48 179 5 138 86 241 -100 11 -144 170 -126 67 -91 -92 29
5174 29 77 -89 -236 44 -47 -10 -50 133 48 27 288 390 -122 21 -87 162 217 -17 -111 -233 -1 46 -94
5197 -94 -56 42 -35 -101 -208 110 -23 -31 -19 184 -133 -248 -143 87 193 -150 4 -134 -10 -97 10 111 118 48
5221 48 61 -28 -15 -76 86 153 -19 111 -143 196 155 84 -42 -5 217 -96 89 53 -132 46 90 -58 -8 -20
5245 -20 -201 -66 -4 93 43 78 -35 -138 103 194 146 -49 -31 -129 -161 31 76 164 -95 -99 -18 440 -35 83 298
$$ packed form
5082E4O6J93l87J25J23lk8l5K4j22q7J96j02L4k31L00L9M9k46K10k36J72k90K84
5106A02m3l39N01pr0l8k44K86p1K27j59J30j16l54L82o2j32j30K46j00j63J85
5128A1o9R7R1j06mM4J21J1j95M2n17J26J73J75K03m67J98j36K32N0j20J42j70
5151f8l0K82j32O2l45J91pJ83q8J31j74J33n2J55l41J11j55L14k96J93j58jJ21
5174B9M8j66j47K80r1L7m0J83q5k1K61J02n12J43j08K49N5k34r4j22K32M7j40
5197i4L8R8p7o6j07L18j33qJ2K03l17j15J05K30J06l43J54j38J24q7J07J01Pp0
5221D8J3q9J3o1J62O7j72J30k54L39m1p1j26L7K22l13J85l6j85J78M4j48N0j2
5245b0j81J35O2R7n0L5j13j03K41R1m8j95J8r8l2J92M5Q8k59mQ1M58m75J18K15
$$ plain form
5270 298 17 -143 24 -354 99 69 -23 164 221 51 -301 52 -73 -140 -71 -236 65 55 -55 -240 33 -2
5292 -2 -70 -154 91 -112 56 -119 212 334 0 -387 -18 -23 -155 -2 86 87 -49 12 -63 -5 -2 -44 203 270 -4
5317 -4 -95 229 -300 -200 -54 32 96 -32 -371 -182 -202 48 102 265 -102 4 -32 150 54 -43 -36 37 -50 -9 -66
5342 -66 37 185 -124 120 -129 483 152 -117 -91 -182 307 19 186 -184 76 77 128 57 253 239 -5 203 -137
5365 -137 146 152 -135 77 -266 168 69 -234 -122 -131 -23 86 189 62 78 -133 -143 194 235 -176 114 34 44
5388 44 94 -302 200 38 24 43 392 24 381 -162 -190 -192 22 -20 -49 326 -313 125 78 193 -91 275 -92
5411 -92 28 -33 -92 291 0 -32 18 90 -143 -108 75 -152 100 74 -72 -173 35 -204 -55 129 -152 -45 -142
5434 -142 51 12 124 -204 151 322 23 89 75 -78 79 -178 -91 242 -107 -96 20 57 14 -181 192 -405
$$ packed form
5270B98k81j60J67l78M53l0r2J87N7j70l52L53j25o7O9j65L01j0j10j85K73l5
5292bo8q4K45k03J68j75L31J22l34l87L69nj32J53Q8Jj36O1p5N8Lm2K47O7k74
5317dr1L24n29J00J46Q6O4j28l39J89k0K50N4J63l67J06l6J82r6r7PP3q7M1n7
5342f6J03J48l09K44k49O12l31k69K6r1M89k88J67l70K60JN1p1J96j4k44K08l40
5365a37K83Ok87K12l43M34r9l03J12rJ08J09J03j27J6k11j0L37M1m11K90q0J0
5388D4N0l96N02j62j4J9L49l68L57n43k8kK14m2k9L75o39M38m7J15k84L66l67
5411i2J20o1n9L83k91l2N0P2k33L5J83k27K52k6j46j01K08k39J49J84k81J07r7
5434a42J93l9J12l28L55J71k99O6j4j53J57k57Q7L33l49J1J16L7m3j95L73n97
$$ plain form
5456 -405 172 135 -124 18 234 -138 -82 -45 -34 -35 -20 5 113 102 -219 -116 28 6 -8 245 -130 136 94 79
5480 79 33 199 -450 -27 -95 -39 -38 118 163 27 -155 158 -172 -123 291 57 91 83 157 165 -132 16 -18 49 -52
5505 -52 -64 -109 -188 104 -17 0 -90 34 -127 26 8 -129 -106 8 62 9 -129 -102 209 15 233 -38 -187 -178
5529 -178 24 25 274 -154 -13 -124 -292 -34 -7 127 171 -115 209 28 -77 62 30 -141 -118 -70 -163 225 -96
5552 -96 60 7 134 -19 -19 -93 -295 147 65 -124 -95 4 -4 272 -105 -42 -131 -301 -86 179 -188 36 42 9 76
5577 76 70 47 -46 79 -151 340 2 -34 53 32 16 256 -39 154 20 36 210 -82 -179 -100 258 -124 73 93
5601 93 17 -133 33 -4 219 -129 -78 -38 86 83 -204 -121 115 39 -117 -117 -20 159 48 78 163 90 22 153 -190
5626 -190 -34 70 -302 -75 -9 -121 50 -141 158 60 119 -95 237 -256 172 -60 -200 50 -53 -113 -93 -107
$$ packed form
5456d05N77l7k59J42K16l72N6L7J1jJ5K5J08j1l21J03J44k2j4K53l75K66m2j5
5480G9m6J66o49M23o8N6JJ56M5j36j82L13l30M9M14k34L4qP4Qk97J48l4O7j01
5505e2j2m5p9K92j21J7r0J24j61J53j8j37K3J14N4n3j38K7L11j94K18k71j49R
5529a78K02JK49m28J41j11j68K58K7J34M4k86L24j81j05J39l2j71K3M8r3L88l21
5552i6J56n3J27j53%p4k02M42q2j89K9R9qK76l77O3q9j70K15K65l67K24Ol3O7
5577G6ok3r3J25k30M91l38l6Q7k1j6K40k95J93j34J6J74k92r7P9L58l82J97K0
5601I3p6j50J66l7K23l48N1M0J24lk87Q3K36p6j56%R7J79j11L0Q5p3o8J31l43
5626a90J56J04l72K27O6j12J71j91K99r8N9k14L32m93M28k32j40K50j03o0K0j4
$$ plain form
5648 -107 99 113 -2 -215 -210 189 -95 34 5 40 24 78 264 96 -68 -196 66 -26 7 -127 -318 -37 63
5671 63 80 -104 -116 -290 107 265 -121 -99 66 -192 144 -247 35 -9 207 -148 -90 46 58 -37 -54 157 -202
5694 -202 9 -160 269 -26 21 416 -60 -156 -126 20 -102 -168 -264 -212 -159 178 100 42 88 187 22 153 -261 -190
5718 -190 111 -37 112 172 208 -183 -196 -474 -163 143 -27 -243 -43 -75 -80 28 -60 -194 94 136 -100 22 -2
5741 -2 -68 226 75 -111 -28 33 -8 -36 -29 -60 -161 258 -103 116 150 -2 -15 13 -32 -74 -60 39 2 -157 -67 61
5767 61 -97 -119 -179 62 -85 -65 84 46 63 -263 124 38 2 33 27 74 33 68 145 50 -175 31 -9 -237 38 10
5793 10 160 -125 -105 -1 -18 -29 170 -199 -14 130 -82 -151 -135 -176 -36 -181 -30 31 29 -18 -3 85 -246 8
5817 8 111 -278 -193 -70 286 -20 310 4 -113 113 135 -68 -10 -19 -10 40 18 -65 -41 213 -81 90 -141 191
$$ packed form
5648a07K06J4j15k13NL99k84J29k9L5j6N4J86j68j64j28K62r2L3j34j91K81J00
5671F3J7j84j2j74L97J58l86K2J65k58L36l91K82m4K16l55N8J36J2r5j7K11l59
5694b02K11j69M29k95M7L95m76r6L0J46j22o6r6N2N3L37p8n8M6R9j65J31m14P1
5718a90L01j48J49O0L6l91j3k78L11L06j70k16K00l2nJ08q8j34K88M2k36J22k4
5741bo6K94j51j86Q3O1m1k8Pl1j01M19l61K19L4j52j3K8m5m2J4R9l7j59R0J28
5767F1j58k2o0K41j47K0J49l8J7l26L87q6l6L1oM7m1L5P7r5k25K06m0k28K75k8
5793A0J50k85K0J04j7j1J99l69J85J44k12o9J6m1J40j45J51O1km7J5Q8l31K54
5817HJ03l89Q5J23L56l06L30l06j17K26K2k03N8rRN0k2q3K4K54k94J71k31L32
$$ plain form
5841 191 -101 230 223 -51 -220 75 -14 64 60 12 117 -64 -333 138 99 -258 11 -49 -16 9 255 -92 205 149
5865 149 -69 24 -173 209 -33 35 -121 -209 61 -250 137 159 141 -16 -80 58 -202 -197 -169 209 -90 177 -436
5888 -436 -300 -141 -137 161 101 137 220 267 -70 254 155 63 57 182 -177 67 314 169 -90 -22 -105 9 11 27 208
5913 208 261 61 39 -131 1 -24 36 40 293 104 113 287 212 45 -324 -122 -13 -99 97 -56 100 87 -37 237
5937 237 -86 -150 126 -101 -64 -51 30 138 -305 -25 171 -189 174 13 39 167 -99 20 -43 23 -179 168
5959 168 181 -119 63 122 219 301 136 -97 -46 333 -61 109 63 49 58 137 153 338 20 -264 148 -179 -111 4
5983 4 123 -87 -29 47 -121 -58 -114 62 -169 14 -50 -25 -174 36 84 122 -10 23 144 39 100 -20 -73 114
6007 114 -256 9 42 -84 96 291 22 -45 20 133 62 234 89 -367 313 -52 93 193 21 -267 -44
$$ packed form
5841A91k92L31pk74j69K95q9P8mm8J05j81k69M71l9l57K69o0L3K5K46l47K97n6
5865A49k18R3j97L82k42O8j56q8K70l11L87K2j8j57o4J38k60NK8L78k99K67o13
5888d36J36J59MK98o0L6Q3M7l37L24r9r2oJ25l59K44K47j45k59O8q3J14KJ6J81
5913B08N3k00k2j70J32k5O0MK53j89RJ74p5j67l69K02J09q6J96j53J56j3j24K74
5937B37l23o4K76k27L7J3Q1J08m43K80J96l60L63j61K6J28k66J19o3O6k02L47
5959A68J3l00J82N9R7Q2j65k33N1L79l94J70m6j4RP9J6J85l18k84M12l27O8J15
5983DJ19k10N8P6j68O3n6J76k31J83o4K5j49K10M8L8j32L3J21j05O1j20n3J87
6007A14l70K65L3j26J80J95k69o7O5J13p1J72j45m56O80l65J45J00j72k88K23
$$ plain form
6028 -44 -160 -141 116 -40 133 112 48 -172 14 -191 -331 -139 107 -48 -77 -104 -121 -7 -243 123 156 -162 -30
6051 -30 -40 -163 138 -45 53 -18 -108 47 -205 -18 68 -123 64 -104 42 -189 125 22 25 94 59 91 399 -256
6075 -256 -11 134 110 207 -81 117 -114 125 -86 -51 69 34 -22 4 68 -371 55 67 -113 -77 -13 -12 126 332
6099 332 113 70 40 150 75 252 -15 23 -36 -265 216 166 13 118 85 -115 267 -100 101 -92 -161 -111 -197
6122 -197 -198 -14 -122 -3 126 -150 170 55 -2 188 -3 -66 85 61 -110 183 -20 125 22 13 -76 -170 42
6145 42 56 3 66 92 -33 -39 -122 27 -122 238 -66 -206 117 -140 -150 -186 -35 255 174 121 -12 -346 -149 -47
6169 -47 262 174 -18 -232 -31 97 147 224 161 -74 -62 129 56 39 -107 221 72 -23 158 159 -55 -179 -54 77
6193 77 -14 29 72 50 217 -105 59 -112 173 232 17 -15 318 428 -264 -75 -187 135 -28 -57 86 31 104
$$ packed form
6028d4j16J9K57j56J73k1o4k20J86k05j40J92K46j55k9k7j7J14k36L66L3l18J32
6051c0j0j23L01j83R8p1r0J55k52J87Q6j91J87j68J46k31L14j03LO9l5L2L08o55
6075b56K45J45k4R7k88J98k31K39k11L5J20l5n6K6O4m39M26J2j80L6O4JJ38K06
6099C32k19m3l0J10p5J77k67L8n9k29M81n0j53J05l3k00L82l67K01j93o9N0q6
6122a97jJ84j08J19J29k76L20j15n7J90j91o3J51k4j71K93k03J45j03rq9r4K12
6145D2J4n3O3K6j25oq3J49j49L60l04j40L23k57j0l6J51K90q1n3j33l34J97J02
6169d7L09q8j92k14K01J28N0P7o3k35J2J91p3j7j46L28j49r5J81Jk14j24J25J31
6193G7r1M3M3k2J67l22J64j71K85N9k15l2L33J10o92J89j12L22j63k9J43n5P3
$$ plain form
6216 104 -32 -100 -34 -205 52 1 143 130 233 59 -49 -25 -22 -13 32 -193 -47 160 -183 -242 100 -27 -103 -53
6240 -53 -33 47 83 219 253 -81 -34 87 19 -29 -133 262 -399 69 73 -214 -147 -31 -77 125 173 -194 -134 8 -225
6265 -225 -19 -166 78 233 -151 -249 64 39 -115 61 10 13 -50 -50 -52 -79 27 135 37 292 -36 -46 -42 -268 -237
6290 -237 63 35 -8 -97 80 -131 -16 -223 -113 70 70 181 -115 132 11 111 -44 -21 -133 -14 -82 -42 -28
6313 -28 0 -102 3 111 -14 -96 140 -149 -229 172 119 -72 -114 122 27 72 27 -15 -137 -146 152 12 28 159
6337 159 -80 -196 248 71 -41 -46 30 277 -114 -45 -172 -159 -37 134 107 129 111 78 47 -98 -244 -185 -176 15
6361 15 -296 -77 116 15 30 -57 -64 198 114 -224 127 50 21 -209 -152 -57 -142 88 11 135 154 -112 -84 -59 -15
6386 -15 53 117 -166 -114 150 -24 -157 61 -233 289 -59 11 179 -16 -61 131 106 112 -157 38 176 30 75
$$ packed form
6216A04j36o8O6j71K57n1J42j3J03j74j08K4LRM5k25J46K07l43n9L42j27p6N0
6240e3K0Q0L6J36L4l34M7J21o8m8j04L95o61M68Mk87O7J16m6K02M8l67O0J42k33
6265b25K06j47K44J55l84r8L13k5j54J76n1Lo3%kk7J06J08r8K55l28j0Mk26L1
6290b37L00k8m3q9J77k11J15k07J10J83%J11k96K47j21J00j55K3j12J19o8M0J4
6313b8K8j02J05J08j25q2K36k89q0M01n3j91m2K36r5M5m5m2j22rK98j40J6J31
6337A59k39j16M44j77j12nP6K47l91O9j27J3J22J71k7K2j8l3l1j45j46N9RJ91
6361A5l11K19J93j01J5q7pK62q4l38L51p7k9k30N7R5q5K30p7J24J9k66K8K5M4
6386a5O8O4k83N2K64j74j33K18k94N22l48P0J68j95m5J92k5Ok69J95J38j46M5
$$ plain form
6409 75 99 100 140 -154 110 -110 -81 0 -125 218 138 -88 -208 244 -69 -144 -118 -55 -47 282 -56 229 -109 67
6433 67 -24 -348 72 104 14 -75 -196 -191 117 0 -205 -240 -78 -228 31 -130 196 -80 0 -150 -192 25 -33 -194
6457 -194 -21 -116 146 53 71 -180 -188 160 -116 128 36 160 -161 89 210 254 -17 82 -10 -432 -98 42 -145
6480 -145 -100 -295 13 38 44 85 25 19 -149 -89 92 90 112 15 62 -98 97 27 -166 57 23 -254 -99 24 8 -49
6506 -49 -253 106 3 61 -182 -61 -43 -7 -385 10 -132 95 134 32 -116 -121 115 -136 -133 -129 8 25 -113 53
6530 53 -18 -152 81 33 176 -51 181 -140 -179 126 296 -48 -161 84 -80 -24 -24 25 -92 -94 -85 -313 198 -41
6554 -41 18 180 164 -111 111 -1 50 230 -155 -91 -156 53 -96 141 132 190 -17 -12 93 -32 -88 -31 43 51 -106
6579 -106 162 42 68 56 0 225 -71 -145 -41 97 28 -170 103 29 -156 -51 60 -133 -247 -52 -159 -55
$$ packed form
6409G5K4JM0k94K64k20K9Q1j25L43q0k26j20M52l13p5K6O3QL29l38K85l38J76
6433F7r1l24M20L2r0q9j21NL08j17k05l5J62j50K59j61L26k76Q0j50m2K17n8j61
6457a94J73r5K62r3J8k51qL48k76K44r2J24l21K50J21M4k71R9r2m22L34J40j87
6480a45M5j95L08K5OM1o0oj68O0J81kK2r7M7j60J95p0j93K23l4k77J55J23j6n7
6506d9k04L59j03N8k43J21J8L6l78L95j42K27L9j02j48nK36k51LMJ37J7j38J66
6530E3p1j34K33m8J43k27K32l21l9L05J70l44j13K45j64N6%M9j17kRk28N11k39
6554d1N9J62j6k75K22j12N1J80l85O4o5K09j49K37rN8k07NJ05j25n6N7P4Qj57
6579a06K68j20K6j2n6K25k96p4J04J38o9j98K73p4j85J05J11j93j14J95j07J04
$$ plain form
6601 -55 -106 45 -82 59 168 -248 -57 -119 -55 -452 -100 -82 53 54 -270 -40 53 151 103 201 -24 -12 17 166
6625 166 -112 208 272 -45 35 331 -59 8 24 34 -8 -172 -241 -256 21 309 51 212 83 71 235 -244 -92
6648 -92 -55 166 27 91 -327 -87 -225 21 -44 -154 -18 26 98 -5 293 -11 -154 120 128 25 128 72 -56
6671 -56 38 -137 -34 -72 6 230 -65 23 56 217 -111 97 229 -17 106 246 -137 451 3 -83 25 -33 -37
6694 -37 -70 1 -210 108 103 125 -212 -12 -62 33 14 -120 73 153 12 -30 72 -138 57 238 -168 -306 84 138
6718 138 -4 226 -188 -38 52 177 -17 -50 24 148 -9 -61 17 -98 -116 4 -186 -25 61 141 -144 -180 213
6741 213 -186 36 -64 -4 -168 153 -87 -111 -58 -229 78 -56 -141 -28 125 86 -91 109 93 339 136 -214
6763 -214 3 -170 -19 127 212 -135 8 -14 2 -27 -113 217 -136 43 -133 8 -91 -30 -39 -164 162 71 100 161
$$ packed form
6601e5n1J51j27J41J09m16J91o2O4l97L52J8J35Jl24K30R3R8m8R8k25J2K9J49
6625A66k78L20O4l17Q0K96l90O7J6J0m2j64o9j5K77K88k58J61j29j2J64m79J52
6648i2L7K21j39O4m18K40j38K46o5j10J36M4P2j03K98l04j43K74Qj03J03n6j28
6671e6R4j75J03l8P8K24k95Q8L3J61l28K08J32k46J23J40l83N88m48q6J08n8m
6694c7l3P1k11L18nK2l37K00n0R5j9j34J93Q0j41m2J02k10J95J81m06j38L90N4
6718A38j42K30m14J50R0J25j94l3P4J24j57n2P8j15j8J20j90J61Q6Q0k85l6L93
6741B13l99K22j00O0j64L21k40k4N3j71L07j34q5J13J53l9j77K00j6K46k03l50
6763b14K17j73J51J46Q5l47J43k2J6k9q6L30l53J79j76J41r9O1rj25L26r1K9O1
$$ plain form
6787 161 -144 92 16 -47 2 348 -64 28 -117 114 -56 137 -48 -72 -46 -138 437 60 -45 -60 -17 122 366
6810 366 196 -164 -103 24 -117 -255 -2 -122 -113 -132 15 -262 42 -147 -73 127 -30 -222 101 42 98 -42
6832 -42 -47 54 -76 17 35 53 -1 -176 101 109 50 167 187 -224 53 335 117 76 228 -52 -125 -146 -185 -238 260
6857 260 101 12 114 -180 -9 35 -165 -6 152 -313 98 320 -60 77 192 -195 169 -203 -170 -180 6
6878 6 18 -98 91 235 -9 -55 -39 19 -40 27 -71 48 -146 44 -160 -292 101 -28 -316 -88 56 -130 9
6901 9 -47 17 143 74 -168 -141 -281 74 208 302 8 -68 5 -19 -52 216 -119 -176 -106 27 171 186 175 91 81 11
6927 11 -5 -54 35 64 -188 -200 8 131 39 105 -39 -116 184 -147 137 -40 42 50 37 67 -63 98 39 -145 316
6952 316 217 275 174 75 -12 -57 -49 -178 227 234 -92 -26 -327 147 105 60 -121 69 182 -45 36 -53 -202 90 69
$$ packed form
6787A61l05K36p6o3M9L46m12R2j45K31j70J93j85k4K6r2N75l77j05j5M3J39K44
6810C66j70l60O1J27j41j38K53j20Rj9J47k77L04j89P4K00j57j92L23n9N6j40
6832d2nJ01j30R3J8J8n4j75K77Qn9J17K0m11K77K82k18m1J52k80p3k1l9n3M98
6857B60j59q9J02k94J71M4k00J59J58m65M11K22l80J37J15l87L64l72L3j0J86
6878FJ2j16J89J44k44m6J6N8n9O7r8J19j94J90k04j32L93j29k88K28J44j86J39
6901In6O4J26o9k42K7j40L55J34R4k94p6P3k4l3K68l35n7P0J33J44J5j1q4j0p0
6927A1j6m9Q9K9k52j2K08J23r2O6j44p7L00l31K84j77Q2Qj3L0j30J61n9j84M61
6952C16r9N8j01r9q7m5Qj29M05Pl26O6l01M74m2m5j81J90J13k27Q1q9j49K92k1
$$ plain form
6977 69 163 173 154 -100 174 -144 -20 -16 172 -67 -143 137 259 -13 -88 -21 45 -7 189 19 0 -63 -208 -125 43
7002 43 201 -59 -126 -44 77 212 210 -1 -183 -29 69 180 -151 -24 -361 74 -180 120 -86 56 -103 -77
7024 -77 -111 20 44 88 -85 -84 103 -64 177 -58 134 -28 -213 133 92 92 110 85 44 28 -13 221 -229 -123 152
7049 152 86 -216 -117 18 -14 -22 -85 -199 -71 40 -56 77 226 52 -33 21 93 -38 -28 88 -134 169 -327 -42
7073 -42 -89 33 11 39 23 11 -44 21 19 -5 -192 -300 -13 -162 36 -156 441 -41 314 42 198 55 115 -121
7097 -121 -49 -21 243 -251 -35 -187 -166 48 -15 -9 113 49 174 -104 -128 240 38 149 261 -19 104 219 -234
7120 -234 -45 -166 157 -77 9 -94 62 1 96 -189 60 -14 46 -203 -108 -31 -15 2 -166 93 106 190 -111 -122
7144 -122 202 130 -14 223 167 -87 117 97 168 -91 -22 -166 159 41 155 -22 244 54 -154 -16 101 103
$$ packed form
6977F9R4J0j9k54K74l18J24MJ88k39p6K80J22k72p5O7O6n2J96j70j9o3j45Q3J68
7002D3J58k60o7Q2J21J35kk11j82J54R8J11l31J27l37M35k54L00k06J42j59K6
7024g7l4J31K4M4j73JJ87j67K41k35J92j62j85L46m1%J8k5m1j6m1K34m50J06K75
7049A52o6l02R9J35l2qo3j14J28J11r6J33J49j74q5N4P2j31J0J16k22L03m96K85
7073d2m7J22k2K8j6j2n5O5kk4j87j08K87j49J98j92N97m82L55k72J56j43O0k36
7097a21P2K8K64m94K16j52K1K14o3OJ22o4J25k78k4L68k02J11J12k80J23J15m53
7120b34J89j21L23k34Q6j03J56o1R5k85K49p4O0k49R5P7J6J7j68K59J3Q4l01j1
7144a22L24p2j44K37n6k54K04k0P1k59O9j44L25j18J14j77K66j90k08J38J17K
$$ plain form
7166 103 -175 6 -197 -41 11 210 31 -59 -75 -3 -322 95 15 175 -45 227 -53 -56 -21 -80 -242 107 274
7189 274 -115 -231 -14 -70 -265 78 -15 112 11 -185 159 -113 73 -49 84 332 -20 32 -99 -75 -49 75
7211 75 -3 33 -11 21 126 -22 168 -55 84 180 -24 -18 -77 -185 -159 301 -219 -36 -127 -97 -279 145 302 117
7235 117 40 -196 -44 -133 229 -297 -238 128 117 233 34 -37 -17 74 25 -210 -66 -75 -167 102 53 -47 184 193 95
7260 95 247 -135 142 -72 -50 -47 110 13 -178 124 53 -215 -137 35 112 197 116 30 -33 240 287 0 -79 -128 -9
7285 -9 116 -87 216 -71 182 22 -143 -17 -8 116 27 5 190 82 135 173 -46 263 65 390 -49 -26 -72
7308 -72 86 -80 175 56 -129 119 67 257 -45 -18 3 -139 37 107 50 6 -27 204 -14 -10 139 42 56 -135
7332 -135 207 158 85 -167 -188 117 -77 -76 -47 62 148 -103 125 -116 76 83 -46 252 30 -149 204 39 -50
$$ packed form
7166A03k78J81k03J56N2J99j79r0j6P2l19M17q0J60k20K72k80lL5n9j62L49J67
7189B74l89j16K17n6j95L43r3J27j01j96L44k72J86j22J33K48l52N2j31K4K6J24
7211G5p8L6m4L2J05j48J90k23J39R6k04On9j08K6M60n20J83r1L0j82M24J57j85
7235A17p7k36J52q9L62n26N9L66j1J16j99p1K0R1m9k35J44rr2K69m9j00K31Rr8
7260I5J52l82K77k14K2LJ57r7j91L02p1k68P8J72P7Q5q1q6o3K73M7k87p9m9J19
7285iJ25k03L03k87K53j60j65J26RJ24q9k2J85j08N3L8k19L09j98L25m39K3m6
7308g2J58j66K55j19j85K48n2J90l02K7K1j42J76P0n7m4l3K31k18MJ49r7J4j91
7332a35L42m9p3k52k1L05j94JK9J09Q6k51K28k41J92Pj29K98k22j79L53j65q9
$$ plain form
7355 -50 77 -97 -131 46 -24 17 200 188 -33 -97 20 -41 -3 -131 -114 216 -146 137 134 94 66 -14 165 67 -170
7380 -170 119 52 291 -160 60 254 80 -65 -7 28 -138 202 -35 120 -12 274 -5 -161 -344 -397 -48
7401 -48 -102 157 105 187 -1 -210 163 125 3 106 -248 -106 -88 -13 201 99 -168 -147 -168 62 152 -184 89
7424 89 140 225 40 -32 -238 96 248 14 241 -65 -347 11 421 -134 -59 17 230 -9 -213 36 9 -49 360
7447 360 -13 9 -101 -119 22 -210 106 18 -110 -76 -216 -221 -142 -145 -69 127 250 -12 180 -71 273 24 118 -127
7471 -127 -12 -43 -255 -102 67 75 78 -17 -130 -57 -146 -168 -196 -135 105 -199 -203 121 -51 17 -199 -143 71 123 -43
7496 -43 3 245 138 29 -265 304 -117 14 -93 57 57 98 10 -25 216 165 -19 123 -6 -100 104 38 -64
7519 -64 -238 -237 -1 116 -58 -89 -121 213 -14 125 -89 -101 -103 -200 -63 -80 -43 42 -45 263 -2 210 -10 160
$$ packed form
7355e0J27j74l4J77p0M1J83j2k21o4J17o1L8j28J7L30l62K83lm0k8q0J79r8k37
7380a70K89o7K39m51K20J94j74j45N8L5j66L40k37J55j32K86k79j56j83n3L49
7401d8n4K59n2Q2j88k09L73l8j22J03l54J42J8P5K14j02k67K1k1K30R0l36K73
7424H9N1Q5j85p2k06L34J52k34K27l06k82L58M10n55P5P6K13k39k04K49k7n8M09
7447C60l73K2j10j8J41k32L16q8j28L4j40nP9lP6J96J23k62J92k51L44k49R4k45
7471a27J15l1k12J53J69QLr5j13P3q9k2k8O1K40l04mL24j72O8k16N6K14N2j66
7496d3M6K42j07j09k94N69m21J31j07J50%M1q8l5K41n1j84J42j29r4K04o6j02
7519f4j74JK36J17j74l1l2L34k27J39k14j2kr7J37j7L7Q5q7L08k65K12k20J70
$$ plain form
7543 160 -77 -113 -51 60 -50 31 -158 23 22 242 9 119 195 -96 -66 -122 5 -68 -83 156 227 58 -233 -206
7567 -206 304 86 -161 93 -54 127 -292 -270 1 -117 95 -29 -183 54 -156 136 188 -256 130 188 -396
7588 -396 0 5 -111 88 -68 -17 192 -102 -150 192 117 40 -175 -124 203 78 -52 102 -46 55 -147 -51 162
7611 162 87 -91 81 7 4 158 -282 36 -54 -62 -113 -54 11 -127 -205 114 60 -198 2 -205 -108 -23 65 -65 52
7636 52 -140 80 0 -61 -92 67 261 36 -222 231 117 -72 70 91 109 -113 -185 40 -133 186 -72 127
7658 127 69 -24 55 116 70 -193 71 -239 156 167 -123 -284 78 -49 105 28 33 565 -197 -210 -97 -187 -189 -201 103
7683 103 -25 80 30 68 -100 66 84 214 -172 -184 29 197 -9 -95 105 180 -36 -37 80 19 118 -26 -41 -39
7707 -39 54 189 -40 -238 52 -387 8 -23 107 -193 3 75 -14 59 279 -89 -9 6 -89 44 -41 147 98 114
$$ packed form
7543A60k37l6O2J11j10Q1j89J81jK20k33J10P6k91L0n6J27p3j5K39P1j69k91K7
7567b06N10k18k47K54j47J81m19K2K71j18K12j24j54K37k10K92N2m44L86N8n84
7588c96L96Nj16J99j56N1K09k94m8L42p5p7k15N1L27j25j30J54j48J01k02R6K13
7611A62p5j78J72p4lJ54m40L18r0qn1N9O5j38p8L19n4k58K00k07R7Q5Q8j30J17
7636E2j92K20q0o1l1J59J94k25k58M53j14j89J42K1J8k22p2K25j73L19k58J99
7658A27n8r3P9O1m6k63K64l10L95J1k90j61L62j27J54p7NN32p62j3J13r0kj2L04
7683A03j28J05n0L8j68J66J8J30l86j2K13J68k06q6K00P5k16jJ17o1R9j44j5K
7707c9R3J35k29j98K90m39L95l1J30l00J96P2q9P3K20l68Q0J5r5J33q5J88m9J6
$$ plain form
7731 114 -30 -206 194 -38 44 218 -31 89 119 177 -39 8 60 54 -4 -39 -113 -45 -120 41 101 -130 -156 -145 95
7756 95 -3 -398 -356 -17 -81 -85 255 -111 -20 -285 -107 98 -5 122 31 1 154 -204 -181 67 95 119 -66 -143
7780 -143 -26 80 29 75 -118 -104 185 -19 55 -41 391 80 -27 -173 -313 -223 -113 -118 -44 -54 238 175 -82 -139
7804 -139 -255 -77 -81 -174 -186 -92 -119 22 -36 7 -208 -234 99 -109 -41 -52 -290 -123 -183 113 -47 154 -161 105
7828 105 -98 180 15 -276 25 -233 -10 -74 -8 -215 163 -158 41 203 4 187 62 25 156 -161 -73
7849 -73 -129 38 56 -59 -66 224 41 -169 -171 -268 -105 -28 -145 17 2 -86 -186 -121 73 27 -39 376 -41 98 -145
7874 -145 117 -42 19 -58 2 197 -178 21 -37 -48 152 273 98 41 129 -132 48 130 -17 -173 -64 213 -207
7897 -207 11 191 -85 8 -21 -142 -112 -77 93 -25 -110 88 -8 125 14 4 3 -114 24 141 -66 152 -256
$$ packed form
7731A14j44j76M00k32Q2J74k49J20L0N8k16M7N2on8l5p4O8p5J61O0k31k6J1K40
7756I5r8l95M2L39o4mL40l66R1k65J78K05j03J27r1l0J53l58K3K48K8K4j85p7
7780a43J17J06n1M6j93J4K89k04P4r6M32l11j07j46j40R0J10nP4j0K92o3k57n7
7804a39j16J78mr3j2R4k7J41n8M3k15k6L33k08O8j1k38J67o0K96j60K01l15K66
7828A05k03K78j65k91L01k58K23o4O6k07L78l21J99J62j99J83j25l7J31l17Q8
7849g3n6J67J8j15pK90j83k10kr7J63P7j17J62j5q8j00O5J94m6o6M15m17J39k43
7874a45K62j59O1p7O0J95l75J99n8j1K00J21j75n7Q8k61J80Q2j47j56J09K77m20
7897b07K18J80k76R3k9j21L0L5J70j18q5J98r6J33j11j0jj17J38J17k07K18m08
$$ plain form
7920 -256 -82 -2 -183 9 128 120 -140 71 -71 -314 -188 75 -112 118 174 -324 -215 105 114 98 192 375 185
7943 185 -250 12 114 114 -167 18 -67 -135 -35 -44 -104 242 -144 -171 -51 -138 -25 36 13 78 -217 179 42 196
7967 196 11 71 -19 49 234 -108 20 238 -168 -306 98 -68 116 194 -161 35 4 -11 86 108 -158 189 -160
7990 -160 -118 1 -141 376 194 -27 138 126 163 53 284 31 -161 74 -4 66 -27 64 20 -189 -162 100 30
8013 30 137 -147 -118 362 -173 107 97 -215 -50 -90 93 -163 79 -57 -102 74 -219 -63 15 8 -69 65 106
8036 106 44 -207 317 0 110 58 -71 148 -29 -97 70 -6 -5 -189 202 -99 270 206 -15 194 -47 79
8058 79 -28 -103 -133 115 -83 -2 -228 -279 95 -215 126 73 -178 16 -154 267 -209 -61 -33 199 0 225
8080 225 123 -27 219 136 -83 77 106 -160 161 11 -222 -30 120 193 108 -108 -2 -186 -186 -104 -181 180 -109
$$ packed form
7920b56J74Q0j81J92J19qk60K11j42k43J26K63j87K30N6m98J09L20Rj6R4J83j90
7943A85m35K62J02%k81J85q5o8J00ro0L46l86k7J20q7J13O1k3O5k95L96j37J54
7967A96j85O0r0O8J85l42J28K18m06j38M04j66J84P8l55J96l1j5R7K2k66L47l49
7990a60M2J19j42N17j82k21J65j2L7j10K31k53j92K35p8P0r3R1m4k09K7K62p0
8013C0J07k84K9M80n35K80j0l12J65m0J83k56K42j36m5J76k93J56P8pp7J34M1
8036A06o2k51N24l17J10n2j29K19j77o8J67p6Jj84L91l01L69o4k21K09k41J26
8058G9j07p5l0K48j98Q1k26n1L74l10L41n3k51J94j70M21m76J48K8K32j99K25
8080B25j02j50K46q3k19J60K9k66L21j50k33J92J50P3q5k16J06j84%Q2p7L61k89
$$ plain form
8103 -109 -253 86 -207 -230 66 37 -51 13 93 -66 -169 21 111 39 -216 84 -135 -35 19 -54 -5 122 -258
8126 -258 -89 21 -31 -74 -389 341 -66 64 -55 -89 -151 45 83 -153 -190 67 -178 -148 126 -215 42 -42 -264
8149 -264 -56 -240 122 -76 90 -240 209 27 -153 73 -95 30 34 -26 90 -78 219 -274 10 126 -78
8170 -78 160 25 -58 -390 -114 248 260 137 -22 17 9 -1 -299 -73 -75 -147 106 -162 -118 -323 -8
$$ packed form
8103a09j44L39k93k3K96k9q8O4Q0j59j03J90R0p2k55L00k19J00N4p3M9J27l80
8126b58J69J10n2m3l15P30m07J30j19l4o2J96L8k36l7K57k45L0K74l41K57q4k22
8149b64K08j84L62j98J66l30M49j82j80K26j68J25Mo0J16j68K97m93K84J16k04
8170g8K38j35q3l32K76L62J2j23j59L9qj0k98K26kp2K53k68M4k05L15
8191h
$$ Imaginary data points
##PAGE= N=2
##DATA TABLE= (X++(I..I)), XYDATA
$$ plain form
0 0 0 0 0 0 0 0 0 0 0 0 0 0 0 0 0 0 0 0 0 -8 8 -8 8 -8 8 -16 16 -16 16 -24 24 -32 32 -40 40 -48 56 -62 67 -75
40 -75 84 -94 104 -115 126 -141 155 -171 188 -206 228 -251 276 -305 337 -373 415 -461 515 -579 657
61 657 -752 869 -1023 1235 -1540 2028 -2939 5241 -25670 -38816 -28921 -34781 -10047 -2787 -433
76 -433 2585 4071 4430 11490 363 -2575 10996 9841 -1418 8653 14807 7642 7165 7463 1659
91 1659 2768 -4244 -17674 -14924 -13990 -29564 -30265 -18692 -20389 -21274 -10381 -3845 1766 6331 4775
106 4775 9915 16979 7473 2934 11991 8308 -2190 1544 3442 -1166 182 735 -737 3566 585
121 585 -7998 -5486 -6187 -18295 -21351 -19219 -23595 -25396 -22847 -22309 -16052 -11177 -12792 -5337 6008
136 6008 3704 3518 13706 14813 9808 12576 14343 13312 15031 14481 15820 22278 21212 17569 22448
$$ packed form
0@%%%%%%%%%%%%%%%%%%%qJ6j6J6j6J6k4L2l2L2m0M8n6O4p2Q0q8J04j18J29j42
40g5J59j78J98k19K41k67K96l26L59l94M34m79N27n81O42p10P88q76R76j094J236
61F57j409J621j892K258k775L568m967Q180l0911j3146R895n860K4734P260K354
76d33L018J486L59P060j1127k938J3571j155j1259J0071O154p165m77K98n804
91A659J109p012j3430K750R34j5574p01J1573j697q85J0893O536N611M565j556
106D775N140P064r506m539R057l683j0498L734J898m608J348N53j472M303k981
121E85q583K512p01j2108l056K132m376j801K549N38O257M875j615P455J1345
136F008k304j86J0188J107n005K768J767j031J719n50J339O458j066l643M879
$$ plain form
151 22448 23411 16673 15902 15946 10366 7450 4343 -1313 -1709 -1906 -8722 -8251 -3367 -6168 -8060 -4113 -4216
168 -4216 -6710 -6098 -7307 -7150 -5835 -8578 -8562 -2582 -2969 -5057 1138 4885 3192 6497 10248 9693 10920
185 10920 10774 7867 8519 8471 4191 4074 6341 3431 2370 3949 2450 1152 938 -2357 -2468 -1557 -6153
202 -6153 -8678 -6159 -8730 -12327 -10145 -8364 -9473 -7173 -4764 -3444 -680 -462 -568 2188 2473 116
218 116 1753 3243 1243 1174 2466 869 1321 2487 834 1392 3723 972 -482 849 -828 -3222
234 -3222 -3331 -3454 -3796 -3134 -3871 -2951 -339 -1073 -1515 2248 3250 1735 3973 6228 4438 4325 4910 3628
252 3628 3390 3804 2101 2390 3047 1097 335 386 -1313 -2306 -2762 -4378 -4566 -4169 -6108 -6723 -5129 -6170
270 -6170 -7275 -4898 -3254 -4186 -2393 -536 -419 -171 812 864 2217 2669 2035 3657 4471 3178 3763 4287
$$ packed form
151B2448R63o738p71M4n580k916l107n656l96j97o816M71M884k801j892L947j03
168d216k494O12j209J57J315k743J6N980l87k088O195L747j693L305L751n55J227
185A0920j46k907O52m8m280j17K267k910j061J579j499j298k14l295j11R11m596
202f153k525K519k571l597K182J781j109K300K409J320K764K18j06K756K85k357
218A16J637J490k000o9J292j597M52J166j653N58K331k751j454J331j677k394
234c222j09j23l42O62p37R20K612p34m42L763J002j515K238K255j790j13N85j282
252C628k38M14j703K89O57j950p62N1j699r93m56j616j88L97j939o15J594j041
270f170j105K377J644r32J793J857J17K48R83N2J353M52o34J622Q14j293N85N24
$$ plain form
288 4287 3064 3057 4075 2969 2420 3120 1687 -30 407 -716 -1943 -1388 -1223 -1645 -1395 -1536 -1778 -1184
306 -1184 -1452 -1597 -75 -35 -1135 271 1057 -802 -728 1011 13 72 1101 879 714 1217 330 204 236
325 236 -294 -683 -132 -864 -955 111 -1315 -1770 -583 -803 -1734 -231 453 -682 -125 778 134 -326 403
344 403 448 619 932 965 1195 1357 227 677 1120 -120 146 933 335 -423 383 -207 -1412 -995 -856 -1349
364 -1349 -740 -124 -882 -738 -741 -762 -429 -758 -639 560 614 -263 1096 1030 74 502 1087 575 757 1425 1168
385 1168 617 836 639 317 433 310 390 504 232 91 463 -474 -862 278 -25 -482 267 385 -404 -548
405 -548 -228 -975 -690 -400 -561 -151 -268 -285 -258 -396 -910 -743 -119 -746 -57 401 -411 -478 24 -333 -853
426 -853 -233 614 197 47 552 175 73 107 24 356 410 225 1012 330 -193 297 90 -590 -205 209 -35
$$ packed form
288D287j223pJ018j106n49P00j433j717M37j123j227N55J65m22K50j41k42N94
306a184k68j45J522M0j100J406P86j859P4J739r98N9J029k22j65N03q87j26L2
325B36n30l89N51p32r1J066j426m55J187k20r31J503O84j135N57R03o44m60P29
344D03M5J71L13L3K30J62j130M50M43j240K66P87n98p58Q06n90j205M17J39m93
364a349O09O16p58J44lk1L33l29J19J199N4q77J359o6r56M28N85n12J82O68k57
385A168n51K19j97l22J16j23Q0J14k72j41L72r37l88J140l03m57P49J18p89j44
405e48L20p47K85K90j61M10j17j7K7j38n14J67O24o27O89M58q12o7N02l57n20
426h53O20Q47m17j50N05l77j02L4q3L32N4j85P87o82n23M90k07o80L85M14k44
$$ plain form
447 -35 -192 353 46 -343 -490 207 -87 -110 357 932 826 511 463 381 37 -103 626 85 -316 132 -384 -1217
469 -1217 -1226 -977 -1438 -1428 -1075 -671 -1194 -1193 -996 -1113 -1184 -993 -190 80 -118 264 754 223 506 978 1112 905
491 905 1683 1966 1087 853 1113 602 80 -34 -62 -399 -575 -580 -728 -1307 -1697 -844 -1065 -1793 -885 73 12 10
513 10 1136 757 1072 1374 1684 2220 1718 2316 2232 2118 2165 2378 2125 1182 1584 1967 1802 153 19 -666 -1206
534 -1206 -208 -2466 -2147 -1970 -969 -1136 -1802 -1387 -1110 -982 -420 280 649 864 1089 1627 1654 1161 1244 1547
554 1547 1258 985 1018 898 149 -129 -331 -490 -661 -664 -516 -1141 -1234 -1285 -1328 -1839 -1835 -1305 -1336 -1648 -1136 -577 -907
577 -907 -924 -434 -65 -98 245 586 534 326 597 396 -234 -435 -364 -264 -955 -978 -826 -1445 -1895 -1541 -1720 -1882
599 -1882 -1320 -1241 -1171 -1225 -400 -549 -707 -376 192 166 315 564 908 810 700 800 553 346 529 905 724 208
$$ packed form
447c5j57N45l07l89j47O97k94k3M67N75j06l15m8q2l44j40P29n41m01M48n16q33
469a217rK49m61J0L53M04n23JJ97j17p1J91Q03K70j98L82M90n31K83M72J34k07
491I05P78K83q79k34K60n11n22j14k8l37j76nj48n79l90Q53k21p28R08R58o1k
513A0J126l79L15L02L10N36n02N98q4j14M7K13k53r43M02L83j65j649j34o85n40
534a206R98k258L19J77J001j67o66M15K77J28N62P00L69K15K25N38K7m93Q3L03
554A547k89k73L3j20p49k78k02j59j71lJ48o25r3n1m3n11MN30l1l12N12N59l30
577i07j7M90L69l3L43L41n2k08K71k01o30k01P1J00o91k3J52o19m50L54j79j62
599a882N62P9P0n4Q25j49j58L31N68k6J49K49L44r8j10J00k47k07J83L76j81n16
$$ plain form
621 208 468 350 -346 -22 201 50 87 20 -77 -19 -75 -150 -217 -166 -372 693 252 373 687 368 207 559 819
644 819 561 399 841 897 793 428 297 376 60 123 529 405 320 416 493 203 395 642 1012 761 757 1228 1160
667 1160 592 945 766 197 -82 363 -72 -413 -251 -354 -587 -655 -709 -419 -761 -480 -273 -408 -664 -352 -561
688 -561 -935 -558 33 -415 -196 -9 262 -138 15 222 464 497 418 713 360 -26 57 65 -652 -704 -361 -425 -798
711 -798 -358 -393 -660 -848 -472 -509 -111 305 489 209 83 317 287 53 127 531 225 154 411 332 -129 -277
733 -277 29 -30 -172 18 334 -405 -407 -441 -563 -782 -835 -310 -401 -530 -225 -15 -284 -111 206 344 309 771 1107
756 1107 540 466 738 621 118 409 350 481 431 301 268 75 5 -151 -282 -317 -23 -45 -175 -137 12 -302 -605
779 -605 -146 -8 -67 -247 420 195 -88 -213 0 179 143 135 430 592 -46 444 -11 -137 75 139 -127 -149
$$ packed form
621B08K60j18o96L24K23j51L7o7r7N8n6p5o7N1k06J065m41J21L14l19j61L52K60
644H19k58j62M42N6j04l65j31P9l16O3M06j24q5R6P7k90J92K47L70k51mM71o8
667A160n68L53j79n69k79M45m35l41J62j03k33o8n4K90l42K81K07j35k56L12k09
688e61l74L77N91m48K19J87K71m00J53K07K42L3p9K95l53l86Q3Qp17n2L43o4l73
711g98M40l5k67j88L76l7L98M16J84k80j26K34l0k34P4M04l06p1K57p9m61j48
733b77L06n9j42J90L16p39kl4j22k19n3N25r1j29L05K10k69J73L17J38l5M62L36
756A107n67p4K72j17n03K91n9J31n0j30l3j93p0j56j31l5K94k2j30L8J49l14l03
779f05M59J38n9j80O67k25k83j25K13J79l6qK95J62o38M90m55j26K12O4k66k2
$$ plain form
801 -149 -28 -2 -304 -383 -263 -407 -522 -119 218 -81 -181 -8 -90 -220 -144 285 34 55 94 302 103 -329
823 -329 359 80 -17 364 241 263 -4 121 278 -99 -23 191 21 -58 78 476 -51 -424 -262 -151 -537 -417
845 -417 92 131 -77 -6 64 -137 -415 277 207 94 285 374 -124 -128 62 -44 -239 165 291 -40 158 32 364
868 364 -199 -500 356 -5 -22 76 275 -114 -232 -380 -21 -137 -199 190 65 -66 50 199 -103 -373 -128
889 -128 -256 -190 156 303 224 -308 -188 132 -120 -80 182 188 350 306 323 -146 111 -244 -24 -185 -8 95 -7
912 -7 11 -186 133 -148 -158 75 289 213 22 -19 -268 -309 211 196 -146 262 193 48 -165 -10 0 -220 -42 275
936 275 -50 -12 235 100 172 -178 -5 258 -206 230 171 -133 -125 0 -262 -293 -55 -166 -26 -114 40 45 -224
959 -224 -237 -150 8 -106 -34 391 215 -63 101 -78 -179 -60 198 163 -8 118 -26 -187 -318 -45 116 -401
$$ packed form
801a49J21K6l02p9J20j44j15M03L37k99j00J73q2j30P6M29k51K1L9K08j99m32
823c29O88k79r7L81j23K2k67J25J57l77P6K14j70p9J36L98n27l73J62J11l86J20
845d17N09L9k08P1P0k01k78O92p0j13J91Q9m98mJ90j06j95M04J26l31J98j26L32
868C64n63l01Q56l61j7R8J99l89j18j48L59j16o2L89j25j31J16J49l02k70K45
889a28j28O6L46J47p9n32J20L20k52M0K62OJ62m4J7m69K57l55K20j61J77J03j02
912gJ8j97L19k81j0K33K14p6j91m1k49m1N20j5l42M08o9j45k13J55J0k20J78L17
936B75l25L8K47j35P2l50J73K63m64M36n9l04QJ25k62l1K38j11J40q8J54Nk69
959b24j3Q7J58j14P2M25j76k78J64j79j01J19K58l5j71J26j44j61j31K73J61n17
$$ plain form
981 -401 21 -52 67 -296 -8 -258 -199 -12 168 -144 -116 -58 18 73 -370 64 218 223 143 495 276 -98 146
1004 146 159 -329 -160 32 45 -151 230 16 -97 -577 -147 -76 -225 -121 272 234 19 110 -173 -146 48 69
1026 69 251 179 189 -90 248 -143 -96 116 -26 -219 52 193 62 61 199 53 -239 14 -108 -395 -5 68
1048 68 -289 -388 56 -222 -292 -18 89 283 103 -38 -31 51 -244 116 -109 65 -140 -217 -117 -102 -367 -187 -244
1071 -244 -9 148 198 103 18 75 -133 -350 -233 -293 -61 -26 115 -253 -393 -87 -38 15 -49 69 161 75 267 277
1095 277 -211 -258 -51 -242 -238 81 -23 -394 -336 -25 120 -359 -432 456 191 288 368 283 -33 240 179 58 -99
1118 -99 123 121 -146 -174 -86 -114 97 -27 429 183 119 -100 216 -309 -378 -151 128 125 139 359 -161 -36 95 302
1142 302 138 88 408 285 254 182 375 11 -165 50 182 31 -86 365 96 -131 -12 -140 -150 -54 198 197
$$ packed form
981d01M22p3J19l63K88k50N9J87J80l12K8N8P6N5m43M34J54Nq0L52k19l74K44
1004A46J3m88J69J92J3j96L81k14j13m80M30P1j49J04L93l8k15R1k83K7J94K1
1026F9J82p2J0k79L38l91M7K12j42j93K71J41j31jJ38j46k92K53j22k87L90P3
1048F8l57r9M44k78p0K74J07J94j80j41PQ2k95L60k25J74k05p7J00J5k65J80n7
1071b44K35J57N0r5q5N7k08k17J17o0K32L5J41l68j40L06M9N3o4J18R2q6J92J0
1095B77m88m7K07j91ML19j04l71N8L11J45m79p3Q88k65R7Q0q5l16K73o1j21j57
1118i9K22kk67k8Q8k8K11j24M56k46o4k19L16n25o9K27K79lJ4K20n20J25J31K07
1142C02j64n0L20j23l1p2J93l64j76K15J32j51j17M51k69k27J19j28j0R6K52j
$$ plain form
1164 197 98 216 120 27 -180 247 49 23 -48 25 188 2 136 146 -67 -84 -28 -73 -155 -12 48 -458 -371 -200
1188 -200 -70 75 67 80 -101 -99 22 63 -196 -283 263 66 53 63 -96 -45 66 14 73 -175 17 -31 5 68 -95
1213 -95 -155 -228 -110 -92 -35 16 -166 -57 -146 -202 88 139 82 75 576 -81 40 10 232 67 -61 169 290 -163
1237 -163 -121 174 -75 -94 12 -25 53 55 340 90 47 -240 60 -178 -153 -228 -39 76 -141 48 -16 -122 -50 141
1261 141 280 -10 514 263 -108 -30 208 -75 -258 -232 38 -309 -89 -26 -288 -186 -18 -239 34 176 60
1282 60 80 -150 -96 68 -218 -197 47 -235 122 -9 63 -72 -120 174 -13 173 -25 294 156 57 -186 30
1304 30 -75 -213 -26 -63 -175 25 21 -78 -59 55 -12 -84 5 357 133 40 134 -194 -134 -419 -94 135 -85 -27
1328 -27 185 -2 -85 235 60 62 -142 429 36 -252 13 -281 -137 -263 -92 -141 -145 -23 280 121 76 38 -200
$$ packed form
1164A97r9J18r6r3k07M27j98k6p1P3J63j86J34J0k13j7N6m5q2J43O0n06Q7J71
1188b00J30J45qJ3j81KJ21M1k59q7N46j97j3J0j59N1J11n2N9k48J92m8L6O3j63
1213i5o0p3J18J8N7N1j82J09q9n6K90N1n7pN01o57J21l0K22j65j28K30J21m53
1237a63M2K95k49j9J06l7P8KK85k50m3k87L00k38K5p5J89J15k17J89o4j06P2J91
1261A41J39k90N24k51l71P8K38k83j83K6K70l47K20O3k62J02J68k21K73J42j16
1282F0K0k30N4J64k86K1K44k82L57j31P2j35m8K94j87J86j98L19j38r9k43K16
1304C0j05j38J87l7j12K00mr9J9J14o7p2Q9L52k24r3R4l28O0k85L25K29k20N8
1328b7K12j87q3L20j75Kk04N71l93k88K65k94J44j26J71m9mJ22L03j59m5l8k38
$$ plain form
1351 -200 -203 -116 249 70 -191 -200 128 72 -182 -208 146 -32 26 115 137 -197 114 138 -237 -127 168 272 -182 -28
1375 -28 0 -5 -101 197 76 -57 140 55 -38 -170 -143 -17 45 173 -87 271 118 -92 -10 63 -143 134 156 -394
1399 -394 -64 -47 -50 -238 -236 148 -60 16 64 -121 -36 -64 86 -131 -243 47 -6 -30 -194 251 58 -122 -87 -157
1423 -157 -124 75 181 311 -37 167 -30 -277 113 -6 80 118 110 278 56 -118 -262 -148 16 49 -45 151
1445 151 -141 -150 145 -165 -424 -38 -175 -163 -175 91 177 -381 -124 -263 -133 -220 66 155 129 -40 26 -197 -258
1468 -258 70 83 10 -3 8 79 -33 -10 -182 146 -103 -175 33 -280 142 -25 90 -405 32 -26 -35 77 181
1491 181 75 82 -86 287 12 130 76 159 124 85 -231 -101 -145 -73 66 136 105 92 49 -114 77 -154 67 91
1515 91 -62 81 158 77 -5 -102 -97 -86 15 -124 118 427 90 -155 223 65 76 -89 61 127 185 -97 74 62
$$ packed form
1351b00lQ7L65j79k61rL28n6k54k6L54j78N8Q9K2l34L11K4l75J10K95J04m54J54
1375b8K8nr6K98j21j33J97q5r3j32K7J26O2J28k60L58j53k10Q2P3k06K77K2n50
1399c94L30J7lj88KL84k08P6M8j85Q5k8J50k17j12K90n3k4j64M45j93j80L5p0
1423a57L3J99J06J30l48K04j97k47L90j19Q6L8qJ68k22j74j44J14J64L3r4J96
1445A51k92rK95l10k59L86j37J2j2K66Q6n58K57j39J30q7K86Q9k6j69O6k23o1
1468b58L28J3p3j3J1P1j12K3j72L28k49p2K08l13M22j67J15m95M37n8rJ12J04
1491A81j06Pj68L73k75J18n4Q3l5l9l16J30m4P2J39P0l1j3m3j63J91k31K21K4
1515I1j53J43P7q1q2r7NJ1J01j39K42L09l37k45L78j58J1j65J50O6N8k82J71j2
$$ plain form
1539 62 -273 15 11 -407 47 172 -30 168 -282 -300 -154 -202 200 -36 -31 118 213 -206 -39 123 -24 98 -152
1562 -152 116 115 120 -177 83 215 11 -4 -54 120 156 146 53 -253 18 -17 14 -41 173 -73 94 129 -176 79
1586 79 -289 36 22 57 -127 -214 129 -69 81 -31 37 -355 126 -6 44 205 -27 -251 -85 -62 -32 25 -208
1609 -208 -235 -4 -106 -57 31 -13 -64 -163 -126 -57 -67 -59 -98 -301 -57 136 195 -13 124 -62 -91 32 -45 -2 -80 213
1635 213 186 136 -76 76 -25 -133 -230 4 68 6 179 -15 -330 -115 44 91 66 128 260 68 -147 -207 -112
1658 -112 -77 -70 -1 -45 54 21 -5 -88 -56 84 -1 216 279 74 34 -140 184 -29 -85 63 17 -267 222 -211 -145
1683 -145 -237 132 -110 -180 37 30 37 -79 -154 177 -12 -86 -49 100 8 -220 -117 126 -50 -129 137 -132 -77 -42
1707 -42 68 -249 119 172 110 -175 -24 129 -101 48 -144 55 -73 -230 -60 -8 183 -129 27 189 76
$$ packed form
1539F2l35K88mm18M54J25k02J98m50j8J46m8M02k36NJ49R5m19J67J62j47J22k50
1562a52K68jNk97K60J32k04j5n0J74L6j0r3l06K71l5L1n5K14k46J67L5l05K55
1586G9l68L25j4L5j84q7L43j98J50j12O8l92M81j32N0J61k32k24J66K3L0N7k33
1609b08k7K31j02M9Q8m4n1r9L7O9j0Ql9k03K44J93N9k08J37j86k9J23p7M3p8K93
1635B13k7n0k12J52j01j08r7K34O4o2J73j94l15K15J59M7k5O2J32j92k15o0R5
1658a12L5PO9m4R9l3k6q3L2J40q5K17O3k05m0j74L24k13n6J48m6k84M89m33O6
1683a45r2L69k42p0K17pPj16p5L31j89p4L7J49r2k28J03K43j76p9K66k69N5L5
1707d2J10l17L68N3o2k85J51J53k30J49j92J99j28j57J70N2J91l12J56J62j13
$$ plain form
1728 76 -38 21 -34 35 211 53 58 -47 119 147 -138 -224 231 -65 164 53 -95 78 222 -23 -57 -162 55
1751 55 -28 58 105 34 -432 -5 28 -9 114 -167 106 49 -61 -237 -110 64 -137 134 41 133 207 163 -295 -105
1775 -105 -177 -183 -198 -21 64 -82 165 36 131 -171 -140 -71 -92 -204 54 -363 197 6 -129 -68 -150 30 -29 122
1799 122 181 355 -91 -166 -259 -69 -27 27 230 -91 -72 -273 102 -206 -44 -15 -86 -103 143 -31 159 85 487
1822 487 127 225 -113 36 -115 -135 45 161 -70 138 -75 -158 0 230 133 233 108 149 -6 -9 -82 388 -142
1845 -142 66 -269 2 60 -240 -233 230 76 -161 -177 -42 -315 38 83 64 58 195 -162 -80 24 92 -126 -217 276
1869 276 77 -91 -101 119 -194 23 -2 211 281 122 253 -45 -251 172 39 2 -60 -144 -150 101 95 121 -39 -137
1893 -137 70 -166 64 108 133 472 14 -154 -115 -10 -22 195 -38 4 557 -259 103 61 -327 -138 -185 67
$$ packed form
1728G6j14N9n5O9J76j58Nj05J66K8k85q6M55k96K29j11j48J73J44k45l4j05K17
1751E5q3Q6M7p1m66M27L3l7J23k81K73n7j10j76J27J74k01K71r3R2P4m4m58J90
1775a05p2oj5J77Q5j46K47j29R5l02L1O9k1j12K58m17N60j91j35O1q2J80n9J51
1799A22N9J74m46p5r3J90M2N4K03l21J9k01L75l08J62K9p1j7K46j74J90p4M02
1822D87l60R8l38J49j51k0J80J16k31K08k13q3J58K30r7J00j25M1j55lp3M70n30
1845a42K08l35K71N8l00PM63j54k37j6J35k73L53M5j9oJ37l57Q2J04O8k18r1M93
1869B76j99j68j0K20l13K17k5K13P0j59J31k98k06M23j33l7o2q4oK51oK6j60r8
1893a37K07k36K30M4K5L39m58j68L9J05j2K17k33M2N53q16L62m2l88J89m7K52
$$ plain form
1915 67 -33 271 164 219 50 113 144 -68 -144 272 37 -86 259 5 -120 -104 -102 -166 24 3 116 -41 53 -146
1939 -146 -119 71 371 98 -180 28 103 -155 36 -63 -248 41 3 226 182 -196 258 -203 -301 36 -122 104
1961 104 -129 113 -15 -24 -203 175 -24 -66 261 -138 1 -93 -162 46 -121 6 -132 45 -224 -172 -44 -210
1983 -210 -59 -74 -167 -207 233 170 -50 62 48 205 -39 -120 101 80 10 78 -191 -247 -89 61 -58 -61 -1 108
2007 108 28 -1 59 -244 -16 -8 92 -14 -222 -118 -193 13 -73 -56 -194 -15 58 -312 -217 92 212 -92 -232
2030 -232 -18 110 179 301 27 -26 169 179 132 84 64 155 253 -182 -50 12 -139 -97 -127 21 -162 -185 -114 95
2054 95 139 2 112 5 -245 -120 145 -84 -341 133 97 136 -58 -23 58 167 196 100 311 -133 -70 236 53
2077 53 -120 230 53 -18 89 90 80 -138 -161 149 143 293 -2 142 -108 136 182 -129 111 -168 130 -53 -139
$$ packed form
1915F7j00L04j07N5j69O3L1k12p6M16k35j23L45k54j25J6Ko4J90k1J13j57R4j99
1939a46K7J90L00k73k78K08P5k58J91r9j85K89l8K23m4l78M54m61r8L37j58K26
1961A04k33K42j28rj79L78j99m2L27l99J39r4o9K08j67J27j38J77k69N2J28j66
1983b10J51j5r3m0M40o3k20J12j4J57k44q1K21k1p0O8k69n6J58J50j19lO0J09
2007A08q0k9O0l03K28QJ00j06k08J04p5K06q6J7j38J79P3l70R5L09J20l04j40
2030b32K14J28O9J22k74n3J95J0m7m8k0R1R8m35J32O2j51M2l0J48j83k3P1K09
2054I5M4j37J10j07k50J25K65k29k57M74l6L9j94L5Q1J09K9r6K11m44O3L06j83
2077E3j73L50j77p1J07Jj0k18k3L10oJ50k95J44k50K44M6l11K40k79K98j83q6
$$ plain form
2100 -139 277 -53 -54 11 10 41 -104 53 -127 111 30 136 270 83 -8 -31 -150 140 181 -288 -158 -12 140
2123 140 -75 -106 121 -131 -203 220 -152 15 -7 193 196 -38 189 -159 -11 -313 -151 88 240 -102 -34 -1
2145 -1 -122 -30 129 31 97 407 41 64 -34 48 209 -19 136 50 315 99 -38 39 -170 171 -60 -51 -100 173
2169 173 -150 75 -18 203 -120 135 111 -92 140 32 -53 -101 115 -42 -196 -341 -270 18 -44 132 -191 -184 264
2192 264 39 -123 58 134 -60 334 -107 -35 64 49 -11 37 -66 -22 194 -201 -212 -67 -8 -73 88 -192 13
2215 13 170 11 -31 58 206 190 -40 -12 -55 24 228 -21 -103 -58 -82 109 -74 146 13 -193 -258 36 -184 41
2239 41 97 -64 -152 167 -44 -72 112 -16 -10 110 -67 65 62 -51 55 -87 -153 -194 -332 -60 -15 103 -44 -20
2263 -20 172 16 -78 49 2 24 -52 151 213 43 18 -80 -57 -237 -11 -63 -227 -24 34 75 73 44 -40 259 -139
$$ packed form
2100a39M16l30jO5jL1j45J57j80K38q1J06J34j87r1k3j19K90M1m69J30J46J52
2123A40k15l1K27k52p2M23l72J67k2K00Lk34K27l48J48l02J62K39J52l42O8L3
2145aj21R2J59r8O6L10l66K3r8Q2J61k28J55q6K65k16j37P7k09L41k31Rm9K73
2169A73l23K25r3K21l23K55k4k03K32j08q5m8K16j57j54j45P1K88o2J76l23PM48
2192B64k25j62J81P6j94L94m41P2R9j5o0M8j03M4K16l95j1J45N9o5J61k80K05
2215A3J57j59m2Q9J48j6k30K8m3P9K04k49q2M5k4J91j83K20j33k06o5K94k20K25
2239D1N6j61q8L19k11k8J84j28OJ20j77J32lj13J06j42o6m1j38K72M5J18j47K4
2263b0J92j56r4J27m7K2p6K03O2j70k5r8K3j80K26n2j64K03N8M1kk9q4K99l98
$$ plain form
2288 -139 -57 -145 -2 -10 -232 212 13 -69 128 -96 114 83 -190 -60 -74 -133 25 -140 -125 -49 28 44 44 122 -121
2313 -121 126 62 -158 -95 28 -2 67 -56 201 -65 111 63 -114 41 220 81 -227 127 -168 -149 -202 189
2335 189 -38 -49 -253 16 114 -67 130 180 42 -9 -224 101 -147 -34 -118 26 -17 49 -52 -84 -4 -46 115
2358 115 -52 321 -77 -4 -9 90 8 -343 -37 -41 -21 -73 102 -77 -58 -22 -322 -106 3 165 -108 -302 -18 -141
2382 -141 140 -189 -64 171 -13 243 -158 48 -197 -190 90 -70 -3 49 -112 10 37 107 -7 -57 -278 81
2404 81 237 -57 -78 -96 -37 -226 -167 -186 -198 427 114 205 12 37 -110 137 -125 -29 102 199 121 -164 7 -65
2428 -65 -125 94 -60 101 5 49 -143 16 85 14 194 128 -63 71 327 -106 46 204 -222 19 30 -58 125
2451 125 101 -106 -178 163 -311 -215 102 249 48 -48 181 49 -266 213 -200 190 132 -26 9 -98 49 -290
$$ packed form
2288a39Q2q8J43qk22M44j99q2J97k24K10l1k73J30j4n9J58j65J5P6P7J6%P8k43
2313a21K47o4k20O3J23l0O9j23K57k66J76m8j77J55J79j39l08L54k95J9n3L91
2335A89k27j1k04K69R8j81J97N0j38n1k15L25k48J13q4J44m3O6j01l2Q0m2J61
2358A15j67L73l98P3nR9q2l51L06mK0n2J75j79J9L6l00K16J09J62k73j94K84j23
2382a41K81l29J25K35j84K56m01K06k45PK80j60O7N2j61J22K7P0j14n0k21L59
2404H1J56k94k1j8N9j89N9j9j2O25l13R1j93K5j47K47k62R6J31R7p8k85J71p2
2428f5o0K19j54J61r6M4j92J59O9p1J80o6j91J34K56m33J52J58m26K41J1q8J83
2451A25k4k07p2L41m74R6L17J47k01r6K29j32l15M79m13L90n8j58L5j07J47l39
$$ plain form
2473 -290 111 205 49 -159 151 -58 -1 -200 -33 22 -266 -95 -35 -7 317 89 198 193 148 273 40 298 73
2496 73 -30 96 -91 149 106 -107 3 -146 -211 -173 -33 24 41 176 168 245 81 24 46 -114 176 -165 20 -38
2520 -38 46 59 109 45 87 118 -107 96 -147 -28 44 226 -47 258 154 174 -32 -304 11 -112 97 -52 -96
2543 -96 220 153 145 186 -87 51 40 124 141 -333 142 185 -7 136 259 260 -157 170 86 64 -213 -39 -69 143 33
2568 33 362 -107 163 30 57 -187 -156 150 -109 29 -24 94 -113 13 157 -59 126 58 288 -176 -56 90
2590 90 39 -93 -173 156 59 -188 148 61 -77 -121 -7 128 13 77 472 -159 -221 51 381 -59 -161 248 -293
2613 -293 -140 -32 214 -92 125 -112 43 46 -42 89 90 -141 30 -191 -113 34 88 68 -88 90 268 227 -49
2636 -49 -24 59 -156 -13 -139 -222 100 -261 -335 16 -82 175 98 -76 -44 -24 -66 -10 4 247 -153 129 -30 68
$$ packed form
2473b90M01R4j56k08L10k09N7j99J67N5k88J71O0K8L24k28J09nm5J25k33K58k25
2496G3j03J26j87K40m3k13J10j49o5L8J40N7J7J35qP7j64n7K2j60K90l41J85n8
2520c8Q4J3N0o4M2L1k25K03k43J19P2J82k73L05j04K0k06k72L15j23K09j49m4
2543i6L16o7qM1k73J38j1Q4J7m74M75M3j92J43J23Jm17L27q4k2k77J74l0K12j10
2568C3L29m69K70j33K7k44L1L06k59J38n3J18k07J26J44k16J85o8K30m64J20J46
2590I0n1j32q0L29r7k47L36q7j38m4J14J35j15O4L95o31o2K72L30m40j02M09n41
2613b93J53J08K46l06K17k37J55Lq8J31Jk31J71k21P8J47N4k0j56J78J78m1k76
2636d9K5Q3k15J43j26q3L22l61p4L51r8K57p7j74L2K0m2N6J4K43m00K82j59R8
$$ plain form
2660 68 -1 -349 25 68 -20 -3 15 -157 -4 -49 5 -272 -22 120 -98 -147 -340 107 106 94 34 37 -156 45 311
2685 311 -69 135 155 82 -60 -196 203 71 80 103 38 -9 143 -240 131 -231 14 13 59 125 -109 -1 -1 -149
2709 -149 264 68 -60 -73 -53 -59 36 134 -74 281 -2 60 -125 -160 216 66 -152 120 -36 -348 221 -135 31
2732 31 79 -327 18 -13 95 20 188 21 -225 -51 -135 43 -6 -56 48 102 -62 -294 -45 132 -4 100 -147
2755 -147 -35 23 -53 -480 -1 127 -108 -86 -8 109 32 54 7 93 316 11 -113 -47 -106 86 -64 11 126 -124
2779 -124 -35 -3 14 192 90 73 82 102 45 -42 299 -247 -34 -16 143 -147 -68 348 -15 -4 -68 253 23 79 137
2804 137 263 1 -80 -98 77 -43 -309 17 7 -63 44 -53 165 126 157 27 -115 -48 -231 -165 -171 -117 56 116
2828 116 246 106 13 100 161 262 -241 -35 -155 95 -199 64 -128 -91 189 -11 -129 -114 -86 23 114 65 60
$$ packed form
2660F8o9l48L74M3q8J7J8j72J53m5N4k77K50J42k18m9j93M47jj2o0Lj93K01K66
2685C11l80K04K0p3j42j36L99j32RK3o5m7J52l83L71l62K45jM6O6k34J08%j48
2709a49M13j96j28j3K0oR5R8k08L55k83O2j85l5L76j50k18K72j56l12N69l56J66
2732C1M8m06L45l1J08p5J68j67k46J74q4J78m9n0J04N4j64k32K49J77j36J04k47
2755a47J12N8p6m27M79J28k35K2P8J17p7K2m7Q6K23l05j24O6n9J92j50P5J15k50
2779a24Q9L2J7J78j02j7RK0n7q7L41n46K13J8J59k90P9M16l63J1o4L21k30N6N8
2804A37J26k62q1j8J75j20k66L26j0p0J07r7K18l9L1j30j42O7j83O6oN4J73O0
2828A16J30j40r3Q7O1J01n03K06j20K50k94K63j92L7K80k00j18J5K8J09R1m9n
$$ plain form
2851 60 -80 121 -125 55 191 -27 -190 1 70 74 103 -68 -279 -51 35 -49 -132 163 199 77 180 96 -17
2874 -17 -54 18 72 168 -61 25 -303 -146 -211 -18 -201 160 -105 -36 -198 170 181 -197 -77 164 -41 84 -35
2897 -35 50 38 121 54 -280 47 7 -10 -172 -58 -402 53 -203 221 97 33 -192 98 92 -200 71 101 359 69
2921 69 76 81 -29 84 10 -131 88 251 -78 174 17 174 -78 -128 -40 -20 -47 82 101 113 11 7 52 108 176 -67
2947 -67 127 132 51 52 127 -44 -16 -77 -41 198 -143 47 -23 32 -6 9 47 -6 -316 160 -24 -225 186 62 85 81
2973 81 -28 -96 70 284 212 -196 -64 -23 134 186 89 -76 -194 34 -112 -23 -72 -21 -169 62 166 190 -105
2996 -105 43 188 -92 -104 -52 -183 165 -165 -118 28 -357 -37 -149 414 -347 148 -88 39 148 184 5
3017 5 -160 -55 -271 -45 -158 149 -55 -155 -117 -126 21 -272 48 242 -30 -94 118 138 73 59 17 37 133 296
$$ packed form
2851F0j40K01k46J80J36k18j63J91O9MK9j71k11K28Q6q4q3K95L6j22J03q4j13
2874a7l7P2N4R6k29Q6l28J57o5J93j83L61k65O9j62L68J1l78J20K41k05J25j19
2897c5Q5j2Q3o7l34L27m0j7j62J14l44M55k56M24j24o4k25K90ok92K71L0K58k90
2921F9PNj10J13p4j41K19J63l29K52j57J57k52n0Q8K0k7J29J9J2j02mM5N6O8k43
2947f7J94Nq1JP5j71K8o1L6K39l41J90p0N5l8J5L8n3l10M76j84k01M11j24K3m
2973H1j09o8J66K14p2m08J32M1J57N2r7j65j18K28j46Q9m9N1j48K31J04K4k95
2996a05J48J45k80j2N2j31L48l30M7J46l85L20j12N63p61M95k36J27J09L6j79
3017Ej65J05k16K26j13L07k04j00L8rJ47k93L20J94k72o4K12K0o5j4m2K0R6J63
$$ plain form
3041 296 315 126 59 130 32 187 -182 77 115 171 -110 3 244 187 182 184 -10 63 42 -94 137 161 48 132 -55
3066 -55 88 107 -100 -3 65 185 254 70 174 45 -80 94 -26 13 209 -117 -114 -80 -12 207 61 29 -23 -226
3090 -226 163 42 -179 178 -92 -32 -77 -27 -85 158 -32 269 167 -84 -61 23 117 59 -238 85 -47 -120 -12
3113 -12 -230 250 188 113 131 -278 102 -79 -115 189 132 118 27 -17 28 53 -197 -204 -5 -22 15 19 -39 -85 174 118 -101
3140 -101 -52 -92 -28 145 40 3 65 23 -124 -57 33 145 6 -58 140 -163 5 -60 24 0 -290 60 3 235
3164 235 273 -233 -51 49 -57 -89 -304 -130 161 202 -52 55 96 366 12 -140 -206 112 -8 230 274 186
3186 186 -223 -65 -45 16 51 -38 -91 18 290 34 44 -24 -24 8 -18 39 -11 43 90 133 -106 268 74 -245 -159 -64
3212 -64 149 348 16 116 -25 -96 -34 -169 197 -213 -167 -202 -13 229 254 -147 128 -96 -267 198 61 -129
$$ packed form
3041B96J9j89o7P1r8J55l69K59L8N6k81J13K41n7nKj94P3k1j36K31K4j13Q4j87
3066e5J43J9k07R7O8J20O9j84J04j29j25J74j20L9J96l26LL4O8K19j46l2n2k03
3090b26L89j21k21L57k70O0m5N0n8K43j90L01j02k51K3Q4R4n8k97L23j32p3J08
3113a2k18M80o2p5J8m09L80j81l6L04n7j4r1m4M5K5k50pJ99j7L7Mn8m6K59n6k19
3140a01M9m0O4J73j05l7O2m2j47O7R0J12j39o4J98l03J68o5Q4k4k90L50n7K32
3164B35L8n06J82J00j06l2k15J74K91M1k54J07M1K70l54j52o6L18j20K38M4q8
3186A86m09J58K0O1L5q9n3J09K72k56J0o8%L2k6N7n0N4M7M3k39L74j94l19Q6R5
3212f4K13J99l32J00j41p1O2j35L66m10M6l5J89K42K5m01K75k24j71M65j37j90
$$ plain form
3234 -129 -7 87 115 104 -45 -174 -183 -6 220 -192 -19 -67 -131 -24 260 -36 -21 -267 102 43 256 6 39
3257 39 95 -55 -47 26 308 -37 -50 -164 112 -130 -39 5 64 136 -3 -141 -153 -16 70 -257 -261 -200 217 70 -183
3282 -183 52 96 -73 159 -127 24 -4 -62 -74 123 -66 137 473 -173 17 -89 -218 -56 185 -133 257
3303 257 -49 172 78 224 150 -103 -172 79 83 80 102 97 19 41 -256 119 -29 2 -2 -43 -96 45 83 41 -65 19 -243
3330 -243 -40 69 27 -3 -163 -4 60 162 -109 136 58 222 64 -106 -98 8 -81 135 -37 -44 -77 -130 38 -122
3354 -122 59 91 -21 39 -45 -93 151 215 -126 -31 -159 -11 142 3 -277 -209 45 -334 13 -12 -67 21 -82
3377 -82 133 51 54 265 -199 92 100 -76 263 -148 77 -123 29 -30 167 -9 -27 -61 -89 122 16 107 -43 33
3401 33 -275 -286 97 156 -80 -4 135 -257 59 -109 -198 195 -292 -134 12 77 -99 -113 -194 -169 63 -164 190
$$ packed form
3234a29J22R4K8j1j49j29rJ77K26m12J73m8o4J07K84k96J5k46L69n9K13k50L3
3257C9N6j50QP3K82l45j3j14K76k42R1M4N9P2j39j38j2J37Q6l27mO1M17j47k53
3282a83K35M4j69K32k86J51k8n8j2J97j89K03L36o46J90j06j29J62K41l18L90
3303B57l06K21r4J46p4k53o9K51MlK2np8K2k97L75j48L1mm1n3J41L8m2j06Q4k62
3330b43K03J09m2l0j60J59O4J02k71K45p8J64j58j70QJ06q9K16j72pl3n3J68j60
3354a22J81L2j12O0q4m8K44O4l41R5j28J48J53j39k80O8K54l79L47k5n5Q8j03
3377h2K15q2LK11m64K91Qj76L39m11K25k00J52n9J97j76j8l4k8K11j06R1j50P6
3401C3l08j1L83N9k36P6J39l92L16j68q9L93m87J58J46O5j76j4q1K5K32k27L54
$$ plain form
3424 190 45 -81 86 -72 -40 256 95 193 191 -135 166 -171 -32 -94 -140 74 23 169 265 -150 -73 -218 -95
3447 -95 -86 -33 -82 -50 -85 126 156 -42 -40 -33 -43 161 -188 -99 -342 -18 71 203 49 50 -27 -42 74 -262 2 187
3473 187 -26 -162 -101 -82 -92 -187 53 -54 75 -352 3 -39 16 62 60 212 -47 -12 91 144 136 -300 36 -153
3497 -153 105 -160 -189 -187 -139 131 -100 -245 -36 73 47 216 -102 -350 73 -300 -105 -50 -69 168 42 -187
3519 -187 244 150 80 6 -44 38 31 116 -71 -104 200 -89 -93 152 3 61 -159 65 242 85 -160 -78 127 143 -87
3544 -87 77 42 -20 90 44 -38 -91 -284 123 -162 -76 -53 -33 147 39 8 -235 -50 -39 86 -124 -78 188 121
3568 121 16 -107 165 9 -125 162 67 61 -105 -32 14 311 278 -29 -201 287 149 -116 295 -53 229 -90
3590 -90 98 111 -107 100 24 -207 -103 -99 17 104 172 198 -71 -101 -74 133 42 -263 38 307 -110 108 -103 148
$$ packed form
3424A90j45j26J67j58L2K96j61R8kl26L01l37J39o2m6K14n1J46R6m15P7j45J23
3447i5RN3m9L2l5K11L0j98KPj0K04l49Q9k43L24Q9J32j54Jp7j5J16l36K64J85
3473A87k13j36O1J9j0r5K40j07J29m27L55m2N5M6kJ52k59L5J03N3qm36L36j89
3497a53K58k65k9KM8K70k31j45K09J09k6J69l18k48M23l73J95N5j9K37j26k29
3519a87M31r4p0p4n0Q2pQ5j87l3L04k89mK45j49N8k20K24J77j57k45Q2K05J6k30
3544h7J64l5o2J10m6q2n3j93M07k85Q6K3K0J80j08l1k43J85J1J25k10M6K66o7
3568A21j05j23K72j56j34K87r5oj66P3M6K97l3l07j72M88j38k65M11l48K82l19
3590i0J88J3k18K07p6k31J04MJ16Q7O8K6k69l0K7K07r1l05L01K69m17K18k11K51
$$ plain form
3614 148 106 -88 -22 -11 162 -174 37 71 108 -104 55 86 -235 -42 172 319 -139 57 204 223 144 -147 51
3637 51 75 29 -297 3 4 65 157 120 -281 -8 -201 27 -233 -26 -94 -173 200 -142 112 -105 174 -73 -49 -52
3661 -52 -66 -144 84 193 195 -9 113 169 129 -228 -14 82 -256 -150 43 -260 156 8 -236 129 -58 10 -189
3684 -189 -204 -4 -246 -131 75 23 -38 -119 -206 -12 -13 167 -237 -201 93 -30 6 19 -38 47 -54 139 36 -75
3708 -75 -110 -74 -151 -3 230 -122 -36 -29 189 -27 49 33 -11 -248 94 165 209 -20 -264 48 -97 101 0 95
3732 95 389 160 145 10 45 103 -165 84 -182 -126 228 186 -89 204 -272 -36 -101 -26 67 -255 -46 -139 -50 -18
3756 -18 -73 53 15 -69 -17 203 3 -66 -40 -388 64 22 93 132 195 122 308 182 122 -163 -108 -38 153 -132 220
3781 220 14 156 -3 -4 -134 37 347 -68 -78 80 -151 -206 304 162 9 37 -25 -75 80 180 375 -176
$$ packed form
3614A48m2j94O6J1J73l36K11L4L7k12J59L1l21J93K14J47m58J96J47J9p9k91J98
3637E1K4m6l26L00JO1R2l7m01K73j93K28k60K07o8p9L73l42K54k17K79k47K4l
3661e2j4p8K28J09Kk04J22N6m0l57K14R6l38J06J93l03M16j48k44L65j87O8j99
3684a89j5K00k42J15K06n2o1q1q7J94jJ80m04L6K94j23L6J3n7Q5j01J93j03j11
3708g5l5L6p7J48K33l52Q6PK18k16P6j6m4k37L42P1M4k29k44L12j45J98j01R5
3732I5K94k29j5j35L5N8k68K49k66N6L54m2k75K93m76K36o5P5R3l22K09r3Q9L2
3756a8n5J26l8q4N2K20k00o9K6l48M52m2P1L9O3p3J86j26o0k85N5P0J91k85L52
3781B20k06J42j59jj30J71L10m15j0J58k31n5N10j42j53K8o2n0J55J00J95n51
$$ plain form
3803 -176 -105 -143 129 28 19 43 20 -290 -89 -83 237 -181 97 227 176 75 21 -202 -203 47 79 -74 -197 147
3827 147 -34 189 -48 -72 -193 -102 -51 -69 23 -176 -159 -102 111 -3 48 9 -74 2 -5 -138 -52 -50 -113 -65 7 -114
3853 -114 151 11 106 19 -30 -234 -222 17 -36 -119 -58 -101 -105 -70 4 237 -138 153 -196 -106 11 -150 -50 48 85
3878 85 -138 -12 37 -68 101 0 122 12 -93 53 -89 51 136 79 191 -147 14 -61 -28 53 -39 58 5
3901 5 43 -47 -85 -82 105 40 71 18 130 154 -159 139 32 0 -235 -145 -89 17 30 -29 225 105 299 57 24 -146
3927 -146 -52 27 99 -83 114 87 37 28 -73 -146 -84 62 77 -11 88 -25 -270 257 -189 23 35 -62 210 46 99
3952 99 92 76 152 -3 128 151 61 -179 -109 62 -120 -56 92 -295 -85 -8 -57 -53 2 -192 -140 -322 206 59 -19
3977 -19 19 -141 168 25 174 -213 -41 55 138 -157 -34 61 201 -220 -155 63 -75 150 -53 48 -103 108
$$ packed form
3803a76P1l8K72j01rK4k3l10K01OL20m18K78J30n1j01n4k23jK50L2j53j23L44
3827A47j81K23k37k4j21R1N1j8R2j99J7N7K13j14N1l9q3P6pj33Q6Ko3M8P2j21
3853a14K65j40R5q7m9k04J2K39n3q3O1m3mL5P4K33l75K91l49R0J17j61J00R8L7
3878H5k23J26M9j05J69j01J22j10j05J46j42J40Q5n7J12l38J61p5L3Q1r2R7n3
3901EL8r0l8LJ87o5L1n3J12K4l13K98j07l2k35R0N6J06J3n9K54j20J94k42l3j70
3927a46R4P9P2j82J97k7n0rj01p3O2J46J5q8R9j13k45N27m46K12J2r7K72j64N3
3952I9pj6P6j55J31K3r0k40P0J71j82O4J48l87K10P7m9MN5j94N2j82N28j47p8
3977a9L8j60L09j43J49l87J72R6Q3k95J23R5J40m21O5K18j38K25k03J01j51K11
$$ plain form
3999 108 0 -137 -20 12 -187 -8 93 21 -29 -185 -257 -154 97 -118 -76 -79 24 -38 182 -34 -142 -177 -191
4022 -191 -160 -3 -5 4 -183 -73 -204 111 152 76 37 -193 -79 113 230 -66 -70 -194 45 76 20 -265 248 -180
4046 -180 129 -25 31 -5 -132 49 -65 254 299 -96 -78 166 18 -98 -20 218 201 120 101 38 -86 156 -214
4069 -214 -5 -26 -73 167 -197 -80 199 88 42 -24 155 -94 58 -22 -93 -55 204 -146 220 -208 -22 188
4091 188 251 33 -141 79 31 321 51 -76 -147 -239 140 14 -84 -24 28 35 -30 -86 25 8 -186 20 -177 -95
4115 -95 -30 -27 35 -55 268 -138 174 61 76 33 -188 94 139 27 -53 76 -96 -130 -203 103 161 160 -298 -71 -1
4140 -1 50 -2 -264 46 -37 290 -107 102 37 -143 -11 -26 123 65 -21 -119 -91 -68 -20 205 36 56 -282 -89 -80
4165 -80 -3 274 134 14 -54 302 -230 102 36 -55 174 -28 77 52 -1 -270 573 123 152 -95 -187 22 -50
$$ packed form
3999A08j08j37J17L2j99J79J01p2n0j56p2J03K51k15M2lJ03o2K20k16j08l5j4
4022a91L1J57kRj87J10j31L15M1p6l9k30J14J92J17k96mj24K39L1n6k85N13m28
4046a80L09j54N6l6j27J81j14L19M5l95J8K44j48j16P8K38j7q1j9o3j24K42l70
4069b14K09k1m7K40l64J17K79j11m6o6J79k49J52q0p1L8K59l50L66m28J86K10
4091A88O3k18j74K20m8K90k70j27p1r2L79j26r8O0N2Po5n6J11j7j94K06j97Q2
4115i5O5LO2r0L23m06L12j13J5m3k21K82M5j12q0J29j72l4p3L06N8jm58K27P0
4140aN1n2k62L10q3L27l97K09o5j80J32j5J49n8q6r8K8K3M8K25j69K0l38J93R
4165h0P7K77j40j20o8L56n32L32o6r1K29k02J05k5n3k69Q43m50K9k47r2K09p2
$$ plain form
4188 -50 10 271 225 65 36 3 -127 -9 25 46 334 -19 58 124 -19 -190 -96 59 -40 131 161 -24 -36 95
4212 95 -30 -44 -115 9 34 92 11 -250 -114 364 1 38 79 81 -92 -82 -252 -77 -25 194 142 63 -143 -3 73
4237 73 -63 23 221 251 -26 -179 -166 -167 -90 -25 -33 -37 -77 -149 -41 185 -46 -185 -12 297 -25 130 -233 -122 188
4262 188 64 -394 -99 -28 10 -160 66 21 -209 212 133 -124 123 -24 77 -302 108 67 -201 38 -179 -89
4284 -89 -23 -350 -147 156 338 -120 -386 191 -31 163 -24 -125 -17 172 170 -199 -125 99 140 -73 4 -201
4306 -201 -70 22 65 -220 -197 38 -213 152 162 50 -57 -96 -91 -166 235 15 109 62 -361 89 177 -122 -31 -56
4330 -56 -60 -111 -146 56 -17 151 169 -14 139 4 75 31 136 411 -247 72 61 -29 -225 -52 157 168 -311 -60
4354 -60 -28 -220 -29 5 -135 -57 158 -249 120 204 -183 147 -83 162 -174 68 -140 333 273 87 213 -60
$$ packed form
4188e0O0K61m6j60k9l3j30J18L4K1K88l53P7O6j43j71R4J55r9J71L0j85j2J31
4212I5j25j4p1J24K5N8q1k61J36M78l63L7M1Kj73J0j70J75N2K19n2p9k06J40P6
4237G3j36Q6J98L0k77j53J3jP7O5qmm0p2J08K26k31j39J73L09l22J55l63J11L10
4262A88j24m58K95P1L8j70K26m5k30M21p9k57K47j47J01l79M10m1k68K39k17R0
4284h9O6l27K03L03J82m58k66N77k22J94j87j01J08J89kl69P4K24M1k13P7k05
4306b01J31R2M3k85K3K35k51L65J0j12j07l9Np5M01k20R4m7m23M50Q8k99R1k5
4330e6mn1l5K02p3J68J8j83J53j35P1m4J05K75o58L19j1r0j96J73K09J1m79K51
4354f0L2j92J91L4j40P8K15m07L69Q4l87L30k30K45l36K42k08M73o0j86J26k73
$$ plain form
4376 -60 69 -137 -87 0 -7 -126 -226 80 11 198 146 -293 -121 -108 15 -3 273 62 -109 16 -152 -111 139
4399 139 -9 120 64 51 -99 -78 176 27 -220 -38 146 112 -72 -82 -33 109 132 -29 -9 250 -111 -86 63
4422 63 -145 -18 -51 272 128 6 -229 -71 296 77 -257 -33 9 -105 59 -92 -96 -88 -97 -63 233 56 -41 -12
4446 -12 52 70 -47 215 89 -8 152 9 -2 256 117 22 197 -37 -96 236 -83 2 -85 -112 -33 -116 -68 -253
4470 -253 191 -85 51 262 195 129 -48 -124 9 29 332 -34 -75 40 -210 -81 25 2 -29 -56 -65 -142 -62 78
4494 78 18 11 -262 -83 276 7 115 179 -57 -159 -57 15 369 59 92 11 -157 -16 117 8 7 109 182 61
$$ packed form
4376f0J29k06N0Q7pj19j00L06o9J87n2m39J72J3J23j8K76k11j71J25j68M1K50
4399A39j48J29n6j3j50K1K54j49k47J82J84l4j84j0M9J42K3j61K0K59l61K5J49
4422F3k08J27l3L23j44j22k35J58L67k19l34K24M2j14J64j51mQrL4K96j77r7K9
4446a2O4J8j17K62j26r7J60j43j1K58j39r5J75k34n9L32l19Q5q7k7P9q3M8j85
4470b53M44k76J36K11o7o6j77p6J33K0L03l66m1J15k50J29J06k3l1k7rp7Q0J40
4494G8o0pk73J79L59k69J08O4k36j02J02P2L54l10L3q1j68J41J33j09jJ02P3j21
$$ [...]
8191b4
##END NTUPLES=NMR FID
##END=
