##TITLE=1H_Pr C4-Q6
 200.13MHz, CDCl3,
 8 sc
 
 26.5.2025
##JCAMPDX= 6.0         $$ Bruker NMR JCAMP-DX V2.0
##DATA TYPE= NMR FID
##DATA CLASS= NTUPLES
##ORIGIN= UXNMR, Bruker Analytische Messtechnik GmbH
##OWNER= pz
$$ XWIN-NMR		Version 3.5
$$ Mon May 26 15:04:45 2025 Russian Standard Time (UT+4h)  she@DPX200
##.OBSERVE FREQUENCY= 200.1313
##.OBSERVE NUCLEUS= ^1H
##.DELAY= (6, 6)
##.ACQUISITION MODE= SIMULTANEOUS
##.ACQUISITION SCHEME= undefined
##.AVERAGES= 8
##.DIGITISER RES= 18
##SPECTROMETER/DATA SYSTEM= spect
##.PULSE SEQUENCE= zg30
##.SOLVENT NAME= CDCl3
##.SHIFT REFERENCE= (INTERNAL, CDCl3, 0, 14.3821)
##AUDIT TRAIL= $$ (NUMBER, WHEN, WHO, WHERE, WHAT)
$$ ##TITLE= Audit trail, XWIN-NMR		Version 3.5
$$ ##JCAMPDX= 5.01
$$ ##ORIGIN= Bruker BioSpin GmbH
$$ ##OWNER= she
$$ F:/spectra/data/she/nmr/H-C/1/audita.txt
$$ ##AUDIT TRAIL=  $$ (NUMBER, WHEN, WHO, WHERE, WHAT)
(   1,<2025-05-26 15:03:21.29 +0400>,<she>,<DPX200>,
      <created by zg, POWCHK disabled, PULCHK disabled
       configuration hash MD5:
       00 E9 B6 7A A2 85 ED C7 34 08 36 98 17 FE 4E 26
       data hash MD5: 16K
       99 00 9F C4 74 E1 8C 9D 63 10 9D B6 BA D2 B8 E8>)
$$ ##END=
$$ 
$$ hash MD5
$$ CF 50 7B 9C 55 45 41 DA 56 EE 05 19 5C F2 FA A0
##$RELAX= 
##$RELAX= 
##$RELAX= 
##$RELAX= 
##$RELAX= 
##$RELAX= 
$$ Bruker specific parameters
$$ --------------------------
##$DU= <F:/spectra>
##$EXPNO= 1
##$NAME= <H-C>
##$PROCNO= 1
##$TYPE= <nmr>
##$USER= <she>
##$AMP= (0..31)
100 100 100 100 100 100 100 100 100 100 100 100 100 100 100 100 100 100 
100 100 100 100 100 100 100 100 100 100 100 100 100 100 
##$AQSEQ= 0
##$AQ_mod= 1
##$AUNM= <au_zg>
##$AUTOPOS= <>
##$BF1= 200.13
##$BF2= 200.13
##$BF3= 200.13
##$BF4= 200.13
##$BF5= 200.13
##$BF6= 200.13
##$BF7= 200.13
##$BF8= 200.13
##$BYTORDA= 1
##$CFDGTYP= 0
##$CFRGTYP= 5
##$CHEMSTR= <none>
##$CNST= (0..31)
1 1 145 1 1 1 1 1 1 1 1 1 1 1 1 1 1 1 1 1 1 1 1 1 1 1 1 1 1 1 1 1 
##$CPDPRG= <>
##$CPDPRG1= <>
##$CPDPRG2= <>
##$CPDPRG3= <>
##$CPDPRG4= <mlev>
##$CPDPRG5= <mlev>
##$CPDPRG6= <mlev>
##$CPDPRG7= <mlev>
##$CPDPRG8= <mlev>
##$CPDPRGB= <>
##$CPDPRGT= <>
##$D= (0..31)
0 0.7 0 0 0 0 0 0 0 0 0 0.03 0 0 0 0 0 0 0 0 0 0 0 0 0 0 0 0 0 0 0 0 
##$DATE= 1748257400
##$DBL= (0..7)
120 120 120 120 120 120 120 120 
##$DBP= (0..7)
150 150 150 150 150 150 150 150 
##$DBP07= 0
##$DBPNAM0= <>
##$DBPNAM1= <>
##$DBPNAM2= <>
##$DBPNAM3= <>
##$DBPNAM4= <>
##$DBPNAM5= <>
##$DBPNAM6= <>
##$DBPNAM7= <>
##$DBPOAL= (0..7)
0.5 0.5 0.5 0.5 0.5 0.5 0.5 0.5 
##$DBPOFFS= (0..7)
0 0 0 0 0 0 0 0 
##$DE= 6
##$DECBNUC= <off>
##$DECIM= 32
##$DECNUC= <off>
##$DECSTAT= 4
##$DIGMOD= 1
##$DIGTYP= 9
##$DL= (0..7)
0 120 120 120 120 120 120 120 
##$DP= (0..7)
150 150 150 150 150 150 150 150 
##$DP07= 0
##$DPNAME0= <>
##$DPNAME1= <>
##$DPNAME2= <>
##$DPNAME3= <>
##$DPNAME4= <>
##$DPNAME5= <>
##$DPNAME6= <>
##$DPNAME7= <>
##$DPOAL= (0..7)
0.5 0.5 0.5 0.5 0.5 0.5 0.5 0.5 
##$DPOFFS= (0..7)
0 0 0 0 0 0 0 0 
##$DQDMODE= 0
##$DR= 18
##$DS= 0
##$DSLIST= <SSSSSSSSSSSSSSS>
$$ [...]
##$SUBNAM0= <"">
##$SUBNAM1= <"">
##$SUBNAM2= <"">
##$SUBNAM3= <"">
##$SUBNAM4= <"">
##$SUBNAM5= <"">
##$SUBNAM6= <"">
##$SUBNAM7= <"">
##$SUBNAM8= <"">
##$SUBNAM9= <"">
##$SW= 18.0517328524113
##$SWIBOX= (0..15)
0 0 2 0 0 0 0 0 0 0 0 0 0 0 0 0 
##$SW_h= 3612.71676300578
##$TD= 16384
##$TD0= 1
##$TE= 0
##$TE2= 300
##$TE3= 300
##$TEG= 300
##$TL= (0..7)
0 120 120 120 120 120 120 120 
##$TP= (0..7)
150 150 150 150 150 150 150 150 
##$TP07= 0
##$TPNAME0= <>
##$TPNAME1= <>
##$TPNAME2= <>
##$TPNAME3= <>
##$TPNAME4= <>
##$TPNAME5= <>
##$TPNAME6= <>
##$TPNAME7= <>
##$TPOAL= (0..7)
0.5 0.5 0.5 0.5 0.5 0.5 0.5 0.5 
##$TPOFFS= (0..7)
0 0 0 0 0 0 0 0 
##$TUNHIN= 0
##$TUNHOUT= 0
##$TUNXOUT= 0
##$USERA1= <user>
##$USERA2= <user>
##$USERA3= <user>
##$USERA4= <user>
##$USERA5= <user>
##$V9= 5
##$VALIST= <valist>
##$VCLIST= <CCCCCCCCCCCCCCC>
##$VD= 0
##$VDLIST= <DDDDDDDDDDDDDDD>
##$VPLIST= <PPPPPPPPPPPPPPP>
##$VTLIST= <TTTTTTTTTTTTTTT>
##$WBST= 1024
##$WBSW= 4
##$XGAIN= (0..3)
0 0 0 0 
##$XL= 0
##$YL= 0
##$YMAX_a= 943891
##$YMIN_a= -1089292
##$ZGOPTNS= <>
##$ZL1= 120
##$ZL2= 120
##$ZL3= 120
##$ZL4= 120
##$ABSF1= 10
##$ABSF2= 0
##$ABSG= 5
##$ABSL= 3
##$ALPHA= 0
##$AQORDER= 0
##$ASSFAC= 0
##$ASSFACI= 0
##$ASSFACX= 0
##$ASSWID= 0
##$AUNMP= <proc_1d>
##$AZFE= 0.1
##$AZFW= 0.1
##$BCFW= 1
##$BC_mod= 2
##$BYTORDP= 1
##$COROFFS= 0
##$CY= -3
##$DATMOD= 1
##$DC= 2
##$DFILT= <>
##$DTYPP= 0
##$F1P= 0
##$F2P= 0
##$FCOR= 0.5
##$FTSIZE= 0
##$FT_mod= 4
##$GAMMA= 1
##$GB= 0.15
##$INTBC= 1
##$INTSCL= 1
##$ISEN= 128
##$LB= 0.25
##$LEV0= 0
##$LPBIN= 0
##$MAXI= 10000
##$MC2= 0
##$MEAN= 0
##$ME_mod= 0
##$MI= 1.114404
##$NCOEF= 0
##$NC_proc= 0
##$NLEV= 6
##$NOISF1= 3.799351
##$NOISF2= 2.8
##$NSP= 1
##$NTH_PI= 0
##$NZP= 0
##$OFFSET= 14.38212
##$PC= 1
##$PHC0= -1545.913
##$PHC1= -0.4078374
##$PH_mod= 1
##$PKNL= yes
##$PPARMOD= 0
##$PSCAL= 0
##$PSIGN= 0
##$REVERSE= no
##$SF= 200.129724274929
##$SI= 16384
##$SIGF1= 3
##$SIGF2= 2
##$SINO= 400
##$SIOLD= 16384
##$SREGLST= <1H.CDCl3>
##$SSB= 0
##$STSI= 0
##$STSR= 0
##$SW_p= 3205.1282051282
##$SYMM= 0
##$S_DEV= 0
##$TDeff= 0
##$TDoff= 0
##$TI= <>
##$TILT= no
##$TM1= 0
##$TM2= 0
##$TOPLEV= 0
##$USERP1= <user>
##$USERP2= <user>
##$USERP3= <user>
##$USERP4= <user>
##$USERP5= <user>
##$WDW= 1
##$XDIM= 8192
##$YMAX_p= 0
##$YMIN_p= 0
$$ End of Bruker specific parameters
$$ ---------------------------------
##NTUPLES= NMR FID
##VAR_NAME=  TIME,          FID/REAL,        FID/IMAG
##SYMBOL=    X,             R,               I
##VAR_TYPE=  INDEPENDENT,   DEPENDENT,       DEPENDENT
##VAR_FORM=  AFFN,          ASDF,            ASDF
##VAR_DIM=   8192,          8192,            8192
##UNITS=     SECONDS,       ARBITRARY UNITS, ARBITRARY UNITS
##FACTOR=    0.0002768,     1,               1
##FIRST=     0,             0,               0
##LAST=      2.2672688,     0,               0
##MIN=       0,             -1089292,        0
##MAX=       2.2672688,     943891,          0
$$ Real data points
##PAGE= N=1
##DATA TABLE= (X++(R..R)), XYDATA
$$ [...]
2022D99j422Q73P56r41m08J607n76j919J536J032k551J275J781k181l51J601k65
2039C46j386J130J220j939m15K429j018j935K026P13k109N33J272r43q94J088
2055A18Q54j907J72K085j302j286K008n6j763J292Q59j108n72P81J62q23L83J004
2073I01j276n95J618p22l72Q10Q1j040L65J84M16n66J84N15n20n3O03m63r5K15
2093A90l25K3j7k13N00R1m72J56J29j64P3j4L05m25k52R44m02j15N62m34k35J65
2115G0Q3P3k26l20O12n47rP02q36m1Q07o56j38N40k08N24o01k34R51n74o8M55
2137C59p5o09M4J71L12n32j34Q16q25l96J075po96P09L03o98j74O87J84j259M52
2158b93J014j014k00J378n10j222R09N78r38R8N91j65j187P68J163j602K7J502
$$ plain form
2022 499 -923 -50 706 -235 -643 964 388 -1531 5 1037 -1514 -239 1542 -639 -990 611 346
2039 346 -1040 90 1310 -629 -1044 1385 367 -1568 458 1171 -938 -405 867 -76 -970 118
2055 118 972 -935 -763 1322 20 -1266 742 686 -1077 215 1074 -34 -606 175 337 -486 -103 901
2073 901 -375 -970 648 -74 -446 364 445 -595 -230 -46 370 -196 -12 503 -17 -70 533 70 -25 190
2093 190 -135 -112 -129 -342 158 249 -223 -67 62 -102 -29 -43 262 -163 -415 529 127 12 574 140 -95 70
2115 70 153 226 0 -320 292 -255 -264 438 -398 -439 368 -288 -426 114 -94 430 -171 -405 546 -28 -96 359
2137 359 284 -325 -281 -110 202 -330 -464 352 -473 -869 206 199 -497 212 515 -183 -357 330 514 -745 -293
2158 -293 721 -293 -493 885 375 -847 62 640 -298 -200 391 226 -961 -193 970 -632 -605 897
2176H97q89o81J157k2q05J59R51p66q94J453N16j878N14R72j522K60J224m02m74
2195b30L18L47q59K25R04q68m59R38j46r36J222k50r64L70Q04m69m05N82O1p22
2215e37K80P62r29j13J252q97p37J539l07j031J018M21p71q22J474o3j372J241
2233D08N40k012L21J599j072q88J835l58j037N65J201j185r96K307n87j824J478
2250B95R73k343K29J997j400r64J502O18j987M79J817j534j184K302J8k334J690
2267A74J045j881k6J578q55j124J168R70k134M57J881j515r68K210l30k091J830
2284C89P67k020J32J720o00j222J046R01k267O16K250j977j165K838j347j514
2300a453J812P35j797JJ803j023j670K414J57k575J215J977k226m28K470j024
$$ plain form
2176 897 8 -673 484 462 -343 -184 767 1 -893 560 1076 -802 -288 684 -838 -578 646 244 -230
2195 -230 88 435 -424 -199 705 -163 -622 316 170 -766 456 206 -758 -388 416 -53 -458 124 185 -537
2215 -537 -257 505 -424 -537 715 -182 -919 620 313 -718 300 721 -50 -872 602 539 -833 408
2233 408 948 -1064 -743 856 -216 -1104 731 373 -664 -99 1102 -83 -1079 1228 641 -1183 295
2250 295 1268 -1075 -846 1151 -249 -1213 289 907 -1080 -601 1216 -318 -1502 800 818 -1516 174
2267 174 1219 -662 -688 890 35 -1089 79 1049 -1085 -628 1253 -262 -1230 980 650 -1441 389
2284 389 1156 -864 -732 988 388 -834 212 1113 -1154 -538 1712 -265 -1430 1408 61 -1453
2300 -1453 359 1094 -703 -702 1101 78 -1592 822 979 -1596 -381 1596 -630 -1058 1412 388
2316C88j814J799Q05j900p54K870j135j717K164L68k981J303K040k353l15K342
2332A110m16j807R90J531k053o06K839j477j998K576M05k184P48J730j558j127
2348a297K087P0k202J038J953k363o3K340j573j574K171M42k023O31J577j834
2364f20l17J710q8k042J658R78k089l0J874j443n07J971n24j632P20J573j787
2381e95k12K186j187j570J881L93k273J440J386j879r85K044j28k107J495J875
2397A764k334o60K858j513j941L114j8k377Q38K033k074j203K437Q6k228R96J672
2414A450k492l31K841q51j998K240L40k398L91K126q10j972K489M99l236J211
2430e01K105k421l28K505j064j730J245J199k024o8K664j324j870K109K85k349
$$ plain form
2316 388 -1426 373 1178 -722 -1476 1394 259 -1458 706 1074 -1907 -604 1436 -917 -1232 1110
2332 1110 694 -1113 -123 1408 -645 -1251 1588 111 -1887 689 1094 -1090 -342 1388 -170 -1297
2348 -1297 790 860 -1342 -304 1649 -714 -777 1563 -10 -1584 587 1029 -994 -363 1214 -620
2364 -620 -937 773 685 -1357 301 1279 -810 -840 1034 -409 -916 1055 531 -1101 -381 1192 -595
2381 -595 -807 1379 192 -1378 503 896 -1377 63 1449 -430 -1415 629 501 -1606 -111 1764
2397 1764 -570 -1230 1628 115 -1826 1288 1270 -1107 -269 1764 -310 -1513 924 1010 -1218 -222 1450
2414 1450 -1042 -1373 1468 617 -1381 859 1199 -1199 -808 1318 508 -1464 1025 1524 -1712 -501
2430 -501 1604 -817 -1145 1360 296 -1434 -189 1010 -1014 -1082 1582 258 -1612 497 782 -1567
2446a567J094K042k116n13J869n34j358J166J417k060m04J907j293r95K490k24
2462I21k288J571J023j654m08J657l44j340J217O03j815L68J841j439j080J974
2478H07j02k042J012J102j090o17J795m06j815J210J269k048M54J963j679r38
2494a125J629J40j533Q61J127j274q88J789l72j799J962N63k083O30J330j535
2510e78l42J190N30j432J25J057p35n68J486l67j682J430N71j556N57J174j237
2527c77l46J185M2j457P73J201j778O1J811r92j124J528R8j079J06J161r92o42
2545h21J113L10j405M14J361j430j88J433j223n69J888l04j085K84Q52n86r29
2562h85J557J94j646Q48L93j236K32J443r01q63R42K50q12J91J140q74r64J553
$$ plain form
2446 -1567 -473 1569 -547 -1060 809 275 -1083 83 1500 -560 -964 943 -350 -1345 1145 921
2462 921 -1367 204 1227 -427 -835 822 478 -862 355 958 -857 -489 1352 -87 -1167 807
2478 807 705 -1337 -325 777 -313 -930 865 459 -1356 -146 1123 -925 -471 1492 -187 -1125
2494 -1125 504 644 -889 -28 1099 -175 -1063 726 354 -1445 517 1080 -1003 -373 957 -578
2510 -578 -920 270 800 -632 -507 550 -185 -753 733 366 -1316 114 685 -871 -314 860 -377
2527 -377 -723 462 504 -953 -180 1021 -757 -696 1115 123 -1001 527 625 -454 -348 813 -179 -821
2545 -821 292 602 -803 -389 972 -458 -646 787 -436 -1005 883 579 -506 -222 630 44 -885
2562 -885 672 866 -780 68 461 -775 -543 900 -1 -864 78 328 -484 -293 847 -27 -991 562
2580E62l0j253P47M73j015J0Q58j68o60Q34m4r46L40Q68o55o07J170l47o43Q02
2600B96K62q21o8N49O7j026P75N56r22K89Q15j041J8P47n47m20L83L7k46K38Q4
2621B5j48l20O16P4q42P74L22p42l35R36k91m79M72K10m11n32J093j34r49J115
2641D54o2q38N64J10m73N7O13n09r2M54J60n77r4N62k65n64N76j24l79L95M10
2662C78q78J21Q74m41k04L73J68n31j81O37n27k26M01M1k5Q6q6Jl08K53K49k81
2684a06J02J96n04L28L00m92Q9K44j63k65K63J76k5m46L22J24l86L97k17l08K57
2705a14J15r6J23j23J28K01l33L2J53k24J38k99L49J14m38N30Q5l73J01k84J62
2726e3j59J92m2q3R9K99k07j42Ok9J42K20k3l75rJ84Ok1j48J59K61j02k48j78
$$ plain form
2580 562 532 -721 26 499 -516 -506 352 184 -476 358 314 -632 -292 576 -79 -686 484 137 -506 296
2600 296 558 -263 -331 218 285 -741 34 590 -332 -43 772 -269 -251 496 -51 -471 -88 -51 -297 -59 25
2621 25 -123 -443 173 247 -595 179 501 -241 -576 360 69 -410 62 272 -139 -671 422 288 -661 454
2641 454 392 -446 118 228 -245 -188 425 -84 -176 278 438 -139 -233 329 64 -500 76 -48 -427 -32 378
2662 378 -500 -379 495 54 -150 223 391 -140 -321 316 -211 -437 -36 5 -20 66 -20 -19 -327 -74 175 -106
2684 -106 -4 192 -312 16 316 -176 -87 157 -6 -271 -8 168 143 -303 19 143 -243 154 -63 -371 -114
2705 -114 1 -95 28 -95 33 234 -99 -67 86 -138 0 -299 50 164 -274 256 341 -32 69 -215 -53
2726 -53 -212 -20 -62 -145 -46 253 46 -96 -90 -119 23 243 220 -155 -164 20 26 5 -143 16 277 175 -73 -251
2750b51j25N20ln34M65O0j28N63m48k63m8M59k53j8J8L29n27K18L87m58k94O31
2772C00l79k96L97J75j21o39O66p5k59L44K69n00j56O90n88L27Mk45j59K28o9
2793h6k48L19M15o01l55O87j56m72M92M9j87oM35l66qJ74K12k77k2M38n67l62
2815d92O87j64l06R7K00n1j7K12p0m57L66M81q70K73M96l98k69O47o0m64K80J16
2837B37j62l70M90k7o60N76K82r08N59N84p08k77P94k04l79L17K07r81L19R45
2857F34o15n15O53J72q75N18N37p83k46P05K21q81O47O60j221J86Q84l59p53N97
2877A66L99j182L89P38m25m68O68K01j465Q16O61j130J5J256p19n25O72M88p76
2896b21R3P43p34o78J223n7j000O69M56j019NP72k66p43J017L36j293L97O43m21
$$ plain form
2750 -251 -376 144 141 -393 72 132 4 567 119 -144 -192 267 14 -4 14 343 -184 34 421 -37 -331 300
2772 300 -79 -375 22 197 76 -563 103 28 -231 113 382 -118 -274 416 -172 155 159 -86 -245 -17 -86
2793 -86 -334 -15 400 -201 -556 131 -25 -497 -5 44 -143 -149 286 -80 -88 86 298 21 -1 437 -130 -492
2815 -492 195 31 -275 -178 22 -29 -46 166 96 -361 5 486 -384 -111 385 -13 -282 365 305 -159 121 237
2837 237 75 -295 195 168 -492 84 366 -542 17 601 -107 -384 410 206 -173 144 351 -630 -311 634
2857 634 19 -496 157 329 -546 -28 509 -274 -520 185 406 -475 172 832 -389 -203 681 322 -431 166
2877 166 565 -617 -228 510 85 -383 285 486 -979 -163 498 -632 -617 639 -80 -605 67 555 -221
2896 -221 -128 615 -119 -797 426 369 -631 38 494 -525 -520 252 -14 -757 260 596 -697 -300 343 -78
2916g8l32J152l78n95L97L41q21o8J136p02m01P12J25p30Q4Q68p99o67J158k26
2936A76m89K65Q01r59K53M51q8q12O90M82j169J27O14n47l89Q07m0r03Q50J90
2956C10m93j42P93k75n27M60K53r46L50Q66q04l57Q99M2p63K60M04p99r5Q69M4
2977C49r09Q06m0j183O62J073r46k24Q67k89o12M01O83j048LJ023p52l90J111
2996E85Nj110O48M02j026N3Q28k28q23Q10J33o32q6R45o83o13J211p9j105O53
3016a12P28j203J67O42j07o05Q14K58j146J20J207n44o93P70j43n31M00O09q15
3035a84j57Q57l62j034J212J45j477Q15R07j017k65P81K76j043L62Q74p59o05
3053f74J004o7p50O69L28p66j24P43n18l19O68O4o53K06Q41r59m7R65o16m85O36
$$ plain form
2916 -78 -410 742 364 -231 166 507 -314 -382 754 52 -349 363 488 -242 -158 710 -89 -756 402 176
2936 176 -313 -48 753 -206 47 498 410 -402 288 770 -399 -272 342 -205 -594 213 173 -730 120 310
2956 310 -183 -325 468 193 -334 126 379 -567 -217 649 -155 -512 387 429 -334 -74 330 -469 -564 305 349
2977 349 -560 246 206 -977 -315 758 -188 -412 455 166 -446 -45 638 -410 -407 616 -136 -526 585
2996 585 590 -520 128 530 -496 -443 385 157 -666 144 277 -355 -441 504 -179 -792 419 340 -765 -112
3016 -112 616 -587 -420 222 115 -490 324 582 -564 -444 763 219 -474 296 153 -378 22 631 -184
3035 -184 -341 516 154 -880 332 477 -1000 -185 722 -295 -560 221 497 -546 -184 690 -69 -674
3053 -674 330 263 -487 182 510 -256 -380 363 -155 -474 194 258 -395 -189 652 -307 -354 611 -5 -490 146
3074A46M60q27K32N08j81o25L34O6o87L79P13o03n11R80k70n79Q31l70m61M46
3094a9K87m68k60O42K88p97L57L74q61J02J129p68j1K14m8l83lO96r34p2R24Q1
3116D70r57L12O32o84j88R45m93m19K87N14p90J29Q86r38j6N54l10o13O69N74
3136E64q38jM51Kl95K18N00p78M53j1m34j52P34j01n69M32L18p24J01M38Q0r38
3158f50J133j17q98N42K94o24P7O82n54j04L10L19m83m83Q70k62j057J134j47
3177a8m91M85K70k85J16L01k55l65L22L41m69k06O08l41k25O07k25m93J37L27
3197A41j79k82L61J79m70K74K34l24m0M43l09l25M76J74m61l54O80j92n61O66
3217A31l18j88Q1O55o73J58M55k74k2r2J19o5P2R1j51l04L84M7k76K12R4k46J89
$$ plain form
3074 146 606 -221 11 519 338 -287 47 113 -574 -195 518 -85 -596 384 114 -465 366 -4 -465 -19
3094 -19 268 -200 -460 182 470 -327 30 404 -457 -355 774 6 -5 209 161 -222 -225 471 -463 -535 389 470
3116 470 -487 -175 457 -227 -415 530 37 -382 -95 419 -371 -242 644 -294 -310 244 -66 -679 -10 564
3136 564 -274 -275 176 178 -217 1 501 -277 176 165 -269 -421 313 212 -357 75 393 -331 -230 208 288 -650
3158 -650 483 366 -532 10 304 -320 -243 439 -115 -219 91 410 -73 -556 314 52 -1005 129 -18
3177 -18 -509 -24 246 -39 77 378 123 -242 80 421 -48 -254 354 13 -212 395 170 -323 -186 141
3197 141 -38 -320 41 220 -250 24 258 -66 -106 337 28 -297 179 353 -108 -462 218 26 -535 131
3217 131 -187 -375 -294 361 -312 -154 301 27 5 -87 32 -33 39 130 -21 -325 59 106 -170 42 136 -110 79
3240G9n5n0k60J28M62m3J0rl71NJ61l5j22K81K8m43L68K07k62j11K62k66J52L9
3264A55M4m10J12P7%j64K00K1j63L3M09k83j82L36Po9o0J3j72j09M20l64J2lJ16
3289b4R1k13L40m17K76j13PJ9J36M4l04J59k13P3L53k55J14N5j69l33N58k36J07
3312E5l3O0j97P1K37k76l03L58J39j9j83R8K60q6k44J04mj84K59n7l7j44j5J40
3336aK50k59P7k32K99J6k92J04J82l12k39R1N8J01M80l8J4l97K69K6k89j14L56
3359A50m30L78Q9k23J22k0k06J17K55k97k9J0M01j08l35K88o5j40K06j0m21J61
3381a07J28P2l0K4J51o10K23J70L3k92O24j28o50L99j92k51J45L61j61j44K97
3402F2L03n26J58J61j94M9lj37P3O5l7m2K3L33l08j59P9J82j23J81J60o93N15
$$ plain form
3240 79 24 -26 -286 -158 304 261 271 262 -109 -104 57 22 -100 181 209 -234 134 341 79 -32 230 -36 116 155
3264 155 199 -211 -99 -22 -22 -186 14 35 -128 -95 314 31 -151 185 192 123 63 76 -96 -205 215 -149 -137 -140 -24
3289 -24 67 -146 194 -223 53 -60 -53 -34 102 146 -158 1 -212 -139 214 -41 73 128 -41 -374 184 -52 55
3312 55 22 82 -115 -44 193 -83 -386 -28 111 92 -91 7 267 181 -63 41 37 -147 112 55 18 -126 -141 -1
3336 -1 249 -10 67 -165 134 150 -142 -38 144 -168 -407 -316 -258 -157 323 285 299 -98 171 197 -92 -206 150
3359 150 -280 98 187 -36 86 66 -140 -23 232 -65 -94 -84 317 209 -126 162 97 -43 163 153 -268 -107
3381 -107 21 93 63 87 238 -372 -149 21 54 -238 386 258 -392 7 -185 -436 -291 70 -91 -235 62
3402 62 365 -161 -3 158 -36 13 10 -127 -54 11 -26 -68 -45 288 -20 -179 -100 82 -41 140 300 -393 122
3425A22pm1j96L62rk07l43O12l52m5K69o0l69J78M56p80M10J02L6o65M52J16j15
3448g4l32P69m00r3M55j83m31M96J97n84M09J32m64o0J56J79n20J26P39p14m9
3469b46O37n83m27O80Q5j65k65O14rn80N17N4q44O24N85q24j61M72M6o24J43L53
3491H2j72j39M90l4m04n6O04p04Q4M97n45N7M14jk83j08M30n18J43J12J29n00
3513d22O45L03j149O16J97k83j41M12L03q36L35L14n49J87J82j66l92N13K0l03
3533b14L14K77l19m62M99K03p52K99P43p27Q3M32n38k30M72K39m53j07M67m64
3553b38o0M19ml25K21L28m56j90O73k83m82O11l0o79M70N27n81j48N04k83m32
3574d38K52O42p48oL93r1l03O85m22j59L76K94p36k22O91k06l85O15K58n92K05
$$ plain form
3425 122 115 74 -122 240 231 24 -319 293 -59 -104 165 105 -264 -86 370 -410 0 102 138 -527 -75 41 -74
3448 -74 -406 363 -37 -130 325 142 -289 207 404 -180 229 361 -103 -163 -7 172 -348 -222 517 -197 -246
3469 -246 391 -192 -619 61 146 -19 -284 330 321 -259 258 312 -532 92 677 -147 -308 164 210 -414 -271 82
3491 82 -90 -229 261 227 -177 -233 371 -333 -249 248 -297 -240 174 173 -110 -218 212 -306 -163 -51 78 -422
3513 -422 223 526 -623 -7 190 -93 -234 178 481 -355 -20 294 -255 -68 114 -52 -444 69 89 -214
3533 -214 100 377 58 -404 95 298 -454 -155 588 -139 -56 376 -162 -392 80 319 -134 -241 226 -238
3553 -238 -298 121 117 -208 13 341 -115 -305 368 85 -397 214 184 -495 -25 502 -79 -227 277 -6 -438
3574 -438 -186 456 -292 -298 95 4 -299 386 -36 -195 181 475 -261 -483 208 2 -383 232 490 -102 103
3595A03K13k58l16K39L41l47j86N23k34m99P45k03n15N38J15k46m47M09R2k65
3615a98L14L00o35lL97m04o4P76l12n06O58j3n45j05Q32n43k87O01J31o92R7M21
3637B20m22j95M76j33k23m4O00l69j69L09M3l21L58M12q15J64J83q8l10N21j07
3658I0l50K97K50m81j73P30l60q7J13L21r10N29J68l12N9O12l56m49K29J72m61
3679c69L2P79n70k61M54P7l18M1N51l22j07r2K9j70K92K76m21J0J77J25l78L11
3701A46m0l00K96M84m60m91M07l5k93O42j93n34K60K08q4q8L70l01j48M0L28k70
3723e6j22L62k09l98M02J28k91n2L46r4l90L46J52j69r2M37m02L1N56n83j91K92
3745CR0j02j90L57jk93L74k57j57K43O6l66K23p9o6j73K26L42l74k5N0K54l02
$$ plain form
3595 103 316 58 -258 -19 322 -25 -211 312 78 -421 324 121 -394 144 259 13 -434 -25 67 -198
3615 -198 116 416 -219 -222 175 -229 -293 483 171 -335 323 310 -235 -340 492 -51 -338 263 394 -298 -201 220
3637 220 -202 -397 79 -54 -277 -321 279 -90 -259 50 93 -228 130 542 -273 -109 74 -14 -324 197 90
3658 90 -260 37 287 -194 -367 363 3 -84 29 350 -560 -31 137 -175 -116 496 140 -309 -80 92 -369
3679 -369 -337 442 -128 -389 65 142 -176 -135 416 94 -13 -105 -76 -246 46 322 -99 -89 88 213 -165 146
3701 146 106 -194 102 586 126 -365 42 7 -286 356 163 -371 -111 97 13 -75 295 -6 -154 -114 214 -56
3723 -56 -178 184 -25 -423 -21 107 -184 -236 110 16 -374 -28 124 -45 -137 300 -102 -71 485 -98 -289 3
3745 3 93 -9 -199 158 157 -136 238 -19 -176 67 133 -233 -10 -89 -155 -328 -102 240 -134 -159 -109 145 -157
3768a57K81O3k50j19M24j12k86K03M4k03r6L66l49J34K87j70m86M74K40l96r0
3789a98L86l04J05K35j51j2o0M07j97j76O0J47k84j18J96m52L28J38k89O3J40
3810c6M12o56L75q7M1J8p9m2J72j7k96K8R5M13n27k51L35K42k64K77j40K7J52
3833A92n4k30L34m47L79j63j88O00m66J93Mn1l17M33k72p0k0K52k63K6O7L00l65
3856a26N3K50k93N4K42Q3k81Q6K36n51K59P2k35M0K61q9k65M78l44j12Q7M22m46
3879a19j98K53L59l58k68L00J98l08J74j73m2RK70j79l8P7j2P7l00K37J73l01
3901a69r1J01J19o9K05r6j76KL55j64o3K21m04Q4K66R5j07j63R8j66o8J60j54
3924a84K20j90K62j86q1L57r3l30J0J40r4QpK91j82l54M35L6l94M82l49J7R0J78
$$ plain form
3768 -157 124 187 -63 -182 242 130 -156 47 91 -112 -208 158 -191 -57 230 60 -426 48 288 -108 -198
3789 -198 188 -116 -11 224 73 61 1 408 211 35 95 242 -42 -160 36 -416 -88 50 -239 -176 -36
3810 -36 376 -280 95 8 49 67 -12 -54 118 101 -195 -167 -72 341 -186 -437 -102 140 -124 153 13 40 192
3833 192 138 -92 242 -205 174 11 -177 423 -43 150 154 103 -214 219 -53 -123 -143 109 -154 -128 -61 239 -126
3856 -126 -73 177 -116 -62 180 263 -18 68 304 -247 12 84 -151 -111 150 61 -204 274 -70 -182 -95 327 -119
3879 -119 -317 -64 295 -63 -331 -31 167 -141 33 -140 -182 -173 97 -82 -120 -43 -55 22 -278 -41 132 -169
3901 -169 -260 -159 -40 -109 96 0 -176 -174 181 17 -46 175 -229 -145 121 216 109 -54 44 -122 -190 -30 -184
3924 -184 36 -154 108 -78 -159 198 105 -225 -215 -75 -169 -161 -168 123 -59 -413 22 58 -336 146 -203 -186 -96 82
3948H2M1l33K37K86j56j26O8K2Rr4j15K7Q4j60j75M30k60k0J72j55J11K2j95J97
3972ap1P2J86k88N1L4M1j47K09R7k91K0L34k79j24K81J38o14J66K78P3j08Kk22
3996a63k02M61k30K47l17K52j61L8j01J24k58J50M39m25R8L11K8m72O1k7Kj19
4018b64K31M0k66J00K11n4p1R8j55k2L16K96n55J81J60m12J00K43k50k30N14l
4040B08m65P3O08k65m17M22l04N1L00k0k28q3J56j66p0M3J98m49J16N70l23M5
4062@L31l18k35J13K08m52K88Q7O2l20K80M6j63JJ98j55k54N03j03m30N00J36
4084C23j40l70K74p4k65J63J01l52J64M38k37j0J79k00M4j47K41m63Q6M48j7l26
4106a40K52m0k46J88J04m02P8K97J03o68K04O15o53N8K38K44p20P82o8l05NM20
$$ plain form
3948 82 123 -210 27 313 157 31 99 121 130 36 -79 -52 32 -128 -303 127 -133 -153 19 -136 -25 -3 -198 -1
3972 -1 -72 0 186 -102 -51 -17 24 -123 86 183 -108 -88 246 -33 -157 124 262 -352 -186 92 165 57 59 -163
3996 -163 -365 96 -134 113 -204 48 -113 -75 -176 -52 -310 -160 279 -146 -48 263 291 -181 -120 -147 -145 -264
4018 -264 -33 7 -259 -159 52 -2 -73 25 -130 -152 164 460 -95 86 246 -166 -66 177 -73 -303 211 208
4040 208 -257 -184 424 159 -258 164 -140 -89 211 191 -37 -120 36 -130 -200 -157 41 -408 -292 278 -45 0
4062 0 331 13 -222 -109 99 -353 -65 22 84 -236 44 90 -73 -72 126 -29 -283 220 117 -313 187 323
4084 323 183 -187 87 13 -252 -89 12 -340 -176 262 25 15 194 -6 38 -109 132 -331 -245 203 186 -140
4106 -140 112 72 -174 14 118 -284 -206 91 194 -474 -270 345 -308 -250 -12 232 -488 294 226 -79 -74 346
4128C46l53k30M20o0m59L29L25k55m78N45j65r7L53O2l84l9M16j88n34O11J61
4149C26o64K14O08n32n6L64n92o4%N00j69j61J71l76L85L06j13k26J28K27l57
4170h1J58k39J57n05O27P4l98L43Qk36O7M17k86m10J45J86M2k17N30l43k48L17
4192A08kk82L91J60n98L3M87j66l39J19L40k58K6n3q5K0L76m2m27J79J55k08L4
4215c2N34n21k61K09M71p14O19j61k69m1L35M9l44J33K84m87J86K89l38j69J44
4236h4K75j83r1N49k91o54O19j40n97O95J13l76J10N00l66l24LN94m92J9J30j46
4258a37q5M12k06k04O2M74m52J11M07l05l39N29j50m55L8O97n80pK82M3j79K08
4280A64Q9m41N4Q0j23j4K59j00kp2M05l30k09L97j08k91K59nK20j64R0j37k03
$$ plain form
4128 346 -7 -237 183 123 -336 -7 318 63 -415 130 -35 -132 221 283 -101 -140 276 88 -446 165 326
4149 326 -338 -124 484 -48 -104 260 -332 -396 -396 104 -65 -226 -55 -431 -46 260 147 -79 49 276 -81
4170 -81 77 -162 -5 -510 117 191 -207 136 144 -92 -25 392 106 -304 -159 27 69 -148 382 39 -209 108
4192 108 106 -176 215 375 -223 -190 297 131 -208 -89 251 -7 19 -34 -119 -99 277 235 -192 -13 142 -66 -32
4215 -32 502 -19 -280 -71 400 -314 305 144 -125 -166 169 218 -126 7 291 -196 -10 279 -59 -228 -84
4236 -84 191 8 -83 466 175 -479 140 0 -597 98 211 -165 -55 445 79 -245 -242 352 -140 -121 9 -137
4258 -137 -222 190 -16 -220 -158 316 -136 -25 382 77 -262 267 117 -338 -300 397 -183 -190 92 135 -44 164
4280 164 253 -188 -134 -54 -177 -191 68 -32 -34 -106 299 -31 -240 157 49 -242 17 12 232 68 158 21 -182
4303a82J64N5r1J2j17Q2m4o5K81k51N6K99l13MK90O3j95O7k24r3Q3K61j25j15
4327i8K64q7M6r4o9k53M36J13l83Q8P2M8k4k22L32l27J79Mr0k16L01j52J08O0
4351C6J93k07k32L63L3j32J22q7l70m0M77R6n60M99r7l33L19Pj72o8L16l7k04
4374g8j7K04p1r6k2K4pJ14P7j94QJ80j81J86j4j10j36J21L07k16j35L84m20j50
4398b42K48k7j18N8K11J07k40J90r0j04p7J3J74m03M15m88M31k20R6O4J4K69m65
4421a84K34O3j26j31L69j61J5k43O4j7J06k4L66l47j90J72M7j28J91m4o2P0j15
4444g5m6K34k11N3k4J68l06k3L70J37n39K50K67l84o5J92r5J75P4k10Q6k8N1J
4468E2q4L52l75J25p4j3J66r3Q9m07M45k00J40O8k90Q3J29K10Q6l68p4j56L32
$$ plain form
4303 -182 -18 37 -54 -42 -159 -77 -121 -186 95 -156 -100 199 -114 -110 180 243 48 115 -109 -202 -119 142 17 -98
4327 -98 166 79 125 31 -38 -291 145 258 -125 -37 35 83 59 -163 169 -158 21 25 -65 -281 20 -132 -24 36
4351 36 229 22 -210 153 186 54 176 89 -281 -321 156 252 -308 191 94 -239 80 87 -85 -153 163 126 -78
4374 -78 -95 109 38 -58 -80 -56 -63 51 128 -66 -58 122 -59 127 113 3 -133 -12 295 79 -56 328 -92 -242
4398 -242 6 -21 -139 -81 130 237 -3 187 97 -7 -84 -71 103 -300 115 -373 58 -162 -66 -2 12 281 -184
4421 -184 50 113 -13 -144 225 64 79 -164 -100 -117 -11 -35 331 -16 -206 -34 13 -115 76 32 -30 40 -75
4444 -75 -121 113 -98 -45 -69 99 -207 -230 140 277 -262 -12 255 -129 -194 -2 -97 78 152 -58 28 0 51 52
4468 52 -32 320 -55 70 -4 -17 149 56 145 -262 183 -17 123 191 -99 -16 113 323 409 41 -33 -189 143
4491A43o0K7j96j54J00n0J03j2K31J2j36O1J31l06K62k56M0J55k91L67O9M8m32
4514a44k91M31K09k95O9L75j47k82M41o81L68J48j75O8k20n2K67k90q0K92nj44
4536a38J49j08J12m5N2j60k0K20R6k1J8k35k6R9L51m64j5J52j68P7O3Q4l18k6
4560b71M10j47K31l99K96km01N78m6l79L06j04j47J44j51K02j15K39l86J06J55
4581A19j08l24M44j53j41K73k62J91j81J69j65R4K22p4k55L4K38k20p9J32K13
4602A67k49l1J9K45k30J77j70l63L69L9J39k78K85r8mk40L9R9k52M95j70l23N31
4625A96j2k19k04L07Lj31J74K41l86J41Lk41j00O6J46lm6J55m90L65M3m92M05
4648g9L12j7l86m0L12l50K51j6P6o7n2q5J08O3K9M3l05L67N7lj74J03m52L38J55
$$ plain form
4491 143 83 110 -86 -240 -140 -190 -87 -99 132 144 8 69 200 -106 156 -100 -60 95 -196 171 240 288 -144
4514 -144 -435 -4 205 -90 -21 354 207 -75 366 -315 53 201 26 94 -126 -178 89 -201 -281 11 6 -138
4536 -138 11 -97 15 -30 22 -138 -158 62 158 137 155 -80 -106 -7 344 -120 -135 17 -151 -74 -11 73 -245 -271
4560 -271 139 -8 223 -176 120 118 -283 295 249 -130 176 72 -75 69 -82 120 5 244 -142 -36 119
4581 119 11 -313 131 -22 -163 110 -152 39 -142 27 -138 -44 178 104 -151 -117 121 -99 -178 -46 167
4602 167 -82 -113 -94 151 -79 98 -72 -435 -66 -27 112 -166 119 21 17 -223 -184 -85 -337 158 -12 -335 196
4625 196 184 -35 -239 68 71 -60 114 355 -31 110 113 -128 -228 -162 -16 -19 -65 90 -400 -35 8 -484 -79
4648 -79 233 216 -170 -210 102 -248 3 -13 63 -4 -56 -141 -33 30 59 102 -203 164 221 218 44 147 -305 33 188
4673A88p8l39O59m76l21K84K90l65M0K62O1k38j7M15n53j82L83K26m04J91K54
4694B80m09N1L08l21J07J30L3l00n0L36l11J15OJ0o3J87R4n68J76M07k28RJ89
4717A88k12m9j80N64n10J44%M6k13J69J65l81J69L75m50l0N45l27r0j3K54l55
4739a91K04L46m36Pj24k1K57KJ39k66j08J55Mk24L17K01l28K27j3j65k38L61O
4762A12m16K05P9p4m9L14J88o46N23n6k66r4J96j4k15J06J08m39L96M61m07j56
4784a44J95m8l75J05N59l57J02J37l14L4J13J67n11M78J30k87J58J50m31R0J27
4805G8J01k5k02o9J49j37J65m9j09JJ47l52J8M48l59j34M09J17o4l00J30K51l71
4828a57K52Rm26N90Ql37o8O8J91R3k36L31o20RN70m62L12q3O4k63K85J38l59j13
$$ plain form
4673 188 110 -229 430 -46 -367 -83 207 -158 -118 144 205 -33 -50 365 -188 -370 13 239 -165 26 280
4694 280 -129 -78 230 -91 16 146 179 -121 -171 165 -146 -31 -25 -15 -78 109 203 -365 -189 218 -10 -1 188
4717 188 -24 -73 -253 311 -199 -55 -55 -9 -222 -53 112 -269 -100 275 -175 -205 340 13 -77 -90 164 -191
4739 -191 13 359 -77 -70 -194 -215 42 44 183 -83 -191 -36 -32 -256 61 262 -66 161 148 -17 -255 106 112
4762 112 -304 -99 -20 -94 -143 171 359 -287 236 180 -86 -180 16 2 -213 -107 1 -438 -42 419 12 -144
4784 -144 51 3 -372 -267 292 -65 37 174 -140 -106 7 174 -337 141 271 -16 142 292 -139 -49 78
4805 78 179 154 -48 -117 32 -105 60 11 -98 -97 50 -302 -284 164 -195 -329 80 197 133 -167 -37 214 -157
4828 -157 95 104 -322 268 276 -61 -129 -61 130 223 -13 318 -302 -293 277 -185 127 44 108 -155 130 268 -91 -204
4852b04K33J36m20K39Q4k81J76K82j94r2J19M44o33J78k0l38m5L00L8J5K2Pj83
4875a37R5%J50O7p1N1m08R0m3K80J75k12K52p05L39J89k24Q9K60k62m0p4P4l8
4899a03L16k07K0k49J57k12L0L94k41n2j53N04k06q6N1J93j98J17r9K29k91J01
4921A5K93l69L9M76m64j05L33k97M2J74P3k02p5J94J5j62p5R7k20J50L76n62M2
4944b12L77j51l26J99J24r5l8J37J39j85K4%j01L15j95j29K0j08N2L8P5K07l30
4967a63J5Q1j38j1J98J24l40O50k78l37j8K45m9l7nM8p8J07K72k04j86K16j44
4990c2k3K45j78k23N57j8k53J31j4k01j00J07J68m87K63J8N5K4J01k66L46Lk20
5013CK03m15K06K58l07k00L98j94O4Mj22K17j66O8R8k90P9r6K14j8l08J69J07
$$ plain form
4852 -204 29 165 -255 -16 68 -213 -37 245 51 -41 78 522 -111 67 47 -291 -336 -36 2 17 39 46 -137
4875 -137 -42 -42 108 175 104 155 -253 -163 -206 74 249 37 289 -416 -77 112 -112 -23 237 -25 -65 -139 -65 -103
4899 -103 213 6 26 -223 -66 -278 -248 146 -95 -147 -300 204 -2 -88 -37 156 -42 75 -24 205 -86 15
4921 15 308 -61 -22 454 -10 -115 218 -79 -37 137 210 8 -67 127 142 -20 -95 2 -218 -68 308 -254 -212
4944 -212 165 14 -312 -113 11 -84 -122 15 154 -31 -7 -7 -108 207 12 -117 -97 -205 -153 -115 -40 167 -163
4967 -163 -148 -67 -205 -216 -18 106 -234 416 138 -199 -217 28 -21 -58 -63 -15 -93 14 286 82 -104 112 -32
4990 -32 -55 190 12 -211 346 328 75 206 192 -9 -109 -2 166 -321 -58 -40 15 39 140 -126 220 223 3
5013 3 206 -209 -3 255 -52 -252 146 -48 16 20 -102 115 -51 17 115 -175 -96 -192 22 4 -304 -135 -28
5036b8p0J22Q0m5k05J98j37J96M6q9l3j81K18l9L5r1j66L7P8j55pK00j51M36l41
5061i2J3N5K81m53R8qN7K44k96K02j8m9L2J2k44J29J31m12K12k7J12K65k43kJ76
5086A75k08K75l08K34K2K9j83j56L14r4j75p8j12J70L5n1N6K87k65J36J23q0J5
5109A61j23j74N1O5Q8j74K37o9j48J21j77m2R1L20k40k26K54J67k94L00m63P4
5131b01j54L12J65l63L12j61J44o6P9L38o01J60j16p0K29J53k16j7J19j2n1Q1
5153F4J06K5j95j01J27r7K34k1j31or6J44n3M8jk27M35k8k96J20Q7m2j60J46q0
5178BL08l93QL6k20K02m5L5J23J18k62K17l14K38j72K02j69n2L69j30p0k49P6
5201a42J01k33K91p1rm0K29m55L78j5J49k05l2J67Mk86P7L42l30J81J73k79L3
$$ plain form
5036 -28 -98 24 104 59 -146 52 -85 111 157 68 35 -146 72 33 68 -23 -189 -152 -74 -229 -236 -36 -187 249 -92
5061 -92 -79 -24 257 -196 -98 -106 -49 195 -101 101 83 34 66 78 -166 -37 94 -318 -106 -133 -21 244 1 -1 175
5086 175 -33 242 -66 168 190 219 36 -120 194 100 -75 -153 -265 -95 -60 -111 -55 232 -33 103 226 146 161
5109 161 38 -136 -85 -20 68 -106 131 62 -86 35 -142 -184 -93 227 -13 -239 15 182 -112 188 -275 -201
5131 -201 -355 -43 122 -241 71 -90 54 -12 67 405 -196 -36 -152 -222 7 160 -56 -73 46 34 -17 64
5153 64 170 195 0 -101 26 -71 163 142 11 5 -91 53 0 48 47 -180 255 227 -69 51 138 96 -64 82 2
5178 2 310 -83 -75 -39 -259 -57 -102 -67 56 174 -88 129 -185 53 -119 83 -86 -138 231 101 31 -218 -142
5201 -142 -41 -274 17 -54 -63 -103 126 -329 49 34 183 -22 -54 113 117 -169 -92 250 -80 101 274 -5 28
5224B8L86k72k24K84j39k03j74M53k3l70N11ll28j2K20k21O4O5J59k67J59J59
5246B52l40r8K74k52N9J78l5o0L8J00q1L8l46M60j66Q4k36Q0j69J37K97m57M11
5269A68j23j41J1K15j29J42K8j93m4R9K08l37K57J81j62k94J7J87j50Q3J26r1
5291E8Q8p6q4r3r3M74k24k3j9q5n4J5J6M6K49L6j99m47O28o0k94L09j87q2O2Q4
5317D5l52J42L37Rl07J91L18l63m9J92l8n8j74M50m20J08K60l96j70J86L83l9
5339B55m46M01k01k26L62k0l97M52l10j21K61j13P0K4L8J72k87J01J46l14J45
5360hM2k4L9j09O0J3j32L52k74J9L65k52k89J98K02k53j6K85l04j11j32L74k24
5383a79K42L11l12k87K12J06j60J3K48j44k54L96R1j78Ro3Q3j38L50n58M4J64
$$ plain form
5224 28 414 142 -82 202 63 -140 -314 139 116 -254 257 254 -74 -86 134 -87 -23 42 201 -66 93 252
5246 252 -88 -186 88 -164 -105 73 38 -22 16 116 35 73 -273 187 21 105 -131 -51 -220 -83 214 -243 168
5269 168 45 -96 -85 130 1 143 171 -22 -66 33 241 -96 161 342 180 -114 -97 90 -60 23 149 58
5291 58 146 70 -14 -107 -200 274 50 27 8 -77 -131 -116 -100 -54 195 231 32 -415 213 153 -141 168 -19 -101 -39 45
5317 45 -307 -165 172 181 -126 65 383 20 -29 163 125 67 -107 343 -77 31 291 -105 -275 -89 294 255
5339 255 -191 210 9 -217 145 125 -272 180 -130 -251 10 -103 -33 -9 29 201 -86 15 161 -153 -8
5360 -8 34 10 49 -60 0 13 -119 233 -41 -22 343 91 -198 0 202 -51 -67 218 -86 -197 -329 45 -179
5383 -179 63 374 62 -225 -13 93 -67 -54 194 50 -204 192 283 105 114 51 134 -4 346 -212 -168 -4
5405dk58K4k6K56j72J08M28o01K64P8K0k28j53K90lJ57O8o7k06o7K01p2j50K18
5429A05n4o3J6mo7J82j54L9J81r5Q5k97J29J99l39K28m9qk06J14o9L7Q6J10l43
5454b37K57M5lo0l25L5K64K8J67l28p7K53p5j40J74L8m1p8J52J08m43N48J7m76
5478a97L17P1k65M8M71n33j85J8M06r1j14J47Q3m30M91j39n1Q5m32NL11n1J21
5501H6l19J59J31j28l8K86m02J94Q1j66j40L2K67n7k50j49N22m55K02L57l05R5
5523CJ88k77L1J08O7k64j77L64J0lL7O9k31K3J23J25k69J39N5l32M00j08j80j06
5547b05L68m00L32k67M18m66L94j23J82k19p1j93J36Q7mj97L7J32Q3j36J21J35
5569A44l31K40k4Q6j99mJ05j91J37K56j63L6q6J88k28J19jj29J65K93l24j74n8
$$ plain form
5405 -4 -262 -238 -264 -8 -180 -72 356 -245 19 97 117 -111 -264 26 23 180 248 181 -25 -92 109 37 -113 105
5429 105 51 -12 4 0 -67 115 -39 0 181 86 171 -126 3 202 -137 91 42 34 -172 -58 -127 -90 -4 106 -237
5454 -237 20 65 62 2 -323 -288 -24 4 171 -157 -234 19 -56 -196 -22 16 -25 -103 49 157 -286 262 279 -197
5478 -197 120 191 -74 -26 445 -88 -273 -255 151 60 -54 93 176 -254 237 98 47 132 -300 -295 16 -35 86
5501 86 -233 -74 57 -71 -109 177 -225 -31 50 -116 -256 -224 43 -14 -264 -413 109 -346 -144 213 -92 3
5523 3 191 -86 -55 53 120 -144 -321 43 53 50 87 156 -75 -52 71 196 -73 66 121 -211 189 81 -99 -205
5547 -205 163 -237 95 -172 246 -220 174 51 233 14 -57 -250 -114 -27 -31 -228 -191 -59 24 -112 9 144
5569 144 -187 53 29 115 -84 -88 17 -174 -37 219 56 92 6 194 -34 85 84 -45 120 413 89 -85 -143
5592a43k7R4lK44k36l3j46L54kl5J9J39l70K02J80l02M1J42l76O4N1J22J51Op3
5617F3j22m8J03J73j23L28m17K19j15k84M19j26k96M21k56jK88k73K15J9k30J15
5639G2k87jK54k63J30K6J33o4J75k08J43M9j95K47j88Q0r9j47j3J25K99Jk10j78
5663a19K06j08K79o65M87k21K32J99m71J63j08M5p1J18K22k73j34K90k11p3K51
5684C8p2q2K07rj17q2J37o0J96k4l32LL83m00N12k14k08K13M3N0l77K65K8j02
5708dL03k44o6K63m12K2q6K50J69l31L03j48k65K63k2J20Mk93K17K8j3p2o1o3
5732a38LJ21l9M3k0j34K24k2J40j73o5N1L9J23K0l38k02K48L10Lj64O6r3k27M06
5757A82J6j53k14O1Q7l8K85l90J16K05j66N8K3j35j81M41k9k33L32m1l49J49j5
$$ plain form
5592 -143 -170 -76 -79 165 -71 -104 -250 104 102 67 86 225 -145 57 237 -65 -24 118 -258 -194 -143 -21 130 136 63
5617 63 -59 -107 -4 169 46 374 -43 176 61 -223 196 70 -226 195 -61 -62 226 -47 168 187 -43 72
5639 72 -215 -216 38 -225 -95 -69 64 0 175 -33 110 159 -36 211 23 103 4 -143 -156 -31 268 269 59 -119
5663 -119 87 -21 258 -407 80 -141 91 290 -181 -18 -126 -81 -152 -34 188 -85 -219 71 -140 -213 38
5684 38 -34 -116 91 82 -35 -117 20 -40 156 132 -200 -197 186 -214 298 84 -124 89 132 182 -195 70 98 -4
5708 -4 299 55 -11 252 -160 -138 -224 26 195 -136 167 19 -246 17 -5 115 119 -174 43 71 58 -14 -75 -138
5732 -138 -135 -14 -53 -10 -30 -164 60 38 178 5 -60 -9 30 153 173 -165 -367 -119 191 194 30 96 3 -224 182
5757 182 198 45 -169 -108 -21 -59 226 -164 -48 157 -9 49 72 -63 -244 197 168 -65 267 226 -123 26 11
5780A1J37j06r3K0J05r4Q8K22l78P5J17R7m64L66k92M2J06J9j33N1K0J89k53J14
5804c4J07j68p0K62R8l58J76Kj28j94L43j03o2qK22j84J17j8j08K86l22J67m14
5827c91L21J59k52L21n2Np2K75k09j85q7K81l42R9L31j09m8j29K12J08n05K45
5849b4J2J19mk16K14J74j94k62J65k3R4j27L3Mj01J97j7j74J2m5K76k16K51n2
5873I6J9k07N9J19j76Q6r0J47k5j97L38j67nJ57j57N6J21k52O6J5K03k13j06L09
5897A96l03L1P5j6k2K82j66j14m1K71l14q5L53k18j59j00M40j23o1Q9K1N1j38
5920e1J25N9m6j03P2k10L99n8l53K79oj41J07j24M4k57N15l1j58J49N5m45R3J66
5944H0k4j96J61o1o6j03K92k59R9J83L4j45p7M44j94q4j29K04p5O7k67j4R6K5
$$ plain form
5780 11 148 42 -51 -31 74 -20 68 290 -88 -13 104 201 -263 103 -189 -147 -41 -22 -155 -104 -84 105 -148 -34
5804 -34 73 -95 -165 97 195 -163 13 15 -113 -307 36 -67 -129 -137 85 -99 18 0 -108 178 -144 23 -391
5827 -391 -70 89 -163 158 106 111 39 314 105 -80 -167 114 -228 -129 202 93 45 -84 128 236 -269 -24
5849 -24 -12 107 103 -113 101 275 81 -181 -16 -39 55 -72 -39 -35 -136 61 44 -130 -118 -163 113 -103 148 96
5873 96 115 -92 -33 86 -90 -4 -94 53 28 -169 169 2 -3 154 -3 53 174 -78 -12 3 206 -7 -113 196
5897 196 -107 -76 -1 -17 -39 243 77 -37 -78 193 -121 -206 147 -71 -230 -330 110 -13 -74 15 36 87 -51
5920 -51 74 133 87 -16 56 -154 245 187 -166 113 107 -34 73 -51 -7 -264 251 220 62 211 266 -179 -86 80
5944 80 56 -140 21 -40 -106 -209 83 -176 -77 106 140 -5 -82 362 168 84 -45 159 84 151 -116 -130 -34 -9
5968iM5O4k45J72J15q7j8m2K3k4j30Oj2m8rn2L98l3j95J34p7j75M71j13k10J02
5994E1mk23J11J65k17R8l52K23L23j26j43M03l91K14J37j38j1O9p4j48Q5K5k07
6017a30O3p7n2J23M5J7k38K3L67k04j42K79o4j5o6R5q1l8p6O8j83M81m2p7P3o9
6043H0n1N3O6Lp4k9J29j00j88J37k66L76j17j9O9O7l18L6J05L5K3j58K27j54k
6068g0J94j31o1M0N4j95J94j93J52k50J95Q1j89J48L37l44NK2J91m90O44k73k63
6091b02K30J11j85J4j26PL31m06L63k43j08kL74j96J30J23r8k01k3J94j72K4j01
6114a62r6K04j37K77m01K14K13q0J19O4j41o1J18l0k30J27O4J48k02K78k6n7k38
6137c5L61m63J35J37r8p0J20j59K55m58K18M75n39L40n38J72L27k85J41J11k01
$$ plain form
5968 -9 36 100 -145 27 142 55 37 -5 18 -6 -136 -130 -142 -190 -199 -251 147 114 -81 53 -24 -199 272 159 -51 51
5994 51 47 -176 -65 100 -117 -19 -371 -148 175 49 -94 309 -82 132 269 131 120 189 115 -33 52 77 -130
6017 -130 -67 -144 -196 -73 -28 -11 -249 -226 141 -63 -205 74 10 -5 -71 24 -57 -95 -171 -103 -286 195 153 76 149 80
6043 80 29 82 148 151 77 48 177 77 -111 26 -240 136 19 0 69 136 -182 -146 -41 -6 17 -141 86 -68 -70
6068 -70 124 -7 -68 -28 26 -169 25 -168 -16 -266 -71 10 -179 -31 306 -38 -33 -11 180 -310 334 61 -202
6091 -202 28 139 -46 -32 -158 -151 180 -226 137 -106 -214 -216 158 -38 92 215 117 -84 -107 87 -85 -61 -162
6114 -162 -258 -54 -191 86 -315 -101 112 32 151 215 74 13 131 101 -129 -2 62 210 8 286 260 203 -35
6137 -35 326 -137 -2 135 37 -33 87 -72 183 -275 -57 418 -121 219 -319 -147 180 -105 36 147 -54
6158e4o0K83p0p1j58K98l5M7j10j63J58j36J84l91K48j49K44j10k80L09j00N9
6180e7j2L61k31J59k52k13K42r9j0J0QN4Jp5J27k45K62m5l4j02O3J91l9J2P1j69
6206b2M5JJ14j14p0J9M7o6J69j23J9k2q4J26k5P3L1J13l66k21M9J50O17p62K05
6231i7N38l56l68o0J31l9k80N67l27J78K52l18L60j95k21N68m66J68R4k82J94
6252D1k06K50j16J16O8l40L30rr3J86k54j3n4P1J16L9j74J90k17K3L72j35k50
6275e9R0K2J9j02K42j07l7O4j81P5K79l99Q5M3p7m7J15P8M1k4k28K16mo2P3q3
6301C2J40m15M97k43j26J89l12K24O4n5j6o6J15p3j7J18l4J5k25L55k81P8J43
6324A07j75N6J51k87j85L69l2K86l58J3k21L02j6j10J60k80L01o3J84j79l23K52
$$ plain form
6158 -54 -114 169 99 28 -130 168 133 180 70 -93 65 -71 113 -278 -30 -179 65 -45 -325 -16 -116 -57
6180 -57 -69 292 61 220 -32 -245 -3 -102 -112 -102 -94 -40 -39 -114 13 -232 30 -15 -49 -151 -88 103 64 76 147 -22
6206 -22 23 24 138 24 -46 -27 20 -46 123 0 19 -3 -87 39 14 87 118 231 -135 -356 -307 -157 460 -302 -97
6231 -97 441 85 -283 -343 -212 -251 -531 36 -291 -113 139 -179 181 -14 -235 333 -133 35 129 -153 41
6252 41 -165 85 -31 85 153 -187 143 134 41 227 -27 -40 -94 -23 93 132 -42 148 -69 -46 326 191 -59
6275 -59 31 53 72 -30 212 105 68 132 -49 26 305 -94 -9 34 -43 -90 25 103 144 120 -108 108 104 42 115 32
6301 32 172 -243 254 11 -115 74 -238 -14 50 -5 -21 -87 28 -45 -62 56 22 37 -188 167 -114 -36 107
6324 107 -68 -12 139 -148 -333 36 4 290 -68 -55 -276 26 10 -100 60 -220 81 18 202 23 -300 -48
6346d8K74l59J64j85J98j9l3J85j21l6l7k1Rp7J7q8K98j43k24K99J23l0l41K01
6370FK55l21K9j22k44K53L15Q5l13J80k52J51r9n8jM49p8j86K17k79nm4P8j13
6394i7J30k21J23J73n17P37k73k41J02K34k43J10j60o5K71M6K5k69o3K38M0k05
6416a25k56N31p2l16K04%k30J49ML16l66P0j61N15k07J11r5j70J26K1l80J7L91
6439G7k0L8M2q3j85K67k36K22k90K18j18R5j1j50K81j19j55K31m27M75k90J88
6461E0K8J09m83L70k22O7J22j70J24k96M37L9k90M4J23N9k42J31m1J1L35k53Q7
6484A39p5P1j67r5M07l01j79M67p8r4m7nK39k62q8K03k24J15j5j39K0K56k17M33
6508C64k85r0k23K60k70N23m37L81l92L32k04Q8k50J88KJ50M2n02K73k50J60Q7
$$ plain form
6346 -48 226 -133 31 -154 44 25 -8 177 56 20 -17 -38 -29 -106 -89 -177 121 -22 -246 53 176 146 -195 6
6370 6 261 -60 -31 -153 -397 -144 171 256 -57 123 -129 22 -77 -135 -136 313 235 49 266 -13 -18 -62 16 -97
6394 -97 33 -188 -65 108 -409 328 55 -186 -84 150 -93 17 -143 -208 63 109 134 -135 -198 40 80 -125
6416 -125 -381 150 78 -238 -34 -34 -264 -115 -111 205 -161 -91 -252 263 56 167 72 -98 28 49 -331 -314 77
6439 77 57 95 137 54 -131 136 -100 122 -168 50 -68 27 16 -134 147 28 -127 104 -323 152 -138 50
6461 50 78 187 -296 74 -148 -81 41 -129 -5 -301 136 175 -115 -71 52 111 -131 0 -41 -30 305 52 139
6484 139 64 135 -32 -127 280 -21 -200 267 189 95 48 43 282 20 -68 135 -89 26 11 -128 -108 148 -69 364
6508 364 79 -11 -234 26 -244 279 -158 223 -169 163 -41 47 -203 -15 -13 137 179 -323 -50 -300 -140 -53
6530e3J63j16P2l9k37N4P5j11L8K79m38M36m68M92j35l0N9O8k48K19m4k63J92
6553c5Nj10l7M77m00J68r7K12j15m01N43j45l77K77R1k68L04j1K7j91R7j58K07
6576F3K32l01n4j00K40k25%N5J71j04j6j37K76k4l46O3N40l36J71k31j10J10O8
6599EJ78k53r9K66J17k06J88l49L21q3Q8k36J45M4k88L98o7n0j89J41k87M21j31
6622G4j89R2p1l5k4J73J0J5j23PJ75l96J85K70k75j00J92p6K60r8L6l56L02j30
6646h2k4J18q3L19l25J11q3j88K91K3J03j70J72j79J04j67J73p4j93Q0j67j5J52
6669a04j77J14l7K81j4J77J04k93j29pm4K26j30M7k91R0M52l47P7J02L8j26j05
6692i6J66j46q8K22o6oJ4j50J59NJ09m8k09O8j7J24R5j13j5q0J32L5k6J20j45
$$ plain form
6530 -53 110 -6 66 27 -210 -156 -81 -192 -154 125 -313 123 -345 147 12 -18 41 109 -139 80 36 -227 -35
6553 -35 -30 -140 -177 300 -100 68 -29 183 68 -333 210 65 -312 -35 56 -212 92 81 108 -83 14 -144 63
6576 63 295 -6 -60 -160 80 -145 -145 -90 81 -23 -39 -176 100 76 -270 -207 333 -3 168 -63 -173 -63 5
6599 5 183 -70 -169 97 214 8 196 -153 168 85 173 -63 82 126 -162 236 169 119 -70 71 -216 205 74
6622 74 -115 -23 -94 -129 -153 20 30 45 -78 -71 104 -292 -107 163 -112 -212 -20 -96 164 66 102 -254 48 -82
6646 -82 -106 12 -71 248 -77 34 -49 -237 54 77 180 10 182 3 107 -60 113 39 -154 -74 -241 -256 -104
6669 -104 -281 -167 -204 77 63 240 344 51 -78 -85 -129 97 -33 14 -277 -187 265 -82 -5 97 135 9 -96
6692 -96 70 -76 -164 58 -8 -14 0 -150 9 14 123 75 -134 -66 -83 41 136 23 8 -72 60 95 69 189 44
6717D4m7M7J59L0l95j4J29K4PL7K9j48K78j99l9K4j20O1N9K11K15m21J62R2j84
6742D1R8K8j84r2q2K69n9K21j44r7o7K31m22K62K75m29R0K68n6l59k4L39k57J91
6766D1M6j38O5j16O7K29l9m2p8j43J20R6k73K14j14r3O1j70K09O1J25j12j80K25
6790F1m6K48k55k8P5p3jL01l65L4j9J90J11k55R0j28K96m84K26j5R4k01k4K93
6814A25k98L5k54O1M22j88J4L70j20j43n2j4j81K69j29l5K7R6j00J13R8j26qK0
6838Bl5J09k46M8j08l3K36j78M07l54k4L56j41OO1j34l2P3oQ4O3k43K38R2l07
6863f6J98J4k4l47K17M2J12k12J33k67M76m03M2J04K67j78j05K7n8K61j47Pl14
6886b21K64j71m7K20NJ12j7J7J8j17K53k93j11K43j59n1K29l05J5j11N36m25Q8
$$ plain form
6717 44 -3 44 203 233 -162 -176 -47 -23 -16 21 50 -98 180 -19 -58 -34 -154 -93 -34 177 392 -29 133 225 41
6742 41 139 167 -17 -109 -191 78 19 240 96 -1 -68 163 -259 3 278 -151 -61 207 151 -208 -232 107 -150 41
6766 41 87 -51 14 -102 -35 194 155 113 35 -108 12 108 -165 49 -65 -158 -97 -267 -58 3 128 16 -164 61
6790 61 15 263 8 -20 55 -18 -19 282 -83 -49 -68 122 233 -22 68 -60 236 -248 -22 -37 57 -144 -168 125
6814 125 -173 -138 -392 -331 91 -97 -83 287 167 24 -28 -42 -223 46 -83 -118 -91 5 -95 18 116 -10 -18 2
6838 2 -33 76 -170 -122 -230 -263 -27 -205 202 -152 -176 180 39 45 106 -28 -60 13 7 91 154 -89 149 241 -66
6863 -66 132 146 122 -225 -8 34 146 -66 67 -200 276 -127 -85 19 286 108 3 30 -28 233 86 93 -221
6886 -221 43 -128 -175 45 50 162 145 162 180 63 316 23 -88 155 -4 -55 174 -131 -116 -227 309 -116 -28
6909b8m1N3K39j97J9K49m64L57k43L2J0q4J33j40j5J49m8J92l5j51M5k75L38K0
6933A15k0j18k10N0o2K09J92k39j9n6J16j5R7P8k41K8n3K31j22K45k91J31q9P9
6957C6j71l5J47J07m9n2K3k8M2M9j43J48q6L29m46K56k48l8J86J00j63m16M75
6980B3K62j88m94M23j08K4K5j5J5K88k42j4k0j25N2L5j30N04k43k26j6J86j61
7003a45J72j45Q9r6j31K37k3j3K81m07M60j41l50K42pk93J63J87j63l3J08J71
7025A63j06N6R6k20j73L22j6j01k56J50l6k0L47k21J52q2j69J41o6n6K14l13P2
7048a22q9L57lj75J31l37K25O0j40K59j19J49m64K06j4nO3j92J76l66N51k35j04
7071a88mL29n2k35L22m8j66j0J42j75K14m1r4m26L38J58Q0k05M0K0L4J48k62L48
$$ plain form
6909 -28 -69 -16 223 26 45 294 -170 187 -56 -24 -14 -98 35 -105 -120 29 -19 173 138 -13 32 -243 95 115
6933 115 95 -23 -233 -183 -245 -36 156 -83 -102 -158 -42 -57 40 118 -123 -95 -148 83 -39 206 -85 46 -43 36
6957 36 -135 -170 -23 84 35 -17 6 -22 20 69 -74 74 -12 317 -129 127 -121 -159 27 127 -36 -452 23
6980 23 285 97 -397 26 -82 -58 -33 -48 -33 255 13 -1 -21 -146 -94 -59 -189 315 72 -154 -170 16 -145
7003 -145 27 -118 -29 -125 -256 -19 -42 -55 226 -181 279 138 -212 30 23 -270 -107 80 -83 -116 -8 163
7025 163 57 113 209 -11 -184 138 122 21 -235 -85 -121 -141 206 -15 137 55 -114 27 -39 -95 119 -194 -122
7048 -122 -211 146 143 -32 99 -238 -13 47 -93 166 47 196 -268 -62 -76 -81 -18 -210 -34 -400 151 -84 -188
7071 -188 -192 137 85 -150 172 124 -42 -52 90 -85 129 88 -6 -432 -94 64 144 -61 -21 -1 33 181 -81 267
7095B67l06j05K1P2L33l97J60%j29M8K81m94L66K99m65J39m60L16j22J73j11J38
7117B4J18q3l38M06p9j39o5R5K53k47Q1K20j88o7PL7l03J76k22N95j10l18K18
7140G1k71L0Q6lJ49m8n9O1k4P7J0j2k6K31k66J15j31N3l57L80l24L73N7j69m6
7165d3k4q6j5K51mJ91k08J16j53K17k87J3L77m42R7J20k3j76J55kl60L10j41j11
7189b28k8L12J8j03jJ99k13Q2j01J36Q8m9l28k0K7L49j42J81q2KO8l36O5p6L05
7214A25L8J24j67q7l37K36K38J2Op3J42k32j1N0k01J85K3j02K12j82N9J49k75
7237f8r6M67l70j9K71j18P2j49K03j74j08J92j22JmN6OJ21j14l21K71j91o6M36
7261A76M4k70J41j90J96j78p6K21j11M5Q3q6N5N4j37m6J45p8nM9M1K48j66j10
$$ plain form
7095 267 -39 -144 -123 -51 282 -115 45 45 -84 -36 245 -249 117 416 -49 90 -370 -54 -176 -3 -114 24
7117 24 142 59 -279 127 48 -91 -156 -61 192 -55 26 246 58 -9 -2 35 -268 -92 -314 281 171 -147 71
7140 71 -200 -170 -84 -87 62 14 -45 16 -8 69 79 67 41 272 6 121 -10 43 -314 66 -258 115 172 3 -43
7165 -43 -67 -153 -168 83 79 270 62 178 25 242 -45 -32 345 -97 0 120 97 -79 76 74 -286 24 -117 -228
7189 -228 -256 56 74 -29 -30 169 -44 38 -63 73 161 112 -216 -236 -209 140 -2 179 97 99 167 -169 -104 -180 125
7214 125 163 287 120 33 -304 -68 170 182 188 115 257 25 14 64 -137 48 71 -31 181 -1 58 207 -68
7237 -68 -164 303 -67 -86 185 67 139 -10 193 19 -89 103 -19 -18 -22 34 40 161 47 -274 -3 -194 -260 176
7261 176 220 -50 91 -99 97 -81 -157 64 -47 -2 81 -5 50 104 -33 -79 66 -12 -17 32 73 321 155 45
7285D5k66J89m3j33L01q2mL7k62L11j35n6k22L29rQ8n9j45P4j33J90K0j24J02
7309A3j23k1J47k64j12K05K20p7J03l4q3K08l40N10o35L87j22P0l11K2J53J89
7331A05m2k8J1m4K26l33j3m5L06j77m9K04k95l0J05K31P9j36K36p2k89m1M0P8
7355B7O7j83l3K60m09L90j15N3k02L22k43L71j47m24K92j55K14O0m8J22k89N2
7377a8M5q3K18J36n07K9p7J37L69m42K92j12o5L36j45J6j05L8j44RO5j94K77r
7401F6N6l88L40k31J86j89O2J33j7p2J26oj15k6J71R1k10N5n7r8J91R9p2j48K02
7426A49k07J41j47n1K8k4O8M7N3K46k31k68K53l24K22q3K79l36K51j51K57j34
7448C8m3Mj29L43j68On7J55l92L24k27L44j60P5J11l69K96l72J91j05J13K61k92
$$ plain form
7285 45 -221 -32 -75 -208 93 11 7 44 -218 93 -42 -98 -320 9 0 88 29 -116 -42 -175 15 35 -89 13
7309 13 -110 -131 16 -248 -360 -155 65 -12 91 57 -26 182 -158 352 -283 104 -18 52 -259 -237 -84 105
7331 105 63 35 46 2 228 -105 -118 -163 143 -34 -83 121 -174 -204 -99 132 211 75 311 239 -50 -91 -51 27
7355 27 94 -89 -122 138 -271 119 4 57 -145 177 -66 305 158 -266 26 -129 85 145 97 219 -70 -18
7377 -18 27 -56 162 298 -209 -180 -257 -120 249 -193 99 -13 -78 258 113 129 24 62 -82 -73 -8 -202 75 66
7401 66 122 -266 74 -157 29 -160 -98 35 18 -54 72 66 -49 -75 96 187 -23 32 -25 -123 68 167 95 -53 149
7426 149 -58 83 -64 -115 -87 -111 -43 4 57 303 72 -196 57 -267 -45 -128 151 -185 66 -85 172 38
7448 38 -5 -1 -130 213 45 51 -6 149 -243 81 -146 198 38 113 224 -145 151 -221 -30 -135 -22 239 -53
7471e3j43mQ4L74rp1k03L9L5q6J68j58m5o2%M79m75j25K86o6K22j22n8j82J51
7496b4O0L8k60P2J59J2Q7J53k62J00l54L52Lk51q4J67QJ45k05QJ05m7k1j67j74
7521c80N30k62J50P7p8N8l63L88J50j92Q8k49p5N5L06o3j84n4N6p4K19p1kL7j52
7546h5k75O54j00k79m2K14j50N8j53J34Q2j27j31P4L73k00j53K66q4j16J37k65
7568a68M42k36j40J40J77m17L5k1J69O4k51M74l14J05K4j25K93l60P6K9k27J27
7590a04J28k34J32J29j10P6K07j04q7Lm7m8o0L18j92o6r0J17j9J36N8l93K95Q2
7614A27J77k80j10J58j10J22k68K12j41M55k22Rj24n2q0K97J74o65J37K70o5p8
7636e7k24L70J58l25J21J26n1l97L11j82L73j07j15n3j03M09j95k2o5k3J59K39
$$ plain form
7471 -53 -196 -200 -116 258 249 178 -25 14 49 -37 131 -27 -72 -134 -134 345 -130 -255 31 -35 187 65 7 -175 -24
7496 -24 36 74 -186 -114 45 57 144 297 35 135 -219 133 136 -115 -199 -32 -24 121 -84 -76 29 -18 -39 -206 -380
7521 -380 150 -112 38 115 37 95 -268 120 270 78 166 -83 -158 -103 203 140 -44 -98 -42 -116 103 32 30 67 -85
7546 -85 -360 294 194 -85 -127 87 -63 -5 -158 -24 58 -69 -200 -126 247 47 -106 160 76 -40 97 -168
7568 -168 274 38 -102 38 215 -202 -167 -188 -19 45 -206 268 -46 59 83 -42 251 -109 -33 -4 -231 -104
7590 -104 24 -210 -78 51 -59 17 224 120 33 36 -11 -59 -119 199 7 -59 -149 -32 -51 85 143 -250 45 127
7614 127 304 24 -86 72 -38 84 -184 28 -113 342 120 129 5 -47 -127 170 344 -321 -184 86 21 -57
7636 -57 -281 89 247 -78 43 169 118 -279 32 -150 223 116 1 -52 -155 254 59 37 -28 -51 108 347
7658C47l52Q2k4Rj92J96l58M41j99J77k24K95j90J2J45j76j4K87l0k09r3o5m3
7681a78K13k27N4L90J03l82J28k33K67j57L2J95l16J45j03J60m6J12j92j59Q8
7702a06J96k74M80j43k48Q8OK4o9j36J94L60l63O2J9J37m07K43q7j03K97l3k70
7725a33R9J84j55p7L21l78j26J86J20R5k38J32J15o1j33K5R5l32K09J20j2L3L3
7748A22j01Q1j87J83j67J56j88j30L20q0JM4j46L46m33K14l9l0K19j76j12Q3l5
7771e5J49K46m30J1pr3j2M40l17M65m58p1J14K57k70o0K91k03j32M16k00j50j0
7794g9K05N1k8l24K9O7J67j28K4j3o0J26Q6l91K72Q3q9O2j29J26k9L2o6J99k73
7819h0j15L22q8J61j61p5lq8J45m7O6Q3j96l7K87l6j88M62k23O1l07k61N13m3
$$ plain form
7658 347 -5 77 53 62 -130 66 -292 149 -50 127 -97 198 8 20 165 -11 -25 262 232 23 -70 -135 -178
7681 -178 35 -192 -138 252 355 -27 101 -132 135 -22 10 205 -111 34 -69 91 45 157 -35 -194 -106
7702 -106 90 -184 296 153 -95 -7 -1 23 -46 -182 12 372 9 71 90 227 -180 63 -24 -127 170 137 -133
7725 -133 -34 150 -5 -82 239 -139 -265 -79 41 136 -102 30 145 84 -49 -24 71 -261 -52 68 56 89 122
7748 122 21 102 -85 98 -69 87 -101 -231 89 9 10 54 -92 254 -179 35 -4 -34 185 9 -103 -20 -55
7771 -55 94 340 -90 -79 -86 -179 -191 249 -68 397 -61 -132 -18 239 -31 -91 200 -3 -135 281 81 -69 -79
7794 -79 126 177 149 -175 -146 -79 88 -40 -16 -29 -89 37 123 -268 4 87 -2 60 -69 57 28 60 -6 193 -80
7819 -80 -195 127 39 200 39 -36 -39 -127 18 -29 37 120 -76 -113 174 138 -50 412 189 250 -57 -318 195 152
7843A52l4J38j27j52p6J35m0k32L36j08k29L03j66k78J16N19k24k3m2r1J36J28
7865A41k60J88j27J97q4Q8l12L69k82J26K67n14J98J54k6j34k4J77r8k03J33L7
7887A1K01k37J81P9j71J6J11k13j36l8J11M0J23k10K49q4j5J13k17q6k9K13J32
7910A44j28L4N7j37J8j72J30K98j56m0n1j27J24R3p7J34Pj55l6j02K40j17Q4Q2
7934A47r7P1j64j50K06j89n6K77k30J65l30O75j95k94J82j2r0J21k15K67j65J9
7956e7o9J81k85K58K20j98n9K9k34K65ok30J96K23j08mj06k2J85k7j26K17j10
7979A33j48k27N49m14L3J50k85L33j02j19J24R9l15K24J19o7J38k18j60P9L99
8000C25k77j78J35J36R6m17K92j16J41oj56L59j53p6j45J14k0j70J01J02k72J44
$$ plain form
7843 152 118 256 129 -23 -99 36 -4 -236 100 -8 -237 66 -100 -378 -262 257 33 10 -32 -123 13 141
7865 141 -119 69 -58 139 55 143 -169 200 -82 44 311 -203 -5 149 123 -11 -35 142 44 -159 -26 11
7887 11 212 -25 156 235 64 80 191 -22 -158 -196 -85 -45 78 -132 117 33 18 131 -86 -172 -201 12 144
7910 144 16 50 107 -30 -12 -184 -54 244 88 48 -3 -130 -6 87 10 144 151 -4 -40 -142 98 -19 65 147
7934 147 50 121 -43 -193 13 -176 -232 45 -185 -20 -350 325 130 -164 18 6 -84 37 -178 89 -76 -57
7956 -57 -126 55 -230 28 248 50 -9 20 -214 51 45 -185 11 234 126 122 16 -6 179 152 26 243 133
7979 133 -15 -242 307 -107 -74 76 -209 124 22 -97 27 126 -189 35 154 87 225 7 -153 -74 325
8000 325 48 -130 5 141 237 -180 112 -4 137 131 -25 334 181 105 -40 74 54 -116 -15 87 -185 -41
8022d1j70N4L64k01O0Q1l75K33K02J23l59J77k5k01Q5M2k36L85j96N4o2K63k15
8045D2j99L25r3J1j32Q7j83Q5PK14j04j23NQ2q5N6l6n6J21l34K56K63r3n4j72
8070a10o8J26Q6J94l89K34j99J05K9J28n0k22L54k31k99K92K9O2L3m66M53j50
8092e9L8j30M02j28m04L87l7m2l3J37j61K59k31n2M6M8k17J89r5K25j07N7J13
8115B05j02k4k32J63J42k73K07l04O5J70J2J55l46k2J61K75m3k53L3Q1Q4j50J07
8138A11j23J69j96l4k1R6J47l13M43l94J82K06j93J27m9j05m1J89l23oK19j73
8160h2J21N4k62PK50k21J2J88k85R3J83j17K88m33R4K22k6qk08M2J5J22Q0j86
8184e7J5j7J5R0l1J62j80
$$ plain form
8022 -41 -211 -157 207 6 66 147 -228 5 207 330 -29 148 123 -78 7 49 -187 198 2 56 -6 257 42
8045 42 -157 168 75 86 -46 41 -142 -57 -50 164 60 -63 -58 24 -61 -5 -41 -97 24 -310 -54 209 116 62 -110
8070 -110 -178 -52 34 228 -161 73 -126 -21 8 136 86 -136 218 -13 -312 -20 9 71 104 -362 91 -59
8092 -59 -21 -151 251 123 -281 106 69 27 -6 131 -30 229 -2 -54 -8 40 -177 12 -83 142 35 92 205
8115 205 103 79 -153 10 152 -121 86 -218 -153 17 29 184 -162 -184 -23 252 209 -44 -11 70 154 4 111
8138 111 -12 157 -39 -73 -94 2 149 -164 279 -115 67 273 80 207 158 53 12 201 -122 -128 91 -82
8160 -82 39 93 -169 -162 88 -133 -121 67 -218 -125 58 -59 229 -204 -110 112 86 78 -130 -88 -73 49 129 -57
8184 -57 -42 -59 -44 46 15 177 -3
8191c
$$ Imaginary data points
##PAGE= N=2
##DATA TABLE= (X++(I..I)), XYDATA
0@%%%%%%Qj6J6j6K4l2M0n6P2q8J12j44J74k06K48k97L53m18M91n77O74p80R00
29D82j036J189j359J547j755J984k238K519k825L160l530L935m375M856n385N962
45C131o590P276q026Q849r751J0739j1829J3036j4378J5874j7554J9458k1633
58a1398K4144k7080L0571l4803M0060m6788N5753o8373Q7569j20594J92621o11404
70d89722M44124R89489j173307j78984P14069j21117n33622O11929J86427q40614
80c91328r3044R11406j34130o64566K27474L90443k61808k447K01911k77567k55833
91c49489M28961K25285m23714j33510L73159l10j62007J54353p302k85845O5357
102a15062K91378n9405k62330M7742J40889r8412J8819K21210j05171k75067J17727
$$ plain form
0 0 0 0 0 0 0 0 8 -8 8 -8 16 -16 24 -32 40 -48 64 -80 94 -112 136 -161 192 -226 265 -312 362 -418 482
29 482 -554 635 -724 823 -932 1052 -1186 1333 -1492 1668 -1862 2073 -2302 2554 -2831 3131
45 3131 -3459 3817 -4209 4640 -5111 5628 -6201 6835 -7543 8331 -9223 10235 -11398
58 -11398 12746 -14334 16237 -18566 21494 -25294 30459 -37914 49655 -70939 121682 -489722
70 -489722 -45598 943891 -229416 -408400 305669 184552 -349070 262859 449286 -391328
80 -391328 -484372 427034 292904 -371662 -144188 246255 -15553 -18000 183911 -93656 -349489
91 -349489 79472 304757 -118957 -252467 120692 120382 -41625 112728 105426 -180419 -115062
102 -115062 176316 116911 -145419 -97677 43212 -55200 -36381 184829 79658 -195409 -77682
113g7682K59876j21371k30397J63627K05289k46715j48747L10517M1806l28567
123a72364Q3759L18121j89939l14077K44237K60360k69757j14713K82347n7863
133G0111k27269K03000J22686k64983r933K31798j22756j72249K41859P8528l24038
144a73246N7655L36560j84640k25186K85525M0255l53597J18867L65116k20926
154D6383l01900K95926J69669l38025J0792L19752j95392k50867L06938J39388
164B02664l48931k7678L49872m6081k83271J21723J64358j95697l5260K26366
174A28065o6921k14786J08693J78843r3970j20879P2663M4218o6619L4950N4463
185E8720r8828m2892J17037L8041r4472k3890Q3577l185q6091M7676P3945j00106
$$ plain form
113 -77682 182194 60823 -169574 -5947 199342 -47373 -196120 114397 156203 -172364
123 -172364 -88605 229516 39577 -274500 -30263 230097 -39660 -154373 127974 70111
133 70111 -157158 45842 168528 -96455 -106388 125410 2654 -169595 72264 150792 -173246
144 -173246 -115591 220969 36329 -188857 96668 136923 -216674 -97807 267309 46383
154 46383 -255517 40409 210078 -127947 -117155 202597 7205 -243662 63276 202664
164 202664 -146267 -173945 175927 129846 -153425 -31702 132656 -63041 -98301 128065
174 128065 61144 -153642 -44949 133894 39924 -80955 -8292 35926 -30693 4257 58720
185 58720 -40108 -83000 34037 72078 -22394 -46284 37293 34108 -51983 -4307 69638 -30468
197c0468l9678J36099j965j50365L9754J51924p9915j33915J32658P4247j91444
208i3068J0085K12537r1617j80057J53792J18888j87621l4380K10260o2467k06159
219a49807J55796J48849k22347n4809K28693m8252j87303J27782J21491j78359
229e8266l9856K01185n7011j84917J53359J23172k04293k6618J98972o3723j50271
240a08267J29044Q4182j77554j8017J96948o1006j78467J34437J18170j68402
250d8932l6283J58206l2154j25615Q1378R2758j22194n3983J51022N423j46413
261g6787M4956J07623p5024o0562Q0539K4578q4976J535R3498l3361q8596O9563
273B986N8624q7286k0122Q2440q128p3225L0606P0141n9157n7449R4204K0142
$$ plain form
197 -30468 -70146 65953 63988 -86377 -46623 105301 25386 -108529 24129 98376 -93068
208 -93068 -82983 129554 37937 -142120 11672 130560 -57061 -91441 118819 56352 -149807
219 -149807 5989 154838 -67509 -122318 106375 58123 -129180 -1398 120093 -58266
229 -58266 -98122 103063 46052 -138865 14494 137666 -66627 -93245 105727 42004 -108267
240 -108267 20777 104959 -72595 -90612 106336 45330 -133137 1300 119470 -48932
250 -48932 -85215 72991 40837 -84778 -3400 89358 -32836 -86819 64203 69626 -76787
261 -76787 -31831 75792 768 -59794 20745 45323 -39653 -38118 55380 22019 -66577 2986
273 2986 61610 -25676 -45798 36642 28514 -44711 -14105 56036 -3121 -60570 33634 53776
285E3776j08403L0110R1315o9703o1188R0313L1497j05139J214J14572n0393j00500
297h2529J02500N4071j30004P148J23710n4348r8427Q5801P1288j11683l1919
308f4392J27891k5793j17503Q2096P2379j11599k0055J08032k0495r2604N0753
319a1290P3592p9830m0538J03169q602r8622N7002O7259q0013k9738Q1507K450
331C6346p9025K1283P3849n3729n4500Q0577J4983q5184K2827O9152m4065m9546
343d7032N6243L4803o8917j2587Q1352k2711p3344N7048M5975p2398j6301P1822
355C3953n419o9544K4621O3906n2543m3958P5828P227p8390K9404O1012m9188
367c091l8861N8557K0803o5747M188O8372l7196n2254O2728K0579o8595Q992N6984
$$ plain form
285 53776 -54627 -24517 66798 -2905 -64093 26220 57717 -47422 -46208 68364 17971 -82529
297 -82529 19971 74042 -55962 -48814 74896 20548 -77879 7922 79210 -32473 -64392
308 -64392 63499 37706 -79797 2299 74678 -36921 -56976 51056 30561 -62043 -11290
319 -11290 62302 -17528 -58066 45103 36501 -62121 -5119 62140 -17873 -47611 33896 36346
331 36346 -42679 -21396 52453 -1276 -55776 24801 39784 -45400 -22573 46579 2514 -47032
343 -47032 9211 44014 -24903 -37490 43862 21151 -52193 4855 50830 -21568 -37869 33953
355 33953 28534 -41010 -16389 47517 -5026 -48984 26844 34071 -44319 -14915 46097 -3091
367 -3091 -41952 16605 37408 -28339 -24151 44221 7025 -45229 17499 38078 -30517 -21525 35459
380C5459k8708m4126M1665L1224n6874r880O5730j9460n5022M2770L2869m9371
392a3724j1515M8068l081m8731J9465M7303l9504l4885N2160J1376n1661R253
404a5476M0666k2541l2730L5178K5161m9822q363N9393j6013n0944L6214L1998
416C2721m5441j1118M9254p964n2952L0172M8190n3525k8539O5010l884n8891
428c6967L1309M1204m8221k2097N9317J836o3463K6106N4283n1915k6864O3254
440B7782o625n6298L1859M1203m7124k5501N5769M330n7411K2005M4447m5439
452a1003j9575N2180l169m2353J6825K9016k2983j7155K9849L324l2511J3832
464c723K4166k4125r240K0898j150j2870N08J0159q10j3503O173J5857j2147j4126
$$ plain form
380 35459 6751 -37375 4290 35514 -21360 -31240 34490 15030 -39992 2778 35647 -13724
392 -13724 -25239 22829 19748 -28983 -9518 37785 -1719 -36604 15556 26932 -24729 -15476
404 -15476 25190 2649 -30081 5097 30258 -19564 -27927 31466 15453 -35491 723 32721
416 32721 -12720 -23838 25416 17452 -35500 -5328 42862 -10663 -39202 25808 21924 -36967
428 -36967 -5658 35546 -12675 -34772 24545 26381 -37082 -10976 43307 -8608 -35472 27782
440 27782 21157 -35141 -3282 37921 -9203 -34704 21065 25395 -32016 -10011 34436 -11003
452 -11003 -30578 21602 18433 -23920 -7095 21921 -1062 -18217 11632 14956 -17555 -3723
464 -3723 20443 -3682 -12922 7976 6826 -6044 -5536 4623 3813 -9690 -3517 12340 193 -13933
478a3933J1989J5867q412j9615J4651J6586k8895j41L6480k0784k9920L2182J5820
491B1875l5952k735L7233j4919l5743L8267K0679n8475R720O2478l9086m3933
503d0591N4537J7231n8139R384N7862l5941m9730O0906K3949p3201J4601O0501
515D1369m9529l0775O5257j64o4501K4761N4293m6170l3155O6527m52p0203L7022
528e720N1181n8872j9772N8925p565m5476K3760K8050l7102o900M7644j8652m3897
541c4396L6622J9115l7335J2020K5144k8525j2024L0618M585k7698L227K2867
553A4220j2800j0648J7421r623q915K2429o787j6093J3749j553j3126J4196J0471
566A2941j8291q178K1597J159k3566J5155J4890k8210Q561K8204l1144j5853L6210
$$ plain form
478 -13933 -1944 13923 5511 -14104 547 17133 -11762 -11903 24577 3793 -26127 6055 21875
491 21875 -14077 -16812 20421 5502 -30241 8026 28705 -29770 -20050 42428 3342 -40591
503 -40591 13946 31177 -26962 -17578 40284 4343 -45387 15519 39468 -33733 -19132 41369
515 41369 -8160 -38935 26322 26158 -38343 -13582 40711 -5459 -38614 27913 27461 -42742 -5720
528 -5720 45461 -13411 -33183 25742 18177 -27299 -3539 24511 -12591 -19491 28153 9501 -34396
541 -34396 2226 21341 -15994 -3974 21170 -7355 -19379 11239 15824 -11874 -8647 14220
553 14220 1420 -9228 8193 -1430 -10345 12084 5297 -10796 2953 1400 -11726 2470 12941
566 12941 -5350 -13528 8069 9228 -14338 817 15707 -12503 -3942 24262 -6882 -22735 13475
579A3475j254k8680J7024K0473l2313j2138M3099p336m3084L3062K7237m7136
591a7571j64M1210k3540k2812L9958P167m6139P789M2210l1492k7826N3106L443
604B5339n5948K0661L5708l8863r773M5334o631m0157J8122K7207l1648n273M0484
617B4562j5478k9858L0291L521l4181J7229K6330k4773j4431K4589m08k4686J6458
630h35J8293k7026j92K7378k0045j4661K8108k377k1693J7390J2804k4688m664
643a2208K3040j0390j6865K8409N479l6255J0130K3138k5428L86L4124j6518k9624
656b2582K4720J4907l2959L390L9860k0601l2046L4544O085m0253K0680L5414
668C1159l4497k0194L4336j490l1142K3131K5173l8901p625M4283j7617l6087
$$ plain form
579 13475 12221 -16459 565 21038 -11275 -23413 19686 12350 -30734 2328 29565 -17571
591 -17571 -17735 23475 -65 -22877 17081 24248 -21891 -14102 28108 -3384 -31210 21896 25339
604 25339 -30609 -9948 25760 -13103 -22876 22458 15827 -24330 -6208 20999 -10649 -15922 24562
617 24562 9084 -20774 9517 13038 -21143 -3914 22416 -2357 -16788 7801 7393 -17293 -835
630 -835 17458 -9568 -9760 17618 -2427 -17088 11020 8643 -13050 4340 17144 -7544 -12208
643 -12208 10832 442 -16423 11986 17465 -18790 -8660 14478 -10950 -10564 23560 7042 -22582
656 -22582 2138 17045 -15914 -12524 27336 6735 -25311 9233 15318 -24935 -4255 31159
668 31159 -3338 -23532 10804 9314 -21828 1303 26476 -12425 -20050 24233 6616 -29471
680b9471L5090J5782l8167R205L2424k7620k4788L8583J0827m0551J2119L3121
692B6554l4128j7271M1061n763l2588K5408J9715l3802r057L2292n385k4611K4243
705F668J3551l5103J711K8979j5209j1165K2286l225k0802Q925J3324j4255n466
718i781J9110m410j6457J4271L430j7650J0500J2604j3860j751R702o545n105
731e942R942K661j1629M996J0141j6817l722K0919r634j2863J9956o41k1398J0311
745c720J5434j4694o327K0670k817k5182J4791K0116k6602k445K9168j6322k0016
758a7946K4821N824k6585N396K4873j4766k0179K5572N755l0404J4018K5412k8106
771f315q996K9572p231k3155J6896J5417k2081n846K5141q330k3985K2971J1584
$$ plain form
680 -29471 5619 21401 -16766 -7561 24863 -2757 -27545 11038 21865 -18686 -6567 26554
692 26554 -7574 -24845 16216 10453 -22135 3273 22988 -10814 -19871 12421 7036 -17575 6668
705 6668 20219 -14884 -13173 15806 597 -10568 11718 8493 -12309 -3384 9940 -4315 -9781
718 -9781 9329 4919 -11538 2733 6163 -11487 -987 11617 -2243 -3994 5708 -837 -5942
731 -5942 4000 6661 -4968 28 10169 -6648 -10370 10549 915 -11948 8008 7367 -14031 -3720
745 -3720 11714 -2980 -9307 11363 8546 -16636 -1845 18271 -8331 -10776 18392 2070 -17946
758 -17946 6875 12699 -13886 -8490 16383 1617 -18562 7010 12765 -17639 -3621 21791 -6315
771 -6315 -15311 14261 7030 -16125 771 16188 -5893 -11739 13402 5072 -18913 4058 15642
784A5642k8352N600K0927j7425r271K0555R11j8065N352J5806j3829q426K0424
797I849m498j7056J5819N273j7789N954J0494j0306m061J1259r57j2512O452J0900
811H821j3824j992J6682r534r202J5888k639j2669J0156O612j2194j594J2346
824F857l727j2787J1654Q303j9456L358J7364j4123p872J7550k259j4476R352
837b62J0208j2985n758J7696k244j8771J3615J0774k0513J690J7707j0656j1091
850a0590J4008M211j4563P55J4831p627j1767J5949K541j7037Q100J0728j2279
863b740k788J1074j601r758N049P808r315l920J1705l483r356R042K068q560L272
878a503M648l659j952K686K507l743p4L876l331q19M500l799o20L626l558L8L041
$$ plain form
784 15642 -12710 -7110 13817 -3608 -12879 7676 8587 -9478 -4126 11680 -2149 -10575 9849
797 9849 5351 -11705 4114 9387 -8402 -2448 8046 -2260 -6321 4938 3981 -8531 -2079 8821
811 8821 -5003 -6995 9687 153 -9049 6839 4200 -8469 1687 8299 -3895 -5489 6857
824 6857 3130 -9657 1997 10300 -9156 -5798 11566 -2557 -10429 7121 4862 -9614 -262
837 -262 9946 -3039 -8797 8899 6655 -12116 1499 12273 -8240 -6550 11157 501 -10590
850 -10590 3418 7629 -6934 -6179 8652 1025 -10742 5207 7748 -9289 -1189 9539 -2740
863 -2740 -5528 5546 3945 -5813 -764 7044 -2271 -6191 5514 2031 -7325 1717 3785 -4775 -1503
878 -1503 3145 -514 -2466 220 2727 -1016 -1090 2786 -545 -1364 3136 -663 -1283 2343 -1215 -1177 1864
895A864k589j161J795Q34j961l26L387j300l880N554M95o908M504M500o765N6
911a901N247k361l951K886M038n459l072Q328k887o740P513J967q107K782N762
926D045l762l426M213L416p153j60Q475m740n608P415K06o331K183L281j600l444
942b990K345L335m739o71N735k849l424M701L60k750N22J965M52l952N33N272
958C845m127l056N602j069m247K239K709j442l546K396M457o045j007P638l647
973G00m157N678j34m656J795M015j798n705M294M661p857L59P667o135l651O994
989B070O5m675J334L266j366l969M257K618o690K994M874p139Q1N605k877k182
1005a734J957K80j173j623L169Q57m345K397J615l638L376O90l711L236l63k781
$$ plain form
895 1864 -725 -1886 -91 743 -1218 -1544 1843 543 -3337 2217 2712 -4196 308 4808 -1957 -1901
911 -1901 3346 985 -2966 -80 3958 -1501 -4573 3755 868 -5872 1641 3608 -4499 -1717 4045
926 4045 283 -3143 1070 4486 -2667 -2827 5648 908 -4700 2715 2921 -3410 -1227 2054 454 -2990
942 -2990 -645 2690 -2049 -2720 3015 166 -3258 1443 1803 -947 -425 1540 1992 -1960 -1427 3845
958 3845 -282 -3338 2264 1195 -3052 -813 1896 454 -3092 -696 3761 -2284 -3291 4347 700
973 700 -3457 2221 2087 -2569 -774 3241 1443 -4262 32 4693 -3164 -2805 4862 -1273 -4924 2070
989 2070 2135 -2540 -1206 2060 694 -3275 982 3600 -3090 -96 4778 -2361 -2280 3325 448 -1734
1005 -1734 223 503 -670 -2293 876 1733 -2612 -215 1400 -2238 1138 1828 -1883 1353 990 -1791
1021a791K661L79j262L3k59O02j838J012L120m807k92O101n642k715R030k040
1037B292o682M286L850m616k379O774N49r944N015P801j0325p21J0811o958o608
1052f855R262J869q528Q13R422m615r861J0339N533j3265L679J0009j0156l027
1066e381J0545j829p925L968N634o989l491J0520k196r903Q462L753j1265L869
1080b228Q064o735k972O055j02n462K485O281o910k593R226m306o553R812o58
1095C404r188O040L904p491l11P502k254p251O394M750j0719K248J1272r821n487
1110g008J2950k408j0047P858N452j1048j928J3066k911j3101J0694O402j6282
1123h311K845J5286j0347p761J3160M34j3289N426J2213j0184p041J4325j894
$$ plain form
1021 -1791 870 1249 -13 20 -239 363 -1475 -463 2657 -2150 -2442 3659 -1983 -4698 4332 2292
1037 2292 -4390 -104 3746 -870 -3249 3525 4074 -5870 -855 6946 -3379 -4100 6711 -247 -6855
1052 -6855 2407 4276 -4252 -3439 5983 1368 -8493 1846 7379 -5886 -2207 7802 -2354 -5381
1066 -5381 5164 3335 -4590 -622 5012 -1977 -5468 5052 2856 -7047 1415 5168 -6097 -2228
1080 -2228 5836 -899 -3871 2184 2082 -3380 -895 5386 -1524 -4117 5109 803 -5750 4062 3404
1095 3404 -5784 256 4160 -3331 -3642 3860 1606 -5645 749 5499 -5220 -2972 8300 -1521 -7008
1110 -7008 5942 3534 -6513 1345 6797 -4251 -6179 6887 3976 -9125 1569 7971 -8311
1123 -8311 -5466 9820 -527 -8288 4872 5306 -7983 -2557 9656 -528 -7569 6756 4862
1136D862j5763J1384J0179j5182j786J3337o590r505J1151N914j2801q35J3497
1149G862p574q803J3660M34j2776P584P434j0301k404R345k036q157O282N498
1163F048j0464J07R877p104m448J0064j525o993N208K284o908K025P122l620n681
1178d008O240K71q735O408O587j0162J40Q434o965m997R754J018q378L695P197
1193F499r259m428J3142j702j1432J0043M980j5027K458J2685p409p975J1836
1206D411K244j4660L172J3916j1233o779J6962k587j5937J0255Q501j3335l05
1219e375J4158n152j3217J0051P553j4860J533J6527j1028q997J3987r48j3208
1232h976Q211Q986j0003m177J1368l192j1810J0733Q457j4432J063J2240j0753
$$ plain form
1136 4862 -10901 483 10662 -4520 -6306 7031 441 -9064 2087 8001 -4800 -5635 7862
1149 7862 288 -8515 5145 5579 -7197 387 7821 -2480 -4884 4461 2425 -5732 550 6048
1163 6048 -4416 -4309 5568 -1536 -5984 4080 2555 -4438 770 3054 -3854 -1829 5293 1673 -4008
1178 -4008 2232 2503 -6232 176 6763 -3399 -3259 5175 -1790 -6787 2967 3985 -4393 -698 6499
1193 6499 -2760 -7188 5954 4252 -7180 2863 7843 -7184 -4726 7959 550 -7425 4411
1206 4411 6655 -8005 -4833 9083 -2150 -8929 8033 5446 -10491 -236 8265 -5070 -5375
1219 -5375 8783 3631 -9586 465 8018 -6842 -5309 11218 190 -8807 5180 4232 -8976
1232 -8976 -765 8221 -1782 -5959 5409 2217 -9593 1140 9597 -4835 -3772 8468 -2285
1245b285n819J3059L75j0555N272O810j0310l886J3105k311j1199J0847L806j5266
1259h357M373J1146q905l759J1739j951j1478N813Q956j0539k963J5020o451j2487
1273i843J2563L397j4465O002J1413j0367o173J1192J58j1975O841J1680j3048
1286b625m411J5091o180j2019J3432N448j4240J985J0385p147q548J1472M221
1299F864j3170L310J1254j1719m536J4136k570r855P771M521r484j099J0021l232
1313B212q041Q372L335j1491K701Q517q164j389Q715l543o540N570L058o133K33
1328b588P834m651n818P781N12p948N916M325q701J225O122m643l777O907J438
1343C934q273K705P085q043l007J1096l045q467Q220L031r835K022Q258m962o039
$$ plain form
1245 -2285 -8104 4955 5330 -5225 47 6857 -3453 -7339 5766 3455 -7744 3103 6909 -8357
1259 -8357 -3984 7162 -1743 -5502 6237 4286 -7192 -1379 7577 -2962 -5925 9095 2644 -9843
1273 -9843 2720 6117 -8348 -2346 9067 -1300 -7473 3719 3877 -8098 -1257 10423 -2625
1286 -2625 -7036 8055 1875 -10144 3288 8736 -5504 -3519 6866 -281 -8829 2643 6864
1299 6864 -6306 -2996 8258 -3461 -7997 6139 3569 -6286 1485 6006 -3478 -4577 5444 2212
1313 2212 -5829 2543 5878 -5613 -2912 5605 -2559 -3948 4767 1224 -5316 254 3312 -2821 -2588
1328 -2588 5246 595 -5223 2558 3070 -4878 1038 5363 -3338 -2113 4009 -634 -4411 2496 3934
1343 3934 -4339 -1634 5451 -2592 -5599 5497 2452 -6015 2205 5236 -4599 -2577 5681 719 -5320
1358e320Q296K389j1177L509R184q934l604J1140l296r211P622M838q976m04R629
1373E685l963q703Q941M187j1528K839R634q106m776R823n63q603L966O357o862
1388a672l466R206j752q562O987M324r134J537P508n158l864O347J034o518J922
1403a261N784n348k993P384k016n949N714J343n934J879M255l238k411M552L71
1418B132n122K507M560n987j39N644l380l470N074M01n198K568L617m204k319
1433c316N480k10n972M169L901o731M66O288l903l438N185Q89n285J074M926l308
1449B15l816N968K44o789M103L527n813l0M949k125l333K981K676m098o83N268
1465C244k248m122M678N65m521J969K620k590j132K190Q53k879L94K666k448j103
$$ plain form
1358 -5320 2976 5365 -5812 -2303 6881 -2053 -5657 5483 2187 -7024 598 5436 -3540 -3944 5685
1373 5685 1722 -6981 1960 6147 -5381 -2542 7092 -1014 -5790 4033 3470 -5133 -1167 5190 -1672
1388 -1672 -5138 4068 2316 -6246 741 5065 -4069 -2532 4976 -182 -4046 2301 3335 -3183 -1261
1403 -1261 4523 -825 -3818 3566 1550 -4399 1315 2658 -3276 -1397 2858 -380 -2791 1761 2132
1418 2132 -2990 -483 4077 -1910 -2049 3595 215 -3255 1819 2220 -2978 -410 3207 -997 -3316
1433 -3316 2164 1954 -4018 151 4052 -2679 -2213 4075 172 -3266 1919 2808 -2477 -1403 3523 215
1449 215 -3601 2367 2611 -4178 -75 3452 -2361 -2391 2558 433 -2900 81 2757 -1341 -2024 3244
1465 3244 996 -3126 1552 2117 -2404 -435 2185 -405 -1537 653 1506 -1373 -979 1687 -761 -1864
1481a864L524j348k089K803o11j157Q89J90k2m96K88M77j051L10J276k019N64
1498c36J419k399R27J414j738j0J215n92o12O65Q49m42j484K084J0k420K147Q17
1516A514l173J349J258j276m09J039N92j697o48K513l83k563K820N2k677J393
1532b96J377q17m20L33L61r81m88K440j221j750K056j96j717J099R31p48q09K66
1550e80J616j324r50K627n93k226J925L96j152J24N79O4j222m1K317j570j781
1567a791K925p60k275J728J401j426o91J496L81k289O62K805k364j378K795n69
1583F50j975J733R31k059m16J456j9j607J247J629k687l04K702j228o45J638n17
1600E29j018M99K53L45r25O02J3j319J105M39j478J390J15j736J181O03j230L3
$$ plain form
1481 -1864 1660 312 -1777 1026 415 -742 147 337 315 -181 107 584 -467 -157 1119 -900 -336
1498 -336 1083 -1316 -389 1025 -713 -723 492 -100 -712 -47 802 360 -1124 960 970 -1450 697 1514
1516 1514 -1659 -310 948 -328 -737 302 894 -803 -1451 1062 679 -1884 936 988 -1689 -296
1532 -296 1081 264 -156 177 538 -443 -931 1509 288 -1462 594 398 -1319 -220 711 -37 -846 -580
1550 -580 1036 -288 -1238 1389 796 -1430 495 891 -261 -137 442 506 -716 -757 1560 -10 -1791
1567 -1791 1134 374 -1901 -173 1228 -198 -889 607 988 -1301 -639 2166 -198 -1576 1219 650
1583 650 -1325 408 1339 -720 -1136 320 301 -1306 -59 1570 -1117 -1421 1281 53 -592 1046 529
1600 529 -489 10 263 608 -317 285 298 -1021 84 523 -955 435 550 -1186 -5 598 -632 -599
1618e99J351p82r63J258J120k217K45K612k234j846L550j48l300J755J952k989
1634a235n41L200m8l798J875L140m596K47N036k750l506M033J004l757O24L757
1650B685k672l073M576J023n396K133M160m881j336M960j402l750L137K489m129
1665a476p56M970j847l996M246J619n553J796L941l661j354L990p98l647K266
1680b60K639l767q36M620k083l584M954K62m520K392K657l476q07M159j155l622
1696b427K760K389n207Q58N124m002k904N621n37m856L325K712m138j308N351
1711B761j400m820M633K606o700P30N972m246k854N723j09n630K189M580m426
1726i91k475O437p44o803M822L895o804P99N916l709l837M620J861n321P06N490
$$ plain form
1618 -599 752 -30 -993 265 1385 -832 -587 2025 -209 -2055 1495 1347 -1953 -198 1754 -1235
1634 -1235 -1776 1424 1376 -2422 -547 2593 -2003 -1756 3280 530 -2976 1057 2061 -1696 -1072 2685
1650 2685 13 -3060 1516 2539 -2857 -724 3436 -1445 -2781 2179 777 -2973 164 2653 -1476
1665 -1476 -2232 2738 891 -3105 1141 2760 -2793 -997 2944 -717 -2071 1919 1121 -2526 -260
1680 -260 2379 -1388 -2224 2396 313 -3271 1683 1945 -2575 -183 2474 -1002 -1809 2350 1195 -2427
1696 -2427 333 2722 -2485 -1627 3497 -505 -3409 2212 1675 -3181 144 2856 -1282 -2590 2761
1711 2761 1361 -3459 1174 3780 -2920 -2190 3782 -464 -3318 2405 2296 -3334 -1145 3435 -991
1726 -991 -3466 2971 2227 -4576 246 4141 -2663 -1864 4052 343 -3494 1126 2987 -2334 -1628 3862
1742C862m144l664O267k24o054L944L531n119l30M512k080l730L761K138m593
1757a923N01M541l793k113N118o72m305L611J140m175N94L095j372k399L494O31
1773A973m912J989L728m336j48M864k920k948L703O80l676K008K994l561k254
1788b816N035p44n482M488L669o288j57N786l882l450N486J605n826J028N395
1803C847m589l307P479m54p060M652L578p190l32O871k353m886M568K780p032
1818c428N97P054l976m122P016j28p253L539M771n101j548N982j645n836L662
1833d16L762n649p9O556l923m227N505L07m895L029L661m206k028M849r39m605
1849c298L873L025n634K04M566l657k337N108J75m702J787L667m224j683N818
$$ plain form
1742 3862 -282 -3946 2321 2097 -3957 -13 3518 -1601 -1931 2581 501 -3229 532 2670 -1923
1757 -1923 -1422 3119 -674 -2787 2331 1659 -2646 965 2105 -2070 -1476 1619 247 -2152 1342 1973
1773 1973 -2939 -950 2778 -1558 -1706 3158 238 -2710 993 1673 -2003 5 2999 -562 -2816
1788 -2816 2219 1475 -4007 481 4150 -2138 -2295 3491 -391 -3841 1645 3250 -2576 -1548 3847
1803 3847 -742 -4049 3430 2976 -4084 568 4146 -3044 -3376 3495 1142 -3744 824 3604 -3428
1818 -3428 -2831 4223 247 -3875 3141 3013 -4240 -701 4070 -1031 -2579 3403 1758 -4078 -416
1833 -416 3346 -2303 -2382 4174 251 -3976 1529 1836 -3059 -30 3631 -575 -2603 2246 1307 -3298
1849 -3298 575 3600 -2034 -1830 2736 -921 -3258 1850 2025 -2677 -890 2777 -1447 -3130 2688
1864B688j398m350M125J858o180J735M969l932k239N035m98n138K185M447m542
1879a235j277N896k380n299M631K382n201J310M565l230l499M557R93n235K414
1894f08M625m859k211N510j593m377M204J982m270j63M146k465k987L930K062
1909B926n131J420L343l808j035M287j004k831K026J565l125j45L332j313k609
1924b102L222L50m011K079K345k857J50K667j472k316K496R74k767P70K663k647
1940d56j384L654j127k905K933J389l917O49K750j674k141L081R84l905J426L460
1956B817m003q90M652j249l846L249J562m053J42L767j480l749L740J714n055
1971b682J278M498l916j622L921l11l329J915K610l093j200L748o67l737K952
$$ plain form
1864 2688 1290 -3060 1065 2923 -3257 -1522 3447 -485 -2724 2311 1813 -3325 -1140 3307 -1235
1879 -1235 -2512 3384 1004 -4295 336 2718 -2483 -1173 3392 162 -3337 1220 2213 -3022 -608
1894 -608 4017 -842 -3053 2457 864 -3513 691 2673 -1597 -1760 2386 -79 -3066 864 2926
1909 2926 -2205 -785 2558 -1250 -2285 2002 998 -1833 193 1758 -1367 -1512 1820 507 -2102
1924 -2102 1120 1470 -2541 -462 1883 -974 -824 1843 371 -1945 551 1525 -1242 -472 2191 -456
1940 -456 -1840 1814 687 -2218 715 2104 -1813 -1164 1586 -88 -2229 852 1836 -2069 -643 2817
1956 2817 -1186 -2076 2576 1327 -2519 730 2292 -1761 -1619 2148 668 -3081 659 2373 -2682
1971 -2682 -1404 3094 -822 -2444 1477 1166 -2163 -248 2362 -731 -1931 1817 1150 -2587 365
1986C65J968l793M00K921k406j377K331R25k756P12K301j559j893L443m73k879
2002a770K216R52k451M33J792j101j004J380M68j741M36J528j653j074K853j357
2018i3j338K213l69j552J187P93j006m38J217L47k166R70J949k385j56K144j705
2035c88j032K113Nj510N30J211j186r75K214J57k488J528J101k371J34K113j075
2052H1p70R68M51j243j15J346l82j931K006N51k016J171P69j562J34J002j38p18
2070c96K07Q05p41o28J232P0j145P77J50q74M31K25j63J70m89O22m39k8O62k25
2090B23k59K77j36l53N86l83R5K76o08L52K75n69J97k57j7K00l50P04J8n57L12
2111B6J28n12M71K49l09J88j92q7K4l36P12j89l27L08J83p30N13j79j24Q0k18
$$ plain form
1986 365 2333 -1460 -1060 1861 -545 -1922 409 1334 -1422 -710 1591 32 -1861 1582 1109 -1770
2002 -1770 446 1398 -1053 -620 1172 71 -933 447 915 -826 -390 1138 -515 -1589 1264 -93
2018 -93 -1431 782 413 -1139 48 841 -165 -603 614 961 -1205 -235 1714 -671 -827 1317 -388
2035 -388 -1420 693 698 -812 -282 929 -257 -1232 982 1139 -1349 179 1280 -1091 -957 1156 81
2052 81 -689 279 730 -513 -628 718 336 -1595 411 962 -1054 117 886 -676 -542 460 322 -396
2070 -396 -189 616 -125 -753 479 549 -596 181 331 -543 -112 113 -50 120 -369 253 -186 -214 448 223
2090 223 -36 241 105 -248 338 -45 50 326 -282 70 345 -224 -27 -284 -301 -101 -451 253 271 -286 26
2111 26 154 -358 113 362 53 241 49 -38 -14 -350 362 173 -154 154 337 -393 120 -59 -183 -103 -321
2132c21N33P3m33M51L0m73M17j48O5l27k82P62m0j056J278l87n95J78P66r31L72
2153f8K61L84q56n49J785p92m64R69k24r44N60O49q16m95Q62K70j424N14J202
2172H24j283j43J267m76j103J224K64q36k07Q58l4r37Q99O63j656K22J416j224
2190b62r3Q92l20p52K13P28p39j1O31J91j171P51N13j292P55N75j003K12M65l00
2210a7k83O63M3r13L93O87p29m14J392o73j214J523R9j418R95N68r23k79O36N41
2230F77j363P68R11j633k77K109r09j662K143k56j702R37J224q71j389J747N00
2247I54k391J100J776k164m41K485r33j513J679L59j760j37K296o81k221K156
2263E64N51k658J172J949k054k66J936o51j646J298R41j804n21K593j174j790
$$ plain form
2132 -321 212 285 -148 303 333 -140 277 129 194 -133 -415 347 307 -749 529 142 -453 -275 491 -440 -68
2153 -68 193 577 -279 -828 957 165 -299 670 446 -498 62 711 -105 -600 262 532 -892 -378 824
2172 824 -459 -602 665 189 -914 310 574 -262 -469 389 355 -582 317 980 -676 -454 962 -262
2190 -262 -355 537 217 -535 -322 406 -333 -344 287 478 -693 58 571 -721 34 609 -394 -182 283 -17
2210 -17 -300 363 406 -507 -114 573 -156 -570 822 149 -1065 458 557 -861 134 702 -221 -500 136 677
2230 677 -686 82 993 -640 -917 1192 283 -1379 764 508 -1194 -257 967 96 -1293 454 954
2247 954 -1437 -337 1439 -725 -1166 1319 386 -1127 552 911 -849 -986 1310 629 -1592 564
2263 564 1115 -1543 -371 1578 -476 -742 1194 543 -1103 195 1136 -668 -1189 1404 230 -1560
2279a560K000L34k095J135J328j831l34J830l18j887J346J314j930k49K235j018
2295C00j888K343K65k391J280J603k208m29K227n02j982J476J400k613L04K365
2311A550j885j101K278j61j696Q04J564j993m07K136j35k579J737J372k720N70
2327f66K393k066j097K275j93j882P31J777j333j367K829l64k733K022J145k297
2343h26R2K216j464j235J541N45k312R49J860j688j118K507n85k171J964Q99j990
2360h16L41J299j031q97J875J93j800N44J664k049o98K608r26j155J478p4j861
2377a305Q43J782j341q06J719k12k252J566J565k381M17J915j457j630J917N67
2393I07j941P00K075k000j181K389j02k495K028J507l063K66J830o58j625J978
$$ plain form
2279 -1560 440 774 -1321 -186 1142 -689 -1023 807 489 -1398 -52 1262 -668 -917 1318 300
2295 300 -1588 755 1020 -1371 -91 1512 -696 -1125 1102 600 -1382 94 1494 -1119 -815 1550
2311 1550 -335 -1436 842 681 -1015 -211 1353 -640 -1047 1089 954 -1625 112 1484 -1236 -666
2327 -666 1727 -339 -1436 839 646 -1236 -505 1272 -61 -1428 1401 1037 -1696 326 1471 -826
2343 -826 -734 1482 18 -1217 324 869 -1443 -494 1366 -322 -1440 1067 482 -1689 275 1174 -816
2360 -816 -475 824 -207 -1104 771 964 -836 -292 1372 -677 -1375 1233 307 -848 630 556 -1305
2377 -1305 -462 1320 -21 -827 892 680 -1572 -6 1559 -822 -405 1510 53 -1577 340 907
2393 907 -1034 -334 1741 -259 -1440 949 847 -1648 380 1887 -1176 -910 920 262 -1363 615
2409F15R30k688K09K506j723j820L313j18k625J343J317k118k26K282l16k379
2425a498J744J335l320P67K865j987j306K590m02k077J349J277j945l42K029o93
2441C86j971J637J360k551O00K323k058j095J884p7j507J278J147j546q22K093
2457A081m66k217K417L98k797Q36J999j699p20J959lj564O63J114j481m92K193
2474A221p46j745J901N81k669J326J253j260j090K056j83j836R47J394j757m91
2490a098K434j444j081J705O7j442M46J620j285j153J414N58j934J175J197j918
2506g39l23J833p91r72J560o2j190L99J113p13q61J278Jj543J232R28j778J56
2524d72J107p45q78J645m9j198J79J366j413m81J516j28j516J398O10j409K77
$$ plain form
2409 615 1545 -1143 -934 1572 -151 -1971 1342 1224 -1401 -58 1259 -859 -1085 1197 881 -1498
2425 -1498 246 1581 -1739 -972 1893 -94 -1400 1190 788 -1289 60 1337 -608 -950 1079 386
2441 386 -1585 52 1412 -1139 -539 1784 -274 -1369 515 438 -1069 209 1356 -190 -1012 1081
2457 1081 615 -1602 815 1213 -1584 -748 1251 -448 -1168 791 788 -776 -113 1001 -480 -972 1221
2474 1221 475 -1270 631 1212 -1457 -131 1122 -138 -1228 828 645 -1191 -244 1150 -607 -1098
2490 -1098 1336 -108 -1189 516 583 -859 -413 1207 -78 -1231 183 741 -1193 -18 1179 -739
2506 -739 -1062 771 -20 -992 568 506 -684 -285 828 115 -746 532 533 -1010 222 1150 -628 -472
2524 -472 635 -110 -988 657 608 -590 -411 955 -458 -939 577 449 -1067 331 941 -468 -191
2541a91Q69o43p99R56O66j705N61J459j215q88J695p32o66R74K13j210K13J235
2559G92p76o63R53N49j783R05Q68j072k06J246m80r37P77M90j216J50J034n67
2577F4j053J319M35j433M65R54j145k32J311n13o69N39N34r43P8J041p48o52J097
2596D49k66q35M10P74p02J76J57l49k10L55N72q57k78J310q20n48R20r0m93M83
2616A58M20p69j47P46m46l68N60N80j185k6R72o75j92Q16m98k02L76K81p58J82
2636a75N92j12m10J86M85j073K22O09n35J02L46N5o16M16M27n21l14O16j19o98
2656e17Q51j19o76J56N80m15k2J42K80m07j01L87j07k80O46n27j32M69J6k70j6
2677f2J13k81J56j5K11k46PJ69l60J75L68l06k1M56j42k33n8k24O78n32J80K06
$$ plain form
2541 -191 678 35 -764 192 858 -847 -286 1173 -42 -930 765 33 -633 341 554 -656 -443 792
2559 792 16 -647 306 855 -928 -23 845 -227 -433 813 333 -604 173 663 -553 -403 631 64
2577 64 -989 330 765 -668 -203 751 -394 -626 685 172 -497 42 576 -367 -289 752 4 -648 449
2596 449 183 -652 -242 532 -170 6 163 -186 -396 -41 531 -326 -604 706 -114 -662 258 168 -325 158
2616 158 578 -191 -338 408 -38 -406 154 734 -451 -477 495 -180 -372 444 -54 -256 120 401 -357 -175
2636 -175 417 305 -105 81 566 -507 -285 324 -211 -109 237 292 -324 92 519 -2 -316 300 181 -517
2656 -517 334 215 -461 -305 275 -140 -162 -20 260 -147 -248 139 32 -248 398 -129 -261 208 224 -46 -62
2677 -62 51 -230 -74 -89 122 -124 -117 52 -308 -133 235 -71 -92 364 222 -11 -69 -293 385 -147 33 239
2699B39o82N60K26l37J99j3n70L82p9L2m6l2L03m19L50j76P8j82K57j26J06r9
2721b9j21J57L57k72r7J05k13j6J18j98L58l50K92Jj63J20J39k34N7K09m78N65
2743C07k14Q5j45L8k5P1j16K27k05j05j68M83m86M16j19k21N57k95j61l7Q1K93
2765B61o43M00M63m60k50N74l39O8q2j72J24j90J98J16k68RN17m34K61K39l35
2786E7j77N21j02n44J37J37Q0l65M65l08k59K62Q2m08O37M1o46J24N32k23l53
2807c10L86K94l86m22P65r5j001R04l8l19J11M89o57m9L69J23m46J84M40n48J02
2828a04M70k92m66N90Nn18J24N68n33RK25M3n21L52M48p92j21J092o97j56L35
2849F1M49j146L75O04m14l39O18K56q91M99N41j010L92Q39j239p4O18J55p46K90
$$ plain form
2699 239 -443 117 343 6 205 192 -378 4 -75 -43 -89 -121 182 -237 113 -63 15 -167 90 -36 70 -29
2721 -29 -150 7 364 92 -5 100 -113 -129 -11 -209 149 -201 91 92 -71 49 188 -46 11 220 -258 307
2743 307 93 178 33 71 46 117 1 228 23 -82 -250 233 -253 163 44 -177 380 85 -76 -113 -32 261
2765 261 -382 18 481 21 -229 345 6 74 -8 -180 -56 -246 -48 68 -200 -191 326 -108 153 392 57
2786 57 -120 401 299 -245 -108 29 109 -256 209 -99 -358 -96 -14 -422 215 256 -390 -266 266 43 -310
2807 -310 76 370 -16 -438 327 232 -769 135 97 -222 -111 378 -279 -328 41 164 -282 -98 342 -206 -104
2828 -104 366 74 -392 198 203 -315 -191 377 -156 -147 78 121 -400 -48 400 -392 -513 579 -118 -274 61
2849 61 510 -636 -261 343 -71 -410 208 464 -427 72 613 -397 -5 834 -405 -479 139 294 -452 -162
2869a62P28q67j85R38k07q08M00J015j451N04O27p78l80J072J63j086K12Q72r09
2888c02k73J111k86p96N25L50o41J6Q97k07j063N96Q85j252L69O35n52n24P61
2907B49k7p70L88P32p67m9P17l43j040J073O58j272L65N47n06k69O93o3o31L44
2927B9L22o37jR57n40o41P26M3q38O87L55p79K96L76j89m77M97M83j026K17N76
2948D36l65p09J055K4j069L55R57j062l40R21k94n47R38K81r20k37J138n81l11
2967c30P58k09m19J23O96j083j96J005J55j032Q57J86j262N12R27q92j75P90J5
2986D26q34O13L98q24j22P70l57o16Q31L75r44J83O17o85m40R06J60j015P06L55
3006E03p46l11J053n96o48J212j59q14K26P36m39o57R00J51j202P10R45j387P7
$$ plain form
2869 -162 566 -301 -486 452 245 -563 -163 852 -599 -95 532 -246 -626 446 609 -477 -265 607 -302
2888 -302 -575 536 250 -546 -21 329 -312 -296 601 394 -669 -73 812 -440 -71 564 12 -512 249
2907 249 222 -548 -160 572 -195 -244 473 130 -910 163 821 -451 -86 461 -45 -314 379 316 -315 29
2927 29 351 -286 -287 670 130 -511 215 258 -580 107 462 -317 -21 355 166 -311 186 669 -357 -140 436
2948 436 71 -638 417 441 -628 -273 684 -378 -718 203 -91 -638 300 581 -339 -576 562 -19 -330
2967 -330 428 219 -200 -77 619 -464 -660 345 500 -532 325 511 -751 -239 688 -204 -379 411 426
2986 426 -408 205 603 -221 -343 427 70 -546 285 660 -284 -101 516 -169 -609 297 457 -558 148 503
3006 503 -243 -554 499 -97 -745 467 308 -506 -280 456 17 -640 260 411 -791 -81 864 -523 -446
3025d46J139l75r47N22J47n53K87Q92o44o93O46O19j208N99J027j358J02O42o45
3044b47k37Q50J68o82m19J256q04p50J081J99r48O79O33j161l85J200j39p64N43
3063G3L15p01l23J186q29m37J184k17p65N27L45n77n8O18k58m97N69l2n55L67
3083f5Q51p55o17P47j12l88L09P38r42m4N55n68k73P99J69r92N99L43p01k27J109
3104E35m69m80L15L64m79j95R81n41m72N29K88q82M26P24m64m81P40m01o00P67
3124B05O4k52k69N91r3q62R44K22j029N54K61l76n41P24K09p59L44M54p54J39
3144b24N35n14l79J059l50k16J13K33j54o15Q14K4p62M17M90r63L45M61j77Mj11
3165C0K45o31O43J54n41q3M94p0m22L81J50n19j17M79k83j19K37o2j54J6J65K04
$$ plain form
3025 -446 693 318 -629 -107 40 -513 -226 666 22 -671 -25 594 -614 -15 1012 -346 -244 398 -247
3044 -247 -484 366 534 -148 -567 689 -115 -865 216 415 -533 146 779 -382 -767 433 294 -470 73
3063 73 388 -313 -636 550 -279 -716 468 251 -514 13 358 -219 -277 341 83 -414 155 123 -432 -65
3083 -65 786 31 -586 161 49 -339 -30 708 -234 -278 277 -291 -564 235 404 -588 11 354 -347 -574 535
3104 535 66 -414 -99 265 -214 -409 572 31 -441 88 376 -506 -80 644 180 -301 439 38 -562 205
3124 205 269 17 -252 339 246 -616 328 550 -479 75 336 -40 -581 143 352 -407 -63 391 -363 -224
3144 -224 311 -203 -582 477 127 -89 24 257 103 -512 302 326 -436 -19 471 -492 -147 314 137 141 30
3165 30 275 -356 287 441 -100 -183 311 241 -181 200 350 -169 -286 193 -90 -209 28 -34 -188 -172 -7 197
3187A97r07J166m45p97J056q3m81L63J31j86j49L64j0o90K51L16k29k00J338j131
3207a26k47O1O04m08JJ92j63nJ60J58j55k43K92m86K12L19k11k0J28K63k64m57
3229c95K81K03k73L88l8l00J63K91m66J74K67q1j77j4J31k71J59K61j78j87N7
3250eok47K90R3k09N7K37j48k3J75jj71n2J35k44k25M67k56o0L90k32K0R9j81
3274i7J22k05M33j83l85L62P3j35%K37k75L70l51N1L52n41Q5J92k38j82N15j75
3296B5l2j7k77M67j92n3O6k62J09M29k41O7M7o0r6p2L31j52j64L0o4J31k72K34
3320a8o9K23n5k02L0J03J20j24j12J17R0k36M13J7l09j73M22j95K38j08m13O2
3342a79O2k8N6Q8J78k87q3K55p4l05N55k74q6M5j13K70l89M87j41j31m42Q90m62
$$ plain form
3187 197 -710 456 11 -786 270 187 -294 69 200 14 -135 229 219 -471 -220 96 -133 -333 1005 -126
3207 -126 -373 -312 292 -116 -115 77 -86 -91 69 227 72 -171 121 -365 -153 166 -45 -65 63 326 62 -395
3229 -395 -114 89 -184 204 166 -134 29 320 -146 28 295 214 37 23 154 -117 42 303 125 -62 -5
3250 -5 -11 -258 32 125 -84 -27 210 62 39 214 213 42 -10 125 -119 -344 123 -133 -193 197 -35 -15 84 -97
3274 -97 25 -180 253 70 -315 47 120 -15 -15 222 -53 317 -34 17 369 -172 -87 105 -133 -315 200 25
3296 25 -7 -24 -301 166 -26 -79 -13 -275 -166 263 22 89 136 76 -20 -92 239 87 -77 -47 -111 20 -252 -18
3320 -18 -87 136 81 -121 -91 12 132 8 -104 13 103 -133 280 297 -12 -185 237 42 280 172 -241 -179
3342 -179 -117 -145 -89 -1 177 -110 -193 62 -12 -317 238 -36 -122 -77 -190 80 -309 178 37 -94 -536 354 -108
3365a08J81J75l26r7p5K75J41l46M34k71k03P1J32k90L13Q4l07N1P3K66l75J1
3387a91M51m61k30M54J39k39J41R0k67k15N27m05k56N71j54l4OL09n92J80L94
3408B18m15o7R3M85k98m07O89m47l5J66J92l18J23L26j72k56K93j03q4j24J89
3429D8p7p7K09P5n18M34J15m24K40K81m91J79J72j15l62M56o7k85O3K37p8n9L36
3452B92j57l15K18K19k95j93M60M5n80J58M73m57k21P49k83n66P41J6m73L10L7
3473A78j96m34O57P4n28Q5N05m23lK70j94l22M36k72J97l19P69n49l31M06j05
3494i9k2n9L40k66J0K39k46j74K81L2m55L38K40j89m64Q46M1n65J84M40p97L1
3516c14N55k65j06K25J98l26J31L46l13n71P96r0m82M82k75k63K46N99n76k36
$$ plain form
3365 -108 73 248 -78 -175 -250 25 166 -180 254 -17 -220 -149 -17 -307 6 90 -217 -166 -93 173 -202 -191
3387 -191 260 -201 -431 23 162 -77 64 154 -113 -328 199 -206 -462 109 -45 -79 -73 236 -356 -176 218
3408 218 -197 -264 -171 314 16 -391 298 -149 -184 -18 174 -144 -21 305 133 -123 170 67 -17 -141 48
3429 48 -29 -106 103 178 -340 94 209 -215 25 306 -185 -6 166 51 -311 145 78 -207 -144 93 15 -44 292
3452 292 135 -180 38 257 -38 -231 229 274 -306 -148 325 -132 -353 396 113 -453 288 304 -169 141 178
3473 178 -18 -452 205 279 -249 -164 341 -82 -85 185 -9 -331 105 -167 30 -289 480 -69 -400 6 -99
3494 -99 -121 -180 160 -106 -96 143 -103 -277 4 36 -419 -81 159 -30 -494 352 393 -172 12 452 -345 -314
3516 -314 241 -24 -130 95 293 -33 98 444 131 -440 356 266 -216 266 -9 -272 -26 573 -3 -239
3536b39K53J96n38K0R43q21q3M60p6q04R23K32n70l04M32l27L3M80K1p08O26O7
3558B16n72p3P52pq09O70r9p06K88O54k9p36N81Q3n24L31P49q06l70P65n25l51
3580e18M89J91o06M30R6N0m17N37K36q07L70J85m20q5O24l32j98j92O63k25k01
3601a30O23m41n34M37K32o68N15K37m11k9K41J96p47L78M14k54j45L20j69k80
3621b15M42j64m32J95O76m62m28M34K86q96K92O06m36l1L46m20o2M05j53k6j68
3642b11O37m28k82M89q5l14N30j2n65J46J98j93J24K64J28q05L03M61m01k42O74
3663D16j04n08J39K22k7l29N37k45k13K75J54n39L9L99k19j33L21l23n1K67K57
3684C35m95P1L64n50P0M45l4m40J79K37l47k11M84j80J5M7M2k26QN42k75j55L46
$$ plain form
3536 -239 14 210 -328 -308 635 -186 -269 191 115 -689 234 466 -104 -408 24 -303 -270 210 231 -477 149 216
3558 216 -356 -429 323 316 -493 177 78 -628 -340 314 285 -451 130 213 -311 20 769 -37 -407 358 -167 -518
3580 -518 -29 162 -444 -14 82 132 -285 252 488 -319 51 236 -184 -269 355 23 -175 -367 296 71 -130
3601 -130 493 52 -482 -45 187 -481 34 271 -140 -169 72 268 -479 -101 313 59 -86 234 65 -215
3621 -215 227 63 -369 -174 502 40 -388 46 332 -564 -272 334 -102 -133 213 -207 -269 136 -17 -43 -211
3642 -211 426 -2 -284 205 120 -194 336 324 -241 -95 103 -90 34 298 426 -379 -76 385 -16 -258 416
3663 416 312 -196 -57 165 138 -191 346 101 -112 163 317 -222 -183 216 -3 -136 185 -138 -189 78 335
3684 335 -160 -89 275 -275 -205 240 206 -234 -55 182 -165 -376 108 -72 -57 -10 32 -194 -186 356 81 -74 272
3707B72r4p79M25L36l71K00j9K0l25M49R3l44n4M27j49o19N35j18L1L9K48m19
3729b16j3K14K56n98L58L20n18J05K72l60k34Q41l26j51j23M58n30Q4K69k74K41
3750G5K4J30l17KJ83k93J01J54J09j72j7L31k56k57J98l5j52O4N10m71N3M2l12
3773c06K37Q7J53l13J46nl8k12L47l96L44l0J21p2j35K43m28O3M61l76J14Jl4
3796b8qp6L29l46QJ23P2m69L20J91j63M4K16o2k77j2O6j5j95R2j0o4J12K85R5
3821B28k02O5N7P5p1j04n4J5K85k69q6kK04j49J68j30j12J79o8j26j1N3K48l65
3845a72M13j37m12L97r9P9j01K93j37N3k52n4K14l96N69lm39M27j85m6J0M7K27
3868B96m00k1K04k43L29r9j79J59Pr1k4l2K66N1l37N8J07j80r1K84m1l2p3Q4K95
$$ plain form
3707 272 178 -601 -176 160 -211 -11 -30 -10 -335 114 207 -137 -191 236 87 -532 3 -115 -84 -45 203 -216
3729 -216 -229 -15 241 -357 1 321 -197 -92 180 -180 -414 427 101 -50 -173 285 -245 -161 108 -166 75
3750 75 99 229 -88 -86 97 -196 -95 59 168 -4 -21 310 54 -203 -5 -40 -192 -128 382 -89 -36 6 -306
3773 -306 -69 18 171 -142 4 -1 -39 -251 96 -300 44 14 135 63 -72 171 -257 -194 267 -109 5 6 -28
3796 -28 -36 -112 217 -129 -121 2 74 -395 -75 116 -47 -3 213 151 -126 -138 -72 -87 -282 -190 -200 -264 -152 133 228
3821 228 26 91 148 223 152 48 -6 9 294 25 -61 -63 141 -8 160 30 -82 97 29 -97 -108 -55 193 -172
3845 -172 241 104 -308 89 -10 69 -32 261 124 177 -75 -129 85 -311 258 255 -184 243 58 12 22 69 296
3868 296 -104 -125 79 -164 165 66 -113 46 53 -38 -62 -94 172 223 -114 -56 51 -129 -220 64 23 -9 -82 2 297
3893B97j72j07J72l12r3R7N6j62J4K68j08L19m79J37j20K84k8k12K07J6j53R0
3915A1m7j55N06m14N91l86l81L51j11P2R7l3j80P9J53k57J68k43R0K11l26L42
3937A38j10k78L02Q7l74K64n0J67j46K21j24k41P0n2J3L93j8m28n7K42K1k82M94
3960B52l27P9j14K09k44R1R1l37K34RJ46l20J70L70l77O5K04j0l58L22J27k01
3982H1J03J56n08J12J01K7k27M3J26j97K87k96K68k21N1K38j71O2K53k32l14N13
4004B55n43K6K92M9m5k0J36J3j94jJ50J1j09M50l55l71J27L8j2rL38j57l74L43
4028C8J6l67J84J75r6j01J58kl48J26M20k29R8K65m3n06L61m2N4j00N6m47K55
4051g5K95l75L4J39L10k72l41M87j24l03M02m2n08L08M20m98N8K45R0m39M37J34
$$ plain form
3893 297 125 18 190 -122 -215 -118 -62 -224 -210 58 -50 269 -210 -73 -193 91 63 -149 58 74 -79 11
3915 11 -36 -191 315 -99 492 106 -275 76 -35 37 134 101 -79 0 153 -104 64 -179 -89 122 -204 138
3937 138 28 -250 52 139 -235 29 -21 146 0 221 97 -144 -74 -126 -113 280 262 -166 -223 19 40 -242 252
3960 252 -75 4 -110 99 -145 -54 37 -300 -66 -57 89 -231 -61 309 -68 -3 201 191 -167 155 282 81
3982 81 184 340 -168 -56 45 72 -155 -112 14 -183 104 -192 76 -145 -94 144 -27 35 288 56 -258 255
4004 255 -288 -262 30 79 34 14 150 163 -31 -32 118 129 20 470 115 -256 -129 -91 -103 -112 226 69 -305 38
4028 38 54 -313 -129 46 -50 -151 7 5 -343 -217 203 -26 72 337 294 -212 149 107 161 61 117 -330 -75
4051 -75 220 -155 -121 18 328 56 -285 202 78 -225 177 135 -373 -65 355 -143 -85 160 250 -189 248 382
4073C82o02N7O53m12k29M28k27l70L77J72n18J76K76L4p52O49N4j86j41M82o02
4094b99K49J92O3l42j7K35l80J83L14j62l93L47J35m85R2M00m7k43K07j19N4L4
4116A8Q1k6l37O19m29k19L41Q0k73J46J50q7l25K86J85l57P9N88n85mM21l55q6
4139h9K49J25n07K69J84m86K87O2j62l96L41M58n23JK05n6m2R8J71j61j65K11
4161G4l05K4L41J68m49m0N87l33j60J90O2m93N40k47j37R9J46J82m17Q4L9l18
4183c63L21M2Qk42L13J64j81m9J6k72R3M87m54PR7L4l89K96K31l13J73P7Jl59
4207b62L08R6k97K35J53k82k44J98J79l03J14M49k73k69L49q0l52M26K1n08M31
4228H9J97l31l8p0K28R0M7K3m26K07K0J96m52J03K43k95L27k5k89n7L31Q1k78
$$ plain form
4073 382 -220 -163 490 78 -151 277 50 -320 57 229 -289 -113 163 197 -555 94 148 -38 -179 303 -299
4094 -299 -50 142 205 -137 -154 81 -299 -116 198 36 -357 -10 125 -360 -268 132 85 -158 49 -70 -16 18
4116 18 99 73 -264 355 -74 -293 48 128 -145 1 151 64 -261 25 210 -147 -68 520 -65 -69 352 -3 -89
4139 -89 160 285 -222 47 231 -255 32 94 -68 -464 -123 335 -188 -187 18 -38 -80 18 189 28 -137 74
4161 74 -231 -207 134 302 -147 -187 400 67 -93 97 159 -334 206 -41 -178 -79 67 249 -168 -84 -45 -363
4183 -363 -42 0 8 -234 79 243 62 13 29 -243 -150 337 -117 -110 -13 21 -368 -72 159 -154 19 96 97 -262
4207 -262 46 142 -155 80 233 -49 -293 -95 84 -219 -105 344 71 -198 151 71 -281 145 166 -342 89
4228 89 286 -45 -83 -153 75 165 212 235 -191 16 36 232 -220 -117 126 -169 158 133 -156 -213 118 199 -79
4251g9J54J18o47M14K66l57j03K07K22m55M74j64j74L4M61n41J33j77rJ42J24
4272D3Q4j16j95M83j86m84K08J19K03r5n8K01l47N1L84m50L06r1k14J81K74m01
4294a00J97p0J63m06L7K53J41k19J60J30m01j08M33k63rM2K28k43O9l0p2j0K01
4317A23k09k5N7j8j62L61j07j40j17L32L57m97J60j48j08j20M28M0m42M22j98
4338a1j80L43k74J17J60j7k76J03J73o5J01k69M94l58j6L41k47J54l90L03j33
4359E3j66K05L6k44J39N9k12J23J7J6q5o4J64J9j30J06J4k97K84n9j90P3r6M43
4383B08m09J97j3j53J97Q7J8l67N67m42M1L33k17j5k33L08j20n4J12l4j60L74
4405B25M8l88l70P36k55J9J0J34k38J02j26k78J38K33J97l01M96m80K33k23J78
$$ plain form
4251 -79 75 193 -454 -40 226 -131 -234 -27 195 -260 214 50 -124 -90 371 -170 -37 -214 -223 -81 43
4272 43 127 11 -184 299 113 -371 -163 -44 159 64 6 207 -140 -89 295 -155 151 60 -154 27 301 -100
4294 -100 97 27 190 -216 -179 74 215 -4 156 286 -115 -223 210 -53 -62 -20 208 -35 34 4 -68 -78 123
4317 123 -86 -111 -54 -72 -234 127 20 -120 -237 95 452 -45 115 -33 -141 -261 167 207 -235 187 -11
4338 -11 -191 152 -122 -5 155 138 -138 -35 138 73 174 -95 399 41 25 366 119 273 -117 186 53
4359 53 -113 92 128 -116 23 82 -130 -7 10 26 -59 -123 41 60 -70 36 50 -247 37 -22 -212 -139 -235 208
4383 208 -201 -4 -17 -170 27 114 132 -235 332 -110 -69 264 47 32 -201 107 -13 -67 45 11 -149 225
4405 225 273 -115 -485 251 -4 15 25 159 -79 23 -103 -381 -243 -10 187 -114 382 -98 135 -88 90
4426I0k14L7L80j70k22j6O0k5j39M28j12k77L06j0j81N5J56r7KP5K45m57K58j77
4450eJ28k34j3oK11m5Q9q2j12pJ47j72J88j07j00Q1L85k86k92L42j05J94l1k58
4474i0K05j66M1K2j06K55j93q7J0N0q6J98l2K2J46j09r7J65n8L9k55J9J74K11
4498B78l61P0j77L10q5q9K57k03j76J46n0J71r9n1k2p2J46j91K53k09J40j44k4
4521a82j25K21k22L88j01J94j70J12j11k67L28nn6j39L90k43l82L03J86j10J01
4542A10k16J29J58j87k1j49J68J13j27j51O8K05k76J17p0J41J3R5j11r5k8J40
4564B6N5R4l24J03j26K52j03j51R2j67L67j96mJ84m71L20m9j19K98o2j74J56j3
4587a2j9K5J40k81j40L38J40op59L21K56j32p2L97p1j36K7J07k96N1L22j54l7
$$ plain form
4426 90 -124 -87 293 123 -99 -115 -55 -80 -219 209 97 -180 126 116 -65 -10 146 49 51 126 371 -86 172 -5
4450 -5 123 -111 -124 -130 81 36 125 43 -69 -76 71 -101 87 -20 -120 -39 346 60 -232 110 5 199 168 -90
4474 -90 115 -51 -10 12 -94 161 -32 -119 -109 -59 -145 53 21 43 189 80 -17 148 90 129 -126 -107 67 278
4498 278 -83 -13 -190 120 35 -54 203 0 -176 -30 -80 91 -8 -59 -81 -153 -7 -198 55 -154 -14 -158 -182
4521 -182 -307 -86 -308 80 -21 173 3 115 4 -263 65 60 4 -135 255 12 -370 -67 119 9 110
4542 110 -106 23 181 -6 -27 -176 -8 105 -22 -173 -105 100 -176 -59 -129 12 25 120 9 -86 -114 26
4564 26 81 175 -149 -46 -172 80 -23 -174 -82 -249 118 -78 -82 102 -369 -49 -98 -217 81 19 -155 1 -12
4587 -12 -31 -6 134 -147 -287 51 191 185 -574 -253 3 -129 -201 196 125 -11 16 123 -173 -122 200 46 9
4610IJ8j82J8J90P5j94j25L00oj35K99j16qj57M26l87K64o3k09j65J19K31m25
4633b23J98J79n52J43K64j33K41j82L10j38l03N7L75k48K80l11j39K79N8j52j63
4654a60K09J3k06J68K75m29j7K87k02l18K13J81j33r4K79j80k14L07p8N0O6L88
4676D05m19M1qJ3l05L77J55l68j6J18R7k87L79k06m28L32N3r5R6j0J19k42J97
4699bl18K53O0J96n0j61j80P9k5Q9J77n95L69L87l13j5R9K01k22k38M21k49k17
4722b54L15l47M45p0J61l10pK48j33j33Nj36K29K1L5l39L1M81k31p1n1J99m28
4745c40J25K01J75l31M83L0m45J29J8l35R4N5N02p71O92k51k51Q2O59o55j9K03
4767E0J43l69k7M40j98k04K51j15j48J74J82m02L44L55o46J68O1j3l64K73Kk17
$$ plain form
4610 9 27 -155 -137 53 128 -66 -191 109 103 -32 267 151 143 -14 412 25 289 226 17 -148 -29 202 -223
4633 -223 -25 154 -398 -255 9 -124 117 -65 245 107 -196 -139 236 -12 268 -43 -182 97 155 3 -160
4654 -160 49 62 -144 24 299 -130 -147 140 -62 -380 -167 14 -119 -213 66 -114 -328 -21 -99 -49 17 405
4676 405 -14 27 19 32 -273 104 259 -109 -125 -7 90 -197 182 -24 -452 -120 -67 -162 -66 -76 43 -199 -2
4699 -2 -320 -67 -7 189 139 -22 -202 -123 -148 -59 118 -477 -108 279 -34 -49 50 251 29 -209 212 -37 -254
4722 -254 61 -286 159 89 250 -60 -67 181 48 -85 -80 -216 13 34 69 -270 -239 242 11 -60 -111 88 -340
4745 -340 -215 -14 161 -170 313 343 -102 27 45 -290 -196 -141 361 -410 282 31 -220 -138 521 -134 -153 50
4767 50 193 -176 -203 237 39 -165 86 -29 -177 -3 179 -223 121 476 -170 -2 59 46 -318 -45 -43 -260
4789b60l7L93j87j92L83R0l57Q4Rn3OO6L17o26M35L19k61k86M58j19o09L46Q4
4812Co9M9K58l85l72P85k83j38J55l4K49m56M99m8l86J7M45l84LL77l65j23J57
4835d6L41o62M97K31p33L65J30l01j86L90K4j73j27M42j71k61K35J88k68j7R3
4856il39O62j50k56K73o6J09j96l4K00k72j04M17L0k67J72k92M3J09n7L08n49
4878b68K49J9j76M7J51N5l24K88j56p3J01R1n8rK13m6l28M51k07k1K44k57q2L6
4902f0K41Kk67R0J88M2rj17J06m89L35O7k39k21Q9K17l80N21J29l75J70J92j54
4925G8j53J40m2l38K48K78k97K7P5o2rJ97j14O7oJ39m34J87M9R6q4r7ln1j90R3
4951b06K07J2J77p4P8p7nl65K87K39j99M1j54o9J37m41K99K08k74L28j44j23Q2
$$ plain form
4789 -260 -297 96 -91 -283 100 190 -167 -83 -74 -127 -121 -55 262 -364 71 390 129 -157 301 182 -427 -81 3
4812 3 -66 -17 241 -144 -516 269 -14 -152 3 -31 218 -238 261 213 -173 -156 289 -95 -92 285 -80 -203 -46
4835 -46 295 -367 130 361 -372 -7 123 -178 -364 26 50 -123 -250 192 21 -240 -5 183 -85 -102 -9
4856 -9 -348 314 164 -92 181 115 224 28 -6 194 -78 -182 235 265 -2 170 -122 -79 30 -27 281 -268
4878 -268 -19 0 -176 -129 22 77 -247 41 -115 -188 -87 4 -54 -63 150 104 -224 227 20 -1 243 -14 -96 -60
4902 -60 181 183 -84 6 194 236 227 110 216 -273 62 129 -110 -331 -242 -25 -405 116 245 -130 40 232 78
4925 78 -75 65 23 -315 -67 211 -86 -59 16 -46 -55 142 28 95 89 228 -206 -19 30 126 42 -55 -58 -109 -299 -206
4951 -206 1 13 190 116 194 117 112 -253 34 273 74 115 -39 -108 29 -412 -113 95 -179 149 5 -118 -36
4974c6j42j17K45O6L9L8J06n4j89l2J95k34J79J45m30J51j14L23l75K73j3Q0k52
4997a48J22K82m45J00R0l00K04J02k19L82k02J44m1k90lK01J2k92K84KK6j32Q5
5020c6l50M47j95j66K72K89k24o3oMj37RM44j45k15K03J96n59K49Q1n2p2j85J67
5044d4r1P7N3j96P6J22R4k15jl4O0KJ18N4k04K29N7l67J18j02L39n9q4oj27M0
5070i1L10l74j66J74l7M3J72j29j99K60L76l06j44K6n6L9O1L32j14k15q9L85l95
5093a37J20K03J20k35oN8k03J21j77R5k4Q6QQ1j57Rk08K68q3K5K13j24N4j97n9
$$ plain form
4974 -36 -178 -295 -50 16 55 93 199 145 -44 -76 119 -115 64 209 -221 -70 -184 139 -236 37 24 104 -148
4997 -148 -26 256 -189 -89 1 -299 -95 7 -212 170 -32 112 71 -219 -222 -21 -9 -301 -17 -15 11 -121 -36
5020 -36 -386 61 -134 -300 -28 261 37 -26 -32 -28 -165 -156 288 143 -72 131 327 -232 17 98 46 -26 -211 -44
5044 -44 -135 -58 -5 -201 -125 -3 91 -124 -125 -159 -99 -97 21 75 -129 100 157 -210 -92 -194 145 86 2 -4 -131 -91
5070 -91 219 -155 -321 -147 -184 -141 31 -98 -297 -37 339 33 -111 -85 -141 -102 -41 291 177 -38 -127 258 -137
5093 -137 -17 186 306 71 65 123 -80 41 -136 -41 -65 21 29 110 -47 -38 -246 22 -61 -36 177 53 107 -90 -149
$$ [...]
8191e8
##END NTUPLES=NMR FID
##END=
