##TITLE=1H_Pr C4-Boc
 CDCl3
 8 sc, 
 28.10.2022
##JCAMPDX= 6.0         $$ Bruker NMR JCAMP-DX V2.0
##DATA TYPE= NMR FID
##DATA CLASS= NTUPLES
##ORIGIN= UXNMR, Bruker Analytische Messtechnik GmbH
##OWNER= root
$$ XWIN-NMR		Version 3.5
$$ Fri Oct 28 13:50:42 2022 Russian Standard Time (UT+4h)  she@DPX200
##.OBSERVE FREQUENCY= 200.1313499994
##.OBSERVE NUCLEUS= ^1H
##.DELAY= (6, 6)
##.ACQUISITION MODE= SIMULTANEOUS
##.ACQUISITION SCHEME= undefined
##.AVERAGES= 8
##.DIGITISER RES= 18
##SPECTROMETER/DATA SYSTEM= spect
##.PULSE SEQUENCE= zg30
##.SOLVENT NAME= CDCl3
##.SHIFT REFERENCE= (INTERNAL, CDCl3, 0, 15.7039)
##AUDIT TRAIL= $$ (NUMBER, WHEN, WHO, WHERE, WHAT)
$$ ##TITLE= Audit trail, XWIN-NMR		Version 3.5
$$ ##JCAMPDX= 5.01
$$ ##ORIGIN= Bruker BioSpin GmbH
$$ ##OWNER= she
$$ F:/spectra/data/she/nmr/H-F/1/audita.txt
$$ ##AUDIT TRAIL=  $$ (NUMBER, WHEN, WHO, WHERE, WHAT)
(   1,<2022-10-28 13:49:36.20 +0400>,<she>,<DPX200>,
      <created by zg, POWCHK disabled, PULCHK disabled
       configuration hash MD5:
       00 E9 B6 7A A2 85 ED C7 34 08 36 98 17 FE 4E 26
       data hash MD5: 16K
       D2 90 19 4B DC E8 9C CB 57 C2 41 FB 09 8A 8F BD>)
$$ ##END=
$$ 
$$ hash MD5
$$ 11 68 49 7E D0 8C 81 81 70 86 77 48 AE 7D 70 FE
##$RELAX= 
##$RELAX= 
##$RELAX= 
##$RELAX= 
##$RELAX= 
##$RELAX= 
$$ Bruker specific parameters
$$ --------------------------
##$DU= <F:/spectra>
##$EXPNO= 1
##$NAME= <H-F>
##$PROCNO= 1
##$TYPE= <nmr>
##$USER= <she>
##$AMP= (0..31)
100 100 100 100 100 100 100 100 100 100 100 100 100 100 100 100 100 100 
100 100 100 100 100 100 100 100 100 100 100 100 100 100 
##$AQSEQ= 0
##$AQ_mod= 1
##$AUNM= <au_zg>
##$AUTOPOS= <>
##$BF1= 200.13
##$BF2= 200.13
##$BF3= 200.13
##$BF4= 200.13
##$BF5= 200.13
##$BF6= 200.13
##$BF7= 200.13
##$BF8= 200.13
##$BYTORDA= 1
##$CFDGTYP= 0
##$CFRGTYP= 5
##$CHEMSTR= <none>
##$CNST= (0..31)
1 1 145 1 1 1 1 1 1 1 1 1 1 1 1 1 1 1 1 1 1 1 1 1 1 1 1 1 1 1 1 1 
##$CPDPRG= <>
##$CPDPRG1= <>
##$CPDPRG2= <>
##$CPDPRG3= <>
##$CPDPRG4= <mlev>
##$CPDPRG5= <mlev>
##$CPDPRG6= <mlev>
##$CPDPRG7= <mlev>
##$CPDPRG8= <mlev>
##$CPDPRGB= <>
##$CPDPRGT= <>
##$D= (0..31)
0 1.2 0 0 0 0 0 0 0 0.06 0 0.03 0 0 0 0 0.0002 0 0 0 0 0 0 0 0 0 0 0 0 
0 0 0 
##$DATE= 1666950575
##$DBL= (0..7)
120 120 120 120 120 120 120 120 
##$DBP= (0..7)
150 150 150 150 150 150 150 150 
##$DBP07= 0
##$DBPNAM0= <>
##$DBPNAM1= <>
##$DBPNAM2= <>
##$DBPNAM3= <>
##$DBPNAM4= <>
##$DBPNAM5= <>
##$DBPNAM6= <>
##$DBPNAM7= <>
##$DBPOAL= (0..7)
0.5 0.5 0.5 0.5 0.5 0.5 0.5 0.5 
##$DBPOFFS= (0..7)
0 0 0 0 0 0 0 0 
##$DE= 6
##$DECBNUC= <off>
##$DECIM= 32
##$DECNUC= <off>
##$DECSTAT= 4
##$DIGMOD= 1
##$DIGTYP= 9
##$DL= (0..7)
0 120 120 120 120 120 120 120 
##$DP= (0..7)
150 150 150 150 150 150 150 150 
##$DP07= 0
##$DPNAME0= <>
##$DPNAME1= <>
##$DPNAME2= <>
##$DPNAME3= <>
##$DPNAME4= <>
##$DPNAME5= <>
##$DPNAME6= <>
##$DPNAME7= <>
##$DPOAL= (0..7)
0.5 0.5 0.5 0.5 0.5 0.5 0.5 0.5 
##$DPOFFS= (0..7)
0 0 0 0 0 0 0 0 
##$DQDMODE= 0
##$DR= 18
##$DS= 0
##$DSLIST= <SSSSSSSSSSSSSSS>
$$ [...]
##$SUBNAM2= <"">
##$SUBNAM3= <"">
##$SUBNAM4= <"">
##$SUBNAM5= <"">
##$SUBNAM6= <"">
##$SUBNAM7= <"">
##$SUBNAM8= <"">
##$SUBNAM9= <"">
##$SW= 18.0517283424941
##$SWIBOX= (0..15)
0 0 2 0 0 0 0 0 0 0 0 0 0 0 0 0 
##$SW_h= 3612.71676300578
##$TD= 16384
##$TD0= 1
##$TE= 0
##$TE2= 300
##$TE3= 300
##$TEG= 300
##$TL= (0..7)
0 120 120 120 120 120 120 120 
##$TP= (0..7)
150 150 150 150 150 150 150 150 
##$TP07= 0
##$TPNAME0= <>
##$TPNAME1= <>
##$TPNAME2= <>
##$TPNAME3= <>
##$TPNAME4= <>
##$TPNAME5= <>
##$TPNAME6= <>
##$TPNAME7= <>
##$TPOAL= (0..7)
0.5 0.5 0.5 0.5 0.5 0.5 0.5 0.5 
##$TPOFFS= (0..7)
0 0 0 0 0 0 0 0 
##$TUNHIN= 0
##$TUNHOUT= 0
##$TUNXOUT= 0
##$USERA1= <user>
##$USERA2= <user>
##$USERA3= <user>
##$USERA4= <user>
##$USERA5= <user>
##$V9= 5
##$VALIST= <valist>
##$VCLIST= <CCCCCCCCCCCCCCC>
##$VD= 0
##$VDLIST= <DDDDDDDDDDDDDDD>
##$VPLIST= <PPPPPPPPPPPPPPP>
##$VTLIST= <TTTTTTTTTTTTTTT>
##$WBST= 1024
##$WBSW= 4
##$XGAIN= (0..3)
0 0 0 0 
##$XL= 0
##$YL= 0
##$YMAX_a= 452488
##$YMIN_a= -510035
##$ZGOPTNS= <>
##$ZL1= 120
##$ZL2= 120
##$ZL3= 120
##$ZL4= 120
##$ABSF1= 10
##$ABSF2= 0
##$ABSG= 5
##$ABSL= 3
##$ALPHA= 0
##$AQORDER= 0
##$ASSFAC= 0
##$ASSFACI= 0
##$ASSFACX= 0
##$ASSWID= 0
##$AUNMP= <proc_1d>
##$AZFE= 0.1
##$AZFW= 0.1
##$BCFW= 1
##$BC_mod= 2
##$BYTORDP= 1
##$COROFFS= 0
##$CY= 11.3945322036743
##$DATMOD= 1
##$DC= 2
##$DFILT= <>
##$DTYPP= 0
##$F1P= 2.36226072786647
##$F2P= -0.459571619588291
##$FCOR= 0.5
##$FTSIZE= 0
##$FT_mod= 4
##$GAMMA= 1
##$GB= 0.15
##$INTBC= 1
##$INTSCL= 1
##$ISEN= 128
##$LB= 0.24
##$LEV0= 0
##$LPBIN= 0
##$MAXI= 10000
##$MC2= 0
##$MEAN= 0
##$ME_mod= 0
##$MI= 1.114404
##$NCOEF= 0
##$NC_proc= 0
##$NLEV= 6
##$NOISF1= 3.799351
##$NOISF2= 2.8
##$NSP= 1
##$NTH_PI= 0
##$NZP= 0
##$OFFSET= 15.70392
##$PC= 1
##$PHC0= -18395.41
##$PHC1= 11.0007
##$PH_mod= 1
##$PKNL= yes
##$PPARMOD= 0
##$PSCAL= 0
##$PSIGN= 0
##$REVERSE= no
##$SF= 200.130013532006
##$SI= 16384
##$SIGF1= 3
##$SIGF2= 2
##$SINO= 400
##$SIOLD= 16384
##$SREGLST= <1H.CDCl3>
##$SSB= 0
##$STSI= 0
##$STSR= 0
##$SW_p= 3612.71676300578
##$SYMM= 0
##$S_DEV= 0
##$TDeff= 0
##$TDoff= 0
##$TI= <>
##$TILT= no
##$TM1= 0
##$TM2= 0
##$TOPLEV= 0
##$USERP1= <user>
##$USERP2= <user>
##$USERP3= <user>
##$USERP4= <user>
##$USERP5= <user>
##$WDW= 1
##$XDIM= 8192
##$YMAX_p= 0
##$YMIN_p= 0
$$ End of Bruker specific parameters
$$ ---------------------------------
##NTUPLES= NMR FID
##VAR_NAME=  TIME,          FID/REAL,        FID/IMAG
##SYMBOL=    X,             R,               I
##VAR_TYPE=  INDEPENDENT,   DEPENDENT,       DEPENDENT
##VAR_FORM=  AFFN,          ASDF,            ASDF
##VAR_DIM=   8192,          8192,            8192
##UNITS=     SECONDS,       ARBITRARY UNITS, ARBITRARY UNITS
##FACTOR=    0.0002768,     1,               1
##FIRST=     0,             0,               0
##LAST=      2.2672688,     0,               0
##MIN=       0,             -510035,         0
##MAX=       2.2672688,     452488,          0
$$ Real data points
##PAGE= N=1
##DATA TABLE= (X++(R..R)), XYDATA
0@%%%%%%%%qJ6j6J6k4L2l2M0n6P2q8J04j21J45j76K08k46K91l41L98m58N23n99
31c20O86p82Q87j003J131j273J431j601J788j995K219k464K730l022L344l695
47a939M076m491M947n450O005o618P295q050Q901r862J0956j2216J3689j5436
61h193J7543k0143K3449k7819L3894m2970N8156q9742K68006m29145j87395P94616
73C90257l41583l84843M72475J12414n71580K86691M88657n66887l31918P12818
83B66501m3147n72171L51418L17806n00877j3430M74788k20035m17440M08788
93E2201K35964m79904P1722M28610l65315k23255M72882j1340m57505J73375L76735
104B74170k57537k08369L34912n6230l29306L08212J79703m48712J2884M43668
$$ y = [0, 0, 0, 0, 0, 0, 0, 0, 0, -8, 8, -8, 8, -16, 16, -16, 24, -32, 40, -48, 56, -65, 80, -96, 112, -134, 157, -184, 214, -244, 279, -320, 366, -416, 471, -532, 599, -674, 757, -844, 944, -1051, 1168, -1296, 1434, -1588, 1756, -1939, 2137, -2354, 2593, -2857, 3148, -3470, 3825, -4225, 4676, -5186, 5770, -6446, 7243, -8193, 9350, -10793, 12656, -15163, 18731, -24239, 33917, -55825, 212181, -216964, -404359, 390257, 48674, -336169, 136306, 248720, -322860, -36169, 452488, -114399, -446317, 266501, 223354, -348817, 2601, 320407, -180470, -193900, 280888, 60853, -356587, 52201, 288165, -191739, -120017, 308593, -56722, -279977, 192905, 181565, -275940, -102565, 274170, 16633, -191736, 143176, 86946, -242360, 65852, 245555, -203157, -190273, 253395]
114B53395j32902l53950K07381K03647k90964J3739L18995k59749k04893M21516
124A76215J0475m24311J43596L08641k45318j51292L32382l2822l46241K52326
134B3651K29301l99117j9741L67212j79425k13529K97387N1388l45533J01906
144h6500L31371k61167k16170L53375L91k98768K06542J27437l11955M2699L17118
155B04373j65739k63745K67396J51021l14452L9936K45940k26375p7613K96856
165A57598r2901k52352J97135J71596k42099o4186K54729q5921k02557K24138
175F5180O0032k67076R2166J97736j74329r2451J94534m146j96471J11251J66347
186A52773k18056o5522K46620o9418j70355J50267N4352j59025M3603J55149j23130
$$ y = [253395, 120493, -233457, -26076, 177571, -113393, -99654, 219341, -40408, -245301, 176215, 186690, -237621, -94025, 214616, -30702, -181994, 150388, 117566, -228675, 23651, 252952, -146165, -165906, 201306, 21881, -191648, 105739, 157127, -188406, -86500, 244871, -16296, -232466, 120909, 121300, -177468, 29074, 156511, -155444, -112745, 204373, 38634, -225111, 42285, 193306, -121146, -81210, 164730, -61645, -139258, 157598, 64697, -187655, 9480, 181076, -61023, -125209, 129520, 43599, -158958, 65180, 125212, -141864, -49698, 148038, -26291, -118742, 75792, 71646, -124825, -13574, 152773, -65283, -130805, 115815, 46397, -123958, 26309, 80661, -78364, -34761, 120388, -2742]
197b742j34635K02429N6074k33873O4003J64291j48738l9850J60392n9107j35719
208a07475J25766J03653j87267l6070K13002q3247j55757J76345L1478j85596
218a05168Q0139J37387j37467p6660J74921l265j87900J14168J31563k07466p084
229h6832K12559j08659j33189J62158M2759j66756M2365J49751j38829r3384K13961
240I5904k5647k08344J40313J16330j80643m878J57317p7407j16534J41897N5337
251I3645j93740M4989J81799j49309q6259J88877k7569j49149J02852R0209j39904
262d3559l1269J62263n2203j48052J44326O4317j82866N0021J44935j20730p4382
273h7199J39620J0801j44653N3508J24077j33109n1265J76915n6779j42084J35606
$$ y = [-2742, -137377, 65052, 121126, -112747, -48744, 115547, -33191, -73041, 87351, 28244, -107475, 18291, 121944, -65323, -101393, 111609, 28362, -127395, 48950, 80428, -105168, -25029, 112358, -25109, -101769, 73152, 69887, -118013, -3845, 127718, -79748, -86832, 125727, 17068, -116121, 46037, 88796, -77960, -35595, 114156, -24673, -118057, 95904, 70257, -138087, 2226, 118556, -62087, -66965, 90352, 12945, -103589, 38308, 93645, -100095, -55106, 126693, -22616, -108875, 80002, 52433, -96716, 6136, 96345, -43559, -74828, 87435, 35232, -112820, 31506, 95823, -87043, -37022, 107913, -12817, -87199, 52421, 63222, -81431, -27923, 96154, -36955, -88220, 88695, 31916, -110168, 25438]
284B5438O3599j51048P091J36329o6596j10699J31618M5009j71814O1442J42909
295A13278j44031n2475J62296l2282j34425Q6404R3101j36048l1827J65735o4608
306B5118j34250J50661M0428j67419N5551J24219j11162o9937J37542Q972j52468
317i2745P3107J21266j47824k7313J65266p2405j12699J26778M2112j38094J6211
328d6340J32958q1766r9280J46032J7647j58171Q1883J02882j36420k3493J33489
339F9421m1001j13468Q9877P7404j37614n617J50207q4539r5734J39476R616j33559
351g5531N6067R6769r7041n4937J29442l866j37395Q7071R1047j40518k360J32331
363H1079p1058q5582J02806L4828j20233J8380J22636q6597p9860J39890n929
$$ y = [25438, 89037, -62011, -54920, 81409, 14813, -95886, 35732, 80741, -91073, -29631, 113278, -30753, -83228, 79068, 46786, -87639, -1235, 91866, -44182, -76009, 89726, 25118, -109132, 41529, 81957, -85462, -29911, 94308, -16854, -86791, 50751, 59723, -92745, -19638, 101628, -46196, -73509, 91757, 19352, -93347, 33431, 75543, -62551, -46340, 86618, 4852, -94428, 51604, 69251, -88920, -7037, 95845, -40575, -64068, 69421, 28420, -85048, 4829, 82233, -55381, -60998, 89209, 4670, -91064, 48412, 58028, -75531, -19464, 77305, -19736, -74673, 54769, 50903, -86492, 579, 91626, -48892, -51252, 81079, 10021, -75561, 27245, 62073, -58160, -39780, 82856, -3741, -83601, 56289, 50360]
374E0360j32737Q0875P5515j12875j7318J13200l3081j03665R0215O6953j34449
385e7007J3444J29769r1991o9282J21918j774j09997N1214Q6657r2891m6479J29431
397F3012k4073j21500R9463N8605j31159J7136J06530o9194o7898R7569K6198
408E4689j16973L4997J07727j01648m8195J30559l1923j03966Q2321N2279r8259
419c8392n901J03544m0516q9966R8261L7993j26210L8411R8110r2245m1246J00511
431D2354q525r0747M8511P4430r1060k9656J17425m2816r5973R7193L3002j06072
443e1934K2621Q5167n7332n9186R0368K0343j10595M5549Q9970j03409k6495J12473
455E7540l7839q2338P3988M6672r2243n622J03028n1349q1266J05481J5324j17895
$$ y = [50360, -82377, -1502, 74013, -38862, -56180, 57020, 23939, -79726, 10489, 77442, -57007, -43563, 86206, -5785, -75067, 46851, 45077, -64920, -13706, 72951, -19940, -66419, 63012, 38939, -82561, 16902, 75507, -55652, -38516, 68014, -1180, -69078, 28491, 54689, -62284, -27287, 80440, -21208, -69403, 61156, 29233, -74733, 7588, 59867, -38392, -44293, 59251, 18735, -71231, 27030, 65023, -61187, -22776, 75334, -16911, -58157, 42354, 33829, -56918, -8407, 66023, -25037, -54693, 62732, 19916, -76057, 21136, 54138, -51934, -29313, 55854, -1478, -60664, 29704, 50047, -60548, -14999, 74971, -28438, -54933, 57540, 19701, -62637, 11351, 58023, -34220, -39842, 63186, 11837, -69429, 36052, 51376, -66519]
467f6519N3009P9513q9657l0370R6605j0067r1668N6332O7244j03067o940J12140
479F6555o5071p2314J02033J4957r6759K9068Q0803o2204n1744R5646j618j04341
491f4989O7409O3649j05489k82R5528m5183o5479P0316L5472r0121P613R3504
503F1948o6875n8196J02267p848r1639N8811N5567p8542k0175Q8735j5409q7354
515e8710O2900N3464r9034J0556R0443o6566m6952Q8733O736q7211K6641P8956
527E9956o5588m8960R5499j2593r0321P0567M4706r2895N931Q4495l8908o7431
539e5542O7797L7941r4509J4784R0180p2978m3860R7274j2398q0185N1490N3038
551E3032p3562k1687R1127k5073q8115P6860M3384r9322J9456P8223o1641l7116
$$ y = [-66519, -13510, 66003, -23654, -54024, 42581, 32514, -59154, -2822, 64422, -38645, -45585, 66555, 1484, -70830, 31203, 46160, -50599, -21531, 59272, -2932, -54676, 40970, 39352, -64989, 2420, 66069, -39420, -39702, 55826, 10643, -54836, 15480, 50952, -39169, -31556, 61948, -4927, -63123, 39144, 31296, -60343, -1532, 54035, -24507, -44682, 44053, 28644, -58710, 4190, 57654, -41380, -30824, 59619, -6947, -53899, 34834, 41570, -45641, -19000, 59956, -5632, -54592, 40907, 28314, -62007, 8560, 53266, -39629, -33698, 50797, 11889, -55542, 12255, 50196, -44313, -29529, 60651, -12327, -56187, 41087, 28689, -51496, -6, 53032, -20530, -42217, 48910, 23837, -64278, 12582, 55966, -43356, -23900, 54323, -7318, -44434]
563d4434P7766J533q6136L5872P7653q0839l7710J00740k5147p5705P1133K8351
575D3077q1374J3372P6183m5430o3724P9241K5682r6988L3519P4803p7684k1624
587d0947Q5588k3343o7931N0423M5019p4285j2899Q7697l9887o9512Q3334K0296
599D3553q8250K8166O2670n2575l3559O5309J498p6622M2434O3787q3655j7775
611d5019R2684l1228o2068N7883K5056o5213O224O7725m4650n6220Q3002J4713
623D2889r2347L9244O2299o8555j8031O9974j7151o4752M6285M7788p7808q267
635c8432Q8064m5206n8020Q0303R599p8631K7279O1058n1058m0082P1729K749
647B9352p8029N0201N2180q5156n11Q2719l9583n6909N6205K8013o6928M328O8194
$$ y = [-44434, 33332, 34865, -51271, -15399, 62254, -18585, -56295, 44445, 19298, -56407, 14726, 43077, -38297, -24925, 51258, 5828, -57896, 21345, 47027, -49961, -16442, 58361, -19323, -40947, 44641, 21298, -46633, 3790, 48809, -25476, -38375, 49322, 9435, -60077, 23257, 43553, -44697, -16531, 46139, -6436, -39995, 25314, 26812, -49810, -7376, 56411, -27244, -45019, 47665, 16437, -45631, 12252, 37308, -27905, -21681, 46044, 1394, -54826, 28176, 42889, -49458, -10214, 52085, -16470, -34501, 35473, 18322, -46430, -145, 47643, -30165, -38432, 49632, 4426, -53594, 26709, 36308, -42323, -15044, 46014, -5044, -45126, 26603, 29352, -48677, 1524, 53704, -31452, -31963, 50756, 11173, -45736, 10469, 38482, -28446, -24118, 44076]
660D4076m8812m3569Q3553n048q0281M7143M8292o3366j6328O3205j3298n9578
672d4011M7946L9617p6805P184P5697n1127m0151O7790J489o3065K3966N3232
684D1762m8641l4288P2327n425o9805N1046L4238p0357P813O0469l5313m5887
696d2061N0518K7572o5864O623O5220m8019l1894O9672j3166n9979M1535L7725
708C7882n3557j7590O1533r571n8496M7720L2251p0057J3587N9029m6611l0829
720c4709N3967N570n5065J7721N1474m7723k8598O9840j3841o0157M8088K5176
732C1743n6863M642M9931k5445m1747M9437K3390o7155J6035N8716n1598k2170
744c1084N9574j4884m6761L4664L1587m8545j2449O1570j9411n3572N3200J7815
$$ y = [44076, -4736, -48305, 35248, 30200, -50081, -2938, 45354, -18012, -34340, 28865, 15567, -44011, 3935, 43552, -33253, -26069, 49628, -1499, -41650, 26140, 27629, -35436, -11470, 41762, -6879, -41167, 31160, 25735, -44070, 6976, 41214, -29143, -21330, 39139, 3826, -42061, 8457, 36029, -29835, -23212, 42008, -6011, -37905, 31767, 18601, -41378, 157, 37882, -15675, -33265, 28268, 18697, -39799, 7921, 40172, -29885, -16298, 42731, -3880, -34709, 19258, 24828, -30237, -12516, 38958, -8765, -37363, 32477, 18636, -41521, 6567, 31743, -25120, -20478, 29453, 4008, -37739, 11698, 35088, -32067, -16032, 42684, -8914, -31084, 28490, 13606, -33155, 1509, 33096, -15449, -27898, 33672, 14261, -39311, 13889, 31704]
756C1704o2352K0407M2792m0986k1342M7101L454n1673K2931M5312n2504j3714
768b8870O1603k5794m2420M5163J4514m5304N745M3208k4037l5160M9326R502
780B7476n9321K6819M0442m9052r550M5786j2410l6007K7379K6949m4604o047
792b2140N4409k8179l9141N0345N057m7882J9847L2235l0400j8485M1293K274
804A9233m8761K7579L5587n1876k475M9980k6527k9651L6822J2105l9012L770
816a3226M2357k7171l1838M9602o80n0346L0797K7107m1215m615L8473r523l4973
829b5251K7009K5459m6687J565M8074l3684k5614M5843j432l7295J7461K9035
841B4483k8152j8563M2459m344m5400L3904K3081m8130P383L7915k4465k1514
$$ y = [31704, -30648, -10241, 32551, -8435, -29777, 17324, 20778, -30895, -7964, 37348, -15156, -28870, 32733, 6939, -35481, 9682, 24196, -21108, -15363, 27845, 3808, -31352, 17974, 27476, -31845, -5026, 35416, -13636, -23186, 22600, 10190, -25817, 1562, 28511, -16093, -22140, 32269, 4090, -35051, 15294, 20351, -27531, -7684, 24551, -5849, -24334, 16959, 19233, -29528, -1949, 33638, -18238, -20713, 29267, 2740, -26911, 9911, 22016, -16996, -13226, 29131, 1960, -29878, 19724, 19044, -31302, -505, 26602, -14613, -19228, 19245, 9722, -25251, 1758, 27217, -19470, -17905, 30169, -3515, -29129, 16714, 15282, -22013, -4552, 24483, -3669, -22232, 20227, 15883, -29517, 4387, 27468, -20662, -13279, 24636, 171, -21343]
853b1343L0948J0351l8257O584L9758l4061k1397M8202j1087l7415L0838J6920
865B0041l3143j528L3938j1384l3021L1343J7271m6010J2767L6861l4399j1711
877a8975L6238n503k9599J6086K5368l0138j4043M1683j3439l5224L6022J0092
889A8568l7322J1254K6487j9751j7897K6862Q525l7303J2360L2789l5640q836
901a9904M0071j5133k4205K4611J2165k6861l117L1503j3394k9725L4122P898
913A8031l9701J9000K4361k9267o077K7452m142k7099J4519K3560l2568o401L9336
926B1004k0204k3739L3850K071k8631J1046K1585j7889j7756K9343L303l6071
938b2088K1353K3318l5356J983L0495j7163j7839K1476R327k7054L81L0923k1078
$$ y = [-21343, 9605, 19956, -18301, -11717, 28041, -6020, -27417, 20785, 9698, -27717, 3121, 20041, -13102, -14630, 19308, 7924, -25097, 6246, 23517, -22493, -9726, 27135, -7264, -18975, 17263, 11760, -17839, -1753, 23615, -6523, -20566, 21117, 7678, -27546, 8476, 18568, -18754, -7500, 18987, -764, -18661, 8201, 16726, -20577, -8217, 24572, -11068, -19904, 20167, 5034, -19171, 5440, 17605, -9256, -12373, 19130, 5736, -23989, 10133, 18031, -21670, -2670, 21691, -7576, -13653, 13799, 9657, -17442, -2923, 20637, -11931, -18332, 21004, 800, -22939, 10911, 12982, -15649, -4603, 16982, -907, -18663, 10680, 13983, -22088, -735, 22583, -12773, -10790, 19705, 2542, -15297, 6179, 15506, -11548, -11167, 19756, -1322]
951a322k0270L6299m363l0640K2743J3396k4543k677K3380o127k5170K0577J7054
964A8337l4454O232L1570k5926j1143K8539m062k2581J0740J9253k0815j2522
976a6832L2458o920k9691K8154J0023l1306Q680K1090j6593j3748J9773P314k8238
989a5836Q101K8061k7859r341L3692j2064k1670K0641Q955k1518k531K4683q546
1002D768k4375K7040R685l4174J4600K2615k6149n863K2986l682k1652J0891K0515
1015A7205k4764p553L3830j4905k4022K9343L389k6930Q296J9371j4620j5700
1027a7060K3950O146l1223J5700K4250l1900k179K9790j4324j8282J8776J0294
1039A3938k2813k272K8968j4817k2412L1963J030l1750J7649J6533k3481n385
$$ y = [-1322, -21592, 14707, 10344, -20296, 2447, 15843, -8700, -11377, 12003, 5876, -19294, 1283, 18337, -16117, -9885, 21685, -4241, -15384, 13155, 9093, -13488, -2748, 16505, -4310, -16832, 15626, 8706, -20985, 7169, 17192, -14114, -5434, 15656, -937, -14685, 5088, 12402, -15836, -7735, 20326, -7533, -16874, 16818, 4754, -16916, 3725, 12680, -8838, -11369, 13314, 4768, -19607, 7433, 17118, -17056, -2456, 20159, -5990, -11853, 11133, 7451, -14201, -3310, 17205, -7559, -15112, 18718, 3813, -20209, 9134, 12523, -14407, -6111, 13260, -1360, -17060, 6890, 13036, -18187, -2487, 21763, -10137, -12316, 17474, 3150, -15132, 3644, 13938, -8875, -11147, 17821, 3004, -19408, 12555, 13585, -18165, -516, 16017, -7464, -12849]
1051a2849K2391k010k4516J5443K0293l0083q32L1523k0400j6035K6196J63k2450
1064a3166P220K0614j4848j6098K7974P83l0361K0463J5467k9462L006K3009j2766
1077A835j6581J7279J2109k4627L03K8308k0083j5977K9598m794k4303J6244J2885
1090A2196j8522o192K3134j922k5412J8971J5628l0609N039K4565j9223j0899
1102a3246K1070J361k0142N599K2383j8126j4908K9918n118k6111K0664R030k3343
1115a0969L354J8854q926j7176J8136J1831k8177M873K5871k2690r364K5776o920
1128D473j8007J3534J2999j7165p523K5407o111k4832K3136Q693k8734R884J8444
1141A4198j7220q299J8367K494k1051P479K0952k3271q124K8644j1380j9019J9980
$$ y = [-12849, 9542, 7532, -16984, -1541, 18752, -11331, -12163, 19360, -1040, -17075, 9121, 9284, -13166, -5946, 14668, -180, -16278, 11696, 12479, -17882, 2581, 18048, -11414, -8408, 14601, 1835, -14746, 2533, 14642, -9985, -9682, 18626, -1457, -17434, 12164, 7370, -16933, -689, 12196, -6326, -12518, 10616, 8694, -16718, 2253, 17881, -12728, -7689, 16876, -2347, -13246, 7824, 9185, -10957, -5358, 17025, -1101, -16009, 13909, 8791, -17320, 3344, 12374, -10969, -7615, 11239, 2313, -14863, 3273, 15104, -13073, -8200, 17671, -5019, -14383, 11393, 4473, -13534, 0, 12999, -4166, -11689, 13718, 7607, -17225, 5911, 14604, -14130, -4246, 14198, -3022, -11321, 7046, 9540, -11511, -4032, 16920, -6351, -14475, 14169, 2789, -16230, 3750]
1154C750N542j8127K547J7564q992j6311K1143O204k8462J1832J9435k3062k525
1167i462K0048o135j4563J1403J2070j8997m817K5187j2028j9122K3867J518k1637
1180a2668J0252J3343j3164q289J7054K363k2291J0957J7191k4372r60K3928j3094
1193B50j2387J6708N433j6252L97J8467j1084j5678K3403k6k4866J6181J3009
1206A3555j9864j477J7077m045j6121J1061J2611k2343j80K4222j6767j2690K3173
1219H212j241j7749Q825J3118j2828j0138K0098l49k3191J6367J2894k4378M399
1232e961J9215j2685j0463J4670N808j8734J461K0298j5499j1821K3863m812j9513
1245a4173J6475Q697j7413j436J6633m401j7764J4508J0661k3428N530K0369j7894
$$ y = [3750, 9292, -8835, -6288, 11276, 2284, -14027, 7116, 13320, -15142, -3310, 16125, -6937, -9462, 10586, 4451, -10112, 1291, 13361, -5636, -10453, 14734, 2706, -16416, 7451, 8969, -12668, -2416, 10927, -2237, -10526, 6528, 8891, -13400, -2443, 14748, -9624, -10584, 13344, 250, -12137, 4571, 10004, -6248, -5851, 12616, 1532, -14146, 9257, 9231, -15635, 546, 13555, -6309, -7786, 9291, 5246, -10875, 186, 12797, -9546, -9726, 14496, -2271, -14961, 8212, 6971, -10778, -1953, 11165, -1663, -11801, 8297, 7948, -15243, 1124, 14018, -10360, -5961, 13254, 569, -9894, 4776, 10584, -8150, -6689, 13609, -1890, -13711, 10152, 5340, -14173, 2302, 10999, -6414, -7850, 8783, 4382, -13382, 1126, 11787, -11641, -6111, 14258, -3636]
1258c636o729J9385k235j5350O664J3729j4317q811K1700m920j9645J8622O719
1271A1176j9942N213J4180j0052j0510J3154O213j9962M354J9174j7468o883K1378
1284A0025o687j3576J2176P017j3951l356J6960m444j7394J6768P528k1286P799
1297b421J4451j4466m933J3795j49j4765M992J5129j5399p027K1560p690j5092
1310a2015J6629L316j5480K851J2506o974j1991J4288N957k0178P966J5738j7394
1323d781k918J6920o203j1075Q640Q045j3083l573J8069p183j4832J8122K693
1336H841j8204Q299J0102j1360n321J1871J327j5237P139J3475j7020j859J8428
1349A0481r759j0041J3014K055j1784J164J2415o631j1201J5954K080j7430J0443
$$ y = [-3636, -10365, 9020, 6785, -8565, -1901, 11828, -2489, -11300, 10400, 5480, -14165, 4457, 11176, -8766, -3553, 10627, 575, -9935, 3219, 9432, -10530, -6176, 12998, -4470, -11353, 10025, 3338, -10238, 1938, 8955, -4996, -8352, 8608, 4164, -13230, 3538, 11066, -10220, -2421, 12030, -2436, -7369, 6426, 6277, -8488, -3496, 11633, -3766, -10793, 10767, 3077, -12015, 4614, 7930, -7550, -4699, 7807, 833, -11158, 3130, 9087, -11091, -3125, 12613, -4781, -7699, 9221, 3018, -8057, 583, 8628, -4455, -8028, 10041, 2858, -11974, 6148, 8841, -9363, -1064, 9038, -2322, -7643, 4228, 5555, -9682, -2543, 10932, -6088, -7947, 10481, 722, -9319, 3695, 5750, -6034, -4870, 7545, 914, -10287, 5667, 7747, -9683, 760]
1362G60R624j5205k10J1819m189r854O837R014j3657j716J7024j0019r966J6019
1376F281j589j2942O477P878p885o018J1881J352j5026R604J0069j6148J370J3227
1390H531q761o306Q843L207r854j66J3215p996r073J5321j367j4133R639N649
1404F749j1135n03R197j627j0494P302Q812j4162J126J3851j0968n558J2135j976
1418B749q672L980P972o794o117J3101q16j3578J0882N221j3921L500Q722o551
1432c22n136P330L683j0232J107J1958j0064n455J3721n155q952Q414K912p304
1446c495q43Q780j663r687R110M771j3520N051Q747j0233j575Q674j520o543K891
1461a055P798p746m441J2370m926r225J0640K38r061M061N035m032m427O657L389
$$ y = [760, 10384, -4821, -5031, 6788, 2599, -7255, -418, 8596, -5061, -6777, 10247, 228, -9738, 6281, 4692, -8250, -1773, 6105, -1780, -7798, 4083, 5435, -9591, 13, 10082, -6066, -4696, 8531, -230, -6536, 2307, 5514, -4340, -4506, 8709, 713, -8360, 6961, 5594, -8539, 1100, 6749, -4386, -4889, 4308, 2681, -7813, -511, 8301, -5861, -4735, 9116, -1852, -7410, 4725, 2749, -5923, -1943, 6029, -765, -6882, 6219, 5403, -8175, 2707, 7928, -5993, -2493, 6229, -322, -5458, 1872, 5555, -4677, -3570, 8388, -1676, -7131, 6590, 1435, -7517, 897, 3809, -3495, -4338, 4442, 2779, -6908, 2202, 6973, -6547, -1496, 7251, -2982, -4557, 4117, 2597, -3946, -1055, 6743, -1003, -5444, 6926, 2000, -7225, 3415, 3653, -5408, -1347, 3688, -344, -4771, 1886, 5275]
1476E275j0920L718Q772j1050k74R914n805m817O381K786n596j354Q846l949q301
1491f374J0578J33j0870O683M822p623M1N639k19o674L522O576r614j160J0493
1506E953p339m725R131j450n703L156M895l982m509P967N99j0736P547N169j0508
1521d535K437P080n174k724M797K544o843j78Q966p527n089J0990l414p353P507
1536A484J791n624m7N515j179p340O017M426j0986L268Q544q534j035P565j997
1551A868m777K679N277o002l424R834l968q217R631J415q817M277M508m432l429
1566c577N344J918r003L169Q037r566j381J0274m853m917O249J909n880q68P266
1581D121k891p781R565J406j0419O066N704p776m16O251p61o858K906O510q699
$$ y = [5275, -5645, -1927, 6845, -4205, -4479, 5435, -370, -5187, 1194, 3980, -1616, -2970, 5876, 1927, -6374, 4204, 4337, -6533, 150, 4972, -2651, -2610, 3029, 2810, -3864, -342, 6234, -3380, -4540, 5953, -1386, -6111, 3020, 1570, -4133, -977, 3918, -64, -4573, 3394, 3993, -6743, 804, 5973, -4535, -2098, 4982, -192, -2916, 1881, 4425, -2418, -2596, 6370, -1157, -6246, 4744, 1330, -6023, 1484, 3275, -2349, -2396, 3119, 1940, -5400, 617, 5043, -5943, -2675, 5869, -2665, -3700, 3865, 1868, -2909, -230, 5047, -955, -4379, 5455, 1487, -6730, 2901, 4316, -4501, -224, 4284, -148, -3577, 1767, 3685, -5318, -2149, 5888, -3678, -5059, 5215, 362, -4555, 1694, 3603, -2277, -3145, 4121, 1230, -6551, 3014, 4420, -5999, 67, 5771, -2005, -2421, 3830, 3069, -3789, -883, 5627, -3072]
1596c072j635J0760o226n948R522k78o969K771M634l876n110P233J752j0051N737
1611g56O610r810J286P945m813m111M809L069o561j241R267n442o518J0885j266
1626C353q622O308L691o622j350N776q4p987M418O588r653O86R333o645l457P180
1642B913n27n441J182O091m405n529R515l36r115P339L656q329J871N251l650
1657D86m198M119M088p928J27R274o593m291Q932k179n826M149K626m448k434
1672d096O407q3q070O494M758r249K767O093n605k212M625O68n206P44O831n387
1688e21l824Q913k170o921O393J313n743Q15L849j432m925M398L918q235K334
1703a838P151p368j242O403k533l701K381L545l857k511P370j783o872P576J347
$$ y = [-3072, -4707, 6053, -173, -6121, 3401, 3123, -3846, -1075, 3559, -317, -5427, 1806, 3558, -6493, -756, 5854, -3956, -2670, 5275, 462, -3649, 1160, 4229, -2332, -3573, 5694, 252, -6266, 4619, 3353, -5269, 1039, 4730, -1892, -3242, 2534, 2450, -5537, -1119, 5469, -4184, -3498, 5835, -810, -4267, 2913, 2386, -3055, -1873, 4218, -187, -5716, 3799, 3463, -5652, 1687, 5343, -2986, -1115, 4136, 486, -3712, 407, 4495, -3433, -3306, 5968, -625, -4916, 4016, 1837, -3989, 160, 2786, -1662, -4096, 2311, 2228, -5842, 652, 5410, -3839, -1072, 5021, -584, -2796, 1829, 2497, -2709, -1965, 4866, -521, -4345, 4568, 2398, -4523, 1870, 3183, -2560, -1745, 2104, 672, -4253, 145, 4063, -4172, -1838, 5313, -2055, -3297, 3106, 573, -3128, -747, 2798, -1059, -3570, 3800, 2017, -4855, 2721, 4068]
1718D068p945M058L225m183j880M101J042n666K141N839o544j679P905m433m197
1733d148N670Q7m163N51M089j310m947O446J314p953M771L938o861M02M720k162
1749D44k584K050L759n133q94P223m392m601P142j397n102L218K291k796k210
1764b982M103J473o563L513N027q031J288N857m467k220M104P89l693Q8N712l046
1780I52m775P313j040o711N431J702n214O05L851p00m162K818M067o989N10O711
1796D369o351j666O214k097l720K487L331k737l113O128m09p020N607K778p522
1811c721K629M487m069j213L148J714m828N05O094n730k796P649l294m840N296
1826A031R87l795k40M185p07n503M852L002p916K564N263n726o15M740q16l061
$$ y = [4068, -3877, 181, 3406, -777, -2657, 1444, 2486, -3180, -1039, 4800, -1744, -3423, 4482, 49, -4148, 1522, 1609, -2554, -2003, 2086, 776, -4171, 2275, 3589, -4364, 407, 4345, -2516, -2114, 2606, 444, -2140, -90, 3669, -1464, -2358, 4865, 473, -4128, 3014, 1617, -3485, -267, 2024, -772, -2982, 1121, 2594, -3969, -456, 4571, -3460, -2172, 3685, -782, -3002, 1102, 1891, -1802, -1714, 3998, 952, -3823, 3490, 2450, -4261, 1170, 2872, -2342, -1737, 2114, 1414, -2748, 70, 4137, -2852, -2342, 4369, -1982, -3648, 2566, 469, -3251, -764, 2567, -170, -3283, 2845, 2436, -4584, 1023, 3801, -3721, -1092, 3395, -674, -1887, 1261, 2975, -1853, -1348, 4746, -984, -3780, 3869, 575, -4265, 1031, 2018, -1777, -2017, 2168, 1461, -4042, 810, 3812, -4104, -1540, 3723, -2003, -2618, 2122, 1306, -1755]
1842a755J320M123m057k890P053k324o130O503P64n343K147K882j942k768L293
1857H76K273o482J578N774o228j265O398k905k939L263J874k840j580M899j147
1872A549n691N659J821o926L415L277l865r76L283R05m312P93N106n391k022P119
1888C744l480m228N203N01l685O92L375j511m024L995K105o783L009M680n803
1903b210M28M371j624k459J474L071l576k029O240l018m489O130k06m748K760
1918A15K363k811j515K864J283n310J949M530n901l39N808l425j978L592L30k615
1934a060p02M030j341m451M986J151n788L748K134l839O58K261n42k642P09L531
1950B843m291j235N856l282k822M760o20k941J119K052j226l066L402J411n060
$$ y = [-1755, -435, 3688, -369, -3259, 3794, 1470, -4660, 1843, 2607, -2736, -589, 2293, 351, -2417, 876, 3149, -3333, -1755, 4019, -2209, -3474, 2924, 19, -2920, 343, 2217, -623, -2203, 2696, 1549, -4142, 1517, 3338, -3588, -173, 3104, -761, -1737, 1546, 2451, -1861, -1068, 4038, -1353, -3375, 3744, 264, -3964, 1239, 1740, -1945, -1253, 2122, 611, -3413, 582, 2687, -4096, -1087, 3593, -2210, -1782, 2589, 965, -1494, -20, 3051, -525, -2554, 3686, 668, -3821, 2309, 2103, -2645, 115, 2478, -333, -1848, 1016, 2299, -3011, -1062, 3468, -2433, -2772, 3036, -389, -2367, 1225, 1555, -1060, -1762, 2268, 927, -3524, 1462, 2613, -3175, 573, 2707, -1132, -474, 1787, 1245, -1397, -688, 2843, -1448, -2683, 3173, -109, -2931, 1829, 1209, -1732, -613, 1439, 213, -2853, 549, 1960, -3100]
1965c100K704L301m768J042L232k133j225J266J366k392j190M460k029l387N100
1980B247q67l311K632N72j678n96J423O88l341J279L492m700K39M637l344j126
1996a754K978n02j647k43K358q99k849L904N00m568L928J021l395J321J162p10
2012F05j471L45K524l096n55M079l085j323M008j858j626J683M26r29j401J922
2028B48J053l877K876J919l720J397K141k808L14R50K80j083n53K622j769j760
2044a770L935j065k712K798l40j727O04K28M74j997J083K313l665J305K428l006
2060a114L36K172j682l46K71P91j39j934K970n3k704K921k24k669J992K51j288
2077d49K66J81Q52j558k01K894k761l14L059k566n29J684p84m99q3P44N09k046
$$ y = [-3100, -396, 2905, -1863, -821, 2411, 278, -947, 319, 1685, -707, -1897, 2563, 534, -2853, 2247, 1380, -1931, 701, 1273, -405, -1001, 422, 1110, -2231, -952, 2540, -2160, -1921, 2716, -628, -1754, 1224, 722, -925, -1168, 1190, 291, -2558, 1346, 1846, -2722, 1206, 2227, -1168, 153, 1315, 605, -866, -521, 2003, -1093, -1648, 2431, -654, -1977, 2031, 173, -1453, 230, 656, -273, -1674, 248, 1301, -2576, 300, 2219, -1501, -104, 2037, -771, -457, 493, 773, -310, -863, 1759, -10, -1770, 2165, 1100, -1612, 1186, 846, -881, -277, -49, 425, -1572, -489, 1824, -1841, -536, 1892, -1114, -778, 1394, -288, -634, -363, 428, 289, -1645, 1325, 1272, -1432, 1489, 1265, -1404, 588, 839, -449, -183, -2, 850, -708, -909, 1985, -776, -1090, 1969, -597, -1126, 558, -226, -725, -808, -64, 445, -1601]
2095a601K088Q97l210K639O85k501J227K78p09o1l5J690j700n64K879j855j495
2112a348K843j634j337J974o86j40l54N72J068k231J052K028l476J352J587k172
2128i02L74R09k61j43m32J544l96j879K880q31k005K349o66j763J246J08J27o40
2146c81K91J630k574K15K374k712J40J791j641m3R33R7J96p48J178K13k619K479
2164H19R0k447K174J09j452R18J33N24q90l6J702j844j012K785k030q92K192j144
2182c01l28M93M20J60j738J392Q67k458J226J415k778J490R22j258P31k69J039
2199A025r27q83J909q97j686K868j110j562K062n75j81p4N7P32k039Q23J718k777
2217a517M52J937j684K49J146n42k8n24J351m31j929K280j48k251K324J85j689
$$ y = [-1601, 487, 1384, -1826, 813, 1498, -1003, 224, 502, -207, -268, -303, 1387, -313, -877, 2002, 147, -1348, 1495, -139, -1476, 498, -188, -328, -682, -110, 958, -1273, -221, 1807, -1669, -317, 1270, -902, -528, 381, 120, -23, -455, 1089, 693, -1186, 1694, 863, -1142, 1207, 541, -1222, 24, 132, 259, -381, -90, 1540, -1034, -819, 1555, -1157, -1017, 774, -867, -910, 23, 120, 316, -432, 746, 959, -1660, 819, 909, -1538, 636, 745, -707, 211, 344, 868, -22, -58, 1644, -200, -1212, 1573, -457, -1349, 843, -301, -629, -136, 284, 444, -1294, 98, 965, -1493, -267, 1148, -1630, -140, 782, -476, 255, -14, 1025, 98, -785, 1124, 227, -1459, 1409, 299, -1263, 799, 224, 43, -31, 26, 758, -1281, -458, 1260, -1517, -1065, 872, -812, -563, 583, 41, 13, -511, 840, 409, -1520, 760, 612, -1639, 685, 870, -819]
2234h19J402l6p9m94p9J485k080k59K161j939m46K064j249n1P08q6j46j020J236
2253B73O85k929J886J102k335J392J008j454O11K49K62p80l78J730j319j472K839
2270A370j262j022K166j008n48K94p7N3o27K83J153k098P56J679k052M60J303
2287H23r61n8J18L99m53q07J899n74j857K426j42j747J411p9n09J40J36N95j474
2306g14J72J763k225K14K314k151m9J477r73Qm23N70j05j302J683N00k070K083
2324G72K73j774J136K89n34k41l15J293j233m32K467j889m64J974j232m98P23
2341C15l60j60n92M96Q19j917J284J275k216Q42J304j392PM25M3k08q04J746l99
2360E08j711K247m14j611J819m02q21M68J28K7q32L74J421j918P8K285j837n87
$$ y = [-819, 583, 547, 468, -26, -105, 1380, -700, -959, 1202, -737, -1183, 881, -368, -419, 289, 203, 57, -963, 273, 958, -1971, -85, 1017, -1318, 74, 1082, -372, 239, 488, 750, -30, -408, 1322, 3, -1469, 1370, 108, -914, 1252, 244, -304, -10, -87, -34, -661, -378, 775, -1323, -567, 1112, -940, -480, 823, -138, -196, -78, 321, -132, -939, 960, 386, -1471, 955, 813, -934, 477, 398, -111, 29, 165, 760, -714, -542, 1221, -1004, -790, 1524, -627, -676, 801, -172, -164, -587, -17, -122, -1424, 259, 759, -1311, 772, 1045, -729, 407, 696, 162, -79, -394, 899, -334, -766, 1701, -188, -652, 1322, 90, -408, 315, -45, -205, -797, -301, 518, -1399, -115, 1160, -1056, -214, 1090, -302, -295, 130, 173, -35, -839, 907, 508, -1203, 1044, 630, -981, 838, 436, -385, 83, 211, 238, -594, -220, 1201, -717, -639, 1646, -191, -778]
2378g78J552j261J55k29O51J62j372J791l4j953K113M09k003J028K43o47N5j13
2396b31Q30r99j49K082j647o89K172j399o96J167k63n87m50J056N20j807J427
2413C37R64k431J056R40j437P0P85r5m73l55J587r01p53J971p29j491J811l01
2431E55j097L03M65m6o83N56J100j937M10J681k003PJ270q83l31M86M01r2j117
2450i55J655l7j872J657M77j490P34K52q32J92K79N08p63m49K031j215r70J989
2468A191j277q43J150k30l37j10M04O22j600R17J114k332J016J178j652O94N82
2485D87n75l5j20J100o68j158K036l92j793J630m07q27O99Q5K33p57K98J133j480
2504e11kJ738j796j19J082q81k19O49O4J08p41J403l14j681J510J49j293J054
$$ y = [-778, 774, -487, -332, -561, 90, 252, -1120, 671, 637, -1316, 797, 1206, -797, 231, 474, -173, -118, -231, 599, -400, -549, 1533, -114, -803, 1369, -30, -726, 441, 178, -409, -859, 197, 717, -1090, 337, 1301, -1130, -74, 866, -571, -501, 284, 189, -284, -639, 948, 47, -706, 1265, 536, -955, 856, 555, -542, -239, 226, 180, -503, 53, 1153, -784, -374, 1307, -696, -689, 581, -302, -633, -147, 254, 162, -955, 700, 663, -1209, 448, 925, -565, 169, 421, -411, -219, 60, 568, -195, -644, 1387, 172, -798, 1191, -86, -929, 221, -9, -346, -456, -52, 570, -1030, -113, 1001, -1331, -315, 863, -789, -95, 487, -88, -123, -243, 857, 189, -969, 1067, 675, -1118, 512, 105, -722, -23, 62, 295, -462, -164, 969, -511, -513, 1225, -571, -690, 392, -489, -708, -59, 5, 113, -628, 775, 461, -1220, 290, 439, -854, 200]
2522B00L46q48K63J97O13q40j36J258j159q56J729r47p16J130k49k23M1J27N62
2541D92r79N75O26j638P46Q26j362O40K46R5j50k89R67l19q49J059m07j133J205
2560C51m11l80O82k18M20o78L5R02r82k14J155j579L29R56m71j47L36Q7Q1n91
2580c37P82J49j508R26M72j088P94K39m56L23k04K68l75l41R99o07o32J137p93
2599b52m87J020m63J77j50JK61n84K37P91j537Q71M69q93M56M13k64n6j85P21
2619E46l04n82Q90n08p80J196l14o20P02j55J89k89k26P85r38l36J293j204J46
2638e09P88m96M99j14k91M93n79L46K52j223R78M73j152P01J57k06M24n63J69
2657A47pn96P48j74p55R45k27l80N58m79K77N7n33O35o83L13L16q45N47N31o25
$$ y = [200, 546, -302, -39, 158, 771, -69, -205, 1053, -106, -962, 767, -180, -896, 234, -15, -238, -197, -70, 492, -487, 88, 714, -924, -178, 648, -714, -74, 172, 267, 117, -172, 795, 476, -373, 686, 279, -854, 351, -60, -440, 242, 24, 444, -234, -199, 703, -279, -493, 662, -917, -588, 368, -103, -250, 86, 173, 254, -337, 445, 594, -914, 12, 484, -604, 190, 429, -27, 296, 92, 360, -15, -356, 643, 36, -596, 541, -252, -739, 281, -182, -5, -155, -154, 107, -477, -240, 551, -986, -115, 354, -539, -83, 330, 66, 10, -175, 546, 242, -340, 550, 42, -738, 458, 144, -476, 226, 71, 260, -29, -255, 530, -408, -744, 549, -655, -509, 279, -217, 282, 168, -123, 370, -209, 137, 389, -834, 144, 617, -535, 166, 323, 117, 541, -22, 147, 140, -456, 292, 118, -637, 308, 81, -299, 259, -220, 57, 114, -419, 216, -467, -154, 162, -683, -136, 395, -230]
2678b30L84N3l54Q85q73J19K80o03N55J6o55P75l74j07P77p65J35j4m73P71o29
2699c27m04J041q49M74L35o64M88J30n13M93o12J32O58q26M29J70j00K95l37m5
2719c2L62m77K03K34q19O25j61k51O69n68o3O27m43J82q4n70P23m30j59O21n87
2740c98K01N30p63P96k47l09N29k99j26L58p78M23J73l11P26n20l9M47n48J01
2760e4K94n17K19k40j25Q01p74J82O82q22M24o3m66O73k30o6L44k01j63L55k75
2781b2N98k52l77N55o55j0K57k05K17q6m62N88j14j57K35p36N31N8m37M26K1k98
2803c25O75l29j32M98n02N97l39m37Q38p28K37L10o12O31o7o02Q46o72m9N01q55
2824e16M84J22o72L82J56k11M05k94J45K05n74N11Q3o13N13l36p8N46l39r4K21
$$ y = [-230, 154, 207, -147, 738, -135, -16, 264, -339, 216, 232, -423, 352, -22, -129, 648, -117, 18, 4, -469, 302, -327, -731, 310, -539, -65, 270, -394, 94, 224, -289, 204, -408, -276, 382, -444, -15, 155, 55, 350, 13, -32, 330, -147, 56, 290, -529, 96, -65, -316, 353, -215, -278, 349, -94, 88, 4, -566, 157, -273, -432, 189, -398, -197, 333, -430, 366, 119, -190, 339, 40, -86, 272, -506, -83, 90, -221, 505, -15, -54, 393, -155, -54, 240, -277, -58, -298, -423, 378, -396, -214, 468, -354, 70, 7, -459, 214, -16, -82, 262, 61, -102, 253, -22, 576, 324, -53, 502, -153, -163, 94, -111, 106, 20, -442, 146, 32, -125, 110, -626, -95, -37, -474, -48, -27, -325, 350, 21, -111, 387, -115, 482, 143, -294, 544, -184, 53, 363, -249, 382, 315, -287, 559, -113, -162, 339, -516, -32, 90, -582, -200, -44, -255, 150, -144, 1, 206, -368, 143, 226, -387, 126, -210, -288, 258, -81, -175, 46]
2845D6J2K72l36j75N89p86J28N77l63J40J68l11M99n10J86J17n96K63K96p64P05
2866A57r8n12N22j61K16J23l65M28j03l12L68n75K03L11k79K19j08j5J20k11k24
2887b96M78n44J91N61p09M20M3m67M24j81J34J22p11O26j93l02M22K6j56O19o44
2908a37L56J12m26L06m43k1Q37r38K34P28q96K16K48l26L49l31M7J37k10n7L74
2929A59n65N34j84l02P31m07J87K68q42M24J21m68N52j21k82N23k16n6M93m26
2949A23K52m33k84M68n09L14L91o88L86K39n48L04l61J96K43n24P26k48m66O93
2969B74k35n6K28n8n0R5l96N58n00j20O45p99J34Q09n91L84k22j37K69k39k01
2990b08N04o23L65n8k91L51k3K2L10j39k08J46m04N34L1n41N83l08k06N04m53
$$ y = [46, 58, 330, -6, -181, 408, -378, -250, 327, -36, 104, 272, -39, 460, -50, 136, 253, -343, -80, 216, -548, 157, 59, -453, 69, -92, 124, 247, -118, 310, 207, -105, 263, -312, -109, 202, -77, 142, 34, 19, 139, -72, -296, 182, -362, -171, 390, -319, 101, 144, -323, 101, -80, 54, 176, -535, 91, -102, -404, 18, 44, -112, 507, -137, 219, 331, -95, 211, -232, -253, 584, -354, -120, 608, -288, -72, 176, -150, 199, -132, -85, 52, -158, -215, 159, -406, 128, -56, -358, 373, -34, 153, 421, -421, 3, 124, -344, 208, 87, -195, 328, 112, 56, 549, 123, 375, -58, -342, 126, -383, -69, 322, -366, 20, 259, -289, 15, -346, -150, 93, -431, 295, 47, -419, 274, 39, -17, 211, 153, 103, 198, -198, 360, -140, -260, 385, -414, -280, 529, -62, 322, 100, -37, 232, -7, -208, 296, -327, 38, -20, -311, 40, 17, 39, 349, 210, 2, 148, -256, 278, 309, -232, 351, 43, -163, 341, -112]
3011a12K76M7o01N23j66m32Q17m90j46N55k94Q8J96n16J62K8n9P5l62N60k31l12
3033c94P83k05l97M37k76j82N84o44M54mj93K79l29o4O11o42J35J39j85J05k38
3054b26N9K42l24O1M85l31K59j25k99J17k3R1Om79O08J34m69P12k14l53M29l12
3076D8j51K16r6J90j90l11O70o18J81M35n76J49r5%J30k27K32J89k79J33K01n17
3098b86O48J00l55k1j48k5L37n86N13k03k27O39m42l62O47j16k74J75j04R3l25
3119c22K51M85n29L4K80j84j60M36l84J27r9j04L12l73L79m9l24M81l04R9J69
3140B21j96j95L29k84J53j32k37Q76o21m9L32j06j86J85l63L80l12K1M04m85J00
3161a65N15l96J1L52l32R0k42L53j50j82K36M3j64M39j04m54N71m80j0j9o8J64
$$ y = [-112, 164, 211, -390, 133, -33, -465, 352, -138, -284, 271, -23, 65, 261, -255, -93, -65, -124, -49, -411, 149, -82, -394, 389, 184, -213, 224, -52, -234, 350, -294, 160, 156, -37, 242, -87, -151, 460, -182, -47, 92, -93, 12, -226, -167, 75, -249, -188, 297, -34, 225, 100, -199, -82, -105, -14, -8, -487, 121, 255, -214, 498, 284, -69, 360, 48, -103, 113, 17, 207, 17, -294, 376, -242, -61, 374, -202, -53, -148, -148, -18, -245, -13, 176, -103, 30, 231, -286, 362, 462, 107, 86, -62, -87, 250, -336, 177, -26, -253, 386, -56, -418, 229, 113, -161, 14, -90, 3, -322, -71, 414, -115, -81, 199, 15, -145, 291, -93, 34, -65, -169, 143, -230, 149, 100, -224, 257, -47, 52, 221, 25, -170, 159, -125, 28, -104, -341, 535, -86, -135, 197, 91, -95, 90, -273, 107, -205, -184, 220, -265, -165, 350, -46, -35, 317, -15, 75, -167, 186, 36, -146, 90, 133, -31, 408, 304, -150, 421, -59, -69, -88, -156, 8]
3183Hj92pK67k80R7M36m65M8J05k13K93k08K36J46n41L20J48l96K76R6l05K98
3205A67l10J38n6j56M87Ll64L47k12l81L61o6o2P4k75J49P4o0K05l15Q2M81p43
3228d32N88l6m01L31k70j01O91n82K82kk38O41l99l57M00j26n9J38r2J84j90r4
3250a24N20m66j00L56k60J66m9m5q1j6L71k7m18M21M7m78J19J15l26M18M8p9k03
3273i1oL77k92n9M08l06k52M66m12J15m0J13k7l30J80M25l98q4K51j55J74J08
3295A65o5k1P2o0L86o62M54M3n78K38J72k30K41p2k85L79k31K83n07N3N60l36
3317ak88N36l23p9rK09k8j26N5L33k60J14p4j62L16r8k74N7J90j07K85m11J21
3340b4J12j82J79j31k35M30l73J67l5o4M62k48j71K75m96J20L02k16Q2m9J81J63
$$ y = [8, -184, -191, 76, -204, -107, 329, -136, -88, 17, -196, 97, -111, 125, 271, -270, 50, 198, -198, 78, 174, -131, 167, -143, -5, -61, -217, 270, 273, -91, 256, 44, -337, 24, -42, -104, -30, -305, -156, -82, -142, 63, -252, -170, 311, -432, 156, 120, -281, 50, -220, -321, 370, -212, 70, 68, -170, 471, 72, -285, 115, -11, -70, 68, -24, 160, -30, -124, 396, -70, -170, 186, -74, 92, 43, -2, -83, -99, 272, 245, -173, 248, 295, -183, -64, 51, -275, 143, 191, 112, -91, -97, 280, -12, -71, 337, 31, -221, 245, -167, -52, -92, 21, -6, -336, -156, 269, -129, -213, 38, -117, 57, 165, 100, 79, 151, 91, 477, -185, 269, 312, -266, -28, 144, -86, 155, 83, -202, 177, -54, 229, -278, -225, 335, -1, -289, 247, -76, -155, -164, 45, 17, -109, -54, 279, 19, 133, 59, -103, 213, 115, -159, -102, 88, -19, 266, -145, -24, 88, -94, 85, -46, -281, 149, -224, -57, -92, -156, 306, 58, -113, 162, -334, -214, 88, -128, -46, -95, 86, 249]
3362B49l36K11J40l47N5K39m23L97Q8m85L93j17m2J00k62J82j91j22L55k04M9
3383g1L02n49QM42m53N11j74J40K8l44Q6M01m52L60k34J0j80K83m7J67k29L4J38
3406A77n80O41l19q9N5N7J76Qq0L5j11j40K32j39j19L50l98O2J15j19J95mk8M20
3430C97n03L42N7k08q0l06L37J86k07pN4j85J63r8j87K02j54k05N57m98L54P5
3452H6j94J24J23J3l7rj08K41k62K1J53j75K84k48j21K35l87K39J60k88J23k61
3474b88q0M66k84j3L78l27J91j89J19J55m44J46J81k21L70K26m79L00j26k58L70
3495A93l45J74K00n42K15J83j69P0O3J04q5k01J5J31k8K37r7l56M15l21K17l0
3517D3j73K56J0j85o7M3M7K51k62K00Jl14J54L8P4P1l70R8j84K14j13J27j5J11
$$ y = [249, -87, 124, 264, -83, -28, 211, -212, 185, 273, -212, 181, 64, 22, 122, -140, 42, -149, -271, 84, -120, -71, 231, -318, -310, 132, -321, 190, 16, 156, 184, -160, -74, 327, -125, 235, 1, 11, -169, 114, 67, 234, 5, 39, 177, -403, 238, -81, -170, -115, -58, 118, 126, 46, 81, -30, -170, 62, -77, -196, 154, -244, -182, -67, -186, 9, 5, -23, 397, -106, 236, 293, 85, 5, -301, 36, 222, 15, 8, 62, -123, 40, -58, -245, -43, -197, -402, 155, -343, 11, 86, -108, 16, 139, 152, 115, 106, -2, 239, -23, -2, 151, -24, 260, 12, -109, 126, -261, -22, 138, -150, -27, -288, -368, 98, -186, -199, 179, -148, 43, -146, -27, 128, -316, -170, 11, -210, 160, 386, -93, 207, 81, -177, 193, -152, 22, 222, -320, -105, 78, -91, -21, 42, 146, 61, -140, -125, 6, -22, 215, 118, -238, 177, -144, 73, 43, -130, 126, 136, -49, -116, -73, -26, 225, -37, 163, 164, -150, 4, 42, 116, 187, -183, -85, -269, -55, -168, -41, -56, 55]
3541E5k28J33M1m14L96J53k24L76m10J14K78l92Q4L25j15j24P7L4j8j83r2OkJ72
3565D2R6j96J02j52J33R2k93k3J63m2J53k23Q2K92l42O2L56l35K40j22O4p9k4
3588D6N0l3q1L4J79k61M29m38J30p3k10K11j86R5J81Q9k80J09j70l2K37n8N7K53
3612B78k22K59j80j50K51l35L31j91J29q7l3k36J99k1pr6K64o2J5j14M9n2P6P1
3636A36k65L13j98l32N27k7l71L71k72M9R9r1K7j14q1L64J08l58L28m32K95J76
3658B52k46O1j54L5J81k38N3j13m4L01j63n4J25jl77M12m5m5k38K38K69lk27J61
3682A40m56M54k44j46L60k34l42M46J45k93j9J88J81r7k60J36m6QJ01l88K25J80
3704C9L2P4j3k19R4K0l4m0r8J65j95P8L90k25p0J45M3l9p7m47O11m91q1O48n27
$$ y = [55, -173, -40, 1, -413, -17, 136, -88, 288, -122, -8, 270, -122, -38, 287, 172, 48, 125, 159, 141, -42, -134, -128, -130, 42, 138, -58, 44, -108, 25, 117, -176, -199, -36, -78, 75, -148, -66, 226, -116, -54, 302, -33, 207, 85, 149, 70, 46, 96, 63, -18, 16, 195, -66, 363, -75, 55, -18, -228, -17, -203, -108, 73, 162, -118, -9, -179, -211, 26, -32, 25, 278, 56, 315, 135, -15, 236, -99, 232, 41, 170, 83, 50, -186, 13, -8, -15, -111, 153, 91, 106, -8, 41, -11, 65, 136, -129, 184, -14, -346, 181, 154, -217, 154, -118, -69, 30, -61, -34, -148, -229, 135, 243, -115, 213, -219, 76, 252, 6, 67, -87, -52, 129, -109, -56, -169, -213, 88, -75, -129, -4, -5, -382, 30, -15, -60, -298, -60, 209, 206, -21, 140, -316, 138, -106, -252, 108, -126, -468, -22, 123, -170, -189, -1, 180, 83, -177, -41, -87, -79, 22, -366, -141, 39, 71, 145, 132, -87, 7, 27, -7, -47, -145, 20, -175, -97, 293, 68, -2, 143, 186, 147, 70, -377, 234, -257, -338, 310, -217]
3729b17K51j24j19R6J62J35n1k29p7K20k56J60K73j98J72j40R6l32L02Q4j77j98
3751a67J84L00n59K78M2k22M1J62L5j79m5L07m24K29p6N5r8J05J03n6j00J18J11
3774A44l20n1J37l1M5N1q1n3K8J58J65j65J52p9l38L84j38q7K3Nm1Q6l0j40K04
3799B8N0J31l24m3L70n35K42J92l2kJ19m7p7k83N51m39LJ24K6Q7k21N6J48l3m0
3824E1K3n8j14J97K5l44O04n44J26J12k3j99J95k77J10m2K39k9l1Q0K7m03M69
3847A94J00k13J18p3j44l0k60L12R5j30J26j10J50j0N6l45J9K46P5j28l11K94
3869C1j16j66M68r9N6k87R4R6j85J07K00n06M86k36J51O0M0l85M85j78j20k41
3891b45J01J51J00q4N0j58j08J25Pj02J0J07J31j50P2K19m35M18L3l51J63r2m
$$ y = [-217, 34, -90, -209, -113, 49, 184, 133, -96, -173, 47, -209, -49, 224, 26, 198, 58, 154, -178, 124, 208, 31, -167, 17, 317, -242, 36, 78, -144, -103, 59, 94, -85, -130, 177, -247, -18, -94, -39, -137, -32, 71, 15, -85, 33, 144, -176, -227, -90, -121, -76, -25, -106, -159, -131, 27, 192, 27, 179, 100, -238, 146, 8, -79, -56, -51, -92, -6, -36, -176, 28, 78, 209, -115, -158, 212, -323, -81, 111, 79, 77, 196, 149, 72, -211, 340, -99, -96, 28, 54, 141, -80, -24, 124, 91, 51, 74, 16, -98, 99, 124, -220, 384, -160, -34, 78, 55, -144, 51, -226, -116, -158, 81, 52, 21, 101, 128, -275, 194, 294, 81, 199, 126, -18, -48, -308, 4, 99, -31, 95, -15, 135, 125, 181, -164, -145, 101, 176, 48, -263, 31, -85, -251, 217, 118, 174, -113, -19, 77, -108, -1, 199, -307, 179, -57, 94, 154, 194, -191, 294, 116, -4, -245, -144, 7, 107, 23, 73, -85, -193, -68, -61, -163, -153, -46, 85, -65, 7, 226, -209, 209, 242, -109, 54, -38, -42]
3914d2J09K9j26j86N8J00J11j30J73J08m41K90l10L39l8k55K83r9K5J11j85K3
3936e3O3j10P9K0Q2j31m9M61j63k43L87k49k24K6K81l05J88j99L8l7J15Lq4J28
3960B4j66J24r9J86k66K76l31Q4K51J8J9j35k72M37K62m13j55M47m04P9m0j65
3982b39K08M4L1M1n0J02k59J03lL20n35L53k44m6j00M89o8m05J86J38k52Q7K87
4005A88k50r4J88j11J01j83K34J50m67L10L9k52O3J59j60p8KM40k31n1j12J71
4027E6o9k31J70O8J72j56m8P1K40j84k83o7K50k04J72J97r5K0j86p7J82m3L9r5
4051a01N8Q3j88K94Q0m10%K62l08K61K2m23N35k22J2n9Q1oj2l6N7Q5j49N7O8k37
4077a96L06k13L74j69j23j9k7n4K45j53j07J06M9J06j5l11L31p1l07L23j65M29
$$ y = [-42, 67, 96, -30, -216, -158, -58, 53, -77, 96, 204, -237, 53, -257, 82, 44, -211, 72, -27, -2, 109, -76, -53, 10, -100, -21, -1, 81, -50, -99, 362, 199, -44, 343, 94, -130, -104, 177, -128, 60, -139, -101, -138, -23, -20, -104, 24, -142, -18, -117, 69, -197, 79, -252, -168, 83, 101, 120, -15, -287, 150, 412, -1, -156, 291, -113, -34, -74, -239, -31, 13, 44, 85, 35, 137, -122, -19, -22, 298, -237, 116, -128, -174, -274, 215, 147, -258, -72, 66, -186, -99, 188, -62, -156, 32, -79, 22, -161, 73, 223, -244, 66, 105, -147, -84, 75, -85, -163, -161, 279, 48, -3, -115, 56, -13, -244, -74, -6, 166, 10, -38, 33, 273, 89, -194, -261, -11, -215, -43, 154, 59, 79, -107, -184, -2, -45, -6, -101, -43, 40, -148, 146, 226, -184, -184, 78, -230, 31, 53, -370, 165, -57, -45, -104, -23, -29, -41, -77, -20, 65, -84, -27, 41, -196, 110, -103, 271, 102, -21, -40, -67, -121, 124, -29, -136, -30, 19, 125, 110, -201, 130, 59, -248, 75, -90, 339]
4099C39m08J32p5j0r9K61l24K86n3p4k9K49l38J21J37k35Nm0L19k83J69r1J1K8
4123bJ31J35j34j39j05J25K59l82L91k69j64K97j80J49n2J51j67j97K99k59M3
4144g0j83K31k03K57J60k30q3l8mL74k09K13k96m0J82k78K02L9l4l2K18l32L0
4167a26N8J57j65k0J5O9k1L35m00n1L38k03j40J70l28L79r9J79qp1k67KJ13K11
4191A27j24mJ78r4k2l8J1j7m8j27O7K28r1j15J4j0N3qmNoKJ75j34J8o1O0K43k04
4220G4k20J37j54J90m9R3n4q8J7p5K16J14j88n4J26j40J92p6k03K21j39k3K78
4243A95j95N4J98j45k05l7K17J10k54l2L7n1K07J53j96Q4l9j47k4K08l32J94l2
4266c2oj21K15j65K27j28q4J09J79l05k67L95j60r8K2J92m11L77j11j16L16k7
$$ y = [339, -69, 63, -12, -22, -121, 140, -184, 102, 49, -25, -54, 195, -143, -22, 115, -120, -115, -155, 164, -119, 50, -41, -30, -2, 129, 264, 130, -9, -114, 11, 270, -112, 279, 10, -154, 143, -37, 112, 60, 211, 44, -153, 146, -113, -70, -253, -22, -225, 32, 192, -38, -121, -159, -163, 211, 2, 215, -81, -121, 61, -217, -15, 24, -10, -42, 176, -156, -126, -68, 89, -76, -96, -81, -12, -33, 302, -98, -149, 189, -14, -154, 16, -312, 67, -32, 147, 139, 68, -199, -197, -84, 127, 3, -1, 177, 83, 61, 23, 34, 17, -31, -158, -91, 137, 46, -69, -55, -65, -12, -20, -24, -19, -25, -23, 152, 18, 36, -25, 35, 278, 74, -146, -9, -163, 27, -22, 71, 17, -71, -54, -129, 87, 201, 13, -41, 85, -55, 137, 61, -142, 79, -60, -83, 195, 0, 54, 252, 107, -98, -135, 82, 192, -62, -94, -57, -108, 99, 252, 56, 140, 101, -46, -70, 138, -194, 0, -32, -38, -159, 56, -109, 118, -10, -94, 15, 194, -111, -378, 17, -143, -241, -219, -27, -438, -61, -172, -288, 28, 1]
4288AJ52j00k25J80o8P2k4K30j34J3q2N2j49j31L79q4O6k13j63M27k79o9L37l57
4312a69r3J77P7P2q2K4J06l34L05J0Pl05Q1Q5Jj9K35j65j54J13K23m5m28M23q4
4337F1o0o3J03P0j74K4P9q2J48j99J94K8l56P2K81p1K5K36k23j76K24k39L12k10
4361Do6K66l35o7L26j5Q5j28j14J92k05j03K65k26J83k2j89J71l80N31l59K35
4383D9K65l45k2J16J8l11R4Q5J16m3J1O0j16l0J58j21M3l3J25n1l4K9j11o6O6
4408d8J09j46J92J07k48q5O5oJ41j58L69k03k17L21j16r0O5Q3k30k1O0J70j87
4431g3K17j07J32j03k66m0N7K90m90L67K85l44P5k5j48J42J14j81J93q7J67j70
4453EJ32Rm39K45J16j56K16q5jK54k65k38K54j51J46j77p2K21J68j78q0K26j68
$$ y = [1, 153, 53, -172, 8, -60, 12, -12, 218, 84, 97, 15, 67, -82, -213, 166, 82, 148, -65, -228, 199, -80, -149, 188, -169, -262, -85, -8, 64, -18, 6, 112, -222, 83, 93, 100, -205, -124, -39, -38, -57, 178, 13, -141, -28, 195, 150, -278, 145, 61, 1, -62, 41, 111, -63, -39, 40, -42, 106, -93, 101, 129, -227, -155, 126, 55, 80, 316, 93, -83, 141, -98, 214, 4, -62, 204, -131, -198, 128, 113, 198, 70, -44, 148, -57, -160, 105, -121, 62, 40, -149, 22, -358, 173, -186, 49, 314, -31, -53, 63, 81, -230, -136, -51, 65, 22, 33, 93, -23, -53, 105, -16, 27, -6, 119, 68, 34, 63, -48, -114, -48, 61, -85, 107, 214, -34, -119, -54, -60, 81, -77, 292, 89, -128, 193, 77, -13, 52, 135, -95, -116, -56, 114, -73, 144, 37, 169, 66, -200, -240, -183, 107, -383, -16, 269, -75, 0, -25, -173, -31, 83, -98, 95, 8, 175, 5, 137, 146, -293, -48, 68, -88, 128, 43, 42, 296, 31, -207, 47, -104, 42, -135, -207, 14, 182, 4, -76, 150, -18]
4476a8n1j29M07k17Mo4P8K44l34K4J94p0k00m2M7lJ27q3P7J0J1O7j76R8O7l37
4502b69L36J32k36Q1oJ37j48r0J56q8k51K93k70k1J91K34r6J04j24L0k03R9n0
4525e9r2J65K23l20Q5k1k08L83j43O3k57L43j9j38j15K68j37J36k00J00Oj19J42
4548H6P4k8k69K68l37L82j48J06o9o4J58l73K31j05J08MJ05j23Rj33J3J29J1J31
4572A66l40M34l45J91j32pL6L31m09N15j68k25J51k31J83p1pj09j28J35M2L5k0
4595B7J88k31J69j51RQ3Ll1j95k36N16k72J18J63j46k5K22l50n7L65l04J38l4
4618c1M1N7M6k19Q3j42L50j72J42l82J71Q1q0K54j23l12P9Q0J45p3J89j43j97
4641a56L0J85L9k40Q5K43K6l53L35l17J25l3J37p1j13O8K67m91K6M02l32R3R4
$$ y = [-18, -69, -198, 209, -8, -4, -68, 10, 254, -80, -56, 138, 68, -132, -174, -127, -130, -3, -86, -9, 1, 12, 79, -97, 1, 68, -269, 67, 199, -37, 44, 38, 175, 27, -63, 93, 5, -246, 47, -223, -244, -53, 181, 85, 189, 65, 95, -108, -9, -59, -151, 14, 237, -83, 2, -19, -227, 156, 13, 76, -181, 162, 143, 5, -110, 158, 21, 157, -43, 57, 63, -56, 86, 160, 132, -137, 131, -206, 176, 28, 134, 65, 1, 159, -214, 17, -88, 20, 24, 129, 6, 15, -118, -105, 24, 35, 166, -174, 260, -85, 106, -26, -33, 3, 334, -75, 440, 272, 47, 198, -33, 150, 79, 72, -37, -165, -30, 12, 47, 27, 215, -16, 153, 2, 11, 94, 97, 66, -129, -365, 151, -121, -3, 160, 14, -11, 211, -139, -196, 169, -135, 3, -31, 10, 67, 113, -106, -23, -165, 185, 13, 155, -227, -56, 25, -55, 199, 76, -236, -157, -77, 68, -5, 184, 41, -156, -126, 59, 98, -142, -57, 186, 212, -141, 194, -123, 2, -31, 106, 35, -78, -10, 257, -234, -208, 194, -138, -45, 49]
4664D9J24r9k57J16j4P2j52K97j88R7o3j46M01l23Q7j55J11J69l29K07K87l08
4686a7J46j60K06j02Ok49L80k35N7j92Q5j13K82j00Q3j11l2R8q7J05j0J04K1p5
4710I0k2k38P2K8l07M94k80J97N4j1m4l19O23l00l14J40R0R4J18j27J7k88L42
4733A09p3Q6j00o8N8M3J11o7j89J26l03J87J05J7J80Q2j49j58O0p5M3r3J52j63
4757g9J28J68l14J18n4J9j58J92n6j09J56J6q5O3j04R5J5j97P7K8K66k99J29Q2
4781I7p6J3pP0j48j59K98r8n2K3j73J4L5j28L08k00RL45j83n4m0RK13k17J29K85
4807C13l86J3J6J8O4r8Q7m6q1J92J7k38J29o8J6K0J72k60m8L88k16k18M7R7k18
4832b88J69J71j72P8k10L04J69j28j5J4k83J94L8j38L08k64l9J8k1R2kL76m32
$$ y = [49, 173, 74, -183, -67, -81, -9, -161, 136, -52, 45, -18, -164, 237, -86, 1, -154, -43, 126, -203, 4, 291, -17, 129, -31, 175, 73, 79, -170, 210, -25, 32, -160, -75, -188, 94, -6, 77, -34, -66, 32, -55, 50, 40, 144, 165, 90, 68, -170, -98, -70, -377, 117, -163, 34, 88, 77, 33, -286, 337, 37, -277, -137, -47, 47, 165, 38, 55, -233, 109, 36, 122, 22, -46, 12, 55, 166, 99, -90, 36, -267, -80, 25, 42, 222, 304, 155, -3, 57, -18, 25, -68, 84, -79, 49, 217, -97, 21, -33, -14, -172, 20, -36, -145, 11, 27, -58, 5, -99, -4, 11, -186, -109, -81, 185, -114, 15, 97, 21, 34, 27, 97, -51, -210, 88, -10, -62, -39, -212, -198, -163, -291, 17, -183, -174, 171, -12, -66, -106, -97, 116, -101, 28, 313, -73, -60, -44, -26, 38, -60, 27, -19, -100, 92, 109, -129, 0, -68, -52, -32, 140, -120, -168, 220, 4, -214, -167, -70, -288, -119, 52, -120, -42, -252, 52, 221, 93, 78, 92, -191, 3, 41, -97, 211, -53, -92, -74, -95, -3, -5, 371, -61]
4855f1J18R1l57K10J29Q7l68K53l2j65K71j50RP9j07R2j31N7K5o1q1K6N18n33
4879h1J47j37O9R7jj37j46Q1k2M3q2J70j12J11J30j56R1j04j35J01J70r1K51o3
4903A94l20K47P3k40J31O8k05o8J06Rj8k44J41j6P0j98O0K49L7k41K79j37k61
4926b84N67l82M8j15o9P9L17M0J8l00K73j8m07L50j83K03k39l2M15l13j29K77
4948A16P4j07q6j64J91l6k7K10j89M6j29M3J49J19p9K2j60k58L46j25j82J37n8
4971a47J24m7K1J78j05j47R4J76j22j23J63j89N2J43J0l78J57K38L5J1k04j76
4993b36K34m8O8j40J82j31R4j36M30m04O3j2lJ39j44q5M7R1j28J54L5J53l8k60
5017g5O1N9J28l07k0K23K3k81K19J59j97j17O1J75j35K07l17J49j04Q2o2N6K68
$$ y = [-61, 57, 148, -209, 1, 130, 217, -151, 102, 70, -95, 176, 26, 35, 114, 7, 99, -32, 25, 50, -11, -92, -66, 452, -81, 66, -71, -2, 95, 94, -43, -189, -108, -130, -87, -169, 1, -111, 0, 130, -26, 65, -39, -174, -73, 97, 6, 257, 194, -126, 121, 194, -46, 85, 153, -52, -120, -14, -5, -23, -267, -126, -142, -72, -270, -210, 39, 76, -165, 114, -23, -284, 283, -99, -51, -166, -235, -156, 161, 201, 219, -81, 192, 174, -233, 117, -66, 137, -102, -134, 281, -32, -161, 116, 190, 83, -3, -167, 24, -12, -39, 171, -18, 28, -101, -58, 91, 210, 131, 153, -7, -265, 81, -44, -226, -89, -147, -23, -70, -49, 129, 24, -123, -29, 147, 25, -98, 65, -124, -72, 71, 81, -297, -140, 98, 133, 144, -60, -236, -2, -50, 18, -122, 60, -71, 23, -113, 317, -87, -24, -36, -39, 100, -44, -129, -82, 9, -119, 35, 70, 223, 185, -75, -14, 45, 173, -134, -154, 69, 92, -189, 30, 189, -8, -125, -64, 111, -24, 183, -134, 15, -89, -7, -69, -13, 255]
5040B55l07l0k6lrM1J40k7J13k63K58r6J09k4r7Mn8j04J64Q3k27L11j24q8K05
5065B00k16J77r2j0k07K13j89J59k26K6K07j62M6Q6k6J30q4j03K42j82j00Q0j18
5088a49J23P9J18k50M37k84j68q0K65q8j3L8l2R8j6PJ05L1m00J90J40p7j76M4
5112e8J96j65Q1L4j43J37j27J9j10J43q8o6J3J3L12n33K76o2j17M99l46O8J48
5135A24j38j13Q4P0M9j84j6K19j38j47J63P1K28k24L1M0l84K02K5%J3M0j68r1
5159b44L22l5J8J32j76RJ64l29K23j22J39j18Q1J92m30K57j61M1k7J37n4j06J41
5182E4j16N7J98j95%l5L8K03j10k70J83K15j71k91L99j74j6l37L80P5k8q8j01
5205a30O4P6p6j74n9K70Q6o6l0J37J57j5l92j7K17j03o9j74M85j89M7J48o7k52
$$ y = [255, -52, -82, -108, -111, -120, -79, 61, 34, 147, -116, 142, 46, 155, 131, 34, 38, -20, -124, 40, 123, -104, 207, 83, -5, 200, -16, 161, 69, 59, -148, 65, -124, 35, -191, -165, 42, -120, -74, 12, -14, 116, 32, -71, 171, -11, -111, -31, -149, -26, 53, 171, -79, 358, 74, -94, -174, 91, 3, -10, 28, -4, 94, 78, 85, 190, 221, -179, 11, 151, 74, -102, -58, 138, -27, 54, 88, -55, 82, -45, -26, -136, 7, -81, -147, -134, -121, 191, -342, -66, -128, -245, 254, -92, -24, 124, -14, -127, -43, 27, 76, -108, -124, 95, -43, -190, -27, 44, 272, 48, 79, 119, -265, -63, -38, -38, -25, 15, -153, -244, 78, 43, 61, 193, 17, 26, 190, -139, 84, -38, 101, -17, 64, 256, -174, 83, -78, -37, -64, 73, 19, -87, 54, -62, -5, 193, -2, -2, -37, 1, 204, 94, -176, 7, 222, 51, -240, 159, -15, -31, -368, 12, 87, 59, -29, -130, -66, 10, -66, -240, -299, -29, 57, -9, -39, 98, 255, 240, -152, -169, 48, -55, -124, -298, 187, -2, 45, 193, 126, -126]
5229a26J33k75K15J7K4k59K89j36l1J13j01K05k85L17K1Jp4r2Rl9K12m74N23l22
5253a35K27j42p4K2K26j60K43l64P3K50j09l2j5n6n5J18L61n18q1K87n4M2N5k73
5277a64M78k12j44J00o4J62r4L6P5j17j15M5K9K79l02j77j2J00N5J04J22j41j49
5300a06J16j71M5j27M54l03n8L06l76R6K15k29jp1J80j03J49j78M04j19j51J04
5322G6J5l16N1L6N0J39k67K02q3J54j37o5L2K75j64j88J19J75l38J1K65k16P8
5345i6J6J84m31M17j01O2P4R0j46j36J83o8M9k0j71K4J44o3n5Pm8jN6O5k4q4J07
5372C4J99q8j94J38K2j99J40J50j23k23J21l2N3L10l95KJ85n2o8K18l36J21l8
5395e5J58p7J76k50J72l29K73j64P8n5J89k01K74k07M1P4J68m34L32k65J48M4
$$ y = [-126, 7, -268, -53, -36, -12, -271, 18, -118, -149, -36, -137, 68, -217, 100, 121, 122, 48, -44, -35, -74, 138, -336, 187, -135, 92, -50, -124, -102, 124, -36, 207, -157, -84, 166, 57, 25, 10, -46, -101, 17, 378, -140, -221, 66, 12, 54, 109, -164, 314, 102, -42, 58, -6, 156, 62, 98, 173, 56, -59, -14, 15, 294, -8, -185, -197, -97, -42, 62, 184, 43, -106, 10, -161, -116, -243, 211, -92, -150, 156, -220, -124, 91, -138, -139, -210, -30, -133, 16, -162, 242, 123, -28, 76, 91, -225, -174, -138, -88, 51, -216, -14, -97, 57, -80, -145, -113, 162, -2, -190, -71, 104, -234, -223, 42, -174, -96, -80, 104, -327, 90, -11, 51, 125, 215, 69, -67, 116, 48, 97, 77, -94, -70, 74, 11, -44, -37, -85, -86, -30, 35, 11, -73, 34, 233, 145, -49, 89, 111, -88, 52, 202, 79, -144, -23, -55, -2, 308, -87, -85, 100, 48, -20, 198, -138, -17, -55, 103, 26, 202, -48, 124, -205, 68, -96, -18, -73, 116, -85, 189, -18, 23, 97, 265, -169, 163, -102, 46, 90]
5417I0j45L12l11k27M42k61K2K88j52N6m7J18k31K20j63J70k29q2J59l22L41N0
5439I8j29M3J80k51j1J0J47k7j50J16Pj04M0m8J46M3j26j20J49m7KJ64K3n9k69
5464a73J00m3Q2P4j38r4K83R1j83N1j12j9N8r0o2P9MK6K60M2k98K98l6k94K5J87
5490A18j88K07r1j0L0Kk8J18j65J3O0r6l6Om0P4k8LN0j09j8l6K03n8Q3J40j06
5517I8k57J6L23j03j69R7N8O4j86j85J5L72l2N3j52J3LJ4r2M4R5j10K43j70j68
5542a16l3J52O8k54K28r6O6K3K8m4o2j66J60J96k37L0M7qK57l21o6K61j34R5q4
5567a0K5k22K04j20J88j69K24P5j91J38l67J76J6J33r3K4M5q7J14k12J0M3n2K16
5591A08l92q1K54j12L57J02j58j62J61l1J35k67Q1p0J26M1r9J5L1j04L08k21k2
$$ y = [90, -55, 257, -54, -281, 161, -100, -78, 210, 58, 114, 67, 185, -46, 174, 11, 181, -48, -130, 29, -293, 48, 98, -31, 12, 192, -59, -70, -60, 87, 60, -90, 26, 33, -71, -31, -79, 67, 110, -16, -136, 13, -34, -32, 132, 155, 96, -173, -73, -116, -34, 40, -98, -192, 91, 182, -1, 50, -62, -81, -23, -113, -175, -96, -92, -66, 194, 236, -62, 236, 200, -94, -69, 118, -70, 137, 46, 36, 66, 68, 40, 158, -7, 6, 66, -30, -66, -60, -100, -26, -54, -51, -1, -110, -128, -164, 39, -19, 64, 204, 98, -159, -143, 180, 77, -92, 5, 63, 127, -59, -244, -229, 143, 111, 164, 12, 25, 28, 42, -50, -6, 89, -21, 222, 52, -116, -149, 3, 71, -183, 45, -51, 15, 38, 66, 22, -40, -206, -46, 150, -87, -57, -10, -18, 239, -82, -148, 113, -21, 74, -10, 15, -207, -3, -123, 65, -104, 120, 195, 4, 142, -225, -49, -33, 100, 7, 31, 76, -11, 103, -109, -99, -56, -108, 108, -284, -365, -111, -223, 134, 236, 78, -84, 77, 46, 181, -86, -5, -75, 51, 92, -7, 8, 39, -65, 243, 22, 0]
5614@L7qK2N0J17M6k81N8j01L6K43j04k49O7j2k3K24o4J56n07L80j27K29o6k08
5639h5j85J07J31J22Pk2j30j13K82k44R9p0p3J83k0Q8J25o5j55J98n4l09K69j40
5663e4P9O7J18k32O2Q6Lj50L7q5j1K75k38K66l16p9L5K62k92J57K32m10J75o4
5687g7O2k5j25L04l7l48L36O6k60L21k17K49l59L34l57l2J13K0j7K06k09r3n0
5710a95M06k7k00L5K21j81j83R0pJ05j35J66O2r1N7p9k22J81P8N4k34J01j92L6
5734a54Q8K05j37J01N7n2Np7Nj18p7J50j09o9Q3o0K70Lj05j66J55j19j5O7N8j00
5760a11K51k20qJ24j68M4n0J33j03J66k72K79j11q4p7K37K0J5j08P5R4j30j32
5783a36J45k24K62J74k14N7K6l88K46j08J20j04K33L2l04J14o6M8K38j16j47L7
$$ y = [0, 37, 29, 51, 101, 218, 264, -17, 41, -60, -24, 219, 115, -134, -67, -79, -102, 122, 58, 214, -293, 87, -40, 189, 123, -85, -270, -163, -32, 90, 97, 75, -55, -168, 114, -130, -31, -101, -174, 9, -11, 77, 202, 137, -18, 180, 126, -183, 86, -54, 25, 92, 210, -22, 40, 126, 129, -21, 16, -69, -80, 195, -43, 223, -93, -172, -137, 125, -167, -10, 222, -188, -13, -77, -15, -40, -165, 139, 102, -246, 90, 156, -104, 217, 0, 249, -110, 224, -133, -165, -52, -32, -49, 157, -52, -145, -195, 211, 184, -16, 19, 240, 59, -124, -34, -41, 64, -71, 95, 157, 66, 123, 44, -178, 3, 81, 135, -99, 2, -190, -154, -66, 139, 2, 103, 160, 108, 113, 36, 41, -77, -154, -4, -113, -182, -99, -159, 111, 114, 9, -157, -2, -121, -136, -69, -11, -111, 140, -80, -88, 36, -132, -88, -138, -5, -108, 58, -214, 65, -46, -130, -207, 30, 50, 65, -43, 32, 126, -4, -136, 9, -215, 47, 221, 7, 64, 90, -298, -52, -160, -40, -144, 89, 121, -183, -69, -135, -87, 151, 35, -112, -75]
5805g5j72K22J64l0l33L25r5j22O4L3L03l86M18m40Q7J04l0p1jm4J77k50J47J20
5829A15k25L32l43r3mq0M00j98p0J50p5J83j86J23K6j04J38n0j53J25j41J08r5
5852a17K18n1j44l6j00L00K4n8j7L8l43M95l57J88p0m5J40j22J13j34O7J3J04
5875A06Jk5Ql25J52J05P3P4Qj98P2o3k4m6N7j14q3J78J34J20m14J64M3k16J99
5900a4K54j32j7j43J05j16j7J0l9K05M0N5k63L6K17j04p0J64O4k96O8K4K23k51
5924Cj15K3J31k00J36r5K18q8j46J60J43l5j88O2M9K2j36J46j30k34M08l71L9
5947a98J86j93J51J1k0j59K15r8L55k84j11K45J28j40j79K43k95PJ08K19m14L03
5969H0p0m0J54j64mq5K32J99k38J20l37J20mr1N2P2p1j23M37k23k43J11J8L0J30
$$ y = [-75, -247, -25, 139, 109, -224, 101, 6, -116, -52, -19, 284, -102, 316, -124, -37, 67, 37, -34, -35, -79, 98, -152, -5, 115, -110, 222, -121, -214, -218, -298, 102, -96, -166, -16, -91, 92, -94, 29, 55, -49, 89, 39, -114, 11, -130, -22, -117, 101, 50, -94, -130, -230, 70, 94, 36, 19, 57, -286, 209, -148, 40, -30, -75, 65, -57, 56, -78, -11, 2, 106, 107, 82, 90, -235, -83, 22, 95, 169, 177, -21, 51, -12, -36, -82, -25, -139, -222, -44, 90, 210, -204, -40, 3, -213, -14, 240, 108, 91, -52, 53, -63, -80, -70, -109, 96, 136, 191, -72, -36, 181, 77, 7, 171, 235, -61, 7, 31, 254, 3, -112, -89, 42, -158, -22, -117, 101, 13, -133, 27, 170, 135, -53, 9, 58, 80, -56, 90, -40, -274, 134, -237, -198, -12, -205, -54, -43, -63, -222, -7, -105, 250, -34, -145, 100, 228, 88, -91, 152, -143, -136, -28, 191, -223, 80, 10, -30, 124, -40, -44, -129, 103, 302, 64, 184, -153, -33, -37, -128, -76, -4, -75, -198, 239, 16, -227, -116, -98, -68, 62]
5994F2N3nN1l27J62J13k21M10o2l60L8J0n1M8P2j65L49m8k17J45J5KJj17mj72
6020b18q9N40j07j85P9J84m5k13J9K14q0j17J86l26K09j39J00no2J09J42k66k46
6043c16J06M07j37j30J86l3r6o9J66P7k99K38j13m4k0L3o0L3J63j24K5J11j78
6066g4O6P0j52J76j24K5O0k6N1M9P7j30j12K08j91J82K6j99j76k7N39o00l3L13
6090bR8j94R6J77k88J33n3L7k45K16J21l82N02k00m7Pk0R8M8P9j19p4P4J86nl81
6116a38J50m5J11M2o9M0m3R0q3j29J9k4j18J20J13m9J75l01QJ02j89J54K12k24
6140g6P6o7R6j69K17j80J1r7K94j2q8j3j62K57j79J97k6o1o2l3P8j37K82r1q0
6165b5j9j77J23J00K31j85k33J66j00K53kj51Rl11K30J70j21o9J65j1j24L1k2
$$ y = [62, 115, 110, 161, -166, -4, 109, -112, 298, 236, -124, -86, -76, -127, -79, -7, -172, 177, 129, -88, 57, 72, 74, 75, -42, -46, -218, -307, 233, 126, -59, 20, 204, 159, -54, -35, 179, 99, -18, 168, -158, 51, -88, 12, 7, -55, 54, 196, -70, -316, -210, 197, 60, -70, 116, 83, -13, -82, 84, 161, -138, 100, -13, -57, -77, -44, -104, -71, 92, -32, -7, 104, -74, -8, 62, -90, 86, -38, -13, 47, 21, 72, 121, 198, 68, -44, 164, -27, 155, 181, -18, -194, -221, 318, -282, -315, -2, 96, -98, -2, 175, -113, 20, -33, 4, -241, -25, 96, -286, 216, 16, -31, -24, -44, 54, 102, 181, 62, -12, 62, 248, 243, -138, 12, -33, 78, 120, 51, 91, 48, 138, 55, -74, -55, -79, -197, -77, 36, -13, 162, -139, -131, -29, -218, -64, 148, -76, 0, -67, 29, -140, 77, -103, -92, -189, 105, 93, 5, -8, -170, 87, -92, 105, 79, 18, -44, -77, 1, -136, 146, 55, -25, -44, -221, -98, 2, 233, 48, -185, -19, -119, 134, 132, -19, -10, -321, -91, 79, -42, -111, 54, 43, -81, -50, -72]
6188g2p2J10J13k18P3J26o5j42Q1nJ38j52K95k39j05L50j34j63K82m25K19Mj6
6211a7k44K87Q3j34j70J19P8J90j00j0k7o3%R1j56M5p6j73J87Q9J48k31Q5J1k7
6236a5j85J79Q2k5K6j72p4J33K25m34L16m9J39j88P1M2j14o9K04j08M5L00l80
6259e1k91L29q3J59N3P2l08K99K8m02L51k32R9l1m8O7k61J67j58R5N1O3o3jJ2
6284h4J6J98k1J36l22O6k7o9R3r7Q5Q8L8L1J49k28J65k96J53J34j12j1o3K30m62
6309b10K42k19K52j88J22p4k18M36k03l2J69o5P5J63j89M9Q1j69j66J80o1j32
6331a57J39j24K56q7M5k0p4j95J99Pk35K25K05j54j62J57po6J31q0q4m9l0J88
6355B8j39J23J31j76Q6M0l23L37J4M7k43L7J07o6m8R2j40J87Mm06J99L9n1Q7P5
$$ y = [-72, -144, -34, 79, -139, -66, 60, -5, -147, -66, -71, 67, -85, 210, -29, -134, 216, 82, -81, 201, -224, -5, -1, -17, -261, 26, 109, -25, -195, -76, 2, 192, 92, 82, 55, -8, -8, 83, -73, -28, -104, -277, -90, -1, 147, -84, 1, 12, -15, -200, -21, 61, 36, 62, -110, -184, -51, 174, -260, 56, 7, 146, -42, 29, 71, -43, -112, 92, -16, 29, 329, -51, -342, -13, -96, 63, 116, 188, -120, 179, 207, -195, 156, -76, 23, -8, -56, 11, -250, -83, -241, -146, -95, -32, -95, -96, -84, -68, 130, 109, 245, -77, -11, -38, -107, -14, -111, -26, 62, 100, 131, 280, 52, 217, -79, 74, 208, 96, 85, 22, 252, -210, 32, -187, 65, -123, -1, -75, -293, 143, -60, -92, 77, 12, 87, 250, 61, 110, 191, 22, -144, 36, -25, -157, -18, -142, 114, 27, 72, 52, -22, -217, -18, -11, -246, -21, 184, 30, -132, 25, 18, -48, 83, 3, -81, -130, -160, 28, -111, 12, 143, -33, 53, 93, -230, 107, 121, 168, -75, -38, 69, 3, -45, 47, -93, 94, 98, -308, -109, -70, -121, -34, 41]
6380D1j03l2K56k47J13j43J93j76O4M8j45K36k5k0J10j10q8K16l88L99j15R6k22
6403d2Q0k62K05k3M0J27k81K50j27j03L45j01j07P0k60J01k8m1M7J89j4k89L69
6426A45k07o7k1K2L28j0J93l48J36J00j71k27J32k56J91j36Q1J26K13j41N9M5
6448A87j07r9o5k8Q8OR3j13P0j8k6Q0l8rO2J06l53J76k8N5J9O2k72J52J41j62
6474b1MM5K9O8r0Q3j79MJ44J00J9m02K76k35J74j64J99K12j87k73J39m6k1J50
6498B8k89K95p6jl8L92k17j05k40M3J25Q0j68K11l14L41J6l72M98m02J84j30J62
6521B3J03k65J43j6K1m1l6j93M30m21J93J16j51K96k06r8q0M07j16o6k61K09J96
6544A87r4l5K60m46j1J91Ko6j99J89J22j81J22J2J60j54k96J81q8Q0J28o7j68
$$ y = [41, -62, -94, 162, -85, 28, -115, 78, -98, -34, 14, -131, 105, 80, 60, 170, 60, -28, 188, -200, 199, 84, 180, -42, 38, -224, -19, -42, -2, 125, -156, 94, -33, -136, 209, 108, 1, 71, -189, -88, -116, -157, -110, 79, 65, -224, 145, -62, -129, -150, -128, 200, 190, 383, 35, 171, 271, 100, -127, 5, -251, -60, -196, -115, 11, 224, 83, 142, 187, 80, -19, -84, -112, -24, -18, 75, -38, 32, 14, -12, 68, 30, 21, 83, 189, -164, 12, -16, 39, 58, 120, -152, 0, 141, -21, -17, 28, 57, 125, 35, 118, -61, -57, 87, 187, 206, -196, 80, -155, 19, -145, 54, 266, 79, -194, -55, -101, -122, 28, -261, 34, -42, -43, -81, 311, 94, -11, -251, -208, -83, -3, -171, 40, -274, 67, 83, -289, 209, -193, -9, -139, 23, 126, -139, 4, -12, 9, -32, -68, -261, 169, -252, -59, 57, -94, 202, -4, -102, -182, 225, 109, 43, -218, -9, 187, 93, 58, 318, -128, -139, 52, 54, -12, -211, -22, 100, -81, 41, 53, 213, 59, -237, -56, -144, -64, 64, -3, -171]
6567a71K38K1k86Q4J64j34R3J22L3o8j51P9K30r1Jo6q3J10l25L58j90M9r0mK40
6592A63K3k06M80m92O7k9l0N1nn9l09L97p1J90k11J79j06j22k44L75j24j19L80
6615A78L9j67O1q4j04J76j72K69k12J75k52J43K88n11M46j84K3j33Q7RJ7j80K02
6638A14k19K28k48R7NK%p3N3j00K39k80K52m15M08j25K51k37L70k69m3L2q6Q6
6662D2n7J2J5Rk01K56r9l6j17K39q8J85j10k46L01l9j4j20n6K86J0N4l61L44k56
6687d7j47K72J0P9k63K77l94K48m1j2R2O0l56L96k79J82k21L7q7m2j40K71J65
6710F0J2j28j35J55K62k66K24j70K3j14J26j32K26k12J67j64rp8N6o0K18l5n1
6733b5o2K4J96p4N6j89J80k35L2m6K1J41j51K22Plj01k31K95J83k93P9%J61M6
$$ y = [-171, 67, 88, -198, -114, 50, -84, 9, 131, 164, 96, -55, 24, 254, 163, 164, 98, 15, 125, -200, 158, -32, 17, -73, -77, 163, 186, -20, 460, -32, 35, 6, -24, 27, 22, -37, -346, 51, -20, 170, -41, 138, 32, -90, -334, 41, -83, -202, 178, 217, 50, 111, 27, -77, 99, -73, 196, -16, 159, -93, 50, 338, -173, 273, 89, 112, -21, 66, 75, 92, -88, 114, -105, 123, -125, -28, -23, -21, -21, -94, -41, -141, 98, -182, 70, -345, 63, -62, 189, -48, 322, 53, 10, 42, -44, 42, -15, -3, 12, 21, -180, 76, -23, -59, -176, 63, -25, 160, 50, -196, 105, 66, 52, -68, -124, 162, 172, 226, -135, 209, -47, -194, 78, 88, 167, -96, 181, -213, 35, -6, -18, 74, 134, -222, 174, -105, 77, -144, -107, -194, -236, -376, -105, 60, 72, -56, -191, -36, 226, -40, 184, 14, 37, -77, 49, -83, 143, -69, 98, -66, -75, -153, -97, -157, 61, 26, -25, -87, -63, 133, 59, 115, -74, 106, -129, -97, -143, -122, 19, -132, 90, 97, 94, -7, -238, 57, 240, -53, 26, 26, 187, 233]
6758B33k49p1K91l50n1K20k17J81n0J22j4J69m06J42j9l2m2j56L57k14p8L24j81
6781i1j80K37j25k06L00Q3j64j7J60Mr3L5j8J23J98k90M2n8p0L03l48K57j7j35
6805g0J09o4j58J04L15l80j02J1L75j98o0K48k00J7K5Q9l5R1j22Q7k2L8j65M9
6829a8K6Q8j03Q6L1n0j8j7k35J91K35k50K9J32m8j61K34k57Q6j65O4M9N8k01L8
6854a76R1K01r5j8l5j83K22p5K0J17Nn3j07J61k83K2K91l64L43j13K7J4NP4p5
6879A6L31k71j23J74J14j36k15K92j7k73o2L50j1l3j53j71K39J44k16J0j02J27
6901A4k6j1o8J46j49M1k5J02n4j7j33L18j72J41j87P7J84l47K1Q2q4R1k0j29K86
6926H1j36K39J59k86j4oJ2r7K42k91J97j18N9Pj35J06L4j20L26l41J43P5j43k
$$ y = [233, -16, -87, 204, -146, -197, 23, -194, -13, -63, 59, 45, 214, -192, -50, -69, -101, -143, -299, 58, -156, -234, 90, -91, -271, -34, -159, -365, -65, 18, -146, -163, -3, 1, -92, -57, -75, 48, 246, -44, -2, -60, -130, 173, -175, 82, 65, -70, 39, -25, -183, -79, 236, -144, -246, -235, 140, -58, -118, 130, -70, -53, -28, 61, 26, 117, -5, 82, 60, 98, -67, -18, 8, 96, -7, 79, 110, 60, 42, 25, -210, -19, 216, -34, -5, 127, 79, -82, 152, -105, -19, -184, -120, -71, -13, -214, -176, -85, 116, 21, 3, -32, -215, 7, -68, -48, 69, 74, 21, -86, 75, -208, -186, 105, -259, 84, -29, -2, 12, 17, 91, 16, 347, 76, -47, 127, 241, 105, -110, 182, 165, -108, -170, 180, 169, 136, -17, -188, 51, 195, -21, -11, -113, 14, -12, -23, -91, 55, -94, -53, -78, 24, -30, -47, -180, 138, -34, 107, -80, -3, 181, -166, -145, -63, -147, -56, -76, -205, 81, -55, 184, 343, 57, 43, 37, 49, -48, 194, -97, 100, -18, 41, 48, -87, 19, 53, -67, 259, -82, 61, 136, -7, -9]
6950ip3Q1k4k31J80P8L1M1Q0j31J41k72J52j04J2J08J1P7m02M64k63P4j24J6J00
6975A3k52L08j53K86m6n4p6k0O2j17J25j97kL17l72K59L8l0j32nK1Q1k06p2K07
7000a7R2J13k27K17k82j1J26j9JNn5n4J04J21j00m3J11j77M3K05k05p7mK49j51
7025c5J77k41Q6l5J33Q6m09J89J23k2nj8j51L0r1K1J03k5K44k85J09L3j08J37
7049D6j28K29l91K94k07J57R7l78L63j25p3K01J36l31J23qM35m37j00j12M86q3
7071A94j26j22r6J74j44J59q3j9J34o8k3k2O8K46k53J3J09k57j77J33J14J73O9
7094A96k33j23J94j61m5P8J38J35j88l8O9j13k7J88r5j52K55r0n4q1R9J6J91j71
7118a2M0P6l47J97J87n0j74L05k77K58l95K8J12L35l77K19j81J13j04R6m7r7J05
$$ y = [-9, -82, -1, -25, -256, -76, 2, 33, 74, 154, 23, 164, -108, 44, -60, -48, 60, 71, 148, -254, 210, -53, 21, -103, -87, 13, -239, 69, -84, 202, 156, 102, 26, 6, 68, -49, 76, -121, -123, 194, -178, 81, 119, 89, -43, -48, -27, 54, -152, -224, -17, 75, 188, -39, 178, -104, -115, 11, -8, -7, -2, -57, -111, -7, 114, 14, -29, 82, -95, -52, 153, -52, -129, -133, 116, -35, 142, -99, -13, -48, 85, 171, -238, -49, 74, 52, 47, 29, -122, -92, -183, -162, -59, -84, 160, -125, -16, 17, -91, 46, -82, 147, -244, 50, -157, 0, 97, -281, 82, -43, -116, 85, 221, -110, 13, 5, 440, 3, -97, -209, 277, 194, 68, -54, -150, 24, -120, 39, -44, -63, 71, 3, -20, -42, 26, 272, 19, 32, 141, -116, -293, -160, -46, 127, 196, -37, -160, 34, -127, -172, -94, 44, 179, -9, -47, 22, -91, -118, 70, -25, -177, 78, -12, -66, -147, -48, -32, 159, -12, 28, 104, -243, -46, 141, 91, -83, 222, -55, 203, -192, -164, -52, 283, -94, 125, -56, 57, -47, 49, 2, -95, 10]
7141A0Q7j80j53K45n9n9J34n5P9j11J93K3k36QO4J40n7l1l44K87j65R1j21L63
7165A53q8j55M1l0O3j62J49J56m23M66l04J01K04k03P6k09J59j94P2K30l00K18
7187B0J7K8K78m40j3J20o5R2Q8k75P2N2kJ21l84N08r7R9j56n94O95j68N7K2j57
7212h2j27K80j32L7p0r6K91k59L3Q4o0M2n1M7J44j52J05J7o5M0k46k1J42J09R0
7237A00nj10j12L66k18q5r2J10QK5L1O0j25J32J24j71L1no2p0j1M7R2P2j60O4
7263C6Q5r7n0J00j41K53k42J34k6j82J50p7k0K08j48m9K18R9j32j37k02K35k9
7286a4j7J76l10R8J34j9n9j25j50M18j2r9P5J13j10n3k36J58J77k23K0K31r0k44
7310a61K98k56J2J80q1l3pJ01r6L74k96LL9k12l5LK36m2j12JJ43qq6K47r1p4k28
$$ y = [10, 97, -83, -236, 9, -50, -109, 25, -30, 49, -62, 131, 154, -82, -74, -10, 130, 73, 42, -302, -15, -180, -89, -210, 153, 65, -90, -49, -79, -16, -178, -29, 127, -296, 170, -134, -33, 171, -32, 44, -165, -6, -200, -128, 102, -198, 20, 37, 65, 343, -97, -110, 10, -55, 37, 125, -150, -78, -26, -28, 93, -291, 217, 120, 219, 63, -531, 164, -4, 53, 75, -82, -209, 71, -61, -24, -94, -190, 101, -158, -125, -41, -101, -59, -110, -63, 81, -71, 34, 51, -14, 26, -220, -241, -99, 10, 100, 95, -15, -127, 239, 21, -64, -156, -46, -38, -13, 18, 78, -47, 85, 209, 38, 69, 64, 2, -68, -79, -32, 60, 132, -28, 36, 121, 24, -26, 74, -67, 186, -56, 78, 52, -130, 20, -57, -77, 131, -17, -66, 152, 251, 119, -18, -220, 15, -14, -31, 145, -165, -67, 67, 48, -11, -136, -286, 132, 120, 21, 96, 209, 99, 46, -190, -32, 145, -78, -58, 173, 83, -161, 137, -119, -107, 73, -8, -41, -48, 53, -43, 331, 35, 38, 77, -135, -170, -167, 69, 27, -85, -84, 59, 51, -35, 212, 121, 47, -181]
7337a81RK21j29K10L5k38M0k3K45p0k08K60j00q4j86PM84l80K11Qj82K36j87J79
7361A77k91Q6r5K18L2j91K09n44M26R3q4P3l61K84j44P8k4k59L86j9j25J60N3
7384A38p1K3M2k91J53J04k44K00rk9j20K16R7j97P5Jj66Q4q9M5J09R5j79n2m1
7409a06K38k13J59o4l1mo5j2o7L9r1K22JO1m2L3k06K39rO9k58O9K11m0k55R0K53
7436B21k72k2o8K08j58L9J6J31p5L1j05K1K13j53K23k91o2Q9J30k22K15n4L8l38
7460b45L58j54J79Lj98K68r1J03q0j04k20L02o5r0j16J14l3j4K04j22n5J2O3J67
7484A86k18j18R5R5m0k12O4L16L9q4K9j20k21J04lj27K35J2P2Q1j65P9j19J53
7508A33k04j36J40N6O1K13j80j52J21n2q8Q5m8K56q9j43J68r3J8j30l6J38j46
$$ y = [-181, -172, 49, -80, 130, 165, -73, -33, -56, 189, 119, -89, 171, 71, -13, -199, -192, 292, -88, 123, 131, -51, 185, -2, 177, -114, -28, -123, 95, 127, -64, 145, -399, 27, 120, 36, 109, -252, 32, -112, -34, -58, -317, 69, 50, -75, 85, 138, 67, 90, 132, -159, -6, 98, -146, 54, 45, 16, -104, 112, 209, 12, 87, 88, -78, 6, -83, -38, 71, 166, -13, -65, -106, 132, -81, 78, 14, -17, -21, -86, -98, -165, -126, -217, 5, 6, 67, 25, 58, -148, 91, 82, 151, -107, -38, 173, 133, -122, -32, 221, -51, -73, -141, 67, -91, -52, -36, 95, 20, 51, -54, -33, 180, 27, 250, -41, -103, -14, 116, -106, 109, 55, 93, -245, 113, -41, 138, 141, -57, 211, 120, 223, 143, 39, -181, 121, 56, -34, -150, -36, -69, -83, 121, -1, -56, -44, 19, 186, -32, -150, -55, 40, 0, -212, -148, 168, 207, 123, 152, 32, -189, -85, -88, -215, 20, 32, 104, 185, 20, 99, -20, 133, -71, -207, -67, -11, 50, 263, 83, -69, 52, 0, -88, -3, -51, 205, 116, -27, 141, 48, 66, -64, -100, 38, -108]
7531a08L65k16j08N8j09J4P4J54O3j11j38L70k07K25m73J59p3J74k6m8Q1k17J73
7554G6J00j47J33l00J11P6r9J4J63j7l51R1K24M2j53N0j2j07q1J75n5j96L71j96
7578h8k7K0O7J35o3Pq9K39k58k2R8j01J52L7m37J43J78J61O6j49Rl7K34kj31P1
7604B13j79n7l9L99k00J21k00k60O4K34j68P2m6R0j39R4p0J06j56J28k55K31K31
7627B14l86L93l82J76J08j92j84R6K36j19J76j35Q0j80J72m1Nj1J44k18K94j71
7649G5j30Q1J66j70J98k18j70L22k5M9l18K09j37R5j83J44K01m45K34rK6J29k8
7672I6q6L7K9n5p3RJ15k26Rn0L13j73R6K5j95K41k17J51j20J31j40MJ62q1j73
7697a71J54q2K25j04m1K2P5J06l22J87n0j27M4Q2J27j37q8RJ41j41P0N8j63M4
$$ y = [-108, 257, 41, -67, -9, -118, -104, -30, 124, 187, 76, -62, 308, 101, 326, -147, 12, -61, 113, 87, 39, 120, -97, 76, 176, 29, 162, -138, -27, 49, -50, -36, 127, 110, -241, -150, 74, 116, -37, 13, 1, -106, -187, -12, -67, -263, 108, -88, -115, -95, -28, 107, 44, 51, -38, 201, -57, -79, 19, -82, 70, 107, -330, -187, -9, 152, 218, 69, 78, 41, 275, 273, 142, 213, 34, -23, -62, 337, 137, 258, 58, -202, -138, 96, -72, 0, -46, 44, -95, -1, -71, 35, -121, 7, -248, -17, 214, -172, 221, -161, 15, 123, -69, -253, -157, 79, -40, 136, 1, 81, -99, 73, 32, 37, 26, 170, -48, 246, 75, -55, 26, 192, 22, 220, 2, -168, 154, 129, 178, -140, 69, -68, 27, -156, -12, 189, -256, -22, -31, -5, 124, 96, 10, 47, 76, 21, -52, -43, 72, -154, -145, -195, 118, -55, 41, 66, -129, 112, -105, 46, -74, 57, -83, -79, 83, 2, -171, -17, -99, 126, 22, -19, 3, 78, 184, -138, 49, -1, -128, -84, -2, 125, -12, -100, -91, 50, -91, -21, 37, -126, -82]
7721h2L5j76J04K6J04n9L8m9K87j50o8J48p2j02r7K71j52j51K61n5k02L37k58
7744f2J0J72K75l20k39K3K70j62P6J20n1l47L22r9l0J08j85K87k30L9L6p8K2K15
7768A72j06k36J05l8K40k74K96j47P8k53K13j11l2O22n15r8n7R4Q4J12j37l35
7790c23K96p4K77k6k01K04k02l6K13m9j72j13K19k75J83NP0qj10P5n4o0J74L08
7814C21j44o7j85J42k7j8K73j62l24K30j68K31j85J12k14K52n5O4q7j79J85M5
7836D0l3oN0j07n9rJ15K23l77J86k49K68J7J29k30J53q8l4j58M3K09j32J85j15
7860B1j81J83L2r7L8L6M0Q3j59P2j88L81k65m0K8PJ70n2j87J21L5l26L41k01j3
7885a21p1K55k98K37k7l1r9J79q5L09l44pQ6J59n4n7q9K14k11J16m6j57J99j81
$$ y = [-82, -47, -223, -119, -93, 11, -48, -10, -59, 228, 78, 10, 158, 86, -16, -113, 158, 6, -145, 116, 61, -141, 196, -62, -52, 120, 395, 75, -164, -141, 129, -33, 43, 163, 112, -235, 87, -12, -42, 66, -119, 168, -62, -23, 13, -65, -43, 172, 66, -170, -65, -103, 137, -137, 159, 12, 90, -163, 50, -61, -93, 529, 14, -84, -141, -47, 37, 149, 12, -323, -27, -101, 176, 150, -51, 153, -49, -85, 128, 79, -93, -206, 13, -262, -79, -74, -4, -12, -122, -47, -101, -161, 13, 321, 177, 110, -75, 67, 40, 22, 295, 133, -191, 39, -129, 102, -83, 29, -185, 67, 12, 76, -11, -190, -5, 40, 7, 1, 51, -56, -115, -124, -9, 214, -163, 23, -226, 42, 59, 188, -42, 111, 23, -11, -169, -126, 83, -49, 136, 21, -160, 23, 55, -42, -4, 32, 72, 155, -4, 68, -120, 261, -4, -44, -16, -9, 161, 109, -78, 43, 78, -248, 93, -108, -121, -192, 63, -235, 2, -25, -56, -155, 24, -61, 248, -96, -103, -17, 142, 88, 31, -58, 156, -55, 61, 15, -142, 57, -124]
7909a24J23k8N3l7L7k08J41J09J99k86J17j42K94k47n2m9P5o5m2M73l12K1o9J82
7933A63j4m7j4j21J12l9K8j32P2K42k69j1P9j08j0J47j71J29q0q0K6j9K14k70
7957a73K45j06Q1j46L3O8Q2o7o7j20P9M61l80K18j48Q7j52j11J17P3J66Mk55K
7981ik10J54J10l46M37j56M5O6m1r7K02j40L9nJ3j22j25K2l4K32M5K1r1j35J90
8006F5%l1p7J31j8j56k9j50jQ6J64J46k42J09J24o9l2J89l66M29j04p8q1J19j96
8031f8J23r5KJ91l19O6J52R8j46nj21J91p1K1J78l06J6P7J90k44J08j75J50K21
8055B34j68Jk7j18k7r3J39L18k90J32l58K60q4R5j84l4R0J11k1j98J56P6r3j5
8079i8K66j28j55K40q5l1J08k64J66j73q7L06L3L1N3l02R3m8R7o6J06J51j30k4
$$ y = [-124, -1, -29, 24, -13, 24, -184, -43, 66, 265, -21, 96, -46, 248, 1, -51, -100, -25, -90, -132, 341, 29, 50, -19, 163, 149, 102, 88, -33, 79, 40, 68, -64, 8, 250, -19, -30, 49, -59, -69, 78, -93, 36, -44, -124, -98, -117, 97, -173, 72, -34, 47, -99, -66, 2, 84, 17, -50, -170, -91, 370, -10, 208, 60, 147, -5, -116, 1, 74, 240, 244, -11, -9, -219, -65, 45, -301, 136, -20, 25, 91, 50, -47, 155, 15, 54, 49, 62, -60, -185, -163, -197, 35, 80, 101, 10, -125, 65, 65, 34, -43, 88, 70, -86, -115, -265, -266, -180, -16, 130, -112, -3, 121, 52, 20, 209, -157, 272, 168, 90, 9, 128, -68, 55, -40, -38, 153, -166, -100, 52, 150, 4, -1, -122, 69, -2, 19, 197, -109, -93, -16, 174, -70, 38, -137, 13, 234, 66, 67, 40, -78, -105, -198, -59, 259, -31, 101, -257, 3, -81, 14, -170, -204, -114, -3, -24, -222, -66, 10, -83, -98, 168, 40, -115, 125, 40, 9, 117, -147, 19, -154, -241, 65, 98, 129, 182, -120, -27, -75, 22, -44, 62, 213, 83, 59]
8103E9j80J91j20J54n5r5L58k90J65R5R6n04J48j38J76j73J1J99j63K4q2K86l30
8126a68J29k22K61rJ39q5k52j0L38j03J58q8Q8R9m79K00N5o2j14J05j46K32j26
8149f0M4j37J55m9J82j77K29k06j4Jo3K67j90j32K17L4k79K73k71K75p1o7j13
8172a52R2m2K37k40J14j79L38j45m8k39J39L32m56M34q6k49L65j04m
$$ y = [59, -121, 70, -50, 104, 49, -46, 312, 22, 187, 282, 378, -126, 22, -116, 60, -113, -102, 97, -66, -42, -124, 162, -168, -39, -261, 0, -9, 130, 45, -207, -217, 121, 18, 176, 88, 176, 275, -204, -4, 51, -11, -125, -20, -166, 66, -60, -16, -153, 2, -47, 135, -42, 187, -19, -33, -32, -95, 172, -18, -150, 67, 101, -178, 95, -176, 99, 28, -39, -152, -60, -102, 135, -105, 9, -170, 168, 23, -25, -264, -125, 207, -249, 185, 99, -150, 215, 111, 107]
8191A07
$$ Imaginary data points
##PAGE= N=2
##DATA TABLE= (X++(I..I)), XYDATA
0@%%%%%%%%%%Qj6J6j6J6k4L2m0M8n6P2q6R8j12J32j54J78k06K35k70L10l53M00
33B12m50N06n70O39p13P95q87R87j094J211j342J484j638J807j990K190k411K657
51A393k929L229l562L940m368M854n417O077o860P807q979J0471j2444J5178j9213
66a0823K5740l7945O7891k62958k91940Q48739j32896n68454M13259K67579n48298
77b30106R6582N32638m34071m40948O76772J51202o65323K10033M57899m56363
87a01685j60183M93932j08438m55800L25369L44361m58255r4943M74575k36799
97B2134l38510M41465J03032m74723J06860M25505k17140l06812K99957Q3089
107A44857l48596J91572K70212l96997p8354M60997q3224m06439J70109K86107
$$ y = [0, 0, 0, 0, 0, 0, 0, 0, 0, 0, 0, 8, -8, 8, -8, 8, -16, 16, -24, 24, -32, 40, -46, 52, -60, 72, -82, 96, -110, 125, -145, 165, -188, 212, -238, 268, -302, 337, -376, 419, -468, 519, -575, 636, -706, 778, -860, 947, -1043, 1147, -1264, 1393, -1536, 1693, -1869, 2071, -2297, 2557, -2860, 3217, -3643, 4164, -4815, 5656, -6788, 8390, -10823, 14917, -23028, 44863, -218095, -510035, 338704, 205808, -362646, 50613, 318192, -230106, -133524, 399114, -34957, -475905, 200867, 352069, -313254, -103221, 354678, -101685, -261868, 232064, 123626, -332174, -6805, 337556, -120699, -215642, 258933, 22134, -316376, 125089, 228121, -246602, -139742, 285763, 68623, -238189, 61768, 144857, -203739, -12167, 258045, -138952, -217306, 243691, 160467, -245972, -75863, 210244]
117B10244k49590j04053L18940j40530k80243L57552J08265m43671P4937L75816
127B27667j97339k31931K92273O4957l53494J42850L04881l43957j28771M06219
137A83355q6923k96250K49742J30468l27987K4273L48037j83089k89226L21771
147G4171J15451l46378J11785K19690k75288l6555L23176j09028k96876K18541
157a311K17013l02619o2738K95972j41889j68551K79780j3130k82956J54840K14297
168A88708k23361j22854K53859n990k40447J63082J39652k60966K1899K42422
178A56004j43839j44554J87841M3177j97607N4295J87949j69789j25356K45486
188I3607l564k19583J20115J12831j60104j770J56957q3484j49852J64414J04354
$$ y = [210244, -39346, -143399, 175541, 35011, -245232, 112320, 220585, -223086, -148149, 227667, 30328, -201603, 90670, 155627, -197867, -55017, 249864, -94093, -222864, 183355, 96432, -199818, 49924, 180392, -147595, -123322, 224715, 41626, -247600, 74171, 189622, -156756, -44971, 174719, -100569, -137124, 186052, 77024, -219852, -1311, 215702, -86917, -149655, 146317, 4428, -164123, 115657, 102527, -180429, -25589, 188708, -34653, -157507, 96352, 90362, -150085, 12997, 152649, -108317, -86418, 156004, 12165, -132389, 55452, 98629, -98978, -44683, 143266, -26523, -151879, 93607, 90043, -129540, -9425, 103406, -56698, -58468, 98489, 15005, -134847, 29567, 133921]
199A33921k28450L687K11788j14372j01857J63153j5329j48917R4274J21264j57753
210c8591p7331K07936k0830j96063J38113R6831j91592K9995J64692j14716j08658
221a10214J56849M0414j87706N6135J70718j68084p3524K23509n6358j78490J44127
232A7376Q7005j67568l11J61107q9150j29127J83561M0105k23630Q9135J70021
243A38524j71633n8520J72721m1111j38145J09268Q9759j72197r955J98929j01678
254A5962j41721J80047K6847j75727P1429J18765j23501o1986J53099n993j61904
265a04683J01727J14820j73035n298J72354r3618j09752J33710M1231j43030J8826
276d6748J39034r3209r5118J63404k605j69180J03198J03483j50380k6472J44961
$$ y = [133921, -94529, -90842, 120946, 6574, -95283, 67870, 52541, -96376, -2102, 119162, -38591, -115922, 92014, 71184, -124879, 13234, 110065, -81527, -51532, 113160, -1556, -110214, 46635, 87049, -100657, -44522, 126196, -41888, -115412, 108097, 51739, -126751, 17376, 104381, -63187, -63498, 97609, 8459, -120668, 62893, 102998, -120632, -31497, 138524, -33109, -91629, 81092, 39981, -98164, 11104, 100863, -71334, -81289, 117640, 15962, -125759, 54288, 81135, -94592, -23163, 95602, -27899, -89885, 63214, 57221, -104683, -2956, 111864, -61171, -66469, 105885, 12267, -97485, 36225, 77456, -65574, -46748, 92286, -923, -96041, 67363, 64758, -104422, -1224, 102259, -48121, -74593, 70368]
287G0368l6938j26684R9012Q4831j58214P090J68108j09323j01158J61577O379
298F5048j51017O2566J14735j10952o6602J56624j3090j59421J13868R1636j69344
309f5949J1127J49325q9480r7322J25451M1349j48129K9448J45181j14658q0300
320i3957J66142k6226j45115J06215P6201j35122j1705J37472m6998j20474J17449
331B3882O4430j60908L4701J37228j17179o2750J39622j1754j24191O5704R8348
342H7133j15132m6338J50927m0430j31631J18983N2129j43557K7549J15871p8441
353b937p6293J14545K9470j38707M5378J22145j20457m8491J43916l9128j10131
364h0690R0876O0105j11827r556J25199n0991j08414J18329L9637j45251M7516
$$ y = [70368, 33430, -93254, 5758, 90589, -67625, -60535, 107573, -1750, -102908, 58669, 65048, -85969, -23403, 91332, -19620, -86222, 70402, 57312, -102109, 11759, 103395, -65949, -54822, 94503, 5023, -92299, 33152, 74501, -73628, -44180, 101001, -13657, -93957, 72185, 45959, -99156, 7059, 83260, -51862, -63567, 73905, 26907, -93567, 23882, 88312, -72596, -37895, 99333, -17846, -80596, 59026, 47272, -76919, -11215, 87133, -27999, -74337, 76590, 36160, -95471, 23512, 75641, -67916, -40367, 75504, -2937, -79230, 35315, 64785, -73922, -28544, 93601, -26856, -75347, 68569, 29441, -80690, 10186, 70291, -41536, -51092, 74107, 23116, -85298, 33031, 72668, -72583, -25067]
375b5067J06843j02992m4966J14674q169j10113O0564R0834j16663l0940J40336
386G4341n7234j04242J14096L1982j18842K9529R9808p1467o9310J14074J4887
397E7622j32654O4352R5295j22843j9215J23666m7212q7338Q5201M8048j08710
408d3788J188J17410p0389q4237J22719O734j23539O2629P8099r2795k7853J02219
420D8397j5779j00392O9547O9453j18465J91J18767p0161p0271J01543J4492r5521
432d8199K8651Q4476o9830n7069J08650n476j14462P4993O6072j07281k237R6971
444E5259m1801p2714P3695M2557j03976R954J06240p8646o1357J15112q152r9586
456f3415O0116O4529q3333k7368R9779k1152r7576Q1438N1865j18447K1284J03160
$$ y = [-25067, 81776, -21216, -66182, 48492, 40323, -69790, -9226, 81608, -35055, -65995, 74341, 17107, -87135, 26961, 58943, -59899, -30370, 69438, -2029, -71339, 42735, 57622, -75032, -10680, 84615, -38228, -57443, 66223, 19011, -68327, 16874, 64922, -43788, -42600, 74810, 4421, -79816, 42903, 49637, -73902, -11273, 66826, -25969, -53822, 48397, 32618, -67774, 1773, 71226, -47239, -47048, 71719, 1558, -68713, 32830, 47322, -48199, -19548, 64928, -4902, -61971, 46679, 41203, -73259, 1734, 67806, -39475, -41712, 55259, 13458, -59256, 14439, 56996, -46980, -37026, 69214, -9432, -70789, 44323, 36171, -63415, -3299, 61230, -22103, -49471, 50308, 29156, -68420, 13018, 64883, -53564, -32280, 70880]
468G0880p5847n3937R5105R732r6402L1803Q2942q2232m1900J13965l1090r7104
480g4085Q9494M3059j02419R247Q9715m5620o8940P9984K8500j05571L6467Q9339
492F9170r1903l1235J05391k5167q0498N9029N0934q1230j7139R5577l7351q1430
504f5852Q9869K5937j02173L6652P4515p1688l7374Q3584L312r0887L7988P5679
516E9562q5479k2814J01034m1356p0240Q2256K5589q8974J0167Q4221m5290o8190
528e9514Q3646K0907r8317M4658P1026q7027j7665R0646k4563p6717N2015N5093
540E4188q3297j4921R7978m5754p1199R1089J4511r1960L4685O6623o3194l8735
552d9986Q3192Q82r3901N2775P1423r3764j1310R3979m3934n8164P1658J8544
$$ y = [70880, -4967, -58904, 36201, 45933, -50469, -18666, 64276, -17956, -59856, 54109, 23019, -74085, 15409, 58468, -43951, -34704, 55011, 9391, -59549, 20435, 48935, -56636, -20169, 69170, -22733, -53968, 51423, 26256, -54242, 4787, 55721, -25509, -42648, 52929, 15578, -65852, 24017, 49954, -52219, -15567, 58948, -12740, -50114, 33470, 36782, -54105, -16117, 59562, -25917, -48731, 52303, 10947, -59293, 22963, 48552, -40422, -30255, 53966, 8676, -59514, 24132, 45039, -53278, -8620, 62406, -24621, -42286, 48360, 23797, -52920, -905, 54188, -29109, -44030, 53948, 8194, -63005, 28084, 42595, -49365, -14680, 51943, -11251, -49986, 33206, 34088, -59813, -7038, 64385, -29379, -40689, 53290, 9356, -48808, 22850, 41394]
564D1394q2902J5342Q5126n9035o1975R5921O272r3373N2480N2067q0347n763
576c4793P9168l0272p1975O2615M8689r1720L118R2072n9658m9094Q6667l336
588C1481p7922L8022N6971o2141l1640Q3927j1565q3185O5179M7186r1141N892
600b8936P6763m2982m8030N8658J7988p2197J8845P4419o5408m3430R3807q836
612C0661q0365M7526M2893o2734r082O7206k4063o4923O6133L9330r2667J3717
624b6368Q1078n7880l9831P1454j262o7814L1112N8440o2649l1273Q7269j9107
636B3169p7498O6827L3347q3150J0833O9929l9837n1610O1481K4575p7696K3693
648a5937O9970p1911k7239Q8806k2544p1021N0404M2485o1651j3121O9925k5606
$$ y = [41394, -41508, -26166, 58960, -75, -62050, 33871, 40143, -53230, -750, 51317, -29030, -34793, 44375, 14103, -57872, 4743, 53432, -38288, -35170, 56902, -2756, -51850, 34817, 31481, -46441, -8419, 48552, -13589, -45229, 38698, 27133, -56052, 9127, 56313, -34828, -28936, 47827, 4845, -43185, 15473, 33461, -38736, -19891, 54528, -10880, -54310, 39497, 30661, -49704, -2178, 40715, -22019, -31101, 36105, 12042, -52881, 13252, 52582, -40085, -26368, 54710, -3170, -43001, 28453, 27191, -40623, -9511, 48929, -13720, -44993, 42276, 23169, -54329, 12498, 45845, -37305, -26472, 43457, 3620, -47990, 13491, 38066, -39630, -15937, 54033, -17878, -45117, 43689, 21145, -49876, 528, 43013, -18638, -31759, 38166, 12560]
660A2560n9989P0087K0614q7587K8768O5575n8813l1468O3535J459o2078K9692
672g645N2915o4655j8944Q1543l1503o0750O2971J9359o6499J2849N8506l5395
684B752m5345O2237J6842p5089K9838N4968o5014j2192O7521k4055n2872M3394
696B985L7663n8606j2835O8834k7993n2504O2582Q566o8437K9804M8920m8494
708i515k7614N7407O562o2360K8784M8915o2560r435O8051l3235m5278N3219J7710
721C0651n4693N922N4828l1965m3380O1317Q274o9690L3546M3243n5415q953N3824
734B7509j5766m6061L7167L4924o0591n286O6826l6704m2243N9573J712n3933
746c2873K6805L8962m0798k3146N6512j728o1443L8108L7919o1926L194N4803
$$ y = [12560, -47429, 22658, 43272, -44315, -15547, 50028, -8785, -40253, 23282, 24741, -37337, -7645, 45270, -19385, -38329, 43214, 11711, -49039, 13932, 33291, -33208, -20359, 38147, 2752, -42593, 19644, 36486, -38603, -8765, 46203, -18811, -31003, 36518, 12463, -40409, 2985, 40648, -17958, -30793, 38041, 10048, -42456, 20126, 28692, -39745, -9941, 38979, -9515, -37129, 20278, 26840, -35520, -6736, 42179, -20381, -29816, 38235, 5000, -40278, 12941, 30651, -24042, -18120, 36708, 4743, -38637, 22680, 30954, -38736, -5190, 38053, -17362, -26315, 27509, 11743, -34318, 2849, 37773, -22818, -28104, 38722, 2018, -40225, 19348, 21060, -32873, -6068, 32894, -7904, -31050, 25462, 23734, -37709, 399, 38318, -23608, -20414, 34389]
758C4389l3518l1603M4930J2331m9699Q298N0798l8870l2891O0637p229n4780
770c7207L8625K7858m6444l620M4424j3675m0721L6719K5071n7503Q578N3324
782C5429m1428k3987N0237l410l9824K0040L1686l5832j8821N1915j1107n0694
794c5796M2550K2139n1988R429M0248k6165k5030L5421J1676m7005J1480M5414
806C2373m2275k0388N4960j4285m0079L4054J9947l7248m292M0817j4410l9619
818c0445L9666J7667n3893J7749M0442l8362j4559M0282l287l6600J7194L1431
830B7285l7782j4786N0559j8632l9289M3122J1066m2859J1312L3033k2555k4956
842b4482L5378R321m6815J9957L6804m3845o802M5477j7991k9052K8449J5441
$$ y = [34389, 871, -30732, 14198, 26529, -23170, -14872, 35926, -2944, -35835, 24802, 17573, -37207, 1418, 29276, -17168, -20788, 23636, 9961, -30760, 5959, 31030, -26473, -17895, 35429, -5999, -29986, 20251, 16841, -22983, -2943, 28743, -7089, -25910, 26005, 14898, -35796, 6754, 28893, -23095, -13666, 26582, 417, -24613, 10808, 22484, -24521, -13041, 32373, -9902, -30290, 24670, 10385, -29694, 4360, 24307, -12941, -17233, 23584, 9174, -30445, 9221, 26888, -27005, -9256, 31186, -7176, -21735, 18547, 15260, -21340, -4146, 27285, -10497, -25283, 25276, 6644, -32645, 10477, 21543, -21316, -10004, 23029, 474, -24482, 10896, 20217, -26598, -6641, 30163, -13682, -20484, 24993, 7002, -22050, 6399, 21840]
854B1840l4482l388M0603k0790l2909M3613N257m5721K3712K7056l3640q315L2498
867A5334m324l4860K0931K7509m1046k589M5018k5883k4327L7928J717l2625J0841
880f376K7154k2097k1274L7172J414m1112K6793K3654l8804K042L1845j6862k1715
893a8166K2293J3979l3016M02L7833k5495k2111M0666m572l3284K1569J7503k5936
906h335p722K9373m226l2149K4871K1272l9804O656L4247k6449j4593K9008j12
919A2037k6940Q591K6418k3677j7428L9055p170l4318K9761J2012l2850N503K4406
932A5400j4501k0199K3480J2105l4199R016L2483l0689j0407L4977j1201k3654
944a7389J9535J2885k3285n461L0305j0034k7925L1115Q695l6263J5138K1980
$$ y = [21840, -12642, -16030, 24573, 3783, -29126, 14487, 19744, -25977, -2265, 24791, -8849, -17164, 15334, 11010, -23850, -2919, 24590, -16456, -19045, 25973, 90, -24237, 13691, 15408, -17217, -6376, 20778, -1319, -22593, 14579, 15993, -25119, 1674, 25328, -13476, -11434, 20411, 3549, -18166, 4127, 18106, -14910, -14508, 23325, -2170, -24281, 16385, 11813, -21471, 98, 17601, -8335, -16057, 13316, 9090, -23059, 1812, 23084, -16720, -10064, 24183, -2266, -16859, 12149, 12037, -14903, -6312, 20106, -3571, -20999, 18056, 10886, -23432, 6329, 18341, -14509, -9006, 15400, 899, -19300, 4180, 16285, -17914, -8898, 23585, -7104, -17511, 17466, 6265, -17389, 2146, 15031, -8254, -13715, 16590, 6556, -21369, 9746, 18441, -17822, -2684, 19296]
956A9296k5364p070K3291j386k4862J2237K3360k8627o382L5417j7940k1848K8791
969H913K119k5532P846K0611j4458j6696K6957M842l3450J8998K1342l2417N31
982a0394K6658j4469j6415J7865J1084k4040j068L0419j8575k0787L3404k863
994A0819k9528J8079J4406k1364n097K2541j727k5782J8086J9118l2965K986L0122
1007A9694k2137j3891K5506O37k2164O859K2272j7528j5626L1284l644l0942K3686
1020D006J3178k9935L717K2673j1698j7343J8711J2278k8659M097K9899k5820
1032d896j3727L2813p719k4332J7609J4211j9867o927K6390n184k7548K4931J2398
1045A8152l4397R970K4581k2319r867K2909J684k3198P659K3890k3493j1980L2580
$$ y = [19296, -6068, -13138, 10153, 8767, -16095, -3858, 19502, -9125, -15507, 19910, 1970, -19878, 8913, 11032, -14500, -6654, 13957, -501, -17197, 9760, 14602, -18848, 150, 21492, -10925, -10394, 16264, 1795, -14620, 3245, 14329, -9711, -10779, 19640, 1065, -19722, 13682, 10819, -18709, -630, 13776, -7588, -12685, 9856, 8129, -17653, 433, 19551, -13414, -10428, 19694, -2443, -16334, 9172, 9809, -12355, -5496, 16776, -752, -16378, 14906, 11262, -19680, 4006, 17184, -12751, -9034, 13639, 1941, -15402, 3309, 15587, -13072, -8975, 20924, -4896, -18623, 14190, 6471, -17861, -252, 13959, -5908, -12835, 13555, 8371, -19177, 5754, 18152, -16245, -6275, 18306, -4013, -13880, 9029, 10713, -12485, -4826, 19064, -4429, -16409, 16171]
1058A6171j1240k5402K5770P107k5133M380K1478j0315j9082K1376J0088l1280
1070a6082J0655K4359k7175n387K7455q781j8841J4776J4332j9986p383K7981
1082A5923j0395k4313K6558N193k8642J2312J7767j7480r318K0355L135k5366
1094a4271R759K2686k6920o126L0100j3956j7557K1552N611k0069K128K1616j1022
1107C531k0641K5258N122k9894J4828J7832k3588j551K1149o378j7815J2483J5794
1120A6130k4174m940K8865j5094j8789K6237M76k2378J1334J5119j5294j0490
1132a2998K1608J592k7108J5570J8197k7980J552K4439j4049j2802J8074N247
1144A1342j9483J449K1954j5679j6564K8061j859k5569J7585J1653j9916n35J7333
$$ y = [16171, 4931, -20471, 5299, 12406, -12727, -8347, 13131, 2816, -16266, 5110, 15198, -16082, -5427, 18932, -8243, -13630, 13825, 5044, -13797, 979, 15311, -4675, -12058, 15923, 5528, -18785, 7773, 12966, -15676, -3364, 14403, -3077, -12395, 7960, 11095, -14271, -4512, 18174, -8746, -14872, 15228, 1272, -16285, 5267, 10878, -9191, -7063, 14553, 3531, -17110, 8148, 13270, -16624, -1796, 16036, -7552, -9103, 12046, 5668, -12147, 336, 16130, -8044, -12984, 15881, 787, -18002, 8235, 8711, -13667, -2333, 12786, -2508, -12998, 8610, 10202, -16906, -1336, 16861, -11119, -9567, 14872, 823, -11979, 6095, 11342, -8141, -6692, 15262, -417, -16981, 11080, 9221, -16348, 1237, 12890, -7026, -7561, 9772]
1157I772n581j8120J4994J2905k6658K690K5908j8692j0946K3347l003j6605Q834
1170a155J3316j4690r917K3317l290k4165J9967J0537k4537O012J7448j2300j0632
1183a0089J4290N824k0015L263K1123j8869r800K6203p128j8723J6180Q426j6414
1196e729k959J7480m668j8754J7922R404k6065R002K0107j9165o306J8829k067
1209G031j6286O701J5055j6824p746K4901q261k0152K1707N064k1346O029J4458
1222A0331j0433j2196J6062O056k3025Q776J9633k1794l932K3067r536j4514J4085
1235B580P709j6343l202K0699p738j8219K1801L727k3335J2079J3677j7872m463
1248h900J6379j080j7857Q640J5728j9875l278K3894j3097j3698J9524J398j7113
$$ y = [9772, 4191, -13929, 1065, 13970, -12688, -9998, 15910, -2782, -13728, 9619, 6616, -9989, -1155, 12161, -2529, -12446, 10871, 7581, -16584, 3383, 13920, -10617, -4605, 12843, 543, -10089, 4201, 10025, -9990, -6727, 14396, -4473, -14273, 11930, 4802, -13921, 2259, 10685, -5729, -8688, 8792, 4124, -14630, 3292, 12696, -13369, -4367, 15740, -3425, -9731, 9098, 7031, -9255, -2554, 12501, -4323, -12069, 12832, 4571, -15581, 6126, 11190, -10156, -4127, 10331, -102, -12298, 3764, 9820, -13205, -4429, 15204, -6590, -10522, 12545, 3009, -11505, 2580, 10289, -6054, -9256, 11443, 3705, -14514, 7287, 11014, -12321, -242, 13435, -4437, -8900, 7479, 6399, -11458, -2818, 12910, -6965, -10243, 13651, 554, -13144, 6380, 7778, -9335]
1261i335M544J4374r940j2093J8811K948k2077J3050J3954k1077L77J7209q429
1274B316j1758J0851Q815j6572j843K1174j1699j4163K0982p16j8280R943R891
1287H941j3175n153J5021Q15j8693J1324J4043k0684K09J9322j2486r389J4411
1300D506K405j4086K182J5686r612j2461J9705L53k0332J3311R285j7007Q2J3558
1314G575m918j2455J0048J0506j8309N90J9704j3985j0055J8371k519j3994P773
1327a668R337j0056o685J6563r05j8128J3781R408j9365L301J4349j0645p087
1340g800J1385L560j3683K264J5711j2740q836J9105m632j5052J2081N488j2574
1353e723m19J2235l322j2292J1501P762j8097M277J4840j4267m171J3748k681
$$ y = [-9335, -4791, 9583, -357, -12450, 6361, 9309, -12768, 282, 14236, -6841, -6464, 10745, 2316, -9442, 1409, 10224, -6348, -8191, 12983, 1284, -12879, 8103, 7387, -10893, -950, 8941, -4234, -9387, 5634, 6449, -12244, -920, 13123, -7561, -7352, 11970, -516, -9905, 4506, 6911, -7175, -4993, 10693, 1081, -11380, 8325, 8678, -11654, 1657, 10942, -6065, -5983, 7575, 2657, -9798, 250, 10756, -7553, -6963, 12741, -1244, -11299, 7072, 4553, -9441, -1668, 7669, -2387, -9072, 7491, 6586, -11542, 2239, 11647, -7718, -4417, 9932, -713, -7800, 3585, 7145, -6538, -4274, 11437, -1303, -10139, 8966, 4334, -10718, 1363, 6851, -5723, -6142, 6093, 2771, -9521, 1980, 9742, -8355, -4078, 10762, -3505, -7676, 6072, 3391]
1366C391j0158N604R846j0080o066J6460m362j4746J3983L584j5231M846R572
1379F643p258o327R529M445j4213L437J4248j4150m693J5797o338r468R387M587
1393E626q817j797J1756l421j2249J2740M431j6388O361J0328j1420k510R899
1406D539n7r572L810J0298j1745m433J5137o777j0319J2459R99j0585L362Q359
1420E475m780p500R729L605j4383O248J0094j3327j50J1329n484o249O757N091
1434F455q658k454J2287n981r992J3061o6j2204P521N675p994j788P707K27j0035
1449f239N066Q337j2550j49J2398q572m796R956l47p159K589P194n068o974J0393
1464D079K20j1709Q820M964j0866K511P175m016m873M806M223q779n55J0578q203
$$ y = [3391, -6767, -1163, 8683, -1397, -7463, 8997, 4635, -10111, 3872, 7456, -7775, -2929, 6643, -615, -6942, 2587, 7032, -7181, -3744, 10504, -3646, -8339, 7458, 1120, -8348, 1039, 5626, -3191, -4988, 6768, 3347, -8902, 3838, 8269, -8119, -1758, 8570, -2850, -5360, 4539, 4482, -5090, -1280, 9018, -2727, -7160, 7977, 1200, -9119, 3340, 4339, -6246, -2884, 5475, 695, -6805, 2924, 6529, -7854, -1606, 8488, -4839, -4989, 6340, 856, -5393, 1364, 6455, -2203, -4657, 7630, 1649, -8343, 4718, 4652, -7552, -31, 5644, -2350, -4138, 3569, 3796, -6239, -1173, 7164, -5386, -5535, 6863, -1709, -6505, 3451, 3104, -4055, -1466, 5728, 660, -6314, 4079, 4299, -7410, 1410, 6374, -4492, -1981, 5194, 1178, -3695, 1111, 5334, -3445, -4000, 6578, -1625]
1479a625n295J1648l244o924O182L005n278k421P284o19r377P042N364j1754M100
1494a912Q227p948j749O539K65o167J262P177o824m994J1417l507q172R265Q92
1509C771p495K750M731k949n806N711L566j0342L483Q790r668q76R562m756m005
1524c533M690K767n611k128Q540l726p341J0040Q48j0061O552M381p255p74N442
1539B831k45p069K966O855r236o35J0636p000m327Q837j246n915K320M579l783
1554d32n055Q613N80j0396P708N120r705J990O638m596l761M278L064p194k83
1569c431R287o630m778J0868k771p751O458K551o117j222N941l63q232O268N638
1584E716j0798K754Q940p919k742P023m38n885J319O759n257m761J0696k378q941
$$ y = [-1625, -6920, 4728, 1484, -5440, 742, 3747, -1531, -3952, 3332, 2713, -6664, 378, 5742, -6012, -1912, 6315, -1633, -3382, 3157, 3422, -2745, -1483, 5694, -1130, -6124, 5293, 1786, -6386, 2879, 3771, -3724, -974, 3757, 808, -4998, 713, 4279, -6063, -2580, 6210, -3458, -4334, 5228, 472, -3533, 1157, 3924, -1687, -3815, 4725, 999, -6342, 3698, 4546, -5515, 1037, 5418, -1837, -2611, 2831, 2586, -4483, -1517, 5338, -3898, -4533, 6103, -897, -5224, 3613, 2367, -3548, -1228, 3351, -432, -5487, 3126, 3706, -6690, 1018, 6138, -3567, -1577, 5061, 465, -3296, 982, 4046, -3148, -3431, 5856, -774, -5552, 5316, 2545, -5206, 1252, 3803, -2314, -3536, 2405, 2042, -6190, 78, 5716, -5082, -2328, 6612, -1307, -4049, 2974, 2536, -3349, -2030, 4729, -528, -5289, 5407, 3029, -5912]
1599e912Q463K607r186K237N770l355n385M909M618r434K092R445r160k235R430
1614D904l933n874M838L585n528k635Q447j453q476Q663K975j0304M210N933o481
1629a129k386N535R12o587J508Q513p653l366J0526m802o553P671M41o011P00
1644b681N628k021o382O831L211r595L915P076q648p54P270l189m436L547M444
1659D216n456k522R251l793o728Q338J22p548L845L674m478k495N035K115p687
1674d111K811P023q414j206Q372m855l822N198Q89m107l93O245k273o154P768
1689B971J190q913N387L720o860K82M530o56m185K452N187p217j391Q885n532
1704a50m671P430j472m972K832L416l026l063N928Q24p943N120M302q246J659
$$ y = [-5912, 2551, 5158, -4028, -1791, 3979, 624, -4761, 148, 4766, -4668, -2576, 6869, -2291, -4526, 4904, 971, -4903, -65, 3520, -2008, -4643, 3804, 2351, -6125, 2538, 5513, -4791, -581, 5352, -1129, -3515, 2020, 2932, -3655, -2147, 6366, -1287, -4653, 5873, 1071, -5482, 2189, 2630, -3381, -2681, 2947, 926, -5456, 1375, 4586, -5009, -1094, 5982, -2666, -3420, 3850, 661, -3775, -228, 4216, -1240, -3762, 5489, 1696, -5032, 3306, 3428, -4120, -275, 3399, -1079, -3574, 1461, 3576, -4111, -1300, 5723, -2691, -3897, 4475, -380, -4202, 996, 1885, -2222, -2615, 3630, 1357, -4797, 2971, 4161, -4752, 635, 4355, -2505, -2223, 2307, 1651, -2534, -82, 5105, -2112, -3503, 5382, -150, -4821, 2609, 1137, -3835, -1003, 2413, -613, -3676, 2252, 3076, -4867, 253, 4555, -3691, -2032]
1719b032N536m027k160M185J607m526j50O451m597m605Q280k170o502N822J158
1734B270m514N50L746k48n319L698M075q044J783O426o869j007N916j591l237
1749b365J832L784l396l032O853j777o847O546J677o877L206L379k887j961L081
1764A216K140o009R53O188o381k157P614l800l762M781J210l470p13M696r80n819
1780d293N485K074p700L733M620n886J79M249o36l428J258M433n031k516P659
1795D200l868n012P032l14n078K554L060k406l195M304J637p631L521N130p025
1810c091M30O133l607k442L438K138m074j298O003k954n186P192k83o207M400
1825E92K833m368k71L081M55n316K292M672o851k73P113m958k513N719m10m061
$$ y = [-2032, 3504, -523, -2683, 1502, 3109, -1417, -1567, 4884, 287, -4318, 3962, 1792, -4710, 1112, 2270, -2244, -1694, 2052, 1804, -3515, 183, 4258, -3786, -2003, 4423, -2446, -3453, 2463, 872, -2365, -533, 3251, -145, -3177, 3676, 1899, -4948, 1598, 3275, -3602, -396, 2983, 96, -1865, 1216, 3356, -2653, -1700, 4488, -1893, -4050, 3564, -236, -3998, 783, 1993, -1477, -2190, 2506, 1526, -4293, 1192, 3266, -4434, -701, 3919, -1967, -1788, 2461, 1825, -1603, -345, 4088, -943, -3459, 4200, 332, -4680, 2352, 2038, -3040, -486, 2574, 168, -3027, 1277, 2914, -4717, -1196, 3934, -3091, -2661, 3472, -135, -2577, 861, 2999, -1075, -2373, 3630, 676, -4510, 2682, 2399, -3808, 592, 3425, -943, -1214, 1867, 2322, -2994, -702, 3970, -2881, -3154, 3959, -999, -3512, 2207, 1797, -2264]
1841b264J181L383k068m207N760Q44p211M901L457o197J663L667k046k657K242
1856D48K802m946j318P354m570l816P091j649m492L533J755k927j964M002O60
1871A963o271L842M138o816J277N383m092j337L193R45l765k42M698k817m153
1886d054P038r38n610M908J876m670M67L213j141m009K409L877o501Q87O432n140
1902i56k132N696j672k936J500K598k320l154N270j44n886N038K649o009K318
1917a40L223l147j644K309J729m059m97O085m540k543O502k336l802L859O35k802
1933a168o92K837J43m728L514L194n734J615M192m351m39L246o55k434K44L543
1949B327k060l184N885j409m516M735O41m246J472J446p67k542J762K759m455
$$ y = [-2264, -1083, 2300, 232, -3975, 1785, 2629, -4582, 319, 3776, -2421, -758, 2909, 863, -1794, 448, 3250, -1696, -3014, 4340, -230, -4046, 3045, 1396, -3096, 437, 2192, -735, -2699, 1303, 1963, -4308, -466, 3672, -3144, -1867, 3516, -576, -1913, 1280, 2225, -1540, -1782, 2916, 99, -4054, 2984, 2046, -3564, 1344, 3220, -1450, -983, 2230, 1089, -2920, -511, 3366, -3135, -2248, 4184, -956, -3088, 2608, 936, -2000, -500, 2098, -222, -3376, 1894, 1750, -4136, 902, 3551, -2458, -140, 3083, -64, -1708, 601, 2330, -1729, -2226, 3859, -681, -3224, 3278, 942, -2860, 999, 1634, -1168, -1860, 977, 1120, -3608, -94, 3100, -2634, -1019, 3173, -1178, -1617, 1629, 974, -1460, -1216, 2327, 267, -2917, 2968, 1559, -2957, 1778, 2419, -1827, -355, 1091, 324, -2218, -456, 2303, -2152]
1964b152M83N056m612r98M623k356k020J889J060j492j947L611M11m468L989J721
1980B798m923K331K033k520r36J487J289k626K6M164l437j875N097k197l027L502
$$ y = [-2152, -1669, 3387, -1225, -2223, 2400, 44, -1976, -87, 973, -519, -2466, 1145, 1556, -2912, 1077, 2798, -2125, 206, 2239, -281, -1217, 270, 1559, -1067, -1041, 3123, -314, -2189, 2908, 711, -2316, 1186]
$$ [...]
8191e4
##END NTUPLES=NMR FID
##END=
