##TITLE=1H_Pr C3_2Z2
 200.13Hz, DMSO.
 8 sc
 27.7.2026
##JCAMPDX= 6.0         $$ Bruker NMR JCAMP-DX V2.0
##DATA TYPE= NMR FID
##DATA CLASS= NTUPLES
##ORIGIN= UXNMR, Bruker Analytische Messtechnik GmbH
##OWNER= pz
$$ XWIN-NMR		Version 3.5
$$ Mon Jul 27 13:35:21 2026 Russian Standard Time (UT+4h)  she@DPX200
##.OBSERVE FREQUENCY= 200.1313
##.OBSERVE NUCLEUS= ^1H
##.DELAY= (6, 6)
##.ACQUISITION MODE= SIMULTANEOUS
##.ACQUISITION SCHEME= undefined
##.AVERAGES= 8
##.DIGITISER RES= 18
##SPECTROMETER/DATA SYSTEM= spect
##.PULSE SEQUENCE= zg30
##.SOLVENT NAME= DMSO
##.SHIFT REFERENCE= (INTERNAL, DMSO, 0, 14.3821)
##AUDIT TRAIL= $$ (NUMBER, WHEN, WHO, WHERE, WHAT)
$$ ##TITLE= Audit trail, XWIN-NMR		Version 3.5
$$ ##JCAMPDX= 5.01
$$ ##ORIGIN= Bruker BioSpin GmbH
$$ ##OWNER= she
$$ F:/spectra/data/she/nmr/H-C/1/audita.txt
$$ ##AUDIT TRAIL=  $$ (NUMBER, WHEN, WHO, WHERE, WHAT)
(   1,<2026-07-27 13:33:54.96 +0400>,<she>,<DPX200>,
      <created by zg, POWCHK disabled, PULCHK disabled
       configuration hash MD5:
       00 E9 B6 7A A2 85 ED C7 34 08 36 98 17 FE 4E 26
       data hash MD5: 16K
       D2 F6 19 7A 39 0B E0 1A 04 71 04 5E F6 E8 2E 16>)
$$ ##END=
$$ 
$$ hash MD5
$$ 9E 33 1B 2A 03 71 AA 97 50 00 45 06 28 C3 41 D5
##$RELAX= 
##$RELAX= 
##$RELAX= 
##$RELAX= 
##$RELAX= 
##$RELAX= 
$$ Bruker specific parameters
$$ --------------------------
##$DU= <F:/spectra>
##$EXPNO= 1
##$NAME= <H-C>
##$PROCNO= 1
##$TYPE= <nmr>
##$USER= <she>
##$AMP= (0..31)
100 100 100 100 100 100 100 100 100 100 100 100 100 100 100 100 100 100 
100 100 100 100 100 100 100 100 100 100 100 100 100 100 
##$AQSEQ= 0
##$AQ_mod= 1
##$AUNM= <au_zg>
##$AUTOPOS= <>
##$BF1= 200.13
##$BF2= 200.13
##$BF3= 200.13
##$BF4= 200.13
##$BF5= 200.13
##$BF6= 200.13
##$BF7= 200.13
##$BF8= 200.13
##$BYTORDA= 1
##$CFDGTYP= 0
##$CFRGTYP= 5
##$CHEMSTR= <none>
##$CNST= (0..31)
1 1 145 1 1 1 1 1 1 1 1 1 1 1 1 1 1 1 1 1 1 1 1 1 1 1 1 1 1 1 1 1 
##$CPDPRG= <>
##$CPDPRG1= <>
##$CPDPRG2= <>
##$CPDPRG3= <>
##$CPDPRG4= <mlev>
##$CPDPRG5= <mlev>
##$CPDPRG6= <mlev>
##$CPDPRG7= <mlev>
##$CPDPRG8= <mlev>
##$CPDPRGB= <>
##$CPDPRGT= <>
##$D= (0..31)
0 0.7 0 0 0 0 0 0 0 0 0 0.03 0 0 0 0 0 0 0 0 0 0 0 0 0 0 0 0 0 0 0 0 
##$DATE= 1785144834
##$DBL= (0..7)
120 120 120 120 120 120 120 120 
##$DBP= (0..7)
150 150 150 150 150 150 150 150 
##$DBP07= 0
##$DBPNAM0= <>
##$DBPNAM1= <>
##$DBPNAM2= <>
##$DBPNAM3= <>
##$DBPNAM4= <>
##$DBPNAM5= <>
##$DBPNAM6= <>
##$DBPNAM7= <>
##$DBPOAL= (0..7)
0.5 0.5 0.5 0.5 0.5 0.5 0.5 0.5 
##$DBPOFFS= (0..7)
0 0 0 0 0 0 0 0 
##$DE= 6
##$DECBNUC= <off>
##$DECIM= 32
##$DECNUC= <off>
##$DECSTAT= 4
##$DIGMOD= 1
##$DIGTYP= 9
##$DL= (0..7)
0 120 120 120 120 120 120 120 
##$DP= (0..7)
150 150 150 150 150 150 150 150 
##$DP07= 0
##$DPNAME0= <>
##$DPNAME1= <>
##$DPNAME2= <>
##$DPNAME3= <>
##$DPNAME4= <>
##$DPNAME5= <>
##$DPNAME6= <>
##$DPNAME7= <>
##$DPOAL= (0..7)
0.5 0.5 0.5 0.5 0.5 0.5 0.5 0.5 
##$DPOFFS= (0..7)
0 0 0 0 0 0 0 0 
##$DQDMODE= 0
##$DR= 18
##$DS= 0
##$DSLIST= <SSSSSSSSSSSSSSS>
##$DSPFIRM= 0
$$ [...]
##$SUBNAM0= <"">
##$SUBNAM1= <"">
##$SUBNAM2= <"">
##$SUBNAM3= <"">
##$SUBNAM4= <"">
##$SUBNAM5= <"">
##$SUBNAM6= <"">
##$SUBNAM7= <"">
##$SUBNAM8= <"">
##$SUBNAM9= <"">
##$SW= 18.0517328524113
##$SWIBOX= (0..15)
0 0 2 0 0 0 0 0 0 0 0 0 0 0 0 0 
##$SW_h= 3612.71676300578
##$TD= 16384
##$TD0= 1
##$TE= 0
##$TE2= 300
##$TE3= 300
##$TEG= 300
##$TL= (0..7)
0 120 120 120 120 120 120 120 
##$TP= (0..7)
150 150 150 150 150 150 150 150 
##$TP07= 0
##$TPNAME0= <>
##$TPNAME1= <>
##$TPNAME2= <>
##$TPNAME3= <>
##$TPNAME4= <>
##$TPNAME5= <>
##$TPNAME6= <>
##$TPNAME7= <>
##$TPOAL= (0..7)
0.5 0.5 0.5 0.5 0.5 0.5 0.5 0.5 
##$TPOFFS= (0..7)
0 0 0 0 0 0 0 0 
##$TUNHIN= 0
##$TUNHOUT= 0
##$TUNXOUT= 0
##$USERA1= <user>
##$USERA2= <user>
##$USERA3= <user>
##$USERA4= <user>
##$USERA5= <user>
##$V9= 5
##$VALIST= <valist>
##$VCLIST= <CCCCCCCCCCCCCCC>
##$VD= 0
##$VDLIST= <DDDDDDDDDDDDDDD>
##$VPLIST= <PPPPPPPPPPPPPPP>
##$VTLIST= <TTTTTTTTTTTTTTT>
##$WBST= 1024
##$WBSW= 4
##$XGAIN= (0..3)
0 0 0 0 
##$XL= 0
##$YL= 0
##$YMAX_a= 92728
##$YMIN_a= -85425
##$ZGOPTNS= <>
##$ZL1= 120
##$ZL2= 120
##$ZL3= 120
##$ZL4= 120
##$ABSF1= 10
##$ABSF2= 0
##$ABSG= 5
##$ABSL= 3
##$ALPHA= 0
##$AQORDER= 0
##$ASSFAC= 0
##$ASSFACI= 0
##$ASSFACX= 0
##$ASSWID= 0
##$AUNMP= <proc_1d>
##$AZFE= 0.1
##$AZFW= 0.1
##$BCFW= 1
##$BC_mod= 2
##$BYTORDP= 1
##$COROFFS= 0
##$CY= -3
##$DATMOD= 1
##$DC= 2
##$DFILT= <>
##$DTYPP= 0
##$F1P= 0
##$F2P= 0
##$FCOR= 0.5
##$FTSIZE= 0
##$FT_mod= 4
##$GAMMA= 1
##$GB= 0.15
##$INTBC= 1
##$INTSCL= 1
##$ISEN= 128
##$LB= 0.25
##$LEV0= 0
##$LPBIN= 0
##$MAXI= 10000
##$MC2= 0
##$MEAN= 0
##$ME_mod= 0
##$MI= 1.114404
##$NCOEF= 0
##$NC_proc= 0
##$NLEV= 6
##$NOISF1= 3.799351
##$NOISF2= 2.8
##$NSP= 1
##$NTH_PI= 0
##$NZP= 0
##$OFFSET= 14.38212
##$PC= 1
##$PHC0= -4139.607
##$PHC1= 20.7923
##$PH_mod= 1
##$PKNL= yes
##$PPARMOD= 0
##$PSCAL= 0
##$PSIGN= 0
##$REVERSE= no
##$SF= 200.129724274929
##$SI= 16384
##$SIGF1= 3
##$SIGF2= 2
##$SINO= 400
##$SIOLD= 16384
##$SREGLST= <1H.CDCl3>
##$SSB= 0
##$STSI= 0
##$STSR= 0
##$SW_p= 3205.1282051282
##$SYMM= 0
##$S_DEV= 0
##$TDeff= 0
##$TDoff= 0
##$TI= <>
##$TILT= no
##$TM1= 0
##$TM2= 0
##$TOPLEV= 0
##$USERP1= <user>
##$USERP2= <user>
##$USERP3= <user>
##$USERP4= <user>
##$USERP5= <user>
##$WDW= 1
##$XDIM= 8192
##$YMAX_p= 0
##$YMIN_p= 0
$$ End of Bruker specific parameters
$$ ---------------------------------
##NTUPLES= NMR FID
##VAR_NAME=  TIME,          FID/REAL,        FID/IMAG
##SYMBOL=    X,             R,               I
##VAR_TYPE=  INDEPENDENT,   DEPENDENT,       DEPENDENT
##VAR_FORM=  AFFN,          ASDF,            ASDF
##VAR_DIM=   8192,          8192,            8192
##UNITS=     SECONDS,       ARBITRARY UNITS, ARBITRARY UNITS
##FACTOR=    0.0002768,     1,               1
##FIRST=     0,             0,               0
##LAST=      2.2672688,     0,               0
##MIN=       0,             -85425,          0
##MAX=       2.2672688,     92728,           0
$$ Real data points
##PAGE= N=1
##DATA TABLE= (X++(R..R)), XYDATA
$$ [...]
109B005N5038p39n2727n3814o703M5364N7036J6034m2204o1786k0845M0932O1147
122C8738K1529l6179n7005k4577K8932N4694L0121k2465n3543l3947J6377N0211
134A2886L7644r532m8339m1927M991M7747M4056j823m4367m4044l330L9282M4890
147C8134Q776l5375m6207j3435L2088M6887J7484k8325m6892k0623K4696M5364
159B2572K2895k0123m2778k5748J4139M0610L0152q467l9837l3954M724L9212
171C397L5721k145l7309l6318q61L4208L6044M646k9722l5926r478K5397L6979
184B4633J4200k2548l8206j7380K0042L8108J9774j7097l6880k1523J3520L4860
196A1503K3319r314l2471k5851M408L0899K8973o00l0364l0958j299K9180L0733
$$ y = [2005, 57043, 56304, 3577, -50237, -56940, -11576, 45460, 61494, 19290, -42496, -63341, -22409, 38738, 60267, 24088, -32917, -57494, -28562, 26132, 56253, 33788, -19755, -53702, -37325, 12886, 50530, 40998, -7341, -49268, -44277, 3470, 47526, 45703, 1336, -42708, -46038, -6756, 38134, 46910, 11535, -34672, -48107, -16019, 30868, 48352, 20027, -26865, -47488, -22792, 22572, 45467, 25344, -17434, -43182, -29043, 11567, 41719, 33252, -6585, -40539, -35815, 3397, 39118, 36973, -336, -36654, -37515, -3307, 32737, 37383, 7661, -28265, -37743, -12346, 24633, 38833, 16285, -21921, -39301, -19259, 18849, 38623, 21526, -15354, -36877, -23357, 11503, 34822, 25508, -6963, -32814, -28406, 2493, 31466, 30866, 502, -30456, -31755, -2575, 28158]
209B8158L268k5982l0050o735K2125L0409J0608j9096l0786j3878J6114L1236
221A5391J6919j3920l1585j8708J2202L0588J9118r462k7880k0340N254K5641
233C218K2767j188k4695k5027j466K3754K6216L555k2386k6609n303K0513K6198
246A9547P156j7629k5237j0076J4073K5335J3402j1657k6064j5666J0224K5961
258I369J6702q386k4842j7529O048K3089J8427l123k1263j9541m6J9615K1197
271A9717K792j8707k2452m568J7857K2641N619j6059k1699p360J3215K1127R819
284B1942j0519k1149j2232Q505K1286J4026o887k1258j5062N561K0384J5477l809
297A6265j8724j5763J335J6764J6734J342j5307j8023l744J4610J8981M995j3706
$$ y = [28158, 31426, 5444, -24606, -31341, -9216, 21193, 31801, 12705, -18081, -31959, -15845, 15391, 32310, 18390, -13195, -31903, -19701, 10887, 30005, 20543, -7337, -27677, -22423, 3218, 25985, 24797, 102, -24925, -26391, -2637, 23579, 27134, 4748, -21861, -27164, -6651, 19547, 26703, 9074, -16163, -26239, -12166, 13169, 26571, 14914, -11150, -26816, -16592, 9369, 26071, 17685, -7157, -24686, -18638, 4451, 22878, 19755, -1508, -21049, -21095, -1480, 19717, 22509, 3802, -18650, -23218, -5361, 17280, 22899, 6840, -14859, -22219, -9004, 12123, 21942, 11423, -9726, -21958, -13453, 7833, 21859, 14972, -6286, -21348, -15787, 4597, 20074, 16265, -2459, -18222, -16887, -123, 16611, 17953, 2646, -15377, -19121, -4511, 14470, 19465, 5759]
310E759j8934o001J2187J8253P279j0033j7597q985P803J7207J0925n810j7255
323e202j2503M498J7167J3264l440j6443j3392K033J4925J3576k8j3115j4253
336a2913k389J1913J5239M239j1187j5989n306J0544J5873O018r303j5201o944
349a5406P488J4514Q259n553j4083r676L799J3888J1034k578j3752j1777J633
362a2210J3276J1861o55j1959j1846r31J0415J2132K924r182j2942m463Q536J3491
376H447N326p973j3266n916O844J2671O639n357j1963p599L722J1429Q716k201
390I519j1175r803J112J1054J0333l00j0620j0372m26R511J0191J665q155j0356
404g822l144P064J0798M444o373j1093n298N751J1063N723m941j0548o144L820
$$ y = [5759, -13175, -19176, -6989, 11264, 18543, 8510, -9087, -18072, -10269, 6938, 17863, 12053, -5202, -17705, -13207, 3960, 17224, 13784, -2659, -16051, -14018, 907, 14483, 14455, 1340, -12913, -15302, -3389, 11850, 16089, 4902, -11087, -16393, -5849, 10024, 16042, 6739, -8462, -15406, -7918, 6596, 14855, 9302, -4781, -14457, -10658, 3230, 14264, 11686, -2066, -13843, -12210, 1066, 12927, 12272, 313, -11533, -12464, -2049, 10083, 13007, 3825, -9117, -13580, -5044, 8447, 13773, 5800, -7466, -13382, -6538, 6133, 12772, 7415, -4548, -12147, -8425, 3004, 11720, 9519, -1656, -11459, -10347, 707, 11040, 10740, 120, -10252, -10678, -1167, 9024, 10689, 2534, -7822, -10966, -3902, 6896, 11340, 4967, -6126, -11424, -5673, 5390, 11113, 6172, -4376, -10520, -6700]
418f700R835O760k381r324p701J251R038Q414k57q884q775l39Q311Q805R95p488
434A560q594j978O375Q690L050n339q910m236M760R127M857m148r088n231L538
449e567Q622N578k611q064n989J476P480O667l58p239p207l81O969P545Q54o562
465A213p467j429N775P374K124m825p308l036M014P294L886l236p546m509K808
480d868P513M835k385p036m958J421O467N541o17o106n907j83N771O247Q09n382
496A162o481j390N079O516J726m494o292k156L600N986L009k750o139l763K309
511d078O269M116j958n921m406J225N754M749q12n465m785K92M797M911O54m324
527A018n490j255M281N646J473l973n341j799L119N294K584k674n489k850K366
$$ y = [-6700, 3135, 9895, 7514, -1810, -9511, -8260, 778, 9192, 8935, 51, -8724, -9063, -752, 8053, 9048, 1560, -7034, -9012, -2637, 6053, 9103, 3764, -5146, -9382, -4622, 4505, 9362, 5214, -3874, -9105, -5567, 3055, 8633, 6022, -2042, -8031, -6555, 925, 7592, 7234, -5, -7212, -7593, -624, 6921, 7775, 1213, -6254, -7683, -1908, 5466, 7590, 2765, -4543, -7579, -3565, 3729, 7615, 4379, -3167, -7676, -4868, 2645, 7480, 5095, -1941, -6899, -5478, 989, 6530, 5913, -193, -6100, -6283, -512, 5735, 6544, 1162, -5319, -6709, -1630, 4886, 6612, 2118, -4174, -6330, -2730, 3256, 6265, 3515, -2624, -6387, -4078, 2191, 6307, 4349, -1572, -5978, -4753, 1001, 5750, 4938, -527, -5312, -5020, -223, 4688, 5342, 1018, -4472, -5727, -1446, 4200, 5673, 1700, -3641, -5440, -2321, 2973, 5557, 2883, -2606, -5456, -3090]
542c090N142L126j567m864l904J029N223M038j108m762l773M22L959M241N28m020
558F20m714o31L844M417J057l051m583j899K878N075J980k969m629j858K122M094
574A753K569j195m377l356J284M550L036j037l831l204J09L621L953J74l886l880
590c717n4L220L643Q15k672m074j344K763M254J282k608l802j541J891L693K122
606C871j520l908k284J493L537K277q48l161k851L07L372L169l82l284k732M2
622b902K533K970O83k464l410p48K567L093Q34j922l007j427J572L274J674j676
638A644l202j462J318K709J813o67k794k291O44K878K129n40k377k077j07K146
654b36K508L31k255k469l29J883K275O91j388k445j167J369K567J244j328k387
$$ y = [-3090, 2052, 5178, 3611, -1253, -5157, -4128, 1095, 5133, 4025, -737, -4510, -4088, -129, 4112, 4640, 620, -4094, -4725, -881, 3536, 4593, 1542, -3041, -4940, -2062, 3013, 4993, 2024, -2605, -4463, -2341, 1753, 4322, 3127, -1250, -4606, -3322, 1228, 4264, 3227, -604, -3808, -3699, -78, 3875, 4049, 163, -3717, -3771, -551, 3092, 3907, 1235, -2839, -4183, -1420, 2834, 4116, 1508, -2294, -3835, -1944, 1749, 3871, 2351, -1557, -3841, -2348, 1189, 3466, 2618, -543, -3394, -3087, 285, 3454, 3072, -212, -2944, -2902, -369, 2601, 3284, 820, -2590, -3338, -771, 2322, 3156, 1234, -1773, -3200, -1628, 1646, 3320, 1644, -1558, -3020, -1702, 1007, 2820, 2153, -641, -2932, -2288, 590, 2719, 2179, -198, -2275, -2382, -236, 2272, 2603, 348, -2121, -2450, -567, 1708, 2399, 1011, -1434, -2601, -1232, 1335, 2579, 1251, -1136]
670a136j239R55K193J532n90k222j796M77K215J753l15j913j773r7J746K033L31
687B154j754k107l56J500J973O30j171k057r19J093K071J001r86j896j099O35
703a288J829J381m42j872j451L59J723J414m3j501j662k03J555J715K61j388j670
720a283m22J084J735P16j032j796q33R14J775R07p04j700j084N67J649J171l48
737A316j571j342K27J497J354q2j382j374j41J269J445L44j155j555m46J067J542
754A013N45q37j511p80P35J574Q60o53j532r51N15J430J050k74j422j226K37J376
772A49J211r7j250j269j01J145J407K37j154j335l45R87J366M34p96j390o48P86
790f63J422O49o65j351p63N20J300Q91l70j306r83L02J240J008j26j184j090J5
$$ y = [-1136, -2375, -1420, 773, 2305, 1715, -507, -2303, -1826, 389, 2142, 1827, -86, -1859, -1956, -210, 1823, 2154, 400, -1707, -2063, -563, 1410, 2040, 869, -1188, -2107, -1014, 1057, 2058, 1072, -824, -1923, -1288, 541, 1922, 1480, -392, -1843, -1484, 239, 1653, 1610, 109, -1553, -1756, -201, 1514, 1775, 387, -1283, -1705, -621, 1114, 1830, 798, -998, -1831, -917, 858, 1765, 1061, -639, -1723, -1156, 493, 1664, 1316, -255, -1597, -1370, 127, 1481, 1399, 17, -1357, -1498, -229, 1216, 1560, 405, -1150, -1596, -529, 1013, 1558, 721, -790, -1570, -835, 739, 1599, 946, -586, -1537, -1022, 408, 1458, 1184, -238, -1464, -1227, 149, 1360, 1263, 13, -1256, -1357, -212, 1195, 1432, 278, -1057, -1402, -415, 951, 1385, 589, -801, -1449, -663, 759, 1408, 743, -608, -1371, -851, 449, 1340, 970, -336, -1319, -1017, 223, 1231, 1105, -79, -1169, -1154]
808a154J109J123Q8r99j118k50R18J161L25p73j225l98P27J158N00o14j130o37
826a189N03J166O78m24j138o64L13J036P66j68j000q96J01R88Q94p7q30q63r8
845i02P69Q88K19p16r94k18O87Q87L11n38q76m13L92R26N08m08q82n53L37Q23
865B47N66j95p42o37O5P62O92l8p34p08rO70P00R0n69p05k06N11P63K33m56o79
887c79l20L05P38M02k95p06m77K65P02M26j46o12n14K4O24N53nn56o27qN53N65
909E12J02m84n91j62M12O23J97l32n70l03K97N67L50k55n89l94K05N87L82q9n64
930i9m17R7M81M11J2m60m91m4M52N08Q8m41m73j34L61N05J42k98m78k06K32N18
952B66K27j74n22l10J73M38M08r7m73m11J06M14L74j3m36l36n0L52M42R8l58m57
$$ y = [-1154, -45, 1078, 1166, 167, -951, -1201, -283, 878, 1203, 430, -795, -1193, -466, 692, 1192, 578, -552, -1189, -686, 480, 1158, 734, -404, -1068, -755, 281, 1047, 879, -121, -1017, -916, 72, 966, 889, 59, -804, -902, -133, 755, 974, 258, -736, -954, -267, 620, 931, 393, -483, -896, -504, 422, 930, 522, -360, -913, -576, 247, 813, 618, -124, -761, -696, 66, 758, 720, -14, -722, -731, -61, 639, 729, 160, -545, -751, -240, 523, 756, 300, -379, -699, -394, 344, 746, 451, -255, -732, -467, 235, 661, 515, -97, -611, -587, 37, 590, 585, 29, -598, -606, -53, 512, 614, 130, -461, -623, -211, 412, 609, 277, -293, -596, -299, 268, 618, 363, -226, -620, -415, 172, 554, 465, -99, -516, -419, 62, 473, 485, 25, -466, -510, -58, 450, 538, 97, -376, -510, -149, 356, 498, 200, -278, -484, -252, 266, 493, 319, -203, -513, -340, 98, 506, 409, -64, -475, -369, 45, 419, 406, -30, -366, -416, -64, 378, 476, 118, -339]
974c39j12L37M46Q6k64m08j76K44M13K14k03m28k21J41L69K90j15l61l09Q1L86
995G1L24r6l55k67K5K93L01N0k02l87j19K26L94J34k28l80j18J90L37J51j59l07
1017a22j83Q9L41J98r3l12k20M5L50K00pk56l15mK82K32P4k40k99n5K12K46J40
1040C03j62l18j56J63L35J77k07k66j20O7K82J70o7k56j74RK67K38l7k47j97m4
1062b40K60K21J2k22k68lK33J90M7j36k08j46Q7L18J58j98k33j02J40K06R0o1
1084A45k10j60L4K86J48n5k27j33rJ52K37L4k19k36L7J96J48Kr9k10o8J42K45
1107A80L5j45j86r9J22J77J52r4k45j16J23J95R8p3j58r5NJ38J74k3j82j52N6
1130a13J03J71pj40j43nJ35R5J5p4j12p3R3J54N9j12j26o0J03P7R2l1j33q4LJ75
$$ y = [-339, -451, -114, 332, 418, 154, -254, -430, -186, 227, 441, 238, -190, -411, -270, 99, 389, 274, -87, -396, -315, 71, 395, 299, -56, -323, -298, -5, 296, 346, 144, -243, -362, -136, 258, 392, 164, -216, -334, -144, 193, 344, 185, -122, -305, -216, 125, 323, 230, -82, -302, -257, 93, 293, 286, 30, -285, -289, -7, 225, 299, 59, -240, -295, -83, 163, 303, 141, -177, -333, -170, 165, 342, 135, -131, -251, -184, 98, 268, 201, -55, -229, -220, 47, 285, 248, 1, -196, -240, 20, 241, 253, 31, -237, -240, -7, 183, 230, 94, -114, -260, -173, 145, 303, 105, -128, -230, -90, 116, 206, 145, -65, -225, -191, 95, 243, 188, -39, -172, -181, -29, 208, 242, 23, -213, -176, 20, 168, 170, 71, -139, -207, -65, 180, 215, 70, -116, -215, -93, 84, 236, 142, -103, -219, -96, 99, 197, 124, -34, -129, -124, 14, 188, 165, -17, -169, -113, -10, 161, 154, 14, -129, -134, 1, 96, 111, 37, -75, -148, -55, 99, 158, 46, -80, -140, -37, 40, 132, 101, -32, -116, -113, 62]
1156F2N0n6j05l2J4L8J25K1q3j38NJ33N2k3o2l6k6M1M5O0j7r5k6nP4M8m2j7m6
1185d1j9Q8O7m7o3k8L1j2O0N2l9p6n8P6L1MMk1j11M1N1R0j4m4p6j3M0O3K2j4j03
1216e9l4Q6N4J8Jj05l2M5J0J27jj26o0QQ5P5l1m3o8l6J02P3rm7j19k5O2P1Q2n1
1246E3j23l3M9J41K1n0j05k2k5J33Q6m0j23q3Q0J07L0j0q0p4m8J51Q8l5p6o0l7
1273h5Q1Q5L2p7j16k2J02R3%o2q6o1N6J60J9q7r1m6P5O9L7j5q6j29P3J34O2m1
1301G4j02l8rR7P6qj04j01M1J03P6l1o9p4J4O2J03k8p3p4J9QQ2N7o9j18j4R3Q1
1330G4j0k9n3l6J3O1O2l6j45KO7K5M8Jq0l1k8J16N4k7p2k5K9J8L7L2p7m3M4L0
1360B1L9m8kn5J1L2K3L7jj31L2L1L7J4m3k3l2M3M8j7j6mp3O2L0J2%j3n1J5K9N0
$$ y = [62, 112, 56, -49, -81, -67, -29, 96, 117, 34, -104, -99, 34, 86, 63, 1, -35, -61, -20, 25, 85, 68, -27, -53, -58, 16, 64, 22, 5, -41, -60, 28, 95, 48, -15, -43, -12, -24, 36, 88, 49, -27, -85, -9, 22, 26, 30, 9, -102, -61, -10, 80, 66, 22, -54, -67, -27, 36, 58, 44, -59, -93, -7, 47, 65, 66, -39, -71, -26, -16, 111, 110, -16, -76, -68, 17, 92, 61, 18, -50, -86, 16, 89, 80, 33, -86, -111, -49, 22, 104, 53, -70, -103, -54, 87, 108, 58, -47, -69, -94, 39, 125, 85, -38, -121, -41, 66, 96, 86, 6, -68, -116, 35, 123, 88, 12, -48, -85, -4, 81, 113, 36, -80, -102, 0, 93, 93, 31, -55, -116, -60, 100, 119, 32, -59, -105, -30, 39, 76, 61, -25, -154, -81, 53, 115, 74, -28, -66, -75, 22, 98, 90, -14, -115, -74, 29, 105, 74, 5, -69, -55, 7, 110, 82, 9, -65, -46, -38, 44, 101, 32, -86, -100, -7, 74, 64, 35, -18, -54, -41, 20, 82, 46, -99, -97, -30, -5, 43, 44, -36, -67, -95, 21, 75, 48, -24, -49, -20, -2, 35, 67, -10, -53, -9, 21, 60, 12, 10, -45, -34, -2, 21, 58, 57, -74, -42, -11, 26, 40, -3, -26, -58, -15, 33, 16, 0, -4, -77, -15, 15, 27, 27, 14, -37, -22, 7, 57]
1392E7k5l6qK0J2lK8l6m0J1L9J7k2j6j3JK0kK4j4m1QL2j6L3ok4j2K1J8Nk1j4o
1426ikOK3qJ1k8J7l5L0j2R%k3M5k5%J4K4l9j1J4J1J4kk3k6rN6k5J3l0QpK7J9j4
1462A3j8MJ1l5K2JMn2L7K0L7l8pJ6kk8J3L1j3om5L8J4J1m5pj1RN5Nol5k3K0K5
1497A5k0M2k7Nj0j4kLJ6k8j1RL2Ok2Kj8J4K6l4M4j5k1jLJ9j6nJ0M0l9K4l5j8J9
1532grL6j2Lj1L6m3K8Rj2k8j6K6K6l8J2J3J0j7m0L3K%rJ8l7J8K6%k1MRRj4J2r
1568GNpj4N7l1nl2oK6J6J2k0j4%kONK9j5j6%rK5J7l0J4j8Onm3P0l2Qk5J1M4Lk3
1606A4j9PJ6qOk7J1J4K7j4n9M1K7k8MJ6Rn1PJ0k2M3l1qNnJ0l1L9J9nn1K1QJ5k
1642Hj1l1L1K9n5J3JK8MqJ0R%j7nj1J6K7l2J2K1l1j8rj0M0j3J1j1jnJ7l2J6Qn
$$ y = [57, 32, -4, -12, 8, 20, 17, 45, 9, -31, -20, 19, 36, 14, -2, -15, -14, 6, 4, 28, 14, -27, -19, 13, -3, 30, 24, 0, -12, 9, 27, 32, 11, -3, -9, -11, -5, 18, 10, 21, -7, 10, -25, 5, -7, 2, 2, -21, 24, -1, -1, 13, 37, -2, -13, 1, 12, 26, 24, 1, -25, -34, 22, -3, 10, -20, -12, -19, 8, 27, 13, -5, -1, 10, -25, -3, -2, 2, -50, -13, 7, 44, 6, -1, 15, 13, -15, -2, 29, 16, 10, -35, 3, 17, 28, -17, -24, -35, -26, 29, 34, 28, -7, -30, -10, 15, -5, 37, 10, 15, 5, -9, -11, -8, 8, -20, -31, -22, 10, 16, -6, -4, -22, -8, 18, -16, 28, 13, -8, -9, -6, 13, -3, -8, 2, 42, 3, 27, -8, -26, -7, -16, 20, 8, 11, 0, 36, -7, 21, 30, 18, -10, -26, 0, 26, -12, 0, 13, 23, 6, -34, -1, 1, 1, -8, 10, -27, -9, 17, 17, -4, 0, 9, 18, 4, 16, 7, 12, 5, -9, 48, 17, 12, -20, -26, 0, 16, 28, 8, -6, -6, -8, -2, 3, 32, 17, 1, 1, -8, 17, 34, 4, 18, 0, 6, 1, -42, 28, -4, 4, -21, -10, 34, 37, 14, -5, 2, 18, 10, 16, -11, 0, 14, 41, 27, -32, 9, 36, 8, 12, 28, 37, -14, -7, 3, -19, 24, -7, -15, -10, -15, -5, -36, 3, 22, 17, -34, -13, -5, 10, 8, -3, -34, -3, 26, -29, -16, -15, 13, 17, 9, 19, 28, 28, 11, 6, -5, 11, 38, 6, 18, 39, 8, -10, -19, -29, 11, -2, 9, -2, -3, -8, 9, -23, -7, 1, -4]
1678dJ2j5jJ8NJ2mk1J9rmP%Qj6m4M9J1pk3J7J2o2M1j0mJ6l2K2L1l1J6pPj0j7L
1715a5l0N0j2J5K4n4K0Rk1QPJ9Kj0l3PJ3J0l4J3L1j3%k4L8Oj0j0l8L2J9k5J0%
1749DoNk4NQKNlJ5k2K7k8%k3L4J9rm9L8K7j4m9M8K4m8j6kM4J4J4o6qK7L2l3J7
1785Ikkrj6J6oK6l6K3m6L1L9k1m4L6%j4J%J3k8J8%nJ7rj2J3J2J1k2PNJ7%n2L3
1822CK4k6k0L8KK8l9m0K5kL3k9%l5M1JqMJ6rk0j1k3O5j2n6L6K5j4ooPJ5j6j0L2
1858A3j5K8m9J2N0l2K0om6J5N0j1j6mL3m5Nj7jM0ol4j6M7J0k4k3j5L6Nj9j6J7
1891a4K9j1n5M5J1kk2OoM7J7m1j7J2rL8m1K7J8j8k6NJ4j7mJ1J3Ql0pk9M6J9j7
1925@j5J1K8j2k9k3N1l6K8k7ML1Ll3mK4J9Mm1K5kK5k7JnJ1%kRj8M0n0k1L1L3Q
$$ y = [-4, 8, -7, -8, 10, 15, 27, 23, 2, 21, 12, 8, 15, 15, 23, 7, -37, 12, 23, 16, -7, 10, 22, -40, 1, -9, -13, 3, -29, -7, 24, -7, 9, 2, 9, -1, -18, -15, -45, 5, -7, 8, 32, -22, -2, 7, -14, -6, 1, 20, 22, 12, -21, -14, -1, 9, -25, -12, 19, 6, 6, -18, 20, 26, 16, 6, -32, 0, 19, -6, 4, 4, -2, 3, -21, -16, -8, -6, -1, -4, 11, -11, 16, -12, -12, -35, -1, 18, 9, -40, -2, 25, 11, -38, 10, 34, -14, -30, -32, 12, 26, 40, -26, -34, -7, 25, -8, 9, 7, 5, -4, -20, -4, -10, 16, -20, 3, -43, -12, 27, 6, -38, -2, -2, -16, -15, -15, -2, -30, -12, -12, -17, 0, -9, -21, -8, 4, 15, -7, 0, 5, 22, 22, -30, 3, 27, 1, -19, 19, 21, 49, 10, -30, -5, -7, 26, -3, -3, -38, 3, 4, -4, 0, 16, 7, -13, -24, -47, 18, 6, -50, -14, 11, -3, -9, -15, -8, 7, -9, -19, 13, -2, 26, -23, -11, 39, 7, 27, 21, -25, -10, 40, 29, 13, 9, 42, -3, 2, -15, -16, 24, 18, -16, -32, 15, 25, 1, -22, -37, -1, 4, -15, -31, -14, 15, 4, -51, -6, 5, 3, -19, -13, -19, 28, 45, 4, -13, -1, -10, 28, -13, 14, 32, 14, -12, -7, 7, -10, -14, -3, 10, 18, -12, -19, -48, -2, 17, 0, -15, -4, 24, 12, -17, -40, 11, -25, 3, -24, -20, 11, 14, -19, -23, 1, 20, 24, -17, 8, 6, 31, 4, 5, 0, 11, 11, 9, 18, 0, 40, -10, -31, 0, 33, 41]
1961D1o0J6Rrjj6K8Rl6Nj2L5j6looJ8J2l1J2J1MLk8kJ7j6L1k2MJ3j5J3j9L3J4
1997C0l9%K5qJ1Ll1K2Pj1j0K0ok0j3pL9Nl6pkK4J9j6k5PMJ7J0m2L9j2nk1N9j3
2033A7k7J1NQPk1K5l7O5m6m0J0K4K1l8J3j2J1J1l2K5J2j2J2j4mJoLOl2M3j6%J1
2068Dj8N7n5pL2jQqk9L5K1l5%K5NJk1j9K4k6Mqj3M3l2J8j4J2RQm3nK8J1j8k6N5
2105B2j7k0j7L2Qj5jj1PJ4K3k9lRLl5K9J6Qj1k3L6k3j3K9j5pK4jj6l4M5k7k2J8
2140a7K4j1K7k1l9O6k3Nk1J8pQj7j7oM3k4qOM4qrm2%M2J2n6L8OJ6j3poMJ4ok5
2177a0KL8j0k5J2J9rk7j9M8k4mK1k0K3k1k8KM9kk2K2j1MpK1k8J2M%k3pN0rrk1
2213ik8N2Lj3mJ9Nj5n7L7J2J7l4J0jJ9lk4K2l1M1j8rJK1mKNj6jQj4J0LmjQPjK3
$$ y = [41, -19, -3, 6, -3, -4, -20, 8, 17, -19, -14, -26, 9, -7, -10, -16, -22, -4, 8, -23, -11, 0, 4, 7, -21, -23, -6, -22, 9, -13, -9, 4, -11, 2, -17, 16, 30, -9, -9, 16, 8, 19, 22, -9, 13, 20, 9, -1, 19, 13, -7, -20, -27, 12, 17, -19, -26, -28, -4, 15, -1, -26, -19, -15, 2, 12, -30, 9, -3, -8, -29, 30, 17, -10, 1, 6, 14, 21, 0, 25, -12, 53, 7, -33, -23, 1, 22, -16, -3, -15, -4, 7, -25, 0, 12, 0, 12, -2, -6, -5, -11, -8, -2, -34, 9, -7, -7, 4, -14, 43, -12, -19, 13, 12, 20, 12, -17, 18, 39, 4, 4, 29, 34, 35, 14, -5, 19, -7, -3, -11, -24, 19, -13, 5, -9, 3, 12, 20, -23, -28, 0, 11, -7, -33, 22, 5, -15, -32, 0, 8, -7, -8, -19, -12, 2, 25, -4, -7, 2, 5, -30, -1, 15, 23, 12, -11, 25, 2, -11, 18, 3, -4, 20, 19, 3, -31, 14, -13, -35, -17, 7, -4, 23, 2, -37, 29, 6, 11, -10, 8, 1, 9, -8, -25, -31, 12, -12, -20, -14, 30, 22, 13, -29, -29, 13, 25, -31, 7, 13, 29, 16, 9, 3, 7, 21, 15, -10, -8, 30, 20, -5, 7, 26, 17, -10, -29, 19, -5, -9, 12, -8, 15, -6, -34, -32, 17, 15, -7, 15, 4, 8, 1, 22, -6, 6, 10, 10, -13, -20, 30, 21, 12, -9, -37, 15, 18, 5, 1, 20, 25, 10, -47, -10, 2, 19, -15, -5, -6, 13, 10, -14, 8, -23, 18, 0, -9, -8, 13, 9, 11, 16, 0, -1, 7, -7, 3, 6, 2, 1, 9, 16, 15, 38]
2253C8k7LNLk0J1LJ1j4pJ6j0K0l0rj2K4j8k2K6L5k1J3l9J6L1rl6J8KlJ6qPj3m
2289drK7Qmkj2%K6j1Pk8L1j8kJ1jPj1k6K5k9J3j2mJ0pPJ6k0K0J5k8nJ4Ok4Mk7
2327c7M2qL4nk3QmmKL2j9joj1J2Ol4J7OL3l4K9p2K4jJ7JRk8jJ4k3L4pj3J4por
2366a9K0J9k6K5l3K9J6k7Nj9L4l6jRRq%K2lnNpJ2rk6JK1j9Lj5L6j4k8M0j8J9j7
2403ej1pK8nRll1K7k2RL7k0jproL3j7K4l7pJ0K7j2j7L4j7J7J1k2j8L1k0K0K8o0
2439iNj2LM0k3Mmk2kJ4jjk5L2LqK7j3J1k9J0oK0LRk9L5k7k2J4j8K0J0rNK2k4p
2477dj5NJ4j7J8j3J5Jrj0lN1n9M5n4L9Nk8K1JK0lrPn4J7K4J8l0K4lppK6ok4j5
2514a9K3n3O0Pjk6K9rj2p%K3l2J5%K6l2L1j2rl9J2L3q%%kRl2L9k8j0L8j7J0j9
$$ y = [38, 11, 14, 19, 22, 2, 13, 16, 27, 13, 6, 22, 12, 32, 2, -7, -19, 5, -13, -35, -9, 26, 5, 18, -21, -5, 26, 17, -19, -1, 1, -2, 14, 6, 13, 0, -4, -13, 14, 22, 18, 16, 4, 4, 30, 19, 26, -2, 29, 11, 9, 20, 19, 26, 15, -11, 14, -15, -2, -14, -18, -8, -15, -8, 8, -12, 8, 23, -5, -10, 4, 10, -14, -10, -37, 5, -3, 31, 26, 3, 11, 7, 3, 5, 37, 18, 17, 11, 0, 12, 18, -16, 1, 7, 40, 6, 35, -37, -13, -14, 3, 4, 13, -15, -16, -2, -25, 9, 2, -11, 3, -4, -10, -19, 1, 20, -6, 19, -14, 15, 31, 4, 9, -10, 24, -12, -13, -4, 5, -3, -3, 19, 16, 11, 16, 9, 21, 12, -14, -13, 8, -11, -8, -23, 13, -1, -29, 11, -7, 12, -5, -16, -23, 5, 0, 9, 6, -25, 2, -20, -11, 26, 6, 5, -2, -11, -17, 16, -1, 23, -14, -21, -11, 16, 4, -13, 21, 4, 21, 32, 10, -8, 23, 3, 23, 51, -9, -4, -16, -13, 27, 4, 8, 4, -18, -20, -6, -7, -8, -33, -1, 2, -6, 21, 8, 19, -10, 0, -6, 14, 17, 26, -3, 32, 5, -17, -3, -21, -1, 9, 0, 5, 27, 3, -4, -19, -14, 0, -17, 1, -12, 3, 4, -5, -15, -18, 33, -26, 19, -35, 4, 9, -19, 2, 3, 23, 20, 11, 18, -36, -19, 5, 23, -7, 17, 14, 7, 0, 26, 20, -4, -19, 4, -49, 11, 18, 17, -9, 20, 11, -1, -8, -8, 15, -17, -2, -2, 24, -8, 23, 11, 2, -37, -25, 8, 0, 0, 0, -2, 7, -25, 14, -14, -24, 14, -3, 7, -12]
2550a2L6l2mJ6OMj3J2Nj0J4k0Nkj9J0K9l3KLK3k9PooL9rj6LRQk6M5n0Ok0J9jJ9
2589A2J6rl6K3Lj6L9k3J9lk1LJ8pk2oJ6jj6KJ7lj2J3k3K0j9k4M2J9rj2RlqQPj4
2627arL5k7k3K4KNj6Pk4L3nlJ1pkj5kK3jNk5NRpqJ1J4Jj6k0K6j9J7J7l1M1k4k0
2666a9J2PK4k5nLL7l7K0j2J3pnL4n6L5Ro5N1Ll6J6J9kj1J3Oj8JOk1j5LK6JJ9l4
2703a0lj6M8l7J7nK6l3jQj6%L1J2mj2l0L1l8L5J0Jj4L8j9Nj5j8J8Mm6L2j8oL4
2738INMlKNj8j4J4l0LJ8%jK8kj7j0jJ0J4pNJ2j8j1M0m1K5NpPl4Oj7K7rl0J6J%
2778a4J6K2qj4j7L0k9J4k1j0L8Oj8J9nj1J1nK3m2J7j4OJ3J4l2qJ7j0J4LJK1j6
2812A1m5L0K3Ll4K9m2J0J0j9k0N5Jmj0K1k8%qJ6Rj7k0L2Rj6jjJ3J1j6K0j8J3p
$$ y = [-12, 24, -8, -12, 4, 10, 14, 1, 13, 18, 8, 22, 2, 7, 5, -14, -4, 25, -8, -6, -3, 20, -9, -2, -8, -14, 25, 16, 0, 3, 12, 20, -6, 39, -11, -5, -25, -6, -7, 12, 28, 19, -17, 6, 9, -7, 32, 9, 28, 25, 4, 7, 25, 18, -4, -10, 6, 5, -11, -9, 8, 5, -7, 6, -17, 3, -16, -40, 2, 21, 12, 0, 9, 6, -2, 6, 13, -1, -10, 25, -2, -25, -1, 1, 6, -10, -3, -27, 6, 1, -2, 9, 2, 0, -15, -17, 6, 5, 10, -15, -10, -1, -8, -16, -5, 9, 10, -6, -26, 0, -19, -2, 15, -16, 25, 1, -19, -7, 0, 24, -1, -6, -3, 34, -3, 17, 5, 18, 11, 6, 40, -16, 19, 28, -37, 14, 17, -19, -3, 16, 14, 3, 16, 22, 4, 5, 11, -10, -25, -22, 4, 5, 24, -10, -13, -29, 19, -18, -1, -6, 20, -13, -14, -6, -22, -22, 9, 21, 17, 5, -25, 6, -32, 3, 13, 14, 0, 38, 19, 24, 9, -9, 9, 13, -33, -1, -19, -25, 9, 14, 18, 15, 17, 22, 4, -10, 4, -26, -23, -5, -5, -6, 22, 20, 3, -7, -8, 2, 16, 9, 14, 26, 8, -3, 37, -4, 21, 26, 19, 26, -8, -2, -19, 8, -1, -31, -15, -14, -14, 2, 24, 16, 2, -15, 15, -14, 0, -21, -31, 7, 13, -5, 14, 9, -2, 9, 4, 27, -15, 2, -12, -6, 7, 21, -11, -19, -2, -12, 2, 5, 6, 27, 11, -34, -4, 19, 22, -12, 17, -25, -15, -5, -24, -44, 11, 12, 8, -2, 19, -9, -9, -17, -1, 8, -9, -29, 3, 12, -4, -5, -6, 7, 18, 2, 22, 4, 17, 10]
2847A0rj8PL7k1Lk3L1rrkqK2k8K1Lqj3J1%j8N5m9J6k5J1J6jk0K1Jk8K8k6L4JM
2884A7j6j8K8l4j3J4POmM4k1K6m6L2kl5L4J2k7Mj3j2MJ0k2j5N8k7K5k5K2J3k0
2917FkLl0K5P%j8J2ooj3L0Kj7LRPjj3PRj5K6m4K0J4l1L1j1j8J4MJ%k7K1pMkpk1
2958c4K2KQoMpK7K9l6oKk6%L1kk7L1J6j8Pk0M2o1L5Jk3J6j3qK1LJ6n3M0qrj6M6
2996B6k0qK0m1L8n3MRL7l4L9Kj7j2Qj3K4Nl9OK7J1Mom8K1L5j9l5O1l7J3k7K8K5
3031C4l1J1lnPrk4RJ4k8L7ko2K5L4l4K7MJ5Jj7MK4m6K9K2l6KoL1l9K4k%Omk7M1
3069B6j7l1L6Jk6L6j5Mj5J1j6K3k4J1klJ3jl0J2K0k9J9j2%K2n0J6K5qQK0l3QJ0
3104ILJ2nJ3j9j3j3QNJ3MKl2jj5k5K1M9Jl4LmJ1JrK4j4L6n7LK4krMNK6m2K1Km
$$ y = [10, 1, -17, -10, 27, 6, 9, -14, 17, 8, -1, -3, -11, 11, -17, 4, 7, -1, -14, -3, -3, -21, 34, -15, 1, -24, -13, 3, 2, -18, 3, 4, -24, 4, -22, 12, 13, 17, 1, -17, 11, -23, -36, -22, -15, -9, -13, 31, 10, 36, -10, 22, 20, -15, 19, 31, 4, 8, -5, -17, -13, -3, -25, -40, 18, -9, 16, -9, 13, 26, 6, 4, 7, -23, 2, 9, 9, -9, 3, -3, -9, -22, 8, 10, -7, -4, 5, 12, 11, -2, 5, 14, -1, 25, -19, 1, 15, -16, 15, 4, -14, 0, 4, 5, 5, -22, -1, -8, -4, -6, -13, -34, -12, -10, -2, -8, -4, -11, 16, 45, 9, 3, 5, -21, -21, 10, 8, -19, 12, 28, 10, 17, -3, 39, -22, 13, 14, -9, 7, -6, -14, 7, 10, 26, -27, 13, 5, -4, -20, 26, 6, -2, 18, -23, 15, -38, -34, -25, 12, -22, 17, 19, 2, -10, -2, -15, 9, 14, -25, -19, 8, 19, 23, 17, -31, -10, 25, 6, -29, 32, -5, 8, -19, 9, 34, 3, 14, 11, 6, 13, 4, -20, -11, 3, -25, 12, 10, -52, -27, 7, -27, 0, 4, 19, 20, 3, 7, 31, -15, 14, 36, 0, 2, -4, 27, -12, 12, 10, 10, 16, 12, -15, 26, 9, -22, 14, 15, -11, 25, 10, 14, -1, 10, -6, 17, -7, 4, 2, -1, 12, 11, -19, -7, 13, -16, 3, -9, -9, 13, -37, -21, 4, -4, 4, 24, -9, -1, 9, 12, 24, 19, 32, 13, 0, -13, -5, 0, 13, 17, 19, -13, -14, -29, -54, -33, 16, 17, -17, -14, -18, -7, -6, -15, 9, -5, 31, -26, -23, 1, -1, -10, -6, -1, 25, -17, 4, 6, 2]
3144BlJ2k0N%KpK1j9J3rOj4%K6m8mN3j4KrRrk0J8J4l1M2l9K2K3m4K4K2l3oJ6Q
3182A1J4Kj0K9l4%krRjJ5j3mqL4l4K5k4Rj4mK5l3L4n0L0l6L9NK6l8njkpj2L8O
3220A0Kj0J0loJ5pRkj9j0J2K3j7JK7m2ML0mj0MRj6jl3J1L7l7J9k4L4lk9oN9l5
3257BNkollJ7m1K0OJM1k7k9J4J1nLMJ3j6J8Rl4J4Kj3Rk8M9n3Qj0K8J4j3j1J0K2
3295B6o5NK4k1%K8ljLJ1qNjj2K9k1J2lJ6j5k1Ok1L9j6mOlRJ%j3MJ4j4rJojJ6J
3336bMPl0K4mLk1K4J8l9K2p%j4J1lL7l0J0l8L7j2L1k0k2K1L4k0JmLj7oRJ0l7J3
3373grkQ%NKJ5k2J1Qj0K7l9qL0pJ4rMk5prL9MKk3L6pl1OrJ9J6k6RJ7kk0k2K2K
3414Bnj2J0pMK2Mj6j8J8LQjNn7L0k2M3j7J2mkJ6k2OJ2j3oJ3J6rL5l8l0O1l4Pl
$$ y = [2, -1, 11, -9, -4, -4, -2, -9, 12, -7, 6, -3, 3, -11, -11, 15, -33, -37, 16, 2, 4, -5, 4, -5, -25, -7, 7, -24, 18, -21, 1, 24, -20, 4, 26, -7, -13, 3, 11, 25, 27, 17, 46, 12, 12, 10, 1, 10, 9, 24, 11, 7, -1, 33, -1, 24, 0, 9, -5, -9, 16, -17, 17, -33, -3, -39, 0, 5, 31, -7, -12, -13, -15, -22, -34, 4, 10, 12, 2, 12, 9, 3, 18, 11, 20, 18, -1, -11, 1, 24, 7, 8, 35, -7, -3, 27, 23, 13, 17, 26, 10, 9, -24, -13, 24, -13, 6, -18, 16, 13, -16, -22, 37, 2, 7, 5, -1, -4, -7, 10, -31, -11, -5, -4, 37, 10, -19, -5, 6, 1, 4, 8, 21, 5, 23, 32, -2, 12, 14, 1, 10, -18, 31, -22, -14, -24, 4, 18, 5, -6, 4, 26, -39, -34, -10, -31, -31, -3, -6, -7, -4, 7, -1, 4, 3, -9, 20, -1, 11, 8, 24, 9, -12, -6, -27, 12, -4, -8, -2, -5, 4, 5, 5, -8, -4, 10, -4, -13, -12, -18, -19, -3, -2, 2, 9, -21, 3, -1, 2, -19, 5, 23, -16, 6, -1, -1, -15, -4, -7, 30, 0, 10, -28, 9, -3, 28, 8, -14, 7, 41, 21, 22, 18, 21, 4, -2, 7, 17, -20, -7, -16, -18, -10, -10, -5, -3, 12, -10, 1, 9, -1, 26, -13, -21, 9, 2, 16, 7, 11, -14, -21, -30, 9, 13, 15, -8, 28, 21, -10, -4, -13, 6, 22, -4, 5, 22, 20, 0, -22, 0, 2, -3, -15, -5, -12, -8, 14, 18, 2, -16, 2, 5, 13, 12, 17, -40, -10, -32, 11, -6, 6, 2, 0, 16, -6, 0, 12, -1, -7, 6, 22, 13, 48, 10, -20, 41, 7, 14, 11]
3452A1Rk3kjJ1j2rMlJ8MjkJ0l1Pj3M8ok3J4j1pNJ6j7J7lk7J5j5jK7rJkJ1j0j3
3491a3L5lj8J2joMk2Rj2K8k6PnknQPk8N1l9K4J2k1L4l1qnK2J4l3L1m0J8L7k5r
3528A%KNmoL6m3J0j6K6k1J9rk5K5l4L3JQJ4l7K1j7qlN7n0j0K4plj6K0mJ5J5Nq
3566A6J9k2PpJkj5nL3k1J7rj0K7j2k6qK6k2J2Qk3K8k0JPPj1J8j7J5j8Qmn3N2N
3603Bj5K5jj1K7J2n1K4LJ1JJ6j3j4oNj4Ok0K6rOj4J1m3L0%J5J2J4k5rl9K2K3j3
3639fK8j0j3mL1rj7J1kk3N1m4J7J9j9k0KN2k8oNj0qK0nj6j0M4l2j1JJ1jj7N1n4
3675b2j4J1L0j0nRj2J5%j1jK3j4K0k0Lj9J0J6l2L0K8l0K8k8J2j3k4L6k2J7KJ5
3708B8k8J6Ql5nJ3j4K1K5j6l2PqK3J4k0j4lL6J3n6QJ7kK1j8J1L2o6M1nj2J8lK
$$ y = [11, 20, -3, -5, -6, 5, -7, -16, -12, -15, 3, 7, 6, 4, 14, -17, -10, -23, 25, 19, -4, 10, -1, -8, -3, 13, -4, 13, 10, -17, -2, -17, -18, 9, 0, 1, -1, 10, 0, -13, 22, 19, 1, 13, 12, 6, 10, -12, -3, -15, 13, -13, -6, -11, -13, -18, -10, -3, -31, 20, -19, 5, 17, -4, 30, -1, -9, -14, 8, 22, -11, 20, -20, -2, 35, 10, 1, 1, 3, 8, 4, -2, 34, -9, 1, -15, 11, -10, 9, 0, -25, 0, -34, -1, 0, 8, 22, -15, 6, -11, -19, -22, 35, -15, -25, -1, -8, -11, -27, -7, -11, 4, 19, 24, 16, 35, 13, 20, 13, 14, 12, -3, -8, 25, 4, 21, 12, 2, 29, 17, -9, -17, 9, -13, -1, 7, -16, 12, -8, -7, 0, 7, -4, 14, -3, 12, -6, 2, -2, -55, -3, 2, -13, 12, 11, 0, 27, 39, -12, 12, 15, 26, 27, 43, 30, 16, 10, 15, 1, 7, -13, 13, 4, 10, -4, 7, -36, -6, -6, 9, 21, 35, 10, 1, -38, -16, 7, -6, 22, 12, -1, -5, 26, 17, 0, 11, 9, -14, 37, -7, 10, 29, 10, -10, -8, 44, 16, 10, 15, 5, -3, 17, 12, -4, -14, 30, -2, -13, -12, -1, -2, -19, 32, -22, -36, -25, 5, -5, -10, -1, -13, 2, 2, -9, -10, 13, -1, 19, -1, 2, -17, -7, 9, -23, 7, 35, 5, 33, 5, 17, 4, -20, 16, -6, 11, 13, 28, 0, 16, 24, -11, -16, -3, -17, 4, 29, 13, -19, -12, -20, 3, 17, -3, -17, -20, 16, 29, -27, -19, -2, -4, 17, -1, 10, 42, -24, 17, 12, 0, 18, 15, 17]
3743A7moj6lK4k5K5l5M2l2j4M2qj4rJ8j6j0J7K1mj4J0l7L6j1j8K9nj1J9ol7L1
3777dj0L5j6J8k5Olk4L3j0L8m9J9lJJ3l3J5K1k2J4l7jL0mkKk2j4K4J7j2njNL7
3813C1j3rj3Oj0qqM4l2N4m0j3%K7k2mj0K7J7l6KPLK3l1NoK8j1j5%J5j3J9k3Kk
3850iLJ6k4L1j7j0j9J5M0k3pJ1l1K1M3m7J6KJJ0lk2Nj5j2K0J7Jk1j4K2J6k4J1
3884CrkNj8j5K3j3K5j5J3Rk1M0j1j8J1%k2K8pK6k8RNk8J4JOJj2K1nK8m2Nj6J4
3921EPPRj1Ml1nJ5j5nJ5KmoRkk1RLM3k9j1NMJ7m9M7j7nPLqORRQLk7K4m1J1K7m
3964A7j8J5%j4J8j0pl3K9oMNj0K8j1L3j4j1l7OLj1J9k3%K4K2j4l2J7qK8j6j5L0
3999HJj4MOLPK1j8%R%m4J4lL0m3J8oj2J4J2k%j3k5K2KL1rnj1k0J6OJ4o5P1j7k
$$ y = [17, 13, 7, -9, -12, 12, -13, 12, -23, 19, -13, -27, 15, 7, -7, -16, 2, -14, -24, -7, 14, 10, -4, 6, -31, 5, -6, -24, 5, 0, -11, 8, 2, -35, -4, -14, 21, 5, 23, -2, 4, 1, -23, 10, 0, 38, -11, 8, 5, 6, 19, -14, 1, 22, 0, 14, -23, -24, 6, 2, 0, 2, -20, -34, -10, 7, -5, -10, -11, -6, 31, 18, 9, -4, 2, -8, -16, -24, 20, -12, 42, 2, -11, -11, 16, -6, -10, -20, 7, 24, -12, -10, -3, 0, 23, -8, -3, -9, 19, 8, -7, -7, 8, -5, 14, -9, -7, -9, -6, 10, -14, 17, 0, -10, -29, -14, 26, 3, -4, 7, -24, -3, 40, -7, 9, 11, 12, 22, 19, -3, 2, -13, -25, -5, 12, 13, -8, -22, 0, 16, -8, 3, -6, -8, -3, -21, -36, -13, -26, -1, -16, -3, 6, -15, 25, 14, -4, 7, 7, -15, 13, 6, 32, 4, 13, 18, -10, 4, 5, 11, 12, 0, 21, 16, 44, 2, 7, -9, 5, 12, 19, 28, 17, 21, -10, -15, 0, -15, -20, -5, -3, -7, -13, -4, -6, -27, -18, -15, 28, -1, -12, -7, -3, 14, -35, 12, -5, -10, -3, 0, -8, -2, 7, 16, 24, 27, 0, 24, -17, -6, 21, 17, -1, 14, 14, 0, 18, 8, 1, -32, -3, -9, -5, 0, -10, 18, 7, 40, 26, 15, -22, -16, -13, -24, -5, -28, -28, -4, 18, 4, -28, -11, -19, 9, -7, -22, 8, 9, -5, -1, 5, 8, 15, 36, 18, 18, 27, 27, -17, -3, -6, 24, -19, -1, -7, -19, -5, 7, 5, 5, -8, -33, -11, -9, 22, 13, 8, -3, -23, -7, -1, 13, -52, 19, 2, 0]
4038@K4j7J1k5KJ7j3jL0j2j1J1l4K7lj7K3j6Mjj3RkK8k6J5J1k5K1k0j9J8J4%J2
4073B2jl1J4k5L7J4l8J2LoqJ6J5j9mJ4J7m6K0NpKORk6jM9l0l8J6K0ll1J7JRll6
4111c5M5mj6P%j9KK4J0pNj8J5j7K9j1j0j1kPK0Qk7J7J1mm1J2mL5m4K9k4J1K7k0
4147@j3MJ1jk6LL8k0j3K8j3J3j3J9Ll2Ll8O9k0J9rk5LJ2nLK4j8Pj5RMk7N0rm7
4184b2J9K0k0J2nLJ4n1L4NJ6ol2K2j5QK%nlOj7K7JRl1K2Nl1J2jOkJ1Kj9J5jMk0
4224fjoNkJ4J3k4J4kJ3j8j5J3j3j8M6k5pK4J1j8L9j5l1J6K4j5lj8K5k6OLJ4j0
4259Gj5QJ7l5M4j4j5J2ljk5j7M3Rj9Rj1J5j5JJ0J7n6J7J3mL0l5PJ1rL1k3J2nj1
4295@J8pj2J7Oj4J5k5L4k4J5j8K8m1pK2k4L6j6Kjk3K1mJ0j1Jk5L9oLKlkMN%Kq
$$ y = [0, 24, 7, 18, -7, -5, 12, -1, -2, 28, 16, 5, 16, -18, 9, 6, -11, 12, -4, 0, -1, -14, -5, -7, 21, -5, 10, 21, -4, 17, -3, -22, -4, 10, 10, 22, 21, -10, 4, -21, 16, 30, -8, 4, 7, 1, -7, 9, 24, 5, 1, 15, 32, -14, 6, 11, 4, 6, 12, 21, -5, -6, 43, 13, -25, -9, 11, 8, -23, -6, -5, 4, 1, -35, 10, 6, -10, -3, -3, -22, -20, 4, 14, 7, 12, -6, 9, -8, 21, 10, 0, -11, -13, -6, 14, 22, -5, 12, 23, 19, -22, -10, -14, 21, -23, 6, -18, -7, 20, 0, -13, -9, 2, 1, -25, -22, 16, -4, -17, 11, -2, 11, -2, 17, 20, -12, -9, -47, 22, 2, 21, 12, -13, -10, 2, -3, 0, 24, 6, 13, -2, 7, 11, -16, 34, 25, -22, -3, 17, -3, 9, 4, 7, 21, -30, 4, 9, 25, 19, -13, 9, -6, 2, 4, 4, -1, -4, 2, -15, 12, 13, 22, -9, 13, 18, -13, -1, -2, 4, 2, 13, 15, -4, 11, 10, 14, -6, -7, -13, -8, -10, 4, 17, -7, 7, 5, 18, 0, -15, -2, -15, -33, 13, -12, -19, 5, 16, -2, 37, 22, -9, 7, 31, 16, 13, -5, 20, -6, 0, 3, 17, 7, -8, 0, 17, -18, 26, 12, -3, 9, 6, 5, -20, -37, 6, 15, -4, 5, -6, 9, -6, -5, 5, 22, -34, -17, -4, -8, 22, -13, -6, 5, -4, 27, 4, 16, 11, 0, 18, 11, -1, 16, 22, 8, 23, -2, 32, 8, 23, 5, 33, -8, -15, 7, -17, 19, 3, 5, 4, -19, 2, -2, 8, -3, -2, -27, 12, 6, 9, 11, 8, 6, 10, 15, 15, 17, 9]
4334InJ1Nk4J4m4L3J7j3oNJJ2k5OJ8k5Jj4j7O0m0NL4k9J3m9P7k9j4KNL0j7j2n
4370a0j4K5jmJ1Kl8L7k6L8k7L3j5RLk1J1j0L4n3L4lqJ2j2k3J9mj8LM4m1Nj0Ok
4406a4j8J4K0k3%J9J4Kk2J4j6K5k8K3Mjj1M9l7oL7l2K9l8qK3k2K5l6K7j9K0j9
4439ek2M1nPm0M3k6OK8pk4KrMLK8nj9nJ4Rk5qK2Ok7LL1oj0p%qK1RM%k2l4J0N9
4480C6n1J3JqK7qOmpLk8J1L9j6j3kjNLj3J3l0RK9k7J9M0j9jjk4K6k6J0KNj7J0
4518A1K4n2J1MJ6j3qQJ4rl0J8j1K2j4JK8k4qJ8J3l%k1L9n3J7Oj7J6jrK9Ql5K5
4554B0k0J1nJ6jk4MK3n3L9Ql4L5Jj5L3n5L6j7j0k6L2oJ1Okk2J8j8RMj8L9l2K3
4589A0lnJ5mJ6l9J7RjqmnK0kj6OmK2j4pj2J6j8J6j0K9Ln8K6rL1k0l3N3n2K1L2
$$ y = [9, 4, 15, 20, -4, 10, -34, -1, 16, 3, -3, 2, 3, 15, -10, -4, 14, -11, -10, -24, -41, 19, -21, -16, 18, -11, 2, -47, 30, 1, -13, -11, -6, 24, 7, -5, -10, -24, 1, 0, -4, 7, 9, -29, 8, -18, 20, -7, 26, 11, 20, 23, 2, 13, 3, 37, -16, 18, 15, 7, 19, 7, -16, 3, -1, -19, -16, 28, -13, -8, -18, -12, -14, -32, -18, 2, -21, -21, -2, 12, 14, -8, 6, -10, 15, -13, 10, 14, 13, 2, 51, 14, 8, 45, 13, 42, 4, -4, 19, -3, 22, -14, 13, -6, 14, -5, -27, 14, 9, 16, -24, 19, -7, -1, 27, 20, -4, -2, -11, -7, -4, 24, 19, 0, -5, 9, 18, -7, -15, 7, 13, -14, -11, 20, 14, 4, -3, -3, -11, 10, 19, 23, 23, 1, -33, -23, 36, -15, -2, -1, -9, 18, 10, 16, 12, 5, 8, -20, -9, 30, 14, 1, -1, -2, 3, 6, -7, 6, -24, -15, 14, -13, 6, 46, 27, 26, 25, 1, 27, 1, 11, 13, 18, 1, 11, 35, -17, -6, -2, 14, 1, -7, 1, 15, 6, -24, -6, -17, 5, -9, -8, 20, -4, -12, 6, 19, 16, 16, -5, 34, -19, -2, 4, -13, 3, 2, -7, 22, 30, -5, 20, 0, 11, 6, 22, 21, -3, 1, 24, -29, 10, 18, -16, 19, 20, 5, 38, -17, 19, 2, -8, -34, -2, -8, 3, 9, 7, -15, 3, -15, -6, -2, -20, 19, -13, 10, 7, 2, 17, 13, 29, -10, 7, 16, 15, 7, 3, -2, 18, 16, 0, 6, 2, 24, 10, 3, -9, 7, -11, 5, -5, 24, 27, -31, -5, -14, 17, -3, -36, 17, -35, -14, 18]
4626A8j4j7j8O7l9NlJ0l2L3j8K2J8k3J4loj0Qj9QrmnM9l7J1k5K3NJ3k5kj5J8J0
4662H%Mm5K8K0j9J3k5K5Jk5j3M1j4L9l7kJ3qJ0Jl2M7m4Pj8K5J7noK6l7j3LJ5j3
4698a3K7k1MKjmkJ7l0J3j7K2j6M4j3k1J1rlJ2j0lK2pj4%k0M2j5K1Rl6LKjMJ1k4
4736a4JmJ4k7K3L2m7L2k0Mk3L1j1OK6j6qJ4Jj3QRk8J6j0%J4j5oN0k2j0Rk9L7k4
4772@MJ4rj7L1l6Rj1J3k2LK2K0m0pKJ9j3K5oj1MJ2j6K5l0K9%rk4K9Nk2lJ4PJ1
4809B2j8j7K7j2qkK3QJ2k2J2j7jj3K3j6lM7m7k2L5j0Nl5OJ6J2%j9J2l3K9K4k8
4843a0J9k3J2kLjJ0mkJ5m1J1L5k3kRj7J5j8L2pk1qJ6nJ1Oj7jKK5K6l8nk2L7j9
4880bj9J9MMLJ0n1K0L0l6M7MKj1m5L1K6k3j6K4k1M1l3j7L0j7k2J2Ok9N2l6lK4
$$ y = [18, 4, -13, -31, 36, -3, 2, -1, 9, -23, 10, -8, 14, 32, 9, 23, 20, 14, 4, 12, -7, 1, -8, -12, -17, 32, -5, 6, -19, 4, 9, 22, -3, -5, -20, -2, 8, 8, 12, -33, -5, 15, -4, 9, -16, 9, 10, -15, -28, 13, -1, 38, 1, -1, 12, 4, 14, 15, -17, 30, -14, -7, -25, 0, 17, 12, 6, 32, -5, -18, -15, 0, -13, 14, -7, -3, -1, -2, -6, -8, 9, -21, -8, -25, -3, -19, 25, 12, -9, 2, -7, -10, 2, -8, -11, 11, 4, -10, -10, -30, 12, -3, 18, 27, -9, -6, -4, -5, -1, 10, -14, -13, -17, -3, -30, -7, 25, -22, 10, -10, -6, -29, 2, -9, -3, 23, 7, -1, 13, 14, 1, 9, 18, -10, 6, -4, -4, 10, -5, -11, 39, 17, 7, 16, -13, 24, 0, 4, 18, 9, -8, 23, -13, -4, -15, -2, -24, -21, 1, 21, -19, -26, -24, -5, -18, 7, 1, -10, -6, 6, -10, 15, -15, 14, 14, 5, -19, 10, 15, -7, -10, 4, 11, 22, 4, -13, 14, 2, -6, -8, 15, 23, 35, 13, 25, 8, 7, -6, 17, 1, -2, 45, -2, -24, 11, 1, 6, -29, -23, -7, 5, 5, -14, -2, -35, -6, 18, -10, 9, -14, -2, -4, -1, -2, 8, 4, 2, 17, -24, -13, 22, -1, -3, 6, -11, 4, -14, 18, 11, -10, -18, -2, -7, 4, 10, -7, -8, -6, 19, 45, 7, 2, -20, 17, -2, -21, -2, 2, 6, 9, 19, -32, -12, 18, -18, 29, 33, 35, 24, -21, 10, 36, 13, -3, 21, 0, 41, 8, -9, 21, 4, -18, -6, 0, -29, 23, -13, -16, 8]
4914HJj5J3J0k0Qlj8LK1MOl5L0lNQnn5L3J4lk8K7N%k0RJ3k5L2k7OK8ll3j1M2m3
4953b1mJ4J7l6K3kK7l7K4okNj8kK1K4k9J5k1M9m9J0OlK0qrkL0j9J8k5K5k4j3l
4989ejLjQk2QQJ3j3K4j4k7NJ2Rj8nNMj6RK6j8Rj1K2j3NMoNnQmj2j1L0j3J7jk5
5030gmL4k2j0J7nJ5qNj4K1m9L0m8M0j0K1rpj7K1K0k0oOLj5RK5j6jK2l5M3k1rO
5067EJ9l9QL2nj2%J2qJ0j1MJOj8J5j5oK0m2J0joJ3K4j3%j6MKpmL0j9Pj3PJ0J3
5106A7j4NK4nk0J5j8j7OJ3%rK2oRjk3J6%oOk3J1j0Oj4j6L4l2K4K1j8Mj1K6Nnl2
5144a6M0j1j9rM1k5JPJ0j7nL7j0n3J7%K2Kj5%Lj3K1RqJ8l0Rj0j0J7pj0K8l0RJ4
5181GNj8j1L3Mk1L7k1j9K4qj2j4J4j5L2j6pJ2l2N3k3nkL1m3J9Mk1MmPj4J3J8k9
$$ y = [8, 9, -6, 7, 17, -3, 5, 2, -16, -13, 8, 12, 18, -17, 13, 10, 15, 23, 18, -37, -4, 10, 7, -21, 6, 11, 11, -9, 0, 13, -12, 20, -7, -1, 27, 24, -9, -20, 22, -21, -25, -11, 6, -30, -7, -9, 18, -19, 5, -1, -3, 2, -16, -18, 3, 27, -2, 13, -8, 41, -8, 2, 8, 5, 25, 17, 8, 6, 36, 17, 35, 10, 35, 11, -2, -5, -6, -3, -4, 4, -18, -10, -2, 11, -2, 22, 8, -19, -14, -2, 7, -11, -16, -11, -7, -23, -14, 12, -6, 3, -8, 14, 1, 6, 10, 4, 9, 4, 12, 8, -4, -15, 15, 2, 19, 18, -7, -11, 23, 1, -9, 8, 3, 18, 10, 15, 1, 22, -27, 3, -45, -5, -15, 6, -3, -10, -27, -6, 14, -6, -12, -6, -3, -18, -9, 16, 0, -1, 21, -14, 29, 8, -1, 5, 24, -15, -7, 25, 20, 8, 8, 20, 12, 22, 11, 15, 16, 22, 4, 19, 4, -2, 18, -24, -14, -15, -21, -8, 16, 3, 3, -13, -9, -7, -14, -18, 12, -7, 0, -13, -6, 4, 17, 3, 8, 32, 27, 7, 22, 4, -13, -7, 6, 6, -3, 19, 13, 22, 21, -2, 14, 14, 8, 14, -9, 2, -8, -2, -16, -32, 2, -30, -6, 15, -3, 1, -10, 16, 21, 16, -16, 24, 13, -6, -15, 26, 1, 2, 9, 19, 2, -3, 34, 24, -29, -12, -12, 10, 12, -3, -3, 0, -13, 8, 17, 9, 27, -3, 6, -4, -14, 3, -4, -14, 14, -16, -7, 7, 12, -6, -17, 16, 20, -1, 36, 15, -4, 20, 12, 0, -14, 0, -15, 17, 1, -6, 6, -26, 27, 4, -1, -3, 28, -15, 4, 8, -13, -9, -13, -6, -20, -7, 11, -18]
5217a8j4L3pL2l1QL%j6pK5oL0rj6j9K8LQj2kK0l4njL5qj6k0M2l0j8K2J1K6Jj6
5254B2j7J1j6k7L6J7m9KJ5kLlrL5opLj6Rj0J1mRK%LJKk4OJ1j8J0j6J2J6J0l5N
5293hoLk1OJ6j7RK3Rk1NKorOpnL7k3K4j7K4k5k0RlL1k0K8j1rpj5M9o8K3K9j1j5
5332a1Jj3K0J1j4rQrQkk5N0j6L1m6J4nK0k2RlOKoj1J8J4k5j0M1j1k2MRpj3OL8
5370C0k2nK0l5L3j7J3l0M0k3k5J5oK0j5Rj2kOk4J0j9K2J9NJ6l6J9k2M7l6K0Lm8
5404c0J8N1l9J2J6k2kj1J3m0M5j5RmqMol0K0PJK0j6l7M0Jl1L9Jk2Nj8L1oRKpk7
5442b7K6J1k7J9j0J5oOJ4j1J6l3pMK8l4K0Qk1K6k8J2j9K9om3M4Nqj9J5l7M5J3
5476B0k9LRNj0J9j5qJ5l1J4NmJ7j4K5m1RMpK7k1NL2l8J0j0J3Pk7J7M%k1J0Mk0
$$ y = [-18, -32, 1, -6, 26, -5, 3, 6, 6, -10, -17, 8, 2, 32, 23, 7, -12, 16, 19, 27, 15, 13, 33, -1, -6, -7, 28, 20, 4, -16, 26, -4, -22, 0, 11, 37, 38, 22, 5, 16, 0, -27, 9, 26, -23, -21, -6, -8, -5, -8, -17, 18, 12, 5, 8, -8, 1, -9, 2, -2, 7, 9, 9, 12, 13, 15, -9, -3, 8, -10, 0, -16, -4, 12, 22, -13, -8, -14, -11, -32, -26, -10, -27, -18, 5, 14, -7, -2, 0, -6, -15, -9, -16, -21, 16, -7, 17, 0, 24, -1, -21, -12, -15, 16, -4, 24, 13, 4, -3, -18, 31, -37, -14, 15, 4, -11, -10, -23, -3, 8, -6, -15, -7, -16, -8, -10, -35, 15, -1, 30, -16, -2, -7, 13, -9, 0, -3, 3, 5, -1, -12, 6, 20, -5, -15, 26, 15, -7, -3, 6, -1, -14, -8, 30, 8, 3, 23, -12, 21, 4, 17, -13, 27, 4, -21, -6, -12, 8, -7, 2, -10, -12, -6, -30, -20, -39, -17, 2, 7, 23, -13, 6, -16, 31, -5, 15, 18, -30, -12, 39, 0, 12, 28, 6, 4, -7, 6, -34, 11, -4, 5, 1, -7, -3, -9, -39, -19, -12, -11, 9, -7, -44, -4, -3, -34, 5, 6, -16, -11, -29, 2, -4, 5, 7, 0, -27, -1, 10, -17, 2, -8, 7, 1, 7, 21, 10, 26, -7, -14, -10, 18, -16, 4, 12, -9, 17, -11, 1, -18, 11, 5, -38, 6, 11, 3, -16, -1, -38, 7, 20, -9, -6, 3, 8, -2, 17, 2, -6, 9, -22, -8, -3, -7, 10, -4, 21, -20, -11, -7, -14, 13, -8, -3, 29, -9, 1, -9, 4, 11, -16, 1, 5, 5, -16, -6, -2, -22]
5513b2RK0jj5J0k2OJ8jj8L0lk0M2o1M2NjmklmJ4JLjk5L0op0O7k3M5l7j3J1pnJ5
5552DrlJ6l3j2L8ooJ9j2mJ5jPj8K1ppj9L0rJ6j3j2J4jj2lLK5nl0L1j9J2J0k1j8
5590a9nK9j2K3qk0JJK0J2l5J0OK0k8pK5j3J0k0J6rj0pJ9J0j4J3PJ7l1jmJ1Mj4
5626cLL5l9mj0M7ok2Qqj0%kj0K4l5QK5j6jL9Jo4M7j2Oj1K1lJ3k0K8k0jlM%oK4
5665B7k8j6K0J%J8j4k5J1J5mj3J8j6Qlj8KK8J7n1K2k4J7Jmlj4J8J9l1K2kK5m1
5700a8J2MMJk2M3o1M2Lpj2L1k2J3nj4nrPk0M7Jj8J0Qk4jL2k2j7J8JJK7n3MK6k9
5738b4MK2J3j7PJ8lj6no%K4j6j6mK2kJ8n5K1K9j7J7k8K6k3Rk8L3m1J6K2k8KJJ9
5774fJ1mj1L5j%n4K8NJLk8LL8kj0j0K3j9L9mk4k3K9j7Jnj1KJ9moqkJ0oK1j8J2
$$ y = [-22, -13, 7, 6, -9, 1, -21, -15, 3, 2, -16, 14, 11, -9, 33, -28, 14, 19, 18, 14, 12, 9, 5, 19, 20, 23, 22, -3, 27, 21, -49, 18, -5, 40, 3, -10, 1, -6, -11, 4, -5, -8, 8, -25, -37, 1, -5, -11, 8, -4, -8, 7, 6, 13, -5, 16, 9, 2, -17, 13, 4, 20, 7, -5, 9, 8, -4, -7, -4, 21, 16, -14, 17, -2, 10, 20, -1, -19, -24, 5, -7, 16, 8, -12, -11, -10, 10, 22, -13, -3, 3, 23, -5, -12, 13, 0, 10, -10, 6, -3, -13, -20, -1, 9, -5, 8, 15, 32, 1, 0, -4, 7, 11, -3, 0, 35, -4, -8, -18, 29, 23, 1, 9, 1, -9, -9, -11, -21, 3, -32, -24, 1, -15, -16, 23, 24, -40, 7, -5, 1, -10, 11, 8, 21, 1, 29, 9, 8, 5, 9, 9, 3, 27, -1, -17, 3, 4, 4, 22, 8, -17, -6, 9, 5, -8, 10, -6, 2, -1, -19, -17, 11, 28, -23, -1, -25, -8, -7, -11, -14, -28, -10, 9, -22, 0, -2, 23, -18, -6, -2, 2, 3, -19, 24, -37, 5, 8, 1, -11, 20, -2, 11, 6, -8, -13, -22, -15, -35, 12, 13, -5, 5, 13, -11, -12, 20, -2, -19, -1, 0, 1, 28, -25, -21, 5, -24, -20, 2, 15, -2, 5, 23, 20, 4, -1, -7, -7, 17, 1, -15, -19, 3, 1, 19, -36, -15, 14, -3, 14, -14, 12, -11, -2, -30, 3, -38, -22, 0, -28, -26, -25, -6, 5, 1, -10, 25, 24, 24, -30, -2, 3, 4, 7, -21, -18, 20, 18, 8, -2, 21, 2, 41, 37, 13, -10, 19, 2, 3, -2, -13, -11, 8, 4, -2, -10, -12, -2, -8, 13, -5, 7]
5813GJ7j4jOnm3jM0l6N4j2k3K2rJ3k3MlL5J2l5K2j8j5J0pL0l8J4lJ7j6%qPjLK
5851Dj2j5PRJ4j0k0J5K0m2J6J2K4j7jJk8J7J5j4RMjjjj2LQN2l9nk3J8j7MK5j4
5888EqJ6j3kORk4J4Qj7j0J6J5k8K7l6L8j2Rpm4P1m8K6j0K2j0k2OK1j9m6O1J7l2
5923aPk2J8Lmk4K3rK5k5pj8M0jj9LOLOj4J6k1kMJ6j3pJ6QOl5O7k3k5lL4l2L0m2
5962a6J1qL8mLl0oLOoQK4k8j5M%O%J9j0L6m1j4NK3Kj9L1l9K6j1j9K8kK2n3K6l6
6000c6L5j1L3K0k7j8OrK2m5K1jJ5nqkJ9j7j6M6n3N1m0L3nj9J2j4J2M6k5kk9pK2
6035DMpJ6j1Mk6L5j5K0l8J2KK0Ll2J7%K1j2l3K1k2Rj7M0j5Orj8M8n4L3J0j8K5
6070B3k8J0l0JK6pQj9LpL7j6j5K5k2L7l4k3L3j5L2k6L5j1j7JKK4n0j3P2m4J4l
$$ y = [7, 24, 10, 9, 15, 10, -33, -34, 6, -30, 24, 12, -11, 11, 2, 15, -8, -4, -7, 28, 40, 5, 27, 9, -6, 4, -3, 27, -11, 3, 0, 17, 1, 1, -7, 0, -1, 2, 4, -8, -23, -16, -7, 7, -3, -23, -8, 12, -30, -14, -2, 22, 5, 4, 5, -23, -6, 9, -5, 4, 8, 7, 6, 5, -7, -4, 4, 56, 17, 12, -11, 7, -10, -6, 19, 5, -3, 13, 0, -2, 4, 13, -11, 3, 11, -6, -16, 0, 15, -13, 14, -22, 16, 4, 13, 6, -38, 33, -15, 11, 1, 23, 13, -9, -3, 18, -1, -47, 14, 31, -1, 6, -16, 2, 5, 1, -23, 0, -9, 16, -9, -16, -34, 6, 5, -14, -11, -5, -2, 4, -10, 6, -15, -17, -13, 3, -10, -17, -1, 7, 13, -22, 45, 22, -3, -6, 28, -4, 26, -16, -5, -13, 25, 21, 24, -6, -12, -9, -3, -9, -1, 23, -5, -20, -16, -16, -10, -10, 9, -1, 35, -6, -20, -15, 8, 10, -9, 22, -17, 9, -2, -21, 7, 5, 27, -26, 0, -36, -1, -12, 21, 41, 14, -4, 2, -7, 15, -30, -9, -10, 5, 0, -8, -10, 9, -8, -24, 22, -31, 20, -20, 13, 8, -11, 1, -13, -1, 45, 20, 18, -11, -18, 4, 8, 1, 17, 6, 10, -16, 19, 4, 24, -14, -2, 0, 20, 23, -9, 8, 8, 29, 17, -16, 5, -17, -8, -25, 15, 0, 6, -3, -21, 27, -27, 6, 16, -2, 23, -5, 5, -25, -24, 2, -5, 3, -16, -13, -20, 17, 1, -14, 11, -11, 26, -8, -31, 2, -13, 19, -7, 28, 17, 0, 1, 3, 27, -23, -36, 36, -8, 6, 3]
6104Cj8k5lM1k1lK7pRNk6J0K0k5QpL5k4j0K0Qmj0K3l0J5Mk6K5l0L9k1J7ojnrn
6142gJ0k1J6j5J1MjmJ8J2qm7MN3l2K6k0k1K6%Rj4Jj2J9m1M3k6K4J3j2k8K1L5m9
6177a3K5qQl5L1kl1M9j9j3rK4j1lk6K6O%Pj6j3KPNQk1KJ3NNkJlqK4kj7JL1l3j
6218fMQJ4j9%K8k2k5N1l5Jj2J4j1rQNKokK8j9lNNlk0QlJ2MoLk1J5K3j2J8J1k8
6258EJ5J8m5J7j7K0j6L0m1L2Mom5M7kj0j1J2j4j5L3lm0M4j6pJoL3l3OK3m2K7K1
6293A9pJk0J4J7Mm8L4J%j7j7J6L4k7Nj2K3J4l9mLK0k9OJ7j9J2mJ6k8K1Np%j0O
6330@J6kj7nJ9k9kN6l7MPJ6k2J5pj5K0rk0J3K4l3L0j0j2J6%j5k7LK4l4P2m7j0
6365a8qL0k0Nj4J2mK7J4k7J8rj2K3j6mJ1k9L6oOk2Rk8L3J7j5k1J3nK4l5J9OK8
$$ y = [3, -15, -40, -43, -2, -23, -26, 1, -6, 3, 8, -18, -8, 12, -13, -5, -12, 23, -1, -11, 9, 17, 13, 3, 26, -4, 11, 15, -11, 14, -16, 23, 2, 19, 13, 12, 7, -2, -7, 3, -18, -2, -17, -6, -2, -3, -7, 11, 23, 15, -32, -28, 25, -7, 19, -1, -22, 4, 4, 13, -1, 0, -12, 7, -34, 9, -17, 7, 20, 8, -20, 1, 36, -13, 12, 4, 12, -23, 8, 6, -25, 24, 5, -8, -17, 7, -4, -7, -33, -7, -1, -1, 6, -10, -23, -21, -14, -9, -1, -22, -20, -7, -2, 3, 1, 2, -1, -9, 15, 13, -4, -3, 28, -5, -6, -2, 6, 20, 1, 1, 29, 7, -18, 33, -2, -1, -13, 1, -10, -19, -11, -6, -4, -10, -12, 16, -3, -6, -1, 4, 1, -19, -11, -14, -2, 2, -4, -1, -22, -7, 16, 4, 22, 33, 5, 20, 38, -7, 10, -7, 13, -3, 27, -14, 18, 22, 16, -29, 18, 16, 6, -5, 7, -7, -22, 11, 8, -32, 12, -4, -11, -10, -16, 17, -16, -10, 13, -29, -2, 19, 12, 13, -7, 7, 24, 28, -20, 14, 15, 15, -2, -19, -3, 31, 4, 9, -3, 20, 34, -5, -9, -6, 14, -15, -9, 8, -11, 1, -3, 13, -15, 6, 11, 4, 4, -6, 0, 16, 14, -3, -8, 11, -18, -20, 36, -1, 3, 10, 26, 4, 19, 12, -3, 17, 8, -12, 1, 25, -8, 22, 12, 0, 16, 16, 1, -26, -23, 1, -33, 39, -8, -18, -26, 4, -16, -11, -25, -13, -17, 10, 24, -3, 15, 6, -6, 17, 1, -3, 8, -21, 15, 9, 15, -7, 2, -26, 7, 24, 9, -12, 1, -4, 20, -15, 4, 10, 38]
6400C8kn9NpK4%K8l0j8jJ8K3k5J0lkqQK1l8L0j1j6K2K1k0j2nL4j5qj3K2k4J8j
6436Dqk4M7Jj4Kn1M3mJ9j8nJ5k5K1j2N%k2K2roJ3j0J7k6K0K6rj0J1j0L0j2kj7
6472Bj6K3j5J6K2J0m7Ljk1L0qj0oL6k6j1J6pJpQj1J0J6J7l0rNmJ4joj2j4L8Nm6
6510c6JN1j3Mj0nJ0PNqKJ6mjm3M5j7%Oj2Oj3Pk3MJ3j4K3j4qJJK2mMkqLJ6k6%K5
6552A1k3rM9nl8M3l8J2J2kj7%MRj1qJ8k0L0l4MOoqJ3L%k4J5lJ1K9k8QNl2L4k6
6590a6K1Jk2L1k9Nj8M3rjK2j2Rk0Lj7J6PKj6K2k5K9k8%j7J4kJ9m1K8KpJ1j6J4
6626CJ0j5J1k1K2l6K8nOJ6Mj6j0K2j4k0J4Nk2RPmK5j0rk5L5pMprLnMj7PK3j9K5
6665A2k6J6K3k5J3Nok6nK7kLj7nL5l3Oj4LL0j2MJ2l6QJ9J1m0LJ1mK3l0K1J0l5
$$ y = [38, 36, -23, -18, -25, -1, -1, 27, -3, -21, -22, -4, 19, -6, 4, 1, -1, -9, -1, 20, -18, 12, 1, -15, 7, 28, 8, -4, -9, 25, 10, 2, -11, 11, -13, 5, 4, -4, -28, 19, 20, 6, 8, -43, 0, -4, 15, -3, -8, 7, -18, 3, -9, -4, -4, -26, -4, -13, -19, -6, -16, 1, -25, -5, 21, 12, 2, 13, 3, 33, 21, 19, 2, -14, 9, -6, 10, 32, 42, -5, -2, -3, -24, 6, -2, -12, -18, 18, -8, -19, -3, -10, -9, -16, -8, -19, -9, 7, 24, -6, -15, -10, -14, 0, -1, -7, -19, -33, 5, 10, -36, -35, 16, 3, 7, -3, -8, 2, 9, 14, 6, 8, 24, 20, 19, -24, 21, 4, 4, 10, -2, 4, -9, -2, -25, -21, -8, -22, 1, -13, -21, -20, -19, 3, -1, 3, 1, -7, -4, 12, -14, -14, 11, -12, -21, 28, 23, -15, 28, -10, 2, 14, 12, -5, -5, -1, 8, -3, -11, 7, -13, 17, -17, -13, -7, -13, -21, -8, -5, -5, -29, -14, -17, -6, 23, -5, 3, 8, -24, 10, -16, 5, 6, -16, 15, -14, -9, -27, 16, 7, 6, 28, 16, 25, 5, 8, -9, 7, 14, 16, 0, 22, -3, 26, -2, -2, -19, -5, -7, 12, -29, -1, 1, -6, 5, -11, 3, 13, -2, 9, -12, 10, -26, 2, -3, 3, 19, 23, 7, -3, 19, 5, -15, -1, 4, -18, -9, -2, -6, 19, 9, 0, -25, 10, 3, 7, 0, -9, -6, -11, -7, -24, -17, 6, -13, 12, -14, 2, 25, 0, 13, 18, 12, -14, -19, 8, 6, 9, -8, -13, 22, -11, -5, -19, -16, 14, 2, 6, 18, -18, -10, 9, 20, -20, -17, -6, -10, 13, -17, 4, 14, -21]
6701b1J2J6Km9J5K1j6RpJ9JpJ7nj9qK9J7k4J2j0J5j7JJ3k2K2mk5K9k7J7nmJJJ5
6738A4k3j0L0j7k8K4k3L8lk6JpM5j0ok5L1Ll0K0LJ2j2J9l6J1Ql3O1j4J7k1Pk5
6772emK6mJ1l7j0K7NRql3L7j1rmJ1OLj2K8l9K4l8J0J1j3MLJ3Kl3J2L6k6K9j9O
6809Hj1%j8M3pj8K0k3k3O1j6Pml4LQpM2l0j6mJ1J5k0j1K3mPnJ3j0qRK1m2L8k6
6846hJ1k6L2j9j6J4J0J4l0K0jk0J9k3N4l7JM2n1M2roj5J5l5J6Rj2k0K5%j2jQM
6881emK2m0J8j0PjL5Rl2k9L2J2l4j8N6rLl1J8LpK8j7J9j1J2l5J1j5OJ2j0k5Qo
6917b8L1%Mj8L1k9J0Mkk4K6oK7nj0pqNM4m1Mj1j7K5J8k8pJ0RpQj8%J6nopK9n2
6956c5N0l7K8l7K6qj9J9kOL0Mj9j1RmJ1j2j3N0l9K3j9lrK9k6ML8l1Oj7Pj6LJ0
$$ y = [-21, -9, 7, 9, -40, -25, -4, -20, -11, -18, 1, 2, -5, 12, 7, -12, -20, 9, 26, 2, 14, 4, 19, 2, 3, 16, -6, 16, 12, -13, 16, -11, 6, 1, -3, -2, -1, 14, -9, -19, 11, -6, -34, -10, -33, 5, 2, -24, -23, -30, 15, 5, -1, -26, 5, 8, -22, -2, 1, 13, 1, 20, -16, -5, 3, -30, 31, 17, 34, 13, 20, -5, -9, 17, 13, 24, -13, -23, 4, 9, 18, 10, -23, 14, 3, -6, -10, 1, 7, 10, -2, 26, -13, 11, -27, -17, -6, -19, -15, -12, 1, 3, -30, -18, 18, -8, 21, 2, 8, -3, -3, -21, 22, 15, -3, 17, -6, -29, 32, 16, 23, 19, -15, -12, -4, -11, 31, 1, -15, -19, -8, 7, -13, -24, -1, -5, 2, -3, 10, 0, -8, 1, 22, -20, 18, -8, 3, -23, 9, -10, -26, -12, -2, 12, -18, 2, 1, -19, 0, -23, 31, -6, -5, 37, -14, 28, 19, 13, -2, 13, -22, -6, 3, -9, -29, -4, -4, -16, -17, -9, -5, -9, 13, -27, -9, -19, -12, -13, 22, 31, -1, -30, 2, 14, -20, -38, 18, 9, 12, -19, -1, 2, -5, 23, 6, 25, 14, 26, -9, 2, -13, -7, 5, -5, -30, -22, -28, 3, 3, 7, -11, 20, -9, 1, 5, 3, -21, 5, -1, 26, 21, 11, 4, -4, 1, 45, 4, 8, -3, -20, 5, 23, -5, -12, -2, 7, 0, 8, -10, -10, 6, 1, -5, -12, 17, -35, 15, -22, 6, -31, -5, -13, -32, -13, -15, -9, 21, 25, 6, -5, 4, 0, 11, -1, -14, 36, -3, 20, 1, -2, -11, 18, -8, -4, 34, 3, 9, -8, -1, -17, -14, -4]
6992dJ7J4n0K6j6rJ8j9K8j1j3K2j3J1j9K7K0k4k2KNK0k2J5J7j4j1J3j0J0J4k9
7024gJ2L0l6mJ5nrK8l1Pj8k2L2L4l7J4jJ3k8RJ7l7K8Jk9ML0k9JoPMj9K7OJ2j6
7061cJ5klLpj4M0j5j3lOjJljj8M2k8J9kqk6J9J0nOk7lJ7j0L3j3k5J7j3L9n2M9
7099B1K6m4j9J3K4mk2K6pPJ3k8J5j5J0j6QpJ8ok3K0j9K3k2j0J4klJ2J4m5JJ4J2
7134aJ2j3pJ8k2mM8l2J2mRj0lJJ0POk1J5k7K6NJ1l7Rk5N2l8l0P2q1L5K0j0K1m4
7170b0K4l4mM6l4ML2m0K3K5l3J4Kl4L5%j1J8k4L2k5pJ1JqK6Kj2j9J7K6n2M8p0
7204d1N7k4QrJ5J6j0j3J7j6J8j1Loj2lRj5jQK1k5J5J9nm6K5MQJ2k1K1kJj0L0k6
7241A1KLk6K2Mj8RJ0j3Plk5K9k3J9Pj0j0J7JJ5n6J9rRJKK7n1M1j6QK8k1m9O2q
$$ y = [-4, 13, 27, -23, 3, -13, -22, -4, -23, 5, -6, -19, 3, -10, 1, -18, 9, 29, 5, -17, -15, -10, 10, -12, 3, 20, 6, -5, 8, -2, 8, 22, -7, 5, 35, -1, -5, 10, 5, -4, 24, -7, 0, -18, -40, -8, 26, -11, 3, 2, 15, -13, -4, 13, -24, 4, 5, -24, -20, 10, -19, -18, -24, -17, -13, -32, -5, 1, 13, -3, 12, 10, 7, 10, 3, -11, 29, 14, 1, -2, 4, 3, 4, 1, 0, -18, 24, -4, 15, 13, 5, -21, -2, 8, 3, 9, -18, -21, -4, -14, 19, 6, -19, -2, -15, 24, -28, 21, 47, 3, -16, -3, 21, 17, -5, 21, 14, 21, 34, 6, 21, 6, 16, 0, 8, 1, 19, 13, -10, 10, -9, 14, -8, -18, -4, -6, -9, 3, 17, -28, -27, -13, -1, 11, -2, -9, 9, -13, -17, 31, -1, 11, 7, 16, 6, 3, 4, 14, 21, 27, 6, 21, -6, 20, 25, 36, -1, 8, -17, 35, -3, -33, 39, -42, -7, 13, 3, 24, -20, 4, -30, -34, 12, -22, -18, 14, -26, -3, 22, -11, 3, 5, -29, 6, 6, -5, 13, -11, 21, -4, -11, 0, 1, -7, 19, 21, 9, -10, 7, 33, -19, 29, -41, 16, -8, 0, -9, 6, 22, 12, -1, 16, 0, 18, 7, 10, 4, -8, -11, -2, -17, -18, -10, 11, -14, 1, 20, 15, -31, -6, -2, 6, 18, -3, 18, 16, 17, 7, 37, 11, 13, 16, -10, 12, 16, -2, 7, 17, 4, 11, 8, -17, 12, -11, 8, 15, 5, -5, 12, 13, 28, -28, -9, -18, -9, -8, -6, 21, -30, 11, -5, 3, 31, 10, -39, 23, 15]
7278A5ol3M0j0LK0k2J7n5K9oj9L4LJ0l0Pj1K3Ql9L1k5L3nk7K5j3m5K1J3L3oj9
7312fK4k0jj4J3J1k1J4K0Lk5oNjnK0qOk6L2l3Lj1J2Qj0L0l8L4Kj2k3M0o0M7j3
7348iOpk8N1ok4J8nj7J9j0KL1lk6L8j9k3OJ7%nL5k5k6K0k1lL4o4L9OLj1qPlKK6
7387A7j4lOj9lL5lj7rJ7j2K5j7k2L6l9M4j7qNj0L8j5k2kN4m2KpMk4N3j4mrk1J5
7424bL4l6K7l8qJ6oJ2qK7l0K5ol3L1k4MK6l5K4kJ5Jk6K3L0m0J0k7K6J1krj4J7
7459A3Rl4K8k0l6P0l6%Mk4K1qJ9nqK6j6%J1mPj9j3k5PL1qL0j1j2K9j3j7K5j6q
7495cJ7npk0K8%k1qL1k5K4pk9J3K3pj7K4pj3%k6RN6m3J5jj1nJ0J4j5J6j5QrJ6
7532A0l1L8k3%J9j2Nk7OJ1j3Qj2J8m%J9lj0Pql6K6L3l2MJ6Jl8L1j7J0k2M2j1k1
$$ y = [15, 9, -24, 16, 6, 9, 29, 7, 24, -31, -2, -8, -27, 7, 10, 20, -10, -3, -14, 9, 17, -22, 9, -16, 17, 12, -15, 10, -3, -48, -27, -14, 19, 13, -6, 18, -2, -3, -17, -4, 7, -14, 0, 20, 23, -2, -8, -3, -4, -9, 11, 3, 9, -17, 15, -18, -15, -26, -14, -6, -16, 14, -24, 10, 12, 0, -23, 17, -43, 4, -9, -3, -10, -38, 13, 7, -17, 1, -4, -21, -2, -12, -10, 21, 18, -8, 30, 11, -12, -6, 11, 11, 6, 41, 16, -10, 10, -11, -14, 20, -44, -5, 1, 4, -7, -15, -8, -11, -9, 17, 3, 0, 6, -13, -16, 19, 16, -1, -10, 7, -5, 20, 3, -19, 17, -22, 22, 5, -3, 2, -8, 30, 15, -7, -9, 45, 3, 5, -2, 2, -22, 31, 17, 13, 4, -17, -2, 32, -4, 23, -15, -23, -7, -13, -1, -9, 18, -12, 13, 7, -26, 5, -19, -15, 11, -24, 0, -2, 13, 14, -12, 11, 41, 1, 11, -16, 10, 21, 19, 10, -4, 13, 22, -12, 16, -4, -40, 30, -6, -6, -2, -26, -5, -13, 6, 1, -7, 19, 3, 3, 14, 10, 17, -2, -15, -40, -33, -2, -10, 20, 9, -3, 26, 13, -4, 21, 5, -3, 14, 9, 2, -18, 10, 10, -11, -19, 12, -13, 11, 4, -25, -12, 11, 4, -13, 11, 4, -9, -9, -35, -26, 30, -13, 2, 1, -10, -15, -5, 9, -6, 10, -5, 3, -6, 10, -21, 17, -6, -6, 13, 1, 6, -21, -15, -4, -17, -9, -21, -3, -7, -7, 12, 9, -1, 6, -2, -38, -12, 21, -11, -7, 9, 10, -28, 3, -14, -4, -26, 16, 5, -16]
7568a6MJ3QK4l2jQk6L3ORm9nK2L2m2J9qPMm7L2K0j3j6K5Lon%l8M8Kk3L2k4mJ%
7607ck3K1k2lM2lQqJ1j3j8J6K1kj1j8Rk4M2rjPk1LKj3KMnj2RK2k5J1LklJ5k7K
7647a6J7J3k0K2k7qJ4j2j2K1L1j5j6NJ0k5K8j8j5L2j1Rk2NK8k0j0pL8J0m4Nlj
7681a4J8j6nK2kj1lnQmpK4k9j6K9J1nk6K3j1J2J8noj8K6J%j1%LJ7j2RpK1mj1j6
7720bj2M6m3j5K5j1QmqpK1k8KQJ2Pqk7K7J7Oj9qK6k1K2rjqM0k7j2Rj2K1kj6k0
7758b3P%J2Nk5J9L3j6m5L2Kj5K5j5k2pM3pK2k2j2j5L7Kk6JjJ9j8PkJ5j7J6omk6
7795b7K4J9k1j7Rj7N3k2j4J4k3K9j3K7j6oll2K3J6J0j0mJ6l3pJpJ2k5K7J0kJ2
7829CMOk2L4l0K9j1ppj9M5k1l6J0L5l2qj5M0J1j6K5j2jk3JOlj4L5j7KMk8K5j5
$$ y = [-16, -12, 1, 9, 33, 1, 0, 8, -18, 15, 21, 30, -19, -24, -2, 30, -12, 7, -1, 6, 10, -37, -5, 15, 2, -14, 11, 14, 8, 3, 3, -35, 13, 15, -8, 24, 0, -4, -3, -3, -26, -5, -27, -30, 12, 9, 17, 9, 20, 7, -11, 5, 26, 24, 13, -5, 4, -20, 22, 13, 12, 19, -2, 1, 3, -10, -8, -4, -9, -21, -12, 10, -15, -4, -1, -3, -6, 9, -18, -16, 1, 14, -6, 16, -11, -19, -5, -17, -29, -8, 23, 8, -8, -3, 7, -18, 10, -8, -23, 9, -2, 7, -15, -10, 18, -2, -12, -19, 19, 29, -15, -10, -13, -14, 4, -12, -17, 5, 3, -8, -11, -16, -8, -12, -19, 5, -24, -40, -11, 0, -5, -31, -8, -19, -7, 11, 6, 0, -18, 8, 9, 9, -2, -2, 1, 18, 6, 15, 8, 29, 25, 14, -2, -14, 32, -11, -26, -1, -12, -4, -8, -16, -23, -2, -30, -28, -20, -8, -1, -9, -36, -9, 8, 14, -5, -13, 13, -8, 14, 5, 4, -4, 36, 9, -3, 6, -6, 15, 13, -3, -23, -16, -16, -4, 1, -24, -5, 28, 12, -33, -1, 1, -14, 11, -4, -26, -33, 10, 3, 25, 3, -9, -24, 13, 15, -11, -10, -11, 8, -10, -3, -5, 10, -7, 9, 3, -1, -27, -3, 16, -5, -22, -13, -30, 23, 1, -13, 1, -22, 7, -6, 21, 5, -1, -4, -36, -13, 3, 13, 3, -1, 15, -18, -25, -24, -31, -19, -44, -17, -7, -9, 3, 7, 13, -9, 25, -5, 24, 13, 6, -1, -20, 25, 4, -32, -22, 13, -19, -27, -42, -2, 9, -7, 18, 6, 5, -18, -17, -11, -14, -28, 7, -10, -8, -4, -32, -7, -22]
7865b2Pj7L3j0KK2Nqj5lJ0JKL6l3k6rK4J7k5J4RLj1PjqJ7m0J8K1k5mmJ3l8M0o
7903drj0K6Kol6J4J0J0j5J5PK%k2J9j6K2l8K1RNk2J3J0%Jrkj7pN4l2JK3pmQj8
7942bkj4K1m0K7k6K5L2nj0K9n2nK8J5k8J8Rl0QLK6j7lJ6j7rRJOkJ0rl9K4RMj7
7980gk4L6j6L2k1j4JJ0l2N9j8Pj2k3J2nLrJ7%L8k5J0j9J3k6K2pJ4l4L7j9J3k0
8014gRQl1L9j9oK0nj7Pj5K2j3J2Kj1lPj3J8QJl9M4qj5KLj1M2k1j1%l0M3j1L7m0
8052blj4K6Kl9K9Jj8L0k9K0j5jk6M8Ql9K2jK3j7m1L7oqK4m0M1j5J7k5KjJ0JK0
8088B1kj7L1j4kPk4J7Ll8J7J9k5M0n1J0kMmj0MQnJ1ol7Q5n0j6K2J0Kj5j4K4LJ1
8125A7pOj1mJ6mj7qJ4jj9OJ4nL7k3j3j8J3J7oMj6Mj5L%K8Ol6K1j4J8Jk7J8j0M
$$ y = [-22, -15, -32, 1, -9, -7, 15, 20, 12, -3, -6, 4, 5, 7, 43, 10, -16, -25, -1, 16, -9, 5, 14, 17, 6, 13, 12, 4, 21, -19, -1, 20, -5, -9, -13, 0, -38, 2, -4, -13, -23, 3, 5, -1, -37, -23, -13, -3, -18, -3, 4, 6, 6, -16, 3, -13, 9, -29, -8, 1, 6, -16, -3, 7, 7, 8, -1, -3, -20, -27, 27, -5, -4, 19, 12, 8, 16, -2, -4, -18, 3, -37, -10, -36, -11, 21, 16, 6, 35, -17, -22, 6, 21, -7, 11, 20, -10, -2, 1, 27, 10, 7, 23, 6, -3, 6, 7, 13, 11, 21, 12, -27, -3, 6, 10, -7, -31, 5, -11, 21, 0, -14, -13, -3, -35, 24, 6, 13, 1, -22, -10, -15, -12, -21, -4, -4, 34, 9, 19, 0, 13, -13, 9, 2, 16, -18, 19, 0, 13, -7, 2, 10, -21, 18, -1, -7, 13, 8, -9, -2, -17, 5, -8, 4, 6, -5, -8, -1, -14, 4, 12, 13, -26, 18, 10, -5, -3, 0, -11, 31, 10, -1, -1, -31, 12, 1, 38, -2, -5, -19, 7, 9, -30, -1, 0, -18, 12, -17, 3, -12, -13, -39, 9, 17, -22, 0, -1, 22, 5, -36, 1, -5, -13, 11, -29, 12, -3, 14, -11, -9, -10, 0, 1, 21, 19, 2, 33, 19, 17, 24, 0, 17, 20, -18, -1, 18, -7, 33, -18, -8, -10, -6, -10, -20, -16, -8, -13, -2, -8, -45, 40, -10, -26, -4, 6, 8, -7, -21, 3, 6, 17, 10, 16, 5, 1, 17, 13, -4, -12, 2, 1, -18, -12, 2, -3, 34, 11, -2, -20, -7, 10, 4, 8, -8, -4, -19, -16, -16, 12, 18, -18, 3, -11, 7, 8, -19, -1, -11, -7]
8163gnJ3MrnPj0PJ2j7Mkj9K2pRLLRKMj6J9j9Ork1K5
$$ y = [-7, -12, 1, 5, -4, -9, -2, -12, -5, 7, -10, -6, -8, -27, -5, -12, -3, 0, 3, 12, 14, 18, 2, 21, 2, 8, -1, -22, 3]
8191C
$$ Imaginary data points
##PAGE= N=2
##DATA TABLE= (X++(I..I)), XYDATA
0@%%%%%%%%%%%%%%%%%%%%%%JnJ2j6J6j6J6j6K0k8L2l2L6m4M8n2O0o8P6q4R4j05
44e5J15j28J43j58J75j92K09k29K54k80L08l41L77m18M65n20N85o61P53q68J017
65E51j220J503j927K615m546O2649L3103o5524q1630l0999M7967P8784M2968l7042
79D7252q0533m7548L1741P5231M9454k0945p1063n8410J1308P2465O4466p945
91F5473o9289o1884K227O0160O2688P541n5816o8147j3806N3932O8041J7360m6358
104B2122o5010k3697L9123O5316K8939l5069o3906l1890K7193N9344L8255j7303
116D3417n8343m5274J2784N9778M7614j1318n7170m6777O055N0574M7477J439
128E0256m5186m9289p099M1113M9781J2681l5594n1167j9378L1446N2834K3398
$$ y = [0, 0, 0, 0, 0, 0, 0, 0, 0, 0, 0, 0, 0, 0, 0, 0, 0, 0, 0, 0, 0, 0, 0, 1, -4, 8, -8, 8, -8, 8, -8, 12, -16, 16, -16, 20, -24, 24, -28, 32, -36, 40, -44, 50, -55, 60, -68, 75, -83, 92, -100, 109, -120, 134, -146, 162, -179, 198, -220, 245, -275, 310, -351, 402, -466, 551, -669, 834, -1093, 1522, -3024, 59625, 92728, 27204, -54426, -85425, -37458, 41326, 84294, 47252, -33281, -80829, -49088, 26143, 75597, 54652, -16411, -74821, -63513, 8952, 73418, 65473, -3816, -65700, -63473, -3313, 59375, 66916, 11100, -57047, -70853, -16921, 51120, 68480, 22122, -42888, -66585, -27462, 37854, 66793, 31724, -32182, -64072, -36879, 22465, 60720, 43417, -14926, -60200, -47416, 12362, 59976, 48658, -8512, -55289, -49234, 1340, 48817, 50256, 5070, -44219, -51318, -10205, 39576, 52257, 16663, -34504, -53882, -22436, 30398, 53796]
140E3796k8643n1728k5083K3959M9089K8659j8012m7486l2764J2676M5906L5648
152D6017q214m3917l7883M294M1886L8945n71l8367l9078l943L3427L9420R665
165D1681k8987m1143j4816K6323M2880J8218k4155m2715k0271K0916M1192K1854
177D0977j7051l8544k4127J1835L6235K7515o595l5056l0838K966L4085L2506
189C3908o7l2286l3242k727K9647L3316N975k6030l2950r931K1854L3441J4300
202C5208j8757l4750j7622J6996L5169J8915j4976l3293j9957J1112L0871K2083
214C0999o749k9326k4493L146K7772K6631L85k6674k8437k788K5704K8958M273
227B9401k3452k7882o734J9550K7329J0490j5943k8009j4101J3778K8667J6300
$$ y = [53796, 25153, -26575, -51658, -27699, 21390, 50049, 32037, -15449, -48213, -35537, 10369, 46017, 37803, -6114, -43997, -39703, 2183, 41128, 40557, 2190, -36888, -40831, -7404, 32016, 41681, 12694, -28449, -43265, -16942, 25938, 44156, 20001, -22714, -42985, -22069, 19123, 40977, 23926, -14618, -38745, -26910, 9325, 36840, 30245, -4811, -35649, -32683, 1402, 33908, 33841, 1555, -31687, -34414, -4767, 28549, 34524, 8494, -24456, -34387, -12533, 20908, 35208, 16451, -18299, -35921, -18925, 16244, 35159, 20183, -13110, -33067, -21955, 8916, 30999, 24250, -5076, -29569, -26423, 1349, 27980, 28365, 1691, -26746, -29534, -3830, 25128, 29401, 5949, -21933, -28667, -9117, 18212, 28702, 12759, -15250, -29351, -15573, 13094, 29394]
239B9394j1805k8527j7913R851K7625J8810p542k5770j9362M303K3247K1055m66
252B2900k1879k3188k347K1211K4426L955j9989k4377n645J7954K3883P551j5320
265I135k3400r889J2520K3097J2578r921k3401j4828Q260K3536J5972p017k2538
278e896j6214M918K0544J6914j982j8685j8225j004J7490J9646L195j6516k0608
291a6423m818J5643K0665N954j4082k0124p198J1812J9203R199r129j8987j1453
304a9738P010J9171J3269n700j9123j4037M475J8253J4345k824j6653j4770N68
317a5754J4984J5537J860j3645j6635l862J2851J7385N240j2115j7469o008J0780
330f851J6768P027q808j5855q531O383J5510J0452m648j5562j1941L521J5532
$$ y = [29394, 17589, -10938, -28851, -19000, 8625, 27435, 19893, -5877, -25239, -20936, 2311, 23366, 22900, 1021, -22167, -24514, -3303, 21123, 25078, 5089, -19288, -24933, -6979, 16904, 24455, 9135, -14265, -24154, -11634, 11463, 24041, 14120, -9281, -24109, -15849, 7687, 23659, 16642, -5896, -22110, -17192, 3352, 20266, 18284, -401, -18626, -19630, -2140, 17506, 20701, 4185, -16423, -21241, -5598, 15067, 21021, 6939, -13185, -20383, -8571, 10632, 19831, 10702, -8285, -19738, -12728, 6443, 19712, 14012, -5111, -19148, -14673, 3580, 17925, 15101, -1552, -16322, -15754, -770, 14767, 16627, 2982, -13653, -17515, -4664, 12721, 17961, 5846, -11623, -17631, -6851, 9917, 16944, 8136, -7719, -16250, -9867, 5643, 16095, 11447, -4115, -16056, -12535, 2997]
343B997J2461k501j4697j2655J214J3325J2750O16j1829j3238k532J0575J3955
356A0441M277r783j4487n423Q951J4647O117q026j3939o773O406J3072P829m408
370H901j2553r383K822J2623J0465j801j2481j0995J114J1710J0981K4j0595j1014
384a0182j404R249J1290K953q136j1662m454P238J2200N392o658j2201n895N894
398f376J1648O331m550j0853p168L007J0278Q257j628j0118r068O88R887R542
412I877k8r398r531p78Q453R481J775p238r531l145O294R803M243n544j0102n005
428a0374N018J0016N413m259r570n780L209Q850O382j927q338p099P36Q030P876
443H183L3p801q171o87P386Q186J282o535q065k150N645P957L113m640q202m063
$$ y = [2997, 15458, 12957, -1740, -14395, -13181, 144, 12894, 13510, 1681, -11557, -14089, -3514, 10441, 14718, 4935, -9552, -14975, -6024, 8623, 14740, 6714, -7225, -13998, -7592, 5480, 13309, 8901, -3652, -13035, -10213, 2410, 12875, 11074, -1407, -12402, -11288, 422, 11403, 11427, 832, -10182, -11586, -2337, 8953, 11906, 3770, -7892, -12346, -5108, 7092, 12484, 5826, -6375, -12270, -6376, 5272, 11603, 7053, -3800, -10968, -7961, 2317, 10574, 8946, -1172, -10240, -9552, 335, 9877, 9849, 451, -9080, -9858, -1405, 8076, 9851, 2613, -6918, -10063, -3769, 6034, 10277, 4733, -5369, -10374, -5356, 4660, 10073, 5814, -3756, -9536, -6327, 2523, 8905, 6978, -1360, -8459, -7723, 307, 8183, 8216, 415, -7756, -8443, -1057, 7129, 8411, 1876, -6189, -8339, -2694, 5263, 8376, 3736, -4466, -8529]
459h529M038Q356M668l540q231m955K874P771N244k069p180n558R88O681O123
474F681j21o187o699p72O065O995J210n661o977j586M939O727K433m100o907l105
490g065L477O874L778k911o794m293K319O765M636j951o411m759J337N845M847
505E694l60n205n405n69M985N890J023m783n923j423M232N936K082l865o025k336
521f052L331N718K779k464n514l577J811N775M018j629n615m091J216N059M236
536E001l23m745m730j63M616M777N05m004m785j333L503N369J756l623n204j668
552e051K973M651K268k026m840l100J945N020L007j571m492l333O82M411M069
567D613m91m643l907N77L933L574K84l111m131j209L286M623J061l173m114j327
$$ y = [-8529, -4491, 3865, 8533, 4993, -3238, -8193, -5319, 2452, 7696, 5627, -1553, -7111, -6123, 558, 6681, 6560, 373, -6326, -7098, -1033, 5962, 7172, 1511, -5466, -7052, -2113, 4614, 7047, 2947, -3960, -7065, -3588, 3286, 7064, 4153, -2641, -6934, -4615, 2150, 6786, 4835, -1576, -6335, -4998, 847, 5694, 5334, 129, -5276, -5845, -860, 5030, 6053, 1270, -4653, -6076, -1844, 4092, 6174, 2309, -3716, -6052, -2721, 2997, 5776, 3312, -2202, -5779, -3968, 1807, 5825, 4196, -1419, -5510, -4294, 765, 5001, 4678, -67, -4797, -4960, -344, 4433, 4938, 934, -3851, -5184, -1681, 3688, 5444, 1821, -3383, -5051, -2078, 2573, 4841, 2815, -2025, -5125, -3180, 1840, 4847, 3276, -1216, -4549, -3867, 544, 4613, 4122, -521, -4428, -3851, 82, 3656, 3940, 829, -3302, -4511, -1225, 3398, 4459, 1286, -2828, -4155]
583d155K305M077K176k005m584k287K160M138K196j381l762k866P95L996L291
598D094q84l934l023O31L309L122J08l104l528m39L148L468M16k515l263j155
614c549K069L664J612k211l742j376J900L172J761j140l200k375R77L477K269
629C308r75k957k291L20K738K747K2k929k843O9K634K509L27k003k770q94J989
646i99L002R32j964k749r15J347K558J563j088k756j701J073K622J568p28k147
662c82j878J68K249K140o8k239k132K1J910K032L53j632k199o80J566K338P69
679B336j490k171r00J089K060J282q05k201j444P84K120J344n22j839j542J79
695a720J829J718%j798j730n7J446J766L98j301j895o12J303J899O66j056j774
$$ y = [-4155, -1850, 2227, 4403, 2398, -2186, -4473, -2313, 1825, 4021, 2640, -1122, -3988, -3193, 803, 4094, 3210, -724, -3747, -3116, 193, 3315, 3423, 319, -3209, -3648, -500, 2968, 3384, 869, -2394, -3549, -1480, 2184, 3796, 1585, -2157, -3533, -1633, 1539, 3300, 2160, -1040, -3415, -2438, 1039, 3308, 2333, -624, -2915, -2595, 143, 2890, 2912, -17, -2860, -2791, -157, 2352, 2679, 676, -2094, -2988, -999, 2003, 2935, 971, -1778, -2693, -1346, 1212, 2775, 1687, -1069, -2770, -1697, 925, 2493, 1765, -382, -2260, -2092, 157, 2297, 2229, -10, -2142, -2121, -211, 1821, 2174, 542, -1657, -2337, -771, 1567, 2336, 846, -1325, -2225, -1136, 924, 2206, 1401, -800, -2244, -1460, 660, 2004, 1482, -357, -1899, -1720, 109, 1827, 1827, 29, -1701, -1758, -312, 1454, 1852, 551, -1344, -1956, -653, 1246, 1912, 856, -918]
712i18r50P49J907J136p07j873j156N63J696J209k28j642j484J43J617J474M7
729A583j483j534k22J307J633L58j212j605n71J097J719O00q74j648q26P62J560
746F44R23m28j621j095L98J570J102k51j426j217J4J337J428Q6j335j410j67J217
764b31J353L54j025j481n17R53J532N80q38j461p01O53J396Q84n34j477r28N05
782i83J346J013l09j264j085R6J284J181n1j217j165o0J074J207K27r75j296l24
800a301R00J283M53q10j274n53O61J296O34n62j289o79M55J191Q02l33j183q95
818a204K65J112R53j81j019r38LR76R97J18r52j051j54Q71R92L02p25j038m05
837a078O37J100M41n99j003n03M80R38O01l29r49o76K08R80O79k19q56p02R8P57
$$ y = [-918, -1868, -1119, 788, 1924, 1217, -656, -1812, -1249, 447, 1656, 1428, -214, -1698, -1555, 62, 1536, 1583, 100, -1434, -1656, -349, 1284, 1642, 430, -1175, -1746, -649, 1070, 1670, 796, -852, -1678, -916, 644, 1567, 1139, -482, -1577, -1179, 391, 1493, 1242, -184, -1401, -1387, -50, 1378, 1464, 129, -1281, -1448, -231, 1122, 1476, 451, -1030, -1547, -594, 938, 1518, 680, -781, -1482, -829, 567, 1451, 917, -560, -1488, -983, 363, 1376, 1067, -197, -1282, -1186, 98, 1279, 1228, 11, -1154, -1214, -140, 1067, 1294, 319, -977, -1301, -401, 882, 1335, 525, -749, -1302, -641, 655, 1289, 727, -562, -1241, -786, 405, 1207, 874, -309, -1204, -939, 173, 1126, 945, -74, -1012, -1009, -33, 964, 1082, 130, -921, -1075, -204, 788, 1090, 365, -673, -1078, -441, 659, 1100, 501, -502, -1005, -525, 413, 1014, 685, -264, -940, -732, 248, 927, 708, -148, -850, -752, 5]
857EP73O6p40q70q2O92Q28J11n77p83k63M95Q34L98n08q39m02M45Q15L71k75p34
879b40m90J74P27O04j96o99n71R1O08O22N3o30o42r5N70O52J25n31n90k07L91
900b74O59K84l26p17l34L21O61L34j93o24m18J63O16M47j32n48m98R8N02M88N4
921E63m97n44o6M54N81J08m38n64j56L55N42K28k93n48l11K56N63K84j62n82l36
942e63J78M91M10j14n13l80M4M58M23K1m54m21n0L77M72J34l52n06j57L76M64
963C38J64k88m51j98J98M41K67j55m85k81J26M62L38j75l90k96L8L64L53kl47
984B1l85j8L31L42M6k47l86j30K83L75J98k46m24j43K16L26K01j75k94k54R9L64
1006A00K64p8l64k46M4L16K93k5l03k68k9K65K89R0k70l45p3K19K98J25j47l36
$$ y = [5, 778, 844, 104, -766, -848, -156, 672, 783, 206, -577, -840, -345, 489, 887, 379, -460, -862, -417, 398, 769, 494, -240, -730, -556, 171, 775, 579, -120, -691, -600, 8, 630, 683, 53, -589, -684, -114, 538, 663, 132, -458, -665, -274, 385, 669, 343, -374, -708, -387, 274, 608, 415, -209, -627, -464, 152, 599, 467, -81, -579, -481, 21, 509, 563, 66, -478, -544, -90, 491, 599, 161, -403, -559, -204, 338, 566, 273, -275, -586, -330, 233, 517, 355, -227, -563, -385, 106, 516, 402, -111, -491, -447, 11, 434, 455, 1, -420, -470, -93, 379, 513, 161, -345, -502, -126, 338, 502, 214, -237, -435, -237, 204, 471, 316, -169, -450, -324, 138, 476, 301, -89, -385, -347, 17, 370, 368, 21, -364, -382, -51, 291, 337, 90, -296, -426, -143, 232, 430, 184, -240, -383, -167, 159, 360, 185, -109, -363, -264, 100, 364, 286, -78, -324, -280, 36, 329, 304, 1, -267, -296, -31, 258, 348, 78, -267, -340, -121, 177, 302, 155, -181]
1028a81j70J72L26J65j49l19j93J54K80J90k7k73k40j0K96K74l2k89k47O6K04
1049cK49M2k11k60q5J62K95R8j77k72j25J83K47J40j31k84j84J51K93J03r4j87
1071e0j51j1K23K20j7k55k36N5K31K23j7j66j98o7J30K91L2j81k17m8J54J62J37
1094B44q5k82j22J38K31Q4j14j55r4%J70K25p6k18j31J0J62J84k9j17j93o8K25
1117a1J68J9j65j62k9J29J64P4r8k19o6J41J41Q1q5j46q0Q4J43Q8j12q0n9m4J41
1142A7J44qj71j17L2J39Q8k0j10r9m4J50P8K2p3j33K6L6O9M6j9j16p6O3J41M8
1168A13p9p1l5j3R3O4On4q9L5R2M5m2k3o2l7J8J07Nl2q5j1O2JN5k1m5o8JM1Q5
1199E6k5%o4l2J4O4N5m4n5l8J2P9L2pn1m7J1O6L5Qo4l0k8P0L7N4n4j09l4M1J07
$$ y = [-181, -351, -179, 147, 312, 163, -156, -349, -195, 85, 275, 248, -25, -265, -275, 21, 295, 263, -26, -273, -207, -3, 246, 288, 77, -183, -268, -106, 189, 287, 110, -162, -287, -104, 143, 283, 152, -132, -316, -165, 128, 231, 137, -50, -201, -212, 11, 231, 214, -41, -277, -222, 9, 232, 215, 49, -149, -216, -86, 205, 237, 56, -161, -209, -55, 107, 244, 159, -123, -245, -107, 124, 208, 94, -61, -155, -155, 15, 240, 164, -54, -185, -175, -13, 171, 142, 25, -168, -236, -11, 157, 176, 11, -151, -180, -51, 113, 187, 89, -130, -196, -55, 86, 167, 82, -64, -144, -60, 83, 171, 59, -21, -80, -124, 17, 161, 153, -18, -135, -103, 36, 124, 104, -6, -105, -149, 1, 79, 101, 28, -105, -79, -43, 26, 72, 53, -63, -139, -76, 65, 113, 34, -37, -72, -85, 8, 72, 78, 24, -65, -30, 62, 107, 65, 42, -20, -57, -39, 68, 73, 41, -44, -55, 7, 8, 63, 42, -3, -71, -70, -29, 56, 31, 31, -33, -65, -51, 13, 68, 24, -31, -69, -57, 22, 54, 47, -4, -51, -40, 26, 61, 69, 5, -25, -53, 17, 54, 108, 54, -55, -89, -48, 59]
1230E9M4q1o3l9K4P8Q5j2j60l0M5Q7J9j2l5j34lJ24P3nr2p2L6L3J30K1r0j05Q
1259f7L6J40j0o1o1r4Q1R5Q0q5j05l1M4O3Q8o9r0j13M7J42M1l5p2n4J4P6R9K6
1287A25j91o1O0N2Q9np1p4m9J10J13rr6o8oO8N5O5o4j06m0O1J30j8n0m7n1M5Q0
1316D7P7q9q2m0J2J00M6k0q7p8M1J08K5l5n5n3L6J3Q1L1p2r7M8P2nK1k4o9j3N1
1346a0N6N9o4j08k0R2P9l3l2m4n7K5Q8M2m1o5l9P0PM4k0k4q8N8RL5k5k7J1j8K1
1377a9L5K6o6j8oN2L0l3j3Rk8J8L9Jj5Oj9j2K7J8J5n9j2K7KN4k6m2j7K1k1L6k3
1410a3jj2k3O2%j0l0k9K4M8l9M2K4m3k8L9j8J2k4L8Qj8oJ4J6Rm4j6M1Rj0k2K1
1443B1l7j6M9jRk5m1lK3JJ7J2m7qM5J0j8NPRk9j3L4%l1MKN2J3m1rj1K4JJ3Ljl3
$$ y = [59, 103, 22, -41, -80, -56, 22, 107, 95, -65, -95, -50, 37, 56, 44, 9, -125, -128, -4, 69, 64, -28, -100, -64, -31, 99, 120, 30, -75, -67, -31, 109, 99, 38, -23, -117, -36, 59, 139, 54, -51, -82, -38, 25, 113, 44, -46, -159, -112, 30, 71, 36, -36, -90, -76, 0, 99, 125, -66, -127, -67, -15, 74, 69, -2, -76, -125, -15, 98, 89, -7, -75, -81, -13, 42, 107, 43, -63, -103, -42, 88, 70, 20, -27, -78, -33, 47, 124, 35, -47, -87, -75, 25, 71, 51, -36, -114, -73, 35, 60, 25, -30, -83, -47, -34, 47, 78, 6, -91, -43, 29, 24, 45, 21, -48, -61, -10, 46, 105, 41, -67, -87, 5, 84, 51, 19, -25, -82, -57, 31, 73, 32, -33, -72, -2, 5, 49, 29, 5, -83, -25, -16, 19, -6, -33, -22, -40, -19, 16, 42, -24, -42, -48, 4, 34, 1, -12, -3, -31, -13, 26, 27, 12, 18, -1, -13, 14, 32, 47, -12, -24, 3, 5, 59, 33, -9, -26, -5, -26, 10, -13, -14, -26, -49, 13, 13, 3, -27, -56, -32, 16, -23, 19, 43, 0, -28, 11, -7, 5, -19, 19, 27, 9, 3, 17, 33, 42, -2, -18, 23, 32, 22, 0, 21, -16, -32, 17, 16, 25, 0, -41, -44, -21, -20, -3, 9, -38, -46, -1, 9, -9, -4, 3, 12, -17, -30, 4, 4, -27, -23, -21, 31, 44, 3, -6, -17, 7, 8, 21, 24, 23, -10]
1481a0qJ0M3k0k0j1L0l0OJpRj2oQ%M7k7j4l0O2j0K0n2JJ1KJ0Rk2K0l4QL0J1K0
1517D5p9L3J9l0J9L4m4L3l2QpK1k6l3L1nK2j9Rk1nJ4J2Qn1L5lOk0L1m0J5K3k7
1551b4K6J4mjm1M7j3J6k0l9L2K4nJ0j8J9rj7j4L8j5J4k2J9k3Mk2J1j0L3k9K1m
1584bKl6Oj1J5L1lj8J7MQk4K5Jj9j2J8K5j7JqrK2L6m9J9j9j1K1JJ5Pl5qk4L7M
1621A0J1k9j8J7j2J4Nj8QKPNk8J2R%oJ4lK0l2j0L8Ol1PpJ4J6m8N2j1k3MkJ5J2
1658B0kl2rJ0j7O1l9k7K2J7l4K1Jj7J1j9K3K4k4qOj1K6K9n5L1K0l4K6k1mK6J3
1691C4k8k7M9k2J3j9K1j7nj2K8j7L8n7j4L7Mlk4kjJ1nK6n3L2PJ9l2L8l7M3j4j6
1725eK9j6pk5K6L5m7rRN4J7n8nk1M1j2rQj9N0l8jnJ5rk4mL7j6qk9NJ9K5k7j6L7
$$ y = [-10, -18, -8, 35, 15, -5, -16, 14, -16, -10, -9, -16, -7, -19, -25, -17, -17, 30, 3, -11, -41, 21, 11, 31, -21, -20, -9, -7, 3, 12, -10, 10, -24, -16, 14, 25, 45, -34, -1, 18, -12, 7, 41, -3, 30, -2, 6, -1, 20, -6, -39, -8, -13, 9, -10, -1, -22, -27, -13, -1, 7, -44, -9, -12, -6, -26, 5, -35, -20, 3, -24, 2, 16, 12, 11, -30, 17, 4, 20, 0, -39, -7, 17, 12, 22, 4, 23, 14, -3, -17, 21, 6, 20, -2, 17, -6, -2, -24, -13, -23, 10, -19, 2, -2, 0, -36, -30, -41, -26, 5, 2, -16, 1, 5, 13, -11, 14, 15, -4, -16, 2, 27, 10, 11, 3, -6, 16, 52, 3, 22, 3, -8, 13, 14, 29, 36, 1, -7, -31, 6, 10, 21, -8, -26, -9, -21, -7, -2, -20, -12, -10, -3, 2, -26, -14, -5, -5, -11, 3, 0, 20, -12, -22, 16, 22, -9, -2, -9, 5, 21, -27, 25, 14, -9, -5, -7, 8, 20, 18, -14, -23, -13, -30, 31, -8, -35, -13, 4, -30, -9, -8, -25, -14, -33, -10, 14, -10, -18, -12, -23, 3, 32, -23, 8, 28, -6, 20, -1, -5, 21, 34, 6, -21, 28, 6, 19, 0, 21, 4, -1, -13, 15, -2, 36, -21, -35, 2, 6, 3, -21, -23, -24, -13, -18, 8, -45, -13, -6, 13, -19, 19, -18, 25, 11, -5, 24, 8, 1, -24, 2, 37, -10, -19, -10, 44, 61, 3, -2, -23, 18, 6, -3, 5, -14, 36, -2, -3, -8, 7, -2, -26, -30, 7, -9, -17, -46, -41, -22, 3, -24, -40, -3]
1762cpMlk4M3L2p9M6Nkqj2pN9k2oJj2J0kj6K1rl0LJ5NoLk2lPL2nn2NO2l1j7L9
1802A4l1nJ5j9L1kJ4k4mj2L6oJ6l7K9Mj2OlL4k1n6L3K9k1pqPKJ0j6k7J2L5j2l0
1838b6j4K8j0OK5k3K5Jp0K6L1k2J2%%K7jj7K9l8N0l0j7LM3l4LjJ7Jkl4J2lK3m6
1874b6J3L5l3j1J8K9l2ll3JRJ0N3l3k6J5K5Jj5NmJ3lJ6nJqpK4j0K8j1n1K4M0l5
1910A4ll0M0Pn7jM8nl7KNM2Jk9n6M8J5L3n6j8M8oKmKK7l5j0JKM7n2K1QpK4k8o
1948cL2l1nJ3mJ1J5m2K1oJ8k2ok0L9j7K0n1MJ3K3j1OJ9on3J7K0KLkj3PL0k9M2
1984C4m9N4l5JmJ2ml0kL7RRl6Kk3J6M2k8k5J0J6k9J9MRj7k5kK5j8J6l0L6L2l3
2019gMk0J7M0l3MK4j2K4m6OK2omj1mJ5Pj4mJ7Lj1k2j6K8J5rl4K2L6k3k5KJ2JK
$$ y = [-3, -10, -6, -9, -33, 10, 42, -37, 9, 14, 12, 4, -8, -15, 44, 22, 16, 17, 5, 15, 13, -3, 18, 9, -21, -18, -3, 2, -4, -1, -23, -26, -19, 13, 8, -44, -39, 23, -8, -25, 14, -17, -22, -7, -26, 5, 3, 17, -7, -11, -23, 13, 7, 23, -14, 15, 19, 7, 13, 10, 44, 23, -33, 0, 29, 8, 1, -7, 0, 2, 12, -4, -31, -19, 16, 4, -26, -40, -12, -22, -16, 9, -14, 11, 12, -58, -32, -1, -23, -11, -11, -11, 16, 15, -2, 27, -11, 39, 9, -8, -5, 38, 4, 7, 6, 23, 24, 22, -12, 0, -3, 20, -26, -13, 22, -11, -22, -4, 25, -7, -10, -43, -42, -33, -23, 30, -3, -29, -14, 11, 12, -3, 2, -2, 11, 8, 24, 19, 20, 12, 5, 29, 19, 47, 36, -15, 9, 49, 14, 11, -19, 21, 28, -29, -30, 18, 13, -24, -22, -17, 25, 26, -3, -59, -11, 4, 37, -19, -37, 11, 5, 7, 3, 5, 32, -3, -13, -12, -10, 37, -15, 6, 14, 7, 31, 3, -3, 29, -2, -7, 6, 2, 13, 28, -14, 7, 1, 19, -3, -9, -29, 10, -7, 13, -38, -34, -21, 2, -9, -3, 16, 10, -43, -26, -6, -4, -1, -3, -16, -9, 21, -8, 34, -15, 39, 4, 5, 1, 13, 9, -21, -23, 14, 23, 32, -4, -2, -25, -9, 33, 5, -20, -10, 6, -23, -4, 0, 9, -8, -33, -35, -10, -28, -12, -42, -6, 26, -7, -3, -23, -6, 34, 1, 5, 29, 17, 41, -5, 1, 23, 17, 13, 2, -2, 13, 20, 6, 2, 19, 22, 11, -11, -27, 1, 16, 7, -27, -5, 31, 8, -17, -15, -3, -2, 0]
2056@l2%L1Kk5K3j2L3j9kMLmjMJ5J6J0n0J6Mj6j4KL8j3k0K4l7K6L8m2j7K3m0M3
2092A1l5J0mL4l4k4L5J7J0m3RJ7j0Nl0K8K7oj4qNK3Jkj6K5j6l0%J1LM3n7J5l1
2127c1Q1p2JJ4L3k6LqqK5k8k9M4J3k2k3nL9oj2L4kk5KoK8MOpKlK3k2oNk8M9k3
2165A4l0L5oj5j5L5l5L4Kn7J7J7mK4j2k7K6pj2j6L3J5l2J1rJ7Rk8PJ6J1Rl1PO
2200IJ3j5k2K0jK4k8j0QL0l8K3Kk7J5Kl5N5Kk7m7OM4j7lj8M3l4J3rK3k9K3Qk7
2235b4oN5kl2RJ7Lk8KL1%l9mM5j1pKJm3J2K4Lm0M4pl2K5rJ0j5jRrj2M0l1nK5o
2274fqK3j7Rj2RNJ2J3k2J1lrj7J5Pj7RK0m6JNJ5qjj1L7j9Lj4J9k1j0K3j6K1k1
2311b1K2j0lK4k3k4L9MKj3J6MqMm%Mj3oJ8Ok3J9J7l0M1k5k6J6j3k8M3%k3nPMj3
$$ y = [0, -32, -32, -1, 1, -24, -1, -13, 20, 1, -1, 3, 6, 2, 1, 5, 20, 36, 46, -4, 12, 16, 0, -14, -12, 26, 13, -7, 17, -20, 6, 44, 2, -15, 8, -32, 11, -24, -14, -18, 16, -18, -42, -7, 10, 20, -23, -14, 3, -7, -2, -32, -4, 23, 17, 3, -5, 0, 23, 24, 22, 6, 31, 15, -15, -15, -4, -1, 42, -15, 0, -31, 50, -22, -21, -7, 26, 0, 3, -5, -13, 12, -16, -45, -1, 12, -10, -33, -38, 1, -5, -17, 17, 15, -10, -8, -14, 14, 18, 24, 17, 19, 16, 39, 17, 11, 16, -12, 37, 14, -16, 19, 13, -2, -17, 18, -17, 17, 19, -38, -21, -4, -8, 16, 4, -23, 3, -4, -16, -32, 1, 16, -16, -5, -14, 3, 12, -16, -9, 7, 18, 27, -4, 3, 9, 22, 7, -15, 5, 4, 28, 0, -10, -2, 28, -10, 13, 15, -12, 3, 5, -30, 25, 27, 0, -47, -41, 3, -14, -17, -35, 8, -26, -13, -22, 1, -28, -5, 3, -24, -30, 25, 23, -9, 0, 17, 20, -8, -6, 25, 25, -14, -18, 27, 16, 9, 11, 12, -31, -19, 5, 8, -32, 12, 5, -27, -2, -11, -1, -16, -17, -8, -17, -29, 11, -20, -25, 0, -6, -14, 9, -8, 1, -11, -2, 3, 15, 28, 6, 17, 14, 5, -12, 3, 10, -7, 2, 22, -24, -23, -18, -3, -11, -12, -23, 14, -5, -2, -16, 3, -18, -28, -5, -21, 0, -21, 1, -9, -12, 12, -11, -35, 4, 8, 10, -3, 13, 17, 9, 13, 9, 9, 13, 0, -6, 12, 18, -5, 14, 31, 1, 42, 17, -9, 7, -6, -34, 9, 9, -14, -19, -12, -8, -21]
2349b1pLJ9l1Llj1J6K0jJ0k1JK8L%rmJ2jj0J0MJ6l0J0rK0j8l2O5l6L2l8K5m6K2
2386iLJ8J1n5K4Nj0l5N2j8M%K0qmj9j9K5j3M3oj0pK4j5K5j1k3L1Nnj7Nl1OK2O
2423A4j1K1k7K0k4K0m7J1MJ7nj5J8Nk7rJ5J8jj4j6N3j4j4QK5%kl2L5j9rJ6j3L3
2458C4k3Jk8L3j9J6k3K5JOj1l0l6M5M7k0j4k3j3qM6k9NjK7lk7M7k5Mk8jM6nj0
2493Fm1M9JKj1OKpK2pQj8Kj8L3K4o3Rl2K7LmpJ9j7k2K6NLk5M0l0pK2j5J8Ll7J4
2532a7J7J5j7kJ8klRK4j0k8K8l5K3k6K0L2m6K0k1k2J0K1qk3J0LK7l3NNj6j0%K1
2567a1j4k9L1JM2j5RkllK1%k1rJ3J2k5M9j5j0k6J7Lj5K2j8PLPl9J8pPlk6K0%N
2605dj4QNj8jM0j7k4J8L3k7j1K1k4J0k2M7j6K6j4lkj0JK3Nn2RM0j9lnPqJ6j2j7
$$ y = [-21, -28, -25, -6, -37, -34, -37, -48, -32, -12, -13, -3, -24, -23, 5, 8, 8, -1, -5, 7, 6, -4, 6, 10, 26, -4, 6, -3, 17, -1, -33, 32, -4, 28, -10, 15, -31, -9, -6, 12, 23, -32, -8, -3, -13, -48, 4, -14, -10, -10, 10, 2, -2, -21, -40, -15, -28, 15, 9, -1, -8, 16, 1, 26, 15, -8, 23, 28, 23, 6, 11, -20, -14, 8, 14, 3, 24, -3, 17, -7, 13, -34, -23, -19, -2, -7, -22, -4, 1, -26, -35, -20, -2, -3, -17, -33, 20, 6, -8, 0, 25, 25, 23, -9, 26, 7, -2, 14, 1, 34, 11, 12, -16, 17, -2, 14, -9, 16, 17, 23, 12, -18, -54, -9, 38, 18, 4, -19, -32, -40, 6, -23, -18, -19, 8, 5, -22, 25, 0, 4, -24, -25, 21, 16, 6, -35, 14, 15, 17, 6, 12, 14, 7, 29, 22, 30, 12, 14, -4, 29, 53, -10, -1, -33, -6, -3, -7, -14, 5, -12, -34, -8, -3, 0, -25, 15, -15, -22, 0, -15, 3, 6, -31, -17, 0, 15, -2, -4, 14, 12, 9, 18, 42, 32, 4, 32, -3, 20, -6, 14, 46, 0, 20, -1, -23, -13, 8, 0, -23, -13, -10, 17, -16, -11, -6, -22, -32, -32, -11, -25, -54, -23, -22, 20, 5, 14, 12, 9, 6, 27, 27, 6, -3, 10, 22, -3, 46, 31, 21, -5, 12, 15, 0, 22, 4, 11, 14, 21, -18, 0, -7, 0, -3, -29, -9, -9, -4, -18, -10, -5, -23, -24, 16, -1, -25, -7, 26, -1, -12, 9, -15, -5, -27, 20, 4, 30, 16, 13, 11, 1, 2, 25, 30, -22, -13, 27, 8, 5, 0, 7, -1, 15, 3, -14]
2642a4J4Njk7PK0jRn4J5J7%j3L7k6Pm%N4q4M8K1j8J2J1k0onK6k0j3J4LrJ9k9J2
2679Gj9K0K8m3k4K4k0K2K1pk1mL0Jk7j3J0j6K0J8mj9L5k6k0O7l6mLkKJ7JJ3k0
2714A4K%k4M5m3K8j3Rrj3OMqjj3MM2k7l5qJ8mJ9lnJ8rjk6QK4oJ6l5N7k5k8M3J
2753B2j3L5n2J0%PrROkRk5oJj1L6l4kK6l3J1J7mnk7NJ0J6Pj2j0J1%j5OJ6nqK3
2792A0kJ7m3M6j0J4m2K2pNK5k6Qk2K9rqk1kmL7%j3k0K5j6Jk2K5j1J0j3K3o%%j0
2829a0qK3j7LPrM5k3J6j1mj0jk1M0qJ0k9L%J2JK0j4qrm7M7k5K2k3O0k4J4m0j6
2865c4K6j6J9J8k6PRj1kQ%K3j8mQJ2Lm0L7Lk8L3mkJ2m7K9lqOk8JnK5J0j1k8j6
2903d2K5Rm3J5K4Ll1L5l4M5qL2k7k4OJ3K1pk3K1rL3m1PJ1K7jl7J5k5K9j0Pnlk8
$$ y = [-14, 0, 5, 4, -23, -16, 4, 3, 12, -42, -27, -10, -10, -23, 14, -12, -5, -9, -9, 45, -39, 9, 30, 12, 24, 35, 15, 9, 4, 30, 10, -3, 11, 14, 5, 24, -5, 7, -12, 8, 36, -7, -31, -7, -27, -5, 16, 9, -12, -16, 14, 15, -12, -25, -15, -31, -11, 7, 3, -16, 19, -7, -27, 40, 4, 0, 3, 1, 3, 20, 21, 34, 14, 16, 16, -8, 37, -6, 22, 9, 18, 9, -4, 2, 6, -2, -3, -16, -12, 30, 3, -32, -40, -22, -26, -7, -10, -15, 3, -6, -7, -33, -25, -1, -7, 9, -26, 31, 6, -22, 21, 22, 9, 44, -8, 2, 2, 9, 0, 9, 15, 13, 22, -3, -9, -8, -19, 17, -17, -19, 7, -26, -15, 2, -2, -7, -34, -29, -19, -3, 4, -8, -18, -7, -7, -22, -16, 0, -5, -13, 10, 8, 25, -18, 28, 18, 32, -10, 12, 5, 10, 35, 9, 17, -5, 24, 15, 7, -14, -16, -20, 17, 17, 4, -16, 9, -7, -6, -28, -3, -14, -4, -17, 6, 0, 0, 0, -10, -18, 5, -12, -9, -2, -11, 34, 11, 27, 16, 12, 2, 1, -20, 20, 12, 22, -7, -4, -4, 8, 9, 29, 15, 7, -2, -49, -2, -27, -5, -28, 32, 8, 22, -18, -34, -8, -24, -5, 13, -13, -6, 3, -8, -10, -2, -2, 21, 3, -1, 7, 19, 22, -18, 19, 22, -6, 27, 23, 21, 33, -14, 15, 12, 4, 10, -18, -17, -22, 3, 13, 2, -26, -42, -17, -8, -51, -36, -12, -9, -40, -5, -39, 6, -2, 30, 3, -21, -15, -2, 19, 12, -11, 10, 1, 34, -7, 0, 11, 38, 37, 0, 15, -10, 19, 9, 16, 11, 8, -20]
2939b0Qj2qJ4K0J5k6NMmJ2k0J0J9k8j0K0kJ0j2J0prJ1MoJ6QJ0l4KQJ8j3qL3Mk1
2977B1m0k1M4k3QJ8mj0j9pM5l6J8j2j2%J0mL9k4NkLmk9M0RqJqJ1LrJ8j7K0j1J2
3015B5l8M2l0OLlJ3j0j7M8o1K2l2J8J3j1j7MJ4k2mJL3k4J1jK4J8oj1QJj2k4M0
3050B1lj6J3%K2k0Nk6pPK1rj1PJlj1J5j4k3J6j4L8k3k0N0l0M1m3lPk1K3OK0j4
3086BRj0k0NJ1J4J1jNqk4J1j0J7Nj4j2%KK6k5Lj4J9lr%rLJ5j8L8l2K3m9J6rJ3
3124a9Ok0K5j0lM4k1Pj4J6K7k0Jj0J1j7PNJ6orj3pLL7k8Qm6L0k5L1j8j5J0njJ2
3161a1onJ2k9PK4K4rk4K9l7J8RK6pkK4q0N1j2J6k1Qrj3K1mlMJ2J8j6j6Oj6J0k
3198cj1%MM0n9J1J6j1j8J3K2l0K4mk1M7k8l7P2l1J6nK2Mk0J4J6rk2jJ6j4j5%K2
$$ y = [-20, -12, -24, -32, -18, 2, 17, -9, -4, 0, -4, 8, -12, -2, 17, -11, -21, -1, -3, 7, -5, 5, -2, -11, 0, 4, -2, 14, 22, 32, -2, 0, 8, 26, 13, 5, 38, 42, 21, -19, -40, 4, -19, -11, 7, 3, -7, -26, -33, 12, -24, -6, -18, -30, -30, -20, -24, 15, -9, -4, -6, -3, -7, -36, 4, 13, 5, 6, -2, 9, 12, 3, 21, 4, 24, 13, 25, -13, 29, -1, 5, 8, 5, 18, 8, -9, 39, -22, 0, -32, -14, -1, -12, -29, -25, -11, -33, -37, -36, -3, -27, -16, -17, 7, 25, 19, 8, 16, 17, 5, -19, 21, 18, 2, 15, 15, 37, 17, 22, -4, -11, -4, 17, 8, -3, 4, 5, 2, -9, 6, -8, -31, -15, -29, 9, -14, -34, 16, -14, 27, -16, -19, -12, -33, -10, -4, 16, 2, 11, 1, -19, -14, -3, 11, 22, 21, 26, 18, -6, 5, -5, 12, 17, 3, -9, -9, -7, 19, -6, -3, -17, 2, -1, -10, -10, -19, -16, -1, -19, 19, -13, 10, -39, -23, -32, -19, -13, -33, -8, -18, -21, 23, 2, 9, -5, 11, 38, 18, 19, 9, 20, 3, 10, 15, 31, 25, 16, 3, -4, -1, 36, 8, 16, -30, 0, -25, 6, -12, -27, -17, -22, -23, -11, -17, -22, -10, -39, -32, -8, 16, 7, -17, 12, -25, -7, 2, 28, 21, 19, 43, -37, 14, 2, 18, -3, 5, -4, -17, 4, 0, -3, 1, 13, 31, 15, -1, 5, -11, -1, -3, -14, -14, -10, 30, -29, -18, -2, -13, -31, -18, 4, -26, -2, -6, -27, 20, -8, -45, 27, -4, 12, 7, 29, 33, 13, 27, 43, 34, 12, 11, 27, 13, -2, -2, 20]
3233B0k0rPJ5j3J4j9K3k2k1K1nK6k9qJ4j9QJ7j8KMMJ0j9Qj9M1j1J0kJ3j4MPj2
3269HoK3qmJ3j5k0qJ1L9k4rJ5jj4rrJ8Oj6%l7M0k6M4j3j1j1K5k6J2%L2k9rJ7N
3306CK1k0K1k3K3MMk0kj7mJ8oK3k7Jl9L6J1nk0K3plJ9l8RK8l6L5ppJ4m1L4m1M5
3343IL2n4L8j0k2K3M%mrL0k7J7k3j3K1l5M8%l6jJ4k3K1nRK0%l1J3jm8O5l9J6j2
3379a3JLNmlJ5%MKJ5j6k0L2j8M0m0J1jOMj5l6N6nQj3pl8K5Km0L9%M%j3j6N0m1
3418a7K3pj6lM3l9J5j%l2L2J3k1L7k4rmJ0K0j6J0oJ2Orj9j8K6MoJ3j2j5j6J8j0
3454a8K5k0QoJj3J6k9K0njL9jj1Pl6L1k9L9k4J2jlmL2k4k3J7J9j4J9kj7J7Jrj8
3491eK0k4J5Kk6J9j5J1m1M2llkjJ9n0L0OK6ll7K5j9K4JJ3k0jQkJ2MqmnmJ8j8K9
$$ y = [20, 0, -9, -2, 13, 0, 14, -5, 18, -4, -25, -4, -9, 17, -12, -20, -6, -25, -17, 0, -18, -16, -12, -8, 2, -17, -9, -28, 13, 2, 12, 10, 23, 9, 13, 20, 8, 2, 25, 17, 13, 26, 11, -9, -17, -6, 33, 9, 0, 15, 14, 0, -9, -18, 0, 6, -10, -10, -47, -7, -33, 11, -2, -13, -24, 1, -25, -13, -13, 19, -10, -19, -2, 3, 24, 4, 25, 2, 25, 29, 33, 13, 11, -6, -10, 8, 2, 25, -2, -1, -40, -4, 7, 2, -18, 5, -2, -5, 14, -24, -15, 13, -23, 12, 5, -2, 12, -29, 5, -36, 9, 41, -13, 25, 15, -7, 16, 20, 20, 16, 7, 37, 10, 27, 4, -9, 12, -23, 25, 25, -11, -12, 2, -21, 0, -5, 4, 24, 24, -7, 6, 5, -43, 22, -17, -1, -13, -12, -9, -4, -8, -11, 4, 4, 8, 10, 25, 9, -11, 21, 3, 43, 3, 14, 13, 19, 23, 8, -28, 28, 23, 31, 18, 11, -27, -2, 0, -40, -1, -1, 3, 3, -10, -26, 24, -17, 6, -1, -17, -20, 23, -16, -1, -2, -2, -34, -2, 11, -10, 27, 3, -6, -10, 0, 20, 4, 14, 8, 20, 26, 17, -2, -20, 6, 10, 4, 17, 5, -10, -26, -8, -18, 7, -13, -5, -11, -10, -23, -7, -36, -16, -21, -22, 17, 16, 5, 12, -24, 7, -22, 17, -7, 5, 4, 1, -3, 29, 5, -18, -1, 18, 4, 23, 21, 4, 21, 22, 13, -5, 15, -9, 6, 8, -18, 1, -14, -3, -44, -2, -5, -8, -10, -11, 8, -42, -12, -6, 20, 17, -20, 5, -14, 10, 11, 24, 4, 3, 11, 9, 21, 25, 17, 13, 8, 4, 22, 4, 33]
3530C3k2j2RPqj6L4j1k0KrkL0j5K1j4k9Mk1J6J3j1M6l3Q%JRk3J8qNK5l3K2l6M8
3567B8j4lnjlLK9j9j7mK1l0K4ojj7lMk6K2O%Kj2j0J0QL3k2LOmK0k2J0k6MLRMK7
3608C1j6J2j3j6K7Nl6RJ2m0L6oj6J4oNk2J7k7J9j3pJ4Qj5%J9rj0J6mJ6qj1K5k0
3644a0K8k5K1LkQj6kpJ4m%lj9K3ppJ5j5Nj4J3%j9jJ0rJ0j3J2j0JL5j7rMK2mk5
3683a4J1pL8l6L7j1LkqOk4K7J2k9J4J6l6NnJ9lk2rlJ5kk2J4MMNlj7J3k3K7nK5
3721A4j9J5k8J7J1lk3L2j6j5N0j7K4m7K7qk1L1l5J1RpJ2rnL9l7j4qpk1N8l2J8
3755dLPqqj5%Nj1K0J2J5qMOjl6L0LJ4j1l0N1j1Ml0K8j7j0L2m0M6k7lNj3J4k3k0
3793b7K7l6L1rKJk1M6l7J3jk2L3jK9l0L8l8j2K9j5J6rJ6k8jK5nKJ6nk0OJ5pj1
$$ y = [33, 11, -1, 8, 15, 7, -9, 25, 14, -6, -4, -13, -15, 15, 0, 21, 7, -22, -18, -39, -23, -10, -21, 25, -8, 0, 0, 1, 10, -13, 5, -3, 2, 27, -6, 16, -20, 28, 14, 11, 6, 5, 2, 5, 34, 15, -2, -6, 15, -15, 9, 3, 2, -15, -18, -14, -40, -18, -12, -12, -10, -22, -32, -22, -14, 19, -3, 0, 6, 2, 22, 0, 10, -16, -12, -9, 0, 4, 31, 15, 27, 14, -2, 25, 30, -6, 3, 15, -25, 11, 5, -11, 3, -3, 2, -20, -3, -30, -11, -24, -31, -17, -9, -24, -24, -5, -14, -24, -8, -12, 4, -4, -15, 10, -10, 18, -7, 14, 17, 15, 23, 7, 5, -2, 12, 8, 8, 5, -14, 9, 2, -5, 10, -5, 0, -14, -1, -1, -20, -21, -11, -20, -10, -23, -11, -21, -20, 15, -2, -11, -7, 15, 11, -14, -3, -10, 28, -8, 29, 18, 21, 19, 11, 17, -7, 20, 32, 3, 17, 33, -3, 2, -3, 16, 13, -9, -18, -21, -6, -8, -30, -16, -12, -8, -3, -6, -23, -10, -33, -6, -11, 14, -5, 10, -18, -1, 10, 7, -16, 16, 0, -15, 35, 18, 42, -5, 22, 14, -7, 24, -11, 0, 9, 2, 14, 5, 0, 39, 2, -12, -20, -27, -48, 10, -22, -4, -1, 6, -2, -10, -25, -25, -20, -31, -11, 1, 16, 8, 12, 18, 17, -19, 11, 14, 28, 17, -13, 38, 27, 31, 1, 29, 12, 2, 34, -6, 40, 13, 10, 15, 2, 16, -7, -27, 0, -36, -5, -14, -12, -11, -32, 14, -23, -10, -11, -33, 0, -1, 28, -2, 36, -2, -14, 15, 0, 16, 7, 23, -5, -6, 19, 14, 16, 32, 27, 7, 13, 28, 21, 10]
3829A0Mqj3J5jk6KL7l2lnK5j9rL4jQl3jJ7m0L9k9L1Qk1M3jQpj4j1j6J0rJKkK7
3868B0Nl5L4j2pJ3j2J2rk8M8m1NJOqJ0l0L8n6L8j0KJ8J2k2MnK7Lk5RK4rk8J7K
3905A1K7k3k6M4j2mL5m0k2j7M0k2Oj1RnQk3OJ1k4N6l7k5L2j6J0l0J6J8K0l1JK1
3939CJ1j8k3K8L3k6kj0RMK8l7K2j7J8k1mL0j2nl2L6l2K0jRlj5rK3oQj3k5J9nk3
3976c8OL1Rl6J0J3K9jl1kL1oMk5M3k3k3K2qLj1nK8J6m7K4j7K7k4mk4L7j1pK4j8
4012dk1J2Kj9PMnrL0Kkj2pkLJ8j5K0NJ2l0OlK2K1m2K6k0J8k5j6k2M5QK1k6Kl9
4050c5J4J6nMKpk6K7J9l6M0k6k3J0j8L1oL9j8J5LJok2K2j7lK4pm0J0L4k9L9l6
4085a0kK3k6QPk2K4l4L2lj6%K6n0K4J2%%j5Mj8L7J%k2K1RMj4MkL5lj1m1L5mJ5
$$ y = [10, 14, 6, -7, 8, 7, -19, -17, 20, -12, -15, -20, 5, -14, -23, 11, 10, 18, -15, -16, 1, -39, 0, -29, 2, 10, -11, 32, 31, 39, 32, 18, 7, -9, 1, -8, -7, -5, -7, 20, 25, -10, 24, 12, 5, 18, 6, 18, 9, -19, 29, -12, -7, -6, 0, -8, 2, -28, 10, -46, -8, -18, -16, 2, 14, -8, -4, -9, 18, 21, -4, 5, 29, 20, -8, 9, 11, 38, 15, -11, 33, 21, 17, 52, 12, -10, -27, 13, -9, -3, -14, -5, -10, -2, -25, -19, -8, -32, 24, -13, -38, -6, -22, -12, -42, -26, -8, 12, -19, -18, 3, 14, -4, -27, 1, 34, 8, 6, -4, 5, 9, 37, 0, 22, 5, 23, 2, -2, 28, 16, 11, -21, 15, -17, 3, 2, 11, 8, -7, -16, 7, 1, 9, -4, -29, -10, -15, -38, -32, -1, 8, -28, -18, -5, 24, 23, -8, -10, 21, 15, 19, -6, 37, 14, -9, 13, 5, 8, -3, -8, 20, 36, -11, 13, -4, 23, -1, -5, -29, 8, -3, -10, 14, -4, -25, -13, -11, -30, -23, -19, -24, -33, -3, -1, -3, -15, -22, -24, -21, -3, -18, 2, 7, 19, -11, -5, -8, 14, 35, -7, 19, -1, 17, -8, -24, -46, -1, 7, 28, 2, 4, -35, -21, -5, -10, -6, -4, -11, -37, -10, 9, -27, 13, -13, -36, -26, -44, -13, -19, 20, 2, 17, 20, 21, 15, -7, 15, -2, -5, 19, 12, -28, -18, 16, -13, 26, -10, -12, 11, -15, -7, 0, -22, 2, -32, 0, -3, -19, -19, 7, -43, -19, -7, -7, -7, -22, -18, -36, 1, 2, 2, -20, 1, 10, 14, 0, 4, 2, 37, 34, 23, -18, 17, 13, 28]
4123B8j6j0QMMj3j5K2qj0lj9K2rL5l4PJ6k9oL6k1k7J3K7j9J5Oj3J1nlK2l4K3%
4159EO%Lk1L1j5j1K1j2j0mpJ6j4K4j8jJ4j0pK3m3K6k4j2L4j0moQj4K9Ojk9M2j1
4196DrJ1j2k2L8J4L2l5Qk3J2l0L2k2QJ6j9mj5LK2qmqK7nn3M4qk1L1j6Pj6J8J4
4232A1l0kqlM3Nj5j1PK0M3m5j5J1j2KJ3j8j1L3rMJ2m2RkNj6K2J7mk7j4J7J2J4
4268A6k7qkJ2J9j5OJlJ2j7J8l8K8LOjmK9k6j0J6K6Rj4k0Rj6KM%oj4QKJ3rk1Qn
4308iK1k0Qk9J1J6J4Ol4K3okk2J1J0olM0Pj1k6K0j0PJk7M8k0Ok8J8MK4l1j2J5
4344A4j8J0LKk2J6Mj3j8J3Lm3N9l6K0k4K1K1ql5L0j6K4k5N1m0PnK7kKm2K6J4m
4379A6nqk3K3lQJj8J6J4Jl0K4l1jK8l5qK8Kj9MMnJ8PJ4m3J1L6k1J4JPk6l0N5k1
$$ y = [28, 12, 2, 10, 14, 18, 5, -10, 12, 4, -6, -9, -28, -6, -15, 20, -14, -7, 9, -20, -26, 10, -11, -38, -25, 2, -17, -2, 4, -9, 2, -3, -6, 16, -18, 5, 5, 11, 11, 14, -7, 24, 9, -2, 19, 7, -3, -7, -14, 2, -12, 12, -6, -7, 7, -3, -10, 13, -30, -4, -28, -40, -6, -16, -20, -26, -18, -32, -3, 3, 2, -27, 15, 4, -5, 6, -6, -28, 10, 24, 56, 21, 29, 6, 18, -12, 20, -2, 6, 22, 3, -1, -16, -13, 9, 1, -3, -11, 16, 11, -42, 2, -6, -27, 4, -12, -5, -21, -3, 11, -19, -21, -29, -32, 11, 16, 1, -10, -3, 17, 60, 15, 0, 11, -1, 1, 14, -4, -15, 18, 9, 13, 25, -17, -8, -10, -5, -21, 1, 18, 14, -13, -27, -10, 2, 16, -11, -19, -21, -9, 10, -5, 1, 2, -1, 11, -6, 12, -26, 2, 5, 11, 10, 6, 35, 9, -1, 15, 41, 50, 36, 16, 25, 9, 11, 15, 15, 9, -5, 3, 5, 18, 9, -12, -4, -9, 12, -8, 0, -29, -18, -2, 12, 18, -16, 7, 1, -1, -23, -12, -2, -8, -11, 29, 36, 25, -1, 19, 9, 16, 17, -10, 38, 18, 24, -4, 14, 18, 42, 11, -1, 14, -4, 6, 9, 11, -11, 5, 9, -4, -22, -9, -6, -49, 10, -26, -6, -30, -9, 12, 4, -31, -1, -17, 7, -18, 33, -7, 0, -5, 22, 20, 22, -20, 6, 20, 16, 11, 3, -20, 3, 0, 8, 9, -9, 7, 21, 22, -8, 16, -15, -16, 12, -23, -31, -3, -1, -20, -16, -12, -17, 1, 8, 22, -21, -10, 26, 5, 19, 20, 27, 1, -29, 26, 5]
4417EJ2rrK4k7PJ8rnj6NrJ2mJ1j5kjJL8k9kJk9L5k8J9k0LL9Kj0l0JM3k6J7nnk1
4457a8N3l0j2M2j6j0J0Kqj9J5j5MJmlK0Mk4J5j4NLk7QJ5j8J6J2j4rL4j0l0K1N
4493Dj4K6%Ol3O0m4K2onLKll2K7k4K0k2M2k8LqJ0j5jK1j9l%Qrj7L4j9roRJ8l1
4532c3J4oRK1j6NK6j6K3k3KK7pk3j1K2j9K4J2Rk8krJ7On1L3LJrKj0j4K4k6K5j5
4569a3J5j4J2l1L0lJ5Qj1jMj4j9K9j8J5nJ9%J5l6L1ol8RMM4k5k7Pj3RPj9kK6K7
4606C1km5Jj3PJ2L1pl6RoOkK7j7j9J6K8nJRj1k5K0PMKMKJqk2qM4m3rmK0Lj9Nj2
4648b3KK1k2J1kQk0%K5k5L0k1K9j7j0K5n%Qj5Lj1NJ3Ok0M1j8Qj6kJ5K9m6%rj6
4685a9J5J2Knj6PjNj5NnJ7j6qJ4J6%n3J9N0j9k1J8j1lL7oPj4J1J4l6QPL6j2j3
$$ y = [5, 17, 8, -1, 23, -4, 3, 21, 12, 7, -9, -4, -13, -1, -5, 6, -9, -11, -12, -11, 27, -2, -4, -3, -32, 3, -25, -6, -26, -23, 16, 18, 8, -22, -21, 22, -4, 13, 8, 3, -18, 35, 5, -7, 35, 19, 9, 19, 21, 13, -6, 9, -6, -2, -1, -5, -8, 12, 16, -8, 7, -7, -2, 1, -26, -18, -3, -21, -5, 7, -7, -16, 18, 8, -22, -1, 4, -10, 16, 16, 22, -11, 49, 5, 27, 21, 16, 19, 21, 18, -14, 13, -11, 9, -13, 29, 1, 4, -4, 6, -9, -10, 11, -8, -11, -11, -3, -12, -29, 5, -14, -23, -29, -20, -2, -33, -19, -25, -16, 5, -11, -6, 20, 4, 27, 4, 6, 33, 26, 3, -8, 14, -5, 19, 31, 40, 12, 10, 1, 18, 24, -27, 6, 9, 10, 1, 3, -7, -21, 3, -23, 2, -13, 2, -12, 0, -31, -1, -4, 11, 19, 8, 7, 11, -3, -22, 7, -11, 4, -1, 18, 18, 33, -3, 28, 22, -16, -7, -3, 41, 16, -11, -4, -17, -8, -1, -20, -22, 4, 31, 29, -16, -15, -28, -21, -9, 22, 15, -21, -12, -18, -12, -14, 13, -4, -23, -7, 21, 16, 17, 26, 15, -10, 10, 17, 21, 23, 27, 29, 30, 22, 0, -8, 36, -7, -16, -20, 0, 3, -16, -11, -23, -21, 0, -22, -11, -13, -5, -25, -25, 0, -25, 5, -16, 13, -4, -14, 11, 6, 6, 14, -1, 2, -9, -4, 9, 15, -5, 36, 18, 26, 10, 8, 23, 52, 6, 6, -3, -19, -4, 8, 10, 5, -11, -4, -5, 0, -15, -10, -15, 2, -14, -22, -8, 8, 8, -45, -26, 24, 5, -16, 2, -9, -12, 25, 19, 26, 12, 23, 37, 1, 9, 16, 52, 40, 27]
4722B7llJ7j9j6j2k0OK7l2K9k9J3nJ9j0k2K6LqK0j5j1K7m0L6j9M9o1M1qrK0k8
4756a0M4l0rJ5J2jj5K0l1L7j7L9n9QrMj8J8j2LK0Kj0k1J9J0k4l1L0QKnj4k0L2
4791a3LMK4ol6K4j2L2Nl3K8oqj8K9L0m1KLLj5K5k0rM8o7J4pK4rk3J0PMj6J3J4
4828Gl7L7qk0K2QKJ6j4J0j3LPj6JlMK4k9mQk2K7lJ0J6l9KJ4Mm3J8L1k5nJ5Jk0
4866a4J5J1m6NJ9kk0J6MJ3J5mpKj6NJ0lJ4j3J1j9J9j6jKNJL2l7j8M4Kj2nkok5
4904b1J4j5M0k5pQLmJ0Kk3J0K4l0J7NJ7j9ojJ1K2rpRj8j8J5LOk9L4lmk4QJ2Lk9
4943a9JlJ5j8RK0pk4Qj1K7Kj9K1j6j6J5KJK9j7j3J3QRj0J4pJmrJ8j9L7j9k7K1
4980A3Ql8L9j8nk0pK7J4m0M2Ol1k6NK0Mj5OK3j2Ok0J0J7kpOJ6k0j9M8j9L5l1J
$$ y = [27, 24, 21, 38, 19, 3, -9, -29, -23, 4, -28, 1, -28, -15, -20, -1, -11, -33, -7, -4, -12, 8, -7, -18, 9, -31, 5, -14, 35, -26, 15, 7, -2, 18, -10, 34, 4, -5, 10, 22, 21, 6, 26, -5, 32, 15, 54, -5, 3, -6, -2, -20, -2, -14, -11, 9, 11, 1, -20, -1, 9, -15, -46, -16, -8, -6, -11, -25, -45, -13, -10, -6, 18, 12, -24, 0, -12, 20, 25, -8, 20, 14, 6, -12, 17, 47, 6, 8, 11, 14, -1, 24, 4, -5, 43, -24, -10, -17, 7, -2, -25, -15, -8, -4, -20, -7, 7, -30, 7, -1, -21, 1, 9, 11, 27, 13, 23, 10, 13, 20, 4, 5, 2, 6, 30, 1, -3, 5, -17, 10, 7, 17, 33, -6, -4, 10, 14, -29, -11, 20, -5, -10, 5, 6, -14, 1, 12, -34, -29, -10, -12, -32, -16, -12, 1, 16, 12, 5, 7, -9, -4, 6, 3, 17, 4, 15, -4, 15, -1, -2, 0, 5, 6, 38, 1, -17, 27, 29, 17, 12, 10, 4, -21, -7, -22, 18, -7, -14, -6, -3, -7, 3, 5, -18, -8, 16, -14, 3, 8, 25, 6, 0, -1, 10, 32, 23, 16, 25, 7, -11, 4, 7, 13, -16, 18, 15, 11, -13, -5, 7, 10, -19, -18, -21, -6, -24, -15, 5, -2, -26, -18, -29, -2, 0, -19, 2, -14, -30, -15, -13, -12, 17, 0, -13, 0, 8, 17, 7, 21, 14, 15, 11, 2, 20, 1, 38, 19, -8, 13, 21, -17, 22, 4, -1, -21, -28, -1, 13, -27, 15, 21, -10, -36, -31, -11, -7, -22, -16, 7, -5, 1, -19, -9, 8, 6, -1, 5, 21, 1, -18, 30, 11, 46, 15, 16]
5016A6K7l6mj7M6k1pk5K9j1j1mJ8j8L0%m7J3J7l6K3KojK6mOrNj9L1j3l1K8PLo
5053AJ3rL1m5K9j3J7kkl3M5oj1l0OnK5J6m2K1Jl2L9Km6L4kk3J6m7K6K8j2J1%%
5089Al3K7J0l3N6m0J9K0k1MK8j0J6l5lJ9rJ6k6K5j5j7J9m1J7Pq%l1QK3L2m7K3
5123Aom4L4j5L2j5Ol1N9l7M3j5LRk8qL0rj1PRl1L1m1J9QQj5K3j5J4qnj0koL4l1
5161a3J3j1k5J8J3k6NjK0j1J6k1jpL9Nj7K2pk7MJ4j1N0pj5j6J6Qk4Kj3K0j2PO
5197A3j9K8l0j3NNJ1mJ5l0k6L8rLL3k7oJ9Nj6J3k8J6nJ1j8J5K7k2K8j6k2nL4j6
5232GknMJ5lk7L0Mk1QJ7m8J8q%j9J4pj1lK4j8L6lK1m6L6j0k5J7k2L3pPNj4K1n
5270A3QjJ7rl%%Nj3k4%MOMoMjJlk3M5l4nJ5j5oJ0k4J9L1j0Rk3lK2Jl1kL8Pk4K7
$$ y = [16, 43, 7, 3, -14, 32, 11, 4, -21, 8, -3, -14, -18, 0, -18, 12, 12, -35, -22, -5, -41, -18, -16, -22, -23, 3, -1, 5, -4, 1, -18, 13, 0, -31, -3, 4, 7, 1, 14, 5, 36, -9, 20, 7, 24, 22, 20, -13, 32, 26, 15, -15, -9, -14, 11, 27, -15, 6, 7, -25, 14, 16, -30, 4, 2, -21, -5, -52, -26, 2, -10, 1, 1, 1, -32, -5, 5, -28, 28, -12, 7, 27, 6, 10, 38, 28, 44, 9, 6, 25, 16, 32, 6, 31, 16, -1, 18, -23, -6, 1, -7, -7, -38, -30, -7, 25, -22, 1, -5, -49, -15, -30, 2, -13, -7, -38, 21, -16, 27, 12, 15, 24, -4, -12, 18, 9, -2, 5, 14, -17, 14, -27, -8, 0, 8, -7, 16, 1, 15, 7, 2, -8, -10, -16, 18, -13, 0, -11, -36, -18, -5, -31, -26, -27, -7, -18, -2, -23, -24, -31, 8, 13, -4, 18, 11, -16, -12, 2, -9, 41, 34, 19, 3, 19, 27, 3, 5, -8, 12, 0, 7, 13, -6, 22, -8, -21, -16, -11, 0, -4, 11, -19, -45, -7, -16, -13, 20, -7, -13, 6, 11, -5, 8, -20, -4, -9, 2, -16, -1, 26, 4, 32, 16, -6, -11, 23, 7, 5, 0, 4, 19, 16, -11, 19, 23, 2, 10, 27, -21, -3, -11, -11, -30, -16, -23, -34, -37, -13, -31, 5, 2, 23, -23, 13, 3, -22, -5, -27, 6, -1, 6, 11, -3, 18, 13, 21, 20, 37, 28, 25, 25, 25, 30, 17, -7, -7, -3, 3, 7, 1, 5, 4, 5, 2, -21, 24, -10, -15, 0, -15, -21, -11, -35, -16, 15, 5, 14, -9, -12, 10, 11, -20, -22, 16, 23, -1, 26]
5312B6Pk5K4j9lQqk1J7%Pj9QK4q1J2K5nLJ7Qj7j1j5K0K1mm3K4J0J5k0K0m4L7J1
5348IJ7k6lnL1Qj7j1J4j1QJ2j4kRrQMl9M1j2k8j1K6nMqK7l6l3J2K9JnJ0J6j8J5
5386HQk4J0J3Rm1K8J9Kk8J2krJ2Rk0Nk5L7om3M5J0k7J5m7K5Oj1J0l0L7j7K4j5
5421al2K1MrOJ0nJK1l7M7j1K1j3j1J2k4LMJ5l3J3mjj8L6RNMl6Rok4J9j0LJ2j6
5459a6rk7L6J2kNj7K2j2lpNmMK0K0m1kK5j6L8l3J6j9K1k8mJ0J2%lRnQqQpr%j2
5499a3j1M1k2%J3mj6rrLQkK0j2OJ8kk5L7%l5M8m2L3m4L2%k0J0L9l7j0kP%J9ol
5537A0knknJ2k0K0qqJ2m7M0Ll5N7o7J3L5L5n6K5j0M0l6kJ2Jk1Rj3K7K0k9L0j6
5572A9L0o1l7P7q%qrK1k8ml0L9j7K4j5JK7k4Pk9J9Qj6rj3L2j9K1kjK2Rk2mJ8J2
$$ y = [26, 33, 8, 32, 13, 10, 18, 10, -11, 6, 6, 13, -6, 2, 26, -55, -43, -18, -23, -20, -3, 5, -12, -23, -38, -18, 3, -1, -44, -20, -10, 5, -15, 5, -39, -2, 9, 26, 0, -3, -8, 23, 31, 14, 3, 17, 6, 14, 26, 12, 10, 19, 10, 18, 22, -17, 24, 12, -16, -27, -1, -6, -2, -10, 17, -19, -52, -40, -11, -10, -15, -5, 11, -7, 8, 16, -8, 2, 15, 24, -17, 11, 30, 32, 4, 16, 14, 5, 17, 26, 6, 11, -14, 23, 17, -26, 19, 29, 2, 17, -30, -5, 1, -10, 0, -30, 7, -10, 14, -1, -33, -12, -8, -17, -11, -1, -6, -5, 16, -21, 26, 15, 36, 23, 12, 24, 0, 3, 7, 22, -11, 2, -2, -3, -21, 15, 24, 29, 33, -3, 6, 0, -24, -5, -15, -12, 0, -16, -25, -52, -16, -4, -6, -1, -18, 4, -8, -11, -18, -13, -17, -13, 7, 27, -14, -16, 9, -7, 31, -2, 14, -5, 16, -12, -16, -6, 6, 6, 3, 12, 7, 15, 7, 15, 8, -1, -1, -13, -24, 17, -5, -5, 8, 4, -12, -21, -30, -27, -19, -21, -1, -13, -7, 11, 9, -16, 21, 21, -14, 34, -8, 25, -19, 13, 13, -7, 3, 42, 5, -5, -7, 0, 0, 19, 13, 10, 8, 3, 1, -4, 8, -12, 8, 0, -8, 4, -43, -3, 0, -35, 22, -45, -32, 3, 38, -18, 7, -3, 37, 1, -1, 11, 12, -9, 0, -13, 14, 34, 5, 35, 19, 49, -12, -49, 28, 20, 20, 12, 3, 24, -4, -8, -38, 1, -16, 8, -7, -6, 21, -3, 4, -25, -6, 2, -14, -23, -36, -4, -23, -2, -4, -5, 17, 26, 4, 0, 18, 30]
5609C0Ml7M0mk8J3k5K2j9J2k4qN3kk8k6K7j5k3J4M8n4LQKJ3J4j5nr%L2j0J3j8
5644bpJ5LKjnKKQj1J9lPj6mj7K9lMk3qJ2K4j4j6PKjKOl4K3l4J8Kj0NK2pk4K9p
5686dlM4j8k0K2kqrJ4%Pj6J6%m4K3M3k2j4rJ9ok4L0j7k8J7ppK7k0J4j6Kl2L8P
5723cPj7JmK7l5K7RQj1j6nM6j4j8J8l7J3PqJ3K9k6Okknj0J3oj7K9m0K5k3K6j7
5760a2k6N0n6K1Nj8J6L1j7Oj1J7L4o7M1j9J8%J2Kk5K1j2PK7l5loj2oRnK2ooJ1
5796Hj8j3K2k8K2oJ3nkJ6j2J3k6K9k9PLj6K7J3l0L2J2j7%NqKOj2m%J5m2L9J6k7
5833Ej4JK5Nm1L6j2K6l8l0K0J3j0k6M2lj8JJ1m%NJ6J0m6L6nK9l6PLpNrnM4k0J4
5871C0l5K3j4j0J2Mj1K2kkok8L7m7L0k4J3J5j4j8K1kKmj8mO1n4K9rNlk7L9J1k1
$$ y = [30, 34, -3, 37, 33, 5, 18, -7, 15, -4, 8, -16, -24, 29, 27, -1, -27, 0, -15, -38, -24, 24, -30, -27, -19, -17, -4, 10, -5, -10, -19, -19, 13, 3, 16, -2, -9, 6, 9, 11, 10, 5, 7, 9, 17, 6, 25, 22, 29, 13, 9, -8, 21, 18, 22, -1, -9, 3, 27, 13, -3, 4, 6, 5, 7, 13, -21, 2, -32, -14, -12, -22, -17, 5, -2, -26, 3, -4, -7, 37, 19, -1, 21, 19, 11, 2, 16, 16, 23, 7, 23, 23, -21, 2, 45, 23, 9, 0, 19, 13, -11, 19, 2, -26, -9, -16, -23, 4, -16, -2, -18, -16, -48, -10, -3, 4, -13, -12, -16, 11, -24, 3, 12, 20, 9, -7, -12, 34, 20, 2, 20, -17, -4, 3, -5, 8, 37, 11, 17, 15, 13, 8, -2, 11, 5, -12, 17, -23, 2, -21, 5, -12, -38, 12, -44, -23, -18, -36, -20, 11, -6, 0, -11, 6, 40, -27, 14, -5, 13, 13, 25, 27, 2, 23, 11, 18, 45, 10, 7, 1, -11, -17, -8, -13, 9, 3, -3, 8, -10, -23, -1, -29, -7, -13, 0, -5, -7, 9, -3, 10, -16, 13, -16, -9, -6, -22, 5, 18, -12, 20, 32, 15, 15, 20, 12, 14, 20, 8, 4, 4, 19, -23, 16, 32, 5, -9, -8, 17, 22, -19, 17, 5, 31, -7, -37, -17, -4, -14, -40, 2, -1, -19, -18, -7, -11, -11, -6, 10, 20, -26, 10, 5, 34, -2, 5, 8, 1, 6, -3, -8, 36, 16, 30, -5, 18, 4, -6, 6, 10, -1, 21, 19, 17, 11, -17, 20, -27, 3, -21, -8, 7, -7, -25, -4, -6, -4, -8, -26, -30, 31, -23, 6, -3, 2, -1, -28, 11, 22, 1]
5907AJ4OrLl4L2k2K3pM0rj8k4jOrj3K5jj5OK6j3Nk1j9L7j1Pj8K7k6J6j5K4Lj2
5944D%nJ4LjOrL5j0k7j0L6j8K3rm0J3J9rpjk7J2RJ0j2ok6J7jRQPj8Rk3M6j3l0
5983b2J0K4j1J7k0J3k5J2K5lj1J9oJ3m5LJ1jK6m1J0J1Lj0Oj0j7J0R%lj6L5k1K
6018cOk7jL1Kpk6J7%OqL8k1J7pLnNL9j1j2j1jJ0l4K0pkOk1J9k5N3o1J2j2J3J0
6056Ej3oJ4j4k1K5PJ7l7KJ5j1PJ4J5j6mJkNj0L5qJ0k5N4n9LJ2rJ1Jj0J2j4J1l0
6093a3K2k3J4K4j7rjjl6O4l2j3J6NK0n2O1l8oM3k8kKOJ2J1KRl0lJ2Jk3L0l4K8
6129B1Ml7N3k6n5N8npomk0J2RKl9K2J8k6J5k2L0MRnj9K6j4l1K2K2L0l6lJ6l3K2
6165GK2j8OpJ5k0K3m%j6j3PK5k5nJ5Ll0jK0ml6M4Jl0J9l5O2l2l2K3%J1J5mJ6j4
$$ y = [1, 15, 21, 12, 15, -19, 13, -9, 14, 7, 47, 38, 20, -4, -5, 1, -8, -21, 4, 3, -12, -6, 20, 7, 12, -9, -28, 9, -2, 5, -13, 14, -12, 4, -11, 13, 16, 4, 4, -1, 13, 16, 15, 21, 12, 47, 37, 10, 0, 36, 18, 41, 32, -8, 5, 24, 15, 8, 7, -20, -8, 1, 11, -1, -7, -33, -16, -17, -8, 0, 7, -11, -2, -25, 21, 8, -22, -12, 12, 1, 18, -2, 11, -14, -2, 23, 20, 9, 28, 22, 35, -10, -7, 4, 3, 29, -12, -2, 9, 12, 2, 8, -2, -19, -9, 0, 0, -3, -19, 16, -5, -3, 3, -24, -25, 6, 8, 1, -25, -8, -8, -2, -10, 28, 7, 24, 17, 20, 15, 20, 59, 48, 36, 25, 24, 34, 0, 20, 13, 11, 17, -4, 15, -10, 43, -18, -6, -18, -5, 5, -8, -14, 0, -14, -35, -10, -3, 14, -23, -21, -6, -17, -10, 4, 19, 3, -1, 0, -2, 3, -7, 28, 20, 30, 5, 59, 0, 3, 15, 6, 17, 18, 8, 20, 6, 17, -13, 9, -14, 0, 24, 7, -2, -3, -4, -40, 24, -8, -21, -5, 0, 20, -32, 29, -9, -15, 28, 0, -2, 0, 6, 18, 29, 31, 40, 10, 7, 19, 20, -3, 27, -7, 21, 25, -12, 41, 15, -40, 18, 13, 6, 0, -4, -24, -12, -3, -1, -40, -18, 0, -26, -11, -33, -3, 1, 10, 5, -14, 12, -2, -33, -11, 11, 41, 5, 2, 18, -15, 7, 29, 11, 17, 10, 25, 5, 28, 24, 24, 8, -5, 2, 27, 2, -3, 12, 15, -15, -16, 4, 0, -36, 8, 9, -21, -2, -37, 25, -7, -39, -16, -16, -5, 10, 6, 22, 8]
6202HqJ9K2o4L5J2LJ1ok7K8oRmpKk4j3L5j5oK7k1m6M1l2L0Mk3K0j1j4oJ%PJ4r
6240a4L0lRm1K2J5j0kK4k0j4KMK3l2L4l1oJ8j7J4J4k0J2n3L9%K0knm8K6k5L0J4
6275Gj6RKl4J3LL9k3K3j2j%j1J6K2k8j5M0m0j0L4j0J0j7J1k9J1L0k6Pj9j4RL0
6309A1jLk9Qk3mK2j1Rlj3K3j1J6l0K0mJJ1K9k0nMPLnQmj1j1J8kJ0k9K0j1KoJn0
6349e7O0krj0Kj%KJ0j9L7j1k9K4j8J8JPj5L9m2mJ5%QNMk3Qj0L4k5J1J4j1j0KP
6387A2j5L4j4k7J2pmJ6l0MJ5j4J6n%k4J2pL6ql5M7l1QL1j7k2K8koJ7nK7k3k3K1
6423A7J4qj8q%J8j9M6n8N1nj2m5M1k1Ok5M7Mn9K5pJ0RoqL2k5k3L2j3%K1j6JK0
6459A8m4M6j2MKNq%j4ORjj0JPk0PJ1mQk4k6L8j8J9j2Mj6rJ0QJMj8K0J3j4K8lK9
$$ y = [8, 0, 19, 41, -23, 12, 24, 27, 38, 32, 5, 33, 27, 36, 32, 25, 27, 3, -10, 25, 10, 4, 31, 10, -36, 5, -27, 3, 7, -16, 4, -7, -21, -27, -26, -26, -19, -5, -14, 16, 13, 22, -19, 3, 18, 8, 6, 30, 10, -4, -2, 2, 25, -7, 27, -4, -10, 8, -9, 5, 19, -1, 11, -42, -3, -3, 17, 15, 10, -38, -12, -37, -7, 7, -9, 0, 2, -32, -19, -16, 23, 0, 23, 11, 10, 10, -1, 15, 37, 9, -6, 34, -6, -16, 18, 8, 18, 1, 12, -17, -6, 24, -2, 5, -14, -28, -19, 11, 10, 13, -16, -8, -31, -35, -13, -24, -15, -18, -31, -8, -19, -3, -33, -13, -17, -16, -5, 24, 4, -1, 3, 10, 13, 8, 16, 12, 1, -10, 8, 6, 16, -13, 7, -4, -2, -8, -7, -57, 3, 1, -8, -18, -16, -17, -17, -15, -5, -24, 13, 2, -27, -3, -21, -3, -2, 5, -10, 29, -13, -17, -2, -2, 6, 11, 15, -8, 0, -10, 24, -1, 10, 24, 13, 3, 5, 12, -3, 31, 17, -10, 2, -5, -9, 7, -23, -19, -4, -18, -2, -7, -7, -31, -19, -26, 10, 2, -33, 14, -17, -9, 22, 5, -17, 11, 9, 3, 20, 15, 42, 19, -4, 17, 31, 23, 5, -3, -3, 15, -4, 42, -16, 35, 30, 18, -27, 14, -7, -1, -26, 21, 25, -34, -9, -16, -6, 3, -3, -11, 21, -4, -27, 5, -8, -8, 13, -3, -2, 18, -26, 20, 8, 12, 14, 19, 11, 11, -3, 3, 12, 11, 1, 2, 9, -11, -4, 7, 3, 11, -13, -39, -1, -19, 0, -12, -8, -24, -33, -23, -15, -14, -10, -28, -8, 5, -9, 19, 16, 45]
6499D5n0PNOJ2Mlj0K8m1K1%m8lL7k2L0m5M9l6j0L1Oj8j1Pl6M1kj3J6OnQok8J2
6536a6J6Kk9L7j5OQJ2NJ7j6j2j5J3j2QJ3rJLoJ0Qm8L5Pj3J0l0k2J6oj5L2LJk8
6573b9N0lj3pJ8j9mQrj8K2%K5Nj7k0J2KJ0J9rqOpJqLl5L5oNJ5n5M0j8MJ9k4r%
6613a9LJ9j4j3J7%Mk1L2j5pJJ2K9j9J8qj2Rnj2J6k1RlRL1k9LoQj0j3kJ6pmK3P
6652B6k0j3l3J5oM5l2J3J4K9m6jk3K8K2k5M1k3j9K9OoJ9k9MKk1oK2Qk5J7L6n9
6686a1JlL7k7J6k0K5j9J4n4K0RJ5%j2JQj7QK4k8jknL3nJ8qJ0lk1M3l5NnK8l3R
6724A5k1K3k1kM9o3K1J4k2M0l9j3J6m7O0m5K3j3J8J7j4j2Pk2K9J7j4j2K7j4Pq
6756AqMJ9K1p0N8j2J7k0Jqj1K2KMl5%K9j4K4Rl5pj5J2Jj2J3L7o2K4L5Ql9j2J4
$$ y = [45, -5, 2, 7, 13, 25, 29, 26, 16, 44, 3, 24, 24, -24, -27, 10, -12, 18, -27, 22, -14, -24, 7, 13, -5, -16, -9, -45, -4, -6, -19, -3, 3, -2, 6, 0, -28, -16, 0, 2, -27, 10, -5, 1, 9, 21, 26, 43, 27, 15, 0, 13, 1, 9, 22, 13, 14, 17, 11, 21, 29, -19, 16, 23, 10, 20, -10, -32, -16, -22, -37, -5, -2, -1, -29, 21, 18, 5, -2, 16, -3, -7, 1, -8, -26, -4, -4, 21, 26, 9, -11, 1, 3, 13, 32, 23, 15, 21, 14, 15, 7, 10, -25, 10, 4, 9, 24, -31, 9, -9, -5, 14, -10, -19, -19, -16, 3, -11, -24, -7, -7, -3, -24, 8, -7, -14, -13, -1, 28, 9, 27, 19, 7, 16, 11, -1, 15, -6, 3, 0, 9, 40, 11, 14, 8, 16, 6, -7, -9, 7, 0, -4, 19, 26, 6, -7, -40, -25, -31, 14, -18, -5, 9, 38, -8, -9, -32, -4, 18, -7, 34, 11, -8, 21, 27, 21, 40, 11, 15, 17, -4, -10, 12, 20, -5, 12, 48, -11, -10, -13, 24, -3, 13, -7, 18, -1, 13, -41, -21, -12, 3, 3, -9, -8, 0, -17, -9, 15, -13, -14, -16, -21, 12, 7, 25, 17, 27, 24, 3, 46, 11, 16, 11, 39, 6, 15, -6, 17, -4, -6, 43, -20, 1, 15, -7, 33, -6, -19, -3, -50, 10, -35, -12, -25, -7, 10, -4, -16, -9, -31, -2, 15, 1, -11, 16, 2, 9, 1, -7, -3, 16, 37, -33, 25, 13, 30, 10, 11, 3, -8, 14, 16, 20, -15, -15, 14, 0, 24, 33, -2, -9, -24, -12, -11, -23, -10, 27, -35, -11, 24, 32, -7, -19, -5]
6792ekJ7Nlj2J3J6k6PMk1L0Lj1prl8N2k2K0Jk8K1Qj3k5L6k1qJ6Jj0Jj5J3pL3j8
6830dj2%J7%l8J3J3j0L1k6N3l5oRJ3j5Qk1J3J5J2j2Mnjj5NJ2k6K8j3l8L7j9J6
6865CJj7P%J1m4J9LJ2J6j8k6K7J9Nj9kJJ3LpJ6Qmk2J7j2kpMJ1j1qPLl7K4K7o0
6904c9J7K8Ok4j1J0ompK8j6NK0nj2nK1Nl7M3l8J1Pk2J8N7n9M1Ml0L1k4lJ2K5l6
6940A1Jl5K4Mk0L2k3Lmj3QLn1M9MJ6k1J3rllJJ%K7m7N2PppLmnQJ5njjj2jJ6ql8
6983b0L8k1j2K9k3L5l4j5K3J1Ol1lk3L3jJ2k4J0P%Rm5L8j4l1Q5k0k2J6qoPJ0k
7018A4NKj0j3K8NJ2m8k1J0L0j4jqJ9j4j8K4k0k8L0l4N2k3L2ml0K5l8L7Jj6J6K
7052DJ0L0r2N6K9k9j1L0j5%kJ0l9M3j3j7L9k5qkj3MoK9k2J3Omjk1lJ4Rl8K5MM
$$ y = [-5, -7, 10, 15, 12, 0, 13, 29, 3, 10, 14, -7, 23, 26, 15, 8, -1, -39, 13, -9, 11, 12, -16, 5, 13, 0, -25, 11, -10, -18, -2, -1, -11, -10, -25, -12, -19, 14, -4, -16, -16, 1, 1, -37, -24, -11, -21, 10, -16, 37, 2, -4, 5, 18, 3, 11, -10, 3, 18, 30, 18, 22, 17, 16, 1, 6, 18, -8, 20, 7, -31, 6, -13, 3, 4, -13, -6, -6, 5, -39, -20, -17, -5, 11, -7, -33, -6, 13, 18, -1, -3, -2, 11, 14, 7, 23, 31, 27, 5, 22, 10, 8, 1, 5, 16, 5, -3, 4, 7, -30, -6, 21, -39, -22, 6, 12, -12, -23, -13, -19, -23, -30, -2, -18, -13, 7, 2, -10, -15, 6, 11, -26, 17, -21, -10, -3, -25, -7, 50, -9, 32, 36, 6, 37, 13, 10, 22, 47, 11, 12, -23, 1, 5, -15, 17, -6, -3, -7, -20, -12, -9, -60, -11, -7, 9, -12, 1, -8, -11, -14, -13, -12, -12, 15, -32, 20, 27, 20, 13, 16, 12, 7, 15, 30, 25, 24, 23, 11, 10, 26, 18, -20, 18, -3, -15, 14, -9, 26, -8, -23, 0, 11, 17, -14, -17, -40, -7, -8, 4, -20, -10, -3, -3, 6, -39, -1, -15, -46, 39, 19, -3, 13, 5, -1, 6, 16, 14, 19, 21, 11, -2, 26, 31, 43, -5, -26, -16, 14, 0, -1, -9, 10, -4, -22, 2, -18, -46, -16, -50, 2, -21, 11, 7, -23, 2, -36, 1, 2, -14, 2, 4, 14, 44, -48, 8, 37, 8, -3, 27, 12, 12, 10, 20, -19, 24, 11, -6, 33, 8, 0, -2, -15, -11, -17, 12, -10, 3, 9, 5, 4, -17, -20, -6, 3, -35, -10, -6, -2]
7089bK3k3J7pl0L7jJ3k5L4n6O0mjk5%POl1K6l2N1j0l8J9Lj9K0mpQj9j6j2J4K7
7125Cpk0LK7prqj4M2l3K4NJK3l0PJ5l5K8J0k6K4o2M5Mj7K0k5K0m1L1J0j9K0j4
7160ej0QJ6mlj0j1OOLRk8KJ3j2QPMJ3j4J2k6LQOQJ8k3j0L5k3L5m4K7l1K9j9jL8
7199D0m5RMj3Lj4K0Ll2jPj4J9pK4k3K7%l3j1J0N3l3J7J0n0L5j6L3k9K8kk5K4o
7234A2Ql6M2jm0j0M1l0PJ2mk6J5K2j4j3J7j6QPLj5j1PlQK3k1j0RQK8l1J0rK3m
7271A6Rj1O%Oj7J0j7J8rMl9K9j7LL3m3L3l4L2Kj8j2k3K4Ql5J0K6l4K1J1lOk3%
7307b8J1M6n0M9l4J1J1j3J7J6j3nrkOK3j1k7J0j6K0l0J1kj5j0L7Rk4KpJlJ1M2
7342C4j1n7K6jj4QNJ4j5K7j6Qj3oL3j8L4l3j0M1l2k1L6l6J8lk0L0Ol1JJ2Rk0J3
$$ y = [-2, 21, -2, 15, 8, -22, 15, 14, 27, 2, 36, -20, 40, 36, 35, 10, 10, 17, 23, -8, 18, -14, 37, 27, -11, 8, 11, -8, 12, 8, 1, 9, -10, -26, -38, -24, 3, -4, -24, -21, 6, -1, -10, -18, -32, 10, -23, 1, 6, 7, 30, 0, 7, 22, -13, 15, 25, -1, 23, -39, 6, 10, -7, 13, -12, 8, -33, -2, 8, -11, 9, -5, -15, -7, 9, 5, 2, -8, -19, -13, -7, -4, 5, -23, -21, -8, -20, -12, -5, -1, 12, -2, 10, -16, -13, -5, 1, 9, 27, 4, -6, 29, 6, 41, -3, 24, -7, 22, 3, 2, 40, -5, 4, 8, -5, -2, -16, 4, 7, -25, -26, -19, -33, -14, -21, 3, -20, 7, 7, -26, -37, -27, 26, -7, 10, 20, -30, 5, -11, 22, -7, 21, 19, -6, 18, 12, 20, -16, 26, 25, -15, -25, 16, -14, -7, 5, 1, -25, -10, 12, -2, -15, 2, -14, -6, 1, 4, -11, -22, -15, -18, -10, 13, -8, -18, -9, -1, 27, -4, 6, -3, 20, 16, 25, 14, 20, 20, 26, 9, 19, 2, 20, 11, 15, -24, 5, -12, -9, 24, -19, 14, -20, 12, 14, -4, -16, -39, -15, -7, -42, -32, -6, -40, -19, -8, -11, -5, -28, -28, -17, 29, -21, 28, -6, 5, 16, 3, 20, 36, 23, 18, 9, 7, 13, 36, 25, -2, 8, -8, 12, -18, -7, -9, -24, -34, 3, 12, -12, -10, -17, -16, -19, -8, 34, 23, -34, -8, -9, -23, -15, -10, 4, -11, 16, 0, 8, -5, -11, 22, 4, 38, 5, -5, 36, 4, -17, 19, -17, 1, -2, -22, 8, 14, -17, -16, -4, 5, -15, -2]
7377bOqMl0M0qj1%J1j2j0J7K7m2K4J9k4M5o9K3J0j3L8j2j1J7k2L3m4J3Koj0lK6
7412A8m2L8qnj9pL6l4J0l0M5k3J9Mk9K2Pl8L7jlJ2pRk4K0J7pj4QJ4oj6LnkK7l1
7450eK1Qm2L1j2krRj3J6J5l0J2j5%K%j1J1Pk2K1mJ0%j1K6j9J0jj5kL2m1M8j7R
7487A7lJ1mk0K3j4Jk7K8j2Kj2J9j8nL5n7K1jQj8Rj2j3L8j2j8J7OqJ8lL7j5lj2
7523CQj1%K7jj5j3K3Jj9Pk9M6Pm2J0j0J0Kj0%k4K8j8K7k5j3N1n4OJ9j6qL0k1k
7559b6J7j2K6qM%LJ2j3K0k1K2Mkj0k9j9P2k9%J2k5RKJ7l8RKj1K7l2j0J5j2K5j0
7595iR%k8L3kjJ5j2J5l0L1k7K3Kj7j1QM5l7K1j2komJ2j4nK0k4p%PJ5j1%Oj5K9
7633A7j0J3j6l9PK4rk3L4j3PPj4JmOmJ9j7K3j7K6K0n8L7Lj6OJ9o4M5QK2k7oQj0
$$ y = [-2, 4, -4, 0, -30, 10, 2, -9, -9, 2, -10, -20, -3, 24, -18, 6, 25, 1, 46, -23, 0, 10, -3, 35, 23, 12, 29, 7, 40, -4, 9, 11, 5, -5, -8, 18, -24, 14, 6, 1, -18, -25, 11, -23, -13, -43, 2, -21, -2, 2, -27, -5, 2, -36, 1, 0, -3, 9, 2, 11, -13, 7, 24, 17, 3, 11, 25, 19, 3, 6, 1, -1, 26, -5, 16, 24, -18, 13, 1, -1, -10, -1, -14, 2, 17, -13, -1, -16, -16, -14, -14, -25, -14, -7, -29, -8, -12, -2, -2, -13, 13, -6, 4, 3, -12, -14, 18, -23, 25, 8, 17, 14, 25, 21, 1, 24, 10, 11, -16, 12, 0, 2, -10, 9, -9, -14, 21, -36, -15, -16, -8, -26, -17, -29, -42, -4, -16, -34, -17, -11, -19, -1, -4, 33, 18, 15, 3, 11, 0, 0, 27, 26, 11, -2, 21, 22, 3, 10, -19, 27, 34, -8, 2, -8, 2, 4, -6, -6, -30, -2, -20, 7, -18, -31, 20, -34, -28, -9, -25, -33, -3, -24, -26, -9, -21, 5, -3, 1, 1, 4, 16, 3, 23, 2, 24, 28, 26, 16, -13, -32, 40, 11, 11, 23, -2, 7, 9, 26, -12, -3, -1, -12, 15, -17, -27, -12, -24, 1, -9, 0, 0, -28, 5, 3, 2, 17, 5, 20, -10, 21, -6, 17, 19, 2, -9, -1, 44, 7, 28, 16, 14, 8, 4, 16, 2, -3, 17, -7, -14, -14, -7, 8, -3, -3, 3, -12, 17, 7, 20, 4, -35, -28, -4, -13, -36, -2, -15, -8, -1, -15, -14, -18, -12, -16, 3, -14, 9, -8, 18, 38, -20, 17, 20, 4, 10, 29, -35, 10, 18, 40, 13, 7, 15, 5]
7670ElonJ1rlj6L0k1QK3l6MK9k0J3lLj8J1J1j9J5oL5rl3RRmLK5lj5joJ8j0jMl3
7711a4L7jj0Km4Pj2L5mk3j1K7j4j1J8j0K5l6L9J1qJ8j2qkJ7NnJ2pj2k5K5J1Jl
7747A8K3n5L5k8J6j4oj4L7k9L0l6RJ5k6J3j9J8j1Mj8K9J6ooJ9qpmj2M7k1kj0L2
7782B9j0Mk5j5J9L7j0K4k4m0L1j0rk4K0Lk6M3k6j4J4J2K4p2K1PMj6OL0k5rM5m5
7816b7L4J4j8pJ4J0pQl7K8pK4qljMqJ2m0K9j9jORPlj6J3n0K2kj1J4k0M0j0Qj2
7854a1KJNj9PM8l8J1j4j1QK6rj2K0Rj6j5J9l6M3Pk6m%Rmj8L3rj8J7k8NlNl7J4
7892c9L0nJ4km0N7j2l2RJ3J8nk3L5Pk8QJ1k1K3qK0pk3J5J5k6JJ7k3mK7j1k1Kl8
7928d6K0QOj6QROK3j1j9NJ8j2k2J7NLK0j3LnK9k1k7MJ8j7L7K9k7ql8L5k4J2kJ3
$$ y = [5, 2, -4, -9, 2, -7, -10, -26, 4, -17, -9, 14, -22, -18, 11, -9, 4, 1, 4, -14, -3, 8, -11, 4, -2, 33, 24, -9, 0, 9, 5, 8, 33, 30, 15, 14, 8, 26, 16, 15, 19, -14, 23, 22, 12, 14, -30, -23, -35, 0, -4, -27, -38, -11, -25, -36, -18, -28, -3, -39, 0, 11, 3, 21, 9, 1, -1, 16, 21, 16, 28, 21, 9, -16, 9, 20, 21, 18, 41, -14, 21, -7, 9, -5, -11, -25, 12, -17, 13, -23, -14, 1, -25, -12, -31, -13, -24, -20, -38, -9, 7, 1, -5, 14, 6, -1, -5, -17, 30, 9, 7, -3, 29, 19, 23, -2, -17, 2, 39, 29, 53, 29, -11, 20, 10, 1, -23, -3, 0, -26, 17, -9, -23, -9, 3, 27, -45, -24, -17, -13, -29, -23, 7, -18, -27, 18, -27, 7, 21, 3, -4, 10, 20, 13, 21, -16, 12, 5, 29, 21, 18, 17, 21, 13, 25, -15, 14, -5, -6, 0, 9, 16, 13, -3, 10, -40, -18, -20, -31, -17, -37, 3, -7, 1, -11, -9, -8, -3, -22, -15, 33, -5, 6, -8, -19, -11, 15, 6, -6, 14, 23, 7, -8, 11, -25, 18, 25, -1, -5, -5, 4, 0, -18, 15, 6, -12, 5, -23, -18, -21, -16, -53, -39, -9, -14, 0, -2, -42, 15, 3, -29, -20, -7, 11, 6, -17, 18, 25, -3, 5, 16, -5, 18, 10, 30, 23, 0, 15, 30, 4, 5, 22, -1, -5, 22, 11, -10, -8, -46, -26, -18, -12, -28, -20, -11, -5, 18, 7, -12, -7, 11, -1, -23, -6, -1, 2, 22, 9, 12, 7, 36, 15, -12, -8, 10, -7, 30, 59, 32, 24, -14, 21, -3, 9, 7, 20]
7965B0llk0KJ3j0J1m4%J1MK0k3qJMJ2J9pk5L2j2j1J9M1j7j5J9j0j8j1Pj0Qj6K0
8001@lK8j8moK9kl5J6kk9pL2k1%j7J6j4RJ6J5j1k6K0J6lLj0nlJ6NnmNj8L4LrL1
8041D2k8oj1oL8k8Rk6OlJ2llOJ6k7kRl5M3l7L4l9M4m8L9rk6K3JkOrN4j6J4k8j6
8079a2M8l9j4K6rJ4j7J4J9j5J7j5k4J6Lk6K7k1J8k6Jk7K6LRk9QJ1nK2J5l7QJm
8114a4K7k3jM1m6J9K0j1LmJ3k2K6m3L4lj9K1K2l3Pj7J2j8j7K8J4j4nj1J3l5L3
8147cKLj9Ok3J9K1J2j0RMk9L8j8k4L9k2J4mK1k3j3NjOJ2Qj5l1K0K4j3j9Ql5K5
8183fJ4pj6rJ6Lj6L1
$$ y = [20, 17, 14, -6, -4, 9, -1, 10, -34, -34, -23, -19, 1, -22, -30, -29, -25, -13, 6, -1, -26, 6, -6, -17, 2, 43, 26, 11, 30, 20, 2, -9, -2, -12, -4, -20, 0, -3, 25, 7, 3, -3, 26, 24, -11, 5, 3, -26, -33, -1, -22, -22, -39, -23, -37, -28, -12, 3, -8, -34, -14, 2, -1, 2, -8, -13, -16, 0, 5, 0, -4, 1, -17, 17, 20, 11, 42, 14, 8, -3, -9, 29, 1, 10, -16, -10, -13, -1, -4, -7, -1, 15, -12, -14, -5, -40, 3, -34, 0, -39, 5, -43, -4, -13, -39, -16, -15, -17, -11, -20, 34, 18, 32, 4, -12, 36, -3, -17, 9, 0, 14, -3, 11, 30, 15, 32, 17, -7, 9, 12, -14, 13, -8, 10, -16, -15, -42, -16, -13, -4, -33, -25, -14, -19, 3, 18, -19, -11, -10, -14, 13, -10, -11, 30, -16, 3, 23, 12, 15, 11, 24, 2, 28, -15, 19, 16, -3, 18, 40, 7, 14, -3, 9, -9, -26, 2, 16, 2, -3, -14, -1, -36, -3, -1, 2, -17, -11, -34, -15, 6, 18, 8, 17, 21, -8, 30, 12, -12, 27, 5, 19, 15, 36, 13, 0, 5, 4, 10, 22, 30, 15, -16, 4, 28, 15, -4, 4, -31, -6, 8, 1, -15, -24, -8, -5, -21, 10]
8191A0
##END NTUPLES=NMR FID
##END=
