##TITLE=1H_Pr C3-mat
 200.13Hz, CDCl3
 8 sc
31.8.7.2026
##JCAMPDX= 6.0         $$ Bruker NMR JCAMP-DX V2.0
##DATA TYPE= NMR FID
##DATA CLASS= NTUPLES
##ORIGIN= UXNMR, Bruker Analytische Messtechnik GmbH
##OWNER= pz
$$ XWIN-NMR		Version 3.5
$$ Fri Jul 31 14:28:37 2026 Russian Standard Time (UT+4h)  she@DPX200
##.OBSERVE FREQUENCY= 200.1313
##.OBSERVE NUCLEUS= ^1H
##.DELAY= (6, 6)
##.ACQUISITION MODE= SIMULTANEOUS
##.ACQUISITION SCHEME= undefined
##.AVERAGES= 8
##.DIGITISER RES= 18
##SPECTROMETER/DATA SYSTEM= spect
##.PULSE SEQUENCE= zg30
##.SOLVENT NAME= CDCl3
##.SHIFT REFERENCE= (INTERNAL, CDCl3, 0, 14.3821)
##AUDIT TRAIL= $$ (NUMBER, WHEN, WHO, WHERE, WHAT)
$$ ##TITLE= Audit trail, XWIN-NMR		Version 3.5
$$ ##JCAMPDX= 5.01
$$ ##ORIGIN= Bruker BioSpin GmbH
$$ ##OWNER= she
$$ F:/spectra/data/she/nmr/H-C/1/audita.txt
$$ ##AUDIT TRAIL=  $$ (NUMBER, WHEN, WHO, WHERE, WHAT)
(   1,<2026-07-31 14:27:24.78 +0400>,<she>,<DPX200>,
      <created by zg, POWCHK disabled, PULCHK disabled
       configuration hash MD5:
       00 E9 B6 7A A2 85 ED C7 34 08 36 98 17 FE 4E 26
       data hash MD5: 16K
       EA 15 E4 29 5B 49 C1 BB 31 71 B5 2B 79 C7 28 BB>)
$$ ##END=
$$ 
$$ hash MD5
$$ 65 D8 04 19 68 62 14 47 74 C6 C6 DA A6 6B D6 21
##$RELAX= 
##$RELAX= 
##$RELAX= 
##$RELAX= 
##$RELAX= 
##$RELAX= 
$$ Bruker specific parameters
$$ --------------------------
##$DU= <F:/spectra>
##$EXPNO= 1
##$NAME= <H-C>
##$PROCNO= 1
##$TYPE= <nmr>
##$USER= <she>
##$AMP= (0..31)
100 100 100 100 100 100 100 100 100 100 100 100 100 100 100 100 100 100 
100 100 100 100 100 100 100 100 100 100 100 100 100 100 
##$AQSEQ= 0
##$AQ_mod= 1
##$AUNM= <au_zg>
##$AUTOPOS= <>
##$BF1= 200.13
##$BF2= 200.13
##$BF3= 200.13
##$BF4= 200.13
##$BF5= 200.13
##$BF6= 200.13
##$BF7= 200.13
##$BF8= 200.13
##$BYTORDA= 1
##$CFDGTYP= 0
##$CFRGTYP= 5
##$CHEMSTR= <none>
##$CNST= (0..31)
1 1 145 1 1 1 1 1 1 1 1 1 1 1 1 1 1 1 1 1 1 1 1 1 1 1 1 1 1 1 1 1 
##$CPDPRG= <>
##$CPDPRG1= <>
##$CPDPRG2= <>
##$CPDPRG3= <>
##$CPDPRG4= <mlev>
##$CPDPRG5= <mlev>
##$CPDPRG6= <mlev>
##$CPDPRG7= <mlev>
##$CPDPRG8= <mlev>
##$CPDPRGB= <>
##$CPDPRGT= <>
##$D= (0..31)
0 0.7 0 0 0 0 0 0 0 0 0 0.03 0 0 0 0 0 0 0 0 0 0 0 0 0 0 0 0 0 0 0 0 
##$DATE= 1785493644
##$DBL= (0..7)
120 120 120 120 120 120 120 120 
##$DBP= (0..7)
150 150 150 150 150 150 150 150 
##$DBP07= 0
##$DBPNAM0= <>
##$DBPNAM1= <>
##$DBPNAM2= <>
##$DBPNAM3= <>
##$DBPNAM4= <>
##$DBPNAM5= <>
##$DBPNAM6= <>
##$DBPNAM7= <>
##$DBPOAL= (0..7)
0.5 0.5 0.5 0.5 0.5 0.5 0.5 0.5 
##$DBPOFFS= (0..7)
0 0 0 0 0 0 0 0 
##$DE= 6
##$DECBNUC= <off>
##$DECIM= 32
##$DECNUC= <off>
##$DECSTAT= 4
##$DIGMOD= 1
##$DIGTYP= 9
##$DL= (0..7)
0 120 120 120 120 120 120 120 
##$DP= (0..7)
150 150 150 150 150 150 150 150 
##$DP07= 0
##$DPNAME0= <>
##$DPNAME1= <>
##$DPNAME2= <>
##$DPNAME3= <>
##$DPNAME4= <>
##$DPNAME5= <>
##$DPNAME6= <>
##$DPNAME7= <>
##$DPOAL= (0..7)
0.5 0.5 0.5 0.5 0.5 0.5 0.5 0.5 
##$DPOFFS= (0..7)
0 0 0 0 0 0 0 0 
##$DQDMODE= 0
##$DR= 18
##$DS= 0
##$DSLIST= <SSSSSSSSSSSSSSS>
$$ [...]
##$SUBNAM0= <"">
##$SUBNAM1= <"">
##$SUBNAM2= <"">
##$SUBNAM3= <"">
##$SUBNAM4= <"">
##$SUBNAM5= <"">
##$SUBNAM6= <"">
##$SUBNAM7= <"">
##$SUBNAM8= <"">
##$SUBNAM9= <"">
##$SW= 18.0517328524113
##$SWIBOX= (0..15)
0 0 2 0 0 0 0 0 0 0 0 0 0 0 0 0 
##$SW_h= 3612.71676300578
##$TD= 16384
##$TD0= 1
##$TE= 0
##$TE2= 300
##$TE3= 300
##$TEG= 300
##$TL= (0..7)
0 120 120 120 120 120 120 120 
##$TP= (0..7)
150 150 150 150 150 150 150 150 
##$TP07= 0
##$TPNAME0= <>
##$TPNAME1= <>
##$TPNAME2= <>
##$TPNAME3= <>
##$TPNAME4= <>
##$TPNAME5= <>
##$TPNAME6= <>
##$TPNAME7= <>
##$TPOAL= (0..7)
0.5 0.5 0.5 0.5 0.5 0.5 0.5 0.5 
##$TPOFFS= (0..7)
0 0 0 0 0 0 0 0 
##$TUNHIN= 0
##$TUNHOUT= 0
##$TUNXOUT= 0
##$USERA1= <user>
##$USERA2= <user>
##$USERA3= <user>
##$USERA4= <user>
##$USERA5= <user>
##$V9= 5
##$VALIST= <valist>
##$VCLIST= <CCCCCCCCCCCCCCC>
##$VD= 0
##$VDLIST= <DDDDDDDDDDDDDDD>
##$VPLIST= <PPPPPPPPPPPPPPP>
##$VTLIST= <TTTTTTTTTTTTTTT>
##$WBST= 1024
##$WBSW= 4
##$XGAIN= (0..3)
0 0 0 0 
##$XL= 0
##$YL= 0
##$YMAX_a= 418318
##$YMIN_a= -408585
##$ZGOPTNS= <>
##$ZL1= 120
##$ZL2= 120
##$ZL3= 120
##$ZL4= 120
##$ABSF1= 10
##$ABSF2= 0
##$ABSG= 5
##$ABSL= 3
##$ALPHA= 0
##$AQORDER= 0
##$ASSFAC= 0
##$ASSFACI= 0
##$ASSFACX= 0
##$ASSWID= 0
##$AUNMP= <proc_1d>
##$AZFE= 0.1
##$AZFW= 0.1
##$BCFW= 1
##$BC_mod= 2
##$BYTORDP= 1
##$COROFFS= 0
##$CY= -3
##$DATMOD= 1
##$DC= 2
##$DFILT= <>
##$DTYPP= 0
##$F1P= 0
##$F2P= 0
##$FCOR= 0.5
##$FTSIZE= 0
##$FT_mod= 4
##$GAMMA= 1
##$GB= 0.15
##$INTBC= 1
##$INTSCL= 1
##$ISEN= 128
##$LB= 0.25
##$LEV0= 0
##$LPBIN= 0
##$MAXI= 10000
##$MC2= 0
##$MEAN= 0
##$ME_mod= 0
##$MI= 1.114404
##$NCOEF= 0
##$NC_proc= 0
##$NLEV= 6
##$NOISF1= 3.799351
##$NOISF2= 2.8
##$NSP= 1
##$NTH_PI= 0
##$NZP= 0
##$OFFSET= 14.38212
##$PC= 1
##$PHC0= -4219.924
##$PHC1= 10.3923
##$PH_mod= 1
##$PKNL= yes
##$PPARMOD= 0
##$PSCAL= 0
##$PSIGN= 0
##$REVERSE= no
##$SF= 200.129724274929
##$SI= 16384
##$SIGF1= 3
##$SIGF2= 2
##$SINO= 400
##$SIOLD= 16384
##$SREGLST= <1H.CDCl3>
##$SSB= 0
##$STSI= 0
##$STSR= 0
##$SW_p= 3205.1282051282
##$SYMM= 0
##$S_DEV= 0
##$TDeff= 0
##$TDoff= 0
##$TI= <>
##$TILT= no
##$TM1= 0
##$TM2= 0
##$TOPLEV= 0
##$USERP1= <user>
##$USERP2= <user>
##$USERP3= <user>
##$USERP4= <user>
##$USERP5= <user>
##$WDW= 1
##$XDIM= 8192
##$YMAX_p= 0
##$YMIN_p= 0
$$ End of Bruker specific parameters
$$ ---------------------------------
##NTUPLES= NMR FID
##VAR_NAME=  TIME,          FID/REAL,        FID/IMAG
##SYMBOL=    X,             R,               I
##VAR_TYPE=  INDEPENDENT,   DEPENDENT,       DEPENDENT
##VAR_FORM=  AFFN,          ASDF,            ASDF
##VAR_DIM=   8192,          8192,            8192
##UNITS=     SECONDS,       ARBITRARY UNITS, ARBITRARY UNITS
##FACTOR=    0.0002768,     1,               1
##FIRST=     0,             0,               0
##LAST=      2.2672688,     0,               0
##MIN=       0,             -408585,         0
##MAX=       2.2672688,     418318,          0
$$ Real data points
##PAGE= N=1
##DATA TABLE= (X++(R..R)), XYDATA
0 0 0 0 0 0 0 0 0 0 0 0 0 0 0 -6 8 -8 8 -8 14 -16 16 -24 24 -32 36 -44 52 -60 68 -78 92 -102 116 -132 152
35 152 -171 194 -218 242 -271 302 -337 374 -415 460 -508 563 -619 684 -754 829 -914 1006
53 1006 -1109 1224 -1351 1495 -1658 1845 -2059 2312 -2612 2978 -3429 4004 -4754 5766 -7133
68 -7133 8556 -6128 418318 215426 -341812 -79534 229128 -13325 -128881 119762 1649
79 1649 -231188 26979 251411 -65914 -201350 105349 140934 -112794 -12537 165076 -46143
90 -46143 -167982 87284 110302 -148423 -77261 158165 12016 -155748 45080 144827 -63971
101 -63971 -82547 80438 477 -102504 66962 95194 -140656 -90443 200486 120422 -154092
112 -154092 -68804 108650 -11974 -83475 59683 19665 -134038 9007 164977 -35900
122 -35900 -160099 62240 123773 -85183 -52346 132825 -445 -167543 25281 152421
132 152421 -59615 -118140 89373 79882 -83647 -2174 94985 -58690 -102077 74491 50448
143 50448 -110182 -10016 111284 -48810 -94584 123919 96474 -155736 -70858 167060 32125
154 32125 -147823 28449 119333 -87939 -78341 139158 33304 -169549 11894 174204 -51475
165 -51475 -148184 83386 85076 -132877 -38478 150042 -10441 -132629 77652 123369 -105970
176 -105970 -76605 128858 19351 -143411 25307 128387 -65815 -90780 98681 40574
186 40574 -120197 8799 116048 -68099 -113029 99889 85663 -117804 -47265 114768 -813
197 -813 -93755 58408 80235 -81884 -35715 107456 -4711 -118638 28639 87037 -72541
208 -72541 -57483 102726 21070 -117235 16296 112538 -57089 -99729 84257 72116 -95557
219 -95557 -24665 109440 -9116 -94879 49768 75262 -75784 -40881 92032 408 -99107
230 -99107 32776 80256 -74417 -65114 90129 29958 -94197 15501 94283 -49287 -73870
241 -73870 80585 44437 -99222 -4505 111979 -23776 -92882 63119 68084 -96892 -45385
252 -45385 102586 1167 -108710 30935 92541 -63761 -69033 81413 32516 -87986 10449
263 10449 90308 -37809 -64139 73633 38692 -93756 -6858 98430 -28668 -91613 58903
274 58903 71583 -83099 -47759 85488 4355 -91551 25685 77381 -52423 -48083 78921
285 78921 22566 -83294 13870 81554 -41301 -60467 71034 38416 -83592 -8047 81666
296 81666 -32359 -79114 55607 53936 -79726 -26791 90372 -5842 -91125 35339 78140
307 78140 -59208 -49560 84858 28770 -83758 7877 81403 -37534 -68802 56714 42559
318 42559 -72027 -15273 71591 -19353 -68401 39967 43488 -64494 -19416 77765 -4802 -72527
330 -72527 38047 66292 -58398 -44078 76888 20861 -78790 11363 75705 -38631 -64617
341 -64617 53859 34175 -74506 -12445 73404 -17690 -64913 43868 47501 -62404 -22461
352 -22461 73836 -2137 -67524 36595 63245 -54661 -40426 70413 12582 -79618 11609
363 11609 72079 -39767 -60671 56802 34787 -73925 -14158 72162 -14425 -62964 41827
374 41827 51646 -52485 -22837 64876 -98 -61625 27517 53053 -46716 -33717 60029 7128
386 7128 -69422 11760 57181 -41756 -48030 58634 27657 -69055 -2532 73237 -19537 -64111
398 -64111 42359 52161 -50815 -23863 62608 1981 -59846 20681 46485 -45940 -34495 55533
410 55533 11373 -61897 7449 51639 -33312 -41244 49657 23064 -58002 4102 67898 -19936
422 -19936 -58620 40673 48276 -50156 -26230 56314 2412 -57342 18157 45992 -42476 -37563
434 -37563 50396 15349 -58240 3374 54618 -21068 -38852 42021 24026 -52037 -225 60022
446 60022 -17805 -51327 42901 43388 -58150 -30267 59113 1945 -62699 19351 52902 -42736
458 -42736 -40641 54617 16953 -64443 4669 65933 -18278 -46169 40564 27978 -51804 -1895
470 -1895 59279 -19922 -53335 40426 38104 -59839 -24611 61308 -2031 -62525 22172 49969
482 49969 -43840 -35268 56318 16880 -54351 12743 55839 -31171 -45731 45967 31997 -47807
494 -47807 -7982 47012 -15339 -41623 28924 20058 -49420 -5817 58735 -7642 -57916 16243
506 16243 41046 -28659 -18445 43718 4094 -41208 21236 42865 -36674 -37593 45462 27638
518 27638 -45242 -11450 36346 -13547 -33536 25531 17911 -39255 -3376 45406 -13176 -46760
530 -46760 27498 44408 -30981 -25540 39743 9054 -38638 13308 34802 -34124 -27150 52021
542 52021 16458 -67183 -13758 59096 -2545 -47271 19917 28841 -38125 -9886 51239 -8088
554 -8088 -55652 28395 59383 -33179 -42185 40818 20612 -43732 4955 42287 -29238 -38751 42957
567 42957 21005 -58249 -6989 59864 -13068 -56158 29746 45639 -38792 -23792 49119 6826
579 6826 -44676 18037 39617 -37529 -29836 50884 19384 -53286 -8626 39089 -12761 -28845
591 -28845 25289 9871 -36840 7516 41163 -23085 -39150 34882 33106 -35029 -12813 39380
603 39380 -2651 -35242 18273 27009 -30548 -14233 37227 -3379 -45897 9990 38778 -20125
615 -20125 -29214 23332 11620 -25267 7964 24600 -24763 -15014 47613 15522 -53035 -8732
627 -8732 49314 -3050 -38528 18723 24442 -35441 -13201 40982 -7687 -50183 20043 49899
639 49899 -27430 -38991 33337 22098 -36274 -504 39825 -12087 -27820 31475 16717 -45593
651 -45593 -4640 51629 -8353 -50912 18046 37172 -33284 -25951 37246 4463 -40717 17240
663 17240 42508 -33085 -38605 43382 33259 -39362 -12857 38464 -3756 -30599 19312 17651
675 17651 -33544 -6007 38943 -8935 -42449 14588 29712 -27050 -17469 34537 5438 -32945
687 -32945 10871 29335 -23411 -18442 37798 12790 -39659 -909 37998 -9584 -31950 15184
699 15184 16778 -22709 -3085 23834 -15151 -28125 23227 23847 -27783 -13557 30059 2404 -23948
712 -23948 15102 21551 -24797 -10784 36055 2882 -40378 5355 36242 -17143 -31133 22878
724 22878 17547 -31527 -8128 29764 -6473 -26616 20252 22060 -27807 -10672 35261 2722
736 2722 -32366 10386 27995 -18788 -16176 26589 1344 -34934 9191 33605 -23189 -32227 28190
749 28190 21284 -33112 -9091 33017 -4455 -28178 19873 24617 -26248 -12374 33885 3959
761 3959 -31618 7822 25634 -18561 -18236 23567 4401 -28928 5094 24713 -19453 -21370 27726
774 27726 13326 -31895 -2077 34696 -5140 -27437 17048 21514 -22564 -9367 28595 -1304
786 -1304 -29644 9920 23830 -19524 -19517 20939 6321 -24056 3547 21124 -14796 -15529 24039
799 24039 9460 -26341 2355 29735 -8982 -23813 19468 18210 -25370 -9313 27107 -2718
811 -2718 -28677 10043 21932 -20446 -17573 23145 7291 -25009 2352 23715 -9717 -14994 19832
824 19832 9187 -21612 2185 24222 -9846 -20795 17465 14232 -24198 -7524 24051 -4699
836 -4699 -26084 11176 20399 -20017 -14385 24325 6999 -24463 3587 24435 -9247 -16351 18073
849 18073 10949 -19899 -1090 20355 -8245 -18716 13876 10925 -21316 -5465 21381 -5329
861 -5329 -22081 12656 17588 -18961 -10003 24902 4638 -23668 6213 23880 -11401 -17248 17833
874 17833 10422 -20853 -2565 19593 -7150 -18737 11668 10873 -18588 -5361 19232 -2943 -17753
887 -17753 11917 14848 -16372 -6881 22186 1844 -20930 7907 20449 -13697 -15936 17834 7981
900 7981 -21794 -2338 19245 -7174 -18321 11447 11837 -16188 -4912 18324 -998 -15104 9568
913 9568 13037 -12873 -4862 17819 -343 -17670 7222 15199 -14465 -12312 17104 4583 -21055
926 -21055 -229 18247 -7825 -16674 12531 12609 -14805 -5094 17736 457 -15114 7334 13736
939 13736 -9646 -7465 13029 1520 -14720 2994 11226 -10716 -9554 13385 2702 -17643 1144
952 1144 17156 -6550 -14260 12727 12162 -14427 -4661 17976 371 -15722 6971 14517 -11832
965 -11832 -11355 12946 4251 -15070 386 11661 -8395 -9763 11748 3721 -15002 2863 16959
978 16959 -6774 -13218 12805 10276 -14177 -2643 17608 -2771 -16558 8128 12566 -14134 -10411
991 -10411 14783 3779 -16178 -235 11796 -6375 -7908 10832 3993 -11246 3255 12445 -6802
1004 -6802 -8898 12269 7048 -12446 -899 12514 -6283 -13161 9710 9054 -14027 -6380 14566
1017 14566 201 -16613 2484 14188 -4685 -8158 9842 4907 -10186 669 11174 -3744
1029 -3744 -7433 9288 5403 -12358 -3666 10345 -2755 -10667 6809 7488 -11949 -5759 12464
1042 12464 267 -13808 5737 16514 -6744 -12481 9935 8578 -10335 -2052 12540 -1609
1054 -1609 -10477 5483 5335 -12502 -4531 13517 974 -12611 2374 8052 -8213 -4983 11752
1067 11752 1941 -10748 6249 12803 -9906 -11666 12593 9556 -11659 -3290 11189 -2547 -11270
1080 -11270 4132 5440 -9080 -1619 11517 -2205 -12589 3146 9054 -4423 -2464 7934 158
1093 158 -5976 5507 4721 -10211 -2633 13913 1845 -13746 -797 8544 -4914 -7163 6660
1106 6660 2827 -8463 1142 8982 -5244 -9237 7896 9454 -5787 -3842 7108 494 -6259 2986
1120 2986 4432 -5909 -1731 8669 -1831 -12443 1559 10509 -4452 -9155 6101 5949 -7514
1133 -7514 -2307 8661 -1478 -7693 7818 9929 -9060 -8422 9981 6150 -9535 -2570 7640
1146 7640 -2398 -6740 4904 1919 -9753 166 11204 -3049 -10873 5820 8956 -7414 -4203
1159 -4203 10426 1467 -9079 4182 8621 -8353 -6911 10966 4159 -12921 -2585 10739 -1661
1172 -1661 -9482 2981 4630 -5444 -237 6785 -3598 -6488 7397 6949 -6819 -2928 7421 135
1186 135 -5481 4125 3311 -7821 -1448 8984 -2272 -11136 2661 8625 -5068 -6475 6056 3098
1200 3098 -6120 1316 6228 -3165 -3055 7340 2518 -7745 -87 7826 -2125 -6551 3789 3230 -6333
1215 -6333 -1046 6192 -3613 -7900 6063 7721 -7784 -6326 8328 4806 -6975 -438 7091 -1695
1229 -1695 -4599 5135 3183 -7326 -1824 7705 -770 -7919 1547 4743 -4449 -3092 5013 -108 -5727
1244 -5727 3343 6038 -5339 -4258 8508 3916 -8254 -904 8677 -1031 -7193 3081 4470 -5946
1258 -5946 -2512 6415 -855 -8142 2036 6813 -3942 -4775 4468 2227 -4001 1682 4523 -3732 -2401
1273 -2401 6811 1830 -7065 51 6739 -2574 -6261 3623 3194 -6284 -1937 6093 -1389 -6379 3388
1288 3388 5860 -4456 -3471 6092 2442 -4752 680 4629 -2167 -2038 4478 362 -5834 1265 5136
1303 5136 -3920 -5535 4473 2819 -5975 -1225 5892 -1599 -5390 4336 5139 -5107 -2818 6949 1910
1318 1910 -6113 532 5414 -2283 -4004 3397 1167 -4834 104 4014 -3028 -4194 3857 2547 -5004
1333 -5004 -572 5745 -956 -4459 3895 4372 -4822 -1779 6362 575 -6303 1170 5613 -3122 -4874
1348 -4874 3505 2078 -4796 -496 4094 -1758 -3672 3177 2602 -3784 -328 4872 -642 -3600 3281
1363 3281 3235 -4096 -1503 5078 -408 -5585 1608 4694 -3867 -4395 4111 2097 -5292 -768 4765 -1119
1379 -1119 -3609 2898 3011 -3132 -607 4151 -376 -3340 2137 2615 -3531 -1435 3839 -912 -4629
1394 -4629 1622 3437 -3781 -2938 4608 1551 -4885 292 5079 -1262 -3507 3073 3127 -3424 -1020 3917
1410 3917 -202 -3646 1560 2509 -3094 -1684 2719 -417 -3603 1391 2625 -2889 -1726 3872 864
1425 864 -3828 976 4506 -1531 -3039 3252 2437 -3711 -1199 3646 -473 -3903 1081 2500 -2906
1440 -2906 -2303 2777 529 -2661 812 2643 -1702 -1578 3022 866 -2790 1100 3563 -1579 -2722
1455 -2722 2758 1759 -3715 -965 3647 -549 -4047 1116 2711 -2817 -2095 3387 1441 -3023 316
1470 316 3026 -1219 -1783 2549 1251 -2470 333 2750 -1726 -2667 2371 1503 -3167 -592 3239 -1354
1486 -1354 -3477 1979 2544 -2544 -965 3710 586 -3368 666 3153 -1315 -1704 2485 860 -2676
1501 -2676 -26 1850 -1590 -1851 2149 896 -2588 -227 2125 -1177 -1881 2268 1826 -2140 -458 2945
1517 2945 -241 -2704 1301 2771 -1164 -1691 1682 591 -2309 -515 1602 -636 -1441 1109 716 -1742
1533 -1742 -562 1822 208 -1038 1049 1274 -996 -364 1732 124 -1855 686 1937 -1544 -2364 1404
1549 1404 1484 -1949 -886 1924 -66 -2020 564 1678 -1232 -1031 2360 1157 -1779 -120 1820 -592
1565 -592 -1284 1276 538 -1723 288 1462 -1681 -1930 2030 1336 -2582 -845 2523 -193 -2216 1202
1581 1202 1970 -1380 -889 2309 301 -2458 666 2124 -1127 -1406 1135 114 -1963 366 1232 -1690
1597 -1690 -667 2084 111 -2608 471 2550 -560 -1459 1845 1267 -1729 -223 1983 -343 -1647
1612 -1647 1369 1429 -1765 -1262 1232 329 -1330 69 822 -776 -353 1160 -146 -1216 837 1956
1628 1956 -480 -1130 907 962 -1197 -285 1102 -199 -1459 422 1008 -1370 -1134 1374 1240 -1245 -598
1645 -598 960 489 -681 174 897 -81 -60 979 -202 -1205 260 1097 -547 -908 484 161 -1152
1662 -1152 -125 833 -557 -751 981 910 -1439 -644 1637 632 -1211 96 1232 -399 -713 713
1678 713 -22 -938 234 887 -855 -990 576 223 -1235 134 852 -491 -315 1272 211 -1407 267
1695 267 1922 -244 -1676 746 1112 -888 -791 943 -6 -938 368 673 -1093 -744 1250 494 -773
1712 -773 276 944 -289 -421 891 272 -936 475 1445 -643 -1355 787 1098 -1057 -856 955 243
1729 243 -1101 -107 661 -478 -871 790 825 -974 -59 1139 296 -672 243 600 -328 8 695 -311
1747 -311 -811 397 804 -1023 -871 769 609 -882 -171 753 49 -522 632 772 -799 -239 1001 300
1765 300 -798 -154 790 -68 -335 301 -50 -378 338 427 -628 -484 1046 218 -742 108 910 -69 -558
1784 -558 645 642 -852 -327 900 -145 -1176 178 776 -501 -847 463 354 -539 177 603 -266 -191
1802 -191 685 287 -708 -25 945 -187 -724 448 508 -774 -313 692 -107 -1007 156 1000 -702 -906
1820 -906 648 722 -751 -173 825 114 -480 677 461 -416 35 795 -99 -712 55 425 -795 -604 636
1839 636 -35 -821 231 947 -595 -517 921 784 -760 -130 1043 119 -764 87 557 -429 -214 495 7
1858 7 -678 80 306 -415 -464 457 122 -708 351 767 -407 -440 754 408 -888 -287 1043 15 -857
1877 -857 321 546 -539 -562 513 62 -831 20 613 -284 -553 644 230 -465 104 681 -283 -371 763
1896 763 174 -883 0 1043 -317 -906 308 450 -740 -906 888 186 -841 49 887 -168 -641
1913 -641 543 372 -466 136 633 -51 -442 499 300 -702 -84 466 -389 -699 423 553 -748 -295 852
1932 852 157 -897 215 1005 -226 -579 631 600 -482 -226 536 152 -664 234 310 -350 -386 304 -172
1951 -172 -445 374 620 -549 -258 577 276 -724 322 1072 -90 -710 608 632 -866 -527 915 -4
1969 -4 -1124 -34 766 -382 -565 481 283 -715 244 943 -325 -201 805 360 -606 345 733 -514
1987 -514 -910 840 475 -1185 -368 1007 -248 -1110 408 952 -652 -573 983 219 -776 287 959 -42
2005 -42 -183 669 151 -863 195 644 -553 -463 638 99 -922 -171 864 -640 -806 750 719 -747
2023 -747 -263 948 105 -781 419 689 -567 -304 305 79 -496 185 462 -284 -434 179 -62 -543 113
2042 113 689 -163 -270 568 524 -585 -183 1029 283 -670 23 650 -247 -847 396 620 -324 -429 253
2061 253 -250 -898 159 566 36 -47 661 136 -381 234 743 -346 -303 973 147 -1046 -319 661 -575
2080 -575 -842 481 671 -734 -544 800 -73 -926 564 1040 -310 -650 625 194 -623 327 548 -309
2098 -309 -167 830 -285 -1107 245 831 -614 -827 841 278 -1010 -56 901 -113 -662 920 981 -990
2116 -990 -637 828 162 -651 128 472 -634 -472 298 -294 -560 314 716 -712 -485 783 185 -500 362
2135 362 916 -259 -334 578 366 -839 -270 918 128 -866 -179 565 -148 -550 172 338 -214 127 319
2154 319 -282 -236 364 445 -270 -78 439 -23 -460 149 304 -584 -157 903 -139 -1210 -2 794 -411
2173 -411 -744 501 590 -542 -65 682 -127 -248 714 297 -502 -120 721 -88 -729 268 114 -639 -155 438
2193 438 -454 -801 550 675 -762 -615 928 516 -810 -86 1065 -133 -458 338 421 -693 -151 635
2211 635 -186 -801 -121 374 -530 -74 403 -49 -345 478 751 -655 -238 1145 481 -737 25 922 -80
2230 -80 -625 243 195 -493 -113 604 -185 -654 143 454 -128 -500 284 204 -146 249 368 -157 24 789 106
2251 106 -727 -70 811 -310 -777 -5 383 -658 -498 508 -38 -729 214 681 -202 -427 490 531 -69
2270 -69 62 227 160 -150 417 -158 -595 244 469 -400 -629 379 246 -575 -95 715 -113 -504 546 689
2290 689 -792 -463 942 475 -684 -258 812 -69 -297 213 -140 -448 40 367 -400 -408 559 377 -591
2309 -591 -149 559 -63 -294 418 390 -610 -118 910 239 -769 -143 810 -373 -682 18 273 -392 -268
2328 -268 256 -101 -182 285 424 -335 -157 393 44 -248 39 294 -419 -216 534 -100 -742 79 495 -394
2348 -394 -786 428 437 -334 -233 554 90 -417 312 540 -68 -150 425 112 -287 160 311 -279 -130 244 -247
2369 -247 -592 164 292 -503 -573 637 408 -598 -78 608 151 -379 253 411 -298 -339 472 46 -670 -169
2389 -169 385 -351 -336 258 96 -381 129 348 -307 -201 871 310 -710 280 820 -105 -456 433 473 -436
2409 -436 -358 491 145 -719 -207 242 -407 -508 289 319 -270 33 431 -154 -97 376 180 -398 224 747 -151
2430 -151 -700 228 256 -640 -203 511 -182 -587 61 475 -390 -165 426 337 -158 -41 278 230 46 192 76
2451 76 -260 -16 301 -216 -409 24 -39 -499 -232 314 -147 -537 86 503 -198 -289 507 381 -414 -189 446
2472 446 258 -247 43 474 -241 -396 203 -63 -192 86 10 -236 -153 176 -36 -428 458 532 -154 -264 455
2493 455 371 -632 -33 940 -127 -669 271 366 -552 -404 303 -56 -616 -14 182 -470 -324 607 150 -123
2513 -123 396 485 -322 -211 608 15 -480 229 528 -309 -674 260 162 -556 -255 495 42 -492 239 205 -39
2534 -39 53 338 119 -40 225 60 -328 29 220 -57 -229 48 101 -452 -315 243 99 -299 -47 402 -2
2555 -2 -516 228 409 46 -144 278 368 -423 -150 459 116 -197 -13 168 -340 -285 119 -77 -304 251 198 -237
2577 -237 -181 511 -67 -436 224 687 -339 -382 627 163 -706 20 514 -385 -706 222 195 -385 -190 402
2597 402 -28 -316 266 125 -100 274 561 -21 -466 452 389 -620 -83 563 -18 -750 -81 593 -494 -325
2617 -325 592 340 -280 77 375 -24 -104 345 221 -68 275 251 -166 -415 154 84 -290 -80 40 -208 -397
2638 -397 317 248 -352 -130 423 -91 -327 11 453 164 -354 88 375 69 -245 79 71 104 15 31 -236 -271
2660 -271 1 -113 -147 67 168 -139 -254 342 138 -217 164 711 65 -491 -103 339 -336 -370 253 76 -214
2681 -214 -196 162 -277 -474 396 254 -296 159 451 -122 -282 547 59 -264 229 594 -406 -686 287 249
2701 249 -585 -493 434 16 -612 -23 341 -182 -424 519 310 -451 132 330 148 -82 71 55 -109 246 -48
2722 -48 -450 -345 489 164 -583 -156 305 -78 -503 107 239 -174 -55 292 174 -267 184 242 -15 -193 191
2743 191 -10 -26 -169 -6 -66 -22 190 -1 -417 55 365 -56 -200 148 247 -136 2 454 226 -231 8
2764 8 481 -131 -432 -58 226 -235 -296 305 -12 -132 -112 -1 -165 216 421 -131 -254 224 332 -374 -186
2785 -186 493 -68 -280 132 458 -350 -501 260 334 -607 -465 393 211 -308 130 179 44 -30 296 12 -299
2806 -299 172 205 -191 -342 203 32 -245 52 130 -268 -172 387 -27 -480 -333 415 168 -501 117 555 -28
2827 -28 -63 281 119 -203 19 122 -316 -344 172 -33 -187 -129 72 71 -163 141 47 -218 421 323 -87 -159 228
2850 228 346 -273 -245 234 83 -287 29 145 -163 -144 94 -32 -175 -30 147 44 -48 202 225 79 256
2871 256 278 -201 -93 485 326 -453 -71 420 74 -294 -81 354 -51 -225 170 47 -422 34 375 121
2891 121 -62 104 174 -43 66 138 -103 -205 141 42 -480 -151 364 -155 -583 64 275 -257 -66 254 125
2912 125 -215 65 372 242 -341 159 260 56 -161 -16 -192 -90 73 64 -192 47 276 -418 -222 320 312
2933 312 -195 38 312 -9 -302 278 296 -128 -36 231 226 -241 -241 244 6 -200 -95 -107 -98 58 71 -86 31
2956 31 375 181 -107 -24 283 112 -165 282 168 -98 -282 264 272 -583 -96 84 -50 -537 -52 310 69
2977 69 -149 240 189 -89 2 122 -16 -63 98 90 -32 237 233 -159 -339 206 152 -365 28 352 -80 -510 201
3000 201 599 -131 -139 530 381 -60 -70 386 54 -154 108 -16 -215 78 57 -164 -170 228 31 -287 208 341
3022 341 -256 -216 374 317 -242 -42 238 150 -134 226 82 -2 -144 12 101 -86 80 46 -276 144 70 -139
3044 -139 -185 116 134 -133 82 332 52 -252 -35 159 34 -209 9 266 -189 -276 -174 117 -197 -151 35
3065 35 235 -30 -213 117 193 -79 61 155 19 -26 -3 27 -137 194 112 -360 -109 32 -303 -383 272 308 -146
3088 -146 -66 303 30 -489 167 497 -13 -90 117 103 -288 -39 182 -221 -239 121 -65 -539 112 189 -120 -145
3110 -145 337 141 -471 127 437 -97 -300 413 288 -226 -185 331 -136 -305 97 -82 -172 -60 -49 -177 -300
3131 -300 357 60 -67 212 394 -166 -260 251 247 -142 136 209 29 -230 167 73 -226 -65 77 33 -124 -6
3153 -6 -46 -51 161 34 36 323 284 -88 247 223 186 -139 14 53 63 -112 -210 -159 155 -69 -434 -51 145 -44 -238
3178 -238 195 316 -47 -2 93 39 -36 11 240 -142 -161 -33 58 -254 -89 93 -227 -125 62 -43 -291 214
3200 214 214 -340 -185 185 55 -425 -115 355 -101 -148 196 20 -287 -102 211 82 -164 -25 27 -177 96
3221 96 181 -232 34 335 42 -209 135 405 21 -242 170 148 -302 -251 169 50 -408 -122 108 -82 -242
3242 -242 48 174 -128 54 -88 43 127 138 -110 -67 115 132 40 -195 81 78 -245 -145 181 -114 -514 5
3264 5 108 -211 -257 184 322 -188 2 82 308 -30 88 127 -10 21 -65 -194 -73 25 -179 -141 4 52 -42 -244
3288 -244 12 210 -42 -113 317 76 -24 -130 441 79 -205 -210 282 -52 -81 -41 -179 -105 -206 -75 -133 -42 45
3311 45 10 -23 172 175 -60 14 265 52 -259 22 298 11 -128 -33 269 -141 -118 46 34 -119 -54 -77 50 -149
3335 -149 -42 126 -16 169 253 83 87 119 26 -173 -10 150 -299 -104 -14 30 -300 -214 64 19 -252 66 279
3358 279 17 -74 140 243 -34 123 104 140 -197 -42 -178 -23 -134 -117 -66 -45 79 -85 -256 -68 192 70
3380 70 -228 123 270 -243 -195 269 378 -180 -5 218 62 116 -73 21 -89 0 -143 -16 84 -47 -6 -143
3402 -143 228 162 36 -80 249 225 -96 101 275 41 -275 -101 99 -97 -162 -32 14 20 -261 212 202 -259
3424 -259 94 -96 74 51 81 133 -46 178 254 -94 -144 71 -99 -186 46 65 -210 -83 120 55 -202 -149 219
3447 219 26 -17 18 26 -33 25 121 31 88 -34 72 -69 68 51 -70 33 132 -27 -118 54 126 107 56 -14 247
3472 247 157 -176 50 142 12 -130 102 50 -56 -256 19 10 -222 21 -55 -18 -28 31 -36 -98 169 39 -31 77
3496 77 172 76 -72 201 309 -197 -122 80 45 -260 -103 155 44 -204 -92 203 -296 -94 228 -84 54 113
3518 113 -54 3 174 -22 -284 21 192 -67 -348 -98 131 -17 -228 103 131 -152 -198 139 69 0 -165 123
3540 123 105 8 275 -98 -84 119 -77 -102 10 78 -257 -173 152 -36 -201 -59 76 -126 -59 71 83 23 -12
3563 -12 167 172 87 -10 -149 99 -67 -134 -42 -78 -42 -97 45 -53 -76 60 -46 -40 136 306 4 -60 -32 50 34 -53
3589 -53 55 8 -150 -99 125 -106 -384 0 114 -125 -260 124 86 -115 157 113 64 -25 -53 110 -52 118 184
3612 184 -145 62 95 -9 -199 103 2 -240 -28 225 -32 -63 -5 129 -180 -73 253 67 -36 63 33 -55
3634 -55 55 250 -205 -155 73 -72 -222 -55 104 99 -147 224 94 -86 93 98 -6 -60 39 11 -48 210 173 70
3658 70 2 14 -33 1 -29 -69 -17 46 -15 28 27 -90 65 89 18 44 94 116 188 -121 158 -65 9 63 143 -119 -147 33
3686 33 -31 -23 -88 88 11 37 -78 -62 -5 24 -12 59 179 64 52 -183 -29 208 74 -70 -79 114 -38 -94 120
3711 120 93 -165 -56 96 73 -45 25 71 8 -12 31 123 -17 19 -98 -27 -71 73 -75 89 125 -66 -162 -89 -68
3736 -68 11 -112 32 77 -82 -179 181 -4 -22 29 89 33 -33 -58 9 47 -37 -89 -18 -70 -81 -63 -116 -8 -61 115 -21
3763 -21 53 11 44 74 191 43 14 19 134 114 10 -74 127 -157 -38 -206 36 -89 67 -30 83 73 -52 -97
3787 -97 76 64 97 22 -55 159 -110 -13 22 237 47 -151 31 108 -34 -151 -109 -23 -26 -13 150 1 55 -44 75
3812 75 -9 24 -18 -98 -71 76 72 -117 59 -59 45 -111 198 -91 13 -3 145 85 37 -75 222 90 12 -11
3836 -11 17 -32 37 63 -14 48 -59 13 -183 -166 -136 -119 -24 -118 -185 -154 -40 48 -239 138 10 95 -19 -134 87 5
3862 5 -90 -20 15 61 54 155 0 9 43 -104 36 58 6 -58 -61 251 -13 -14 2 -47 5 -50 95 177 -45 7 -38 -80 47
3891 47 -73 107 42 -60 -87 126 31 61 135 105 -10 58 52 69 -136 -26 -74 -244 -52 -21 -288 -34 -15 76 -74
3916 -74 -218 94 -31 -15 102 -162 -61 -98 49 -5 -109 205 -117 -40 -71 19 70 -1 -15 -34 -53 -31 178 -166
3940 -166 -51 -46 157 -85 11 75 -74 -140 26 -44 140 -69 -114 83 -124 -69 -26 -68 -99 -23 -39 -41 142 -41 -37 -49
3966 -49 -69 43 51 93 -94 153 -66 76 34 -65 -29 39 57 59 -238 -106 -77 77 -71 -8 -111 137 9 88 132
3991 132 69 -87 -103 -20 -22 203 10 49 110 -23 -206 57 146 30 -320 -161 31 2 -5 -42 118 -131 -65 59
4015 59 -30 -4 -167 56 -2 -78 16 1 10 203 -153 6 -62 -121 31 28 93 -68 -149 179 46 14 -73 147 13 -6
4041 -6 -53 236 190 -80 198 -45 -16 139 97 -89 34 90 16 34 -66 -23 -147 -36 77 -133 -24 -36 56 -68
4065 -68 -96 18 -87 -5 87 15 9 -85 -299 5 -16 -40 102 83 -21 -25 102 -29 11 -160 -73 -60 -12 -30 14 4 52
4092 52 4 -11 -205 110 -31 -5 21 -172 -98 -63 50 2 73 174 115 52 -47 42 28 23 3 -111 -19 -19 -111 -92 -205
4119 -205 19 35 66 -27 -134 148 24 -147 141 159 -60 -17 -146 -245 -76 -21 -71 -19 -18 -20 -153 41 -10 44 -102
4144 -102 85 85 -232 55 -62 -55 54 33 222 123 -49 -26 -179 40 21 81 -68 14 188 11 131 37 -31 21
4168 21 26 -11 116 -3 -35 61 -46 -38 114 154 102 75 23 45 -56 -64 -104 76 -54 -67 -10 44 -54 -212 27 -192 0
4195 0 -156 78 -106 -15 -31 17 -242 -83 -147 -45 25 192 -17 36 -54 -23 -75 65 -69 161 -67 57 31 157
4219 157 4 78 147 32 164 112 7 1 -98 -112 50 5 74 28 180 -87 -193 123 45 8 -186 116 51 16 -85
4244 -85 -154 89 4 -69 -25 -109 -103 111 -26 -91 -19 -57 -39 -11 26 -27 -213 -3 41 180 117 -65 -16 -8 9 -6 35 -48
4272 -48 -25 212 84 -17 -97 -91 72 76 61 -74 55 90 131 -108 236 16 85 72 -90 -72 -104 12 -23 -169 -96
4297 -96 -125 -77 117 98 105 -99 116 -109 53 127 228 117 -54 -81 43 8 -24 -80 -72 47 -14 103 -27 80 -110
4322 -110 -124 -100 114 -18 75 -1 -1 40 -61 89 -75 -14 -82 -84 -27 16 -67 28 105 -65 -56 -150 74 55 23 86 179 16
4350 16 52 -117 89 59 -129 -150 -46 42 -19 31 -144 59 123 41 102 38 25 40 -23 -45 -40 -20 -12 95 54 -159 100
4377 100 103 -28 23 24 -7 -45 -143 78 133 -29 -59 -24 46 8 99 156 79 -17 34 118 -1 14 -75 50 -41 -12 -48 103
4405 103 -165 -38 -78 61 -211 -77 144 219 21 -7 59 0 74 -64 81 111 157 1 21 -80 -96 -31 -24 -74 -1
4430 -1 38 29 -16 -16 -78 113 -109 -34 30 -52 36 99 4 -60 -150 53 83 30 -179 107 -4 -10 -61 -119 23 -146 47 25
4458 25 208 62 73 -43 -138 -31 14 -107 147 -18 -133 -13 -30 -54 -205 54 -99 -120 -97 106 -154 -8 7
4481 7 -24 120 -95 -17 39 -50 -44 -57 15 26 -73 76 113 -224 23 -33 -43 84 37 40 -83 17 96 -13 -108 79 -104
4508 -104 73 105 167 -149 -52 16 -13 -102 -127 89 21 -34 -149 -224 -54 -110 25 262 -10 -64 3 -60 -5 43 126 40
4534 40 67 -51 -10 261 141 18 134 -111 0 119 -20 31 16 -5 99 191 23 9 63 -134 -13 66 -92
4557 -92 -139 -41 26 -156 -19 65 59 -67 12 176 -76 186 -63 7 -18 115 177 -113 82 -68 -186 -54 35 -121
4581 -121 -116 -21 76 73 121 35 140 5 -131 57 -9 -27 22 46 103 64 -26 -106 75 -46 109 -84 143 55 -216 95
4607 95 1 72 30 -167 -34 -27 8 27 28 -109 20 44 96 -89 -107 37 -16 105 23 -85 100 -45 -129 -126 -8 -40
4633 -40 64 34 1 17 15 -32 124 -34 -6 -61 19 32 89 35 89 147 -62 137 1 -51 94 54 -122 -9 163 52
4659 52 19 78 42 151 -123 57 -5 -26 -114 49 243 -90 147 19 -22 -39 41 2 43 8 -147 -39 93 -7
4683 -7 -49 -51 37 189 -74 65 99 -5 -33 -2 80 -6 -9 75 92 -176 36 -29 -118 -77 200 -105 -122 147 -73 24 -70
4710 -70 28 182 -13 73 81 -69 -34 -73 -168 142 -68 99 109 121 156 3 -57 61 75 -1 13 135 25 119 34 23
4736 23 -30 76 104 27 -55 16 -198 -122 9 -32 -25 181 -20 38 98 -97 -27 113 -13 79 9 -143 -48 18 39 -32
4762 -32 54 52 26 131 123 -55 -78 102 63 -62 88 127 46 -160 -18 118 -1 -88 19 -64 91 68 -94 181 -110
4787 -110 48 -11 -54 80 -42 -95 -139 100 -83 -23 -39 69 -32 -166 69 47 72 -105 -31 -4 -80 -1 110 -192
4811 -192 -90 -100 59 131 -104 -96 100 -76 13 -34 -24 10 -162 -40 -129 -74 -154 -112 5 56 -6 -1 60 39 -94 69
4837 69 -127 -105 76 -123 -96 77 -65 -48 67 -125 -3 82 146 -22 -5 38 -11 131 50 -137 -41 -28 -14 100
4861 100 47 -42 12 -50 -46 -11 0 -8 -59 -20 36 51 67 7 -28 -4 -75 72 94 72 -134 39 12 26 43 -103 -170 -6
4889 -6 -75 2 145 -205 16 -89 -9 -15 -54 -155 125 40 -118 41 -131 53 123 112 23 79 -42 -24 -148 23 137
4914 137 -71 38 -91 -38 30 -84 48 62 96 65 -132 45 -52 -97 8 61 -86 25 7 -47 -132 -137 109 114 -11
4939 -11 -121 -46 9 -3 45 84 -14 5 15 -19 117 -186 175 220 -129 45 16 139 -90 -121 45 -37 -24 12 12 12 -56
4966 -56 94 9 134 85 -50 -164 72 104 -167 -84 69 70 -45 26 -41 31 -153 26 58 22 -96 7 -61 -34 -114
4991 -114 -60 3 83 -8 -29 32 -40 18 -57 -83 12 98 50 54 -215 14 66 -113 84 59 174 124 -29 16 -138 117
5017 117 28 -127 27 23 -121 -46 -39 43 -95 -91 -15 93 20 -52 166 48 32 -134 42 -5 14 32 -202 -33 -12 65
5043 65 42 107 5 170 -62 -113 46 47 12 73 -21 -76 -36 100 -188 139 67 70 64 -260 60 -85 53 47 -89 126
5069 126 -5 103 12 7 26 -4 -102 48 14 -7 5 -12 -204 49 -130 -33 -104 95 74 -100 43 -84 25 22 -64
5094 -64 88 -53 -30 46 -61 148 95 -21 121 44 134 -157 -88 59 9 -35 6 -18 -25 27 3 94 8 12 -50 134 34
5121 34 -20 -39 -37 12 -47 88 27 -23 -22 38 88 -201 65 -127 -73 -146 56 -84 -21 45 27 -56 -95 5 80 -31 67
5148 67 61 -110 61 145 81 -91 330 78 152 -61 -98 222 33 -90 8 -83 -58 40 14 48 -119 -21 -13 124 152 -29
5174 -29 -5 -196 164 89 3 25 -147 124 -82 -145 -15 78 50 -53 -172 112 -57 2 38 -24 -118 -85 82 48 288
5199 288 -80 -122 57 18 -28 -98 59 -14 -25 163 33 30 57 -49 40 170 1 14 48 108 -72 33 43 -32 -63
5224 -63 -62 -42 -125 -22 -28 -138 3 43 24 48 11 -111 52 96 61 -134 51 67 34 -27 48 -16 36 -117 149 49
5250 49 -14 -90 -45 -2 -107 -142 56 13 86 -65 0 201 34 77 -95 73 -136 55 26 -124 -88 13 -109 96
5274 96 -63 -113 114 -137 -125 52 -69 -3 63 47 51 17 -30 54 17 -21 67 110 99 -69 83 -91 58 79 -37 15
5300 15 103 28 95 20 29 -102 -62 76 44 -207 282 -24 -131 -64 -101 -58 113 -49 -5 44 37 156 2 123 87 48
5326 48 4 79 73 122 -41 65 -161 -49 63 74 -89 -33 -13 80 21 -73 35 -126 -17 -97 16 73 53 -81 105
5351 105 24 22 -25 -44 81 1 -50 25 -84 -16 -51 100 -3 85 -84 -22 42 -69 29 69 18 -51 -6 -25 -38 -105 -105 43
5379 43 -98 -17 66 -19 40 108 -15 17 -130 2 46 -15 131 11 64 -197 -92 122 -174 -31 -76 -13 82 109 84
5404 84 -47 -158 -57 33 -327 2 -10 -6 -44 133 -3 -26 -141 -45 100 16 -10 37 -120 -14 56 12 -42 57 -99
5429 -99 -81 -45 -18 -116 57 -103 -16 -72 13 -97 63 131 44 61 110 25 -89 148 130 5 32 -20 -41 7 18 104 -47
5456 -47 104 -70 95 -176 55 94 26 109 -138 -69 119 -90 92 91 105 20 -10 187 -42 -97 -15 7 -73 -41 225
5481 225 278 -103 81 -43 122 -70 -71 5 4 49 -69 -103 -10 157 14 -35 -68 51 74 -26 -19 143 59 -36 104
5506 104 7 2 -123 -14 90 73 34 -58 -91 17 -88 124 -36 -165 -25 37 73 69 1 -83 -96 -19 -77 -16 147 -84
5532 -84 0 -102 -117 58 -13 -23 50 -25 -17 -60 -97 54 -6 -31 -6 -17 -112 56 -2 -8 -114 -6 21 1 15 -136 60
5559 60 -105 146 -22 57 -47 80 -45 -139 34 96 -44 -56 -123 61 -39 65 114 -7 92 -91 9 16 64 24
5583 24 111 -8 22 17 -64 66 104 -117 54 -269 -1 64 -119 -69 95 192 38 -31 124 -2 -1 -98 75 7 -207
5608 -207 7 -151 39 -127 43 -62 -176 103 113 -201 -26 35 48 12 23 167 -48 42 -39 -22 -41 45 -17 -49
5632 -49 40 -12 -62 -103 22 227 -60 -14 38 26 9 -32 -126 -164 6 -165 -46 78 17 1 224 170 -1 -113 15
5657 15 -77 121 -166 -145 -18 -221 31 -23 22 -74 47 7 -131 22 124 -16 -85 -45 -4 -77 90 -91 -89 7 177
5682 177 17 4 -90 -123 145 -167 49 85 -29 -24 276 27 73 -148 -122 76 54 55 156 23 3 -16 28 -81 31
5707 31 -16 -86 -15 -53 -106 -86 199 -31 -120 -16 36 -142 174 1 -151 136 11 86 -103 154 -19 149 -92
5730 -92 -97 -72 -196 -13 70 -164 -137 -235 -137 -179 30 -125 -15 -80 -200 108 -79 120 24 -11 66 -88 92 41 127
5755 127 28 55 -50 22 35 -17 -99 75 41 -112 -128 10 -93 -23 -115 107 155 261 43 189 -109 -19 73 -11 -27
5780 -27 85 -83 -158 26 -27 -8 -121 -19 59 88 -90 2 37 139 80 93 115 87 133 88 -113 -84 41 74 76 -56
5806 -56 32 5 -77 -13 -19 -161 86 124 -91 -90 197 -85 85 4 -121 -66 70 29 8 147 -276 135 -255 -56 101
5831 101 65 -60 31 182 163 -83 51 -1 50 38 -188 43 128 -146 -67 72 -115 3 52 -145 -81 -128 -76 -127
5855 -127 113 -50 98 39 109 -16 53 -187 71 -36 47 50 78 -95 98 -38 -8 -212 24 81 21 -92 -53 104
5879 104 77 -35 -141 -21 78 45 51 75 108 8 -152 -125 -87 -9 -57 94 28 -12 -186 -17 94 99 -15 81 37 -9
5905 -9 145 -43 90 40 112 -24 106 51 63 -57 -179 -42 -249 0 31 -59 -148 -163 -9 18 16 46 21 99 -17
5930 -17 66 -112 156 76 -23 41 -2 -18 -168 -3 85 183 -71 -55 14 -146 4 37 -24 108 0 -79 -8 134 105
5955 105 -241 -48 60 8 24 118 -42 3 -1 42 46 93 -18 39 64 4 47 71 115 149 30 -59 264 168 42 -34 122
5982 122 180 -32 -154 72 -24 64 -33 -35 35 62 113 100 45 -12 15 66 45 19 -54 84 -5 -84 29 87 16 -177 110
6009 110 -75 91 -105 -13 114 -81 54 25 -6 66 111 0 -62 -119 -2 76 21 126 -102 -94 -43 -71 -131 17 45
6034 45 156 11 -3 28 14 49 99 148 86 -13 -26 34 -35 30 53 -127 29 111 23 -140 145 -77 -239 -223 -25 219
6060 219 74 -43 -48 175 -26 -84 150 159 62 -22 51 -75 -33 73 -134 -55 120 65 -38 -133 40 -51 -43 -45 -38 83
6086 83 103 56 14 22 9 179 134 16 -47 -20 56 -120 -40 40 3 -176 111 41 -154 33 -96 38 86 -62 48
6111 48 37 -126 -141 -171 38 -82 -100 -14 164 -44 7 -26 12 187 106 66 -74 43 57 60 -72 79 -172 -56 -29
6136 -29 -36 -166 64 -86 -170 -78 -10 -27 -19 -87 -25 -28 46 57 111 -46 -87 111 101 78 23 146 -40 -98 -65 -205 -2
6163 -2 -4 29 -103 53 -92 -35 12 -6 112 -37 -19 98 -6 88 -69 -142 -17 154 233 -107 -73 -57 25 -143 25
6188 25 112 80 28 208 64 1 -5 -107 98 69 -1 129 -97 77 55 -71 -53 -74 -123 -65 89 6 -104 -18 -196
6213 -196 -28 -75 175 -97 96 -68 -209 -103 -138 150 -1 -65 -11 -107 -58 -5 72 -113 -39 7 -48 -66 -33 -112 97
6238 97 -25 -14 135 78 28 -40 59 19 131 147 0 -228 -95 64 -76 153 -41 -259 -49 -70 -38 -15 25 -53
6262 -53 78 -6 -5 -35 26 -74 -194 -164 52 -9 -271 64 181 116 -85 -118 -82 -70 20 -110 -50 -1 50 37 101 3
6288 3 -59 -47 -134 3 138 -90 -26 -57 71 -85 207 27 36 -33 -33 88 45 143 54 82 20 17 103 -10 -67 68 -18
6315 -18 -54 -30 -163 72 62 -22 7 -27 154 -39 170 -103 -57 85 110 -12 -50 -38 27 78 76 -44 -30 88 -19
6340 -19 -3 -122 -82 -44 167 -34 -265 4 -142 105 -86 154 -157 19 37 95 -139 15 32 -184 163 -138
6362 -138 -111 -33 97 -97 25 88 -24 22 111 -38 24 40 162 105 -125 -5 31 70 -52 5 161 -140 56 -24
6386 -24 -96 -11 -27 -127 -82 -55 53 197 -66 43 89 -90 -34 85 103 -62 -259 -164 201 -9 -13 -121 136 -38
6410 -38 119 -127 -36 92 145 125 65 49 -23 5 -67 -134 -8 -171 -83 21 -30 144 -43 -46 129 29 -51 -124 -61 70
6436 70 -23 -125 129 60 -36 152 68 98 -17 -6 66 -16 -42 61 144 38 -100 -22 -84 116 -37 -72 -36 -117 21
6461 21 88 65 28 4 -134 -31 127 -21 -91 82 144 -59 53 -110 21 199 -47 28 -70 -51 71 -183 58
6484 58 121 -11 22 69 -234 -68 -14 101 -4 -122 118 36 -121 103 -30 74 10 14 64 -77 84 93 106 -80
6508 -80 -115 151 11 4 -1 179 90 171 -12 -170 -244 -186 -94 -21 21 -143 -107 -61 202 -28 -95 112 69 164 -96 -7
6534 -7 -31 -160 75 -54 -22 -89 -42 -21 -55 -84 -26 -138 16 -37 -152 -81 -16 -116 -38 57 65 6 61 -174 12 -49 148
6561 148 153 -25 125 -77 -15 -69 13 52 137 -159 -97 85 125 218 -96 15 11 96 -39 -15 9 -60 -95 16 -86 9
6587 9 29 28 -27 -57 70 64 -27 39 111 -5 -18 116 29 8 139 -92 -15 -69 -100 167 -83 -63 -225 -89 117 -45
6613 -45 -56 -24 -54 -60 -147 88 91 81 64 28 -29 -52 57 -96 -22 -230 -68 -109 -60 157 -87 108 -61 53 65 -63
6639 -63 15 -110 -49 41 205 222 -64 -58 81 26 99 -129 -47 94 110 -13 -120 -3 14 27 -24 -53 164 -38 66
6664 66 -45 3 -43 6 -52 4 109 -40 -31 -58 63 71 64 -80 -26 -30 169 75 113 -32 25 18 -31 55 -189 -76 66 71
6692 71 6 42 -29 -13 -6 106 69 156 157 -56 4 -141 40 42 -61 16 -85 -45 -145 -31 3 102 -71 -131 60 25 67
6719 67 37 -130 66 46 -39 -127 10 -30 42 -94 121 55 -140 -123 -10 41 -18 196 -96 -27 -34 181 77 -2 74
6744 74 -130 -27 34 -134 -181 -17 66 -156 -48 18 91 -29 -18 43 154 -11 -38 -62 -91 -40 144 -125 -118 -42 61
6769 61 133 97 171 20 64 86 -36 -64 -57 -12 123 49 20 -128 150 12 -35 -138 119 -139 -60 -12 40 -109 -81 -79
6795 -79 -29 -23 165 3 -136 30 85 -24 24 25 -84 -42 10 45 -178 -44 -57 -72 28 -90 -104 -118 -19 -112 29 25
6821 25 3 161 -79 -48 -8 -101 72 -23 -119 -37 78 -201 -150 56 -23 13 4 -37 135 -2 25 -60 -50 -13 27 9 68
6848 68 -80 1 -12 -155 -173 52 38 -209 -96 51 55 189 -77 -19 205 117 50 -3 -99 -24 -53 -137 75 83 -131 183
6874 183 3 28 -126 -186 -106 46 198 -39 54 28 126 21 88 -52 -158 -75 -19 -50 175 -36 32 197 41 43
6898 43 -65 -92 -42 -99 -1 9 122 97 20 12 27 50 -56 -14 179 -39 33 4 67 108 -87 -137 274 88 -12 14
6924 14 99 17 87 -84 -166 170 -25 16 -52 -71 -42 -79 -71 -106 11 -110 98 -119 -68 109 -50 147 132 -159 54
6949 54 156 122 -70 82 72 44 -108 -53 -83 -54 92 113 195 293 29 -45 -27 -2 -71 40 -9 -84 8 -80 90 27
6975 27 98 -137 -101 -44 -15 68 -37 35 48 43 -3 121 38 -109 -10 -75 -36 62 90 82 38 67 -39 158 94 38 -67 19
7003 19 -38 27 9 15 130 33 34 48 127 -95 -28 39 46 -29 96 27 20 111 -74 -122 -31 -41 -74 -48 130 137 23 105 1
7032 1 -70 24 87 -77 25 -268 -6 -67 -131 -22 110 28 163 -39 51 -86 -43 11 125 63 74 -55 64 -5 28
7057 28 187 244 243 -76 28 74 8 -100 -14 -57 -42 63 75 -58 -21 -16 115 74 67 109 -114 9 -68 -92 -54 52 179
7084 179 -70 -30 96 -78 3 -5 89 84 -7 -23 -238 56 44 62 -68 -122 83 28 -7 7 -107 -43 78 86 44 26 31
7111 31 -49 108 -71 -189 -12 -10 32 -13 -56 -60 -9 155 94 -27 -46 36 48 97 62 -44 65 -6 -37 96 -96 -39
7137 -39 2 48 -46 75 -57 -6 -60 -57 -9 -67 24 -161 141 -67 58 -22 -59 -87 -115 -108 -120 -55 23 143 77 -50 48
7164 48 -69 -37 -60 41 60 -5 30 -203 94 24 157 -130 48 13 -5 -95 -98 123 88 170 -32 58 -143 192 169
7189 169 -4 267 -42 46 -38 -60 -72 -45 -59 165 47 3 42 -7 162 -112 13 -78 -37 -7 95 -93 -35 -104 -28
7214 -28 -38 25 -156 -24 -47 27 -75 0 -131 -48 -49 24 50 -60 78 -32 -21 -129 59 -184 -25 66 -9 37 -66
7239 -66 97 110 75 31 67 92 -17 -20 -80 -54 -21 -24 112 37 29 138 -95 77 -133 16 65 -13 -32 -206 104 -35
7265 -35 -119 -105 99 -75 -78 142 -41 47 19 -43 131 21 -128 -10 39 42 -3 -14 -140 -87 -53 106 -24 -58 84
7290 84 -29 -31 98 -130 23 99 -34 -36 61 -55 -205 -114 -5 -103 10 70 67 29 82 34 -104 199 17 83 81 35
7316 35 -155 -5 111 131 140 48 62 2 -26 -76 88 145 -146 79 -80 -119 239 55 5 -151 14 93 93 -30 -66
7341 -66 28 37 6 185 -117 13 -21 10 100 68 -32 14 -94 26 74 -57 135 -16 -7 -44 -46 -63 101 -8 -47 58
7367 58 -41 219 -14 -7 20 -147 -32 40 -28 -3 -119 76 -11 3 -56 17 39 -38 -18 -37 -36 -13 -51 -90 -38 -33 -62 -2 58
7396 58 -1 7 -20 -44 -53 19 3 -60 -30 112 3 9 -126 -60 51 -14 16 -5 -37 110 -15 -13 -117 51 4 -22 125 -21
7424 -21 155 132 134 -67 139 -17 -26 -72 -36 91 51 13 -8 -50 -8 -31 -53 73 -79 -118 46 53 -113 62 -51 -87
7450 -87 15 -32 95 -10 -32 -90 73 128 78 -16 31 42 235 12 -60 -145 29 -93 53 65 73 11 -155 -93 52
7475 52 125 -127 52 54 84 23 93 -100 -91 -129 -219 38 45 2 49 -7 61 -9 38 88 -123 -222 46 44 -62 100 138 -133
7503 -133 73 27 -49 -47 -8 -68 41 83 -97 69 -51 -7 3 26 99 14 -88 -71 -63 -35 -24 94 -80 89 -38 46
7529 46 46 18 -18 65 -174 47 -11 -97 52 120 0 -82 -24 67 78 11 -166 -106 7 77 21 -44 73 54 89 145 33
7556 33 109 14 -2 91 -102 -79 93 161 133 87 23 -15 -144 32 -134 18 -26 147 -70 132 -119 168 74 -13 -92
7581 -92 22 -154 -66 122 -196 199 -15 28 74 33 -84 8 -11 -1 -2 23 167 42 97 152 -106 46 -36 -154 17
7606 17 12 238 -8 -37 155 115 131 -49 -101 88 171 -9 28 34 8 -107 -224 38 61 9 118 8 59 -10 46 -152
7632 -152 9 -61 -66 -27 54 -37 46 96 -33 99 -39 -82 -80 -27 -11 -24 13 -132 27 157 -37 77 -3 26 122 94
7658 94 -39 37 -69 -82 70 -103 98 -41 0 -185 -33 54 48 59 -35 60 -98 -26 175 117 -30 -77 -64 16 51
7683 51 90 156 27 -25 -88 71 -24 70 30 -39 42 145 57 64 -47 33 -125 -38 -101 41 48 43 10 82 -13 6 29 -24 -66
7712 -66 -55 3 37 -75 -85 -73 -2 93 60 55 23 76 -40 -21 48 -75 -13 57 -18 48 -68 -44 145 0 -13 -20 -45 45
7740 45 -25 59 124 32 3 -96 60 -134 -63 -144 77 -16 52 31 -104 77 -164 -97 57 30 -43 -7 54 -83 -57 -18
7766 -18 149 1 -33 127 121 -20 -111 -51 77 -25 79 31 64 -181 61 -119 -7 -28 100 45 -91 94 -84
7789 -84 -59 -23 -174 -36 -128 127 22 70 -99 15 -7 -31 87 -29 -81 139 -2 -33 99 -94 3 -99 -28 -178
7813 -178 57 62 -118 -126 -61 -110 -82 -11 108 -33 69 -93 35 -40 51 -122 -94 -134 218 -3 66 -95 15 47 -13
7838 -13 31 -144 -81 -191 12 -82 -55 23 3 -90 -87 7 -45 -60 101 80 91 160 23 -3 -90 -53 36 -30 153 -97 27
7865 27 -51 38 55 -56 212 34 -169 -165 159 -86 -110 -94 -140 71 88 63 -1 12 17 97 -131 82 94 39 28 135
7891 135 254 -39 -76 1 -9 41 -129 -92 -36 84 27 -43 37 -12 -61 113 123 -59 50 46 96 81 67 9 -11 44 74
7918 74 -60 84 44 -7 129 9 -1 49 87 -20 23 -21 -5 -57 -67 -89 -4 -187 12 1 -53 -46 -78 13 -64 -205 -35
7945 -35 -37 18 -80 -57 -71 -5 -98 42 58 14 -10 90 95 -84 -96 -54 -47 -59 -35 53 -140 -64 131 -26 -35 -36 222 -102 110
7974 110 58 3 -146 -42 21 235 49 -13 79 -15 -21 -48 65 -76 107 -99 -105 -63 35 -123 -23 -214 -8 -129
7998 -129 -66 55 56 -158 -157 -152 58 -2 -129 216 139 55 -149 105 -157 136 181 8 152 84 -78 90 -50 -269
8022 -269 -106 78 -84 -17 -94 17 96 -68 22 72 -107 -37 -63 40 153 -48 102 57 -32 35 54 -23 33 -121
8046 -121 -51 -132 -7 -214 -38 -6 -34 11 -36 38 119 55 -57 106 -33 -67 23 -18 -3 78 178 -3 26 -104 96
8071 96 -102 -40 102 -237 -17 28 50 31 17 -26 -51 4 33 174 -5 -14 84 85 -48 -64 134 -114 48 -44 -73 32
8097 32 -126 -21 13 22 45 -27 45 -53 -4 -43 -185 -48 -78 111 196 58 -86 -28 37 34 89 -65 -143 25 75 54 -42
8124 -42 -49 -63 274 14 -179 -107 -8 -74 62 -29 -10 28 -120 9 -44 -71 -53 74 56 53 183 192 110 30 201 27 -59
8151 -59 18 290 4 43 6 40 -18 15 -313 18 45 -56 -110 -44 -19 -43 -130 -63 -167 55 -9 -66 -12 111 204 -24
8177 -24 -54 -33 -1 -15 84 38 -68 -101 -88 -10 185 55 13 -16
8191a6
$$ Imaginary data points
##PAGE= N=2
##DATA TABLE= (X++(I..I)), XYDATA
0 0 0 0 0 0 0 0 0 0 0 0 -8 8 -8 16 -16 24 -26 32 -40 48 -56 72 -80 96 -112 136 -155 179 -208 240 -272 311
32 311 -352 399 -450 506 -567 636 -710 793 -882 979 -1086 1202 -1330 1469 -1621 1787 -1971
49 -1971 2169 -2390 2632 -2901 3203 -3541 3921 -4354 4854 -5436 6122 -6949 7969 -9258
63 -9258 10949 -13276 16685 -22177 32469 -58323 260849 284509 -408585 -122575 266846 40880
75 40880 -200259 65643 42932 -181507 6407 253997 -52284 -227108 85466 183350 -106956
86 -106956 -68966 139998 -17778 -173799 71143 143156 -113400 -90283 164069 49028 -155393
97 -155393 16857 149477 -66857 -128841 59633 31991 -101380 29592 98765 -102541 -87025
108 -87025 182593 111191 -182413 -100806 131428 30114 -94069 39279 54798 -95860 -2061
119 -2061 153996 -24464 -170622 44795 141095 -78260 -95830 101590 17224 -157163 14644
130 14644 168451 -35777 -129111 84986 108929 -82335 -39077 89747 -32101 -102439 68198
141 68198 79744 -93170 -31010 113029 -18739 -105177 84635 92220 -147990 -89309 162731
152 162731 53202 -158785 -500 138739 -53927 -94070 121232 61183 -153489 -8187
162 -8187 175946 -34101 -168576 62758 113786 -112673 -64147 142691 12051 -146266 42231
173 42231 126738 -97078 -104412 118345 49792 -135189 8727 144290 -41408 -107484 86520
184 86520 67969 -111562 -17740 116996 -43170 -120016 82255 96887 -115305 -71345 116143
195 116143 23088 -104877 31767 89803 -70134 -57225 98479 17858 -112690 20899 110403
206 110403 -46077 -69509 90790 38996 -114706 -6621 111907 -42230 -112292 68387
216 68387 85166 -92836 -49924 104382 8698 -101946 33047 90197 -60098 -55207 88991
227 88991 23951 -95254 17791 91590 -55251 -75220 81940 46093 -97160 -12122 90688
238 90688 -38031 -89925 63322 59455 -90498 -21958 111510 -5764 -100756 47144 84327
249 84327 -78991 -55303 103280 24807 -107320 14084 99781 -51994 -86265 69965 47747
260 47747 -89389 -13211 89247 -25671 -78910 56931 53761 -82383 -19453 102379 -6229
271 -6229 -92392 48014 84906 -71879 -61462 84245 24213 -92612 8449 83501 -43035
282 -43035 -67221 63832 32861 -84820 -4861 84925 -25763 -68955 60898 54118 -75191
293 -75191 -21024 86884 -9918 -79988 45914 67722 -69955 -43656 82836 6251 -96672
304 -96672 17102 83095 -49855 -65512 73071 40260 -84716 -8945 86103 -20487 -72858
315 -72858 52090 60417 -62714 -27348 73798 -2772 -72956 27882 54127 -56101 -34834
326 -34834 69434 4588 -79266 19427 69120 -49497 -55190 70964 36099 -75349 -1134
337 -1134 81763 -22775 -69203 48845 51426 -64617 -23752 74251 -4933 -73617 27579 53151
349 53151 -57873 -38526 67461 9290 -72032 20507 68117 -44392 -50507 66386 30223
360 30223 -72791 2939 79975 -24462 -66677 48426 46425 -69131 -27661 71601 -3158
371 -3158 -71592 26175 55929 -50029 -39125 59428 12467 -62532 16865 62091 -34359 -40943
383 -40943 57184 23024 -64422 3103 64531 -27694 -54830 48907 35589 -68239 -19014 69051
395 69051 -11642 -71911 30648 59311 -46446 -36974 59816 15560 -59572 12563 57045 -31362
407 -31362 -38444 53740 23853 -60603 -4068 55192 -23495 -50279 39113 30121 -56966 -11455
419 -11455 62416 -13138 -64482 31870 56403 -43294 -34599 57420 17614 -55020 10433 53884
431 53884 -30438 -42615 46312 25199 -57462 -8579 54544 -15399 -50816 29334 30007 -48983
443 -48983 -12222 58243 -6850 -54024 33548 50781 -49044 -35244 62070 18953 -60238 9272
455 9272 57932 -33777 -50371 46310 26139 -63512 -8349 64737 -13493 -58634 28819 37851
467 37851 -45545 -12648 59616 -6238 -54657 33329 48915 -49145 -30715 62261 11422 -64112
479 -64112 10648 54615 -36561 -46128 48716 24232 -58312 -3740 54726 -22952 -50603 41725
491 41725 42688 -44781 -17361 50793 -1619 -43471 23986 32411 -39200 -13125 53671 -4066 -63231
504 -63231 8757 47624 -24464 -31544 35788 10805 -43702 8945 43450 -27968 -38255 45366
516 45366 36288 -43730 -18186 42542 -345 -35201 19745 25272 -34940 -13415 39914 -8173
528 -8173 -49487 18783 45249 -30916 -36363 35937 18533 -37826 4385 40157 -20612 -28381 45757
541 45757 23323 -59914 -14898 64958 5750 -55596 8495 35536 -32365 -22557 43177 -913
553 -913 -55230 18530 59172 -30339 -50739 39495 34644 -39876 -5041 46172 -15819 -40338 37365
566 37365 30509 -52002 -15570 58319 -5310 -61416 19377 49415 -36809 -37056 43636 15041 -47553
579 -47553 6710 44487 -25973 -32279 48277 27242 -51602 -13314 47961 -1518 -34426 18663
591 18663 17991 -34016 -3895 36919 -18494 -43189 28481 36111 -35965 -23110 38271 6236 -35945
604 -35945 13495 34510 -22261 -18857 35902 6313 -41834 6978 42566 -16852 -36653 19780
616 19780 18446 -27200 -4094 23778 -17415 -20411 36718 15477 -50751 -11028 54668 6574
628 6574 -41718 12854 33364 -26411 -18674 39111 2492 -46983 13012 48984 -26932 -48313
640 -48313 28054 28929 -36514 -11515 38719 -5469 -33748 23136 24190 -36957 -8329 52017 332
653 332 -50898 14059 44845 -26489 -33086 34540 13728 -41848 4023 39482 -28269 -42843 38427
666 38427 37010 -41605 -22983 40351 5819 -33073 14150 26915 -24675 -10222 38132 -1195
678 -1195 -41999 11117 35658 -22449 -25570 29328 9045 -37030 641 30334 -17873 -23917 31861
691 31861 17000 -37885 -5185 41576 -2304 -33774 14534 26308 -18489 -9972 22970 -7324
703 -7324 -28081 18066 24845 -28244 -21349 27561 6967 -28115 6080 23520 -19319 -15250 32613
716 32613 8922 -37072 3177 40791 -9848 -33258 20615 24459 -28634 -14581 29743 -811
728 -811 -30423 11642 22804 -26292 -17714 31797 6790 -33884 5212 32328 -12849 -20721 24875
741 24875 10672 -29677 5193 35637 -16516 -34168 25212 25845 -32827 -17598 31465 431
753 431 -32406 11361 26276 -23537 -18431 31493 9573 -31710 3909 31188 -11548 -20873 22662
766 22662 12303 -26486 -6 26446 -13662 -24926 22206 15907 -32454 -9533 32458 -2367
778 -2367 -32018 11441 25767 -18857 -14094 27823 5787 -27870 7489 28717 -14174 -21955 20719
791 20719 12616 -23811 -2830 21498 -11393 -20750 18082 11485 -26728 -3960 28685 -5114 -26190
804 -26190 15623 22824 -20993 -12218 28433 4969 -27384 7125 25673 -16071 -21089 20868 11028
817 11028 -26314 -4169 23109 -7440 -20548 14269 12229 -20773 -2863 24597 -4602 -21202
829 -21202 15774 19587 -19879 -10067 25288 1832 -25815 7438 22408 -17252 -19277 20668 8986
842 8986 -26475 -2935 24156 -6766 -20596 14477 14965 -17965 -4617 22226 -2068 -18393 12335
855 12335 15882 -17601 -8432 21293 -832 -23463 7433 18454 -17591 -15458 21133 6543 -25129
868 -25129 657 24495 -8381 -19950 16514 15647 -18201 -5378 22089 -1360 -18952 9724
880 9724 14674 -16021 -9339 17791 -380 -20515 6065 15270 -15240 -11735 19317 4788 -21245
893 -21245 4231 22296 -9683 -16980 17417 13538 -18915 -4426 21010 -2678 -19707 8626
905 8626 13825 -15669 -10022 16209 721 -18212 4826 14106 -11456 -8505 16565 3401 -16721
918 -16721 5519 18359 -9558 -12753 16808 9099 -19388 -3038 18972 -4998 -18955 9002
930 9002 13374 -15420 -10077 15491 2224 -16552 4270 15463 -7636 -9555 12946 5896 -12875
943 -12875 1906 14243 -6668 -10532 11984 5678 -16916 -2212 16295 -5210 -17404 8608
955 8608 12470 -14147 -8690 16609 3056 -16511 4547 16587 -8302 -11754 13867 8868 -13492
968 -13492 -1497 13402 -5004 -11896 9217 5728 -14936 -1584 14923 -5783 -16129 9433
980 9433 12151 -13157 -5705 17201 1198 -15946 6779 16066 -10359 -10970 15243 7146 -16398
993 -16398 -2867 13157 -4308 -11189 7430 4639 -12471 -1170 11564 -5241 -10701 10356 9091
1006 9091 -11621 -2823 13803 -1533 -11834 8774 11900 -11742 -8001 13965 2357 -16850 -13
1019 -13 14519 -4651 -12403 6400 5923 -10472 -2012 11629 -1288 -8205 7899 7506 -10097 -3978
1033 -3978 12674 1304 -10152 4924 8652 -10471 -7781 11218 2144 -14041 1984 14354 -7151
1046 -7151 -15080 8422 11072 -9415 -4269 12753 1266 -10668 4391 8745 -8460 -4277 13681
1059 13681 2799 -14160 -402 9308 -6572 -7589 9319 3079 -12041 1493 11394 -8252 -11997
1072 -11997 12831 12280 -11216 -5565 12383 920 -10968 4097 8915 -6598 -3724 9692 -1636
1085 -1636 -13736 1693 10345 -4378 -6483 5799 904 -7228 3016 5993 -6982 -2482 13574
1098 13574 3402 -13363 -1023 11842 -1716 -7723 5691 4516 -8439 -1990 7596 -4390 -10122
1111 -10122 6267 9249 -7206 -6963 6444 2659 -6357 2245 6793 -3398 -2054 8241 87 -10703
1125 -10703 1740 11867 -3038 -10557 4495 6650 -7821 -5192 7260 -21 -8326 4712 9093
1138 9093 -8113 -8895 10593 8462 -8792 -3320 9415 505 -7073 3686 4072 -7814 -1312 10065
1152 10065 -2618 -12358 3484 9135 -7321 -6937 8816 2922 -9632 1730 9680 -5436 -6727
1165 -6727 10832 6394 -11548 -2865 12370 401 -10614 1970 6525 -5078 -3172 5334 -2637
1178 -2637 -7501 5327 6607 -7358 -4808 7828 2356 -5676 2876 5176 -5212 -1670 8888 -190
1192 -190 -10231 2433 9849 -4590 -8561 4683 3933 -7141 -1597 5843 -2469 -5039 5429 3377
1206 3377 -7136 -689 8812 -172 -6604 3684 5501 -4697 -2130 6113 -1452 -7588 4384 7011
1220 7011 -7804 -7928 7523 5372 -8261 -2802 7115 -144 -5458 4175 4681 -5603 -1643 8389
1234 8389 1148 -7733 1256 6355 -3332 -4428 4273 896 -6332 955 5342 -5119 -5667 6964 4120
1249 4120 -8298 -1863 9107 553 -7197 2732 6378 -3868 -3001 6594 717 -7780 1230 7027
1263 7027 -3781 -6511 3422 3141 -4939 -920 4070 -2842 -3148 5581 2524 -6404 59 7914 -835
1278 -835 -6079 3570 5198 -4656 -2867 5992 -231 -6738 1827 5410 -4590 -5132 4952 2695 -5652
1293 -5652 -759 5093 -1343 -3010 4074 1881 -4693 1034 6315 -2407 -5281 4141 4077 -5577 -2685
1308 -2685 5397 -859 -6408 2430 4935 -4992 -4230 6059 2673 -6076 -282 6249 -945 -3976 3255
1323 3255 2955 -4014 -466 4719 -1703 -4601 3136 3000 -5319 -2075 5176 -562 -5447 2343 4404
1338 4404 -4441 -3029 5942 1691 -5858 924 6526 -1799 -4803 3598 3596 -4422 -1592 4041 -962 -4453
1354 -4453 1986 2592 -4125 -1913 4132 -433 -4172 2241 3676 -3164 -1839 5276 1064 -4991 1347
1369 1347 5453 -2477 -4405 3817 3028 -5153 -1770 4437 -635 -4676 1625 3072 -3150 -1948 3822
1384 3822 440 -3549 1867 3598 -2381 -1818 4121 655 -4014 1022 4101 -2999 -3713 3818 1813
1399 1813 -5192 -1022 4606 -1004 -4522 2050 3480 -3189 -1932 4059 900 -3421 1329 3543 -2037
1414 -2037 -1892 3213 654 -3652 573 2891 -2827 -2656 3101 893 -4352 -49 4335 -1233 -3663
1429 -3663 2797 3022 -2960 -1610 4042 1066 -3502 1044 3278 -2034 -2607 2575 1151 -2941 -322
1444 -322 2422 -1683 -2522 2247 1107 -2909 118 3572 -1058 -2917 2460 2705 -2826 -821 3978 121
1460 121 -3976 702 3204 -2333 -2915 2816 1246 -3505 -817 2939 -936 -2407 2050 1780 -2199 -179
1476 -179 3025 -837 -2338 2478 2541 -2690 -806 3318 -656 -3705 1365 2765 -2796 -2281 3051 581
1492 581 -3956 -199 3490 -953 -2136 2146 1633 -2170 -266 2423 -442 -1685 2054 1317 -2580 -859
1508 -859 2085 -791 -2374 1409 1557 -2416 -1261 2525 84 -2570 1144 3106 -977 -2046 1760
1523 1760 1582 -1972 -364 2133 -191 -1666 506 688 -1631 -1203 1654 299 -1601 245 974 -1201
1539 -1201 -792 1562 592 -1461 751 2125 -908 -2023 1619 2077 -1684 -1323 2019 381 -2471 18
1555 18 1591 -1076 -1682 1506 983 -2080 -391 2158 62 -1250 1113 1138 -1443 -30 1829 -822
1571 -822 -1977 1650 1583 -2516 -1424 2335 -43 -2636 533 1957 -1730 -1403 2022 464 -2203 458
1587 458 2681 -801 -1620 1263 1035 -1579 202 1583 -1100 -1132 1651 292 -2738 -14 2402 -666
1603 -666 -2215 1201 1302 -1752 -589 2235 65 -1688 1093 1999 -1579 -1271 1642 858 -1302 -150
1619 -150 736 -838 -929 739 -136 -1486 404 1471 -788 -1514 926 1439 -854 -353 1498 62 -1165
1636 -1165 203 1181 -831 -1001 1201 986 -1553 -1341 688 290 -953 -133 715 -66 -529 599 -127
1653 -127 -682 665 1448 -153 -870 595 763 -811 -356 874 -139 -1040 694 623 -1682 -940 1324
1670 1324 757 -1343 -195 1340 10 -750 516 557 -463 370 1042 -524 -961 524 579 -806 -195
1687 -195 789 -391 -835 695 225 -1441 64 1640 -179 -1618 452 1443 -459 -820 1035 329 -839
1704 -839 182 687 -815 -853 995 405 -1184 -406 1037 -346 -862 544 503 -737 265 1345 -456
1721 -456 -1244 880 1402 -893 -1089 1052 686 -1053 -481 666 -469 -987 542 404 -1080 -405 1010
1738 1010 96 -801 229 707 -33 -120 604 17 -711 440 945 -656 -930 711 576 -1053 -572 707
1756 707 -172 -849 391 728 -675 -409 1036 511 -812 -41 832 171 -472 97 299 -305 -17 313 -487
1775 -487 -644 683 274 -989 -215 801 -122 -761 527 504 -634 -384 1055 271 -845 284 1173 -174
1793 -174 -928 394 489 -508 -332 211 -380 -612 521 314 -938 -133 1000 -50 -652 587 718 -412
1811 -412 -188 1064 197 -901 207 1026 -464 -1271 697 669 -821 -596 431 17 -432 358 340 -405
1829 -405 -249 843 148 -619 325 640 -389 -360 646 107 -1046 -119 597 -433 -772 756 645 -936
1847 -936 -513 986 112 -942 215 880 -120 -367 695 311 -586 -90 770 -418 -747 492 61 -710
1865 -710 -93 515 -618 -743 593 479 -620 -222 1078 109 -1030 158 890 -231 -443 717 463
1882 463 -827 54 540 -370 -704 272 308 -570 -137 546 -158 -420 554 320 -637 -66 1041 75 -1100
1901 -1100 440 759 -603 -678 613 337 -1151 -302 853 -236 -674 377 557 -561 -291 584 187
1918 187 -407 444 596 -518 -223 740 6 -718 408 720 -557 -610 667 141 -922 -141 819 -108 -762
1937 -762 289 611 -520 -281 915 255 -560 67 658 -285 -315 451 127 -635 36 414 -474 -701 587
1956 587 286 -639 101 840 -74 -737 655 1040 -637 -454 940 268 -793 -51 710 -242 -723 339
1974 339 284 -826 -146 599 -247 -641 646 388 -728 7 1067 -157 -744 793 840 -920 -406 1196
1992 1196 -40 -1168 120 983 -718 -869 532 363 -1086 -101 961 -238 -614 779 396 -651
2008 -651 199 762 -132 -473 1022 264 -961 -30 944 -441 -785 462 684 -817 -640 875 212 -735
2026 -735 323 805 -147 -603 603 277 -361 163 512 -158 -284 145 232 -429 -35 534 -415 -628 146 271
2046 271 -550 -170 694 448 -576 -153 757 -49 -615 505 816 -343 -369 311 -139 -722 -31 539 -212
2065 -212 -338 202 129 -607 -229 472 -59 -222 788 334 -1046 -56 985 -134 -840 527 670 -797
2083 -797 -814 779 59 -933 205 851 -578 -1078 605 364 -701 434 921 -95 -480 605 236 -944
2101 -944 300 1100 -530 -890 595 314 -1191 -345 1070 -86 -962 468 731 -722 -644 1099 493
2118 493 -552 94 855 -224 -420 652 73 -653 254 727 -671 -565 386 288 -620 -9 635 -241 -692
2137 -692 377 489 -566 26 1003 215 -822 54 639 62 -624 177 390 -375 -178 184 -394 -429 431
2156 431 226 -359 -168 561 96 -584 283 618 -224 -123 843 92 -828 245 734 -378 -995 247 450
2175 450 -551 -564 433 -95 -619 293 525 -601 -130 679 281 -493 350 502 -235 -238 610 -79 -812 429
2195 429 688 -847 -937 643 729 -938 -309 731 -53 -462 467 554 -478 -90 905 261 -799 211 559
2214 559 -198 -263 331 -134 -700 43 407 -686 -457 698 277 -818 -109 980 124 -679 303 686 -7
2233 -7 -185 578 -182 -800 -81 711 -178 -699 -38 154 -379 -146 198 -258 -117 629 272 -714 167 794 -33
2254 -33 -577 205 498 -482 -306 462 231 -740 40 447 -468 -661 346 482 -558 -319 164 -71 -263 328
2274 328 164 -369 328 696 -297 -528 394 403 -763 -488 421 -94 -583 353 414 -860 -584 734 359 -713
2294 -713 -187 780 -84 -388 252 342 -290 10 494 -233 -636 398 331 -604 -421 402 -161 -560 324 464
2314 464 -697 -336 772 170 -683 -47 845 170 -603 381 410 -273 -352 340 -131 -454 108 151 -535 -345
2334 -345 399 36 -329 156 386 -169 51 577 -1 -650 276 842 -226 -740 459 450 -448 -392 171 108 -540
2355 -540 10 204 -196 -62 359 100 -364 126 407 19 105 431 140 -290 193 556 -463 -581 390 260
2375 260 -492 -308 489 10 -641 44 532 -298 -306 464 491 -196 116 412 -81 -351 384 120 -298 27 161
2396 161 -215 -541 407 125 -696 -218 731 -89 -611 401 503 -307 -362 605 415 -408 141 583 -98 -557
2416 -557 -61 207 -349 -78 141 -155 -248 341 -36 -347 236 581 -57 -429 550 482 -372 -134 534 -24 -790
2437 -790 -60 299 -291 -367 11 166 -458 -370 184 184 -160 69 222 -36 53 141 73 -230 430 346 -257 -235 190
2460 190 -125 -677 155 408 -259 -539 328 233 -509 -345 621 334 -160 102 467 -6 -271 182 225 -128 -76
2481 -76 305 -163 -369 271 19 -518 -46 285 -390 -420 425 268 -411 58 832 69 -593 144 353 -130 -219
2502 -219 569 160 -482 -38 119 -309 -369 335 45 -477 -52 362 -357 -230 404 218 -408 186 747 -168
2522 -168 -519 481 586 -657 -290 485 64 -655 -147 274 -348 -357 222 135 -284 -15 286 -107 -48 369 71
2543 71 -430 185 441 -230 -99 278 181 -360 -209 399 -8 -457 98 454 -67 -255 198 346 -207 -83 553
2564 553 313 -128 -59 159 -111 -275 313 -2 -474 125 63 -352 -223 442 218 -798 131 505 -236 -502
2584 -502 472 503 -397 -214 843 63 -616 276 313 -367 -252 295 -195 -434 -93 90 -172 38 485 122
2604 122 -497 497 524 -305 -174 574 203 -630 96 325 -328 -487 367 261 -619 -470 261 48 -337 174
2624 174 133 -185 90 254 -11 -79 429 314 -287 35 270 57 -227 59 324 -241 -188 260 185 -554 -184
2645 -184 478 358 -244 -177 394 -152 -219 93 407 214 -117 113 -7 -329 -116 -59 -247 59 47 -185 -443
2666 -443 -15 130 -364 -36 688 48 -479 11 577 46 -346 460 526 -470 -116 261 114 -310 118 287
2686 287 -305 -290 194 -240 -316 278 177 -523 18 597 -158 -396 281 536 -609 -431 647 148 -771 -213
2706 -213 523 -169 -316 381 203 -526 -447 327 -123 -262 148 176 -237 102 243 -348 -62 376 240 -444 -318
2727 -318 433 6 -525 234 190 -226 -284 212 -58 -395 213 405 73 -411 113 257 145 17 176 -41 2
2748 2 135 42 -487 -1 193 -297 -502 50 266 -298 -134 155 282 -168 -54 470 44 -210 288 511 37
2769 37 -134 124 190 -139 -201 -43 -155 -57 300 -132 -385 82 303 -328 -232 451 294 -302 55 415 -109 -413
2791 -413 439 333 -543 -287 576 82 -556 -345 113 16 -124 162 69 -222 187 489 -135 7 265 220 -90
2812 -90 21 197 -189 -186 281 20 -540 -237 391 11 -692 -130 306 -123 -295 253 285 -204 183 144 64 -248
2834 -248 285 74 -98 23 164 -214 -107 160 26 -280 -120 358 -196 -242 154 502 -156 -252 319 323 -105
2855 -105 91 335 40 -204 119 141 -102 -299 -16 12 -146 -45 47 -168 -95 254 -173 -283 275 235 -203 -112
2877 -112 398 316 -241 40 260 -253 -295 150 39 -94 -128 191 74 -287 -26 105 8 61 162 101 -27 187
2899 187 256 -244 47 375 85 -468 -32 181 -284 -452 46 84 -463 -156 255 -5 -450 -11 343 121 -65
2920 -65 165 202 -114 42 14 -92 17 185 -170 -568 -37 120 -230 -188 208 -82 -430 -61 295 -44 -280
2941 -280 347 340 -182 -252 284 19 -118 -44 92 -166 -179 -51 -192 13 111 122 -91 -4 126 74 -66 86 304
2964 304 -7 -208 348 366 -225 -160 325 106 -333 -161 178 -12 -431 135 39 -201 -215 70 99 -201 84 259
2986 259 -62 71 307 -124 -141 240 184 -403 -126 287 -202 -461 113 171 -270 -332 201 317 -218 -279 280 114
3008 114 -68 301 -30 -185 -65 190 -185 -118 206 -206 -392 23 102 -297 -240 234 200 -272 -53 316 146
3029 146 -283 123 338 48 -299 291 56 -82 -35 34 -33 -199 -91 -114 -154 209 21 -207 -153 255 142 -252
3051 -252 93 220 271 -34 92 326 18 -202 61 254 -69 -212 137 98 -305 -251 227 118 -145 -57 74
3072 74 23 -47 127 65 -125 193 293 -213 -78 294 39 -331 147 272 -328 -504 135 35 -458 252 393
3093 393 -49 -343 146 290 -38 129 343 59 -121 297 -64 -310 -13 388 -338 -51 410 -86 -436 -118
3113 -118 332 -133 -271 430 418 -209 52 423 146 -214 52 181 -62 -159 259 -348 -211 147 70 -212 -88
3134 -88 159 -362 -235 260 193 -261 13 210 -69 -209 62 337 117 -148 91 -76 -107 -56 -112 4 60 -200
3156 -200 -65 104 -81 -86 -38 192 193 92 76 115 -182 99 83 68 176 88 -303 47 179 18 -100 126 105 -252
3180 -252 -270 -50 210 -55 -160 353 -50 -78 259 203 -212 -4 128 -177 -138 226 -173 -417 127 48 -142 -413
3202 -413 185 127 -321 -129 351 1 -240 161 206 -231 -85 344 -34 -191 -138 120 -204 -102 -40 -355 -245
3223 -245 -154 -125 -263 -115 322 -90 -184 98 362 -70 -82 354 174 -103 -90 279 -9 -17 248 106 -136 -62 79
3246 79 -311 -112 -4 -70 -57 160 280 -138 -28 161 205 -10 18 74 234 -174 144 104 -29 -289 153 276
3268 276 -176 -245 48 165 -84 -213 69 100 5 -16 86 145 126 193 -136 -15 -46 27 -86 -53 51 -200 -151 179
3292 179 34 -352 -222 208 194 -153 -80 218 119 -10 -19 172 -22 36 122 -102 -185 -47 49 -137 37 44 -35 -79
3316 -79 177 17 -136 -93 306 184 -309 173 247 -19 -291 86 152 132 -82 48 -147 -184 34 -97 -75 99
3338 99 146 110 -66 -25 -24 175 183 208 -238 121 92 -1 -193 -62 79 -10 -155 -17 96 -18 -6 -151 204 -80
3362 -80 -94 180 27 -164 41 -20 60 -20 127 -112 -58 162 67 -157 -22 115 -41 -127 -52 150 -71 -39 74
3385 74 58 -228 34 313 66 -107 -17 69 -30 -199 -44 -115 151 -81 93 20 -29 214 -45 -385 66 210 54
3408 54 52 213 108 -122 74 267 105 -91 195 146 -44 -268 -68 -94 -28 -102 173 -31 -133 67 -55 -112 111
3431 111 -12 -290 26 78 133 -170 121 54 -39 -154 136 83 -302 -2 173 79 -216 210 -8 21 -31 83 353
3454 353 206 65 -48 -5 212 -75 -78 -115 71 -82 -37 -55 16 -148 -228 -57 188 67 -92 37 66 -7 -41 35
3478 35 103 105 -85 189 -21 -53 -129 71 -21 -32 -8 80 -57 52 74 -254 -72 224 61 -82 444 333 -93 -191
3502 -191 100 0 -236 -20 133 -103 -73 104 -47 -285 -155 47 111 -109 38 -23 -207 84 386 4 -69
3523 -69 286 101 -134 -66 218 50 -181 197 169 -150 -169 51 -81 -150 35 118 -53 -10 18 131 9 8 79 -171
3547 -171 -1 50 4 -174 46 -35 -122 -82 164 -34 -204 -20 -62 -60 -36 -93 -62 -39 -10 123 99 211 98 -1 98
3572 98 -86 -28 -66 196 -86 -76 -33 -115 4 -123 -69 -157 141 50 -96 33 247 115 4 56 93 6 -190 49
3596 49 35 -126 7 101 -66 -51 -101 -143 -120 -148 14 -38 -18 146 -79 -17 136 167 24 -67 260 25 -181 -79
3620 -79 119 -14 -236 -41 108 -142 -213 84 -25 -105 142 -16 -115 26 197 27 23 109 169 -23 82 163 -70
3643 -70 -191 83 -35 -54 -146 241 132 -133 -42 323 -66 -56 36 80 38 -52 -88 -35 31 240 -106 -48 96 -21
3667 -21 -126 12 103 -87 -206 210 76 -1 -56 33 182 27 -29 14 199 203 -29 100 139 -27 -175 -128 21 8
3691 8 113 -6 37 -155 -115 50 -41 61 169 10 -152 81 125 45 82 170 56 -73 183 -9 -263 -94 201
3714 201 -134 -379 -103 -62 -62 -115 38 -11 28 177 5 159 13 3 -47 -31 -75 -40 -119 -42 -15 -80 -130 28 -113
3739 -113 -107 -28 18 -68 -121 -19 136 -51 -47 79 -68 -8 106 -1 9 -128 17 8 -117 -107 -65 79 -123 2 -73
3764 -73 -141 76 23 88 -7 -41 139 26 101 82 192 65 -51 61 -19 -49 -88 -181 55 -92 156 136 62 34 29 -101
3790 -101 97 158 117 67 74 63 78 -182 68 36 -87 61 -108 -235 -42 50 94 -23 22 -110 243 83 88 -93
3814 -93 -19 33 -30 -20 4 4 82 82 -56 97 -26 -47 -8 161 268 -97 -15 192 147 114 39 66 -34 -148 -43 73
3840 73 6 84 -33 -44 68 166 -108 29 64 -57 -71 12 -38 -158 -44 -186 26 -85 99 91 -6 22 35 2 -83
3865 -83 -26 180 166 168 -163 14 -132 24 -76 131 75 125 57 -69 58 69 84 -24 96 44 160 -83 -68 17
3889 17 -90 87 -251 44 142 -95 26 -23 -21 -205 62 69 -53 -57 -5 42 41 81 -166 38 50 47 -36 -55 79 128 -71
3916 -71 15 -89 34 -30 -112 -45 -126 126 58 -34 1 -45 159 70 -11 -24 43 -15 3 -69 -69 -121 -67 -84 -58 -28 47 -151
3944 -151 55 108 -90 117 53 197 -232 156 -61 129 184 -217 -100 -82 135 122 -55 17 -160 20 -20 -69 15
3967 15 -288 -99 -60 157 -178 68 -135 50 73 -121 -70 117 -187 -116 42 15 97 -144 5 -46 101 16 190
3990 190 -17 -92 -99 70 -46 47 32 46 -16 -52 -162 -7 109 34 -224 44 114 194 63 69 -60 -124 173 160 -73
4015 -73 24 227 100 -125 146 70 129 55 241 67 -130 62 -90 -56 -158 144 -13 95 -4 46 157 141 34
4038 34 -41 -30 38 20 -144 -35 209 -10 -82 -69 132 -113 -30 -19 -110 -80 33 -88 -87 -8 96 22 -95 45 41 -26
4064 -26 126 19 85 -2 145 -137 45 -7 -10 -48 45 -45 62 -101 -47 46 1 40 20 18 1 27 -133 104 -3 5 -144
4091 -144 79 10 51 113 84 -22 -5 65 -63 110 -92 -38 35 113 41 64 195 89 135 -31 280 -12 85 -93
4115 -93 -80 -27 157 22 -139 156 -108 0 167 117 -163 12 140 -55 27 89 2 88 57 89 -128 -71 -87 -22
4139 -22 -177 13 -10 -50 30 -163 -25 -32 46 190 -94 -88 15 49 -69 -129 180 87 70 112 74 108 -64 -42 -10 -40
4165 -40 136 83 -63 167 46 94 211 76 52 -17 50 24 -8 -8 32 -22 -71 -59 -130 100 34 47 82 -155 -40 -153
4191 -153 50 -6 -10 -108 -52 172 72 18 160 29 -119 -68 -144 -126 76 -5 -42 130 -130 53 -13 127 6 138
4215 138 107 177 78 -14 93 105 77 50 38 -129 127 -59 -162 92 72 -25 81 -60 -91 -30 22 151 194 -113 262
4240 262 37 12 8 119 -98 -26 -65 -53 -121 -19 23 -125 -107 -255 113 -20 73 -108 73 -20 -57 166 181 21
4264 21 85 -40 193 -61 142 196 -72 4 -64 76 5 -11 61 -57 -81 -65 -72 69 23 -109 128 44 -102 12 -90
4289 -90 220 -25 41 -140 -136 -36 16 -37 23 121 -39 0 -57 -106 -117 -61 61 129 69 -147 57 69 87 -6 -14 153 18
4316 18 -26 52 -17 -71 27 88 -1 -4 93 218 -13 46 30 -108 74 158 75 192 1 -41 -31 15 -60 -236 -176 -48 72
4343 72 1 -244 -259 -32 73 -25 -176 -24 156 9 36 -65 97 30 145 67 -32 132 0 68 -25 -38 -102 -45
4367 -45 -133 -131 -138 -119 31 -128 3 65 217 73 -2 -198 -143 215 117 117 10 -51 -5 -78 -39 -51 -154 -242 12 -157
4393 -157 -114 124 -89 -60 -31 187 -106 51 -30 23 165 13 37 -12 3 -48 74 -27 36 33 0 24 115 59 -38 71
4419 71 51 -53 112 52 -156 -79 1 110 -28 -1 75 -21 155 -158 -178 -1 -36 74 -35 13 -105 -58 21 -107
4443 -107 -8 36 -109 116 3 120 -91 2 -65 252 69 -53 -49 -38 69 -34 -7 -71 66 -5 46 101 280 -104
4467 -104 -17 -16 -59 63 79 -39 1 71 -10 78 80 -64 -148 81 -18 -26 4 36 56 -19 54 169 -39 41 55 121 -139 -119
4495 -119 -22 -72 -85 -28 -111 -13 -18 74 -26 160 -9 56 50 133 25 -68 32 90 -48 -102 58 -3 -30 16 149 -83
4521 -83 -62 -75 13 -6 -87 -89 -47 -62 -4 -20 59 53 -66 190 40 40 139 -55 41 -97 288 -28 12 41 -113 151 -89
4548 -89 20 -4 207 -81 -119 -62 104 -53 -115 29 88 -85 60 84 83 -232 -136 55 39 11 98 -42 -137 -60 -119
4573 -119 -105 -57 -24 107 -75 43 -17 -233 34 101 -28 96 30 -39 70 85 13 33 91 -9 -156 124 65 -11
4597 -11 117 113 108 -110 88 209 -48 -33 -124 -119 -69 72 53 73 31 55 191 201 63 -113 -14 -5 -76 -82 43 10 -32 -157
4625 -157 -134 158 109 -56 18 139 -130 -151 50 -95 57 -87 -210 -64 -52 88 -7 65 108 63 -172 61 25
4648 25 -16 -114 200 34 -67 133 44 -131 14 75 172 -128 74 8 -52 70 -1 -60 52 168 229 -33 11 17 -116
4673 -116 54 -57 -24 -120 -119 -57 114 -136 10 13 94 -196 -11 -153 96 10 -2 142 82 -117 -55 152 120 -80
4697 -80 -43 -76 13 117 -68 174 68 92 84 106 -14 153 -8 -130 217 114 45 68 80 21 120 -55 -91 48 -59
4722 -59 -16 -7 112 -181 -102 6 -119 89 119 65 -192 1 53 -130 -39 16 6 12 146 -123 152 4 182 144 -5
4747 -5 190 36 -185 -170 73 -47 -60 -17 -100 -104 54 -18 -64 -69 28 -25 -38 98 19 -44 -75 -55 -27 55 -15 88 127 1
4775 1 49 -62 79 -181 -19 27 -10 -98 -79 72 40 20 181 48 39 -64 44 30 119 79 36 19 75 152 -62 -67 -4
4802 -4 101 254 22 191 37 72 -60 -74 -52 34 79 -48 -178 -187 93 106 -40 103 -65 -11 91 89 -99 40
4826 40 -133 -72 110 -132 98 -5 160 -43 7 7 76 92 -51 96 144 -76 8 38 -62 103 152 82 43 -9 -3
4851 -3 -33 5 69 -32 -155 -132 138 104 105 49 -89 -101 -16 45 191 -109 42 -41 -105 158 9 65 162 61 71 -91
4877 -91 -34 50 -36 141 53 -117 -70 -6 217 -36 148 -23 -26 10 -14 78 -116 156 -36 246 -46 125 -43 80
4901 80 72 129 96 -36 -37 101 10 -68 45 134 -69 -58 -163 5 85 -35 -51 78 143 32 -13 88 -231 -64 70
4926 70 79 -17 170 32 -38 67 -187 123 98 4 -70 5 -68 59 -27 -156 -89 -138 19 -83 -53 6 -58 -80 -28 -33 51
4953 51 -2 -59 74 65 -20 -35 17 6 50 2 -1 54 -43 200 -86 47 -56 8 6 -164 21 6 11 103 -69 68 37 1
4981 1 -134 9 -41 33 -113 59 32 27 44 -108 -71 50 106 -16 -91 19 66 20 81 76 203 -146 151 12 28 -55
5007 -55 -48 49 -56 -45 -42 21 15 -94 -93 22 139 64 49 8 40 137 -65 -120 -162 -63 -19 -64 20 42 -133 -80 68 -40
5035 -40 -105 17 87 23 62 12 110 -33 56 52 -52 77 -78 126 42 -65 1 74 64 149 47 138 89 98 20 -67 -7
5062 -7 -58 34 -121 -2 94 44 -123 -98 54 28 254 -98 -156 140 22 15 79 55 -82 117 -85 -139 303 -111 -8
5087 -8 -22 -44 -125 44 -83 -105 81 4 -159 57 -138 -107 -8 -33 143 -115 41 -21 -149 -117 48 128 -12 65 -113
5112 -113 -48 -74 103 54 14 -163 113 -40 -42 83 76 185 67 -185 -134 -82 -90 35 50 -70 -119 -24 2 261 -218
5137 -218 -47 16 66 28 61 38 -124 16 -58 -10 77 19 153 47 28 -35 -26 32 47 33 77 -168 1 116 -63 -112
5163 -112 42 120 45 -129 98 -110 -24 -137 -53 28 -40 130 -15 16 35 -35 54 73 5 -69 61 47 -82 -43 -74
5188 -74 94 -52 63 -72 55 5 -145 -17 -16 91 76 -51 -5 -113 -165 41 -38 -20 -51 67 108 154 -198 76
5212 76 12 -50 -37 -108 75 -62 116 -39 11 -74 45 -41 -49 69 -71 -151 -36 14 -176 75 87 -2 21 -45 -191
5237 -191 60 -45 -6 -106 69 201 8 4 23 -20 59 51 7 72 -3 28 -148 316 -40 84 5 -134 -34 -97 -179
5262 -179 80 4 12 74 11 67 -92 -73 -68 -107 8 48 -67 58 -65 154 45 -113 103 -63 58 142 12 166
5286 166 7 49 1 8 51 95 78 -155 21 -70 77 -63 132 -59 14 102 10 153 -164 21 -16 65 90 -36 39
5311 39 -51 -42 85 -106 -110 179 -16 -90 -51 -172 43 -26 -109 -38 106 -84 -100 -134 34 -87 179 38 -2 -49 161
5336 161 78 75 30 40 -162 29 58 48 -79 134 86 49 163 -119 100 63 16 117 -157 -53 -127 -104 -16 -74 -166
5361 -166 40 115 61 7 -4 14 -40 54 -8 -97 92 136 69 -4 -108 16 -17 -12 -86 -108 11 147 -54 6 -108 99
5387 99 -97 -67 122 57 -4 -19 -154 -90 -87 10 -151 131 -92 115 -100 34 -128 -24 -20 -106 50 -31 -82 -27 -139
5412 -139 -51 -15 56 54 -6 205 92 17 119 -135 26 51 -54 -96 158 -29 98 96 -52 -75 -56 -36 18 61 -71
5437 -71 73 74 -65 -11 235 -85 -17 135 153 -85 -3 -95 -4 122 3 122 41 -12 77 138 3 -69 124 53 1
5462 1 -94 38 10 96 -20 96 62 -83 1 -123 7 -29 -55 -41 113 94 -31 -106 158 -108 11 -37 -127 -70 43
5487 43 -37 70 47 -85 77 -65 -107 -7 1 192 152 42 -71 -19 -91 -18 -107 -80 -27 -43 20 -106 -44 75 31 -11
5513 -11 72 -28 0 -46 88 86 -147 -110 20 -69 96 163 100 -12 -49 -83 128 39 -75 54 3 45 -54 -35 -93 58
5539 58 -8 -31 49 165 117 -59 20 -10 -131 23 78 -29 156 -11 -22 26 1 -84 -69 -136 -13 88 -112 60 102
5564 102 124 131 2 -49 53 189 72 13 44 -61 -64 -82 150 -4 90 -9 -14 -65 36 -12 -21 -3 47 65 7 140 46
5591 46 -8 -4 -104 -100 75 -17 -9 -54 123 -134 140 -51 106 105 34 95 54 -62 -40 -38 -67 -107 -60 50 20 161 -27
5618 -27 130 -112 -44 18 -44 3 253 85 -67 22 -43 49 -39 15 -75 -58 -63 -63 47 35 140 -60 -2 79 -6 132 -18
5645 -18 51 -151 247 -89 154 55 5 73 -58 10 -8 56 54 79 -122 -44 26 -70 -8 47 -95 -189 1 79 -7 -104 -110
5672 -110 -32 50 90 -50 13 -64 -149 0 172 65 16 -19 -125 -3 189 -31 116 31 159 102 -58 -40 -118 51
5696 51 -107 0 -143 117 -85 178 -50 87 25 -40 -64 158 -74 -41 30 37 49 110 122 -98 -6 -130 40 -30
5720 -30 84 -82 -91 88 -97 -41 -50 -65 243 23 43 -24 -201 -61 -12 220 25 75 117 -64 17 88 -14 -101 -94 4
5746 4 -133 -123 103 -31 -20 227 137 87 72 79 42 -6 71 129 -30 -90 -18 -114 -36 -145 86 48 -118 -43 44 29 -76
5773 -76 -78 19 -29 122 75 -65 -42 -112 -17 35 -40 16 103 -107 -95 39 -79 55 50 -14 252 -108 -18 41 209 -90
5799 -90 105 -86 -1 60 24 90 84 -6 46 87 -61 -136 -39 -179 19 -8 -28 -74 33 -46 90 87 65 -53 2 -39 -2
5826 -2 43 -76 45 34 43 107 -8 55 -77 -197 127 -86 34 52 7 70 -122 78 -51 -23 81 -21 -119 -48 -3
5851 -3 -21 -43 79 124 105 -281 50 -27 -94 -184 -115 -100 146 52 108 210 -23 -29 -70 -129 83 17 78 10 86 -3 -39 79
5879 79 27 -92 59 -37 116 160 200 -52 -142 -239 -62 72 50 26 23 -60 30 56 154 55 -88 29 -85 -34 -188 -56
5905 -56 31 19 -43 -25 -153 20 49 76 149 12 -110 -4 14 -104 10 67 30 -204 -34 105 88 -96 3 -80 109
5930 109 -115 10 98 -70 24 24 -51 -58 52 78 -83 3 17 102 91 -6 94 90 -57 -33 67 -30 7 -30 -81 -176 -36
5957 -36 109 -30 48 154 45 52 2 -54 77 28 54 -53 -14 37 -2 -39 29 -84 -70 34 -52 146 154 153 135 -50 47
5984 47 -55 -187 -37 -57 52 -41 -67 -208 147 80 -83 -119 -57 -64 69 -8 -31 -96 112 -79 68 123 -125 154
6008 154 -107 -137 53 -17 -55 44 -44 69 33 -104 -12 9 -48 210 52 42 72 125 103 -32 -1 21 -22 -31 -108 -19 63
6035 63 43 -147 -103 -28 53 2 -80 52 -33 70 110 -14 32 127 129 88 -62 -95 -14 -28 66 159 27 -9 181 -99 -96
6062 -96 -52 173 150 -156 -3 -114 -44 99 66 76 90 -14 2 64 -55 -77 -132 -257 47 -153 127 -115 -114 -18 130
6087 130 35 82 -70 -82 82 30 32 11 -101 9 -20 -125 -83 -18 -5 21 55 115 -59 -144 162 -88 -15 -26 153 99
6113 99 66 52 -8 -47 -67 -4 -194 -33 -36 11 43 19 -10 87 27 17 -131 -156 80 -101 -26 87 132 60 -129 79 178
6140 178 47 69 -24 17 -80 40 -65 92 17 -52 -66 42 -32 -80 -88 -84 29 27 -170 140 46 -134 120 180 31 23
6166 23 40 -50 -33 48 -120 111 55 63 5 -43 -122 -97 95 -6 -16 40 -2 93 -8 103 -27 137 9 9 -59 59
6192 59 -113 85 27 41 -30 27 90 -7 76 125 -61 -74 82 -109 -128 66 183 -108 -132 43 19 50 23 19 52 -34
6218 -34 33 172 16 9 129 92 11 73 200 -110 103 200 -87 50 142 -83 -115 64 56 -23 -34 -84 -46 -23 43 -61
6244 -61 53 -139 -117 -6 40 184 -30 -36 107 -149 -90 65 67 -78 10 -137 -146 60 -15 82 -32 -54 89 120 -74
6269 -74 -49 -105 -45 -31 36 88 52 81 -181 6 41 163 78 65 71 -46 -145 5 95 -45 -73 40 139 135 123 22 -55
6296 -55 15 -43 -80 66 106 4 85 -54 -11 113 89 53 44 -64 -160 106 33 5 -42 50 -6 -44 137 83 10 125 -41
6323 -41 35 -41 -86 -28 61 22 102 100 83 -92 18 -129 -121 -14 67 82 77 107 -26 17 164 -37 49 -23 -79 -89 -38 -2
6351 -2 5 -54 5 -6 98 -3 45 83 171 -79 15 82 42 -31 -33 27 -96 -42 -112 -64 -51 -218 -13 -54 -192 -112 -29 -8
6379 -8 46 233 11 21 126 -27 65 9 -98 -147 -37 -90 69 40 -138 -94 281 226 65 50 -56 55 -32 -16 -38
6404 -38 -114 -49 82 121 42 -25 -18 32 -152 88 -118 -26 28 -14 58 92 -6 -146 57 30 45 -41 9 -116 -38 -52 187
6431 187 32 75 -35 114 62 94 214 -2 -10 16 -128 38 12 -39 233 -36 81 62 149 140 -48 -26 -38 55 -89
6456 -89 -3 23 12 -144 142 -83 113 138 166 9 -154 130 -96 229 -73 106 171 -11 52 -95 56 91 -81
6479 -81 -54 17 9 -116 -52 68 -25 139 4 -158 40 -22 -28 74 41 97 12 -138 -40 -151 -92 305 43 -8 10 15
6505 15 -156 35 -24 32 168 112 -100 -45 189 -24 -25 -71 87 43 57 -73 -72 20 41 -112 134 -8 -106 -7 46 49
6531 49 -80 -13 26 -73 -58 43 -79 150 -170 -68 -1 123 41 -61 62 -61 -32 -7 -38 112 33 215 -81 -103
6555 -103 -119 73 0 -50 29 -40 83 23 33 83 10 -56 40 -175 -47 -38 -28 46 -123 50 17 -15 104 73 -1 1 97
6582 97 -33 -229 -133 -46 43 -63 -34 -23 -90 -10 -149 -113 -73 -34 -83 4 190 -28 -241 56 -40 67 129 -8 107
6607 107 51 -98 -5 17 22 -17 12 -105 -47 -134 -117 -41 -36 57 -40 79 -83 125 62 50 74 -26 -113 -30 6 53 -79
6634 -79 -36 -1 -59 83 -37 -1 -180 -180 -28 -27 -13 11 -87 -133 92 -12 60 -17 -21 94 151 -20 23 172 94 154 32
6661 32 -44 27 47 41 -6 118 16 -104 54 -60 -6 197 177 119 22 74 9 -47 61 71 -2 -18 118 4 108 -146
6687 -146 14 -55 145 -4 56 5 27 -50 146 35 64 -71 -48 175 -107 40 48 164 7 164 49 -107 81
6710 81 -13 48 235 45 55 81 -133 34 83 96 288 175 21 66 90 35 21 -55 -68 -44 -39 -67 -44 -78 7 206 -164
6737 -164 -39 54 -55 -207 -104 16 34 172 117 45 -41 11 21 1 -92 85 77 -183 183 154 50 181 64 148
6761 148 100 192 50 -78 33 17 -84 -7 -103 -54 -104 8 47 -8 -5 -38 46 105 -170 -109 -5 -40 51 101 -160 -35
6787 -35 -142 42 27 -123 -58 41 -127 100 5 -143 113 76 60 24 -75 56 -80 -33 -17 42 -181 -89 36 -11 152
6812 152 87 93 -63 35 -35 -92 -5 25 -133 59 -25 -130 -148 41 102 -132 76 -32 -144 -186 39 -48 35 -77 -26
6837 -26 142 -133 203 -42 93 19 202 -12 54 31 119 -22 -50 -34 -17 43 149 39 170 91 32 -15 -98 7
6861 7 -201 -52 110 -55 -16 -9 25 -79 82 75 -14 62 79 -7 -1 -28 28 -46 -5 -151 -92 125 -1 -81 69 -76 -26
6888 -26 -145 -55 27 112 39 -35 -208 -26 -40 29 -111 -56 35 75 155 -19 91 29 6 146 -6 -63 6 18 -138 40
6914 40 100 29 -99 76 34 -132 13 27 58 -56 89 105 -81 17 18 -37 154 -8 20 58 -68 0 86 92 -43 -56
6940 -56 -103 -4 23 173 -31 -87 -189 -111 -192 53 71 -199 36 -28 -51 -57 122 -149 120 -49 -104 78 110 -153 50
6965 50 -105 -128 -141 69 -100 11 22 0 -71 -196 -191 -161 -49 -188 -58 13 164 8 -70 -81 41 58 -123 -27 135
6990 135 132 8 -47 144 -52 37 -205 -117 -53 87 49 85 24 23 85 55 -63 100 198 -18 93 -155 -26 -59 16
7015 16 18 110 116 23 -84 166 -75 -78 -96 17 17 -92 153 77 147 -2 36 -26 -30 -14 -25 100 -7 59 16 -133 5
7042 5 -89 33 -42 -71 66 4 -179 71 84 -4 -2 19 -33 -83 -70 -32 -97 -71 47 52 -50 -62 -29 -107 -84 -75 38 -81
7070 -81 133 38 -120 -116 -68 14 13 1 47 -67 -44 86 -26 -26 220 83 -14 5 5 144 118 45 -46 9 -75 82 -224
7097 -224 163 -84 -61 -14 72 14 68 -58 -16 -4 -44 -42 25 162 -62 -74 -57 58 4 -195 -24 36 -66 105 -95
7122 -95 16 71 -18 67 47 -1 84 -36 -16 -102 1 -8 -3 7 122 -124 -24 -63 44 125 -11 -137 39 -123 279
7147 279 98 -65 88 85 264 61 39 -10 8 -66 77 163 -117 -58 91 -125 -11 15 -96 -19 0 57 11 -138
7171 -138 -168 -43 174 61 -98 35 -39 -20 48 67 136 36 -29 -152 11 34 161 -254 43 -39 54 130 -16 -83
7195 -83 42 -45 -34 -10 25 -106 -34 -190 -39 8 -100 -67 -121 -32 -78 70 67 53 90 -66 27 57 36 134 -88 80
7221 80 39 29 96 100 -80 -81 29 113 82 1 -65 -3 2 20 -24 42 46 108 -30 -78 -109 68 -77 0 -63 15 9 -24 -150 -86
7251 -86 -133 -20 73 -27 102 87 115 5 71 -87 -23 -75 3 -48 128 194 -82 -120 -28 117 190 -37 -91 75 13
7276 13 159 41 -39 186 30 83 -62 -189 -105 -70 -76 18 -21 19 92 143 -28 -48 -44 -103 79 -20 -3 -25 19 211 -63
7303 -63 -59 46 96 38 41 6 -7 71 16 88 -30 99 -69 60 -47 -247 17 -114 -44 79 136 31 17 17 -131 -195
7329 -195 125 2 -64 -38 -89 -17 8 -202 20 138 -52 48 42 -13 -57 175 20 255 -17 56 -120 44 -181
7352 -181 71 78 76 28 -25 -35 -21 8 -49 192 156 -46 35 12 139 40 -129 147 18 -148 -24 -16 -110 92 43 -135
7378 -135 17 22 -74 133 130 24 114 -75 74 119 -69 -80 -15 94 -99 -24 -55 -21 16 76 -10 139 4 101 -71
7403 -71 56 24 38 -6 -73 31 100 21 -13 51 98 24 31 62 41 40 125 74 0 46 -80 -138 22 26 41 -6 -68 -66 75 84
7433 84 32 92 9 33 1 -167 -36 34 -192 103 -98 17 14 -46 136 32 121 0 156 46 16 7 -4 93 160 -103
7459 -103 -133 -120 157 -51 29 -26 -79 -96 126 109 -46 -33 44 -36 62 22 -79 111 134 -33 -73 96 -23 -131 38
7484 38 70 24 -10 62 31 41 -146 41 155 141 -54 -4 112 62 61 35 80 -32 1 -245 -97 -174 78 -173 -32
7509 -32 -138 18 75 112 132 -23 -30 71 87 -29 -75 121 161 -142 -34 -20 78 9 -42 117 7 -195 89 54 116
7534 116 -22 26 63 6 57 -161 -12 -19 16 -124 112 89 68 -22 12 -23 62 81 137 99 -28 64 37 46 -81 46 2
7561 2 146 89 -6 51 -24 26 -37 99 3 41 30 36 -17 -62 54 24 -10 -3 -5 160 95 -44 20 85 26 72 19 -60 -61 -65 -10
7592 -10 -44 36 17 154 -87 22 40 55 -89 -43 -121 70 -3 -78 38 157 11 -103 -32 -174 57 23 -64 -133 -112
7617 -112 129 -59 -162 -143 146 -38 -135 11 -13 62 -170 300 -177 174 -121 -11 43 88 -71 184 74 -45
7639 -45 117 -212 48 20 -81 -68 44 -117 -210 249 -157 -1 48 119 -102 -162 -1 -92 -13 198 168 -67 -97 135
7663 135 -150 110 -79 -102 -23 79 -105 -45 158 182 24 -33 110 -41 46 119 21 -60 -90 -9 76 54 -64 -3 3
7688 3 50 29 40 66 -26 42 -127 128 18 -104 -55 120 200 -172 0 -190 7 63 -262 -101 20 178 -81 -70
7712 -70 32 -82 100 53 84 -56 -17 -4 105 12 8 -76 114 -35 31 -113 33 -1 1 159 85 174 -29 -4 84 4
7738 4 -145 -84 -106 74 48 23 -197 108 -141 -52 -77 -37 15 -41 -31 -47 30 -14 -121 32 -95 94 96 32 -108 121
7764 121 44 -109 15 -6 59 -91 104 -100 -50 -79 -72 63 249 6 -39 -180 75 70 24 -54 74 20 115 -13 -14
7789 -14 52 -156 -146 -78 52 -47 -79 55 -66 127 18 148 105 118 56 139 10 -39 81 -123 -85 63 16 23 44
7814 44 -109 172 -116 60 77 -57 47 -33 17 45 146 46 176 141 35 107 -82 12 82 198 -103 -175 66
7837 66 27 -12 -97 117 39 5 -93 80 -32 -107 -169 -47 71 -190 132 -63 59 122 197 -267 45 -147 -85 -39
7861 -39 105 -79 17 -69 16 -26 -179 -185 -110 -8 96 138 -38 19 107 147 98 -58 -28 -35 161 144 -33 86 -78 160
7887 160 -21 -97 -10 159 -75 95 -45 -151 31 -104 85 4 36 44 7 -46 66 54 38 10 18 -93 199 -172
7911 -172 105 -62 5 92 -40 -76 135 88 -65 -28 -120 -55 -31 -38 -25 -206 69 42 -195 -100 70 -10 -12 22 108 74
7937 74 30 61 -11 88 92 -132 -16 97 208 -60 30 70 52 111 -46 -25 80 -19 -169 140 115 31 93 -13 -14 40
7963 40 78 -61 -12 49 92 23 109 -90 -37 -133 48 -63 -49 -22 28 125 41 -78 -52 -14 119 87 -49 104 -107 -34
7989 -34 35 -184 -140 17 178 -43 9 -26 -12 -73 -43 65 51 72 69 -218 -45 -25 -136 -35 -28 17 217 64 21 -38
8015 -38 -45 -37 42 104 42 157 -44 -49 -219 -51 158 33 -40 -22 119 -43 27 50 -40 33 -38 -108 -124 -33 50 186 -84
8042 -84 -110 69 -14 -36 -84 102 -179 -97 128 -62 45 -41 -109 -36 13 28 -74 -165 -25 10 33 -118 136 144 -68
8067 -68 20 -159 -69 183 -159 -91 70 187 85 66 -250 -81 83 5 124 -166 -150 -15 136 29 14 16 -55 -159
8091 -159 65 65 -59 155 -66 -149 -60 -79 -2 18 -100 16 57 107 -143 49 -27 -134 29 -77 43 -98 -209
8114 -209 -88 -34 125 -158 -61 -58 8 -68 25 10 36 69 102 125 60 49 83 12 -28 100 -110 -80 -116 -25 75 -95 -146
8141 -146 9 -23 -215 136 43 -118 87 218 79 -33 -12 29 -13 -28 170 -3 1 -136 42 -21 -67 -18 35 -86
8165 -86 2 11 162 81 -73 10 -108 45 -266 -53 104 134 57 -36 140 65 80 48 93 -57 32 68 -110 -62 11 -161
8191a61
##END NTUPLES=NMR FID
##END=
