##TITLE=1H_Pr C2_2
 CDCl3,8 sc, 
 25.10.2021
##JCAMPDX= 6.0         $$ Bruker NMR JCAMP-DX V2.0
##DATA TYPE= NMR FID
##DATA CLASS= NTUPLES
##ORIGIN= UXNMR, Bruker Analytische Messtechnik GmbH
##OWNER= root
$$ XWIN-NMR		Version 3.5
$$ Mon Oct 25 09:42:24 2021 Russian Standard Time (UT+4h)  she@DPX200
##.OBSERVE FREQUENCY= 200.1313468511
##.OBSERVE NUCLEUS= ^1H
##.DELAY= (6, 6)
##.ACQUISITION MODE= SIMULTANEOUS
##.ACQUISITION SCHEME= undefined
##.AVERAGES= 8
##.DIGITISER RES= 18
##SPECTROMETER/DATA SYSTEM= spect
##.PULSE SEQUENCE= zg30
##.SOLVENT NAME= D2O
##.SHIFT REFERENCE= (INTERNAL, D2O, 0, 15.7039)
##AUDIT TRAIL= $$ (NUMBER, WHEN, WHO, WHERE, WHAT)
$$ ##TITLE= Audit trail, XWIN-NMR		Version 3.5
$$ ##JCAMPDX= 5.01
$$ ##ORIGIN= Bruker BioSpin GmbH
$$ ##OWNER= she
$$ F:/spectra/data/she/nmr/H-F/1/audita.txt
$$ ##AUDIT TRAIL=  $$ (NUMBER, WHEN, WHO, WHERE, WHAT)
(   1,<2021-10-25 09:40:40.57 +0400>,<she>,<DPX200>,
      <created by zg, POWCHK disabled, PULCHK disabled
       configuration hash MD5:
       00 E9 B6 7A A2 85 ED C7 34 08 36 98 17 FE 4E 26
       data hash MD5: 16K
       31 93 73 D7 0A 94 C0 BC B7 65 89 40 9A B4 7B 50>)
$$ ##END=
$$ 
$$ hash MD5
$$ 42 E0 50 99 AE 0A 56 46 D6 1F 7E 41 58 35 81 60
##$RELAX= 
##$RELAX= 
##$RELAX= 
##$RELAX= 
##$RELAX= 
##$RELAX= 
$$ Bruker specific parameters
$$ --------------------------
##$DU= <F:/spectra>
##$EXPNO= 1
##$NAME= <H-F>
##$PROCNO= 1
##$TYPE= <nmr>
##$USER= <she>
##$AMP= (0..31)
100 100 100 100 100 100 100 100 100 100 100 100 100 100 100 100 100 100 
100 100 100 100 100 100 100 100 100 100 100 100 100 100 
##$AQSEQ= 0
##$AQ_mod= 1
##$AUNM= <au_zg>
##$AUTOPOS= <>
##$BF1= 200.13
##$BF2= 200.13
##$BF3= 200.13
##$BF4= 200.13
##$BF5= 200.13
##$BF6= 200.13
##$BF7= 200.13
##$BF8= 200.13
##$BYTORDA= 1
##$CFDGTYP= 0
##$CFRGTYP= 5
##$CHEMSTR= <none>
##$CNST= (0..31)
1 1 145 1 1 1 1 1 1 1 1 1 1 1 1 1 1 1 1 1 1 1 1 1 1 1 1 1 1 1 1 1 
##$CPDPRG= <>
##$CPDPRG1= <>
##$CPDPRG2= <>
##$CPDPRG3= <>
##$CPDPRG4= <mlev>
##$CPDPRG5= <mlev>
##$CPDPRG6= <mlev>
##$CPDPRG7= <mlev>
##$CPDPRG8= <mlev>
##$CPDPRGB= <>
##$CPDPRGT= <>
##$D= (0..31)
0 1.2 0 0 0 0 0 0 0 0.06 0 0.03 0 0 0 0 0.0002 0 0 0 0 0 0 0 0 0 0 0 0 
0 0 0 
##$DATE= 1635140440
##$DBL= (0..7)
120 120 120 120 120 120 120 120 
##$DBP= (0..7)
150 150 150 150 150 150 150 150 
##$DBP07= 0
##$DBPNAM0= <>
##$DBPNAM1= <>
##$DBPNAM2= <>
##$DBPNAM3= <>
##$DBPNAM4= <>
##$DBPNAM5= <>
##$DBPNAM6= <>
##$DBPNAM7= <>
##$DBPOAL= (0..7)
0.5 0.5 0.5 0.5 0.5 0.5 0.5 0.5 
##$DBPOFFS= (0..7)
0 0 0 0 0 0 0 0 
##$DE= 6
##$DECBNUC= <off>
##$DECIM= 32
##$DECNUC= <off>
##$DECSTAT= 4
##$DIGMOD= 1
##$DIGTYP= 9
##$DL= (0..7)
0 120 120 120 120 120 120 120 
##$DP= (0..7)
150 150 150 150 150 150 150 150 
##$DP07= 0
##$DPNAME0= <>
##$DPNAME1= <>
##$DPNAME2= <>
##$DPNAME3= <>
##$DPNAME4= <>
##$DPNAME5= <>
##$DPNAME6= <>
##$DPNAME7= <>
##$DPOAL= (0..7)
0.5 0.5 0.5 0.5 0.5 0.5 0.5 0.5 
##$DPOFFS= (0..7)
0 0 0 0 0 0 0 0 
##$DQDMODE= 0
##$DR= 18
##$DS= 0
##$DSLIST= <SSSSSSSSSSSSSSS>
$$ [...]
##$SUBNAM2= <"">
##$SUBNAM3= <"">
##$SUBNAM4= <"">
##$SUBNAM5= <"">
##$SUBNAM6= <"">
##$SUBNAM7= <"">
##$SUBNAM8= <"">
##$SUBNAM9= <"">
##$SW= 18.0517286264689
##$SWIBOX= (0..15)
0 0 2 0 0 0 0 0 0 0 0 0 0 0 0 0 
##$SW_h= 3612.71676300578
##$TD= 16384
##$TD0= 1
##$TE= 0
##$TE2= 300
##$TE3= 300
##$TEG= 300
##$TL= (0..7)
0 120 120 120 120 120 120 120 
##$TP= (0..7)
150 150 150 150 150 150 150 150 
##$TP07= 0
##$TPNAME0= <>
##$TPNAME1= <>
##$TPNAME2= <>
##$TPNAME3= <>
##$TPNAME4= <>
##$TPNAME5= <>
##$TPNAME6= <>
##$TPNAME7= <>
##$TPOAL= (0..7)
0.5 0.5 0.5 0.5 0.5 0.5 0.5 0.5 
##$TPOFFS= (0..7)
0 0 0 0 0 0 0 0 
##$TUNHIN= 0
##$TUNHOUT= 0
##$TUNXOUT= 0
##$USERA1= <user>
##$USERA2= <user>
##$USERA3= <user>
##$USERA4= <user>
##$USERA5= <user>
##$V9= 5
##$VALIST= <valist>
##$VCLIST= <CCCCCCCCCCCCCCC>
##$VD= 0
##$VDLIST= <DDDDDDDDDDDDDDD>
##$VPLIST= <PPPPPPPPPPPPPPP>
##$VTLIST= <TTTTTTTTTTTTTTT>
##$WBST= 1024
##$WBSW= 4
##$XGAIN= (0..3)
0 0 0 0 
##$XL= 0
##$YL= 0
##$YMAX_a= 66728
##$YMIN_a= -94984
##$ZGOPTNS= <>
##$ZL1= 120
##$ZL2= 120
##$ZL3= 120
##$ZL4= 120
##$ABSF1= 10
##$ABSF2= 0
##$ABSG= 5
##$ABSL= 3
##$ALPHA= 0
##$AQORDER= 0
##$ASSFAC= 0
##$ASSFACI= 0
##$ASSFACX= 0
##$ASSWID= 0
##$AUNMP= <proc_1d>
##$AZFE= 0.1
##$AZFW= 0.1
##$BCFW= 1
##$BC_mod= 2
##$BYTORDP= 1
##$COROFFS= 0
##$CY= 11.3945322036743
##$DATMOD= 1
##$DC= 2
##$DFILT= <>
##$DTYPP= 0
##$F1P= 2.36226072786647
##$F2P= -0.459571619588291
##$FCOR= 0.5
##$FTSIZE= 0
##$FT_mod= 4
##$GAMMA= 1
##$GB= 0.15
##$INTBC= 1
##$INTSCL= 1
##$ISEN= 128
##$LB= 0.24
##$LEV0= 0
##$LPBIN= 0
##$MAXI= 10000
##$MC2= 0
##$MEAN= 0
##$ME_mod= 0
##$MI= 1.114404
##$NCOEF= 0
##$NC_proc= 0
##$NLEV= 6
##$NOISF1= 3.799351
##$NOISF2= 2.8
##$NSP= 1
##$NTH_PI= 0
##$NZP= 0
##$OFFSET= 15.70392
##$PC= 1
##$PHC0= -14788.7
##$PHC1= 5.600832
##$PH_mod= 1
##$PKNL= yes
##$PPARMOD= 0
##$PSCAL= 0
##$PSIGN= 0
##$REVERSE= no
##$SF= 200.130013532006
##$SI= 16384
##$SIGF1= 3
##$SIGF2= 2
##$SINO= 400
##$SIOLD= 16384
##$SREGLST= <1H.CDCl3>
##$SSB= 0
##$STSI= 0
##$STSR= 0
##$SW_p= 3612.71676300578
##$SYMM= 0
##$S_DEV= 0
##$TDeff= 0
##$TDoff= 0
##$TI= <>
##$TILT= no
##$TM1= 0
##$TM2= 0
##$TOPLEV= 0
##$USERP1= <user>
##$USERP2= <user>
##$USERP3= <user>
##$USERP4= <user>
##$USERP5= <user>
##$WDW= 1
##$XDIM= 8192
##$YMAX_p= 0
##$YMIN_p= 0
$$ End of Bruker specific parameters
$$ ---------------------------------
##NTUPLES= NMR FID
##VAR_NAME=  TIME,          FID/REAL,        FID/IMAG
##SYMBOL=    X,             R,               I
##VAR_TYPE=  INDEPENDENT,   DEPENDENT,       DEPENDENT
##VAR_FORM=  AFFN,          ASDF,            ASDF
##VAR_DIM=   8192,          8192,            8192
##UNITS=     SECONDS,       ARBITRARY UNITS, ARBITRARY UNITS
##FACTOR=    0.0002768,     1,               1
##FIRST=     0,             0,               0
##LAST=      2.2672688,     0,               0
##MIN=       0,             -94984,          0
##MAX=       2.2672688,     66728,           0
$$ Real data points
##PAGE= N=1
##DATA TABLE= (X++(R..R)), XYDATA
0 0 0 0 0 0 0 0 0 0 0 0 0 0 0 0 0 8 -8 8 -8 8 -15 16 -16 23 -24 27 -32 40 -41 48 -56 64 -73 83 -96 105 -120
37 -120 135 -151 168 -185 208 -230 256 -280 312 -344 379 -417 460 -508 558 -615 679 -750 830
56 830 -920 1026 -1146 1290 -1459 1668 -1928 2269 -2728 3393 -4443 6344 -10933 50489 731
71 731 -79016 19696 58869 10936 -25841 5307 7972 -3706 5039 10774 -16339 -12626 12898
84 12898 11767 -24310 -26778 13579 26433 -16554 -35160 -4260 22356 8888 -13869 -15685 -1332
97 -1332 11266 14252 -4344 -14792 4978 16470 1444 -5045 3941 4352 -2923 4377 9270 -8829
111 -8829 -11536 12787 12901 -15599 -20756 8798 20196 -9584 -26099 546 16596 -913 -12999
124 -12999 -1371 4947 -3317 1274 11812 -2082 -10887 7960 16867 -1149 -11272 5844 17472
137 17472 227 -11871 1353 11944 4447 -8168 -7926 2884 4346 -3101 -6437 -5685 -1045 -237
151 -237 -4161 -3332 -1082 -2779 -3226 -903 3144 -185 -4950 2415 6863 -1378 -2896 5770 8219 -1068
167 -1068 -4812 6313 8627 -1981 -3452 3752 3789 -3086 -3299 3604 1232 -8128 -3843 4456 -550
182 -550 -7750 -4241 3964 178 -7506 -1998 5673 1622 -4605 -3244 5588 7643 -1036 -3950 2822
197 2822 6976 3921 -1727 377 4860 1731 -1179 793 1894 -477 -3362 -792 511 -4412 -3339
212 -3339 1640 -826 -7307 -5155 3607 4609 -7000 -7284 4803 5990 -3538 -4436 5031 6848 -2880
227 -2880 -3239 6742 5925 -1595 -1271 4740 4065 -2973 -1814 4565 1826 -4786 -3915 1517 1930 -4403 -5164
244 -5164 217 -670 -4062 -2060 260 -783 -3731 -1318 3543 934 -2929 219 4348 3931 -1863 -1883
260 -1883 6318 6180 -2639 -3240 4450 6439 -2111 -5143 2523 3778 -2722 -4048 -253 704 -2670 -4101
276 -4101 581 -397 -5471 -2560 2893 751 -5323 -2683 5864 3324 -5296 -1241 6436 4085 -2224
291 -2224 -1471 5516 5145 -1762 -1340 3363 3127 -1141 -2295 2084 1169 -3990 -2036 1790 -738 -4664
307 -4664 -3203 1809 47 -5447 -2669 2519 721 -3623 -2551 3944 3873 -3167 -2000 5271 4472 -1355
323 -1355 -1248 4897 4242 -2256 -905 4572 2381 -2465 -2287 2478 1695 -3917 -2628 1516 -871 -4802
339 -4802 -2679 2128 -163 -5701 -2224 3340 -88 -3960 -1167 3949 2152 -3467 -589 6155 3262
354 3262 -2452 -520 4295 4220 -1451 -1206 3546 1820 -2505 -1224 1345 487 -3239 -2277 1303 -1503
370 -1503 -4577 -1310 1665 -993 -4867 -1908 3661 964 -3877 -1080 3666 2697 -2507 -1226 5179
385 5179 3260 -1956 -138 3650 2963 -961 -611 3162 767 -2803 -785 1671 -1 -3603 -2844 1608
401 1608 -178 -4569 -2007 1488 -827 -3890 -1493 3237 181 -3709 341 3838 1112 -1826 44
416 44 4916 3151 -2857 -191 5065 2988 -2041 -1551 3312 2074 -3057 -1139 1279 -924 -2338 -1323
432 -1323 387 -1710 -3705 -499 1532 -1594 -4022 -686 3529 591 -4573 -242 4957 1829 -1969
447 -1969 -194 3898 2715 -1017 310 2666 1610 -329 -113 1583 724 -2706 -674 1910 -1404 -3787
463 -3787 -855 1690 -847 -4796 -1782 1874 -176 -2701 -1140 1334 1056 -1752 -203 3607 1542
478 1542 -1940 688 4375 2361 -2119 352 4177 1235 -2355 -210 2697 1473 -2550 -2920 1631
493 1631 621 -2882 -2220 298 -1067 -3569 -349 2794 -2325 -4752 1098 3990 -313 -3436 -80
508 -80 4745 2026 -2616 -150 3883 2998 -1580 -735 3557 1416 -1595 923 1676 -1184 -2144 362 1171
525 1171 -2323 -3801 49 1852 -1290 -4631 -1859 3465 599 -4699 -1681 3342 1462 -1931 -409
540 -409 3076 1409 -1643 1763 3494 785 -1659 1039 4398 847 -3559 340 3837 -184 -4064
555 -4064 -822 3180 -858 -4699 -808 1693 -1672 -2671 -37 1163 -1755 -2818 1934 3283 -1855
570 -1855 -2884 2471 5179 -118 -3368 1772 5718 736 -2420 351 2931 1264 -1775 -186 1251
585 1251 -739 -1596 -57 471 -1785 -2900 678 1453 -3274 -3890 1454 2420 -2250 -3803 1623 4202
601 4202 -693 -2763 1248 4005 1408 -1648 1000 3525 425 -816 1564 2136 -965 -1556 1223 1664
617 1664 -2172 -2403 1069 578 -2152 -2509 332 1159 -2273 -3126 801 1790 -1267 -2290 736 2852 -308
634 -308 -1447 1906 2844 322 -1045 1056 3321 406 -1417 1175 2162 -504 -2003 208 1678 -1429
650 -1429 -2678 478 906 -2621 -2658 380 1222 -2509 -3107 1053 1828 -1375 -1792 942 2375 14 -1445
667 -1445 2349 2973 -667 -581 1913 2561 -246 -900 1669 1305 -1077 -1098 723 978 -1469 -2519 293
684 293 1012 -1958 -2348 -17 426 -1476 -2266 966 1460 -1675 -1287 1551 2307 -740 -1654 2049 3253
701 3253 -195 -1541 1421 2843 269 -1609 1042 1983 -959 -1154 944 468 -1787 -2061 536 438 -2624
718 -2624 -1813 951 596 -2426 -2135 1588 2190 -2051 -2162 1995 2716 -248 -1303 1222 2914 254 -498
735 -498 1363 1470 151 -829 886 1300 -1215 -1386 1126 342 -1872 -1608 819 590 -2679 -2264 1183
752 1183 816 -1995 -2239 619 1999 -801 -1611 1753 2160 -257 -727 1694 2322 -487 -708 2088 1596
769 1596 -688 -776 1140 1294 -1609 -1755 1017 776 -1985 -2039 385 585 -2380 -1833 1009 442 -1886 -1203
787 -1203 1286 1260 -874 -1189 2023 1969 -955 -829 2005 2487 -557 -1064 1836 1856 -566 -573 1028 818 -996
806 -996 -1308 926 149 -2291 -1405 725 159 -2173 -1707 1374 435 -2533 -1645 1881 1363 -1025 -1006 1646
824 1646 2029 -551 -302 1888 1990 -276 -585 2051 1728 -949 -385 1512 509 -1327 -859 821 -170
841 -170 -2613 -1451 878 -167 -2204 -1700 983 586 -2115 -988 1862 1064 -1236 -744 1800 1752 -570
858 -570 -120 2039 1110 -349 -186 1317 1307 -936 -852 1278 319 -1956 -920 912 -95 -2396 -968
875 -968 1211 -391 -2423 -1131 1045 453 -1862 -1070 2084 1050 -1106 -745 1591 1683 -459 -533 1824
892 1824 1254 -760 177 1331 537 -1010 -233 1553 99 -1616 -686 899 -185 -2571 -1517 1114
908 1114 -422 -2433 -960 1241 457 -1644 -577 1695 791 -842 -17 1814 1119 -539 -269 2334
924 2334 1213 -751 87 1402 774 -1020 -699 1440 -245 -1768 -159 339 -485 -1838 -910 834 -468
941 -468 -2352 -512 1263 179 -1642 -872 1841 933 -1445 61 1738 1179 -197 21 1735 1363 -371
958 -371 28 848 190 -506 -251 830 -66 -1963 -524 1221 -730 -1969 -1011 598 -76 -2230 -696
975 -696 1350 602 -1440 -635 1597 1404 -933 -122 2265 796 -623 214 1727 1037 -1186 -59 1415
992 1415 -5 -797 -41 1040 30 -1662 -667 968 -587 -2009 -527 1076 -375 -2088 -374 1588
1008 1588 -29 -1783 -282 1628 759 -875 -205 2064 1015 -567 63 1422 823 -596 165 1422
1024 1422 31 -1385 30 977 -321 -1872 -359 1049 -1127 -2134 -316 989 -193 -1890 -771
1039 -771 1838 485 -1529 76 1651 496 -943 497 1733 502 -755 549 1554 439 -823
1054 -823 269 1469 0 -1615 252 838 -562 -1727 -201 1160 -1049 -2351 83 1000 -985 -1568
1070 -1568 -264 1408 -82 -1504 319 1600 148 -916 688 1854 681 -1017 912 1623 205
1085 205 -557 371 965 -467 -1163 567 882 -1050 -1567 2 905 -650 -1869 336 1180 -1000 -1851
1102 -1851 501 1337 -185 -1128 470 1518 385 -458 369 1424 613 -585 792 1611 -514 -777 909
1119 909 1103 -608 -1328 535 988 -1030 -1299 -65 401 -657 -1792 28 801 -985 -1588 474 1121
1136 1121 19 -1078 640 1612 -139 -389 688 1311 112 -389 798 1620 67 -841 571 1007 -329
1153 -329 -1208 26 622 -1395 -1269 435 480 -1091 -1421 99 1057 -779 -1336 289 954 -192 -724 747
1171 747 1652 -78 -768 1129 1399 -89 -138 697 1166 -206 -691 718 447 -664 -921 337 900 -891
1189 -891 -1749 480 491 -1229 -1473 190 733 -817 -1128 565 861 -207 -565 728 1198 306 -457 886
1207 886 1191 -54 -382 1006 799 -574 -763 796 469 -1225 -796 222 452 -1007 -1255 -53 509
1224 509 -1213 -1172 418 695 -772 -1225 697 1118 -602 -436 826 1098 230 -303 896 1102 -234 -302
1242 -302 700 731 -328 -851 505 696 -1065 -1165 614 195 -1220 -1193 356 557 -998 -1377 472 854
1260 854 -590 -992 842 1079 -383 -594 779 930 -271 -147 1088 990 -412 -121 791 724 -338 -775
1278 -775 484 753 -1063 -886 380 155 -1157 -1064 37 161 -1121 -1234 737 483 -818 -640 481
1295 481 1101 -322 -302 1008 878 -103 -350 917 1017 -378 -257 905 443 -370 -454 811 568 -1040
1313 -1040 -824 755 178 -1090 -974 724 576 -940 -1263 641 577 -766 -565 665 1017 -467 -447 1165
1331 1165 1163 -567 -87 1125 685 -222 -283 991 449 -760 -21 694 278 -1050 -1005 600 154 -1253 -686
1350 -686 302 126 -1174 -689 920 580 -855 -321 703 512 -62 -171 895 937 -189 84 1084 636
1368 636 -593 -119 1032 457 -943 -314 882 -23 -1131 -550 495 135 -1428 -734 708 -2 -1186
1385 -1186 -661 812 630 -747 -300 713 549 -281 -113 938 724 -391 94 1008 308 -264 -17 800
1403 800 172 -1042 -360 1012 -361 -1443 -475 361 227 -1127 -1067 488 37 -990 -351 320 162 -748
1421 -748 -123 1037 604 -155 -10 1232 452 -368 388 1357 424 -833 -72 632 183 -838 -192 502 -352
1440 -352 -1175 -384 356 -116 -1227 -586 493 14 -1195 -380 733 497 -407 -168 1179 524 -449 201
1458 201 734 620 -298 170 1146 240 -512 29 896 -165 -883 -665 744 -104 -1142 -294 607 -393 -1124
1477 -1124 -728 423 -222 -812 -269 721 262 -588 -48 1094 300 -472 328 991 332 -411 373 926 215
1496 215 -687 248 674 -267 -866 -141 585 -5 -1413 -505 401 -620 -1137 -309 514 -251 -1014 98 911
1515 911 301 -369 -43 838 446 -164 427 813 288 -180 265 895 530 -544 421 961 -272 -893 -169
1534 -169 511 -281 -1080 -136 645 -427 -1164 -265 653 -182 -1087 -250 1035 79 -496 271 909 -93 -174
1553 -174 558 1179 178 -599 390 688 291 -615 110 795 -468 -1053 101 445 -527 -936 -243 338 -591
1572 -591 -1037 -136 609 -178 -483 -201 791 114 -592 409 871 214 -435 350 1006 14 -261 559 522 -376
1592 -376 -409 236 702 -395 -1079 19 826 -327 -1092 96 639 -290 -989 158 465 -454 -491 93 675
1611 675 39 -406 464 714 94 -244 154 1075 215 -457 783 513 -248 -425 566 550 -445 -856 37 358
1631 358 -596 -783 -17 464 -364 -945 67 677 -334 -475 229 755 168 -108 606 769 228 -225 914
1650 914 948 421 -256 368 984 -438 -665 502 647 -435 -1049 8 460 -778 -857 166 42 -101 -690
1669 -690 116 560 -6 -614 525 727 -57 -168 546 756 -57 -120 953 649 -377 -373 406 513 -426 -402
1689 -402 191 487 -341 -667 215 531 -854 -920 380 240 -427 -532 -69 481 -436 -638 509 590 -106 117
1709 117 320 747 -54 -471 660 582 -419 -309 374 552 -302 -411 336 275 -520 -736 92 253 -513 -929
1729 -929 181 117 -353 -434 277 522 -264 -328 446 453 -28 -273 604 582 -65 -137 732 569 -415 -85 285 636
1751 636 -705 -699 347 388 -762 -662 207 85 -613 -476 143 382 -567 -586 112 336 48 66 330 471 -285
1772 -285 -158 557 428 170 56 728 431 -261 -312 470 398 -491 -438 385 73 -576 -770 256 58 -360 -550
1793 -550 241 369 -759 -546 490 169 -338 -458 506 453 -513 -99 766 252 -128 30 641 418 -303 -125
1813 -125 451 102 -497 -222 316 177 -840 -758 569 137 -400 -417 30 259 -626 -521 360 233 -53 -13
1833 -13 435 604 -55 158 772 299 -229 -11 610 537 -241 -65 450 25 -520 -471 165 424 -685 -666 372
1854 372 350 -843 -442 -50 -107 -603 -55 645 294 -446 -178 499 149 -161 -4 845 331 -298 32 673
1874 673 323 -585 -116 441 109 -801 -512 332 52 -742 -565 591 142 -724 -235 374 155 -570 -231 230
1894 230 279 -333 173 263 406 -252 -21 682 387 -406 -5 609 85 -379 -321 493 -89 -707 -296 324 -67
1915 -67 -384 -441 108 25 -511 -282 362 13 -390 -202 295 608 -117 128 635 90 -191 176 497 137 40
1936 40 303 543 141 -379 96 291 -141 -629 -191 396 41 -792 -554 100 191 -481 -399 491 88 -658 -168
1957 -168 547 151 -304 301 705 204 3 188 298 85 -234 41 582 78 -375 95 237 116 -777 -286
1977 -286 343 51 -796 -306 477 -55 -523 -241 182 -302 -314 38 461 144 -231 102 819 219 -309 210
1997 210 607 -155 -111 299 496 -51 -647 -144 304 5 -506 -280 485 -333 -640 -126 256 -108 -490 -361
2017 -361 274 -185 -336 -133 329 -184 -373 253 613 242 -426 114 455 123 -412 386 357 -165 -178 62 519
2038 519 -369 -663 -343 136 118 -595 -111 62 -40 -818 -165 271 -94 -201 171 398 -33 -112 144 293 -44
2059 -44 -10 521 429 -156 -177 125 403 -214 -522 41 434 -361 -540 -94 126 29 -518 -182 440 -134 -460 68
2081 68 313 -61 -121 191 394 203 -234 525 491 -189 -144 251 555 58 -289 409 154 8 -322 47 458
2102 458 -248 -160 85 236 -202 -689 -457 159 -147 -207 203 201 -178 -77 396 512 -155 -278 414 529 108
2123 108 -341 385 270 -70 -448 259 398 -306 -389 191 271 -137 -566 97 33 -210 -434 109 211 -306 -346
2144 -346 220 274 -39 -346 471 393 84 -39 588 445 -313 -224 458 220 47 -359 483 511 -232 -451 229
2165 229 302 -600 -678 279 25 -490 -517 -41 72 -412 -266 -143 45 -135 31 136 302 -5 -38 397 495 -163
2187 -163 -294 241 323 -326 -350 346 219 -336 -287 -8 -24 -323 -593 64 288 -451 -142 129 89 -265 89 174
2209 174 199 -278 -360 412 52 -133 -264 325 450 -279 -83 562 205 -64 -169 182 227 -41 -376 260 237
2230 237 -245 -376 -23 -16 -83 -401 171 159 -399 -189 200 321 -329 -8 504 173 -393 -100 288 397 -40
2251 -40 -98 387 292 -194 -240 122 321 -547 -438 58 84 -367 -691 -196 369 -335 -225 321 -312 -243 -444 202
2273 202 268 -265 -179 144 90 -442 -141 223 250 -123 16 738 331 -402 0 453 200 -308 -358 156 -111 -475
2295 -475 -293 -59 -111 -450 -166 -129 23 -65 -49 375 218 -248 -13 484 326 -432 -28 364 239 -166 19
2316 19 463 279 -242 -160 222 67 -407 -163 39 87 -455 -122 -32 16 -286 -273 204 95 -472 215 426 294
2338 294 -177 187 335 333 -211 85 589 142 28 -69 371 18 -421 -262 327 146 -544 -247 238 173 -509
2359 -509 -276 122 -334 -345 -97 14 161 -340 -90 92 -15 -139 62 396 182 -293 47 472 341 -109
2379 -109 -434 351 313 -452 -62 188 99 -401 94 59 -46 -445 -287 192 -49 -306 9 267 118 -162 39
2400 39 305 103 -464 109 451 324 -338 1 432 -43 -60 -65 272 0 -275 39 52 9 -367 -257 111 -31
2422 -31 -212 22 248 12 -465 -36 298 32 -214 -8 155 -11 117 165 382 -125 -86 82 419 34 -433
2443 -433 106 334 -99 -326 5 258 -96 -614 -4 612 28 -241 -101 296 -63 -215 -272 319 -28 -150
2463 -150 148 185 93 -407 90 551 190 68 116 358 100 -407 118 308 159 -359 9 358 -163 -384 125
2484 125 173 -283 -337 -158 327 39 -283 107 292 -428 -80 130 56 105 -161 187 345 48 -287 335 456
2505 456 -74 -36 17 243 -235 -257 -43 186 -182 -313 55 26 -95 -238 -252 33 -130 -429 394 535 -129 -206
2527 -206 110 444 -116 -57 14 644 -156 -162 301 709 37 -274 225 237 23 47 241 251 58 -321 94 191 29
2550 29 -400 214 141 -124 -252 4 39 -58 -208 297 246 46 -96 382 427 36 144 360 405 -12 -64 31 -39
2573 -39 -234 -186 201 97 -101 -381 -173 155 -211 -268 35 256 -212 -352 13 51 -164 -248 364 405 -272 121
2595 121 354 474 25 -88 89 94 -205 -188 38 154 14 -334 -53 209 -239 -327 115 401 -92 -192 -341
2616 -341 58 -1 68 133 310 -314 17 337 280 65 -165 323 479 -87 58 276 552 -131 -342 180 502
2637 502 -64 -147 186 183 -40 -173 -106 257 -341 -273 123 81 -19 -240 212 243 -38 91 394 158 -152 -123 215
2660 215 152 117 -132 277 193 -192 -349 80 420 -47 -330 -166 218 -170 -157 -311 -42 -238 -344 26 3 -195
2682 -195 -56 289 314 -161 -140 481 88 -152 50 444 350 -201 -198 -141 221 -16 -268 45 -159 -348 -111 -58
2704 -58 80 -163 -507 13 -9 -431 -221 -42 -29 -413 -138 480 2 -204 -99 192 270 -88 -358 449 393 -249
2726 -249 53 349 152 -224 -166 323 86 -389 -144 212 -33 -218 -134 86 -333 -322 -127 339 279 26 87 226
2748 226 151 -117 128 191 35 -79 51 356 361 -224 21 50 60 9 -267 141 154 -329 -351 449 27 -338 -59
2771 -59 38 55 -347 -58 96 75 -124 219 168 -89 -92 199 122 -26 -138 -76 574 169 -86 94 197 174 -172
2794 -172 87 313 78 -108 -154 192 -12 -149 -364 516 67 -371 -172 85 214 -273 -57 346 65 -52
2814 -52 252 420 246 -198 -168 298 110 -266 -28 156 -30 3 -152 123 110 -441 -203 71 -146 -112 -144 217
2836 217 -111 -238 6 313 124 -195 -197 209 -46 -194 317 568 310 -357 34 583 108 -53 -89 67 270
2857 270 -57 -74 210 32 43 -241 238 -160 -368 -166 8 18 -398 -291 97 -53 -464 86 127 178 -67 -193
2879 -193 174 103 -225 135 432 -66 21 -59 207 -89 -265 -64 236 88 -237 122 152 -32 -310 -269 26 -191
2901 -191 -332 -269 111 -1 -200 99 261 -75 -130 25 304 145 -250 -44 434 271 176 359 132 41 -458
2922 -458 81 276 -184 -211 -9 118 39 -327 25 132 -53 -66 -68 192 48 -417 -71 556 8 -114 165 463
2944 463 98 -350 130 123 -82 -15 95 149 -108 -70 21 107 -56 -287 -58 -131 -217 -80 -139 27 71 -242 86 155
2968 155 18 -170 -60 394 150 -183 196 173 -77 132 295 338 54 -456 -67 231 -130 46 223 146 -165
2989 -165 -174 -76 -58 -314 -356 -112 -3 -181 -12 337 -173 -54 -34 -78 -47 -213 -85 161 309 -33 -240 161 220
3012 220 32 -151 50 118 -152 -105 224 -78 -134 -168 -116 20 -232 -316 187 -164 -173 -144 333 -17 69 -272 35
3035 35 333 -66 98 117 229 -155 -34 -97 354 -204 36 183 -12 -290 -155 114 -50 -265 -179 -10 -15 -396
3057 -396 -194 114 300 -96 -144 140 277 -189 -76 392 281 40 -106 69 235 -15 1 39 56 -77 -18 258
3079 258 52 -57 -248 -34 -184 -57 -124 -55 41 -35 -190 -270 58 -82 -225 7 187 -127 -189 265 263 -85 -2
3102 -2 54 102 -121 -52 171 155 104 -106 447 -66 58 -282 -81 92 -76 -120 -101 -171 -211 -178 37 147 -179 -113
3126 -113 203 66 -167 -29 157 353 -60 126 442 275 -177 31 119 -6 -123 22 283 158 -272 64
3146 64 245 151 -452 105 154 -120 -90 -59 318 4 -256 -206 55 393 -210 -135 182 216 25 306 90 315 74
3169 74 -24 419 -32 21 -159 239 12 -256 -325 93 -71 -288 -54 219 42 -66 -359 216 -130 -184 -182 228
3191 228 41 -104 38 198 135 -82 -16 115 262 119 131 317 285 139 -211 123 -102 -94 -90 69 -68 -85 -50
3214 -50 108 -38 -237 -91 128 -34 83 0 132 39 -77 -124 291 191 -85 102 94 193 57 -31 288 255 -143
3237 -143 76 184 -204 -144 6 -147 81 -134 -105 -196 91 -112 -38 125 146 -84 -143 -86 113 -79 92 305
3259 305 -48 -27 -148 185 -74 -226 -114 234 224 -246 -146 8 270 -387 -172 -91 150 -248 -279 319 99
3280 99 -289 25 114 107 -143 -1 143 214 -65 7 352 -36 -211 117 293 -110 -40 157 289 67 48 -183 -58
3303 -58 48 -199 -31 317 113 -264 264 6 165 -86 -68 92 106 -110 100 342 -81 -39 45 406 216 262
3325 262 285 118 245 -62 105 188 25 69 -3 129 -293 -538 5 -63 -313 -186 -120 62 5 -153 22 241
3347 241 6 28 -62 98 177 -302 -181 282 282 3 224 28 138 -40 49 66 -200 -304 173 223 57 -208 38
3370 38 -34 23 -416 -44 147 -47 -232 235 276 -56 49 164 161 466 -134 113 115 -2 108 285 54 -143 -130
3393 -130 -114 309 -120 -197 101 96 -12 -40 -175 142 -43 -259 -14 237 58 -145 -23 205 139 -97 86 75
3415 75 130 57 70 22 37 -117 -76 243 -130 146 -172 -82 -156 14 128 3 -26 -419 68 -183 -241 -317 102 86
3439 86 -35 -81 84 264 33 -238 33 275 277 -142 22 -73 66 75 100 223 -203 71 10 291 161 -231 -131
3462 -131 -35 -97 -92 -110 131 -69 -262 -126 -96 -8 -192 56 217 22 -157 308 80 -126 -244 245 238 -183 -40
3485 -40 -37 -69 -124 121 -186 260 -20 -196 -88 209 -146 347 -29 -75 -345 -131 -94 25 -252 -200 193 7 45
3508 45 13 163 245 -93 -115 81 356 -66 71 211 61 76 -61 125 -189 -51 -3 321 198 -221 -198 184
3530 184 166 -33 -338 85 143 -133 -251 240 -89 -97 -21 59 301 -101 73 282 170 -162 -128 57 -43 -463
3552 -463 123 131 -160 -72 -156 -31 150 0 -450 270 238 -301 107 -9 -17 -245 17 136 295 89 -33 67
3574 67 162 355 99 244 334 -159 -75 257 -36 -87 -108 -39 122 163 -165 66 -154 -336 -44 332 -41 -208 -215
3597 -215 276 94 -164 -37 79 -164 -145 -135 382 122 85 -79 395 152 -121 174 213 121 -10 80 -240 9
3619 9 -81 20 90 18 -307 21 85 141 -63 58 236 -27 161 -104 4 190 40 23 300 33 -132 -53 108
3642 108 176 -53 -119 77 -79 -231 36 174 116 -105 -173 218 118 0 -251 54 90 -131 73 306 -7 -261
3664 -261 -165 114 226 9 -127 128 -55 -214 -33 107 2 -146 -35 3 77 -550 -78 57 -84 -23 -197
3685 -197 173 92 -240 98 364 253 85 -224 204 12 -66 113 115 177 37 5 27 144 -133 -36 -4 197 117
3708 117 -46 105 -124 -97 18 84 -216 198 -244 40 -8 -22 41 42 -43 -85 42 226 -29 -110 36 181 36
3731 36 -44 32 -69 93 172 129 171 163 -71 37 -87 201 -250 4 -122 167 -208 -59 370 -308 -302 -112 -49 16
3755 16 -115 79 240 96 -335 23 322 -30 -151 -114 250 1 -136 164 41 51 -57 170 198 -100 25
3776 25 -79 200 -250 -256 -143 197 -208 -62 -66 19 -154 -15 20 21 -209 -68 60 259 -84 -75 85 137 294 182
3800 182 -30 48 176 -284 128 -61 259 -33 59 -155 -51 -353 42 24 -330 -243 274 297 138 -36 -78 130
3822 130 128 -71 84 508 347 -211 157 41 126 113 124 137 92 123 -25 65 30 57 70 -59 34 -358 -27 301
3846 301 -406 -334 184 359 -29 -278 -46 270 140 -16 -1 1 -41 2 123 514 34 -222 -120 -131 166 -149
3868 -149 -119 24 -240 -196 86 277 -105 -218 -57 54 -148 -329 93 -150 -126 -35 252 115 11 -203 113
3889 113 -93 -334 -182 -89 238 -109 43 146 -2 -273 -248 207 -49 -202 -287 -58 103 -141 -213 28 132
3910 132 -94 -214 119 -110 -142 -97 143 265 -64 38 99 -9 14 14 25 299 -24 -256 267 247 -47 20 203
3933 203 -16 -42 -376 8 53 -6 -34 -104 -137 -306 -320 136 8 109 -35 -130 26 -122 119 150 175 -77 -58 388
3957 388 234 -400 54 -164 -25 -139 -50 388 23 -153 20 64 -230 250 -183 142 7 -232 -49 113 234
3978 234 -13 -160 114 92 -27 -359 -201 60 -152 -97 116 158 191 -13 300 35 256 -148 128 -48 168
3999 168 -69 -61 -109 -238 -63 36 -55 -127 -96 62 26 -268 -175 -83 7 173 55 38 35 12 -111 178 39 229 -151
4024 -151 136 163 -116 -157 -23 -211 -285 -121 177 247 -139 -168 4 -6 -129 139 70 -87 -168 -119 3 -50 63
4047 63 -86 165 -40 -202 -336 360 -56 128 -240 203 -103 13 -85 90 229 -207 -256 315 -1 64 -185
4068 -185 65 128 -43 -189 207 213 -142 -20 307 234 -186 248 -91 107 -68 -13 -63 271 11 123 223 -91
4090 -91 317 -70 241 16 -178 261 76 158 38 -92 91 -80 -14 -263 110 -86 -167 -68 -92 93 -125 0
4112 0 125 77 -258 52 196 258 137 -53 164 283 -108 183 540 217 -127 -42 -38 105 134 -115 114 17 -110
4135 -110 -66 26 -44 78 -132 114 174 -18 -34 254 163 -116 15 68 -115 -43 -98 84 384 -299 144 -160 -32
4158 -32 -281 -204 119 -218 -145 119 393 100 -99 70 86 -222 69 76 139 28 -177 1 246 151 -66 142 -22
4181 -22 208 -43 -15 95 8 -308 -43 -229 1 -17 -68 -49 -197 82 -228 -40 -109 -258 -165 94 -64 -226 -237
4204 -237 123 51 -2 -2 197 121 -176 -28 21 116 -169 -42 202 32 -165 -153 -13 -87 8 -108 -11 -92 -116 -121 126
4229 126 -107 -262 35 181 -153 69 45 171 99 -103 -99 246 100 3 -146 203 51 -68 -90 63 -46 -340
4251 -340 8 235 -89 -84 99 169 -72 -196 -53 118 -222 6 -156 -92 110 -89 -17 127 26 -42 302 -28
4273 -28 -34 -231 262 74 58 -268 -5 212 -228 81 -135 18 -27 22 1 -166 -256 -300 -217 114 28 -115 -165 -172 -116
4298 -116 -7 -56 142 165 -64 -112 140 27 -65 -106 151 23 -107 -139 389 29 78 -46 190 67 -37 22 32
4321 32 115 -104 -114 -211 96 -90 100 351 -10 -147 98 94 -59 84 248 208 102 -54 155 129 -220 -157 166
4344 166 -59 -26 -105 273 15 -1 -94 -188 -8 -155 95 66 85 4 -434 -98 146 -122 -70 -91 86 -130 24
4367 24 290 96 -69 76 102 290 18 -146 167 -111 -141 -78 18 120 -94 39 -139 70 -174 1 127 316
4389 316 1 42 -49 60 77 -59 -335 143 19 -116 194 -42 -3 -78 91 120 -61 -202 -57 67 -146 -190
4411 -190 233 91 -25 -205 30 77 -95 -196 67 -173 -307 130 65 43 -45 34 124 118 -74 -308 88 66 -55
4434 -55 105 104 -153 -214 -170 59 -51 -124 201 65 74 103 28 134 278 -7 178 115 -112 9 -23 127 107 -204
4458 -204 -268 -20 47 -105 -114 200 219 200 -129 111 6 5 -91 143 -41 -257 -74 105 160 20 -157 160 458
4481 458 -59 -201 123 116 -100 -31 278 192 -60 -83 -121 -39 -196 -32 -81 93 -65 -124 -33 58 -139 184 64 -111
4505 -111 -189 -47 142 -30 2 -160 81 82 112 -39 -83 15 16 -132 169 178 63 221 128 -114 -62 -7 42 148 16
4530 16 -136 39 67 -202 32 85 -27 -222 -239 174 -163 -183 -163 122 -175 104 -204 260 96 -55 -222 210
4552 210 -9 79 58 84 54 9 74 57 162 206 -43 177 287 120 359 -33 115 -27 -274 -215 -81 -554 -120
4575 -120 -58 -95 -127 103 115 103 109 -178 -44 3 -84 250 -25 47 -20 141 265 -5 133 -49 237 87 -144 -90
4599 -90 167 125 -213 -104 74 -118 -375 -77 120 -25 -142 -169 -156 131 -223 -72 307 -130 161 173 281 80
4621 80 61 -19 185 257 -202 18 230 -115 -78 -68 -64 -87 -225 -28 15 -177 -33 15 27 42 -550 114 92 -241 -198
4646 -198 284 159 -133 -6 47 -107 69 2 -158 48 111 -215 7 -69 -33 -116 146 -1 -120 -263 -36 496
4668 496 277 -84 -234 44 -291 -157 82 20 16 7 65 15 -73 -192 -150 -58 255 302 34 23 106 -190 -9 -45 1
4693 1 29 -36 -53 2 11 243 -4 -139 -267 -3 -57 -264 -43 -31 -42 154 -134 85 -150 198 -301 133 183 -131
4717 -131 -271 154 58 -247 -36 -22 272 23 -97 -200 -29 24 -52 -22 62 -81 -39 46 54 25 -382 -153 99 25
4741 25 60 142 -43 -80 -189 201 69 -131 -109 214 105 -228 101 -53 219 -23 -176 211 79 -38 -41 216
4763 216 271 -70 -95 -31 159 -107 -151 228 1 58 101 37 -20 -68 6 152 -26 -150 -24 140 189 39 -12 -110
4787 -110 8 89 -148 -249 -97 -228 -232 84 120 -261 -234 -53 -29 58 104 -71 -38 -38 -500 145 95 -27 -33 -125 132
4812 132 -102 -87 116 150 -109 -117 -11 -114 -31 -270 93 83 -139 -164 -108 135 157 151 -99 40 -79 51 66 -103
4836 -103 -136 -86 183 118 -152 -181 90 -19 118 204 -105 235 -147 -99 172 120 -234 -90 181 33 22 140 -11
4859 -11 -165 22 -144 -77 8 -59 130 118 -35 -156 4 -77 157 -146 35 -33 -20 -125 -4 141 -11 -129 51
4882 51 -35 125 109 96 -3 32 -70 -2 -38 -38 115 -39 1 -71 -309 59 17 101 -197 -17 164 -103 69 -60 224
4907 224 4 -162 -173 184 -1 -82 -20 129 -140 39 -185 -105 82 1 -97 -132 -5 -333 -62 -26 -45 -198 55
4930 55 114 120 90 -51 148 40 43 -71 -79 192 -245 120 210 93 31 109 43 -2 -247 -105 -93 110 -151 51 90
4955 90 92 -43 9 204 -287 -88 -91 -136 -137 -137 307 179 -132 -44 -77 -83 240 -4 41 132 -77 -308 -201 168 -11 -276
4981 -276 -26 -96 262 -153 -201 61 4 -142 -43 83 59 -100 23 209 -128 -529 59 384 -129 -78 420 34
5003 34 47 -56 -113 95 78 -80 -183 84 -274 -164 61 -12 -260 -113 -65 -23 -66 -24 -67 167 -60 44 -175
5026 -175 -76 30 -154 -35 -36 -115 130 170 236 58 -195 -149 12 -122 113 -100 58 -222 -206 146 170 101 151 -164
5050 -164 -4 48 -48 -144 97 -411 -78 134 133 134 -163 133 -131 -16 -248 -28 344 63 -190 1 -93 -174 -46
5073 -46 -238 233 98 -225 -162 46 -97 -452 -3 148 64 -249 33 86 -243 78 111 19 -36 -50 -73 224 -172
5096 -172 115 -136 212 7 -2 180 319 -25 -5 -30 -107 -123 -260 38 169 58 -105 268 104 -143 -221 150
5118 150 73 20 -243 56 329 39 -335 42 139 47 -167 -22 165 -10 -360 21 -117 -161 -71 175 18 6
5140 6 -3 -154 70 177 -166 25 26 -279 -167 -277 16 -11 120 -15 117 -37 -60 456 363 3 127 56 176
5163 176 161 -17 -109 135 143 -87 234 172 -151 173 173 12 -196 -251 118 121 -197 -200 210 141 16 7 178 -22 113
5188 113 -250 127 107 165 -219 -16 248 31 248 -165 309 28 -21 -131 -195 78 -118 -117 60 -120 146 282
5210 282 93 109 126 306 -228 -33 -58 60 71 -81 3 76 -9 212 28 -62 66 -44 -56 60 249 6 50
5233 50 -7 -84 302 25 -10 292 13 -254 -190 26 -24 56 -79 -5 125 -94 93 299 33 95 1 -58 225 -377
5257 -377 158 -166 71 -104 178 116 -132 66 19 150 -177 -102 123 1 -97 -86 43 62 9 134 -110 254
5279 254 -240 -150 -136 230 -180 28 140 118 21 163 -48 139 13 -168 84 -36 -75 120 5 77 -122 -75
5301 -75 -65 197 -306 -76 -22 -88 -24 33 297 -240 47 -14 109 173 87 171 98 150 -96 -70 36 62 -38 -153 137
5326 137 31 -184 79 125 -98 25 -126 124 76 -234 -12 273 73 -99 -218 -13 279 -134 80 43 9
5347 9 250 -27 126 59 95 -42 233 -4 -62 -464 77 456 37 -226 330 -112 10 17 -95 206 -8 -125
5369 -125 345 -37 -227 -17 196 50 39 -112 154 218 -151 -17 35 -211 136 -73 97 42 -312 43 270
5390 270 28 -106 -88 -56 -68 6 6 155 -163 10 4 145 188 145 28 86 97 138 55 103 32 -273 -77 203 87
5415 87 -189 -171 73 36 -313 43 136 32 177 16 139 -195 -354 -76 115 -147 -32 -129 56 24 -24 -17 212
5438 212 -10 -221 48 278 224 -140 -156 -126 185 -42 -6 115 -10 -55 -80 49 1 -288 101 -374 116 -134
5460 -134 -163 189 -8 -147 -42 278 -33 -16 2 -45 22 -31 150 162 101 -97 -53 272 173 -74 -208 15 -28 -225
5484 -225 -69 -114 101 -180 -4 51 46 -181 -216 211 -85 -16 73 -12 -159 -175 108 30 -21 -145 240 -30 -73 73
5508 73 21 -15 -113 -243 -69 176 130 5 67 169 -37 -267 90 -173 -52 33 -139 172 110 -279 -35 224 -116
5531 -116 -257 109 177 250 -106 -96 349 -282 -38 15 281 32 -75 0 255 128 114 -78 -68 -21 -81 12 20 19 273
5556 273 97 197 90 -245 384 91 80 34 150 248 362 -255 214 -2 220 43 106 79 -66 32 -19 143
5578 143 -244 -188 -214 304 -319 -161 -77 -71 -36 -208 -2 23 172 213 -221 136 48 -155 -161 105 283 118 66 251
5602 251 138 -95 315 83 -100 38 63 110 -50 -226 161 -90 -281 -94 37 -4 -32 -124 -61 92 -49 69
5624 69 32 82 55 -107 -85 215 -255 15 59 205 26 -25 175 244 -102 52 95 229 -107 -234 132 -7 -168
5647 -168 -408 174 45 -91 -143 49 298 -39 -152 1 65 44 108 242 208 391 -180 183 298 48 -32 -105
5669 -105 114 85 -52 188 45 -108 -78 -173 -39 -102 -107 -71 136 -101 -323 144 131 -145 -253 260 340 -150 -11
5692 -11 92 46 143 21 -5 -28 -70 -197 68 267 71 -115 117 115 -29 133 -96 36 -25 -245 35 204 -112
5715 -112 192 -135 -176 144 -169 -170 11 186 -182 100 131 -76 -207 -13 72 -118 252 -141 -22 -163 -8 171
5737 171 85 -201 -73 -1 -124 -160 -74 3 27 225 -48 145 -47 124 -139 55 156 50 20 186 -85 38
5759 38 43 311 58 11 -133 -98 261 34 -231 182 0 -121 -74 101 -200 -107 -74 -41 192 34 -39 167 -191
5782 -191 -341 -67 209 201 272 -166 127 -143 -142 125 -203 -34 151 -43 97 -177 -111 -118 89 127 -40 -173 -62
5805 -62 -113 -241 -51 -7 134 -279 23 91 34 -73 49 248 -102 -149 -128 215 -28 -181 -113 30 132 -193 -2
5828 -2 112 61 -155 -190 108 149 51 44 -10 169 -127 -192 27 62 -195 -186 35 249 -144 -25 -65 103 100 214 146 148
5854 148 -2 -163 -107 -209 -142 -113 -9 -100 -271 80 38 -28 -142 34 -48 111 -190 -102 76 139 -269 163 169 -25
5878 -25 138 6 221 -132 15 25 183 -11 2 -52 154 134 89 -97 0 -215 -133 -36 361 211 -196 97 -41
5901 -41 92 -64 -110 -169 47 -169 90 189 -50 -199 -124 173 263 -172 87 -48 172 -173 90 56 155 -8 -9
5924 -9 247 100 78 158 53 152 -68 -118 -45 -28 75 -129 -17 41 -140 3 37 13 -42 -145 209 48 -72 47
5948 47 234 47 36 137 60 27 95 -90 20 30 -224 -164 12 -82 -200 -202 127 119 -48 -34 92 -10 -303 -130
5972 -130 128 -18 -175 -181 213 100 159 151 64 84 152 -70 89 -57 50 4 330 -105 -44 255 -167 193 -79
5995 -79 172 -53 -89 -26 173 282 -251 -103 122 220 95 43 -61 169 -18 326 -35 220 31 11 129 -87
6017 -87 -21 -126 91 21 -37 -48 85 112 -198 41 -183 61 -67 -115 114 183 -328 -21 41 -23 -144 11 -2 220
6041 220 159 146 -76 202 257 86 13 -83 135 -96 135 -132 191 -87 -69 325 -191 -63 -78 115 42 -61 205
6064 205 -60 -196 -160 -14 294 180 -65 -43 -16 -30 -47 41 106 -127 -196 88 -60 105 27 51 -57 -180 -150 217
6088 217 211 -11 57 179 -113 -118 -9 -154 17 -105 -86 -52 253 124 128 63 3 -24 -54 107 87 -342 -233 498 37
6113 37 -117 -16 39 -52 -74 51 20 189 -13 -27 -19 136 35 -228 -47 1 87 57 42 3 -88 -11 186 27 20 55
6139 55 145 147 -20 139 99 83 -34 55 201 -80 45 76 96 34 -119 145 -89 39 19 -155 -15 -124 119 30
6163 30 220 313 -106 -119 267 150 226 209 44 118 -47 -102 181 45 89 -80 37 168 49 -161 131 153 -181
6186 -181 -204 173 237 139 112 72 -137 84 -129 390 -90 -39 -76 -157 246 -242 -221 96 76 -11 -207 111 -134 159
6210 159 -207 29 189 89 12 110 262 -26 -130 90 -130 -84 -21 -55 88 -201 45 87 138 -7 -113 154
6232 154 207 -108 -90 -47 -296 -33 -160 -33 -89 -120 12 5 -138 -43 35 66 -67 -253 63 98 18 60 -36 109 -7
6257 -7 -157 -1 68 100 38 -8 152 -155 -47 117 314 -28 -109 43 104 -172 -2 -22 -15 93 -47 -205 -112 -35
6281 -35 -73 -59 -143 -51 -63 9 74 -12 -103 -76 14 0 228 -5 -85 484 -153 -95 -153 38 20 -36 116 -2 -293 -177
6307 -177 319 135 78 -45 90 17 -14 -244 6 -52 -122 -7 123 150 27 -138 73 -87 -304 166 77 -165
6329 -165 -226 -57 44 14 -320 -116 20 -17 62 0 74 162 -187 -44 -107 85 64 -131 8 15 58 149 28 -74
6353 -74 10 117 126 -103 58 93 -12 -133 49 -100 245 -13 -116 -108 -51 85 -149 -241 203 -58 -222 -25 -87
6376 -87 -134 126 -46 95 97 16 13 150 -83 277 109 18 108 -186 0 393 -35 60 220 -107 360 133 -175
6399 -175 53 140 -146 -99 179 -5 -176 -60 57 -374 -47 -115 -22 131 15 104 27 -12 -35 191 185 103 61 54 36
6424 36 58 67 188 34 282 -205 -49 146 66 45 -61 63 -294 -24 82 262 -308 -55 -122 20 -371 -393 -93
6447 -93 18 52 -120 -14 -26 28 -59 73 135 -41 85 -23 145 158 -117 50 122 -192 21 -127 188 -71 138
6470 138 20 -3 -259 -62 80 -52 -158 74 165 -25 266 -16 91 -91 156 117 -29 -113 19 -183 162
6491 162 115 -215 -184 -131 47 -222 -180 -41 -28 100 86 -140 -50 131 -14 -95 122 -15 1 -8 42 -279 75 -27
6515 -27 -177 94 100 144 339 -104 -153 -306 80 -3 -181 -32 241 120 -100 -58 -32 207 -70 -84 22 -7 -131
6538 -131 65 66 -66 -62 -163 48 9 -241 169 108 112 -119 213 -57 -106 -199 117 83 -130 -210 184 124 -93 47
6562 47 24 -100 53 -437 37 -11 127 -38 131 286 -196 -148 250 30 -393 -99 -22 51 151 -334 -20 -45
6584 -45 29 -97 -1 -26 -95 -41 12 166 95 -80 -3 -216 -84 -87 -112 -1 88 -80 121 -178 -177 112 179 -63 -256
6609 -256 67 93 154 97 -74 68 46 -153 136 186 57 -321 -202 -3 58 -94 -511 -94 -62 -252 -205 197 62
6632 62 -206 103 112 -44 72 46 88 132 -101 199 59 -161 -350 56 81 12 -20 -177 155 126 259 -163 -37
6655 -37 186 141 -345 -64 122 -160 -104 53 -77 76 -141 -67 9 -60 -270 62 131 -50 18 -127 285 -171 78
6678 78 -108 10 -3 20 174 115 -39 -11 -92 245 2 -143 -161 -88 -59 180 278 101 -61 62 15 -128 -165 -150
6702 -150 137 300 -12 5 189 -14 126 56 -48 162 -131 -163 -36 -159 70 -63 -29 297 30 -136 -69 -172
6724 -172 113 101 257 -21 36 -191 56 249 -235 57 175 242 212 -106 -151 92 67 -145 -4 114 118 -139 -131
6747 -131 -151 -21 -106 -110 -151 -171 63 108 -14 -37 -89 -102 65 -415 99 211 -245 234 12 -148 -6 182 -41
6770 -41 136 -122 -66 243 13 228 -47 81 -26 -65 75 -58 36 -116 14 91 37 33 -295 -24 -43 -38 158 83
6794 83 -15 58 -12 -53 -31 -187 -39 110 131 14 -107 29 -38 -120 -203 213 -106 -52 197 63 31 -46 -58 144 -119
6819 -119 168 -133 -33 34 212 -25 26 175 113 130 54 -7 6 -184 133 31 -8 11 -85 -141 -115 -138 44 -19 83
6844 83 -44 -89 -11 -38 -143 138 -149 -155 -251 -201 242 53 -246 40 70 10 217 194 138 112 249 -134 45 -165
6868 -165 -244 -131 79 139 -103 -19 129 31 -7 -184 -193 -59 -290 30 -278 -268 -129 -229 199 81 -127 130 186
6891 186 137 -194 214 -20 -51 -126 45 -10 294 -14 196 174 249 6 -15 158 177 197 306 103 -49 -37 201
6914 201 157 117 -103 -18 141 60 -161 -123 132 -20 -24 26 54 -104 122 -120 -195 301 -222 200 198 196 -187 -258 236
6939 236 229 16 -42 23 -45 -252 -71 311 -23 13 -12 145 262 219 70 31 156 -41 -129 86 42 -10 -103 -148 -130
6964 -130 158 -9 -10 -208 7 -254 -100 127 -45 35 101 -44 -7 152 -48 -427 -326 -28 31 67 -102 -120 -93
6987 -93 -311 -55 34 -187 -51 -46 185 43 -48 -64 -281 124 109 -244 36 20 -110 -30 184 25 -215 -169 5
7010 5 -70 -155 127 -113 -179 101 -70 -85 -109 -37 -43 -30 -4 162 -47 68 -31 156 139 -51 194 38 -36 269 29
7035 29 -83 -85 -50 53 -185 51 9 29 -201 -290 -125 194 -154 46 -57 125 51 -27 -80 245 -104 -84 -101 265
7059 265 104 -168 123 53 -149 4 -168 200 -121 -326 -12 -43 -223 38 105 36 150 -335 26 140 -120
7080 -120 -132 44 124 12 -186 -47 18 55 -108 105 242 -198 14 178 -124 -280 -35 41 -79 -254 -133 -42
7102 -42 103 73 -257 -27 138 -115 8 -16 -64 -108 -266 182 39 236 -112 94 71 74 122 130 274 79 -45 140
7126 140 27 -13 -32 171 199 -81 -154 213 -78 136 -164 -30 74 -8 31 20 229 -12 75 61 33 133 -172
7149 -172 -47 -64 -184 87 4 290 -71 46 63 184 -143 -96 124 173 71 35 -210 2 -70 171 11 42 168
7172 168 73 60 218 20 -260 103 85 -222 24 333 147 5 -92 153 221 -170 -228 -51 124 64 43 124 148
7195 148 82 -32 257 48 -277 -110 170 123 -171 58 13 -206 -160 -50 -59 -129 -109 -144 60 -136 2 38 141
7218 141 63 21 -130 -100 75 -25 -12 90 39 -214 23 -94 -123 88 92 230 -19 32 -47 73 110 -128 -84 61
7242 61 -78 9 112 224 249 132 143 159 30 25 127 179 88 -233 182 43 177 -86 -74 -7 -168 -40 88 37
7266 37 227 -113 143 162 -327 -11 77 -16 71 -371 77 196 89 -250 34 65 31 6 15 224 -172 -77 166 236
7290 236 124 -113 132 -204 -4 -12 35 8 -156 -207 -35 189 179 -197 -42 7 162 -7 32 53 4 -1 -136 338
7314 338 307 170 227 88 232 0 -70 202 51 -147 77 25 -193 -87 -57 179 -69 -220 76 -8 -66 420
7336 420 -116 15 -74 196 108 -6 161 -359 45 -7 58 -91 -6 -71 -136 -92 -104 68 -335 -216 -57 16 6 -169
7360 -169 -30 -55 85 -25 -111 58 -29 -327 74 96 -10 63 -246 211 8 8 -79 323 -277 -147 230 114 163
7383 163 75 -241 210 7 -92 106 235 -136 -225 -135 -14 145 -188 -6 -154 -32 -278 -135 -178 158 205 260
7405 260 43 -190 -4 0 56 69 -240 -5 390 -272 -104 -79 -170 -63 -25 163 53 34 -142 -52 111 49 28 -103
7429 -103 137 -74 -132 8 -150 32 98 280 69 -27 -117 59 327 -61 95 6 100 -172 148 -209 -78 59
7451 59 149 -9 -103 8 -146 -163 54 -63 -143 316 195 31 -122 156 163 4 -211 -4 -70 -146 294 -219 196
7474 196 -13 -317 -51 85 4 -88 -99 -41 98 -104 -7 -63 66 -230 67 -19 -85 204 65 150 153 239 190 157 30
7499 30 -70 248 -118 134 207 93 71 274 -6 85 -84 -59 198 -87 45 14 56 -1 -38 69 -190 8 158
7522 158 -70 24 144 47 -40 -127 -103 77 14 -47 223 142 -54 16 125 96 -56 -142 79 -135 -378 -194 -57 16
7546 16 -86 -121 53 -32 -124 -66 135 263 -206 -26 132 -74 -155 -49 -180 110 103 60 115 -270 -13 -30 140 41
7570 41 55 -175 -50 92 -95 137 31 6 -92 -248 -7 -31 110 240 -90 187 -6 -92 -79 -236 39 55 -16
7593 -16 3 -156 -14 148 -186 -52 36 240 27 -212 106 -14 54 -109 -152 -75 -185 158 146 67 317 -82 -208
7616 -208 4 155 35 37 -5 -224 182 53 49 -59 -82 -10 200 -12 -161 -207 200 239 117 -38 -117 123 57 -72
7640 -72 -79 -4 18 65 139 230 -232 -36 162 109 142 8 -111 48 -257 -174 7 -168 -19 -46 -26 60 196 98 -295
7665 -295 -33 -161 -216 -32 12 29 -182 117 137 197 -216 -16 -15 139 76 102 94 195 -89 99 122 169 -43 -59 -183
7690 -183 -22 -129 332 -17 85 -70 -106 58 -100 -141 15 -103 -235 -3 56 -81 71 -120 93 213 89
7711 89 -223 261 83 -75 -1 285 272 -104 73 -119 33 -151 -65 5 35 16 -67 -143 -41 118 -91 10 220
7734 220 -276 -264 39 43 5 139 280 129 32 143 47 346 89 -156 -128 -285 157 162 79 178 -288 -9 -102 -45
7758 -45 111 -190 128 -309 118 93 -158 -63 -52 117 -86 91 -56 244 -142 164 162 3 158 -117 100 -261
7780 -261 193 -87 96 -63 7 -65 31 -24 34 55 1 -85 177 58 -114 53 167 85 -217 7 191 59 63 106
7804 106 188 28 -152 -51 69 77 46 -50 268 -34 -128 -10 -43 -98 -248 28 65 -161 -221 -114 34 -171 28
7827 28 131 -152 -90 22 -130 281 -31 -23 47 67 176 -93 215 28 67 97 50 212 -29 203 -33 -160 295
7850 295 -135 169 193 -31 68 70 -128 50 -46 172 157 119 98 -88 116 46 -43 -131 78 62 -281 37 121 -44
7874 -44 -321 129 -155 -83 112 -131 11 -98 -69 247 -40 -160 -157 -36 169 112 -238 29 58 86 -152 -128 -1
7897 -1 -82 -6 246 -70 -277 86 236 -114 -184 -79 -94 160 -49 -74 141 -45 -211 -184 286 265 -110 -4 47
7920 47 144 -190 -19 -90 207 -65 73 299 -158 45 197 -193 8 60 -211 -142 -50 -107 -149 42 -136 52 44
7943 44 -74 -3 -100 -60 -81 32 153 -48 114 169 -6 62 -153 88 268 -123 239 110 -88 -114 -301 120 -107
7966 -107 -7 -118 -155 49 -9 2 -69 -44 23 170 -194 -61 -103 -6 -170 -66 -375 -86 140 8 -47 97 -58
7989 -58 -182 100 -39 50 135 -255 12 -109 -25 -335 -14 273 -15 235 -71 182 -88 172 -78 -68 8 32
8011 32 148 -66 26 -155 -183 34 -11 -139 -175 257 277 -93 -238 -118 179 55 -78 40 -356 189 308 -71
8033 -71 -3 -17 -82 43 308 53 -45 8 -122 347 -149 26 -121 153 31 156 -332 101 -118 -58 83 -24
8055 -24 256 -55 -198 -105 190 35 51 18 -59 28 80 -36 296 201 66 132 131 -229 -130 -309 195 -67 -107 -29 -125
8080 -125 -2 -34 49 134 129 -63 59 64 259 -94 46 -133 51 -136 -159 80 -67 -61 6 146 166 -104 42 30
8104 30 155 188 -357 153 90 -322 53 9 -198 114 -216 66 75 -153 63 50 190 -33 -11 76 -133 -44 -145
8127 -145 -94 -24 7 22 -69 490 10 59 145 -3 -19 5 49 155 -57 -48 -239 79 37 -54 162 67 -37 29 -29 99
8153 99 -93 79 -46 -138 -60 68 138 35 -201 -195 29 -154 21 -131 -78 3 296 -17 152 -119 -145 68 -57
8176 -57 152 64 -1 174 -28 95 64 -17 -16 111 32 276 65 -13 -31
8191c1
$$ Imaginary data points
##PAGE= N=2
##DATA TABLE= (X++(I..I)), XYDATA
0 0 0 0 0 0 0 0 0 0 0 0 0 0 0 0 0 0 0 0 0 -8 8 -8 8 -8 8 -10 16 -16 16 -23 24 -25 32 -33 40 -43 49 -56 63 -69 76
41 76 -85 95 -104 113 -128 138 -152 168 -186 204 -226 249 -276 305 -339 376 -420 472 -534 609
61 609 -702 823 -985 1214 -1559 2139 -3301 6479 -32580 -94984 13871 66728 464 -40799
75 -40799 403 18157 -549 2275 11647 -8833 -9237 16038 13340 -18452 -18588 18480 25870 -18573
89 -18573 -34157 2813 26032 2955 -23083 -18053 2010 9969 5625 -10392 -17458 3103 16118
102 16118 -1149 -9539 3002 7111 57 3752 10597 -1702 -5962 15979 16641 -10582 -12682 15839
116 15839 23153 -7492 -22768 5091 21109 -1738 -17144 -3816 5349 -3814 -5563 4228 -5249
129 -5249 -14937 2734 11996 -6272 -15020 2964 14848 -2053 -13605 2612 14383 3871 -7069
142 -7069 -3687 8756 9251 -1121 -3624 -229 3429 3245 -2055 -2763 51 -1867 -3266 -1848 143
157 143 -2431 -7092 -1586 3428 -4447 -6721 2380 4271 -3746 -6433 4689 8523 -2101 -3639 5547
172 5547 6333 81 -712 5986 5093 -3703 -486 7670 2311 -5828 -2378 4778 1246 -7685 -3337 4337
188 4337 -1413 -7909 -5279 2528 3631 -5478 -7562 1045 4875 481 -4148 -1141 4895 2429 -960
203 -960 2398 4283 1801 512 2106 4371 207 -602 4175 1502 -4616 -2785 4353 3599 -7443 -8318
219 -8318 3935 4237 -6253 -7354 2105 3959 -5457 -6408 4085 4229 -4074 -2995 3897 4078 -1311
234 -1311 -1012 6428 4467 -2396 -442 5266 4982 -755 -2736 2786 2207 -2377 -1474 872 -1056 -4131
250 -4131 -2670 1057 -1389 -5749 -2522 1830 315 -4699 -3919 3888 4239 -4168 -3693 4899 6436 -1114
266 -1114 -3985 4573 7115 -624 -1763 2882 3757 291 -1446 2133 1686 -3683 -2018 2846 -192 -6111
282 -6111 -3938 3621 994 -7769 -4305 3741 1074 -5455 -3433 3685 3483 -3186 -2077 3955 3677 -387
298 -387 -635 3645 3936 -763 381 4603 1794 -2257 -504 3367 1421 -4161 -2492 2699 -235 -4789
314 -4789 -3425 1523 1372 -5518 -4493 2816 1944 -4002 -3051 2870 3158 -2870 -1289 5157 3113 -1569
330 -1569 -28 4394 4312 -1152 -748 4205 1857 -2069 -203 3136 973 -4608 -2480 3139 -604 -5342
346 -5342 -2632 1728 -420 -5246 -2787 3407 756 -4744 -1913 3521 2881 -1828 -1615 3879 3434 -929
362 -929 165 3520 2425 -823 -383 3798 1090 -2809 642 2576 -700 -4156 -1610 2866 -315 -5444
378 -5444 -2511 2087 -36 -4642 -3269 2629 1625 -4116 -1879 3012 2312 -1407 -577 3695 2409 -1496
394 -1496 1171 4143 1910 -1368 -568 3497 2205 -2727 -1324 2477 -10 -3434 -1806 2153 -728
409 -728 -5331 -1683 1939 -1464 -4274 -1518 2838 693 -4148 -1569 4583 2100 -2602 -930 4373
424 4373 3370 -1638 85 3635 1356 -670 858 2003 351 -2015 458 2377 -1509 -4031 -1049
439 -1049 2334 -698 -5952 -2364 3334 -422 -4956 -1476 2189 840 -2486 -1064 2259 1696 -343
454 -343 490 2361 2170 -440 774 3873 746 -2174 1047 3577 155 -3178 -754 2552 -7 -3506
470 -3506 -1919 251 -117 -3010 -2520 1726 -529 -4036 -1122 2761 510 -3118 -825 4137 1370 -2506
486 -2506 595 4015 2239 -1089 -574 3584 2901 -1210 -636 2076 644 -2049 -409 2682 -1995 -4881
502 -4881 522 2916 -2208 -5144 -1395 2972 93 -4654 -1414 3038 1503 -2643 -1308 3018 1876
517 1876 -1420 1138 3130 95 -281 2043 2827 -63 -1942 1800 3078 -927 -3539 -809 3455 582
533 582 -5300 -2514 2912 512 -3753 -2262 1248 -176 -3015 -254 2205 -459 -2280 590 3905
548 3905 1061 -2761 1176 5483 1016 -2937 947 4857 825 -3295 354 3222 -838 -2677 400
563 400 937 -2161 -3127 616 1656 -3131 -4292 947 2949 -2145 -4678 624 4998 -364 -3257 538
579 538 3585 1345 -1266 405 2762 924 -73 1406 1844 -188 -1427 1599 2392 -2224 -3147 1736
595 1736 2261 -2872 -4263 320 2843 -2369 -4528 -181 2384 -576 -3173 -392 2481 19 -1470
610 -1470 1358 2418 -454 -562 2454 3072 -789 -833 2739 1967 -997 -1036 1283 1632 -1501 -2679 594
627 594 1493 -1971 -2875 -207 1240 -1768 -3173 308 1468 -1379 -2090 310 2362 71 -1630 1370
643 1370 2466 389 -620 1494 2911 489 -1565 1718 2271 -1209 -1584 1542 1671 -1969 -2940 916
659 916 1545 -2669 -2823 -196 762 -1560 -3101 298 1572 -1667 -1491 1266 1916 -583 -1357 1892 2385
676 2385 -198 1 1862 2039 -35 -738 1635 2283 -876 -1559 784 1491 -1126 -2437 184 1046 -2105
693 -2105 -2735 591 771 -2021 -2611 622 1844 -1527 -2434 1119 2644 176 -1539 892 2766 124
709 124 -337 1949 1696 -95 -329 1614 1473 -1345 -1127 1681 556 -2468 -1990 778 955 -2665 -3232
726 -3232 915 1319 -1905 -2840 302 1852 -406 -1589 995 1377 56 -344 1230 2013 -99 -318 2253
743 2253 1799 -853 -176 1583 1608 -1513 -1638 1607 869 -2322 -2613 551 1016 -1997 -2732 347 760 -1925
761 -1925 -1756 692 1193 -1041 -1381 1683 1726 -493 -376 2112 2003 -291 -567 2519 2295 -1045 -851 1595
779 1595 1316 -1210 -1358 1574 585 -2146 -1681 565 241 -2226 -2271 585 765 -2115 -1912 1248 1382 -1105
797 -1105 -1388 1680 1989 -820 -166 1550 1806 -135 -102 1685 1477 -916 12 1823 876 -1219 -1101 1319
815 1319 564 -2911 -1722 1192 140 -2401 -2062 554 726 -1714 -1639 838 947 -1061 -881 1602 1661
832 1661 -667 -346 2105 1128 -575 483 1946 1020 -1440 -127 1805 599 -1570 -1153 973 566
848 566 -2023 -1732 1287 1 -2480 -1871 779 726 -1673 -1221 1242 651 -1257 -201 1146 1277 -282
865 -282 -162 2184 1175 -686 156 1993 904 -1124 -353 1915 483 -1895 -633 1010 178 -2181
881 -2181 -1771 946 365 -2162 -1726 752 651 -1500 -1351 1456 921 -836 176 1395 1013 -560 127
898 127 1879 1272 -625 163 1752 912 -959 -465 1754 384 -2163 -813 1172 -88 -2329 -1384 909
915 909 -84 -1842 -694 727 132 -1733 -661 1324 843 -1333 -390 1722 836 -416 232 1834 951
932 951 -929 497 1619 256 -745 -34 1297 -54 -1870 -519 1323 -316 -2090 -1414 795 182
948 182 -2192 -1022 952 450 -989 -798 896 859 -928 103 1413 579 114 358 1662 867 -579
965 -579 293 1680 155 -1400 -282 1443 598 -1766 -974 1258 -274 -2123 -1307 757 306 -1861 -1220
982 -1220 950 -8 -1499 -462 1266 801 -1433 24 2008 775 -848 457 1634 598 -567 231
998 231 1790 400 -1588 -65 1171 20 -1942 -565 1271 -838 -2235 -708 905 -475 -2047
1013 -2047 -940 1143 181 -1241 -406 1234 906 -506 234 1694 481 -759 784 1831 426 -757
1029 -757 491 1899 -263 -1627 210 1383 -643 -1911 -1021 1609 -52 -2478 -922 1267 -592
1044 -592 -1709 -425 1035 -177 -1397 510 1375 152 -745 356 1758 354 -1010 883 2022 93
1060 93 -1014 656 1643 -112 -1623 345 1124 -849 -1696 -371 1037 -677 -1943 -338 835 -773
1076 -773 -1606 -65 1399 -158 -1690 78 1781 101 -609 757 1346 376 -427 967 1673 -455 -1058
1093 -1058 709 1323 -219 -1474 480 1442 -879 -1515 104 775 -841 -1578 -352 733 -552 -1066
1109 -1066 -264 740 -20 -971 320 1303 -137 -770 1178 1115 -280 -549 1231 1655 -376 -646 815
1126 815 963 -218 -1223 220 706 -964 -1864 38 936 -721 -1904 -251 831 -527 -1483 217
1142 217 443 -337 -468 250 1392 -75 -666 1008 1516 84 -277 895 1410 -512 -753 1098 917 -916
1160 -916 -1167 285 931 -733 -1678 -14 517 -884 -1496 -428 875 -730 -1373 399 961 -434 -617
1177 -617 507 1075 -90 -281 1199 1039 -126 -406 924 1364 -161 -1059 803 1189 -989 -1356 342
1194 342 920 -768 -1716 187 497 -914 -1346 189 634 -735 -1535 100 1112 -580 -508 667 1063
1211 1063 49 -296 1163 1144 -572 -209 1218 1050 -314 -611 427 822 -918 -1095 433 607 -971
1228 -971 -1453 166 887 -901 -1341 62 265 -640 -775 761 717 -448 -580 756 943 -89 -283 1229
1246 1229 1117 -675 -516 1418 799 -729 -619 594 783 -1061 -1346 524 223 -1212 -1474 138 646
1263 646 -1158 -1378 649 330 -923 -387 665 910 -616 -198 1102 892 -353 -15 872 1148 -266
1280 -266 -369 1287 587 -979 -250 518 221 -811 -1006 791 253 -852 -1001 -145 257 -828 -1362 597
1298 597 673 -794 -714 454 732 -219 -329 886 665 -294 108 1138 883 -351 -281 1226 619 -1113 -589
1317 -589 833 716 -1113 -1118 530 239 -1323 -1192 214 60 -826 -842 570 472 -720 -504 979 592 -272
1336 -272 -353 1201 564 -479 254 1351 865 -462 -39 1360 736 -794 -214 790 354 -912 -789 585
1354 585 356 -1447 -876 351 -72 -671 -472 683 492 -836 -224 677 363 -507 96 1117 844 -567
1372 -567 295 1249 758 -305 -70 925 735 -705 -295 1006 120 -1261 -571 595 341 -1335 -1048 359
1390 359 -22 -978 -656 285 450 -742 -273 1091 255 -497 213 893 516 -534 264 1387 566 -753
1408 -753 -65 984 443 -861 -432 915 -84 -1168 -443 129 71 -1304 -509 558 64 -1090 -629 349
1426 349 36 -521 -193 903 188 -580 100 1122 397 -337 52 1202 234 -686 171 887 37 -1182 -321
1445 -321 815 32 -1018 -662 504 -40 -1162 -842 328 -187 -747 -393 778 19 -473 -104 789 186
1463 186 -648 404 882 176 -372 367 1070 390 -880 -7 1056 141 -933 -355 757 68 -1337 -756
1481 -756 494 -203 -831 -323 426 102 -768 -236 797 -118 -549 47 929 376 -371 419 1025 274 -499
1500 -499 303 771 281 -992 251 855 -82 -582 -178 488 -150 -1380 -299 888 -395 -907 -324 49
1518 49 358 -467 -298 717 48 -392 133 908 269 -569 215 1311 58 -417 405 787 65 -496 95
1537 95 1088 -54 -965 -255 706 -344 -1272 -276 606 -516 -988 -97 442 -412 -455 70 520 -49 -570 369
1557 369 790 125 -392 110 1165 134 -592 604 1294 -295 -601 266 959 -349 -837 182 408 -273
1575 -273 -938 -494 424 -250 -1183 -39 577 -676 -751 65 709 -188 -591 438 669 -103 -51 481 755 92
1595 92 -475 649 1017 -96 -718 282 993 -164 -856 226 450 -280 -744 -132 192 -579 -688 -219 580
1614 580 -145 -261 217 338 142 -657 460 682 -375 -132 792 765 1 -528 433 807 -53 -561 172 660
1634 660 -99 -939 -160 846 -373 -1061 -14 259 -403 -791 -319 14 -518 -445 363 406 -91 -325 450 938
1654 938 -140 -602 771 752 115 -407 380 865 -368 -551 323 251 -244 -802 7 631 -376 -639 80
1673 80 310 -419 -849 164 577 -451 -378 458 377 -249 -241 567 624 8 -61 788 997 -329 -385 430 839 -288
1695 -288 -769 397 632 -233 -557 90 187 -661 -581 68 253 -477 -432 307 462 -281 -476 321 584 -309 -273
1716 -273 420 646 -147 -46 832 688 -422 95 473 523 -495 -734 113 457 -342 -619 245 -23 -262 -819
1736 -819 206 97 -532 -650 29 345 -396 -519 463 391 -191 8 575 576 -271 -343 885 793 -88 -401 659
1757 659 461 -383 -741 292 431 -401 -521 156 48 -428 -598 78 266 -715 -471 452 274 -367 -12 597
1777 597 483 -124 -160 858 541 -370 -45 526 510 -183 -470 468 91 -380 -589 298 108 -622 -553 137 179
1798 179 -678 -649 -23 116 -584 -398 338 421 -248 -307 477 472 -459 -160 771 195 -362 57 504 407 -439 -348
1820 -348 642 460 -267 -201 230 251 -475 -713 184 -10 -624 -285 226 83 -329 -228 430 -23 -438 -63 686
1841 686 642 -317 -1 689 494 -422 -251 640 613 -499 -316 634 355 -641 -244 93 112 -384 -335 341 100
1862 100 -566 -163 148 -279 -403 -236 248 192 -409 32 603 61 -47 155 622 269 -396 -78 592 229
1882 229 -394 8 610 125 -514 -159 435 -94 -280 -67 239 81 -659 -352 173 115 -528 -155 372 -146
1902 -146 -608 -126 878 328 -516 -51 731 352 -330 20 979 349 -186 -113 400 143 -468 87 516 177
1922 177 -583 -251 30 -58 -567 -189 407 -127 -479 20 277 270 -260 68 730 223 -293 147 559 130 -451
1943 -451 270 806 161 -451 -38 341 -41 -424 -150 275 10 -666 -304 -35 113 -583 -184 302 -163 -322
1963 -322 -83 399 91 -345 -41 650 148 -360 336 814 267 -181 122 633 104 -288 -99 509 -15 -366
1983 -366 -219 304 -183 -470 25 284 20 -515 -309 517 -10 -729 72 508 -95 -240 163 515 271 -424
2003 -424 359 492 454 -418 150 533 186 -331 -110 358 84 -545 -64 48 -72 -438 -96 56 128 -319 -375
2024 -375 195 -104 -211 102 259 95 -91 -5 452 222 -308 333 484 -59 -476 -15 188 -77 -179 -21
2044 -21 265 -267 -483 312 -126 -99 -482 -162 -74 -185 -179 229 132 -182 -406 -140 666 -169 -347 259 459 252
2066 252 -212 187 522 121 -278 275 593 -121 -298 -52 636 -148 -257 -274 -9 -260 -547 -104 185 -147
2086 -147 -397 16 183 -145 -446 206 350 -96 -263 261 766 92 -59 111 542 -3 -341 151 433 -110
2106 -110 -455 31 340 -159 -133 126 255 -355 -338 24 109 61 -678 6 134 -315 -242 42 610 -189 -384 374
2128 374 599 -148 -229 515 616 151 -214 206 457 1 -232 109 382 -331 -488 223 284 -390 -625 235 212
2149 212 -388 -49 55 209 54 -168 129 558 -369 -165 442 395 -310 -31 188 313 -134 -170 376 479 -267
2170 -267 -311 -17 31 -237 -422 -132 278 -487 -271 246 79 -203 -331 63 127 -270 -239 378 278 93 -153
2191 -153 496 482 -187 -204 289 325 -100 -248 203 426 -299 38 237 124 -644 -166 -54 84 -411 -379 185
2212 185 -36 -156 -464 173 429 -314 -222 289 77 -187 -123 385 427 -113 -152 550 393 -129 -141 428 -4 -83
2234 -83 -411 264 200 -295 -380 230 446 -785 -254 15 -119 -436 -237 212 289 -466 -357 279 176 -203 -45
2255 -45 529 402 -82 -244 536 364 -142 -70 140 75 -454 -179 203 44 -431 -84 111 73 -341 -490 264
2276 264 119 -357 -128 96 154 -314 -381 428 131 -77 1 412 308 -266 51 442 552 -106 -250 161 315
2297 315 -204 -260 264 220 -421 -135 -20 -105 -384 -227 192 227 -518 -160 306 95 -75 128 438 143 -156
2318 -156 188 513 -69 -162 -488 601 185 -246 71 449 269 -197 -104 -102 190 -513 -178 178 40 -283 -186
2339 -186 298 43 -371 -31 395 -88 -257 6 475 115 -261 -275 338 162 -81 64 228 298 -223 15 394
2360 394 -47 -478 -250 241 -24 -301 -320 346 -278 -305 -260 51 -192 -241 12 431 33 -342 150 362 395 -2
2382 -2 21 173 389 -274 166 549 10 -255 -67 320 149 -82 -152 45 50 -245 -55 180 -267 -442 -25 302
2404 302 -7 -377 -134 573 70 -449 253 334 95 -35 -186 613 208 -229 79 347 98 -7 -167 369
2424 369 81 -407 -77 101 -148 -586 115 86 -277 -392 44 148 -142 -177 12 -29 -53 -435 143 635 357
2445 357 -181 -141 461 -20 -320 10 376 229 -318 -33 153 -91 -193 -103 149 -9 -273 -437 153 -7 -235
2466 -235 -88 431 -16 -243 113 375 168 -223 203 465 102 -335 306 424 49 60 186 444 190 -148
2486 -148 -3 -176 42 -232 -301 352 -134 -661 93 320 -129 -479 -52 236 -116 -602 290 435 141 102 297
2507 297 600 150 -180 109 520 123 -60 91 229 -131 -287 214 415 -200 -330 131 50 -291 -303 -119 164
2528 164 -231 -72 263 12 -76 -402 168 478 -159 -347 255 403 4 -287 181 308 7 -233 33 162
2548 162 -6 -285 225 65 -342 -268 -80 -27 -55 -636 301 114 -232 -237 190 196 -52 -326 91 444 -57 -144 91
2571 91 404 210 4 130 173 -249 -118 125 194 -123 -62 -156 100 41 -178 -137 106 -374 -483 -134 98 -305
2593 -305 -247 251 314 -75 -126 212 286 -292 148 82 129 291 37 166 474 83 37 318 217 -111 -108 75 398
2616 398 -153 -199 78 19 -305 -476 89 -108 -298 -354 205 131 154 -100 -3 353 -185 -12 267 252 -112 -57 86
2639 86 123 -103 -258 32 264 -31 -441 -35 44 -372 -101 20 159 -445 -277 121 -149 -186 -287 310 221 -319
2661 -319 -163 106 386 -180 -269 130 340 29 27 167 239 -20 -34 358 353 -317 58 305 -284 -328 -278 292 98
2684 98 -195 -278 245 108 -122 71 269 175 -596 -205 180 15 -180 58 221 336 -95 -11 373 203 -109
2705 -109 -88 140 202 -509 -308 409 -47 -269 -111 209 175 -387 -344 250 225 -372 -82 295 152 -149 -54 191
2727 191 -54 -139 -50 247 370 56 273 225 -73 -111 -120 90 272 -158 257 268 43 -131 -24 217 162 -93 -201
2750 -201 199 387 -470 -105 247 135 -54 -135 108 59 -279 6 283 184 -36 -284 229 78 -58 81 6
2771 6 454 -76 32 274 -19 -210 -324 0 -64 -384 -38 270 67 -194 -23 400 216 -394 -123 402 195
2792 195 -63 62 205 99 -151 167 251 46 42 -114 -73 -159 -236 -101 -202 -5 -522 -142 65 -21 -402 -363 209
2815 209 -139 -199 35 242 128 -310 -41 333 363 -88 20 547 -53 -24 83 271 123 -374 272 76 -107
2836 -107 20 196 53 -237 -354 -151 3 -222 -178 -47 536 66 -456 20 444 151 18 -48 347 459 -86
2857 -86 178 226 152 -87 -300 131 48 -328 24 550 171 -328 -99 -105 -203 -174 -116 177 -132 -89 -27 -155 47 -29
2881 -29 15 277 72 -112 -162 182 58 -239 245 198 189 91 -119 -119 -33 -320 65 272 77 -477 42 239 -293
2904 -293 -355 -311 255 38 -217 55 -19 13 -219 -182 344 16 -298 333 403 275 301 167 319 43 -208 64
2926 64 -16 25 -109 -280 231 -268 -407 12 272 -26 -408 -45 69 -59 -169 175 185 52 -115 297 142
2947 142 -322 -7 235 313 301 -92 272 329 169 -157 386 341 57 -285 147 89 -13 -411 -6 130 -178 -632
2969 -632 126 256 -185 -110 90 142 -13 -153 -39 350 41 -266 184 225 -211 -18 363 238 -282 -29 198
2990 198 55 -137 -56 293 173 -79 -28 8 116 -134 -171 236 83 -179 -207 67 170 -213 -331 390 466 -113
3012 -113 -350 148 199 70 31 -189 193 -82 -28 3 30 -135 -7 113 63 -261 -122 262 244 -204 -141 0 85
3035 85 -194 -268 -240 294 33 42 3 203 337 -279 359 475 45 -138 238 -57 -166 -134 -41 162 -332 -107 167
3058 167 342 -203 -85 92 114 -180 -75 90 8 -48 -232 204 194 -17 -347 134 266 -92 -178 206 334 55
3080 55 -6 252 391 -159 -48 293 93 52 -16 104 -16 -83 -317 -28 149 -301 -160 213 -83 -28 -108 22
3102 22 174 -3 -2 103 295 88 -93 86 83 12 -309 267 117 -181 49 213 158 -264 -45 12 -12 -325 -226
3125 -226 303 0 -313 42 -9 207 -73 -71 108 177 -195 -16 -49 136 -39 -92 419 164 -359 -194 -34 368
3147 368 -189 -337 405 24 -327 -237 174 -114 -248 0 24 -149 -236 -158 -18 -79 -15 -35 112 239 -225 -59
3169 -59 -55 173 137 26 94 179 -321 20 38 196 -64 -267 517 237 -124 38 165 -28 -48 -82 -60 -113 -154 -82
3193 -82 -73 -62 -366 -348 125 171 -159 202 325 174 116 174 190 164 125 -48 238 166 -148 -106 80 -8 -274 -219 241
3218 241 -281 -177 -164 20 -125 -456 -183 39 -14 -335 -150 55 120 -194 -132 37 95 -275 -165 109 82 -87
3240 -87 -111 262 16 -147 58 90 186 -176 -83 -131 88 -81 -170 110 44 -128 33 91 34 -116 17 -18 132 -135
3264 -135 61 513 166 24 -106 250 126 -43 78 328 -56 148 5 36 -39 77 -12 282 48 -180 -220
3285 -220 61 -99 -249 131 279 -231 -325 -197 271 85 -36 61 363 159 -256 179 76 6 -30 215 262 -54
3307 -54 -193 52 135 67 -219 78 34 -223 -358 -223 276 -2 -213 -159 215 218 17 -49 375 144 -245 -5 369
3330 369 53 -34 227 443 -122 138 -45 138 356 -149 -116 59 52 -221 8 -106 126 -284 32 175 172 -278
3352 -278 -27 295 -67 -440 17 152 -73 -12 -103 431 52 -287 412 147 15 -344 121 94 -89 39 -305
3373 -305 125 -116 -20 96 310 -85 -197 20 -5 99 -240 209 152 -66 -259 -64 76 -95 -92 64 234 133
3395 133 -341 59 204 45 -251 76 326 -142 -111 0 22 -154 -133 -91 -121 -44 -201 20 192 -147 -130 171
3417 171 302 142 -324 120 322 -226 42 242 154 68 -90 329 356 -21 -39 -51 -6 -199 -190 -132 107 -552 -119
3440 -119 -196 184 -335 -138 -30 149 -57 -30 85 149 -91 -95 29 262 -92 14 -181 239 123 74 335 347
3462 347 28 20 3 58 -120 -47 7 119 103 -235 30 -24 76 -119 -99 279 19 -189 -277 229 -300 -117 175
3485 175 314 -108 -10 34 255 131 -87 92 67 8 -264 44 207 -94 -290 90 88 -249 -6 21 66 -299 -11
3508 -11 68 156 -39 -66 178 357 14 -234 -13 423 278 -169 186 166 187 -168 -28 144 -124 48 320 134
3530 134 -146 -181 151 -34 -211 -324 161 -119 -131 -365 172 122 -318 -41 124 148 -132 -139 -11 151 -249 -89
3552 -89 265 327 70 -266 386 191 -156 -302 126 195 -112 -53 -45 158 -236 -149 265 -96 37 -307 -41 245
3574 245 -44 -213 177 204 -97 101 188 197 4 -59 320 180 59 231 98 181 -4 -159 287 185 -374 -40
3596 -40 -64 166 45 -152 196 -212 -113 -73 270 291 -38 9 -35 -149 -69 -171 -5 81 -105 122 37 243 145 -71
3620 -71 231 232 -107 -41 65 169 -246 -221 139 -29 -246 -33 64 96 -254 -60 -17 124 -443 -38 103 181 79
3643 79 106 9 -22 -14 102 352 167 21 144 247 19 -60 -95 179 -165 -407 113 69 11 -149 123 59 -211 -403
3667 -403 -126 100 -108 -303 -158 258 117 -76 -78 45 301 40 -41 459 58 -145 149 44 123 -45 -106 -175
3689 -175 -121 -76 -309 -67 148 -256 -1 56 -284 -1 -19 91 -173 -299 -31 227 -56 -14 -100 -126 -14 -138
3711 -138 355 57 189 7 -142 143 94 -178 -332 84 -111 -18 -61 5 -42 71 138 286 -191 -286 274 176 276
3734 276 -139 23 6 -55 -216 -242 194 87 -75 -55 14 -17 132 -137 -135 174 -50 20 150 -172 -141 73 -96
3757 -96 33 -314 -53 214 -63 -220 63 276 105 -454 -123 125 -28 -97 296 155 192 182 94 220 113 -262
3779 -262 146 63 -270 27 200 156 -177 29 -282 128 -166 -198 -26 264 -267 -323 -53 137 -120 -195 18 -10
3801 -10 12 -303 7 90 -45 98 -56 56 -82 46 218 159 83 -284 -188 -94 -15 -144 60 20 67 -90 99
3824 99 -25 -72 -447 -46 234 -65 -8 -48 0 204 -93 -41 225 64 -168 98 111 -18 -96 198 120 -41 -140
3847 -140 411 338 -315 -134 -18 -135 200 -338 154 122 -126 -93 116 -140 -188 -133 34 63 -171 173 217 137 -132
3870 -132 -191 74 202 124 -64 187 239 50 -324 -100 18 60 -193 -196 149 -124 -9 34 26 129 -442 107 302
3893 302 48 -161 90 123 -71 175 118 87 3 -118 243 438 -54 12 -30 131 24 -76 -93 -87 -383 -5 -128
3916 -128 -110 -181 -170 111 228 -46 -511 15 20 -56 247 227 244 -216 -53 146 383 -186 -323 308 -113 -49 -125
3939 -125 317 -161 -289 -375 -83 259 -110 -129 69 -18 -160 -42 -112 35 79 -127 386 57 9 -53 228 396
3961 396 57 -29 201 79 -91 -101 -174 286 -396 -217 -94 -179 -103 -190 -181 198 -261 -100 25 112 -216 -259 -43
3984 -43 -99 158 -223 97 283 56 22 34 133 -25 -73 -40 16 -108 -29 -4 -9 -256 9 238 5 -17 -4 245 342
4009 342 -150 -179 -132 137 -260 -164 129 -8 -42 128 72 -333 29 -66 106 208 -134 31 51 177 -71 -269
4031 -269 285 -44 -181 -176 219 -111 -84 -196 -1 122 -4 -20 192 -23 -119 -79 -74 -2 -163 -148 192 73 133 214
4055 214 105 147 -205 284 289 -131 192 75 205 0 -138 16 261 279 -111 -24 32 49 -124 -153 152 43 -277
4078 -277 203 -14 30 -289 -65 133 190 -68 87 146 205 349 -166 366 -22 -254 -19 30 9 -45 -194 154
4100 154 -139 -37 8 352 133 -80 -173 -74 286 -11 46 -6 -190 -12 -54 69 130 -18 137 88 151 -70 103
4123 103 88 28 -90 91 57 226 -33 177 145 -119 -303 -185 -14 176 -144 -233 -160 -2 -115 -265 -4 -39
4145 -39 16 45 194 188 -69 -96 414 45 -139 75 38 213 -63 49 28 42 10 154 223 -151 -284 27 -95 -33
4169 -33 127 -157 -95 -117 -184 29 -28 92 -284 -27 57 -32 -145 16 14 199 -20 -152 195 -75 -236 -123 269
4192 269 103 -105 124 -46 -17 -283 18 33 200 -18 70 180 -79 -334 -17 -149 -51 -70 -14 -72 12 -216 -120
4215 -120 59 -130 -21 128 -11 -29 -168 -71 47 41 -257 10 117 -85 -195 -281 111 -11 -152 122 37 -102
4237 -102 -252 -62 56 25 -205 -81 180 62 41 -36 134 114 -133 19 299 -90 114 29 171 24 -103 28
4259 28 -135 -22 -35 45 185 -244 -60 81 128 -93 -94 -3 157 -21 -46 50 201 -54 -156 129 236 129 -153
4282 -153 107 131 129 -24 106 60 109 -155 16 2 -455 49 25 299 -104 -143 -233 -26 -5 -304 51 -135 160
4305 160 10 -23 264 243 -158 -107 8 -18 -55 12 351 -117 -42 4 -34 -163 13 -43 -84 -56 -229 -27 -12 -167
4329 -167 -136 15 66 -214 -270 -39 1 -164 3 -280 250 -60 18 -18 -172 61 -258 -98 -105 221 -49 220 251
4352 251 -207 -152 -230 84 -82 -346 -14 174 -154 -256 -96 82 -37 -54 254 -4 -101 -123 -294 -26 -72 -6
4374 -6 140 240 -145 41 -27 243 -12 -271 241 -51 -5 -179 -89 117 -2 -346 -46 4 -119 87 11 206
4396 206 -102 -54 -9 -47 -269 66 273 -8 -86 -104 81 20 -62 -49 125 -152 -250 -65 -68 92 -139 -169 188 45
4420 45 -327 -62 13 -126 -42 84 147 -68 -194 -36 1 291 19 -223 20 -3 28 31 80 32 -143 44 110 188
4444 188 -93 -62 69 -33 -187 -235 -24 -7 -69 -198 -127 118 -39 -55 167 41 65 -211 49 112 97 -49 244
4467 244 122 -194 -100 -143 6 17 8 -39 86 -233 -209 278 88 80 -179 -28 126 -40 -159 62 -158 -134 -154 184
4491 184 -60 -66 61 152 84 -188 44 118 95 21 -248 -57 196 -247 14 94 -166 -234 -43 -34 80 60 62 -20 -182
4516 -182 -79 -412 1 215 -145 -184 248 -78 -140 -62 116 153 -245 -75 159 283 -43 232 -159 99 153 122
4538 122 72 -230 16 73 32 -20 -188 49 33 45 -202 4 -30 -257 -119 16 -49 78 131 49 105 149 -102 -1
4562 -1 144 -118 208 33 243 73 81 -22 269 114 -150 -93 72 131 -197 5 1 32 -211 -173 181 124 -54 -86
4586 -86 -251 -135 -80 -102 169 142 -116 152 109 -36 -46 100 -57 -6 9 -107 -166 136 -219 26 -78 -125 0
4609 0 -106 160 40 -232 -155 210 -129 -380 47 16 -22 -100 -273 330 12 -133 153 86 141 -194 118 -115 -67
4632 -67 81 38 233 94 65 0 115 -180 -183 -427 -114 -60 -47 -94 197 -201 -84 -244 72 13 -310 62 14 148
4656 148 -110 -125 -60 50 2 106 21 -284 -91 190 -26 -32 -224 72 -9 80 -178 -84 -8 99 -50 -24 73 -127
4680 -127 -109 133 93 106 -98 1 51 201 -182 41 181 181 -52 126 155 76 -66 -180 142 167 -285 -36 5 -246
4704 -246 -311 -235 164 -151 -263 144 108 20 139 -214 307 -3 -54 -89 66 2 -185 223 116 15 -12 129 159
4727 159 14 -426 154 107 -129 66 49 -64 68 -172 -22 -19 -218 -276 -8 -23 204 -139 -19 42 55 -64 133
4750 133 392 78 138 -137 48 194 -83 137 207 -57 -43 65 106 -98 33 45 143 -291 -381 -166 53 71 -270
4773 -270 -224 -19 -222 -143 59 165 -65 -152 -125 175 66 -60 20 261 71 -1 14 368 -131 -192 75 82 26 48
4797 48 133 -57 62 -26 -76 45 -224 -240 -52 342 140 -197 -126 -26 -43 -166 149 131 -125 -62 -86 19 -367
4820 -367 -46 -79 -117 -152 -54 100 -6 -25 -291 -97 79 -92 -35 16 82 -80 -5 187 -59 40 -100 85 113 93
4844 93 -82 37 -115 -292 -282 23 16 -71 9 -48 -44 36 -44 -26 -150 -324 77 -2 -25 -97 -106 27 -128 -104 -211 133
4870 133 -38 274 -185 131 6 -3 3 22 190 -113 52 -60 308 -42 49 48 -80 15 -77 0 274 -277 -154 165
4894 165 -30 -34 -95 4 -165 -55 50 37 -117 47 65 77 65 -313 -114 -12 -334 -120 -138 -145 121 -75 -192 100
4918 100 90 -1 27 199 5 -164 66 287 -89 -126 -144 -171 -7 -144 -169 -64 99 -41 11 -106 256 0 -118
4941 -118 276 47 -80 -13 123 6 -75 -70 105 -23 41 -248 153 -149 -92 -342 17 -60 103 -270 -65 -176
4963 -176 -75 -124 -17 29 -246 250 130 -238 -86 47 30 73 22 6 268 189 -45 20 265 65 -32 -89 30
4986 30 -26 -253 16 142 174 -113 -173 -205 -125 -390 -4 214 -99 -129 -289 57 343 -182 138 234 -46 -88 157
5009 157 94 320 7 31 330 -147 -216 73 144 128 -62 -181 131 110 -268 -270 -88 -24 65 -32 197 -48 -10 249
5033 249 110 -22 -209 47 -120 109 -60 65 -3 -217 22 -20 64 -125 -15 75 278 57 -221 6 -54 5
5055 5 -160 58 60 -96 11 71 -16 -112 -221 84 157 -53 23 194 80 -48 -43 16 -282 45 -45 4 -126 52 6
5080 6 -59 149 25 -434 74 34 155 21 -28 -15 -23 40 -20 -91 -117 -204 -139 -159 160 4 57 -7 -92 -59 -110 -3 -364
5107 -364 -73 107 269 -122 -34 170 44 -251 39 -210 -1 -14 -90 382 152 223 -181 -138 67 -19 -84 103
5129 103 205 -103 154 2 188 -157 -88 49 145 -8 -168 209 36 88 -264 -136 36 -126 104 -250 44
5150 44 207 -214 192 107 -122 -73 27 178 44 -140 -66 187 -80 69 98 0 51 123 22 173 91 -88 230
5173 230 13 42 -55 72 -79 -229 -288 -186 -152 -104 28 -85 114 -76 14 95 -41 -141 -205 153 100 -182 -40
5196 -40 13 330 -94 -164 -18 169 36 7 186 127 -104 39 127 235 -253 -51 -84 184 -158 -296 14 85 -4
5219 -4 -109 6 351 156 -114 125 33 75 -169 127 65 6 191 4 4 -132 80 -19 -209 -108 8 48 -89
5242 -89 83 62 183 220 66 -229 32 105 -249 -27 -24 318 4 -79 -46 -125 55 -99 19 247 72 -86 -93 149
5266 149 -160 -247 41 162 56 29 54 129 -137 -29 293 280 9 39 -204 -116 -129 -162 -46 168 -36 -44 -95 -45
5290 -45 65 96 -28 254 -66 -240 57 70 18 -165 6 -3 216 -63 264 63 -297 -181 -88 -143 -106 -200 220
5313 220 148 -49 -22 -179 197 19 149 37 175 -42 -79 38 -101 -18 85 62 148 -128 -3 257 -59 -215
5335 -215 -222 135 151 -86 -142 27 -252 -130 -185 30 247 59 72 67 -42 80 -48 8 191 93 18 127 -90 -131
5359 -131 -152 91 -142 195 -41 -71 44 -237 -84 18 -262 -42 -20 -215 71 16 -142 263 -171 -80 -32 35
5381 35 311 -24 -9 241 -18 56 131 7 72 -166 245 27 50 -32 -127 105 -92 -71 48 31 93 -221 -201 138
5405 138 176 113 5 27 -22 -248 -156 170 -68 140 -96 202 97 70 21 141 10 37 -95 9 -60 -112 -114 117
5429 117 -142 -26 -16 81 -225 -262 28 79 96 -117 39 -92 -35 -210 -107 14 183 164 -63 162 115 -306 53
5452 53 82 158 -217 -145 6 -46 -144 14 191 -3 54 332 -28 -133 -272 69 239 100 -267 -70 52 -23 -87
5475 -87 -33 86 238 -123 -114 227 148 -153 -180 33 296 -64 -56 216 -35 -288 -151 229 -147 26 -116 105 -95
5498 -95 -228 -120 -6 -23 17 -150 -151 88 -325 -177 188 -109 -192 -16 257 -151 -95 -5 8 421 16 191 -191
5521 -191 -153 -32 -34 205 88 -230 136 -320 -4 -126 -39 71 218 -10 -127 93 -52 -162 95 199 -97
5542 -97 66 -25 147 -144 -323 -198 32 -46 -32 26 87 174 66 -50 251 -47 -453 239 -2 -19 -127 -40 35
5565 35 -191 -184 -342 341 -255 -165 329 232 8 -93 65 42 113 32 -23 187 -27 -81 55 34 -52 -113 60 -19 -26
5590 -26 -367 46 299 -209 -154 235 -85 -65 -51 -27 183 -212 -10 105 227 -38 -42 32 105 -7 -88 168 -27
5613 -27 -56 -49 277 -169 29 -217 144 5 41 -118 -92 19 29 -432 -233 112 -317 -262 -249 173 26 -2 45 209
5637 209 -106 -259 -55 62 152 -105 156 158 -175 -170 -39 146 -133 -259 -26 321 -194 -330 106 133 -190 -116
5659 -116 111 116 -58 -42 117 120 7 -109 231 354 -9 -30 -156 -98 -9 10 116 -83 -81 -212 164 -122 -205 -121
5683 -121 18 168 169 -149 -39 -115 244 -254 241 111 -23 144 29 85 -167 -136 -96 220 39 -106 80 366
5705 366 83 219 -12 193 39 -4 -46 95 -83 -190 -7 88 -135 -485 -10 56 -281 -127 253 42 134 -204
5727 -204 137 99 -22 41 27 8 38 -110 -32 -74 8 32 114 168 210 -37 163 197 -127 47 -39 -140 -130 69 29
5752 29 -23 -29 -198 105 -41 -118 -100 -127 18 -380 -21 176 232 -216 141 57 100 -81 11 80 145 -40 -116 -66 264
5777 264 -481 -141 -11 139 34 -119 143 156 7 -216 75 143 -80 -248 220 232 85 -116 -165 147 -41
5798 -41 -160 278 -160 46 199 189 -212 26 25 -28 69 -125 -107 107 12 -121 48 191 14 -283 2 -1 59 235
5822 235 84 28 -157 62 55 -56 206 0 66 68 -60 -212 -12 12 89 -257 28 20 -156 -322 72 161 245 -123
5846 -123 -241 124 -85 8 -11 105 -73 -85 20 240 208 -146 137 71 73 -213 -108 44 140 -67 -197 11 129
5869 129 -126 -53 -123 2 -163 1 -214 -17 -152 -298 -179 -140 -85 -121 181 8 -167 -26 176 -129 -128 -151 171
5892 171 59 -48 211 57 -30 -114 64 69 244 60 -150 190 -77 -147 -91 41 148 -230 59 -144 -111 -201 -123
5915 -123 -78 3 -100 100 173 108 -148 -103 379 17 -268 103 279 -129 69 -138 -94 110 -134 25 278 -21
5937 -21 -62 21 189 266 -97 160 226 104 235 -72 -159 27 -91 -137 272 184 133 -93 120 14 -140 254 354
5960 354 -279 -248 17 53 14 -70 248 -81 120 36 -20 27 -23 -47 -283 242 -99 -153 -63 119 183 -15 -47 128
5984 128 -5 -115 -15 174 40 -63 50 26 -3 -73 226 67 -118 23 -14 79 113 -149 147 209 143 -125 223
6007 223 9 217 -154 133 86 38 -57 -26 251 -45 -228 349 139 -17 10 73 162 -246 38 262 16 150
6029 150 -231 142 321 -85 -3 -31 153 -67 -187 78 -111 -57 158 170 114 32 47 93 -31 -128 97 -150 -63
6052 -63 -97 -96 60 111 -104 -175 78 -400 -77 -479 -110 261 106 -428 52 -32 -136 -142 63 143 -37 -146 -6
6075 -6 83 252 34 3 232 -229 -140 110 -199 13 -108 -36 243 -89 -52 53 -20 -116 -18 168 -281 73 -262
6098 -262 182 -54 120 -55 -81 109 -47 -210 -93 133 103 -64 44 19 100 -118 -9 156 -22 142 -42
6119 -42 176 125 -304 1 -10 -32 123 113 -22 -99 -113 -108 65 107 -67 -30 -115 -24 -55 -79 36 -126 -108 151 74 -130
6145 -130 -44 -15 25 -91 -5 307 105 -64 -73 320 -39 -104 -294 372 -36 -48 367 -180 -37 113 8 207 -6
6168 -6 -40 17 81 147 -172 -131 183 46 -118 -121 75 64 135 -258 -58 -18 -95 -29 117 140 -109 -64 97 127 -83 -180
6194 -180 -148 -76 -83 29 99 -129 -184 -116 -86 -67 164 187 -167 84 -234 -4 -18 79 56 54 11 -43 100 302 232 40
6220 40 -134 -90 -54 52 -185 73 19 -137 -222 -8 -109 -4 -17 -26 272 -41 86 -11 180 270 25 -9 -138 11
6244 11 -208 -87 48 -70 104 -123 10 -112 9 209 -91 -24 20 5 260 35 -262 -206 -12 55 -34 18 92
6267 92 58 65 289 -82 188 42 90 84 -135 62 22 -117 -250 -307 -82 -59 262 -267 -23 -38 -27 -146 -58 -2 -74
6292 -74 -228 132 -72 10 -138 -93 92 47 -114 32 -87 196 198 -116 24 -47 -228 -247 147 -204 -348 -2 134
6315 134 170 -355 58 -11 -256 44 -30 26 1 -12 -130 38 134 -281 -51 230 -100 23 -87 337 46 -91
6337 -91 83 59 200 56 70 -220 -50 47 33 -49 281 -381 -13 -83 -226 -251 85 -42 -122 -257 105 62 -248
6360 -248 -260 -12 82 119 -136 172 -10 -65 23 -72 190 -56 -36 -82 138 162 -13 -70 -4 173 -197 -171 95 -94
6384 -94 17 -41 89 -10 -48 -71 -87 60 -176 3 26 330 -53 -180 -30 64 156 -98 70 193 -131 -36 -32 -110
6408 -110 -61 -73 64 -46 25 -143 193 43 -59 -137 -64 -43 -15 -151 409 -117 -56 -100 414 208 -262 -2 64
6431 64 -78 -59 52 5 -180 -51 54 157 -114 -131 85 -59 -199 38 -100 19 -96 40 -134 -79 21 -45
6453 -45 115 -205 -114 120 62 -129 -121 60 158 68 14 -7 -62 -107 -99 162 106 33 -3 -31 -61 -29 138 135 -322 73 3
6480 3 105 12 96 -149 -24 64 191 171 67 -58 223 39 -128 -149 -35 -70 -167 64 87 54 -221 -160 -82 -73 -26
6505 -26 -63 132 127 -143 -133 92 -64 152 116 178 0 116 -60 112 -6 -134 85 73 -126 -128 235 121 -1
6528 -1 13 234 155 201 106 -52 -52 -52 6 122 89 -16 -45 72 -128 -95 33 -92 84 154 -136 96 64 79 363 135
6554 135 -63 -41 -54 188 39 -59 -164 114 -61 -39 -33 -114 -68 -362 23 215 -111 -108 -100 -52 151 184 111 -44 -44 -50
6580 -50 137 -9 117 49 -94 -9 80 135 -76 -166 211 109 -184 326 -57 -120 -44 2 -75 -11 24 -25 -39 -257 -108
6605 -108 -160 -76 87 -216 35 -188 190 -117 100 268 -72 -200 -161 -77 -83 -174 194 344 120 166 -176 145 -221
6628 -221 -229 -17 -121 220 -311 -110 195 -241 151 74 -117 -80 -54 -6 102 -397 -56 99 42 -33 -121 -45 -130 -15
6652 -15 190 247 160 -341 -231 192 -56 -61 112 -313 50 -69 85 -106 -308 -133 161 -182 -36 -168 -248 17
6674 17 33 -63 25 -67 328 143 -50 90 191 162 30 226 35 -40 -8 -92 -134 170 257 -89 25 44 37 -4 102
6699 102 -209 155 210 -63 -236 186 384 93 -99 37 -18 8 -56 24 167 -34 4 -8 17 6 -91 94 139 -1
6723 -1 -177 -44 146 -232 -174 15 11 9 -66 -299 -240 -13 -182 144 58 44 -86 -12 -23 87 -19 -99 -99 -34 -102 -84
6749 -84 130 78 53 -280 182 -100 136 -12 257 93 40 -144 -251 -51 -143 132 30 -271 -71 -87 -48 172
6771 172 -143 -158 -38 0 -141 -38 -75 -21 -8 58 73 33 80 161 63 17 -141 80 76 -102 -192 -121 -75 -142 -264 49
6797 49 146 -58 196 103 46 29 70 -219 -88 155 165 44 259 20 -151 109 57 51 92 -74 -387 -128 -180 -220
6821 -220 -111 -6 190 -209 -162 83 -68 -93 192 -139 -290 -97 199 -62 -99 257 -17 41 28 87 -39 -106
6843 -106 -114 -75 145 -107 -210 26 0 -73 -55 -215 -68 -238 -8 -148 -64 172 -323 -97 236 55 -22 70 -29
6866 -29 -44 -220 -39 93 -70 -173 -5 41 166 83 106 221 -36 -329 149 192 37 -36 33 -2 52 -73 8 -38
6890 -38 -58 -100 -22 200 47 -30 274 -22 -97 -25 86 164 -20 101 -65 162 -17 -68 -50 0 4 -15 -173 202 9
6915 9 -194 -142 -178 -45 47 -103 30 9 -53 121 110 307 146 -43 37 -30 -121 43 74 29 222 41 83 12 -66
6940 -66 -119 277 45 -139 17 -9 51 -27 -215 90 -48 -283 -66 -135 -73 -190 21 96 -49 -105 132 77 -68
6963 -68 -224 113 107 -123 57 -74 57 3 106 -62 122 6 -123 -126 278 105 -30 -235 -176 25 25 -38 -115 163
6987 163 -58 -67 200 284 -191 95 -148 167 66 68 76 -142 -18 -80 -113 147 -14 -152 106 22 -170 19 20 174
7011 174 -356 -136 11 -365 -6 -16 -136 4 -80 111 203 26 130 183 118 -1 -50 -130 116 -72 1 -66 211
7034 211 129 -125 77 194 26 -130 -111 -81 138 -191 -184 91 -60 21 -183 35 20 -13 -128 99 11 -113 120
7057 120 -165 57 44 -55 167 87 -227 126 29 28 -86 -54 -39 -81 -129 65 -207 -190 -98 -89 53 -31 -259 200 107
7082 107 -129 -194 123 -2 -50 -23 13 -66 91 179 266 -46 57 70 -13 207 -69 61 -93 247 60 246 8
7105 8 -18 54 0 -14 162 -173 -122 -22 222 -18 -171 92 225 -235 9 98 -105 -194 -146 -72 45 64 -131 37
7129 37 -34 61 26 -228 115 68 -215 44 44 78 190 -270 79 -216 4 -111 -11 -122 35 109 254 2 103
7152 103 18 159 -74 42 3 -5 218 102 260 143 69 -263 131 261 -166 24 -12 -18 -17 -131 245 -84 44
7175 44 -61 144 68 -220 2 -65 -11 -79 -60 87 -14 69 107 188 12 -144 -82 -122 -86 -1 -211 174 10 16 -317
7200 -317 18 29 -250 -28 482 94 -89 -103 87 222 -249 -160 69 -86 -73 89 174 3 -82 210 -11 141
7222 141 110 118 -123 31 156 113 49 73 200 56 108 79 -232 32 -147 80 -143 -247 -52 -135 -36 -86 -135 176
7246 176 89 160 115 125 82 -160 -147 188 100 -46 120 28 81 -101 16 24 124 231 -137 -143 -260 -202 173 -38 -199
7271 -199 -35 20 -39 -100 -156 -65 -115 -181 39 44 136 -130 147 213 42 -82 -76 146 -71 -101 112 -142 -102 -23 19 -59
7297 -59 50 97 -73 -89 116 -81 -11 313 -95 -51 102 55 71 -10 174 77 -93 -74 27 336 42 205 -156
7320 -156 144 -41 -29 -121 -64 39 179 -276 47 83 -137 18 40 227 -116 -48 35 208 -60 29 117 -52 -31
7343 -31 -27 -150 455 -171 -97 -1 127 -367 -197 300 60 -105 -48 241 97 45 -12 -5 -191 127 256 -283 -113
7366 -113 41 -177 -44 -76 -110 -101 149 170 124 -3 27 -1 -30 186 73 73 -53 -85 -58 -3 27 -77 54 -145 -217
7391 -217 35 -3 32 -15 -53 -112 -54 -82 154 -31 53 0 -187 -127 36 313 84 -26 -155 -151 -138 230 34 -21 -166
7416 -166 117 -171 -6 329 -120 -9 -137 -43 132 58 275 -6 73 -153 47 227 111 -17 59 80 130 130 -94
7439 -94 77 155 215 -53 -37 207 -24 -39 181 99 3 -238 -40 224 238 -291 26 113 22 -203 7 -81 57 -32
7463 -32 32 210 -9 -115 170 -54 14 323 212 54 7 186 33 49 12 -98 -18 349 -45 -264 24 -29 48
7486 48 -16 -21 -45 -97 29 -142 -45 -251 242 123 359 -139 17 414 111 -16 -19 160 75 -186 -61 135 -92
7509 -92 36 -104 -194 -66 60 -233 -48 75 17 -4 149 -70 -233 -72 -92 2 -246 -90 198 55 -143 34
7531 34 203 96 -91 -191 -87 -109 -32 -169 -73 155 -118 95 -84 -103 -343 -57 86 -208 109 -191 76 98
7553 98 181 -349 -71 -36 -225 54 -1 -205 -275 1 -80 60 -75 43 -12 -26 100 -40 184 -68 105 -97 17
7576 17 58 -166 19 137 153 343 103 -144 114 -84 48 -1 61 -199 -33 205 -99 61 145 2 -163 192
7598 192 -123 14 119 75 -32 -71 -109 10 -6 -100 121 -32 -163 -188 159 -90 -168 -110 68 -339 173 188 56
7621 56 83 -153 -43 26 -71 -55 144 -35 -53 -81 215 153 -48 7 -76 128 72 85 -192 34 -24 -231 -66 133
7645 133 -193 -28 -216 81 -42 71 88 57 18 -46 175 168 62 -171 17 177 -168 73 60 231 -36 -64 -59
7668 -59 80 142 101 -71 69 -6 -81 203 -17 -146 -127 88 68 -231 -144 30 299 -38 98 31 79 73 -186 -98
7692 -98 115 -99 121 -53 138 -14 -140 133 11 -144 221 -115 -21 -207 -77 -42 -3 -148 4 157 198 -79
7714 -79 -109 -25 143 -187 -54 182 154 -56 -91 -58 -54 7 -48 -38 218 30 90 110 -82 -268 14 -111 -247 -109
7738 -109 -188 111 -214 -155 -7 112 -149 -36 145 258 74 33 -35 -5 -70 -41 -52 94 136 45 -224 -130 29 -142
7762 -142 -114 108 145 56 -28 217 108 -30 -200 133 -89 -184 -22 -22 155 73 74 3 -251 27 -51 -47 204 -82 -35
7787 -35 348 191 74 206 57 -20 7 14 -15 -133 161 -277 57 125 56 2 74 39 235 -30 -89 -123 354 -88
7811 -88 13 109 169 23 -145 148 -219 -54 -46 -130 -17 -186 -86 88 -213 -94 256 190 -172 410 -82 66
7833 66 -201 -40 103 75 44 -86 97 36 233 -244 -25 96 62 -72 139 -18 -111 32 95 19 -57 45 -401
7856 -401 173 195 165 84 -20 27 79 56 -26 -97 -143 157 -92 -32 106 -164 -30 17 -303 193 -131 -131 -126 133 75
7881 75 -138 59 -57 -134 218 165 -74 -57 180 -35 136 79 -61 111 -46 -377 -130 -133 204 -322 -134 -194 -219
7904 -219 319 1 -43 22 -14 -396 -65 167 -138 -91 -169 16 341 189 258 74 -39 79 52 55 -274 -73 61
7927 61 150 -64 -110 26 112 -90 50 94 120 -94 33 -4 -7 -26 5 -69 261 84 -135 103 -146 -258 -15 170
7951 170 36 68 121 -58 -133 24 -345 -1 -37 -199 -111 -1 167 -108 -43 -50 -75 -123 87 214 77 76 22 -245
7975 -245 -27 -64 11 -95 129 -81 134 -91 206 82 -121 79 -144 -40 -222 260 -155 71 -126 70 59
7996 59 81 0 115 -68 -16 -16 247 -123 -292 -56 150 61 131 -186 74 58 58 79 37 166 -3 -84 42 90 49
8021 49 -46 -155 -80 -203 -80 -111 -161 105 -162 91 -198 -34 87 60 -165 53 -98 202 -119 -64 15 -214 -44
8044 -44 23 48 -152 45 95 -33 226 -76 -392 13 -18 124 -30 -33 26 22 -37 106 -58 -139 -150 -86 97 184 -74
8069 -74 296 -23 201 -86 -154 156 7 143 -110 39 83 61 -102 70 -49 -165 55 237 175 -211 47 -89
8091 -89 -78 160 -121 272 267 -54 181 -124 -133 -111 -138 153 108 -244 3 180 148 -205 -4 253 30 93 -63 93
8115 93 116 -68 32 -24 167 32 -84 120 -91 233 -68 140 16 36 -37 336 -116 129 -79 3 268 -116
8137 -116 -174 31 -222 -286 -59 240 -144 111 -304 210 -46 94 -133 -73 29 -198 -46 -27 73 -3 38 -248
8159 -248 112 146 -173 -35 -75 31 254 20 78 -267 78 193 67 -37 -181 152 18 -53 93 217 -37
8180 -37 -103 -98 128 34 -33 -75 155 304 -52 250 188
8191A88
##END NTUPLES=NMR FID
##END=
