##TITLE=1H_Pr C2Bzl
 200.13MHz,CDCl3,
 8 sc
 
 2.7.2025
##JCAMPDX= 6.0         $$ Bruker NMR JCAMP-DX V2.0
##DATA TYPE= NMR FID
##DATA CLASS= NTUPLES
##ORIGIN= UXNMR, Bruker Analytische Messtechnik GmbH
##OWNER= pz
$$ XWIN-NMR		Version 3.5
$$ Wed Jul  2 16:36:01 2025 Russian Standard Time (UT+4h)  she@DPX200
##.OBSERVE FREQUENCY= 200.1313
##.OBSERVE NUCLEUS= ^1H
##.DELAY= (6, 6)
##.ACQUISITION MODE= SIMULTANEOUS
##.ACQUISITION SCHEME= undefined
##.AVERAGES= 8
##.DIGITISER RES= 18
##SPECTROMETER/DATA SYSTEM= spect
##.PULSE SEQUENCE= zg30
##.SOLVENT NAME= CDCl3
##.SHIFT REFERENCE= (INTERNAL, CDCl3, 0, 14.3821)
##AUDIT TRAIL= $$ (NUMBER, WHEN, WHO, WHERE, WHAT)
$$ ##TITLE= Audit trail, XWIN-NMR		Version 3.5
$$ ##JCAMPDX= 5.01
$$ ##ORIGIN= Bruker BioSpin GmbH
$$ ##OWNER= she
$$ F:/spectra/data/she/nmr/H-C/1/audita.txt
$$ ##AUDIT TRAIL=  $$ (NUMBER, WHEN, WHO, WHERE, WHAT)
(   1,<2025-07-02 16:34:54.54 +0400>,<she>,<DPX200>,
      <created by zg, POWCHK disabled, PULCHK disabled
       configuration hash MD5:
       00 E9 B6 7A A2 85 ED C7 34 08 36 98 17 FE 4E 26
       data hash MD5: 16K
       3F 66 22 52 A6 D2 32 B5 26 FD D2 65 15 45 96 23>)
$$ ##END=
$$ 
$$ hash MD5
$$ 78 BC 4B 59 1D 76 2B C3 8C 4D EA E9 F7 1F FA 13
##$RELAX= 
##$RELAX= 
##$RELAX= 
##$RELAX= 
##$RELAX= 
##$RELAX= 
$$ Bruker specific parameters
$$ --------------------------
##$DU= <F:/spectra>
##$EXPNO= 1
##$NAME= <H-C>
##$PROCNO= 1
##$TYPE= <nmr>
##$USER= <she>
##$AMP= (0..31)
100 100 100 100 100 100 100 100 100 100 100 100 100 100 100 100 100 100 
100 100 100 100 100 100 100 100 100 100 100 100 100 100 
##$AQSEQ= 0
##$AQ_mod= 1
##$AUNM= <au_zg>
##$AUTOPOS= <>
##$BF1= 200.13
##$BF2= 200.13
##$BF3= 200.13
##$BF4= 200.13
##$BF5= 200.13
##$BF6= 200.13
##$BF7= 200.13
##$BF8= 200.13
##$BYTORDA= 1
##$CFDGTYP= 0
##$CFRGTYP= 5
##$CHEMSTR= <none>
##$CNST= (0..31)
1 1 145 1 1 1 1 1 1 1 1 1 1 1 1 1 1 1 1 1 1 1 1 1 1 1 1 1 1 1 1 1 
##$CPDPRG= <>
##$CPDPRG1= <>
##$CPDPRG2= <>
##$CPDPRG3= <>
##$CPDPRG4= <mlev>
##$CPDPRG5= <mlev>
##$CPDPRG6= <mlev>
##$CPDPRG7= <mlev>
##$CPDPRG8= <mlev>
##$CPDPRGB= <>
##$CPDPRGT= <>
##$D= (0..31)
0 0.7 0 0 0 0 0 0 0 0 0 0.03 0 0 0 0 0 0 0 0 0 0 0 0 0 0 0 0 0 0 0 0 
##$DATE= 1751459693
##$DBL= (0..7)
120 120 120 120 120 120 120 120 
##$DBP= (0..7)
150 150 150 150 150 150 150 150 
##$DBP07= 0
##$DBPNAM0= <>
##$DBPNAM1= <>
##$DBPNAM2= <>
##$DBPNAM3= <>
##$DBPNAM4= <>
##$DBPNAM5= <>
##$DBPNAM6= <>
##$DBPNAM7= <>
##$DBPOAL= (0..7)
0.5 0.5 0.5 0.5 0.5 0.5 0.5 0.5 
##$DBPOFFS= (0..7)
0 0 0 0 0 0 0 0 
##$DE= 6
##$DECBNUC= <off>
##$DECIM= 32
##$DECNUC= <off>
##$DECSTAT= 4
##$DIGMOD= 1
##$DIGTYP= 9
##$DL= (0..7)
0 120 120 120 120 120 120 120 
##$DP= (0..7)
150 150 150 150 150 150 150 150 
##$DP07= 0
##$DPNAME0= <>
##$DPNAME1= <>
##$DPNAME2= <>
##$DPNAME3= <>
##$DPNAME4= <>
##$DPNAME5= <>
##$DPNAME6= <>
##$DPNAME7= <>
##$DPOAL= (0..7)
0.5 0.5 0.5 0.5 0.5 0.5 0.5 0.5 
##$DPOFFS= (0..7)
0 0 0 0 0 0 0 0 
##$DQDMODE= 0
##$DR= 18
##$DS= 0
##$DSLIST= <SSSSSSSSSSSSSSS>
$$ [...]
##$SUBNAM0= <"">
##$SUBNAM1= <"">
##$SUBNAM2= <"">
##$SUBNAM3= <"">
##$SUBNAM4= <"">
##$SUBNAM5= <"">
##$SUBNAM6= <"">
##$SUBNAM7= <"">
##$SUBNAM8= <"">
##$SUBNAM9= <"">
##$SW= 18.0517328524113
##$SWIBOX= (0..15)
0 0 2 0 0 0 0 0 0 0 0 0 0 0 0 0 
##$SW_h= 3612.71676300578
##$TD= 16384
##$TD0= 1
##$TE= 0
##$TE2= 300
##$TE3= 300
##$TEG= 300
##$TL= (0..7)
0 120 120 120 120 120 120 120 
##$TP= (0..7)
150 150 150 150 150 150 150 150 
##$TP07= 0
##$TPNAME0= <>
##$TPNAME1= <>
##$TPNAME2= <>
##$TPNAME3= <>
##$TPNAME4= <>
##$TPNAME5= <>
##$TPNAME6= <>
##$TPNAME7= <>
##$TPOAL= (0..7)
0.5 0.5 0.5 0.5 0.5 0.5 0.5 0.5 
##$TPOFFS= (0..7)
0 0 0 0 0 0 0 0 
##$TUNHIN= 0
##$TUNHOUT= 0
##$TUNXOUT= 0
##$USERA1= <user>
##$USERA2= <user>
##$USERA3= <user>
##$USERA4= <user>
##$USERA5= <user>
##$V9= 5
##$VALIST= <valist>
##$VCLIST= <CCCCCCCCCCCCCCC>
##$VD= 0
##$VDLIST= <DDDDDDDDDDDDDDD>
##$VPLIST= <PPPPPPPPPPPPPPP>
##$VTLIST= <TTTTTTTTTTTTTTT>
##$WBST= 1024
##$WBSW= 4
##$XGAIN= (0..3)
0 0 0 0 
##$XL= 0
##$YL= 0
##$YMAX_a= 91127
##$YMIN_a= -138900
##$ZGOPTNS= <>
##$ZL1= 120
##$ZL2= 120
##$ZL3= 120
##$ZL4= 120
##$ABSF1= 10
##$ABSF2= 0
##$ABSG= 5
##$ABSL= 3
##$ALPHA= 0
##$AQORDER= 0
##$ASSFAC= 0
##$ASSFACI= 0
##$ASSFACX= 0
##$ASSWID= 0
##$AUNMP= <proc_1d>
##$AZFE= 0.1
##$AZFW= 0.1
##$BCFW= 1
##$BC_mod= 2
##$BYTORDP= 1
##$COROFFS= 0
##$CY= -3
##$DATMOD= 1
##$DC= 2
##$DFILT= <>
##$DTYPP= 0
##$F1P= 0
##$F2P= 0
##$FCOR= 0.5
##$FTSIZE= 0
##$FT_mod= 4
##$GAMMA= 1
##$GB= 0.15
##$INTBC= 1
##$INTSCL= 1
##$ISEN= 128
##$LB= 0.25
##$LEV0= 0
##$LPBIN= 0
##$MAXI= 10000
##$MC2= 0
##$MEAN= 0
##$ME_mod= 0
##$MI= 1.114404
##$NCOEF= 0
##$NC_proc= 0
##$NLEV= 6
##$NOISF1= 3.799351
##$NOISF2= 2.8
##$NSP= 1
##$NTH_PI= 0
##$NZP= 0
##$OFFSET= 14.38212
##$PC= 1
##$PHC0= -1202.502
##$PHC1= 10.39219
##$PH_mod= 1
##$PKNL= yes
##$PPARMOD= 0
##$PSCAL= 0
##$PSIGN= 0
##$REVERSE= no
##$SF= 200.129724274929
##$SI= 16384
##$SIGF1= 3
##$SIGF2= 2
##$SINO= 400
##$SIOLD= 16384
##$SREGLST= <1H.CDCl3>
##$SSB= 0
##$STSI= 0
##$STSR= 0
##$SW_p= 3205.1282051282
##$SYMM= 0
##$S_DEV= 0
##$TDeff= 0
##$TDoff= 0
##$TI= <>
##$TILT= no
##$TM1= 0
##$TM2= 0
##$TOPLEV= 0
##$USERP1= <user>
##$USERP2= <user>
##$USERP3= <user>
##$USERP4= <user>
##$USERP5= <user>
##$WDW= 1
##$XDIM= 8192
##$YMAX_p= 0
##$YMIN_p= 0
$$ End of Bruker specific parameters
$$ ---------------------------------
##NTUPLES= NMR FID
##VAR_NAME=  TIME,          FID/REAL,        FID/IMAG
##SYMBOL=    X,             R,               I
##VAR_TYPE=  INDEPENDENT,   DEPENDENT,       DEPENDENT
##VAR_FORM=  AFFN,          ASDF,            ASDF
##VAR_DIM=   8192,          8192,            8192
##UNITS=     SECONDS,       ARBITRARY UNITS, ARBITRARY UNITS
##FACTOR=    0.0002768,     1,               1
##FIRST=     0,             0,               0
##LAST=      2.2672688,     0,               0
##MIN=       0,             -138900,         0
##MAX=       2.2672688,     91127,           0
$$ Real data points
##PAGE= N=1
##DATA TABLE= (X++(R..R)), XYDATA
0@%%%%%%%%%%%%%%%%Qj6J6j6J6j6K4l2L2m0M8n3O1p1Q0q9J03j17J32j48J64j83
38i7K06k31K56k83L14l47L83m24M68n15N67o23O85p56Q33r19J019j132J258j403
58g41J574j777K025k332K723l241L959n020O742r975J7928p2146p8619K13042
72G4142j4527r3165M5494J3671r355p840m767L1801n9128p811P8263n8686k8826
85d0734N6116n8579J9793O6610p2837l009N2740j5378J8508k3046j3243O1798
97D8739m8576k3223P9238o0430m4362P5284j5438l6033P583M65K6214k5136j0198
110b5873O1306m9231k2278R2158m1582m5063O5768k4401j9349L7639l3968r001
122a3875J8449j0832J2212k4187o909M5951m0967q685O6702m1979k4452N8668
$$ y = [0, 0, 0, 0, 0, 0, 0, 0, 0, 0, 0, 0, 0, 0, 0, 0, 0, 8, -8, 8, -8, 8, -8, 16, -16, 16, -24, 24, -29, 32, -39, 41, -48, 55, -62, 70, -78, 86, -97, 109, -122, 134, -149, 165, -182, 201, -223, 245, -270, 297, -326, 359, -397, 436, -483, 536, -596, 662, -741, 833, -944, 1081, -1251, 1472, -1769, 2190, -2830, 3912, -6063, 11865, -60281, -138900, 74142, 59615, -33550, 11944, 25615, 16260, 8420, 3653, 35454, -23674, -31485, 46778, -11908, -40734, 15382, -43197, -23404, 43206, -29631, -32640, 20100, 4722, 23230, 184, -13059, 48739, 163, -23060, 56178, -4252, -48614, 26670, 11232, -24801, -17218, -16753, 9461, -15675, -25873, 35433, -13798, -36076, 56082, 14500, -30563, 35205, 10804, -8545, 29094, -4874, -13875, 4574, -6258, 5954, -18233, -25142, 20809, -20158, -28843, 37859, -4120, -28572, 30096]
134C0096j4270j8876O178p287L0801j6697l7108M3413j0902l5957L9817j1704
146b496k4465L4468q842j0329J8036j0710P774L705q345K4527k0764j8755M5560
159B9364k5315l5757M9550q286l7950K5314N314j3414L046Q55J5956o436j3656
172a1415K9683p301k3248L1110n022k5051K2060n548j6445J2939p792k434O605
185a859j1214J0819J770j4435K5447O93k6494K7265J0155k8487J0070J1485j0193
198E022l841o122O575r79j9724J6615O776k8552J9560J6031k7644J3713J6532
211A3962j6640J0274O052j0410N790m334Q19L064j9817J1148Q909l1441J2216
224a0408J7855k7732R625J7459j5029P228L531k60J2793j5613M471K0530k7688
$$ y = [30096, 15826, -3050, 3128, -4159, 26642, 9945, -27163, 16250, 5348, -30609, 9208, -2496, -26961, 7507, -1335, -11664, 6372, -4338, 3436, 7141, -1204, 23323, 2559, -16196, 29364, 4049, -31708, 17842, 9556, -28394, -3080, 2234, -11180, -8134, -7279, 8677, 2241, -11415, 18268, 10967, -12281, 18829, 13807, -11244, 10816, 5268, -11177, 1762, -6030, -8464, -1859, -13073, -2254, -484, -14919, 10528, 11221, -15273, 11992, 22147, -6340, 3730, 15215, 5022, 1181, -4941, 1634, 655, -19069, -2454, 4322, -24230, -4670, 11361, -16283, -2570, 13962, -2678, 7596, 13648, 3238, 9028, 4694, 5513, 8577, -11240, -92, 8817, -22624, -10408, 7447, -20285, -10660, 6799, -8230, -1002, 2529, 2269, 15062, -551, 3920, 24450, -3238]
237c238J987K1231l0553K373J8539k4525L859P973j1706J1968n676q64K0456j9685
251g861O009K7224l1180N058K9539l0364j30J6997k0368N441k012j1253J7423
264D523j7658l402K7904k6299J042L2221k6702M080K4943k2938P579R120j6280
277a867J4870j0682j0551K3599k5565o225L1055l0462k177L0733k5228L024J7609
290H133j5674J5090j643j1623K5819j8454r448L1933k8144p817L0491k8392k154
303a1883J9889k2771J0322O190j6639K1900q839j0197L1632k1525p164L4080k7058
316b063m706K6353k5284K464J0874j8518J3892o317j3839K8521j8127j0526L4690
329A7414k1983o641L0437k1643J81J7374j9053J0095M02j6781K0821j3048j3607
$$ y = [-3238, -1251, 19980, -10573, -8200, 10339, -14186, -10327, -2354, -14060, -2092, -7768, -8632, 11824, -7861, -1852, 25372, -5808, -750, 28789, -1575, -1705, 15292, -5076, 365, -1647, -12900, 4523, -13135, -16537, 11367, -14932, -13890, 18331, -8371, -4291, 20652, -2286, 5293, 14413, -1867, 13003, 2321, -8230, 15369, -10196, -16421, 14634, -15828, -18005, 12728, -12500, -9476, 8133, -7541, 7549, 5906, -5717, 20102, 1648, -7800, 24133, -4011, -11828, 18663, -9729, -11883, 8006, -14765, -4443, 1747, -14892, 7008, -1831, -12028, 19604, -1921, -9085, 24995, -2063, -6769, 19584, -5700, -3236, 7638, -10880, 3012, -3305, -17144, 11377, -6750, -17276, 17414, -4569, -11210, 19227, -2416, -2235, 15139, -3914, 6181, 6583, -10198, 10623, -2425, -16032]
342a6032K8583k0103r941L0452k0105l880K2465j6278O236P741j4129J6710o400
355E319j4062K5350j6596j3540K7448j8988r748K2769j6324m21J2419j2753J1834
368B707j31j1267K2857j0422j2136K7005j4949j2148K3172j5424p066J3485j2939
381g256L502K357j1817J5564m642j1387K3322q580j0336K3355r605q138J6159
394A2498q789j783M760j0823P291k962j2070J5281p305j2319K0208o140j0613
407a2766J7850l441m045R684m403L004J268p563J0505m813j3154J4611n103j4200
421a2566J3384l487r397J0021j404j445M571l121P477J828p949J1281m96j1513
435b816J1517q23j3278P587Nq430L255j949k36J410m775P744K716r776J0420N943
$$ y = [-16032, 12551, -7552, -17493, 12959, -7146, -11026, 11439, -4839, 1397, 9138, -4991, 11719, 5319, -8743, 16607, 11, -13529, 13919, -5069, -14817, 7952, -8372, -8793, 3626, -9127, 2707, 2576, -8691, 14166, 3744, -8392, 18613, 3664, -8484, 14688, -736, -7802, 5683, -7256, -3754, -1397, -13214, 2350, -2292, -13679, 9643, 1063, -9273, 14082, 4477, -3661, 12498, 3709, 1926, 6686, -4137, 3154, 192, -11878, 3403, -3902, -16221, 3987, -2153, -12766, 5084, 1643, -2402, 7282, 2879, 5883, 7151, -412, 10093, 5280, -7874, 6737, 1634, -12566, 818, -2669, -12066, -2045, -3449, -4894, -323, -3444, 4033, 5861, -2088, 9193, 8697, -2816, 8701, 7878, -5400, 2187, 2192, -6238, -2983, -4932, -5168, -3758, -8533, -789, 1927, -7849, 2571, 8514]
451H514j1380P918M961j0311M146K682n912N03l478M65K264r233L794O246j0832
466i653O180Q760j1607M716Q803o831L543J733l865M674m733k102N720j0442J467
481c637R079j3611J373J0117j0860L437P140o682N688J90k589Q892q022k072J2178
496A0621j2092j538J1690j3822j0R190j1621L760M333o757P866l169k756J3099
510H794j0241k128J5669j2692r00J1913j4025K072P003j2048O014R9q092J1643
524C081o050m487J4459j1120l5J6587j4659L00J2310j1994M599K140j1184J0964
538D911m523q934J3669j0861m953J7925j3013r18J5013j2861M023Q977j1353Q305
552E407o33q057J4549j0441q943J6893j3262m638J6015j5111P97J2818j3064N981
$$ y = [8514, -2866, 5052, 10013, -298, 3848, 6530, 618, 1121, -2357, -1892, 372, -8861, -5067, 1179, -9653, -3473, 5287, -6320, -1604, 7199, 368, 3911, 5644, 1779, 6453, 1720, -382, 5338, -5104, -3637, 5442, -8169, -6796, 3321, -7539, -4102, 3038, -3644, 2044, 2234, -355, 8537, 515, -1557, 10621, -1471, -3009, 8681, -5141, -5151, 4039, -7582, -3822, 511, -6246, 1620, -1549, -4305, 8794, -1447, -3575, 12094, -598, -1498, 10415, -3610, -1538, 5465, -6583, -569, -470, -8562, 3081, -2969, -7456, 7003, -4117, -4152, 12435, -2224, -1924, 10386, -1608, 2991, 5131, -6053, 4911, 388, -8546, 5123, -5738, -10691, 7234, -5779, -6697, 8316, -4545, -522, 8455, -2898, 5407, 4774, -3283, 11266, 825, -8118, 8775, -4487, -9125, 6890, -8221, -7424, 5394, -7670, -1689]
566a689M896r244J2932l538o416J6295j2239n377J7788j5143l344J2713j4040
579f406L074N831j3207R609m02q807J5796o366o172J8037j1015k854J5994j2964
593A48k88R292j1088M994j343j1144J3325o275r666J6599r748m986J7457j1245
607c968j609J3723q912L696N110r340Q551l430p962J3291j0433p980J6023j0803
621d043n359J2111r777J532Q608q526P027J460o913J2593m855q041J4482o843
635C456o837J1001q727l479O624p071K752R22p088J0212k386p835J3945m102o427
650e040J3871n115o056R190m694j761K667n605M410k134p077R292l626p458J1373
665B237k884n296R816l013k406O087l606J794J361n929N930j041q565P657j448
$$ y = [-1689, 3207, -6037, 6895, 3357, -3059, 13236, 997, -4380, 13408, -1735, -5079, 7634, -6406, -3332, 2499, -10708, -1099, -1501, -10308, 5488, -878, -7050, 10987, -28, -2882, 13112, 148, -140, 9152, -1936, 3058, 1715, -9429, 3896, -2379, -12045, 4554, -5194, -10180, 7277, -3968, -5577, 8146, -766, 2930, 8040, -1300, 7251, 3821, -4141, 9150, -1283, -9263, 6760, -4043, -9402, 2709, -7068, -5536, 3072, -5454, 1573, 3033, -3880, 8713, 3858, -4183, 10299, 3456, -3381, 7620, -1107, -4586, 2038, -5033, -2281, -1359, -8447, 1765, -621, -8456, 5489, 1387, -5040, 8831, 3716, -2340, 6850, 2156, 395, 3062, -2543, 1867, -267, -7344, 1948, -1678, -9136, 2237, -647, -5943, 3873, 860, -1546, 4541, 935, 2729, 4090, -1839, 4091, 3050, -5515, 2142, 694]
680F94p484O949p59m656M843n20K50K542l411M430J570o487O336P23q721N917
696B216J374q129L881J239m599K353l82l29K130k731M069K620n887M731L246p341
712a539L898K418o794K888N74m223K058k329m00L963m775R88O094o035K265O392
728E443n996J935M011m984K116J24l547L290m289j393N606p318l17P802p760J004
744d273P873o748K596N261m780L953n24l161N914n330k840P341q110j751P868
759C289r275Q36O649p270L952L076n330P316j124l974R262n520k910R521q555
774e7j672P553r285Q45M086q021M956k75n325R302m176l506J2048p047j786J1528
790I168q710r8P642r222L253J480q404P118l496o691J0614o711l836J2252q513
$$ y = [694, -6790, 159, -600, -5256, -413, -933, -683, 1859, -1552, 2878, 4448, -2039, 4297, 5020, -3701, 2216, 3590, -4539, -658, 581, -4018, -1665, -2047, -2376, -246, -2977, 1092, 3712, -2175, 2556, 5802, -1539, 2359, 4777, -2017, 871, 1445, -2778, -720, -3049, -3449, 514, -4261, -3273, 2821, -3214, -949, 5443, -553, 1382, 5393, 409, 2525, 2649, -898, 2392, -1897, -3290, 2316, -5002, -5319, 2483, -5277, -4273, 3600, -3148, -552, 4709, -71, 3882, 3358, 197, 6111, 781, -2059, 5282, -2828, -4579, 3289, -5986, -5150, 1499, -5771, -1819, 1257, -4073, 3243, 2119, -1855, 7407, 1887, -1023, 8498, -57, -1729, 5824, -3461, -2616, 1470, -6551, -1595, -1870, -7195, 2107, -2069, -5575, 6473, -574, -2360, 9168, 458, 360, 8002, -1220, 2033, 3513, -4891, 2227, -1269, -7960, 2654, -4057, -7893, 4359, -4154]
805d154k40J0679q932L504N979q865P033k06q016R936n878o731J1537q809l536
820f699J0264r450J266P292q603N926K807p529J0433k783o708J2352p003m890
834c325J1195r186k104P948r276K480L885q868Q049q86p052J1618m308n131J2604
849G643p244k645J0112q773J081N144r276N291M90q622R334l438o681J1279n673
864a978l739J1045p264J57Q003p949L801K864q043P288j854p898R784m741o065
879f589J0107o134k623Q359o538J836N124o659N925R36o879Q317k348o631R303
894E506n175m898Q148o033j642N412n712K810K495n557O844k85n141Q386k624
909B534m732P936l977l095N432n319j59K531n640L623N31n656O403m61m691P456
$$ y = [-4154, -4394, 6285, -2647, 857, 6836, -2029, 5004, 4798, -3218, 6718, 840, -5891, 5646, -3163, -6699, 3565, -5885, -4619, 2673, -5930, -4, 2803, -4726, 5707, 2924, -3784, 8568, 1565, -3325, 7870, -1316, -3420, 4528, -4748, -2268, 1617, -7251, 798, -88, -7140, 4478, 170, -4961, 7643, 399, -2246, 7866, -907, 174, 5318, -3958, 1333, 1823, -6799, 2535, -903, -7584, 3695, -1978, -5717, 5328, -1936, -1779, 6224, -1725, 2076, 4940, -3103, 4185, 2331, -5567, 4217, -524, -6589, 3518, -2616, -5239, 3120, -3418, -1582, 3542, -3117, 2808, 3744, -3135, 5182, 2834, -3797, 5506, 331, -4567, 3581, -2452, -4094, 1318, -4394, -1584, 911, -4646, 2198, 1913, -3228, 5158, 2534, -2198, 5738, 1761, -1334, 4098, -1221, -1380, 1151, -4489, -866, -335, -5991, 412, -49, -4740, 2716]
925B716j277l302O411k427j411L592l679J168Q69n335L339j73n993M855l41n017
941f005N569m1k782M288o37J20K803k372J620J503m285K965L33n692L033Q5m994
958d489K859L9k798L125o07n1K880k137K149L181m312K537K844n227J964J411
974C368m640J406P4l092J975j879r49L571l273J026N001m548J815N007n215J869
990A516L293m405J703M56l326K572l059j982M374m880o73O149n263R00N238m751
1006b138K308L248m091M186n96l572N190l990k776N864n688j538O118o262M83
1021c254M379n165L723J517m224O187j489l570P353m746k422P771o719j270N571
1036C642o485J191K666n766N018k50m873P887l257l613R048n410j251P804p213
$$ y = [2716, 1439, -1863, 4548, 2121, 710, 4302, 623, 1791, 2660, -2675, 664, 491, -5502, -647, -988, -6005, -436, -477, -3259, 1029, 392, 512, 3315, 943, 2563, 4066, -219, 2746, 3079, -2613, 420, 505, -4489, -1630, -1591, -4389, -1264, -1871, -1922, 958, -1179, 970, 4151, -161, 2376, 5220, -7, 1957, 3368, -1272, 134, 208, -2884, -909, -2788, -3737, -166, -3439, -2413, 2588, -1960, -145, 4862, -353, 1516, 4809, 404, 2107, 2563, -763, 1809, -1250, -3232, 1142, -3738, -4411, 1738, -3525, -2625, 2613, -2138, 170, 3418, -673, 3513, 2917, -655, 4535, 545, -2231, 3633, -2055, -3593, 2525, -3737, -3254, 1125, -4040, -317, 1200, -3024, 3163, 1674, -1896, 5457, 711, -1711, 6060, -659, -1929, 3642, -2843, -1652, 1014, -4752, 266, 16, -4857, 3030, -227, -3840, 5208, -202, -1453, 6351, -862]
1051h62N64N299p760L312J267o633O534k078n312Q594m466l308R023n628J96O542
1067E284o887L060L143p290N514l04o503P502l934m938Q337n993j822Q024o692
1082c499J715N258o577M914J871o542P671k178n507Q344n532l820P992p287k63
1097c440O099p633L370L249p104O697L94n288Q228k856l491P997n889j382O701
1112E652p595J298L890p589L834P12o561P252j872m459Q857l789k429P854n138
1127h3K80N111o055K951J832o590M344r50n620O560l423l623O822m532p93O234
1143B465m591J495M346m751L974O56m737N340k221m231N658m118k716N106m600
1158b925l56L574m240K690K044l783M562L87l751N486j305l273N243l093k041
$$ y = [-862, -298, 5001, -2759, 553, 1820, -4813, 1721, -357, -5669, 2925, -1541, -4849, 4174, -1454, -1258, 5284, -1603, 1457, 4600, -2690, 2824, 2520, -3983, 3519, -415, -5353, 2984, -3009, -4831, 3193, -3499, -1784, 3474, -3103, 1811, 3682, -2860, 4811, 2633, -2874, 5470, -62, -3882, 4110, -3177, -3440, 2659, -4974, -1604, 1645, -5459, 1238, 1632, -3656, 4572, 1716, -1775, 6222, 333, -1049, 5652, -1943, -645, 3245, -4344, -510, 202, -6359, 893, -979, -5438, 3419, -370, -2799, 5055, -83, 197, 5308, -747, 2204, 4036, -2554, 1790, 840, -4780, 1780, -1643, -5266, 1556, -2976, -3769, 2465, -2126, -631, 3715, -1036, 2938, 3594, -1143, 4197, 1976, -2255, 3403, -715, -3431, 1675, -2925, -3281, 293, -3947, -1257, 787, -2996, 1566, 1953, -1798, 3688, 2383, -890, 4353, 1260, -781]
1173g81L479l747k92J598l616K412P2l148M274k43l138N121n98k349M013j626
1189A431q62K280k242J23J031l375J772j81l507L053l11k674L356j20j513L110
1205A371q44m13K250j729Q38J122l162J608O95l606J469Q94l134J651N56j686
1221b120J590o9j02J926j524R35K204k614N86K156l682Q30J520l507J357P09k542
1238b347J616l82q37K633j482K3L455l104N89L177l422P37J754l293J291r5k521
1255b208K663j456j960L761k341j018M526l148M38M060l772J526K035l495K421
1270B032o78k987L630k537k480M563l941p52M601m183R21L608l625K750J595l487
1286i70L979j026k962M726l026k725N020m875q02M230m932J232K819m416L656
$$ y = [-781, 2698, -1049, -1341, 257, -3359, -947, -875, -4023, 251, 8, -3130, 1991, 1393, -956, 3057, 1431, 569, 2849, 607, 730, 1761, -1614, 158, -23, -3530, -477, -788, -3462, -106, -226, -1739, 1371, 527, 114, 2364, 635, 1473, 2595, -567, 1041, 1736, -1870, -401, 493, -2641, -990, -434, -2120, -530, -599, -701, 1225, -299, 636, 2840, 226, 812, 2968, -714, 116, 1636, -1871, -514, 195, -2347, -731, -1113, -1950, 683, -799, -776, 2679, -425, 164, 3341, -81, 656, 2410, -883, 408, 313, -2208, 455, -1001, -2961, 800, -1541, -2559, 1967, -1181, -743, 3317, -455, 1071, 3106, -389, 2032, 1354, -1633, 1997, -540, -3020, 1543, -2398, -3150, 1451, -2732, -1811, 1797, -1828, 922, 2517, -970, 3009, 1983, -979, 3747, 721, -2004, 3016, -1859, -2661, 1569, -3363, -2131, 688, -3728, -72]
1301g2Q27l413N603j764k406N931l544j833N079m930K2L209n293K291N91m937
1317d639M831j255l540O444k590k328O771m047N6M815m748J395K686n251L277
1332A877n12m682M918k638l429O179m067j205N378m224J231M056m600L508J489
1347C279m733N053j240m202N443l473k833N367m839n14M101n040K418K082m319
1362c450M695Nl505N533j892k806N907l830j443L965m469Q21K094m716K718L61
1378a2m029M730r39l045N612k292j400M849l545K69L074m063J744J291m286L144
1394A102r22l526M332j854k067M415k705n10L918l199J326K348l469K674L71l589
1410a355L319j215k841L422k102j822L607k682J94K393k680J688J261k452L210
$$ y = [-72, 755, -2658, 2945, 1181, -1225, 4706, 1162, -671, 4408, -522, -500, 2709, -2584, -293, 298, -4639, 192, -1063, -4603, 1841, -749, -3077, 3694, -353, -297, 4518, -230, 1165, 3851, -1400, 1877, 1365, -3317, 1601, -1037, -4466, 1713, -2354, -3559, 1819, -2405, -1174, 2882, -1718, 1790, 3279, -1454, 3599, 2359, -1843, 3600, 127, -2706, 2661, -2178, -2692, 1409, -3631, -1213, 869, -3450, 1245, 1250, -2255, 3278, 1386, -1420, 4487, 657, -786, 3179, -1290, -469, 1625, -3091, -373, -12, -4041, 689, -250, -3295, 2317, 25, -1375, 3474, -71, 198, 3272, -791, 953, 2244, -2042, 1102, 180, -3346, 986, -868, -2935, 1480, -1225, -1735, 2183, -1016, 310, 2658, -811, 1863, 2234, -1355, 1964, 749, -2092, 1330, -772, -2594, 1013, -1669, -1475, 918, -1762, -74, 1187, -1265, 1945]
1425A945k65k461L122j028k367K934j942j386K155k217O5J368j963J565P41j844
1441a578K422N8j558K656p00j447K163j196r37J390j747k18N67j918J158M66j640
1458b059J548L51j306K010L83r56J732m66o47J239j255j54P73k014L76M40k164
1475b169R62P39j844J325R11p73J323L76n67J696j063p0J426j759k9J291k816
1492a041K39J155k250K45J153j682J520J93q74K073p13K7K402j765J71J989k526
1509C16J78J227k786P78K98k033J529q01j200K718j371o26L192j907L46K895k360
1526C93N87J436k334J124J18k633K570j946j716L212k452p14L280k588K15K877
1542A429k648J966J041k268K929j090k141L320k486j435L409l394m85K955l184
$$ y = [1945, 1680, -781, 2341, 1313, -1054, 1880, -62, -1448, 707, -1510, -1445, -77, -2040, -475, 266, -1578, 844, 902, -656, 2000, 1300, -147, 2016, 820, -117, 1273, -474, -692, -125, -2043, -885, -419, -2059, -511, -160, -1466, 544, 927, -29, 1703, 1237, 590, 1829, 574, 420, 1193, -821, -445, -5, -2169, -1207, -468, -2312, -987, -76, -849, 474, 850, 283, 1979, 916, 846, 2272, 513, 484, 1775, -1041, -802, 353, -1897, -1652, -499, -2181, -661, -468, -1342, 731, 18, 45, 2447, 682, 853, 2842, 316, 494, 1721, -1065, -287, 11, -2022, -493, -1294, -2494, 224, -1147, -1773, 1419, -488, -142, 2753, 393, 980, 2416, 82, 1206, 1324, -1309, 1261, -685, -2401, 811, -1641, -2355, 925, -1663, -1448, 1429, -1219, 747, 1788, -480, 2449, 1359, -782, 2538, 52, -1383, 2026, -1368, -1853, 1102, -2082]
1557b082O17J976k863K576N15k403L749j305j877M142k662j008L507l675K08K085
1573A500l608J755Q90l311L460r25k437M534k147j243M264k666l08K991l514J333
1589E68J422l668K713n15l128L664j708k065M025k507p90M000l080J126J944k964
1605i63K427M54l357L475j301k892M079k615j736L625k870K7K721l056K034J387
1621A439k968L189j49k684L803j539k411L649k759q20K458k881O41J492k928K156
1637c12N33k743L667p05j765L643j602q78K554k362J28J804l031J317N27l226
1653b451K527n30k524L515j308j010K841j521J51K392j980R80J160k570J804N3
1669A529k839K164r29k195K302j343q14K144j507K52J986j744J493Q62j605J941
$$ y = [-2082, -1465, 511, -2352, 224, 739, -1664, 2085, 780, -1097, 3045, 383, -625, 2882, -793, -585, 1500, -2108, -353, 537, -2774, 686, -239, -2676, 1858, -289, -1532, 2732, 66, -242, 2749, -765, 568, 1990, -1678, 1035, 520, -2608, 1056, -652, -2717, 1308, -1199, -1989, 2011, -1069, 57, 2001, -963, 1464, 1918, -1439, 2036, 735, -2157, 1922, -693, -2429, 1196, -1674, -1647, 1074, -1982, 52, 1439, -1529, 1660, 1511, -1173, 2630, 1091, -1320, 2329, -430, -1250, 1208, -1673, -1032, 460, -2468, -312, 221, -2522, 1145, 440, -1325, 2318, 716, -162, 2392, 30, 158, 1962, -1069, 248, 775, -2451, 76, -454, -2978, 537, -771, -1781, 1060, -461, -310, 2082, 102, 1082, 2242, -328, 1476, 1529, -1310, 854, -75, -2270, 32, -1311, -2125, 19, -1488, -1236, 750, -994, 499, 1361, -244, 1697]
1685A697Q9j855J942j049j281J609j592q92J483j693K70J134j649J300P96j412
1701a103J982J67j200J601k14r31J426j023q78J017j572k83Q13j237N75O16j538
1718a782J261N91j027J545L63q91J264l28o86R16o72m18M00j157j7O42j414N08
1736i02N13j003J037L66p50J406L9p31J260m27m21R89j160m79J289j863K15Q55
1754B33j528M55P42j243J635k05j061J842o65l71J840j452k74J885k407M91Q20
1771G37j799Q35M70j909J665m01r56K375j587j44K365j733J97J787k242O10R67
1788A237k322J571k16k004K151j209j184K449j400m04K600k246Q33J789k087J458
1804A016O02k293J997n57j898K415j777j087K419k248k8K317k439J059J403k154
$$ y = [1697, 1786, -69, 1873, 824, -457, 1152, -440, -1332, 151, -1542, -1272, -138, -1787, -487, 309, -1103, 879, 1046, -154, 1447, 1233, 302, 1728, 705, -173, 844, -728, -1011, -198, -1435, -860, -244, -1782, -521, 70, -957, 588, 951, 60, 1324, 996, 310, 1226, 554, 136, 536, -621, -638, 4, -1410, -902, -389, -1392, -355, 11, -739, 667, 706, -25, 1235, 808, 387, 1376, 216, -263, 1026, -837, -622, 233, -1295, -840, -98, -1341, 294, 89, -972, 870, 205, -166, 1674, 222, -52, 1833, -574, -83, 737, -1062, -227, 243, -1666, -1, -402, -1358, 1017, -570, -714, 1651, -82, 115, 1902, -340, 270, 1237, -1085, 486, 270, -1734, 417, -792, -1976, 473, -927, -1331, 1269, -977, -144, 1645, -442, 1016, 1618, -675, 1322, 765, -1133, 1282, -495, -1582, 837, -1411, -1439, 878, -1561, -502, 901, -1253]
1820a253K320L28k073K713j063j523K761k409o35K435k912M47J490k886J890O20
1836B50k495K660m05j400L457j645p36L041k552R3K087l039R44P52k663J901n60
1853c10k256K760j084j384L270j756l25K896k399J213J502k719K118K3k611K467
1869A405j125k148K794j874j085K491k260M06K511k575J567J138k300K517r0k012
1885f40K454j179j292K629k618k52J771k545Q18J176k368K006K90j989K801o51
1901D11j400K933j400p73K498k307K67J077k237J087K07k120J915l71j542K252
1917D97j050o73K109j433L23J735j837J137P32k000J367ok190J734m27j457J673
1934B34r79n34J675j268L31J332j384J109M31j231J421l07j345J384o97r51J117
$$ y = [-1253, 1067, 1395, -678, 2035, 972, -551, 2210, -199, -834, 1601, -1311, -864, 626, -2260, -370, 250, -2245, 415, 10, -1390, 2067, 422, -314, 2727, 175, 268, 2355, -684, 260, 1012, -1651, 250, -310, -2566, 194, -890, -2274, 996, -760, -1085, 1811, -588, 625, 2127, -592, 1526, 1549, -1062, 1405, 280, -1868, 926, -948, -2033, 458, -1802, -1396, 1115, -1460, 107, 1245, -1055, 1462, 1372, -640, 1814, 635, -657, 1972, -646, -898, 873, -1672, -854, 322, -2046, -40, 250, -1739, 1062, 411, -989, 1944, 544, -229, 2269, -38, 229, 1306, -931, 156, 363, -1757, 158, -213, -1755, 497, -553, -1226, 883, -550, -227, 1508, -329, 808, 1540, -460, 907, 901, -1289, 445, 18, -1439, 234, -745, -1279, 396, -872, -541, 791, -593, 516, 947, -284, 1137, 830, -515, 869, 172, -779, 338]
1951C38q48l64R87j051L45Q44j188J042K91r00J316J64j121J101l09o53M23n37
1969a20m35O64r23P0O92r53N62P17r14Q24J05l79Q19j16k58O18l77p99P59p70
1989b14k97N14q62Q1N51p85L53Q27r03P38M73o37J112l16m27P48n99m64P70r41
2009b78k63O33j230L03O56j286J035M51q25J155J43o26J469q08k68J053j001k67
2027D6J041j679m4R64j903J069J52j107J298r6q60J890q08m6J690j308Q6J125
2045A510j794P70M91j822J131k96j452J341q20n90J907j233k24K275j824Q36J238
2062A444j769J401L31j876J621p45j545K048j618n18J930k091K90J929k142J016
2078b94J195j902J877J36j418J951r46j170K358k111K4J519k336M95R11j996J369
$$ y = [338, -510, -874, 113, -938, -593, 251, -937, 105, 396, -504, 812, 976, -145, 956, 647, -6, 417, -120, -555, 109, -814, -744, -52, -1005, -443, 274, -640, 184, 289, -90, 729, 613, 355, 973, 596, -203, 556, -214, -511, 3, -859, -778, -227, -1012, -659, 168, -735, 3, 476, -161, 951, 635, 208, 956, 357, -107, 663, -278, -541, 92, -1138, -835, -179, -1465, -430, 21, -804, 351, 494, -132, 1337, 529, 261, 1314, 313, 46, 1087, -592, -636, 328, -1575, -506, -354, -1461, -163, -259, -1119, 771, -37, -83, 1607, 299, 385, 1510, -284, 486, 977, -845, 286, -10, -1462, -121, -941, -1531, 376, -857, -1081, 1194, -630, 206, 1444, -325, 1076, 1407, -469, 1152, 407, -1138, 910, -708, -1226, 704, -1387, -1097, 832, -1310, -294, 901, -1001, 876, 1012, -406, 1545, 599, -571, 1787, -324, -300, 1219, -1117, -622, 289, -1707, -338]
2095c38M66j716K278m45j253K517j345o66K490k106J2J646k182O73O20k222K045
2112D74o19j670K450j147j080K950j825k05K263j909N63J190j996J292J05j884
2128a048K038j024j418K151j293p22K010j736N97J584j935J176N70j565J869n83
2144F71j395K211j326j156K152j924j01J310j690Q42Q70j785J583L92j469J890
2160A075n92q32J763j114m35J266j610Q6Q04j728J032K23j393J540k46j029J655
2177D65m13n04J423q39J94J077j386N52M2j317R15l36j306J326m50p16J414q08
2195f67l1R96o24L28J004j055R46j24r55J069l91j024Q57m01o83O93q70j55O93
2214c94q94R17O02n22M40N12n42P73l2n77M72l16p48P06p23k41L99n66M2K28r2
$$ y = [-338, 128, -1588, 690, 245, -1008, 1509, 164, -502, 1988, -118, -106, 1540, -642, 31, 651, -1571, 474, -145, -1815, 635, -512, -1592, 1358, -467, -672, 1591, -318, 245, 1435, -561, 731, 836, -1048, 990, -34, -1452, 699, -594, -1316, 694, -1042, -445, 1139, -796, 380, 950, -615, 1254, 671, -724, 1487, 161, -995, 1157, -767, -868, 442, -1248, -406, 464, -1321, 262, 654, -815, 1075, 483, -349, 1414, 300, -135, 1131, -479, -393, 411, -1317, -285, -62, -1455, 85, -161, -1190, 465, 52, -452, 971, 132, 326, 1403, 17, 569, 611, -706, 209, -127, -1433, -107, -557, -1273, 141, -667, -698, 298, -326, 2, 1006, -49, 897, 773, -182, 887, 496, -528, 329, -72, -755, -62, -932, -1087, -394, -1288, -371, 231, -291, 149, 661, 119, 892, 860, 283, 755, 439, -309, 397, -326, -567, -168, -734, -692, -464, -556]
2235e56K56L55k39N36K30l23M51Ok98K45k65m01K52m29k90L01l69k01N99n98K50
2256d88N44l41L80L03l70N71P0n85P58m22n89N69n23m07P61r83P8P83p77L89M81
2277B02q60R76J44q13J074m37l04R82q31o6P38j435K54O31j200O06M89j214J071
2296Gn3n60J469p45m09J568j320J43R24j448M30M49j660J362m7j254J425p25k77
2315g21J253q87k3J526j278L06Q45j360P16L94j663J503n33j185J433r88k22J541
2333F57j412L71R78j172R50O20j517J553j73j339J669q58j098J826j773j75J550
2350F57j821O47P61j292J223L08j251J896n93p94J694j366l22J596j684J93J064
2367I16j988Q76N26j760J382j26j008J659o82k85J588j140J83J572j810O19N15
$$ y = [-556, -300, 55, -184, 352, 582, 259, 710, 716, 418, 663, 398, -3, 249, -180, -470, -169, -538, -739, -140, -738, -488, 56, -285, 95, 398, 28, 599, 669, 84, 842, 420, -169, 400, -123, -530, 231, -752, -674, 109, -668, -279, 202, -658, 318, 462, -351, 723, 286, -18, 964, 133, 67, 805, -630, -376, 255, -945, -339, 150, -1064, 7, -46, -606, 863, 118, -291, 1277, -43, 100, 1024, -424, 6, 455, -1205, 157, 110, -1144, 281, -444, -721, 532, -355, -378, 1148, -130, 176, 1021, -339, 377, 771, -892, 611, 78, -1107, 326, -662, -884, 657, -755, -384, 594, -578, 372, 992, -525, 1028, 855, -484, 1185, 327, -771, 1055, -718, -893, 657, -1164, -517, 244, -1048, 175, 483, -768, 1128, 535, -259, 1435, 69, -253, 1343, -341, -148, 916, -1072, -196, 330, -1430, -48, -174, -1182, 477, -205, -490, 1098, -42, 141, 1713, -97, 522, 1037]
2384A037j492R25k36j167J345q87p68J537j126k92J737j373N63R92j009Q27M13
2401A026j212J144m66r96J392j110o60J242j191j18J003j314R64M01r19J132J43
2418D61q36J244m67n09J216p69l03R27j297L17J95j260R65q9p87J093l96l68J186
2437E23n67k49J162o95L07M20j049N54R8q03O28l51q53Q43m21n26J145o25q6J166
2457F21p82J61O10n96N45j4l66N09k89o77M35m87j09J78p3q0L51j82K0K72k04
2478a57P46q1l97L60j95l97N50l51k88J31k7k59J88j55j54M68k66K49M59m06L04
2499C22K52l86J42O2k96R5j24k08M5m26k2M51k79j47O39m55O00J47k99K50K97
2520F60o31M55k6n41L93l57n65P83n75l68Q50n41J30N80n85M91M77p34M53L33
$$ y = [1037, -455, 470, 234, -933, 412, -475, -1243, 294, -832, -1124, 613, -760, -197, 795, -214, 613, 1026, -186, 958, 492, -504, 888, -222, -882, 360, -831, -949, 54, -1260, -296, 105, -814, 318, 461, -375, 869, 402, -107, 1109, 340, 37, 964, -333, -16, 179, -1081, -116, -205, -992, 101, -295, -663, 523, -44, -293, 869, 174, 481, 901, -148, 406, 504, -299, 329, -22, -875, -32, -453, -979, 166, -459, -545, 621, -161, 0, 610, 14, 559, 545, 179, 688, 399, -278, 157, -330, -439, -261, -334, -414, -63, -245, -225, 47, -157, 589, 508, 111, 471, 276, -121, 429, 78, -210, -79, -106, -365, -177, -332, -486, -18, -284, -35, 424, 18, 322, 574, 188, 330, 392, 96, 191, 67, -141, -96, -522, -544, -93, -372, -519, 120, -335, 265, 412, 113, 363, 660, 29, 484, 458, -83, 310, -47, -612, 171, -404, -772, 78, -463, -333, 247, -338, 153, 630, -104, 349, 682]
2540F82q14O83l55k10M36o05l02L37m07Q7L90q16Q41O2n81J010k15n95J348o82
2560B94j73Q03q52M3M11j063N44J2q69P46J2r54J089l76k43J168p26K28J007j243
2580a42N23L74r58O43J45j243Q44l08q64J070p27q6Q72r98M05J055j102Q37M37
2599G77j101J352l63q01J017n70n88J146j449k93J153j253O01N56j248J065L08
2616C09p54J239m24n94J454j108KR02j244O6P29j284N22K56j044J051j35o67J276
2635E52r05k02J693j392J95J153j373O19K79j100R07m35n86R17p37j14R60j052
2653f21K43R81j186O43M21r35Q64J77q70J089q49m56J160r88j18Q95j184K98P37
2672C01r83P51K29q51J083k78n66J294q73k72P96p14k36N48p49L04J52o48Q68
$$ y = [682, -132, 551, 196, -14, 422, -183, -485, -148, -555, -468, -78, -894, -53, 9, -572, 438, 223, -372, 976, 294, 121, 924, 72, 115, 526, -537, 7, 19, -850, -104, -92, -1046, 43, -333, -576, 592, -134, 94, 1101, -142, 381, 755, -203, 440, 585, -658, 186, -122, -986, 84, -643, -729, 143, -855, -450, 605, -497, 340, 777, -324, 1028, 665, -136, 881, 311, -277, 869, -580, -873, 280, -973, -372, 184, -1064, 1, 309, -445, 794, 370, -224, 1230, 122, 124, 1026, -218, -152, 577, -707, -185, 71, -973, 78, -57, -724, 552, -353, -555, 1138, -254, -59, 1094, -279, 340, 619, -481, 426, -9, -595, 322, -415, -529, 431, -621, -378, 603, -583, 60, 481, -454, 410, 587, -283, 806, -43, -499, 661, -327, -445, 450, -734, -436, 301, -682, 69, 298, -553, 530, 252, -314, 980, 107, -165, 631, -83, -319, 229, -520, -216, -64, -712, 156]
2691A56k57n06O04J11j81O64n92m3P30o38K94J11p65L98Oo30M54k74k76M84j41
2712b91N2M50l82K43K45k57L76O6m23J80P2o18N93n09j11J68j60k11K58j64N7
2733c66K32J36J22K08j50K46j2j57R5q9l28j43J4k82M85l96j63L55j43J55J94
2754A3j53L17J08j26M32K26q31M97K9l73j77J72k75l0k50o4M81l61J03L25m06
2775c43L26J67m6K65K12n84M86P6o71K20j53j9J82o06J88K19m01K69M39k75J49
2796A00K85n16O78k89k08N34m76m57P55o36l05Q68r95M80O8m94O73K1n24Q08k46
2817A24k67Q29p21q9O97q50K54M30q59P72k41q67Q29m35k78R68n99k4J032o43
2837F2o8Q05j303N87J50p07Q23k58o65Q37m89m05R75o42k9O43o62L69O28j004
$$ y = [156, -101, -607, -3, 108, -73, 591, -1, -44, 686, 48, 342, 453, -312, 86, 92, -538, -84, -358, -634, -150, -291, -239, 211, -171, 72, 317, 60, 436, 502, 79, 259, 331, -287, 306, -203, -314, -146, -306, -517, -259, -423, -366, -134, 2, 124, 332, 182, 428, 416, 259, 354, 265, -63, -206, -192, -474, 11, -385, -548, -193, -336, -181, 13, -140, 177, 285, 159, 591, 817, -14, 483, 512, 139, -38, 134, -141, -171, -421, -485, -4, -365, -262, 63, -343, -17, 150, 104, 369, 581, -3, 483, 559, -112, 108, -45, -64, 118, -488, -300, -81, -482, -213, 226, -49, 100, 385, -131, 547, 258, 50, 584, 108, -349, 406, -230, -535, 333, -662, -182, -114, -608, 65, 86, -438, 370, 124, -143, 686, -35, -124, 573, -277, -23, 407, -452, 320, 79, -788, 41, -394, -672, 296, -303, -327, 705, 62, -6, 799, -504, 83, 233, -474, 349, 91, -574, 263, -226, -631, 344, -298, -327, 316, -346, 23, 651, -353]
2857c53R43j70p72R23l84m70P10m15k86N55p55jP28r24Q19J19q88J039j30o58
2877c70J186o35l58R87j043O1P36j108M72L99j086P99p2o96R62n90NJ056r77K44
2897b8Q07q00K30M82j062O85q7r75R19l47n93R48o17r9P27p34K91O40p40P00J74
2918E21p07O86m1q02R93p16k76M90n45k40Q47r42M95N30p71N99M5n05Q21l06k78
2939a02R03n88k45N95p44j25M86o27OK52m17O08l0l64O59m11L6P86m98j59P11
2960G32o58J66N3o16L02r2l37J42J5j53O51k67j05M17m90M01K58l01K34N2o59
2981b55N73p2k69K23l11l18L40k36j08L51l03Q7K93k15K43K31j30K93Q0m07K44
3002C34k34k88M16l64kL7k80J55Q4m6J48L60m07J1K94k89J12M18l57jJ93m52J14
$$ y = [-353, 590, 420, -352, 571, 187, -283, 427, 12, -274, 281, -474, -475, 253, -671, 148, 267, -621, 418, 288, -370, 816, 181, -177, 810, -233, -172, 564, -544, -72, 327, -759, 40, -32, -728, 234, -356, -351, 705, -272, -28, 779, -21, 209, 691, -371, 314, 227, -748, 171, -176, -769, 179, -438, -537, 190, -544, -253, 387, -353, 347, 521, -186, 500, 459, -343, 650, -66, -342, 148, -397, -637, 210, -732, -237, 293, -478, 121, 166, -339, 482, 176, -102, 801, 213, -32, 563, -181, -306, 180, -447, -441, -189, -606, 2, -28, -392, 267, -144, -108, 678, 180, 21, 732, 74, 240, 293, -323, -21, -113, -450, -308, -293, -446, 205, -62, -167, 250, -240, 161, 419, 118, 352, 404, -255, 318, 246, -23, 200, -111, -429, -89, -325, -433, -82, -385, -298, -5, -220, 23, 254, 124, 417, 497, 90, 334, 100, -188, 228, -136, -138, -101, -381, -226, -142, -188, -40, 320, -87, -76, 218, -71, 41, 459, 102, 101, 294, -158, -44]
3025d4J18l32K81k97k8K23l2L9M03p41M54K71q6p9K87m52K88l48k37K77j6p7J36
3048Hm14J79L00l50J60L69l74L09L08m50L61l61k68L18k76k18O06n79J7L38m59
3069d76L98K60m45K83K19l21N50l07k83R16p42m8N55r22K31K43o38O02k32m52
3089f09M91j93J8P66o42J3R35o48J57N27r50L89j39o07Q20j80q65P93o51n8P88
3110A55o07J66N95n14O01K71o96O05n6o83O48l47l01L66p23L00N60r65K81O61
3130C17j052Q19j50l30Q39j16l66P73n09n2M00p07J85J60n27K45K48r52Q40k63
3150a98n22Q90l01KP57p44J67P95j095N65J77o49N06l33k91M39k24n88P86o03
3170d64P0N85p13O26K01m63L77K32n49N15j53m24M76n14r2K93n66L52L48n59K55
$$ y = [-44, 74, -258, 23, -274, -302, -79, -111, -72, 331, -410, 44, 315, 229, 150, 437, -15, 273, -75, -312, -35, -51, -128, 8, -406, -227, 73, -277, -117, 252, -122, 187, 495, 45, 406, 45, -223, 95, -181, -399, 207, -372, -355, -17, -476, -78, 182, -263, 20, 239, -82, 468, 161, -122, 794, 52, 4, 559, -363, -132, 111, -527, 75, -157, -609, -118, -311, -293, 473, -169, -156, 779, 131, 288, 815, -135, 254, 115, -492, 328, 148, -717, 76, -575, -633, 155, -452, -286, 309, -205, 396, 667, -29, 576, 520, -163, 485, 138, -163, 203, -520, -220, 340, -625, -344, 317, -735, 84, -66, -396, 443, 327, -39, 734, 225, 173, 573, -134, 51, 211, -316, -71, 177, -775, 65, -198, -720, 170, -131, -129, 628, -116, 51, 846, -249, 316, 493, -156, 350, 17, -274, 165, -59, -647, 139, -464, -394, 191, -522, 104, 305, -158, 219, 451, -98, 417, 264, -160, 316, -198, -290, 3, -563, -211, 137, -422, -167]
3191a67K53m26N91J8n25O39j98l56O58n15k53M78n02L22Nm75L77l0o6J69l0NL31
3214C03k77K01J48l80K50K6l79O4J08k43L89m73p2M25l50o1J48J54Q5O9q2RL12
3237C74j56j74J17l32K75j61k85K06m8j46J77q4m5K27p3K50K90k64J15L1k31J3
3259G6j42J41j46n4m5J60k54Q8J64k22j4QJ53J37M58l64l7J33j29KK68m07oJ48
3283A16m80L80j17l20L02o1L4K50j68J75O3j49J71j22J76M4M5l87K84l04j75M40
3305A97k33m73N40m02n8L97j59M81o0j93J80K03m87L27j86o9L33n75r2N60o77
3326d46K05J91n82N25K03n98O62J62m64O24o88J18N99n13J20K44l79J40m4o28
3346e49O01j02n56P79k04k36M14k55O9M46m23Q9N07o24J54J45m73L11k67j17M59
$$ y = [-167, 86, -340, 251, 269, -256, 383, 185, -171, 487, -28, -281, 197, -305, 17, 22, -453, -76, -106, -172, -3, -33, -28, 303, 26, 227, 375, -5, 245, 271, -108, -44, 64, -179, 210, -263, -335, 90, -260, -321, -173, -19, 66, 135, 53, 62, 374, 218, 44, 161, -171, 104, -57, -342, -136, -184, -330, -153, -237, -282, -55, -128, 122, 412, 148, 263, 294, 63, 76, -66, 75, -71, -125, -170, -10, -264, -176, -12, -234, -248, -240, -87, 50, 508, 144, 107, 240, 111, 113, 381, -26, -32, 116, -364, 16, -101, -421, -119, -180, -146, 104, -64, 111, 174, 25, 196, 74, 250, 294, 339, -48, 236, -68, -243, 197, -36, -509, 31, -371, -429, -32, -191, 290, 230, 37, 217, 420, -67, 260, 74, 5, 338, -237, -329, 231, -446, -241, -50, -632, -107, 96, -502, 160, 322, -142, 482, -206, -88, 511, -2, 118, 362, -17, 123, 79, -549, 52, -50, -606, 173, -31, -267, 147, -108, -39, 407, -16, 73, 580, -44, 110, 255, -218, 93, -174, -291, 168]
3367A68k80l09Q58q61L22M83n26L22L19q23P34j98l34N60m96j59M29l05L6L57
3387B97o29J76M30q55O65R9n63Q39r2n67N84m44O8O06r25K86J49o22M24J09n28
3408d93O30j38m13O37j09J23K37m39J57J23m37L85J24q07L65l1k70M74l20l4L89
3429A53n38M2O39m13K78K25l76K60k6k93L10n87kM25m75N7K46k41K2M37m90N09
3451A62J13l96L76k66J38L07j61m8L0m47O3K78o07M89j99l24N15l45J28K21j39
3472a12K05J25o3L7J88l10k0K89k63J32j95k85J28p7j35L85l17J10J69L2J10q5
3494D8O6K19j04j32K42l04j03O5o3k53M8P0J17k11J00R1Q0o8q2K73J47n6P1j93
3518F8PK04j47r3K7l9j64J38j17jQ0r0J62K0j84M97l15J8J42j28Lk37P9K1j4k19
$$ y = [168, -112, -421, 437, -424, -102, 381, -145, 177, 496, -327, 407, 209, -125, 435, -61, -220, 209, -96, -60, 297, -332, -156, 274, -581, 84, 183, -380, 459, 367, -200, 384, -60, 8, 614, -311, -25, 124, -498, -74, 35, -493, 137, -1, -414, 223, 114, 237, 474, 35, 192, 315, -122, 263, 387, -420, -55, -86, -356, 118, -202, -236, 153, -385, -343, 296, -117, 161, 386, 10, 270, 244, -49, 261, -326, -328, 97, -378, -321, -75, -316, -294, 143, -347, 162, 275, -121, 255, -11, 127, 434, 273, 225, 255, -192, -129, 149, -458, 31, -168, -492, 23, -322, -194, 27, -112, 93, 218, 155, 192, 380, 70, 50, 339, 76, 208, 13, -272, -144, -221, -356, 29, -288, -178, -9, 23, 133, 48, 114, 333, 229, 97, 339, 35, -68, -3, -66, -319, -271, -201, -84, -295, -195, -104, -24, -92, -174, 99, 246, 190, 261, 68, 75, 279, 132, 39, 66, 27, -137, 1, -116, -117, -37, -127, 35, 55, -129, 368, 53, 71, 213, 85, 88, -149, -70, -49, -63, -282]
3544b82K08j2o1J2J49j79K23l93K69J84p3J75J47n09L35p1m39L57j19J21j55k04
3566c17L6M08j50k03L03j24O0K91l76N38l16k54Q1k5j44L83m15j55O99o89N9J47
3588a63k43M43J60k04M11j28l31L79l08j37L06j62j42K60m91M28k26n15O24j29
3608a68J7M09k80qL72j87o6J94l93L58J29l59R7J11o18L74l08k24O39l38P9K93
3630A23l69M35L42o16N72m0m74K68j44j69J48j89j31M80n99J53L86o20M19K92
3650B67n52O12j15j91K32m5r3L61m54j70K76m88j05M59n37N89k48j41N30k72j92
3671b77N48k27q5L72l29J87J13n27M71j43l53L41k52r6M55l75k29M80m22O1N73
3692B86k38R4J48n83M48J01k96K62k36l05L90l01k1L79m89K25K14k04J68J48l63
$$ y = [-282, -74, -86, -147, -135, 14, -165, 58, -335, -66, 118, 45, 220, 367, -142, 193, 122, -317, 40, -79, 42, -113, -317, -281, 127, -23, -226, 77, -47, 13, 304, -72, 466, 150, -104, -23, -48, -192, 191, -224, -379, 320, -369, -310, -163, -406, 37, 197, -7, 404, 276, -55, 324, 16, -121, 185, 23, -119, 141, -350, 78, -148, -663, -39, -168, -151, 258, -22, -30, 342, 155, 89, 283, -110, 248, 377, 18, 115, 226, -392, -18, -326, -550, 89, -249, -170, 123, -246, 189, 531, -85, 487, 447, -27, 241, 97, -72, 76, -113, -244, 236, -363, -210, 176, -444, -25, 267, -285, 327, 212, 21, 253, 208, 115, 476, 22, -148, 128, -360, -465, -6, -543, 46, -202, -343, 187, -85, -277, 271, 44, -41, 331, 2, 189, 302, -225, 246, 103, -250, 91, -161, -257, 198, -177, -406, 74, -348, -287, 286, 48, 142, 290, -293, 155, 256, -40, 222, -14, -319, 71, -230, -251, 128, -361, -136, 78, -126, 42, 190, -173]
3713a73L40L1l43N27m53J53K13l99K38K1n85J51L35n69N39j72L4J36k93K53J42
3734A26j69n4L80m64L75m4l20K06k17J15J1J77l49K58o3m5K50k29P2j31L2J38
3756E5oj7k20J30j32J13j4J01O3k54k0K02j98J91J28j09J81j8P7j66p8P3j14j56
3780a88J11k36J67m03L89O1k4O0J35j76J11J77j63K63k68J53J13m14j28L42k01
3801a19N2j19j34L38k06m1mR5J86Q7q2j27L97l36j7K41j57J02k26l6JP6l51L35
3825d5j64K02K51l08J7L21k70K46nk50L34j36j96M43l20m24L58j93j4J95k51J96
3847a3k0j46J76J43J06Q4ll99N10o14L58m2l06j0J24n27L30Q8j63L98j93j19L56
3870A18k28K5L12m76N63q5m33M93l7o05L99P4l89J41j08j42N68n85L22M64o05
$$ y = [-173, 167, 198, -145, 382, -71, 82, 295, -104, 134, 155, -430, -279, 56, -513, 26, -146, -112, 24, -269, -16, 126, -43, -97, 283, -181, 194, 150, -170, 36, -181, -66, -55, 122, -227, 31, -32, -77, 173, -56, 16, -115, -83, 55, 49, 32, -188, -58, -190, -77, -91, 10, 73, -181, -201, 1, -197, -6, 122, 13, 194, 176, 253, 87, 9, 82, -32, -188, -77, -313, -146, -549, -160, -99, -123, -63, 72, -104, 7, 184, 21, 284, 16, 169, 282, -132, -260, 82, -119, -67, -186, -320, 18, -188, -229, -233, -138, 48, 135, 53, -74, 323, -13, -30, 211, 54, 156, -70, -106, -105, -29, -380, -45, -209, -7, 244, -64, -47, 274, 4, 250, 245, -5, 329, 193, -3, 440, 120, -304, 54, -139, -153, 42, -209, -13, -33, -179, -3, 140, 246, 330, 327, -72, 438, -176, 182, 140, -166, -176, -52, -579, -249, -161, -324, 74, -119, -238, 118, -110, -85, 227, -249, 314, 229, -204, 289, 252, -353, 46, 120, -269, -128, -236, -378, 190, -395, -73, 391, -214]
3891b14K83L62n72M59k49j50L50k90j92M51l82j1M78n38L6J83k35J55K64m73N01
3912B16o2l26O39m89QJ51j83M1L38m54r1L93n52M09Ml36M41p1j37M48m80K73J44
3935C24o07J90L65m98M20k37k71K36j78nL82l48O1M25l89J31M28n28P6M47m38
3956a4L00m25N1L8p9p2L31n06J68K27k41O0J76n0K57l23J34K85jm13K2N0O6R1
3980A32l33K32j31n2l8K64k44M05j31k76K84J05p2J35q7j79K71j43l32J80k25
4001b35K19j53P3M8j39rK39R5pK24k66K32k21l9o9K69l74J04L3k56K55l49J54
4024a72J7R6P0oj15L57j95p5J0J50n9J28j36l3J41k41j12Q7M0k52J5J83o9R5O5
4049a1r5J67J03k6j3J15J07l80m9M2K30k55p4o2Q3J16j99J7M91k69k10K94M6p0
$$ y = [-214, 69, 431, -141, 318, 69, -81, 269, -21, -213, 238, -144, -155, 323, -215, -179, 4, -231, -76, 188, -285, 216, 154, -172, 467, -22, -14, 137, -46, -5, 333, -121, -212, 181, -371, 38, 42, -294, 147, 76, -61, 387, -93, 180, 324, -283, -93, 272, -226, 194, -43, -314, -78, -256, -261, 121, -227, -166, 259, -130, 1, 429, -99, -23, 424, -14, 286, -139, -88, -50, -129, -201, 130, -376, -208, 19, -222, -162, 14, -36, 221, -102, 32, 317, 316, -97, -75, -25, 41, 132, -201, 31, -100, -152, -190, 74, -170, 235, 104, -172, 112, 217, 145, 280, 193, 14, 285, 142, -190, -10, -235, -16, -169, -96, -48, -187, -196, 43, 138, 131, 355, 89, 321, 100, 61, -8, 261, -113, -9, 24, -232, 23, -326, -172, -155, -59, 11, 5, -110, 247, 52, -23, -13, 137, 78, 206, 70, 37, 178, -63, -175, -88, -48, -300, -285, -102, -171, -76, -11, -106, 61, 164, 138, 125, 240, 347, -33, -82, -40, 190, -65, -139, -201, -118, -2, -201, -184, 307, 38, -172, 122, 168, 98]
4073I8O1k99K1K36m27L95j93j39M6O5p6L61l06J9K84l62M25r4k20Q1M1j22K84
4096A79l2j32J84k10j96L30m39R8L72l67L34m7j45K10Jk38M51k71l4J53l99J59
4118c9q0j95Q2K66l77M39k84N7K85o4j33Q9o1N0N29o66J36L46o95K99P7l46L71
4141H6j25j87L33j22J6L48m82K45J28l71K40K81m12K31K17r44O56l75m8M87n51
4162c49QM25l58J54L00l59M03k28M1O1P7k13J99j95k20L30k24J60Q4k97J64J85
4184A48o78M59j2j48M05k04r5L82k70p9K85k25r5J10j70L95m18j8K02j57J32J02
4206E1o0N6K83l18R4J74j48Q8j47k81M19j54k70L75m07K43rj36Q7J82k78J08K03
4229A55k27J62Mj04N9k19P3K33r8k73L47k45K2J0m6J21N9q2k5K04j00M9r6J4J90
$$ y = [98, 159, -140, -119, 117, -310, 85, -108, -247, -201, -136, -212, 149, -157, -138, 146, -216, 209, 115, -105, -24, 17, -105, 179, 147, 15, 199, -11, -207, 123, -316, -218, 154, -213, 121, 74, -71, 139, 140, -98, 353, 82, 48, 201, -198, -39, -119, -314, -232, 34, -343, 96, -188, -131, 154, 90, -43, 46, -15, 35, 564, -102, 34, 380, -315, -16, 61, -285, 86, -39, -226, 107, -15, 1, 349, -133, 112, 240, -131, 109, 390, -22, 209, 426, -518, 138, -237, -285, 202, -349, -341, 84, -274, -120, 180, -179, 224, -4, 37, 98, 175, -38, 161, -34, -254, 76, -148, 12, 96, -201, -37, 148, -530, -71, -83, -231, 174, -30, -125, 257, -13, -92, 193, -32, -127, -17, -187, 208, -210, -228, -26, -183, -51, 51, -9, 47, 330, 12, 106, 280, 132, 220, 73, -208, 211, 57, -213, 162, -245, -2, -11, -147, -60, 122, -156, -48, 155, -72, 90, 94, -10, 49, -170, -97, 136, 38, -235, 112, -133, -111, -101, -147, -26, 33, -49, -74, 130, 30, 79, -17, -3, 187]
4254A87j76o4L24m44K60l53nK30o4j02J17K17k06Q9J94m62M29j11J0R2k19J47
4276I0j21R9j59r1O9K29k93k9L06r8j49L24k27l1K11k47P1J72l40Q5K60j87J58
4299A02j72M6j01m4M9q9K29k28J88J24j44K40j45j4J18k01k8J78j27j70K39j35
4321h5j3q5M2J49l3k57L60J63m26K17O9RQ1l80M37o4l04M4q8k0J12M0l07M87k91
4346a43J3M23q0j95K39l05J58r1K30j40k25m2J43k72l2K66j66M8J89o7K1J22r3
4369AJ04m7k6K00k40k11N73m50P3p2j34Q1J68l71J28K44j63L21j39k53O53n85
4391a45L80L43p42K99O6j04K09m10j72M38j92j78J55j27J65K07m45L13nL3O6N4
4413B08k14O4j05j05K54j68j04J45p8j08K67j28P3J82k34K2J87p7N9k1k05J97
$$ y = [187, 11, -53, 271, -173, 87, -266, -271, -41, -105, -207, -90, 127, -79, 10, 204, -258, 171, 60, 70, 162, -57, 90, -31, 68, -91, -182, -113, 116, -177, -206, 100, 2, -147, 177, -50, -81, 130, -117, -46, 126, -214, -129, 131, -56, 102, -70, -24, -125, -169, -120, -209, 20, -208, -20, 104, -40, 200, 55, 41, 159, -42, -70, 108, -19, -189, 50, -85, -98, -183, -141, 8, -25, -282, 78, 241, -185, 32, 101, 110, 191, -189, 248, 184, -120, -76, -164, -184, -72, -32, -339, 148, -143, -130, 293, 213, 18, 257, -48, 110, 19, 249, 109, -116, -158, -15, -287, -319, -53, -219, -171, 18, -49, -28, 94, 1, 105, 58, 32, 232, -8, -219, 354, -96, -23, -95, -229, -148, 20, -351, -223, 21, -142, 179, 40, -213, 440, -145, 235, 578, -164, 135, 201, 97, 306, -104, -276, 162, -30, -208, -53, -180, -15, 192, -253, 60, 55, 88, 154, 208, -6, 58, -47, -152, 102, -66, -170, -25, -103, -211, 56, -72, 1, 183, -51, -29, 158, 81, 140, 119, -86, 111]
4435A11q8j57K84j70J60k02j91J37J76k13J94K9k7M9q1J56q7l3R5J99n21L95j48
4458F7r2L19l13j70K0J95q0K59l50K9L52j00j24J74j88p5J90j01Q8j87j86K89
4480A6o4j10J95n5L3L4J33o2j39R3J39j99O8J47k92k3K28j40k44K03j27kK48l09
4504b29J8L20k35K89J16j42J71l80P2L5j6K4M9j83JoK36j50J3j90L55k06O5R1
4528A18j4J11k22P6k12J64J05J7j67k70J87K80j81j29P7j02r2K34K50m3r5k00
4550a08Q7R8n3QO3l6j54K11j13P3j91o3J88O3j44L42k61J23J8k35J11J3n4Q1J88
4575B55l08N8j5j15l2j11K62qj68J61Q1k99M28j70K57j04k14K76k20q7lj38K12
4598bK6N2j83J41Q9l00J12k3J22J28k61L6K16p0k5J5j82J45J13k67J25k2j9J58
$$ y = [111, 23, -134, 150, -20, 140, -62, -253, -116, 60, -153, 41, 70, 43, 92, 11, 167, 80, 47, 142, 341, -180, 215, 67, -25, 294, -19, -189, -169, 26, -54, 205, -145, -116, 236, 136, 12, 186, -2, -77, 113, 12, 100, -87, -273, 16, -48, -158, 37, -18, 15, 49, 182, 120, -19, 74, 213, 14, 82, 229, -63, -86, 142, 2, -242, -39, -166, -168, 80, -229, -211, 109, -126, 163, 279, 137, 308, -72, 0, 35, 19, 43, 92, -91, -90, -96, 140, -10, 3, -187, 168, -38, 27, 118, 104, 215, -7, 69, -143, 21, 126, 143, -24, -294, -107, 173, -8, -137, -60, -162, -254, -20, 230, 187, 92, -108, -21, 77, 24, 32, 95, 59, -95, 116, 3, 76, -115, -178, 10, 73, -71, 271, 10, 133, 151, -84, 27, 40, -14, 67, 255, -53, 5, -10, -125, -157, -268, -6, -14, -182, -21, 60, -239, 189, 19, 276, 172, -42, 234, 14, -73, -76, -214, -2, 24, 76, -107, 34, 123, -177, -65, -88, 34, 162, -99, -63, 153, 83, 58, 73, -109, 36, 149, -118, 7, -15, -34, 124]
4622A24J6K5p8j29P5L32k30J42k15L2L49n21L70k25k5M4J4k40P6J38l49J98j1
4645h8O3K62k59m1L21l11J04q4j82L62j82l29L82J08m00K43j39k9L14k94J02L74
4667B97k76K47Kl27K80p7m23L88j49p6J39j92J71n9nJ36r8JJ54o8j80L98k87L8
4691C4O9J39m10K83k9j99K49k80O1J74j04r6Q4j93K09l6O6L04m34J64K86m10J31
4714F2p7j89K57q0P5j48M7%k14L06R5J09j87R3o1j79J55J36q8p4k10J62j85l4
4738b29J26R5m4J7O7j44K85n7j38MK41j7j50K7m2J81k03j58L32l68K92j95J05
4761B7J9K5j26J7J78o0Q9j00J10k62J85K11k85m2j22L0R4N7k1r7p3J24q9J64j66
4786a13K74o2o8J74j54j73K17l0P1o3q1j04J33j54N0k9J32r1M7oj5K0J20m9q6
$$ y = [124, 140, 165, 87, -42, 33, 365, 135, 277, 62, 94, 443, -78, 292, 67, 42, 86, 100, -140, -64, 74, -275, -77, -88, -25, 237, -22, -63, 258, -53, 51, -33, -215, 147, -35, -364, 18, 126, -274, -31, -170, -199, 115, -179, -77, 297, 21, 268, 270, -57, 223, 146, -277, 111, -38, -114, 25, -167, 4, -55, -60, 76, -22, -21, 133, 65, -115, 283, -4, 34, 103, 242, -168, 115, 86, -113, 136, -144, -83, 91, -13, -109, -25, -218, -9, -45, 21, 325, -109, 55, 341, -69, 62, -15, -204, 53, -27, 48, -100, -53, -53, -267, 39, 134, 243, 56, 149, 88, -91, 64, 200, 112, 38, -172, -10, -195, -229, -103, -8, -52, -35, 32, -112, 173, 116, -22, -18, 223, 206, 56, 83, 41, 222, 19, -139, 193, -175, 117, -78, 27, 46, 71, -55, -38, 140, 80, 169, 69, 179, -83, 102, 313, 28, -14, -136, -106, -12, 45, 24, -73, -146, -22, -111, 53, -113, 161, 99, 31, 205, 51, -122, 95, 65, 136, 73, -8, -112, 21, -133, -83, -112, 20, -71, -24, -30, -45, -25, 95, 46, -40]
4811d0K07j26J71r5n8k07l1O7L2Jo7K63k15J56R2k86K51O7j98J34j79J16k18m8
4835b11L68j92k15K72M5o2P6j07q6J47J16j71J01j86J49j09K2Q0P9j94J79l54
4857b53kM17k68k2j8J59k23L96k11O7q6k50J78K87j80j01N4M7J59j07m0N2r1m4
4881h0P9n5j0K38j05j56J41N3N6j26j78J25J00k58K57k67K27Q6m27K11K50l40
4903a79K87j21pJ14j3M2J28l56K72M5l04K87j69L3M8n3k30L27m62M33p3K9Q6K5
4927A89k34q2K77k56J54r9Q4m5J0j25J09Q8l68K54J28o4n5p0J31j24O8R3P2j68
4951c3N5j30j0P9k13J34kj08K84j77P5K90l26K9J58j49r4K27j56N3K44j78J0L
4975F5j20J85j64p4L1L1k7O7n8J4L2n3J68k9j35j4R7j69j4K09j28K93k11j04J58
$$ y = [-40, 167, 41, 212, 117, 59, -148, -179, -112, -80, -79, -146, 117, -98, 58, 150, -136, 115, 182, -16, 118, -61, 55, -163, -211, 157, -35, -250, 22, 67, 5, 81, -26, -112, 35, 151, -20, 81, -105, 44, -65, -43, 37, 116, -78, 101, -253, -255, 162, -106, -128, -146, 13, -210, 186, -25, 42, -44, -294, -116, 171, -9, -110, -56, -9, 150, 43, 3, 55, -36, -80, -1, -56, -66, 172, 67, -89, 52, 105, 161, 35, -143, -18, 82, -176, 81, -186, 41, 127, -300, -89, 161, -179, 108, -13, -20, 94, 81, 123, 251, -105, 167, 212, -92, 195, 26, 59, 107, 54, -176, 151, -311, 122, 49, 78, 164, 189, -45, -127, 150, -106, 48, -51, 33, -12, -2, -127, -18, 70, -298, -44, 84, 20, -35, -105, 26, -98, -30, 63, 135, -33, 22, -108, -118, -39, -252, -118, -120, -228, 56, -121, -46, 244, -82, -53, 105, -44, -138, 89, -67, -14, 230, 52, 62, 65, -55, 130, -34, -108, -77, -46, -73, -6, -64, -50, -18, -71, 97, 68, -67, -81, 16, -153, -167, 42, -86, 207, -4, -108, 50]
5000E0n0j29K59q6L00j14j55J04N2j67L4l0Jj14o7K33j24j58M5L1K08j4m1l3N1
5025H6P8l19J87J5j45J90j64R2j19JM0p5R0j37K77j01%j2Qmj11J8J79n9j8m7o2
5052a12r3K18m7r1k2j73J56K7Pj21L02o4j29L93j46K8o6p4N6j33J91l34K65j41
5076a03L33l52J18j48M9m2M46m1j76o0N4p3p1M7J98Jl17K88k88J85k27K16k51
5099b14J59J51k09J30j10K12L8j24l0M4q4K33l56J22J43l10L35j82p1Q5Q7j45
5121i6M8j79J75K4m8K20q4q8J28k1L1m00L87J2l7r9J35K5ok38R9J31j56J37j30
5146c0r7NJ02K92j77j96L20k59N9qk05O7J83k38R0J95n5M6m7K5J8l00L03N9K7
5171A79k34K00l69L47k81J46J95j63L6O2l1o3O5q6n9j12J05O5o2k14M49k34K2
$$ y = [50, 0, -129, 130, 44, 344, 230, 75, 179, 231, 64, 98, 68, 69, -45, -112, 121, -3, -161, -116, -85, 123, 109, 68, 35, 86, 164, -155, 32, 47, -98, 92, -72, 20, -99, -98, -58, -133, -43, -180, 97, -4, -4, -16, -8, -12, -123, -105, 74, 15, -3, -50, -112, -205, 13, -34, -125, -147, -320, -164, -137, -130, -251, 51, -13, -142, 251, 105, 133, 67, -7, 49, -84, 107, -227, 38, -103, 230, -122, -4, -152, -103, -145, 301, 260, 84, 24, 78, 5, -66, -19, 179, 180, -137, 151, -137, 48, -179, 37, -214, -55, 96, -113, 17, -93, 119, 157, 33, 3, 47, -37, 196, -160, -38, 105, -205, 130, -52, -123, -38, 49, -96, -48, -227, -52, -28, -76, 144, 60, -28, 100, 79, 110, -290, 97, 109, 72, -27, 108, 133, 127, -111, -12, 119, -37, 100, -30, -127, -122, -20, 272, 95, -101, 219, -40, 19, 11, -194, -127, 56, -182, -92, 103, 48, 94, 47, 72, 90, -210, 93, 152, 179, -55, 145, -224, 123, -158, -12, 183, 20, 56, 118, 87, 24, 89, 3, -56, -168, -63, 2, -60, -274, 175, -59, -37]
5194c7N2j57O3J66j60J5p6J11J02j52K45r0m7k59L57j09J26J17l21Pj7j32K03
5217Gj26K68j85R9k67L86J4k04J51j6m0o0rk3O3r6Q5o6k38N1J45j43J57N6K9l0
5243HM0K4J3N7m4J8k24J77k3o8j7K5p0J43n2p2R5L0j22n8R9n1q4J14K25j42r7
5270e6J54k30K60k0q1J2L2k36J57L5Q3j28J8J0n2L4L00k04k9L6l2j5p3K35o5k92
5296a47J97K7j70Nl7K49n0q3j7R0j82K63J39Rl13j00j28L68k86j5K50j68j03K83
5320H1k42N6j0K6Q7o1k8J73J08j29m8L3K0j21K41j36j17M4J16o4Q8j91L6J04k39
5345a73K29j03J66l4Jk09J28l3j4j18J9rJ81n3K7l4R1K4J05k17J1M1L68l19n5
5370B0J69k05j7oM6JM0l34L30m7J52J2j33Q6j17l6j9J32j57R7N4l00P0Q0j30J00
$$ y = [-37, 15, -142, -79, 87, -73, -58, -134, -23, 79, -73, 172, 82, 35, -224, 133, 24, 150, 267, -54, -47, -64, -196, 7, -119, 149, -36, 63, -204, 182, 196, -8, 143, 127, 87, 27, 18, -5, 58, -38, 47, -19, -257, -206, -61, -204, -47, 9, 38, 8, 48, 72, 85, 142, 98, 116, -108, 69, 46, -22, -39, -14, -84, 59, 7, -65, 30, 60, -62, -120, -21, -72, -156, -42, 183, 41, -56, 98, -132, 128, 108, 27, 39, 71, -165, -8, 27, 110, -18, 0, 10, -42, -8, 292, 88, 59, 95, 63, 48, -25, 210, 145, -147, 50, 77, -93, -88, -125, 124, 74, -9, -26, 64, -118, 145, 284, 293, -20, -120, -248, 120, -166, -181, 69, -99, -202, 81, -161, -105, -115, -89, -2, -63, -91, 82, 190, 61, 13, 46, 66, -55, 186, 50, -67, -23, 93, 29, 117, -74, -38, 66, -173, 56, -47, 119, 85, 86, -123, 5, -28, -42, -160, -141, -150, 31, -22, 5, -29, 62, 86, 191, -26, -15, 26, 394, 75, 20, 189, -16, -33, -39, 7, 8, 48, -286, 44, -3, 149, 161, 28, 114, -3, -39, -58, 74, -83, 14, 68, -232, -162, -82, -212, -112]
5396a12N9l4lk8K04k1M6oJ48o08K33M5M9J11o5N5k69J43p1K2P9O5p3J4M6k19J97
5423GK42k96K07M2j28K4j31P7Mj60M5K57o8l06Q1m2QRK75j53j8K22k86j59J46
5448a01J27O8k23M7J28K1p7K0K1j13J15O3r7J5J83k58J71K12j90q3P3k26L1J76
5472A03k13J89q2o1j75N6K45j27N8q0O0j4J11m0Qj89K81k39L52j70j99J13q1k3
5496a17P6J42q9m3MM6K1J98kl42K50k4j35q8K20j72J03j03k72L28o0m5PJ2o1R7
5522d9l3M1J18q4r9m9J09k67K00J01K63j49j36J15r1P1M3nj65K21j35J92k64K58
5546B06k55K86j46k95K19p9J25j62O6J83j03j39J1K49l0o8lr2j46K67Q7j64L8
5569E5J3o3q4J7P5n0L6j6j8K2J20j3j0r9J30R6j24j3j06Q3K9m5oR3j22J01l21
$$ y = [-112, -53, -87, -90, -118, 86, 65, 111, 105, 253, -355, -122, -77, -28, 83, 18, 73, -196, -53, -124, -102, -23, 42, -31, -17, 29, -190, 7, 249, -47, 160, 202, 74, 98, -33, 44, 48, -112, -67, 190, 122, -184, -103, -145, -137, -128, 147, -6, -24, 198, -88, -247, -101, 26, 94, -129, -82, 46, 67, -10, 10, 31, -82, 33, 96, -1, 14, 197, -61, 110, 322, 132, 49, 122, -104, -73, 103, -110, 79, -3, -64, -239, -183, 62, -65, -7, -87, -27, -41, 70, 30, 38, -151, 130, -109, 243, 73, -126, -13, -94, -117, -41, 101, 12, -31, -27, 19, 40, 238, 236, -106, 144, 120, -15, -103, 117, -55, 48, -55, -327, 1, -59, -104, -97, -85, -146, -49, -82, -41, 77, -7, -106, -155, -46, -313, -113, -12, 251, 102, -34, 81, -10, 61, 104, 99, -66, 155, 20, 212, -52, 206, -49, 237, 91, -204, 15, -64, 61, -101, -35, 148, 45, -94, -83, 166, 136, 68, 65, -27, -173, 94, 181, 17, 55, 68, 5, -79, -62, 13, -37, -1, -17, -35, -13, 107, 94, 84, -15, 115, 211, 87, 74, -32, 51, 80, 35, 29, 122, 0, 101, -220]
5596b20K11Lk37M31l06J55R0J75k53k26K40k4k7j53J87j55O6j0J98ok68J31K7
5619B9j76K42r9m2M22l62J88k49O5kL1K3k07P8J73j31p7J60p8J12M2k57Q5%J16
5644H6j10p0K26Pj25j65K91l14K56J2k73j1K3J10K34k98K08j03K0n8K05k47K78
5667A82M5j58j66R1P1k65J67j26J59k81M07j05r9K04k63K75p3j68J72Kj6J90k83
5690c8j1qJ32n8j5m5M8j0L1j61K06l6L4j73K52j92L5j48K28l4k3N5J35k26K04
5715A82l18J48Rk16J29q9P0J68K03q4q2j16J04k05K88j06q1q6J15o5j2K49j06
5738I9l61L03j29p6K82n2P7r7o3J4J6P1p6r1M8r2m9J69Jl7M9l3k09L51j9j2Q7
5765A71j63m2L33m52K8J18O8k3j93J71j8j02n8L75p8Rl2N9j18j01K06j48m4M0
$$ y = [-220, -9, -6, -243, 188, -118, 37, 127, 302, 49, -177, 63, 39, 12, -141, 46, -109, -43, -53, 145, 139, -129, 2, 29, -147, 95, -4, -46, 376, 14, 202, -47, 18, 16, 47, 70, -137, -59, 114, -17, -94, 66, -12, 100, 142, -115, -30, -30, 86, -24, -94, 132, 139, 14, -151, 140, -174, 82, 94, -179, -190, -167, -57, 177, -121, 87, -16, 4, -54, 151, -96, 182, 227, 69, -97, -6, 65, -200, -33, -159, 0, -281, 126, 21, -78, 126, -137, 138, 65, -103, 69, 71, 55, 245, -38, -49, -57, 75, 17, 2, -43, 5, -5, 26, -135, 71, 35, 69, -104, 148, -44, -9, -157, 71, 37, 14, 69, 204, -22, 182, -136, 12, 21, -195, -66, -155, -85, 83, 286, 202, 120, 4, 108, -97, 191, 85, 4, -82, 33, -32, -44, 205, 99, -262, 41, -88, -164, 118, 66, 143, 46, -17, -3, 13, 84, 8, -83, -35, -127, -176, -7, -6, -43, 6, -27, -236, 115, 96, 84, 171, 8, -34, 299, -153, -125, -7, 61, 38, -155, 16, -2, -104, -162, 213, 135, 144, 112, 171, 53, -48, 158, 10, -34, 6]
5789FM6oP8l6q6lp5R0N6k24K19J38j39Q1Q4j88Q9j21j32J71j58J53j20j7M8j07
5815a53J97o3oO8r5K28o4l12K09j51K89l78J60O4P7K3k2k27P4l7nK88l49K17k5
5840Gq7J72Q1j42m4J10j77O0K9j16k04L80J68k58m0J04q9K41k34L2K0R9p5l0j32
5865a25lJ29N9j01L26k36k2oq7o9L1J69q1J70j33J17k07P4K6r5k1j07K14m0l7
5890e5n9o4L68l91P9JK44K8k52J26J97q7l28J73p3nR7M3m5O1M1k85L9n2O0J21
5916a8r1J9j02L06j32J05j03P3k46J59J57n1J2o9k31J29M7j13K27j33J18R6L2
5939A91j69J03l03K31L6J09k46J39j40J07j73K04j9p2k3J15j02j35J86J40j26
5960E3k99K58Q4m4j92K32k1j16QJ18L9o1k05L5J46O1j37O7o8k3j06K05m8l2k7
$$ y = [6, 52, 46, 124, 88, 2, -1, -76, 14, 70, -154, 65, 203, 64, 145, 229, 41, 130, 9, -123, 48, -110, 43, -77, -94, -46, -153, 44, -19, -25, 43, -52, 176, 112, -200, 9, -142, 147, -231, -71, -7, 70, 93, 71, -156, -82, -119, -124, 164, -185, 32, 7, -80, 92, 173, 31, -13, 97, -80, -20, 9, -107, -311, 69, 237, -21, -61, 43, -46, 195, -39, -7, 13, 112, 37, 7, -125, -128, 1, 60, -41, 285, 49, 27, 21, -66, -135, -104, 65, -16, 154, 21, 138, -69, 5, 31, -64, -85, -192, 22, -18, -55, -114, -178, 190, -201, -122, -121, 123, 151, -101, 25, 222, 135, -193, -20, -93, -98, -1, 42, -3, 58, 99, -186, -147, -199, -139, -18, -109, -90, -192, 114, -18, 87, -16, 57, -189, -30, 127, 76, 88, 19, -212, -83, -36, -149, 78, -55, 63, 159, 191, 22, 125, -178, 53, 89, 198, -48, 91, -49, 58, -115, 89, 70, -2, -25, 90, -12, -147, 39, 179, 53, -246, 12, 96, 52, -140, 92, 71, -45, -37, 81, 120, 59, -146, -111, 35, 96, -41, 26, -42, -65, -171, 34, -14, -46, -73]
5985g3l5J90l4N6j46q5K03o6J14p5j03R4o2j05%Q8J14N7j12qJ72j00j69j69J85
6010f9Q0K4o1k7oL8n0m6L51l27J26m5L3m3K30o9j89m7P6l8O6j23k22J90r5J82
6036f1J56j08l8K90q2l7n3K0j43J15J3k6J21k16Q9oj07P7P1l03L17k57K57j70
6060h1j6J60j11R0j87L13m3q2P9Rj30k59K84p6P7N4r0l8Q0L9r0j06K91j6l16J37
6086b8J82n4k49J72N5k61M07k34k0R8o3J34m8p5K36j42M3j55j50P2R8j8J24k5
6110I9j87Rr9J5L01j06r4O8R7l13J31K01p9J11Q2k44n4O8n4O1M7Q0j84r3J38j65
6136a64K39n1j37n4K56p9O5K1J47k63K7M2k94L52m6j5M7k53J17k6N3j45M8K04
6160I1k8m3O1l28L48r0j67K2r9M04j64m1J90k64q7K63q4Q0O0j42k18K01O2L0j39
$$ y = [-73, -108, 82, 48, 104, -42, -127, 76, 10, 124, 49, -54, 40, -22, -127, -127, -39, 75, 132, 20, 12, 184, 84, -85, -254, -69, 11, 35, -26, -53, -59, -21, -71, -117, 234, -93, 33, -12, 21, -22, 208, 139, -50, -97, -21, -59, 7, -116, -338, -148, -243, -61, 95, -13, -51, 239, 157, 120, 67, 87, -56, 59, 72, 46, 167, -49, 40, 34, -73, 4, 75, -228, 89, -168, 89, -81, -97, 63, -48, 42, -145, 168, 125, 43, 122, 131, 1, -258, 26, -50, 27, 81, -9, -47, 33, 72, -18, -124, 167, 151, -165, -28, 154, 100, -149, 23, 78, -183, 224, -10, -30, 68, 5, 139, 91, 16, 252, 110, 153, -2, -152, -80, 18, 0, 124, 99, -88, -79, -178, -163, 138, 32, -62, 6, 103, -210, -79, 122, 43, 154, 236, -8, -62, 6, -48, 13, 60, 140, -44, -137, 1, -164, 75, 24, -113, -167, 89, 10, 75, 96, 243, -20, 7, 49, -245, 107, 61, 46, 93, -160, -43, -69, -16, -161, -113, 91, 63, 20, 81, -247, 101, 11, -156, -134, -233, 171, 7, -34, 156, -108, -195, 68, -16, 64, 124, -18, -236, -35, 27, 57, -82]
6185h2m7J94Mj12M5R3p2q9J44k39R2L3J72n1Q3r5j71J00n8k4J29j4k09J88n2j53
6211a91L19l05J78J10j72L4O0j84K16l6o2L90l93K2K5K03l96L31o6o0l6k20J94
6234c9P2j99K28J68m64J39K38M4k16O2J02j14l3j95K26O0k13K46Q3j48o7j21P4
6257f7K0K47j07j71j5K67k94J41J47k46N2p1Q4pk5J29k03Lm3R2r6K52M7j40j17
6282a21J47K19n0j36k5J1q9N6J6j02J0J14j91J81j39J23p9L8K30m9j0j15r7Q5
6306B7o0mJ49N2l95M02l79K16O5l24K09J24k02K25k23j6N5J70P5r7j60K94m3j38
6330B2K25m91K14l2P2j55L25k58j67L11j77J98j54m1O1j60N34j94l18N6n9J21
6352f7N9j15KKJ85Q9Q7k33j1j7P9j65nJ66k33J55J18o3J24l96J30J25N0J42l06
$$ y = [-82, -129, 65, 69, -43, 2, 95, 23, -66, 78, -161, -69, -36, 136, 85, 168, 73, -98, 2, -56, -80, 49, 35, -174, 14, -38, -191, 128, -177, 1, 111, -61, -27, 33, -151, 65, 29, -33, 357, -36, -14, 11, 214, -182, 149, 83, 23, -13, -233, -39, 33, -166, 62, 230, -234, -95, 143, 187, -29, 33, 135, 21, -12, -207, 19, 79, -134, 112, 195, 47, -20, -141, -67, -47, 200, 93, -78, -93, 174, -120, 21, 168, -78, -26, -97, -13, -20, -45, 84, -119, -116, -159, -67, -163, 89, 136, -4, -121, 26, 245, 195, 59, 34, 45, -44, 12, 28, -74, -64, 50, -141, 40, -99, 24, -55, -17, 213, 164, 154, 39, -58, 27, -33, -37, 112, 164, -231, 171, -208, 8, 73, -251, -42, 82, -120, 105, -118, -134, -79, 91, 166, 69, -91, 203, 160, 22, 247, -244, -30, -62, 10, -145, 180, -78, -245, 66, -111, 87, -67, -108, -47, -207, 327, 133, -185, -129, -188, -67, -8, -123, -121, -119, 66, 155, 242, 9, -2, -19, 60, -105, -110, 56, -177, -22, 96, 33, 157, -239, -109, 16, 66, 208, -98]
6377i8J35j23K27j20P0M6q5m6R7j0j57L3k4P3j31P4J09j00P0k5O0M8k97K50k76
6402b00K50J20j81Q3J4q1j93J97j53q0J10J17j19K30j67j49J62Q2ll3M1o1N2J0
6426D8R7j26J46k04O4j93K52k27K69k42k1K71k05R8oK0l0n9n0J01n2O3j3pJ89
6451A83l30J04M0J34K5j76J00P9j84j13R7J2N7K9J59n4m1q4q7o7k4nJ20R0j97
6476a33K91j38J1j5K20j13J7Q6l34R6j18J25K09k37J28k7j23m0J2M0J03n8q7J50
6500F5O0j02j5J98l99K23pJ3R8j82o8M0P3L2p1J52q1o8J10J63m34L33r7p2r5O2
6526f9j36J83j45M09k26k24J66J26m45M25l23J51J54o5r5LK74j74K7J08Pj84p3
6549a26M27m32K56j59j14J08J15j76J56Mk56K57o3k07L61p8r8q1J27O7j62qj8
$$ y = [-98, 37, -86, 141, 21, 91, 137, 52, 6, 103, 93, -64, -31, -55, 18, -113, -39, 70, -30, 40, 15, 75, 123, -174, 76, -200, 50, 170, -11, 72, 86, 5, -188, 9, -144, -224, -114, 3, -116, 114, -53, -202, -40, 42, 39, 6, 47, -14, 38, 48, 145, 19, 165, -39, 25, -168, 84, -143, 126, -116, -137, 134, -71, 27, 21, 41, 11, -48, -98, 3, -49, 14, 1, -6, 183, -147, -43, -3, 131, 156, -20, 80, 159, -25, -138, -41, -29, 28, 57, 216, 162, 121, 37, -50, -117, -141, -146, -26, 64, -133, 158, 20, 31, 16, 236, 123, 140, 226, -108, -12, -130, -5, 204, -33, 95, 68, -55, -95, -83, -43, 60, 2, -85, 65, 125, 23, 8, 206, -193, 30, 23, 36, 134, -48, -116, -76, -3, 29, -42, 110, 29, -39, 71, 234, -200, 133, 36, -36, -131, -69, -205, -22, -167, 242, 16, -208, -42, 84, -361, 64, -259, -108, 46, -19, -114, -111, 163, -11, 16, 124, 131, -53, -126, 301, -131, 125, -34, -148, -40, 75, -101, 55, 59, -197, 60, -3, -210, 151, 73, -25, -106, 21, 88, -74, -82, -100]
6572a00q3J70P5m6O1j25J09j7N1J01j17p3m7J72Q8m3l39J49M9j27O7J3P9j61J01
6597GQ4j60j9J8M2rm4J03j05Kj1Q3n3K44l00K2L7J66j57m9R6L7O2k9q8N6j12J79
6625A02j20j89J82K30l78M04k91o2l2J34k9J06J00o5k01J21m8o7K42j63J81k11
6647e4M4kp1o9k6J49j11J32q1J8j08J12L69m03L79m06J88J9j44K35K4j69L7k39
6671a77L70j42j51l7K04q0l4r2J51J10j95K48j11k08M03m00%L1J09j40k3J16j05
6694a53L79k82jJ03k5p1J77k14J08J17j5Q5j81m7kQ8j32J27j36Q9q5r1J82O8j34
6719d6K00J3l33J02J07rJ30M1k32k4J90k73L02m3l02K81j75Q3N0M5L1j05M8j16
6743c5j7R0k10K54j37J15n1J53l90J77N3P0q8P4J30j38M4j12q8J86K2j48J55k11
$$ y = [-100, -183, -13, 62, 16, 77, -48, 61, 44, 95, 196, 79, 6, -41, 131, 219, 176, -163, -14, 35, -92, -25, -12, 67, -94, 7, 91, -69, -88, -70, -28, -37, -81, 22, -83, -81, -92, -9, -62, 182, -118, -96, -59, 107, -50, -99, -3, 34, 96, 67, -21, 35, -77, 102, -18, -207, -25, 205, -173, 231, -60, -122, -154, -20, -49, 57, 157, 92, -109, 12, -36, -103, 139, -24, 157, -54, -10, -12, -83, -152, -178, -29, -140, -8, -89, -71, -179, -67, 302, -101, 278, -128, 60, 79, -65, 170, 194, 25, 62, -177, 193, 51, -100, -137, 67, -13, -47, -139, 12, 122, -73, 175, 64, -144, 259, -141, -141, -110, -1, -141, -164, -48, -153, 226, -56, -57, 46, 21, -50, 127, -87, 21, 138, 123, 208, 27, -20, -22, 66, -66, 61, -75, 14, -71, -162, 20, 88, -46, 154, 167, -166, -64, 43, 34, 164, 205, -27, -51, 139, -134, 168, 125, -177, 104, -71, 12, 62, 107, 138, 33, 81, -35, -52, 38, -172, 82, -55, 60, 9, 162, -228, -51, 2, 72, -16, 58, 188, 50, 94, -18, -106, 80, 102, -46, 109, -102]
6767a02J21N5k73J64L3j27L20l14J41l1j4mP4m8R8j81J7J46j35p5J45j99L45k12
6791e6J15j03O1L8j77J26q7j4L55k52m9K14o8k43J29n1K29j75J74l7J5l67J32
6814i1J47JRj10R9j91K59k01K8J67j67lNM0k1J63j09k1O2j93J29o9K06k33J5J53
6840G4Q4k12RrL1J26O2k23O3k56J02M50m36J11L7j04KK1J36j11L9r8m9K3O3L03
6866B38k81J06j80J64M1j62J82k8j9L2j94n0J39j12N6J05R5j17K5Q4r5r1j8J84
6890A04L9j01j36J31R4l45K14j30QO2j51K00K7J8j05r1l8L57o0k25J50M5O0j1
6914A16n8k04J67j51K40Jj19J31m63L24K3l5J73o6j28K0M2j9J97j9l01J90k31
6937a70J14Rj0q6K60j85M30k98j16J09j64N1J1J18N7l2qj90O0jQ9J6m4j2o2Q1
$$ y = [-102, 19, 74, -199, -35, -2, -129, 191, -123, 18, -13, -27, -31, 43, -5, 93, -88, -71, 75, -60, -135, 10, -189, 156, -56, 59, -44, 17, 55, -122, 4, -83, -97, 258, 6, -43, 171, 103, -140, -11, -62, 167, -8, 166, 129, 144, -223, -91, 56, 57, 66, -44, 55, -136, 123, -78, -50, 117, -50, -53, -48, -8, -29, 134, 25, 4, 66, -127, 2, -67, 139, -94, -79, 74, 158, -54, -45, -54, -23, 103, 165, -58, 5, -251, -149, 301, -135, -24, 13, -91, -89, -68, 68, -43, -4, -102, -151, -128, -65, 238, -43, 63, -117, 47, 88, -74, 108, 80, 61, 93, -101, -151, -12, -124, -68, 37, 132, 15, 40, 124, 29, -62, -80, 104, 143, 42, -94, 37, 131, -214, 0, -130, -122, -60, -211, -11, 16, 34, -71, -162, -200, 157, 97, -128, 22, 67, 127, 116, 58, -146, 21, -130, 110, 111, -8, 123, -340, -16, 7, -28, 145, 79, -49, -29, 13, -6, 191, 172, -129, 61, -170, -56, -47, -57, -143, 117, -68, 362, 64, -52, 57, -107, -56, -45, 73, 130, 98, 90, -100, -40, -41, 48, 64, 20, 8, -54, 27]
6963B7j45lK63j29m9N7L9k45K33K9j56L41n33L00r1q9J45o3K37q4p7J57j17K4
6987G1j10p1K24j39P6j69lQ8l7J48j30N1O2o9j76K51J12k27O1P5j83J62j42J47
7011G2l25J66K07l06K79n7m4j1J16Nj99J1P9Q4p0j13K47j34L2J40k45M6L2m4J57
7036A25k12Q5r8K40lK7j53r5K39n2r1l0j08L70j59j50Q8j1N6j25L8K3j0J73k25
7061e8P9q0J49j11j72J61J2k80J44K20oP7k21J52k34L76j58j13K0L9J88k00P9
7084F3j90Q2M6K8J08R1l12J25jn6r4j52J73J49K10m20O3J62j04J79l54J57N5L8
7108D6j43J47n4j5J24l24J62m7J14O3j45o3L10j38K4J1K9o6p9J09n5J12l4K6j00
7133A4o3lm1J29lL8q8L0k72L58J88m82K82j63PK4Q3q1R5j69K05k73K53k08Q8J37
$$ y = [27, -118, -121, 142, 13, -36, 21, 60, -185, 48, 77, -79, 262, -271, 29, -62, -151, -6, -69, 168, 84, 7, 164, 47, 71, -39, -110, 114, -25, 51, -118, -121, -33, -70, 78, -52, -1, 61, -8, -184, 67, 179, -48, 13, 88, -95, 67, -75, 72, -253, -87, 120, -186, 93, 36, -8, -19, 97, 102, -97, -86, -7, 77, 7, -106, 141, 7, 39, 179, -66, -20, 12, -32, 125, -87, -2, -100, 140, 137, 164, 11, -84, 155, 103, 12, -18, -126, 244, 85, -65, 23, 12, 68, -57, -19, 4, -6, 167, -58, 21, -59, 90, -21, -193, -32, -20, -300, -156, 64, 58, 135, -86, 66, -168, 208, 50, -63, -43, -4, 184, -16, 63, -127, -45, 1, 29, 137, 228, -84, 41, 40, -16, -110, -262, -89, 60, 270, -150, -87, 75, -29, 150, -204, -47, 8, 46, -97, 50, -4, -19, 105, -219, -57, -104, 10, 73, -72, -135, 175, 37, 61, 72, 101, 35, -44, 65, 10, 122, 88, 114, 14, -49, -52, -93, 36, 33, 71, -17, 13, -259, 99, 287, -195, 87, -76, -69, -45, 38, -43, 52, -117, 88, -185, 68, -140, -52, 85]
7159H5j34J34j57Q8j7j74K61j17J29l6P4q8k18M54k73n4l4P7p6J11m9J47l31K06
7183Hl3L4j89K07L1j7M4j37N8n8r9K72k60J28O6j29J08J21l56Q1P8N1L9L6m7j76
7209a39L11k49P7N1n0K3Pl6J47q8LK16K5m42K64p1j45j9M6O4q1RJ68R1j74n4m0
7236h6J40j67M2K19j30p7p9P0J01J51k49M3Lk3M1J44r7k8lJ59j11j60L29k39P2
7261F5p0j67J71n4K17k02L12j52j28nO3j4k7M2j43O2q6J54j37K03o4M4r3K9j39
7286a19N1M2J71j89J3J87r8j66K54L5k2n9j62K31k99J32q2J27J2l7qp6J13j04
7310e3J47l23M10l01N8K91k42J67l04K41J8j73J15o1p3p8K15O8o3j56J30n5j2
7333c4P6k9j33J92p2M7k70K89r0Q0j96R5R0o7Jl0K34l04J30j30J23O9Ko9J41k27
$$ y = [85, -49, 85, -72, 16, -1, -175, 86, -31, 98, 62, 136, 48, -170, 284, 11, -43, -77, 0, -76, 35, -14, 133, -198, 8, -25, 9, -180, 27, 58, 41, 85, -52, 6, -52, -151, 121, -139, -11, 55, -74, 34, 155, -201, -120, -42, 9, 48, 84, 37, -139, 172, -77, 0, 51, 1, 24, 31, -5, 142, 54, 57, 273, 298, -144, 120, 49, -96, -115, -69, -5, -86, -77, 91, 182, 8, -46, -86, 54, -113, -71, 148, 18, -59, -138, -68, 33, 184, -65, -22, -19, -42, -1, 143, 46, 18, 15, 174, 63, -97, 232, -7, 65, -5, -172, -1, -55, 162, -40, 272, 120, -8, -13, 50, 36, 9, 51, -92, -30, -116, 38, -99, 104, 40, 84, -9, 20, -119, -68, -26, 145, -44, -31, 156, 58, -108, 146, 181, 159, 100, -62, 169, -130, 2, -80, 47, 59, 22, 14, -62, 51, -53, 94, -229, 181, -120, -62, 229, -13, 154, -150, 91, 109, -64, 51, -10, -83, -161, 54, 122, 59, -97, 33, -22, -34, 42, 13, -120, 72, 0, 47, -223, 66, -24, 56, -140, -45, 45, -22, -21, -51, 183, -121, 9, -121, 2, 71, 73, 4, 145, -82]
7359h2J56p7K56m9k57L4j25k6M49l42J43lK6J5j23L8J36j34k34P3J91NJ3Qj67
7384g6o3P0Om6J8j64K72j27K12j9q3M0o2j20J37nN0J31k34r3M1K71k37J55j69
7409i5K71p5r7k57M00N3j6j34R1j06L4j13m1K44r0L7k52J55K9k8j64K31K7j81
7433g7O0K0j14L4J72J04p0p9l3j16R7J3j28J20n8L8Q8J1m7J06j17j31K45k05o0
7458a27K3l8J81p2M5j53K91j52j56K14j6n1j56K76Q1j55r0K32j06j16J80j82O8
7481B1nk74L92k26J88j0q8J38j52m4O1Q9r4J35n5j39NR8L0j92K7N5q2J65j31M7
7507d1j9J9L11m54J33L4o5q7Q1J20L6k50N6J52Q2q4p5n9K14j33kM5K3j0L6l4j
7534B8J11k7k13j7Q2j16J08J00k68Q2K13q2j78K90j40k42J40K00NN7j53j8J66
$$ y = [-82, 74, -3, 253, 204, -53, -19, -144, -170, 279, -63, 80, 77, 103, 118, -5, 33, 169, 35, -199, -126, 65, 70, 83, 91, -76, -139, -69, -63, -109, -91, -255, 17, -110, 102, 83, 0, 40, -22, -142, -5, -10, 40, 171, -63, -156, -115, 156, -81, 74, -95, 176, 101, 4, -253, 147, 200, 184, 50, 141, 35, 69, -44, -85, 159, 69, 106, -146, 9, 38, 10, -154, 77, 104, -77, -17, 3, -111, -77, 95, 199, 129, 50, 17, -99, -2, 11, -117, 3, -55, -17, 71, 82, 35, 141, 24, -107, 138, -67, -127, -104, -142, 39, -33, 12, -141, 150, -2, -158, 56, 40, -11, -167, 109, 190, 35, -55, 177, 71, -45, 135, -47, 21, 16, -258, 134, -92, 96, 86, -2, 136, -16, -60, 1, 90, -4, 131, 76, -63, -58, 40, 70, -122, -95, -40, -122, 43, -88, -41, -60, -41, 270, -184, -51, -17, -82, -169, -88, 32, 68, -182, -126, 26, 108, 24, -51, -110, 104, -29, -31, 14, 37, 27, 63, 29, 28, 139, 112, -101, -118, -36, -152, -44, 56, -212, -130, 83, 1, -177, 113, -27, -269, -129, 71, 76, 133, -20, -38, 128]
7557A28k0k3R8j69k1j6j77J05J15N1L5l38L62p2j62kJ51L6j43J36o5p3K2n0rR
7583i2K62k36P8Q8j44p8J43O4k1J38n35J53J97L8q8K9Q3j42J61k40M2j50K61q9
7607g8j0J1k4R5j22K0J23M5O0q0J3j55N3J97j83j3J82j54r1J25r2J29j85J61q1
7632e4n4k8J89j92K76l28L10r9J4j67J78j4j18J7m6j8J20j39J19po2l9O6J84Q9
7657A97l79J75L1J16j66J45j12R2q6j20P7k3K46k37K35J6k43n9K5K62j83j72K06
7680D3P9r5j80p4L0O4J94N3k83J37rk8J30q4k8J08J58j27k61J54o8r9P3J06M8
7705D1k09L36k05j49J21l0o8K62k69K33Jj82N4J06l5L3p2J25j65nK07k64J5k0
7729a39J93j48M3P3O8j4k1j38Jl3J7J84o4O7J99k61Q0j67J5J01mj34J25J73k88
$$ y = [128, 108, 85, 183, 14, -7, -23, -200, -95, 20, 71, 106, -232, 130, 58, -104, -106, 45, 81, -62, 74, 9, -64, -42, -92, -101, -92, 170, -66, 12, 100, -44, -122, 21, 85, 64, 202, -333, -180, 17, 55, -33, -4, 79, -63, 98, -142, -100, -250, 11, -78, -88, -77, -101, -6, -128, -108, 15, 60, 120, 40, 53, -102, -49, 148, -35, -48, 134, -20, -111, 14, -78, 51, -134, 27, -54, -108, -136, 53, -139, 137, -191, 119, 20, 34, -133, 45, 31, -87, -70, -116, -134, -14, -153, -34, -41, -103, -142, -76, 108, 197, -182, -7, 24, 140, -26, 119, 7, 99, 13, -107, -30, -53, 193, -44, 191, 207, -36, -95, -70, 192, 9, -163, 43, 122, 27, -153, -227, -197, -133, 61, 114, -169, -32, -41, -69, 61, -23, -51, 57, 215, 88, -173, -19, -87, -186, -113, -7, 41, -168, 168, -37, -186, -65, -95, -163, 99, -170, 63, 64, -118, -64, 42, 7, 40, -32, 93, -72, -77, 130, -134, -119, -139, 54, -94, -51, 22, 90, 76, 55, -83, -82, -115, -98, 86, 22, 89, 288, 27, 107, -60, -45, 56, 52, -82, 43, 216, -72]
7754g2J5J01P0K1j80J13k2j7N1r7m0m6K58j78Q4q7m4l4K12k06o0L23L1j94KK53
7780B57j61j75J56J73j98j58J42K03j96j73P1Q4j90K04K3k20J14j04N3L11o4l2
7802A20k32J41k56J50K56l04nJ05K44j28k08L74l25N4n5M5K09l12O4K38j88K5
7824A2Pj20O0M1j07L61k51l0K21M3j53o7l1k11K49j11N1OJ46q2k42O2jK77j02
7849B8j08J98k07J17m7J48j49r9J70J24j19m0o3K68l35J29J14M6j18m9m2J11k28
7872a51O3L02j05k77L50j2k29PR8q8j08J64K5k5j05j32L12n1l02J04J49O1r8J14
7896F6J5J50k25m9J50k54o1K71j93J96L2j11R5J36R0k58J13j52qKM0o1L7J53l6
7921A38L6l50J67K9j15L5J46j61o4J13pM2Q7J1J5j52O5k1j03K37ok64L27r0k86
$$ y = [-72, -57, 44, 114, 135, -45, 68, 46, 29, 80, -17, -57, -103, 155, -23, 61, -26, -70, -104, 108, -98, -158, 165, 196, 2, 4, 257, 96, -79, 77, 250, 52, -106, 36, 239, 43, -130, -59, 25, -165, 39, 62, -158, -44, -148, -95, 216, 152, 120, -112, 29, -227, -77, 179, -125, -130, -25, 219, 91, -117, 257, -68, -14, -69, -24, 185, -127, -63, 175, -13, 12, 19, -101, -41, 0, -107, 254, 3, -27, 194, 237, 84, 17, -14, -225, 24, -87, -36, -30, 116, 34, -208, -146, -147, 130, 28, -80, 118, -89, 28, -19, 129, -20, -119, 51, 175, 56, 16, -47, 221, -114, 15, 129, 175, 57, 8, -34, 77, -151, -88, 214, 109, -168, 182, 170, -59, -52, 46, -42, -150, 14, 39, 14, -91, -223, 89, 38, -264, -160, -11, 50, -48, 66, 81, 231, 6, -43, 107, -147, -208, 63, -130, 66, 98, -13, 82, 218, 308, 50, 163, 11, 3, 5, 45, -16, 21, 174, 138, 174, -176, -9, 20, -95, -60, 86, -75, -139, -26, -33, 9, 96, 107, 122, -30, 35, 14, -89, 148, 142, -122, 205, 115, -171]
7946a71K01k19L78q9j13Q9j20l8q0L8J2N7J4jQ3j72K23q8J6j09K63k74n7L54j28
7971F9q9L17k48k3m7O7m0Q0j19J23P8j60k4m2KP2j54pR1L5J66%p1j67M4j47K89
7998I5j2j17j41K06j31M4R2K3R2m3l9j26P8j12R2OP0p5J29j03n3K06k37r2K98
8023A50k60J13p9O8K70m46R1J28N1r7K59l99P2J61k05J9O2J34Qk14l2N0J54j86
8047a28N4J11J1j66r7N5j6J89j67J99m1m4o3J38J03k32N9K30j64J81k65K5M5J59
8071A76l16L21j64J64j20n8p5K2Q5r3O1k38J54M2J24l7J04K5j01k45O9L57m18
8094a61R4K02q2j69J99l7k97J75Q4O5J23j74J8J0j83n4K52O4J9mj15j60J08P7
8118E4k97L23m8m1O3j33R5L3k3j52N7LK27j60P7j81J19J87j55j74P6q1J97n8k15
$$ y = [-171, 30, -189, 189, 100, -13, 76, -44, -82, -162, -124, -112, -55, -41, -42, 41, -131, 92, 4, 20, -89, 174, -100, -157, 197, 69, -20, 297, 49, 26, -21, 46, 6, 86, -33, 90, 168, 8, -16, -58, -56, 16, -138, -145, -54, -19, 147, 147, 76, -91, -47, -194, 95, 83, -34, -175, 31, -100, -56, 36, 59, 151, 108, 69, -57, 21, -91, 1, 7, 77, 2, 131, 28, -25, 181, -56, -148, 150, -110, 3, -76, -8, 262, -184, -93, 35, 86, -11, 248, -151, -79, 82, -123, -104, -42, 92, 100, -114, -146, -96, 58, -128, -74, 37, 48, -118, -215, -160, -176, 13, -154, 45, 4, -40, -103, 35, 138, -94, -35, 195, 31, 212, -53, -28, 17, 176, -140, 181, 17, 181, 61, 3, -72, -50, 35, -58, 3, -235, -81, -39, 85, 48, 152, 177, 76, -169, -100, 257, -161, -67, 135, 53, -116, 83, 46, -251, -76, 8, 73, 196, 22, 40, 50, -133, -187, 65, 129, 148, 144, 29, -131, -23, 54, -243, 80, 32, -9, 54, -79, 16, 49, 26, -126, -69, -66, 161, 1, 78, -103, 16, 203, 48, -126, -50, -131, 66, 8, -207]
8143b07J78N5M4q2L1J37p9Q3l12J66K1r7J43l7k4r3J37k13J92q5L4j15q3L71j64
8168AJ4Q5m13J95N7M9K8J48k04o0J94M4N4q3l02QJ16J42k20J84q3M1n6
$$ y = [-207, -29, 26, 70, -12, 19, 156, 77, 160, -152, 14, 35, -62, 81, 44, 20, -73, 64, -149, 43, -42, -8, -123, -206, 165, 1, 15, 100, -313, -118, -61, -12, 16, 164, -40, -100, 94, 138, 192, 109, -193, -185, -69, 73, -147, 37, -46, -5, -61]
8191f1
$$ Imaginary data points
##PAGE= N=2
##DATA TABLE= (X++(I..I)), XYDATA
0@%%%%%%%%%%%%%qJ6j6J6k2L0l2M0m8N6o5P3q8J04j20J41j65J89k13K40k73L11
35A66l51L94m45M98n56O21o89P64q47R38j036J143j263J394j534J689j861K051
53A076k264K498k761L060l399L791m249M792n447O257p291Q660j0564J3424j8263
68a0680K8544r0776R8137O5902j76771O0991L8109j5402k202N315K2188j4884
80H471l0670Q1947l2434o3620O1561k1928l0563P1615o1546l8458P0199j4467
92A07j4399N478k3749N5138j0850m7020P6143j6393o7593P9169Q439o1953J5461
105b022P188O017j0824l1152M5316j8987n0879Q0434p780p4317O7417J2055m4114
118b1648M3407j0275k4088L4095q249l551o298k0467L6804j9512l7082N9072j9878
$$ y = [0, 0, 0, 0, 0, 0, 0, 0, 0, 0, 0, 0, 0, 0, -8, 8, -8, 8, -14, 16, -16, 24, -24, 32, -33, 40, -48, 56, -64, 77, -88, 101, -112, 128, -145, 166, -185, 209, -236, 262, -294, 327, -362, 402, -445, 493, -543, 600, -663, 731, -803, 886, -975, 1076, -1188, 1310, -1451, 1609, -1790, 2001, -2248, 2544, -2903, 3354, -3937, 4723, -5841, 7583, -10680, 17864, -72912, 25225, 91127, -85644, -24653, 13456, -1946, -4148, 1167, 23355, 8471, -22199, 59748, 27314, -36306, 25255, 3327, -27236, 44379, -17167, -55625, 14574, 107, -14292, -8814, -32563, 22575, 11725, -35295, 40848, 24455, -43138, 36031, 44470, -17483, -2022, 5166, 11183, 359, -30793, 14523, -4464, -55343, 25091, 17311, -57006, 10411, 22466, -21648, 21759, 11484, -12604, 21491, 13242, 9691, 3393, -17074, 19730, 218, -36864, 22208, 2330]
131B330n1629N9785K828l9147K0641M056J6000L053l9197L4206J6054m7544K8608
144A0044J0253m0869K5875L582k8835J6623l877m986J2996j0686J4535n78k4205
157b0128L9327J001m4919M2426J3334n0137J9062J7890k5021K22K431L848j322
170a986j8135K0004O939k7948K4649J3429k9360J8960J1450k1893J2565K548j2166
183i44P915q970k012O895j7832J0557J0103k9414J5810K2604k8703N325K4232
196A5566j0182l753L338L783N122j6504N751J3414k8908L033K2674k9356j973
209a7995K4557j7909p30J5397j0318M798P168j816R006j0126K832J7219k5069
222b986j901K5526k6436p437K2268j8492n205J0512o762Q751n137m242K5304j4086
$$ y = [2330, -49299, 10486, 13314, -25833, -5192, -1136, 14864, 17917, -21280, 12926, 28980, -18564, 10044, 20297, -20572, 5303, 8885, -19950, -3327, -7204, -12190, 806, -9880, 4655, 4077, -20128, 19199, 20200, -24719, 17707, 31041, -19096, -34, 17856, -7165, -6943, -4512, -664, -1986, -20121, -117, 6822, -21126, 3523, 16952, -12408, 6552, 18002, -3891, 8674, 11222, -944, 6971, -1999, -4011, 2884, -14948, -4391, 5712, -23702, -7892, 14712, -13991, -8666, 15566, 5384, 1631, 4969, 8752, 13874, -2630, 3121, 16535, -12373, -9340, 13334, -16022, -17995, 6562, -11347, -12077, 3320, -6998, -2200, 4968, 3152, 12158, 2032, 4864, 22083, -2986, -4887, 20639, -5797, -13234, 9034, -9458, -14663, -4151, -10913, -2162, -7299, -11541, 13763, -323]
236c23q718L1575j6837j0093K8213j8169r900J6471j4771O25J119j3005J4908
249A095j0347j0970K9683j8540j0841L8789j7804j2814L0766j2663m011J2019
261A4362j4253J0822m595j7959K4049j5498j9824L3300j7600j6387L2117j5935
273g401o403K3089j3662P713P520j6200K1989p191k0146L2175j6367k2553L3721
286A6284j8159j7124K4657j4699m30J1305j7133J8668N96k0276L2464q037k2423
299a4307L6099j3301j9537K8435j6554p029J6678k1015Q437M976k2490K5119m904
312F07k2759L5058j0135k0209L4430j2181j2490K3619j5430K086P939k1206J8884
325H213k672k5985K9830p435k4939L2039r403j5762K6010j1603j902J5309j7309
$$ y = [-323, -9041, 22534, 5697, -4396, 23817, 5648, -4252, 12219, -2552, -1927, -808, -13813, 1095, -9252, -20222, 9461, -9079, -19920, 18869, 1065, -11749, 19017, 6354, 2343, 14362, 109, 10931, 6336, -11623, 12426, -3072, -22896, 10404, -7196, -23583, 8534, -7401, -13804, 9285, -4377, 3336, 10856, -5344, 16645, 9454, -10692, 21483, 5116, -17437, 16284, -1875, -18999, 5658, -9041, -9471, 1834, -15299, 3369, 3965, -16311, 16153, 8116, -14307, 21792, 8491, -11046, 17389, 835, -6194, 10484, -10531, -2094, 2882, -19608, 5511, 607, -22152, 12906, 2771, -17438, 16992, 4811, -7679, 15940, 510, 2596, 10535, -10671, 8213, 5541, -20444, 9386, 1951, -22988, 9051, -352, -16114, 9896, -1707, -3609, 11700, -5609]
338e609J2934M327k2623K4021m799k5302K8399q624k1241K5331j0039q859J7039
351D955j3562P254Q403j8378K0899J038k2977K6862m031k2584K4320p206j5364
364a0371J6456j1032j571Q803j6126J3987L303k0462K3909P02k0881K4741j910
377I548j6336J8584o334o528R285j2916O142L047j8836J4984J567k0340J9754
390A621J000j6791J8253L42q158J1330n550K640O256j3308R447K025j8925J3907
404D089J262k0027J2989K098j2638R545o40k492P192m964P325M743j2702J2098
418G878M939j6875R967L897j5251O478J343r302L521k738M68M282q417O745O922
433C857j1176Q938Q504j2586O188P491r509J976J760m521J036n222L82L829j1008
$$ y = [-5609, 7325, 11652, -10971, 13050, 8251, -17051, 11348, 2724, -18517, 6814, -3225, -12084, 4955, -8607, -1353, 7050, -11328, 9571, 10609, -12368, 14494, 10463, -12121, 12199, 4993, -10371, 6085, -4947, -6518, 2285, -13841, 146, 3449, -17013, 6896, 7598, -13283, 11458, 9548, -6788, 11796, 5462, -1066, 8219, -4697, 1445, 4492, -14344, 640, 2207, -18133, 1621, 2621, -14170, 4083, 4425, -3733, 7597, 2047, 4687, 10943, -2365, 7082, 9107, -9818, 4089, 5351, -14676, -1687, 411, -12227, -2682, -3322, -5814, 1378, -3586, 3739, 8482, -4220, 7878, 12817, -4058, 5909, 9806, -5445, 1033, 2376, -6926, -3405, -6143, -5675, -1393, -9810, -3065, 3857, -7319, 1619, 10123, -2463, 3725, 11216, 1707, 3683, 5443, 922, 1958, -3264, -2882, 947, -10061]
448a0061L224R582j1613K323J0931q315K304Q902n206J014J985j157L249o243
462I19j694P472j0213k061R730j0974k777J1767o614j147O660l669M218J204l221
477d00P617m245l287J0900r552n986J2275r124m898R544p414o74M531n587O623
492C23j226n764J3910m385p433J4879p340o863J3088q608m034Q888q770J350J998
507A3q486J0106l666q659J6417m782q771J6143o489n317J3342r610n33P218j0735
522c809O266L63j1677J1602m134r523J6755q233q487J7539o693l078J0441r543
536b211O001N038j3598J0567j376j2989J5686n875j2336J5841q333o305J4063
549D173r455J223R062j0142J0639R46j3740J6833k795j3294J6905q049j0305J5820
$$ y = [-10061, -6837, 2745, -8868, -6545, 4386, -3929, -1625, 7277, 2071, 3085, 5070, 3913, 7162, 919, -775, 6697, -3516, -5577, 4153, -6821, -9598, 2169, -4445, -5592, 1068, -2601, 1617, 2821, -400, 7217, 2972, -315, 10585, 1033, -4953, 7322, -1802, -6700, 2844, -4570, -5244, -713, -6300, 323, -903, -6667, 7243, 2858, -4575, 10304, 2964, -3899, 9189, 581, -3453, 5435, -3335, -1985, 13, -8473, 1633, -2033, -10692, 5725, 943, -7828, 8315, 1826, -3491, 9851, 241, -292, 6926, -3809, 2457, 2820, -8857, 2745, -1389, -10912, 5843, -2390, -10877, 6662, -31, -3109, 7332, -2211, 3790, 8828, -4770, 5797, 4421, -8568, 7118, 1243, -11093, 4748, -3585, -9890, 4173, -5282, -4059, 5003, -5139, 5500, 6446, -7294, 9539, 6744, -6550, 10355, 2306, -7999, 7821]
563G821j0809n072J0674j0785N126N025j2087J3477j123j1876J9306m610j1299
576f232J7755p399o224J1994j2303J045O741j3659Q420R48j4386J4888k320j1691
590a2423J7674m829p523J5424o232r25O995j0540Q618K593j5401J2099j667j4914
604a1051J5116m961j2304J5469n019m726J0325p346L890O049r499J1321Qj2862
618e590J5468k620j3969J2694m729q036J0391q093j555O507q988P504L080j1621
632i557J3105K122j1569J2573r15q422J0038m121l406M848q182L740K428j1985
646i303Q509K040j1847J1129J729j0471J0363J072n381O355k354J143K910q083
660b189N793J451j1606Q096J693j0905P027P97o829O186l89j829N154m014L253
$$ y = [7821, -2988, -8060, 2614, -8171, -3045, 1980, -10107, 3370, 2247, -9629, 9677, 5067, -6232, 11523, 4124, -2100, 9894, -2409, -1364, 5377, -8282, 138, 1086, -13300, 1588, -732, -12423, 5251, 422, -7101, 8323, 2091, 1166, 8161, -2379, 6239, 8832, -6569, 5530, 3863, -11051, 4065, -896, -13200, 2269, -2750, -7476, 2849, -4497, -607, 5442, -4057, 7264, 7272, -5590, 9878, 7258, -6711, 5983, 1254, -6782, 3609, -4484, -6039, 468, -8520, -1016, 2064, -9557, 3548, 5670, -5899, 6674, 5759, -2663, 7375, 3254, -152, 4696, -3486, 254, 2682, -9303, -794, 1246, -10601, 528, 2257, -8214, 2149, 3221, -2160, 4195, 1841, 2984, 5894, -2189, 3604, 5055, -6551, 1545, 3238, -7667, -640, 157, -6672, -486, -875, -2704, 2450, -1564, 1689]
675A689M107q092N054L966r419M300K921q136K797R03l603K494k503J017M241
690A736n773L283N297p463L713O108p689J586M679n674J51J146k880J097k223
705b906K75L603n398J189O169n980J276O821n592J126M738m354J078L83k879K958
721B507l332k783N427m792k839P169m290j503O766l253J70L932k766K604M71l767
737b79N590l650m652P575n280n150Q196n389l254P191m280Q9M342l748N120K94
753B715m716Q527k779n826R110n181m922Q100o802k450N544o612K263K718o747
768g058P434L33o591J0584k015n625J0304m344l768Q004o794k18L887q685M822
783B70N49r640R729k083q290J1841l076n554J1492n029j149Q023p338L634L187
$$ y = [1689, 5796, -2296, 2758, 6724, -2695, 1605, 4526, -3610, -813, 90, -3513, -1019, -3522, -2505, 1736, -4037, -754, 4543, -2920, 793, 6901, -788, 798, 5477, -197, -46, 1100, -1780, -683, -2906, -2631, 972, -4426, -3237, 2932, -3048, -1772, 5049, -543, 583, 5321, 967, 2045, 2428, -451, 2507, -825, -3608, 1819, -2973, -5812, 1357, -2933, -4436, 2330, -923, -753, 3179, 413, 3017, 3488, -279, 5311, 1661, -2991, 4584, -696, -5846, 2350, -3039, -6293, 898, -3382, -3293, 1049, -2699, 2421, 2715, -2001, 6526, 3747, -2079, 7031, 1850, -3072, 5028, -1774, -4224, 1320, -5292, -3029, -311, -7058, 376, 709, -5882, 4702, 2687, -2938, 7366, 3022, -746, 7258, 464, 246, 4133, -4552, 270, 819, -8821, 908, -1175, -9465, 2376, -700, -6254, 5238, 209, -940, 7083, -255, 3379, 6566]
798F566r624P530j159j0104J0679m301q478J1473n947l698J0244p487K183O454
812D331q545P753K404j0051J0989j566r517J0804m960o643R784q045j384P039
826B393r184M934L788r693R954J150r596J2101k174p568J1371n329l719P791q250
841b031J334M534j0682O840J786j0822J0658n97q673J1791l323m763J0295o523
855a76J53O777r324M776K960j0713Q082k21j0105J0096k601o900R868m449k027
870c804Q197p180L590M681r212P345J552r862Q649p30q505Q285l662m390P103
885B057n522M91N352p371N370L756q564P616J307p802Q148j434o092O806m216
900i8k438M826o357J909L467p572N482K808p559P195J080n418O461j179k985N054
$$ y = [6566, -3058, 4472, 3313, -6791, 3888, -413, -8891, 2582, -3365, -7063, 3181, -4306, -2123, 4331, -4214, 3539, 5943, -4108, 6881, 5315, -4202, 6602, 1642, -5001, 4783, -3262, -4646, 2393, -6791, -1857, 1931, -7762, 2192, 3342, -6254, 5847, 3673, -3895, 7476, 2147, -1572, 6219, -2031, -697, 3837, -6845, -5, 1781, -9041, 1617, 1020, -7653, 4138, 815, -3948, 6347, -176, -23, 6754, -2570, 2206, 5166, -5547, 2535, 2314, -7791, 2305, -296, -7196, 2672, -1777, -3804, 4393, -2787, 803, 5484, -3728, 3617, 5169, -4693, 3956, 3226, -5279, 3006, -656, -5046, 2057, -3465, -2974, 2378, -4993, 377, 4133, -4431, 3185, 4492, -3310, 4838, 3404, -2688, 4118, -98, -2536, 2290, -4067, -2158, 1309, -6263, -781, 2027, -5532, 1663, 2743, -2675, 3786, 2607, -378, 4676]
916D676l930m08L567p036L037K005p524M158K004o547N309Q20l714N028q58o33
932d6M025l569J636K954n616K353K296p137K533K025n907K477P06k758K998j017
948b047J90L427k868K134L760m541J693L644n170J095K021m760J136K38l148J872
964a324j335j075L836l180J72N398l547N29M933l240L83L028l399N63L82l313
980a189K558k152k974M617l696j840N578l928p22N973k768R9L854k599K044L87
996C242l383M228k325m227N607l758l850N758m026j775N188l415R72L105l719
1011b378M075J102m699O445j537m871O713l651l920N783m689j311M166n424K643
1026a553K155n723O262R0n709Q399j669n031P726l511k753N894n775Q94L295p219
$$ y = [4676, 746, 338, 3905, -3131, -94, 1911, -5613, -1455, 549, -5998, -689, 131, -3583, 1445, 587, -46, 3979, 410, 2046, 5000, -616, 1737, 4033, -3104, -571, 1454, -4453, -1976, -1270, -4028, -1030, -2047, -1857, 1570, -1298, 836, 4596, 55, 1748, 5392, 222, 1317, 3338, -1422, -286, -48, -3196, -1324, -2659, -3734, 102, -3078, -2906, 2492, -1055, -526, 4407, 1167, 1550, 4578, 1179, 1742, 2124, -1189, 1369, -783, -3757, 860, -2836, -4676, 902, -3026, -3748, 2225, -543, -444, 3410, 811, 2855, 3242, -141, 4087, 1762, -2465, 3142, -616, -4466, 1292, -2734, -4509, 679, -2736, -1764, 1341, -2378, 1697, 2799, -1900, 4545, 3008, -1863, 4850, 1199, -2721, 3062, -1627, -2938, 1228, -4196, -1553, 602, -5121, 1141, 1231, -4478, 3921, 2252, -2779, 4947, 1436, -1317, 4577, -1198, -304, 2991, -4228]
1042d228M348R21p336P393r09n717Q706l134l478Q287m787q19N980o814L227K479
1058D119q445O138r6p786Q024k146n336P863m438j467P422o295K414N034p562
1073b557N241J865q257P071j003o810P611l676m169P165n913j34O087o819M120
1088a78L560p402P084O68p240Q522k190n656P868n331k430O128p133J481M090
1103A841p597N270J636o910P595n74n168Q602l126k715P291n805l75M707p515
1118b843L446K008q094N958j38o885P287j853l745P430l368o16O110n535K178
1133A340L806o560M400O94o875O040j879n599N969l206k791N514l800J89M350
1148A592m748L960K575n374N495L18n253N365j556l857M311l552j628L592m665
$$ y = [-4228, 120, 1041, -6295, 1098, 189, -5528, 3178, 44, -3434, 4853, 66, -753, 5227, -1587, 1640, 4119, -4326, 1812, 1716, -6070, 1954, -192, -5528, 2335, -2103, -3570, 3852, -2443, -29, 5005, -2557, 2684, 4549, -3708, 3363, 2360, -4450, 3161, -515, -4684, 2481, -3432, -3566, 2521, -4298, -178, 3382, -4020, 3064, 3732, -3508, 5014, 2824, -2832, 5036, -295, -2725, 3403, -3730, -2249, 1841, -5756, -486, 1150, -5760, 1835, 1261, -3907, 4695, 1569, -1146, 6145, 340, -35, 4672, -2843, 603, 2611, -5483, 475, 337, -6548, 739, -1114, -4859, 2571, -797, -1413, 4697, -838, 1340, 5146, -1414, 2986, 3680, -3195, 2845, 966, -4633, 1336, -1870, -4661, 853, -2947, -2758, 1592, -3156, 804, 3379, -1995, 3500, 3818, -1435, 3930, 2374, -1483, 2828, -724, -2352, 1240, -3425]
1163c425J004K886n028L901J707m545N089M20l297M663j017k190L415k874k38
1178D71J922m574J890J433n419L168J160m118L377Q28k430L211k2q64K714j964
1194G83L90J949l374Q21J626m181J666P84l414J872N19k057J982J1l10K097j599
1211d35R68K362k868O83K412l206o4J822k729L24L05j823J472l99j026K990j650
1228h62l76L406k364j1L285k449l95K228k608J27Q38k326J398n67k010L182j982
1245a486j212M140j926q28L809k070j31K504k898J499N40l248K727j082l188L711
1261H61j673k826M380k155j117M347k853P76K731l033K531O63l546L893j399l859
1277b279M543k472k959M352l267p20L651l915K223K218l813M257L53l826N113
$$ y = [-3425, -2421, 465, -4563, -662, 1045, -3500, 1589, 2009, -1288, 3375, 2358, 168, 3583, 709, 471, 2393, -2181, -291, 1142, -4277, -1109, 51, -4067, -690, 138, -2292, 919, 897, 33, 2747, 783, 1173, 3122, -252, 569, 2195, -1986, -320, 464, -2950, -1078, -559, -2616, -634, -623, -933, 1164, -435, 533, 2895, 27, 710, 3122, -84, -148, 1674, -1055, -731, -426, -2249, -777, -1176, -2202, 788, -862, -1238, 2168, -196, -207, 3078, 629, 234, 2462, -146, -19, 819, -1507, -109, -676, -2686, 496, -1486, -2698, 1442, -484, -1312, 2497, 427, 296, 2800, -98, 1401, 1941, -1307, 1420, 338, -2850, 861, -812, -3638, 742, -1413, -2530, 1817, -1036, -260, 2471, -562, 1969, 2632, -914, 2979, 1580, -2279, 2264, -208, -3167, 1185, -2082, -2802, 849, -3066, -843, 1375, -2438, 1819, 2172, -1654, 3459]
1292C459j444l359N241l302k284M412m646K2K924n143L148J353n010N370Q1m006
1308c184O226j710k697N561l209o61L710n171J751J895n928L747Ln468N522j199
1324h12l602N871k557j206N356l854J225L519m843L239J270n929M849j002n236
1339c712N441k602l436N540l903l5M377m920L088K856n073M884N85m739N398j766
1355A983l555N111l687j721L984n029J286K641n233L806J442m988N432j6l775
1370b319N704k119j774M569m077K51K985n182K102J420n317L699K81m363M889
1385G49j076k521M672k308k72L770l614J670K105m583K847Q43m740L823r08l620
1401c163L838j906j258L839l250P69K972l191J885J752l688L384L33l615L304
$$ y = [3459, 2015, -1344, 3897, 595, -1689, 2723, -1923, -1901, 1023, -4120, -972, 381, -4629, 741, 822, -3184, 3042, 1332, -1365, 4196, 987, 326, 4036, -1135, 616, 2511, -3417, 330, 333, -5135, 387, -812, -4414, 1457, -1100, -2306, 3050, -804, 421, 3940, -903, 2336, 3606, -2323, 2526, 1524, -3712, 1729, -873, -4309, 1231, -2672, -2707, 1670, -3250, -162, 2694, -2379, 2505, 3090, -1649, 3749, 1983, -1572, 3539, -148, -1869, 2115, -2914, -1628, 1013, -4220, -414, 1028, -3960, 1472, 1456, -2319, 3385, 1266, -508, 4061, -16, 235, 3220, -1962, 140, 1560, -3757, -58, 223, -4140, 749, -327, -2848, 1824, -484, -756, 3014, -600, 1070, 3175, -1408, 1439, 2282, -2458, 1365, 457, -3163, 675, -1231, -2489, 1350, -1900, -1131, 1841, -1350, 535, 2287, -1401, 1983, 2316, -1299, 2005]
1416B005j426k323K736k269n07K430k745R44K084l090K311J470k902K915J12k343
1432e98K765j135j569J959j805l69J203k400R33J115k339J820O91j943K348L38
1448A014j379J969m85p12J453j536j32J106k152L02P11j930L38J135j591J161
1464g28O94j212J696J80k52J437p58j46J325j786j91J179k255p1J025j807j67
1481a837J134j180R15N63n67J608l3o72K247j120o74K119j996m63J447k111%M86
1499a34j631Q26J22j489K273r80p78L055j218k34K641j709p5J669k034N99L94
1516A297k424J506n40k376K580j237j818L432j530p86L270j631L10K165k295J539
1532A462O14k794L067j014k980L070j656k400L151k155m37K651k537J517J527
$$ y = [2005, 579, -1744, 992, -1277, -1784, 646, -2099, -1155, 929, -2161, 150, 1620, -1282, 1633, 1745, -598, 2167, 1032, -537, 1422, -383, -752, 451, -1949, -1016, 99, -2240, -420, 271, -1672, 676, 1014, -365, 1604, 1119, 407, 1860, 324, 192, 1298, -854, -552, 159, -1771, -1433, -298, -1889, -728, -34, -1246, 450, 630, 378, 1815, 1057, 911, 2236, 450, 259, 1438, -817, -888, 137, -1670, -1837, -703, -1883, -968, -405, -972, 636, 603, -69, 2178, 1058, 384, 2503, 507, 44, 1491, -620, -620, -134, -1765, -939, -817, -2306, -33, -1013, -1791, 1264, 46, -188, 2453, 744, 669, 2338, 304, 903, 1297, -1127, 379, -161, -2537, 43, -1194, -3012, 420, -1110, -1896, 1374, -257, 53, 2218, -77, 1462, 2076, -718, 2349, 1335, -1645, 1425, -231, -2631, 520, -1635, -2072, 579, -1958, -441, 1086]
1547A086k714K971P03l230L669r63k477L365k031j712K909k935K67J963l460K085
1563e04P12l093L799k31k503M071j290k081L787k499j51K194l230J055J170l861
1579b655K865J33l510L928p26k440M064k276m93L442k849R32K169l850K214Q86
1595A834m290L603q07l049L824j672j808L580k653L60K770l279K319J855m102
1610a515L192K36l649L425q76k688L515k597j058L080l352J259K022l316K620
1625B98J220l501L664l59k248L466j746j364K844l077K70J857l649J609J332l244
1641b628K523K25k347L074n39j320L363k079j68K599k724O34J305l197J672K94
1657F87k990K326m14k115K484q82n84K596j682P48J841k345J498J322l020J994
$$ y = [1086, -1628, 1343, 2046, -1184, 2485, 1522, -955, 2410, 379, -1333, 1576, -1359, -1092, 871, -2589, -504, 208, -2885, 914, 683, -1820, 2251, 961, -1120, 2667, 168, 17, 2211, -1019, 36, 1206, -2655, 210, 343, -3167, 761, 35, -2405, 1659, -617, -1110, 2332, -517, 415, 2584, -1266, 948, 1834, -2456, 1147, 340, -2709, 1115, -557, -2365, 1215, -1438, -1078, 1692, -1587, 732, 2587, -1515, 1677, 1913, -1736, 1689, 813, -1875, 1640, -957, -2015, 1065, -2287, -1028, 994, -2322, 298, 1518, -1983, 1681, 1322, -926, 2540, 794, -570, 2274, -803, -533, 1324, -2325, -716, 616, -2628, -105, 120, -2227, 847, 308, -1012, 2351, 272, 104, 2703, -21, 613, 1918, -1279, 393, 687, -2303, 23, -391, -2506, -22, -904, -1488, 1108, -574, 174, 2015, -330, 1168, 2490, -530, 1464]
1673A464j21k303J930j236j614J906j320o19K091j773R19J321j649J768O59j904
1689d81K116n3j489J379r37r08J388j695j06Q75j982Q36P13j591J596N88j117
1706h68J681q5o00J232k48o48R85j013m10Q38j397j38R05j661O22O00j039N51
1724f93R56r46J077J03l49J104o08j55J070j224l98Q21j270j23Q35j618P04N51
1742a63r86Q92L64p44J408m39p34K054j112n31J579j623j92Q36j168Q1M31j338
1760a385J056K40j210J779n65p66K012r21l76J954j507l26J373j893O57M98k022
1777a402J606m98j657K084m44j248K606j603m3K267j811N56J324k235J386M90
1793A378k602K189p87j819K189j322r45K427j627j88K220k026J337J063k054J858
$$ y = [1464, 1343, -960, 970, -266, -1880, 26, -1294, -1913, 178, -1595, -676, 645, -1004, 764, 1423, -481, 1635, 1582, 93, 1472, 535, -373, 1015, -680, -786, 89, -1893, -1057, -344, -1935, -339, 249, -868, 813, 728, 128, 1360, 1112, 464, 1449, 436, 26, 864, -533, -671, 234, -1427, -805, -205, -1244, -693, 263, -683, 394, 497, 148, 1252, 644, 489, 1559, 335, -63, 758, -512, -635, 200, -1418, -714, -163, -1149, -257, 107, -637, 771, 332, -402, 1652, 540, 9, 1588, -35, -227, 609, -559, -478, -47, -1385, -329, -89, -1299, 480, -85, -851, 1161, 240, -136, 1818, 311, -15, 1358, -535, 122, 620, -1402, 204, -294, -1951, 133, -311, -1559, 1047, -556, -599, 1668, -143, 413, 1737, -498, 888, 1378, -1224, 965, 178, -1641, 548, -774, -1719, 708, -919, -1107, 1113, -913, 424, 1487, -567, 1291]
1809A291K77k490K632r96k022K676j964j179K332k253L49J748k596K046O87k179
1825a641L070k22k147L206j283j417K467k320k64K004k832Q12P58k867K472K83
1841G9k619L283o95j467L274j668l20K777k802Q28J577l216J645K86k812K330
1857D80p91k201L141j710r16K977j961N16K228k638J815J369k867K077j00k284
1873h65K465j329j635K458k261l73K134k340R06J504k395K390N03k228K863q17
1889I80j298K355j506q61J932k231K29J225k915J728N20k652K648M9k041K690
1905H52o07r33K375j683J79J802k338O81J003k613J608J19k115J950q05j217K191
1922D49j150l44K225j852Q42J181j597Q31O99j820J348l38j389J311o24j121J423
$$ y = [1291, 1568, -922, 1710, 714, -1308, 1368, -596, -1775, 557, -1696, -1347, 401, -2195, -149, 538, -1641, 1429, 1207, -940, 2266, 983, -434, 2033, -287, -551, 1453, -1379, -567, 191, -2676, -204, 79, -2540, 743, 48, -1419, 1855, 187, -133, 2644, -158, 670, 2247, -969, 676, 962, -1850, 480, -311, -2512, 629, -1081, -1997, 980, -981, -465, 1763, -875, 940, 2309, -558, 1519, 1419, -865, 1600, 271, -1364, 1094, -1167, -1540, 594, -1746, -840, 664, -1731, 659, 1162, -1066, 1797, 980, -318, 2037, 531, -330, 1602, -629, -400, 825, -2090, -362, 158, -2494, 154, 203, -1838, 852, 245, -688, 1687, 4, 183, 1985, -353, 328, 1331, -1282, 326, 445, -1670, 280, -525, -1742, 449, -701, -1045, 1180, -672, 170, 1351, -246, 585, 1284, -536, 812, 474, -915, 396, -228, -1349, 74]
1939G4j008k63J573j176M81J003j167J140M13j626J299J84j023P28n31r12J084
1956B73j058q8J013j143N85N47j074J068N54q51R60O6p72J064p01m67P71p92m79
1975e24P62j004J6P84j086N13Q03q44N94O72p67Q53N2n91P54o07l84P11j126j99
1995f18M96p07J42M64r06P39N86p29N90M97o04J209m29o56J149q35n92Q20q33
2014b17m88Q47j316K38O78j153J007L90j090J753k22n81J567p49o42J539j482
2031G9j44R35j608M54M57j798J163P8j474J941m08q55K330j130m19J988j347K66
2049E08R67j898J150O6j946J512m87j407J982j168j075K292j435K94J719j769
2065f95J043J008j674J584j40j624J807p59j511J965j498q58J837j824N12J374
$$ y = [74, -934, -1197, 376, -800, -319, 684, -483, 657, 1070, -556, 743, 927, -96, 632, 101, -811, 273, -785, -873, 140, -1003, -418, 129, -945, 123, 677, -174, 786, 852, 80, 1144, 443, -24, 747, -45, -524, 238, -766, -750, 34, -1052, -539, 264, -580, 14, 686, -81, 772, 824, 233, 987, 380, -4, 707, -419, -618, -122, -829, -687, -223, -1129, -390, 196, -533, 57, 554, -50, 1159, 730, 74, 1223, 388, -204, 616, -217, -705, 142, -1174, -936, -258, -1411, -404, -14, -1104, 649, 427, -154, 1413, 664, 22, 1561, 79, -65, 870, -738, -284, 173, -1625, -462, -384, -1858, 83, -325, -1180, 1150, 20, -399, 1589, 242, 508, 1475, -423, 727, 793, -1153, 359, -128, -1535, 447, -721, -1796, 496, -939, -645, 1074, -695, 348, 1356, -318, 1266, 1126, -498, 1309, 550, -961, 1004, -494, -1352, 485, -1339, -827, 547]
2081E47k078J562O13j841K502o82j363K691j443r66K103j861k76J452k245J123
2097a62M79k401K165k73j429K336n53j228K606j486l19J837j908P00J110k468
2113i94J652N6k465K128o00j548K572j446l68K041j574L77J543j772J334K96k045
2130h13K037o38j925K196r31j176J874j284l84J635j692Q72J135k070K093r5j623
2147g89J876l76j442J910j217m19J166j596P1J325j933J305L56j519J934r6j318
2164g62J874q24l46J412j301p7J213j871O70N57j829J271L40j719J276p9r36J616
2182D85n08j75J389j108L12R55j662Q63J67j272P59q1j308J048l33n62J029q78
2200h80K32Q47p10O66O93r50Q79O6p69O23k51r01P71o62k84O28o33O2L51n01L99
$$ y = [547, -1531, 31, 644, -1197, 1305, 623, -740, 1951, 508, -458, 1645, -216, -492, 960, -1285, -162, 317, -2084, 81, -192, -1621, 715, 162, -1066, 1540, 54, -265, 1572, -336, 364, 1474, -994, 658, 714, -1751, 377, -223, -1771, 801, -645, -1013, 1028, -546, -169, 1374, -398, 936, 1232, -813, 1224, 586, -1339, 857, -74, -1250, 624, -660, -1044, 591, -1101, -229, 906, -1164, 929, 834, -789, 1087, 711, -731, 1179, -38, -457, 709, -887, -816, 509, -1424, -119, 237, -1282, 652, 556, -762, 1112, 288, -58, 1354, 53, -24, 1189, -682, -12, 545, -1284, -13, 327, -1392, -116, -195, -1131, 485, -23, -198, 1191, 83, 395, 1350, -312, 551, 718, -554, 205, 124, -1184, -136, -469, -1031, -2, -880, -648, 199, -511, 155, 848, -102, 777, 843, 74, 697, 446, -455, 316, -346, -630, -2, -635, -573, -222, -723, -324]
2221c24N86p18P70L97n89O51N8n98N27k36l00J69o25m95N59o72j09N63n86M16
2241e56N74j75J41M69n0L88j63l14M74k90k73K09o81k27M71o52k64J015p20Q7
2261e37O76n38N90L32m73P06j28n83J019o24p07P95p34l63Q06j059J40O90j040
2280a032J000K86r96J267rp65J162o20k01Q64r28j33N71r93K18O43j366J001K
2299b9j096J519k98q05J612r53j15J356j333M92N83j245N55K11j603J447l89j267
2317a358J915j141m75J654p98K5J268j526Q43P15j571J004J04j322J127o20r21
2334a077J531j065l52J557j318K86J138j545J236N09j251J424k67j303J765j142
2350A26p77J502j409M0P76j446P68O98j682J669J86j370J956n91q00J738j147
$$ y = [-324, 262, -456, 314, 711, 122, 773, 831, 233, 760, 524, 224, 393, -232, -727, -168, -840, -949, -386, -972, -556, 18, -157, -16, 453, 403, 791, 628, 314, 788, 498, 225, 434, -247, -474, -3, -655, -919, 96, -624, -537, 139, -399, 191, 523, 50, 756, 628, 45, 1064, 440, -267, 528, -206, -569, 237, -822, -682, 8, -1032, -32, 254, -742, 525, 516, -249, 913, 293, 92, 956, 28, -105, 466, -527, -309, 334, -1032, -31, -29, -1125, 394, 96, -709, 903, -50, -165, 1191, -142, 350, 933, -312, 243, 454, -1149, 298, -91, -1358, 557, -584, -1059, 595, -203, -178, 1090, -436, 407, 1122, -449, 555, 659, -663, 464, -156, -1077, 454, -611, -963, 594, -724, -438, 700, -845, 391, 900, -351, 1073, 806, -497, 1268, 126, -651, 851, -558, -518, 258, -1188, -420, 278, -1404, 265, 451, -919, 1037, 446, -354, 1384, 237]
2367B37k61J310j634M12O29j908R69K03j349J462n15r30J963r32k14J704j303
2384a57O89R81j637Q48L04j629J281l66j210J092p08p65J367r35J06J085j101
2401g55P91O39j315J490k8j149J655q22p49J213j300l46J208j471L43O21j065
2418a040Q24J73r79J575l51n61J671r27j92Q64j054J18O35j185L81K67j341J177
2436E5l36r00J229m49m18J334o91L9P78m56K49K32o71M97j24o38K92m2q58O69
2456b09r4j87N59o24J79P12o03N16L35o79P00p9p17M25k9o10M73m22m6J50k55
2477e05J23L98m00M10P2k98K99K10l54K94Pk43L30k81j20J6j67j53R3m8m2K67
2499i2j71J80K56N4k9K77l91M01j45l73M64m86k14J72l20m03O17j70J21L84m11
$$ y = [237, -24, 1286, -348, 64, 693, -1215, -246, -43, -1392, 70, -445, -1375, 588, -344, -558, 1146, -157, 532, 1513, -124, 724, 1028, -601, 680, 314, -896, 196, -512, -1277, 90, -845, -739, 346, -755, 36, 675, -640, 850, 822, -327, 1328, 506, -243, 970, -330, -676, 532, -939, -596, 25, -1040, -216, -43, -1022, 553, 202, -359, 1312, 385, 193, 1057, 3, 121, 756, -429, -48, 219, -1122, 55, -281, -1181, 48, -401, -819, 515, -176, -137, 641, 185, 434, 666, -5, 492, 368, -270, 22, -20, -878, -209, -303, -490, 69, -555, -376, 336, -267, 249, 584, -95, 605, 526, -191, 234, 205, -405, 68, -354, -400, -250, -505, -382, 16, -384, 26, 98, -200, 99, 309, -45, 249, 256, 13, 343, 62, -58, -42, -209, -362, -269, -317, -359, -92, -263, -83, 173, 227, 198, 475, 84, 485, 340, -33, 431, -55, -269, -97, -417, -820, -203, -373, -252, 132, -279]
2520b79K58N41o66M83L73m81L40k38l25K40l03m88O23m46k21P68r15K82M00k02
2540b56N74N2n69R19j51m38Q86o87m46O54p71k26N73q86K73L62o85O83J36n21
2560e24J032l57m41J024m23r9Q92j133J16M12j059L24M02j092J001m60p35J028
2578i2k56j79J243j068L85R57j033N47K10r74J002l84j174J293j003l98J094r73
2596h03k4J136j135O70O35j116J167O2q27J298n87o44R96p71m49J152j428K03
2614d65P19j140O36L13r06J231k47p93J651o15n51J102p04k88J189j634N88K53
2632C39j021P49j80r91J456q02l99J570r51k1R82j142P41L77r27Q84k06j132J140
2651D66o45n62J082j006k27J254r29K45P88r36O04N40j151R89jq74J077p08k96
$$ y = [-279, -21, 520, -146, 337, 710, 229, 569, 331, 6, 246, -57, -545, 78, -368, -589, 179, -736, -454, -54, -256, 318, 370, -199, 720, 569, 131, 1017, 330, -116, 538, -233, -459, 114, -772, -499, -137, -822, -139, -3, -524, 508, 151, -290, 734, 311, 212, 1104, -29, 87, 499, -560, -236, 166, -926, 75, -385, -1120, -92, -348, -527, 716, -352, 33, 990, -43, 504, 714, -260, 742, 358, -816, 477, -526, -924, 170, -803, -827, 309, -826, -156, 479, -637, 530, 592, -235, 1063, 476, -168, 828, 57, -392, 760, -668, -465, 254, -886, -250, 63, -843, 388, 141, -652, 999, 384, -167, 935, 231, -57, 1132, -502, 86, 339, -682, 67, -113, -1104, 352, -450, -849, 721, -230, -251, 731, -411, 330, 707, -220, 664, 458, -674, 466, -179, -741, 341, -665, -892, 362, -567, -322, 466, -470, 134, 674, -477, 512, 511, -363, 714, 6, -290]
2670b90P83p30j72O38p05P0O28p13P08j58m78J136n24m71J029l09o06N24o44K88
2690DL1q34O78j5o65O35m9l83Q37j94r1O90o16M01L11p01J39L40r10K78J93o68
2712e89O23m04l16P62m56K9O56l38j2N01l92J88K82m18L61J0n89K06k01l44L58
2733h3k97l3kK8K91R7l8K6M09l26M84l4l23L8J22m49J68j82J5l5k50rL50l84J35
2758b82J85j97K80L06ON9K46n10M14Ml29j52j10l82K75l53L3K88k34K04N08o00
2780c41K71L70k85M32J77m38K06j48l07M47m51l69N59n35j34N00m87L96K75n33
2800c95O55L2n35O40ql84N48n24p5M26n58r0K64o48K97M46r00P30j09m32Q15m7
$$ y = [-290, 493, -237, -409, 229, -476, -406, 222, -491, 217, 59, -419, 717, 193, -278, 751, 442, -164, 360, -284, 4, 35, -799, -121, -136, -801, -166, -215, -598, 239, 45, -46, 644, 28, 429, 740, 39, 178, 518, -392, -114, 79, -589, 34, -370, -686, 76, -380, -351, 305, -33, -45, 456, 64, 252, 534, 116, 477, 487, -102, 104, -97, -441, -83, -380, -413, -415, -387, -96, 1, -37, -11, 398, 72, 556, 522, 199, 237, 359, -90, 78, -104, -89, -124, -374, -383, -33, -417, -282, -97, -294, -14, 292, 298, 357, 603, 93, 507, 511, 182, 30, -80, -462, -187, -540, -507, -219, -453, -249, 259, -341, -70, 300, 15, 447, 624, 186, 392, 244, -63, 384, -67, -436, 123, -412, -546, -46, -533, -137, 138, -395, 260, 292, -243, 397, 389, 5, 553, 29, -46, 380, -178, -268, -4, -652, -355, 91, -809, -79, -188, -620, 195, 148]
$$ [...]
8191a97
##END NTUPLES=NMR FID
##END=
