##TITLE=1H_Pr C2BocHCl
 200.13MHz,DMSO,
 8 sc
 
 3.7.2025
##JCAMPDX= 6.0         $$ Bruker NMR JCAMP-DX V2.0
##DATA TYPE= NMR FID
##DATA CLASS= NTUPLES
##ORIGIN= UXNMR, Bruker Analytische Messtechnik GmbH
##OWNER= pz
$$ XWIN-NMR		Version 3.5
$$ Thu Jul  3 13:58:58 2025 Russian Standard Time (UT+4h)  she@DPX200
##.OBSERVE FREQUENCY= 200.1313
##.OBSERVE NUCLEUS= ^1H
##.DELAY= (6, 6)
##.ACQUISITION MODE= SIMULTANEOUS
##.ACQUISITION SCHEME= undefined
##.AVERAGES= 8
##.DIGITISER RES= 18
##SPECTROMETER/DATA SYSTEM= spect
##.PULSE SEQUENCE= zg30
##.SOLVENT NAME= CDCl3
##.SHIFT REFERENCE= (INTERNAL, CDCl3, 0, 14.3821)
##AUDIT TRAIL= $$ (NUMBER, WHEN, WHO, WHERE, WHAT)
$$ ##TITLE= Audit trail, XWIN-NMR		Version 3.5
$$ ##JCAMPDX= 5.01
$$ ##ORIGIN= Bruker BioSpin GmbH
$$ ##OWNER= she
$$ F:/spectra/data/she/nmr/H-C/1/audita.txt
$$ ##AUDIT TRAIL=  $$ (NUMBER, WHEN, WHO, WHERE, WHAT)
(   1,<2025-07-03 13:57:41.21 +0400>,<she>,<DPX200>,
      <created by zg, POWCHK disabled, PULCHK disabled
       configuration hash MD5:
       00 E9 B6 7A A2 85 ED C7 34 08 36 98 17 FE 4E 26
       data hash MD5: 16K
       33 0E 92 5F CD 00 F8 B6 61 7F 17 88 8E 0D 22 29>)
$$ ##END=
$$ 
$$ hash MD5
$$ E5 E7 37 78 B2 E2 69 49 90 79 25 01 57 71 E9 83
##$RELAX= 
##$RELAX= 
##$RELAX= 
##$RELAX= 
##$RELAX= 
##$RELAX= 
$$ Bruker specific parameters
$$ --------------------------
##$DU= <F:/spectra>
##$EXPNO= 1
##$NAME= <H-C>
##$PROCNO= 1
##$TYPE= <nmr>
##$USER= <she>
##$AMP= (0..31)
100 100 100 100 100 100 100 100 100 100 100 100 100 100 100 100 100 100 
100 100 100 100 100 100 100 100 100 100 100 100 100 100 
##$AQSEQ= 0
##$AQ_mod= 1
##$AUNM= <au_zg>
##$AUTOPOS= <>
##$BF1= 200.13
##$BF2= 200.13
##$BF3= 200.13
##$BF4= 200.13
##$BF5= 200.13
##$BF6= 200.13
##$BF7= 200.13
##$BF8= 200.13
##$BYTORDA= 1
##$CFDGTYP= 0
##$CFRGTYP= 5
##$CHEMSTR= <none>
##$CNST= (0..31)
1 1 145 1 1 1 1 1 1 1 1 1 1 1 1 1 1 1 1 1 1 1 1 1 1 1 1 1 1 1 1 1 
##$CPDPRG= <>
##$CPDPRG1= <>
##$CPDPRG2= <>
##$CPDPRG3= <>
##$CPDPRG4= <mlev>
##$CPDPRG5= <mlev>
##$CPDPRG6= <mlev>
##$CPDPRG7= <mlev>
##$CPDPRG8= <mlev>
##$CPDPRGB= <>
##$CPDPRGT= <>
##$D= (0..31)
0 0.7 0 0 0 0 0 0 0 0 0 0.03 0 0 0 0 0 0 0 0 0 0 0 0 0 0 0 0 0 0 0 0 
##$DATE= 1751536660
##$DBL= (0..7)
120 120 120 120 120 120 120 120 
##$DBP= (0..7)
150 150 150 150 150 150 150 150 
##$DBP07= 0
##$DBPNAM0= <>
##$DBPNAM1= <>
##$DBPNAM2= <>
##$DBPNAM3= <>
##$DBPNAM4= <>
##$DBPNAM5= <>
##$DBPNAM6= <>
##$DBPNAM7= <>
##$DBPOAL= (0..7)
0.5 0.5 0.5 0.5 0.5 0.5 0.5 0.5 
##$DBPOFFS= (0..7)
0 0 0 0 0 0 0 0 
##$DE= 6
##$DECBNUC= <off>
##$DECIM= 32
##$DECNUC= <off>
##$DECSTAT= 4
##$DIGMOD= 1
##$DIGTYP= 9
##$DL= (0..7)
0 120 120 120 120 120 120 120 
##$DP= (0..7)
150 150 150 150 150 150 150 150 
##$DP07= 0
##$DPNAME0= <>
##$DPNAME1= <>
##$DPNAME2= <>
##$DPNAME3= <>
##$DPNAME4= <>
##$DPNAME5= <>
##$DPNAME6= <>
##$DPNAME7= <>
##$DPOAL= (0..7)
0.5 0.5 0.5 0.5 0.5 0.5 0.5 0.5 
##$DPOFFS= (0..7)
0 0 0 0 0 0 0 0 
##$DQDMODE= 0
##$DR= 18
##$DS= 0
##$DSLIST= <SSSSSSSSSSSSSSS>
$$ [...]
##$SUBNAM0= <"">
##$SUBNAM1= <"">
##$SUBNAM2= <"">
##$SUBNAM3= <"">
##$SUBNAM4= <"">
##$SUBNAM5= <"">
##$SUBNAM6= <"">
##$SUBNAM7= <"">
##$SUBNAM8= <"">
##$SUBNAM9= <"">
##$SW= 18.0517328524113
##$SWIBOX= (0..15)
0 0 2 0 0 0 0 0 0 0 0 0 0 0 0 0 
##$SW_h= 3612.71676300578
##$TD= 16384
##$TD0= 1
##$TE= 0
##$TE2= 300
##$TE3= 300
##$TEG= 300
##$TL= (0..7)
0 120 120 120 120 120 120 120 
##$TP= (0..7)
150 150 150 150 150 150 150 150 
##$TP07= 0
##$TPNAME0= <>
##$TPNAME1= <>
##$TPNAME2= <>
##$TPNAME3= <>
##$TPNAME4= <>
##$TPNAME5= <>
##$TPNAME6= <>
##$TPNAME7= <>
##$TPOAL= (0..7)
0.5 0.5 0.5 0.5 0.5 0.5 0.5 0.5 
##$TPOFFS= (0..7)
0 0 0 0 0 0 0 0 
##$TUNHIN= 0
##$TUNHOUT= 0
##$TUNXOUT= 0
##$USERA1= <user>
##$USERA2= <user>
##$USERA3= <user>
##$USERA4= <user>
##$USERA5= <user>
##$V9= 5
##$VALIST= <valist>
##$VCLIST= <CCCCCCCCCCCCCCC>
##$VD= 0
##$VDLIST= <DDDDDDDDDDDDDDD>
##$VPLIST= <PPPPPPPPPPPPPPP>
##$VTLIST= <TTTTTTTTTTTTTTT>
##$WBST= 1024
##$WBSW= 4
##$XGAIN= (0..3)
0 0 0 0 
##$XL= 0
##$YL= 0
##$YMAX_a= 127700
##$YMIN_a= -149519
##$ZGOPTNS= <>
##$ZL1= 120
##$ZL2= 120
##$ZL3= 120
##$ZL4= 120
##$ABSF1= 10
##$ABSF2= 0
##$ABSG= 5
##$ABSL= 3
##$ALPHA= 0
##$AQORDER= 0
##$ASSFAC= 0
##$ASSFACI= 0
##$ASSFACX= 0
##$ASSWID= 0
##$AUNMP= <proc_1d>
##$AZFE= 0.1
##$AZFW= 0.1
##$BCFW= 1
##$BC_mod= 2
##$BYTORDP= 1
##$COROFFS= 0
##$CY= -3
##$DATMOD= 1
##$DC= 2
##$DFILT= <>
##$DTYPP= 0
##$F1P= 0
##$F2P= 0
##$FCOR= 0.5
##$FTSIZE= 0
##$FT_mod= 4
##$GAMMA= 1
##$GB= 0.15
##$INTBC= 1
##$INTSCL= 1
##$ISEN= 128
##$LB= 0.25
##$LEV0= 0
##$LPBIN= 0
##$MAXI= 10000
##$MC2= 0
##$MEAN= 0
##$ME_mod= 0
##$MI= 1.114404
##$NCOEF= 0
##$NC_proc= 0
##$NLEV= 6
##$NOISF1= 3.799351
##$NOISF2= 2.8
##$NSP= 1
##$NTH_PI= 0
##$NZP= 0
##$OFFSET= 14.38212
##$PC= 1
##$PHC0= -1206.987
##$PHC1= 17.39219
##$PH_mod= 1
##$PKNL= yes
##$PPARMOD= 0
##$PSCAL= 0
##$PSIGN= 0
##$REVERSE= no
##$SF= 200.129724274929
##$SI= 16384
##$SIGF1= 3
##$SIGF2= 2
##$SINO= 400
##$SIOLD= 16384
##$SREGLST= <1H.CDCl3>
##$SSB= 0
##$STSI= 0
##$STSR= 0
##$SW_p= 3205.1282051282
##$SYMM= 0
##$S_DEV= 0
##$TDeff= 0
##$TDoff= 0
##$TI= <>
##$TILT= no
##$TM1= 0
##$TM2= 0
##$TOPLEV= 0
##$USERP1= <user>
##$USERP2= <user>
##$USERP3= <user>
##$USERP4= <user>
##$USERP5= <user>
##$WDW= 1
##$XDIM= 8192
##$YMAX_p= 0
##$YMIN_p= 0
$$ End of Bruker specific parameters
$$ ---------------------------------
##NTUPLES= NMR FID
##VAR_NAME=  TIME,          FID/REAL,        FID/IMAG
##SYMBOL=    X,             R,               I
##VAR_TYPE=  INDEPENDENT,   DEPENDENT,       DEPENDENT
##VAR_FORM=  AFFN,          ASDF,            ASDF
##VAR_DIM=   8192,          8192,            8192
##UNITS=     SECONDS,       ARBITRARY UNITS, ARBITRARY UNITS
##FACTOR=    0.0002768,     1,               1
##FIRST=     0,             0,               0
##LAST=      2.2672688,     0,               0
##MIN=       0,             -149519,         0
##MAX=       2.2672688,     127700,          0
$$ Real data points
##PAGE= N=1
##DATA TABLE= (X++(R..R)), XYDATA
$$ plain form
0 0 0 0 0 0 0 0 0 0 0 0 0 0 0 0 0 0 0 -6 8 -8 8 -8 8 -8 16 -16 16 -23 24 -24 31 -32 39 -43 48 -55 63 -70 78
39 78 -87 95 -105 115 -128 142 -154 171 -189 207 -229 252 -277 306 -339 375 -416 463 -519 585 -663
60 -663 761 -882 1040 -1252 1559 -2028 2833 -4459 9043 -52804 -149519 -21117 92112 78512
74 78512 11317 -25353 -57886 -50382 11962 59134 29968 -16880 -27862 -12630 3315 18112
86 18112 22261 7368 -24033 -38107 -13277 25315 34596 18522 -4030 -25772 -33213 -5245 32610
99 32610 31434 -6210 -33528 -24340 11198 38072 25234 -14136 -33978 -21089 3964 23678 23227
112 23227 -2745 -23214 -10328 10403 9563 6098 7855 -11607 -33155 -9823 34515 32618 -10649
125 -10649 -28340 -5564 10302 38 -3113 11936 8538 -20278 -25170 13813 38743 11566 -23898
$$ packed form
0@%%%%%%%%%%%%%%%%%oJ4j6J6j6J6j6K4l2L2l9M7m8N5o3P1q2R1j03J18j33J48
39G8j65J82k00K20k43K70k96L25l60L96m36M81n29N83o45P14p91Q79r82J104j248
60f63J424j643J922k292K811l587M861p292J3502o1847r6715J28402J13229j3600
74G8512o7195l6670l2533P504O2344M7172k9166m6848j0982J5232J5945J4797
86A8112M149j4893l1401j4074K4830L8592R281j6074k2552k1742p441K7968L7855
99C2610j176l7644k7318R188L5538K6874j2838l9370j9842J2889K5053J9714m51
112B3227k5972k0469J2886K0731q40l465J757j9462k1548K3332M4338j897m3267
125a0649j7691K2776J5866j0264l151J5049l398k8816m892L8983K4930k7177l5464
$$ plain form
138 -23898 -27255 -11563 9238 28194 19067 -14843 -26353 -2342 14535 7068 1127 2041 -7270
151 -7270 -17116 -6078 16687 21491 3166 -14018 -12384 -4926 -929 8187 14995 3357 -14587 -12764
165 -12764 3793 11077 9327 2901 -11449 -18927 -2061 18302 15196 -2622 -13120 -9197 2871
178 2871 9365 2632 -5157 -2024 1552 -5089 -2259 12982 11918 -10554 -19097 -2270 13898 10270
192 10270 -3164 -9039 -3129 4917 5224 180 -1882 -1230 -2436 -3045 -518 3614 8740 5603 -9925
207 -9925 -14976 3027 15768 1845 -11328 -1843 5414 -2561 -2864 8730 6485 -8533 -10682 -435
221 -435 6057 6371 4865 -2355 -10460 -4819 8712 8070 -4044 -6530 749 2081 -3033 604 8812
236 8812 2848 -9088 -7185 2814 5249 2821 409 -4281 -5987 2483 7998 -828 -6375 1474 3658
$$ packed form
138b3898l357J5692K0801J8956r127l3910j1510K4011J6877p467n941R14r311
151g270r846J1038K2765M804j8325j7184J634P458L997R116O808j1638j7944J823
165a2764J6557P284j750o426j4350p478J6866K0363l106j7818j0498L923J2068
178B871O494o733p789L133L576o641K830J5241j064k2472q543J6827J6168l628
192A0270j3434n875N910Q046L07n044k062O52j206o09K527M132N126l137j5528
207i925n051J8003J2741j3923j3173R485P257p975l03J1594k245j5018k149J0247
221d35O492L14j506p220q105N641J3531o42j2114k486P279J332n114L637Q208
236H812n964j1936J903R999K435k428k412m690j706Q470N515q826n547P849K184
$$ plain form
251 3658 -5865 -4153 7909 7099 -4700 -6849 -382 1918 3011 4716 -2469 -8763 183 8692 1588
266 1588 -7186 -245 6197 -2744 -8374 2237 9841 473 -7638 -1969 4139 1164 -1247 909 -347
281 -347 -3386 1101 4092 -1936 -2642 4182 2565 -7464 -4145 8687 5744 -7219 -6160 4247 4203
296 4203 -1895 -1332 829 -1070 -924 1332 670 -666 1190 1567 -2861 -3648 2883 5653 -1275 -6366
312 -6366 -716 5097 1202 -2582 88 1277 -1613 -613 1727 -227 -840 2807 101 -5627 -742
327 -742 7236 2536 -6587 -2877 4203 1096 -2446 224 1873 -1066 -1140 627 -148 -33 2125 644
343 644 -3594 -2251 3356 3821 -2309 -4255 1500 3736 -1555 -3536 1699 3397 -1328 -3189 647 2438
359 2438 85 -166 -919 -1892 523 3495 42 -3782 -205 3440 52 -3296 168 3008 232 -2503
$$ packed form
251C658r523J712J2062q10j1799k149O467K300J093J705p185o294Q946Q509p104
266A588q774O941O442q941n630J0611P604r368q111N669O108k975k411K156j256
281c47l039M487K991o028p06O824j617j0029L319J2832k943j2963J059J0407m4
296D203o098N63K161j899J46K256o62j336J856L77m428p87O531K770o928n091
312f366N650N813l895l784K670J189k890J000K340j954o13L647k706n728M885
327g42P978m700r123L710P080l107l542K670J649k939p4J767p75J15K158j481
343F44m238J343N607M65o130j946N755K236n291j981N235J698m725j861L836J791
359B438k353k51p53r73K415K972l453l824L577L645l388l348L464K840k776k735
$$ plain form
375 -2503 -858 1430 1408 -260 -1671 -721 881 534 -203 -971 -860 665 1619 -910 -2262 879 2905
392 2905 -1590 -3615 1583 3515 -1284 -2051 687 419 -1012 1288 1476 -2254 -1753 2669 1085 -3166
408 -3166 -70 3681 -116 -4078 -293 3762 832 -2560 -480 1708 15 -816 706 268 -1625 -158
424 -158 1831 -830 -2464 2091 3278 -2663 -3629 3010 3301 -3319 -2768 3187 1854 -2954 -589 2334
440 2334 85 -1131 1180 -181 -2520 1051 3907 -929 -3482 207 2831 -723 -2502 922 2060
455 2060 -1332 -2021 1549 2003 -1491 -1650 1401 1046 -1516 505 1871 -1888 -2384 2746 2823 -3132 -2121
472 -2121 3136 1230 -2961 62 2570 -963 -2366 1447 1143 -1695 114 2152 -880 -2775 1169
487 1169 2840 -775 -2827 329 2376 -235 -2050 559 1928 -1128 -2179 1309 1729 -1236 -690 1591
$$ packed form
375b503J645K288k2j668j411R50J602l47p37p68J11J525R54k529j352L141K026
392B905m495k025N198J932m799p67K738k68j431K300J88l730N01M422j584m251
408c166L096L751l797l962L785M055k930l392K080K188j693q31J522m38j893J467
424a58J989k661j634M555J187n941r66O639K91o620N51N955j333m808K365K923
440B334k249j216K311j361k339L571K856m836k553L689K624l554j779L424J138
455B060l392o89L570M54l494j59L051l55k562K021J366l759m96N130P7n955J011
472b121N257j906m191L023K508l533j403L813l04k838J809K038l032j895L944
487A169J671l615k052L156K047k611j815K609J369l056j051L488M20k965N46K281
$$ plain form
503 1591 -314 -1781 2174 2086 -2881 -1289 3623 135 -4165 613 3812 -1004 -2644 1084 1588 -1460
519 -1460 140 1538 -689 -1482 1151 1219 -1086 -1048 386 936 -82 -632 329 328 -911 -331 2040 581
537 581 -2170 -1082 1731 273 -1182 966 600 -2613 -258 3206 283 -2538 175 1749 -696 -1113
553 -1113 1501 899 -1134 -509 387 130 196 325 -194 -149 -180 488 775 -1 -995 99 1331 -257 -1503
572 -1503 808 1565 -1240 -652 1803 244 -2244 190 1631 -787 -1045 1302 759 -1593 290 1625
588 1625 -587 -1647 383 830 -607 -765 447 967 -24 -1117 -310 765 -9 -264 753 268 -1980
605 -1980 -628 2444 70 -2026 797 1300 -1919 -706 2730 605 -2713 -220 2101 -599 -781 1104
621 1104 319 -1466 32 1423 -36 -1340 -51 933 206 -737 -55 628 -393 -1182 888 1662 -855
$$ packed form
503A591j905j467L955q8m967J592M912l488m300M778L199m816j640L728N04l048
519a460J600J398k227p93K633O8k305L8J434N50j018n50R61jj239N80K371j459
537E81k751J088K813j458j455K148l66l213K355L464k923k821K713J574k445m17
553a113K614o02k033O25Q96k57O6J29n19M5l1O68K87p76r94J094J232j588j246
572a503K311P57k805N88K455j559k488K434J441k418k58K347n43k352J883J335
588A625k212j060K030M47j437j58J212N20r91j093Q07J075p74k55J017m85k248
605a980J352L072k374k096K823N03l219J213L436k125l318K493K321k700j82J885
621A104p85j785J498J391j459j304J289R84p27r43O82O83j021p89K070P74k517
$$ plain form
638 -855 -1698 1066 1187 -1405 -136 1915 -1035 -2076 1343 2242 -1280 -1259 1543 -14 -1965 752 2117
655 2117 -903 -1992 867 1185 -868 -663 970 113 -1088 -151 1477 235 -1183 198 1377 -325
671 -325 -1714 597 1792 -1181 -1559 1447 846 -1946 -511 2198 -407 -2138 585 1583 -1478 -1318
687 -1318 1356 366 -1936 144 1576 -767 -1576 998 1353 -993 -1005 947 413 -931 28 1241 -256
704 -256 -1643 -75 1561 132 -895 718 470 -1105 -690 1406 632 -1388 -239 1297 -405 -1169
720 -1169 910 986 -1626 -679 1163 355 -1202 102 1162 -265 -1351 395 989 -772 -406 761 482
737 482 -800 -254 687 187 -628 -46 868 -143 -923 694 1034 -345 -884 714 782 -1045 -507 1296
755 1296 376 -1291 106 850 -461 -893 984 608 -979 -552 756 -50 -523 382 759 -375 -755 306
$$ packed form
638h55q43K764J21k592J269K051k950j041L419Q99l522K1K802j557j951K717J365
655B117l020j089K859L18k053K05J633q57j201R37J628j242j418J381J179j702
671c25j389K311J195k973l78L006o01k792J435K709k605j731K723R98l061J60
687a318K674r90k302K080J432k343q09K574L55k346j2J952n34j344R59J213j497
704b56j387J568J636j429j027J613k48j575M15K096p74k020J149J536j702p64
720a169K079P6k612R47J842q08j557J304J060j427j086J746N94j761L66J167k79
737D82j282N46R41n00q15N82R14j011p80J617L40j379n39J598O8j827N38J803
755A296r20j667J397P44j311m32J877l76j587M27J308q06m73R05L77j134l80J061
$$ plain form
773 306 113 -426 -412 843 78 -887 107 810 35 -888 -68 938 -381 -645 509 709 -545 -330 1259
792 1259 134 -1196 247 1193 -431 -937 685 692 -777 -691 920 407 -1175 13 1000 -394 -953 389
810 389 454 -450 -547 760 505 -940 -332 584 729 -943 -213 890 4 -1120 61 1149 -756 -1174
828 -1174 509 646 -1192 -522 1359 -319 -1425 751 1156 -814 -939 899 579 -1075 -523 754 182
845 182 -1185 61 1065 -213 -684 208 426 -639 -857 1123 643 -1190 -288 1430 76 -1327 112
862 112 1180 -905 -862 1269 681 -1335 -444 1622 -94 -1642 360 1231 -740 -850 776 729 -1041
879 -1041 -169 1259 58 -1027 12 705 -511 -553 641 637 -865 -711 1161 495 -868 -261 1235 190
897 190 -912 290 1268 -562 -619 804 562 -966 -326 1056 54 -1266 336 1040 -759 -845 1055
$$ packed form
773C06j93n39J4J255p65r65R94P03p75r23Q20J006j319k64J154K00j254K15J589
792A259j125j330J443R46j624n06J622Pj469Q6J611n13j582J188R87j394n59J342
810C89O5r04r7J307k55j445O08R16J45j672P30J103q86j124J181J088j905m18
828a174J683J37j838O70J881j678j106K176M05j970j25J838l20j654N52J277n72
845A82j367J246J004j278m71Q92K18j065k18J980m80j833R02J718j354j403J439
862A12J068k085M3K131n88k016Q91K066j716j548K002Q71j971j10J626m7j770
879a041Q72J428j201j085J039O93j216m2J194mj502J54J872o66j363O07J496j045
897A90j102J202R78j830n7J423k42j528O40J382j002j320J602P04j799q6J900
$$ plain form
914 1055 320 -775 -381 733 67 -452 255 724 -326 -408 433 549 -651 -594 419 439 -670 -74 1038
933 1038 354 -858 176 928 -565 -778 455 1067 -873 -513 1056 28 -1188 178 994 -389 -864
950 -864 659 424 -631 -351 878 175 -720 -46 743 -193 -332 175 366 -511 -538 342 386 -549 -223 514
970 514 408 -788 -88 655 39 -1130 -31 566 -685 -544 648 437 -1091 17 927 -205 -782 343
988 343 471 -367 -305 716 161 -888 -110 399 -140 -373 44 333 -281 -506 438 600 -422 -813 102 628
1008 628 -610 -351 920 107 -940 201 1158 -166 -831 740 483 -831 -288 920 33 -1303 548
1025 548 665 -569 -508 608 90 -180 98 952 319 -644 -495 590 -144 -524 72 433 -152 -1196 534
1044 534 926 -644 -605 691 163 -1145 432 1397 -535 -1094 857 548 -880 -680 952 -299 -671
$$ packed form
914A055p35j095L94J114o66n19P07M69j050q2Q41J16j200N7J013K0j109N96J112
933A038o84j212J034P52j493k13J233O12j940L60J569j028j216J366Q16j383m75
950h64J523k35j055K80J229p03q95O74P89r36j39N07J91q77k7Q80M4r35L26P37
970E14j06j196P00P43o16j169J099N97j251J41J192k11j528J108R10j132n77J125
988C43J28q38O2J021n55j049P78N09n39k33M17K89o14k25R44J62j022l91R15N26
1008F28j238K59J271q13j047J141R57j324o65J571k57j314N43J208q87j336J851
1025E48J17j234O1J116n18k70K78Q54o33r63J49J085p34l80N96L61n85j044J730
1044E34L92j570L9J296n28j308J577R65j932n59J951l09j428K00J632j251l72
$$ plain form
1061 -671 406 886 -544 -391 401 46 -507 -297 269 152 -421 -370 925 468 -733 -298 812 4 -856
1080 -856 346 891 -786 -663 1186 278 -1231 373 1046 -574 -926 1101 778 -1300 -565 1020 -123
1097 -123 -564 172 556 -399 -643 425 352 -288 -208 364 437 -146 78 634 99 -735 -528 1041 57 -809
1117 -809 156 576 -1080 -336 1090 431 -1202 82 1180 -540 -401 725 241 -1161 56 1097 -137
1134 -137 -674 376 292 -456 -293 444 493 -238 -449 -97 318 -103 -362 259 98 -1180 -150 824 62 -888
1154 -888 240 701 -700 -410 979 -5 -1102 93 865 -430 -258 456 415 -725 16 756 -14 -614
1172 -614 13 368 132 15 34 485 -66 -485 196 552 -60 -460 62 460 -486 -116 834 240 -737 156
1192 156 633 -678 -752 939 214 -749 110 849 18 -795 153 372 -335 -130 420 241 -522 -187 340 213
$$ packed form
1061f71J077M80j430J53P92l55n53K10N66j17n73N1J295m57j201M35J110q08q60
1080h56J202N45j677J23J849r08j509J604O73j620l52K027l23k078P35J585j143
1097a23m41P36L84r55k44J068p3o40Q0N72P3n83K24N56n35q34K07J569r84q66
1117h09R65M20j656P44J426o59j633J284J098j720J39J126m84j402J217J041j234
1134a37n37J050q4p48J63P37M9p31k11L52M15m21k59O21j61j278J030R74p62r50
1154h88J128M61j401K90J389r84j097J195P72j295J72P14m1j140P41P40p70o00
1172f14O27L55k36j17J9M51n51m19O81L56o12m00N22L98r46L70R50n94r77Q93
1192A56M77j311p4J691p25r63Q59P39q31q13R48K19p07K05N50j79p63L35N27j27
$$ plain form
1212 213 -434 157 616 231 -575 212 712 -99 -739 378 502 -777 -325 853 -26 -1006 152 931 -459
1231 -459 -719 737 470 -623 -267 985 -2 -687 105 637 -291 -646 488 251 -236 -333 406 86 -532
1250 -532 -52 783 -97 -549 235 364 -247 -745 241 544 -425 -578 879 317 -934 -117 757 -440 -515
1269 -515 343 673 -556 -499 701 107 -714 35 835 -160 -330 320 582 -413 -200 547 241 -220 -44 722
1289 722 14 -623 133 687 103 -641 291 207 -722 -144 447 589 -714 96 793 -363 -944 329 516
1308 516 -922 -476 748 294 -1070 121 982 -309 -802 579 302 -267 -311 518 474 -523 -190 624 -105
1327 -105 -436 117 423 -76 -555 235 314 -164 -422 377 410 -438 -312 634 -243 -550 159 644 -534 -575 552
1348 552 137 -780 -250 431 -184 -250 230 539 -597 -249 251 359 -385 -318 279 -73 -189 -248 551 -29 -567
$$ packed form
1212B13o47N91M59l85q06P87N00q11o40J117J24j279M52J178q79r80J158P79j390
1231d59k60J456k67j093L56J252r87o85P92N32r28l55J134k37m87r7P39l20o18
1250e32M80Q35q80m52P84J29o11m98R86L03r69j53J457n62j251Q17Q74j197p5
1269e15Q58L30j229N7J200n94q21P49Q00r95j70O50K62r95K13P47l06m61J76P66
1289G22p08o37P56N54n84p44R32q4r29N78N91J42j303Q10O97j156n81J273J87
1308E16j438M46J224m54j364J191Q61j291m93J381k77n69m4Q29m4r97L33Q14p29
1327a05l31N53L06m99m79P90P9m78k58P99L3q48J26R46q77l07P09M85j178m1J127
1348E52m15r17N30O81o15o6M80L09j136L48N00J08p44O7N97l52j16n9P99n80n38
$$ plain form
1369 -567 63 461 31 -553 251 414 -601 -326 459 25 -781 48 704 -577 -381 497 147 -400 -179
1388 -179 620 39 -730 99 522 -421 -485 333 171 -156 -443 303 247 -493 -241 415 61 -289 22 731 -205
1409 -205 -440 61 524 -511 -554 635 330 -696 151 842 -130 -663 430 474 -479 -435 565 408 -444
1428 -444 84 537 24 -92 364 388 -429 -380 284 293 -280 -362 556 244 -335 78 642 91 -657 174 381 -215
1450 -215 -252 668 265 -594 30 638 -175 -550 191 378 -461 -541 351 184 -650 386 354 -469 -550 204 419
1471 419 -164 -268 245 230 -202 -334 283 148 -578 -273 664 104 -743 26 409 -482 -283 536 341 -616
1491 -616 -190 817 -81 -523 257 560 -388 -277 527 191 -709 -78 376 -153 -524 58 404 -256 -703 163
1511 163 174 -178 -86 296 231 -487 -59 662 -35 -445 17 427 -178 -591 613 523 -673 -217 764 -190 -445
$$ packed form
1369e67O30L98m30n84Q04J63j015K75P85m34q06Q29O56j281J96Q78l50n47K21
1388a79P99n81p69Q29M23r43o4Q18j62l27k87P46n6p40K52O56l54l50L11P09r36
1409b05k35N01M63j035m3J189l05j026Q47O91r72n33J093M4r53M4J000j57q52
1428d44N28M53n13j16M56K4q17M9O64Rn73q2R18l12n79M13N64n51p48Q31K07n96
1450b15l7R20m03q59O24O08q13l75P41J87q39q0Q92j67q34J036l2q23q1P54K15
1471D19n83j04N13j5m32j32O17j35p26L05R37n60q47P69L83q91J99Q19j95r57
1491f16M26J007q98m42P80L03r48J11Q04l36r00O31M54n29l71N82L46o60m47Q66
1511A63J1l52R2L82o5p18M28P21o97m10M62M10o05m13J204r0j196M56R81r54k55
$$ plain form
1532 -445 409 485 -379 -296 817 16 -476 -132 487 25 -289 11 -80 71 -188 241 167 -139 -577 439 398
1553 398 -253 -323 512 174 -670 237 617 -45 -297 355 366 -565 91 367 -54 -603 164 556 -458 -248
1573 -248 547 206 -377 385 381 155 -382 -100 249 250 -34 -10 -131 -25 -205 227 326 -514 -284 314 85 -368
1595 -368 -69 775 -482 -727 512 285 -586 -603 389 -195 -324 474 388 -237 -340 275 322 -200 -147 349 77
1616 77 -233 -147 278 650 -226 -620 585 386 -386 37 476 -451 -196 873 284 -680 96 886 -222 -793
1636 -793 532 218 -496 -457 488 149 -362 126 34 -121 -246 161 397 -182 -350 90 39 -111 -354 208 425
1657 425 -512 -143 495 487 -496 -30 271 -354 -423 636 364 -406 259 490 -457 -380 341 658 -399 -528 163
1678 163 -100 -246 -300 -38 -26 -138 152 100 -316 -381 84 107 -411 -490 402 153 -422 129 732 24 -631 18
$$ packed form
1532d45Q54P6q64Q3J113q01m92L44O19m62l14L00r1J51k59M29p4l06m38J016m1
1553C98o51p0Q35l38q44R07L80o62k52O52J1r31O56K76m21n49P67L92j014K10
1573b48P95l41n83P62mk26n37K82L49Jk84K4j21J06j80M32R9q40K30N98k29m53
1595c68K99Q44j257k45J239k27q71j7R92n84j29P98q6o25j03O15M7n22N3M96k72
1616G7l10Q6M25L72q76l94J205j99p72M23M39r27K55J069n89r64P76P90j108n71
1636g93J325l14p14L9R45l39n11M88r2j55j25M07K36n79j68M40n1j50k43N62K17
1657D25r37L69O38qr83M66L01o25o9J059k72p70O65K31r47P7P21L17j057j29O91
1678A63k63j46n4K62J2j12K90n2m16o5M65K3n18p9Q92k49n75N51O03p08o55O49
$$ plain form
1700 18 479 -122 -490 494 195 -580 324 408 19 -607 425 579 -495 -37 595 496 -526 187 556 144
1720 144 -250 -200 5 108 -210 107 234 -417 91 436 166 -513 121 645 24 -561 -36 486 29 -484
1740 -484 340 367 -145 -13 404 31 -496 170 131 -350 -418 494 -135 -371 -324 298 269 -261 -180 295 -3 -291
1762 -291 -9 61 -12 -107 303 -91 -406 66 290 -180 -660 280 446 -350 -627 156 303 -473 -438 260 260 -429
1784 -429 111 242 -202 -79 467 167 -288 136 69 282 -574 -194 370 -59 -344 -144 281 -16 -415 -48
1804 -48 158 -22 -42 281 -355 -541 -73 295 -188 -465 320 556 -533 -413 233 163 -192 -204 108 139 -437
1825 -437 323 110 -144 -201 234 219 -320 202 433 -116 -525 12 278 73 -300 3 690 -81 -317 -130 115
1846 115 8 -62 160 -272 -238 168 583 -410 -435 626 260 -433 -388 487 403 -480 189 382 34 -405 90
$$ packed form
1700A8M61o01l68R84k99p75R04Q4l89o26J032J54j074M58O32r9j022P13L69m12
1720A44l94N0K05J03l18L17J27o51N08L45k70o79O34N24o21n85N25N22m57n13
1740d84Q24K7n12J32M17l73n27O66l9m81o8R12o29k36M7O22k9n30Q1M75k98k88
1762b91K82P0p3r5M10l94l15M72K24m70m80R40J66p96k77P83J47p76L5O98%o89
1784d29N40J31m44J23N46l00m55M24o7K13q56L80N64m29k85K00M25k97l99L67
1804d8K06j80k0L23o36j86M68L68m83k77P85K36j089J20O46p0l55j2L12L1n76
1825d37P60k13k54n7M35j5n39N22K31n49m09N37K66k05l73L03O87p71k36J87K45
1846A15j07p0K22m32L4M06M15r93k5J061l66o93M5Q75q4q83O69J93l48m39M95
$$ plain form
1867 90 -46 -163 33 217 -72 -529 74 363 -89 -540 254 498 -130 -679 322 626 -463 -187 438 -86
1887 -86 -386 265 325 -581 -344 343 81 -620 -136 539 -155 -685 -93 264 81 -498 100 175 -109 -85 279
1908 279 -201 -169 -3 197 52 -351 74 148 -381 -574 259 468 -576 -414 395 137 -156 27 430 -288
1928 -288 -165 275 111 -338 -26 403 353 -369 -58 422 12 -404 89 258 -283 -169 -160 -108 202 145 280 -175
1950 -175 -156 182 375 -307 -409 332 456 -331 -533 250 432 -268 -266 336 253 -210 277 236 -152 -85 299 -150
1972 -150 -382 200 328 3 -301 -107 566 -183 -356 -19 54 -38 35 -57 186 -269 74 -80 -22 -326 -40 137
1994 137 -300 -190 350 431 -571 -289 498 27 -290 -149 186 -149 -70 221 159 -491 18 464 -103 -437 -2
2015 -2 307 -512 -196 73 657 -285 -317 52 94 42 -130 288 125 -299 61 295 -154 -150 496 186 -808 -495
$$ packed form
1867I0j36j17J96J84k89m57O03K89m52m51P94K44o28n49J001L04j089K76O25n24
1887h6l00O51O0r06K37O87k62p01M84O75o94n30N92L57j83n79N98P5k84K4L64
1908B79m80L2J66K00j45m03M25P4n29j93Q33K09j044J62Q09k58k93J83M03p18
1928b88J23M40j64m49L12M29n0p22L11M80m10m16M93J69n41J14RN2L10n7J35m55
1950a75J9L38J93o82j02P41J24p87k02P83J82p00KO02q3m63M87m1l88O7L84m49
1972a50k32N82J28l25l04J94O73p49j73L37P3r2P3r2K43m55L43j54N8l04K86J77
1994A37m37J10N40Q1j002K82P87m71l17J41L35l35P9K91o2o50N09M46n67l34M35
2015bL09q19L16K69N84r42l2L69M2n2j72M18j63m24L60K34m49MO46l10r94L13
$$ plain form
2037 -495 544 46 -467 -57 494 352 -136 115 -17 -270 94 134 -156 -53 222 442 -366 -413 128 272
2057 272 -251 -372 -130 335 -264 -289 396 178 -266 -36 2 -133 -107 464 224 -407 -11 453 130 -752 -17
2078 -17 495 47 -500 256 322 -325 132 91 108 -92 -186 102 -370 -266 252 279 -349 -485 148 565 -150 -625
2100 -625 231 373 -167 0 323 -239 -414 28 109 -450 -242 408 -223 -549 228 574 69 -412 149 110 -18
2121 -18 -205 38 20 -42 -174 183 213 -276 -46 174 54 -207 277 395 -242 -295 675 242 -417 -203 464 147
2143 147 -407 -48 344 -305 -132 229 -378 -54 278 330 -308 -329 328 148 -122 -166 208 443 12 -222 184
2164 184 2 -137 -154 33 94 -65 34 252 -132 -205 466 -43 -181 -52 535 -32 -327 176 -24 -197 -174 261
2186 261 278 -320 219 348 -47 -23 -20 218 300 -312 82 208 -339 -408 377 101 -130 -56 431 130 -356 52
$$ packed form
2037d95J039m98n13M10N51j42m88K51j32k53L64M0k90J03K75K20q08m7N41J44
2057B72n23j21K42M65n99k5O85k18m44K30L8j35K6N71k40o31L96M64l23q82P35
2078a7N12m48n47P56O6o47M57m1J7k00r4K88m72J04N18K7o28j36O33M17p15m75
2100f25Q56J42n40J67L23n62j75M42Q1n59K08O50o31l26P77L46n05m81N61l9j28
2121a8j87K43j8o2j32L57L0m89K30K20j20k61M84J18o37n3R70m33o59K14O67l17
2143A47n54L59L92o49J73L61o07L24L32N2o38k1O57j80k70m4L74K35m31k34M06
2164A84j82j39j7J87O1j59R9K18l84p3O71n09j38J29N87n67k95N03k00j73K3M35
2186B61J7n98N39J29l95K4LK38Q2o12L94J26n47o9P85k76k31P4M87l01m86M08
$$ plain form
2208 52 95 -119 -281 232 20 -521 -108 448 178 -284 119 409 -36 -215 -55 416 -148 -236 263 132 -153
2229 -153 -163 -54 132 -258 166 463 -334 -255 229 240 -318 -225 341 134 -309 79 344 -232 -266 96 63 -574
2251 -574 -177 630 -96 -379 156 271 30 -162 -248 36 -71 -169 40 161 -156 24 17 -82 -176 292 -105 -243
2273 -243 -196 227 426 -138 -162 252 88 -273 -181 146 -250 -282 128 30 -41 -83 51 163 -188 63 255 -160
2295 -160 -339 -39 410 -418 -366 -53 229 -113 -24 113 -111 -290 192 266 -280 -214 160 247 -352 34 496 60
2317 60 -350 -231 441 -196 -482 46 309 -107 -289 320 377 -214 198 147 -197 85 14 209 -242 -144 76 -43
2339 -43 -189 0 4 15 -216 -71 -13 116 21 185 271 -253 -317 149 136 -251 13 144 -94 -82 55 419 -64
2362 -64 -78 137 385 -324 -10 305 44 -156 86 119 -486 -467 288 274 -150 37 316 79 -41 20 251 132
$$ packed form
2208E2M3k14j62N13k12n41M13N56k70m62M03K90m45j79J60M71n64q8M99j31k85
2229a53j0J09J86l90M24K97p97P9M84J1n58R3N66k07m43L88K65n76l4L62l3o37
2251e74L97Q07p26k83N35J15k41j92q6K84j07r8K09J21l17J80pr9r4M68l97j38
2273b43M7M23J99n64k4M14j64l61R2L27l96l2M10r8p1m2J34J12l51K51J92m15
2295a60j79L00M49q28N2L13K82l42Q9J37k24j79M82P4n46O6L74Q7n99L86M62m36
2317F0m10J19O72o37k86N28K63m16j82O09N7n91M12n1l44K82p1J95m51R8K20j19
2339d3j46J89MJ1k31J45N8J29r5J64Q6n24o4M66j3l87K64J31k38J2J37L64m83
2362f4j4K15K48p09L14L15k61k00K42L3o05J9P55j4m24J87K79k37j20O1K31j19
$$ plain form
2384 132 -242 -43 299 88 -270 141 -174 -117 -190 316 116 -314 -139 359 69 -136 70 308 -294 -61 160
2405 160 5 -163 191 260 -127 -22 37 251 -273 -126 90 95 -279 64 177 -116 -171 -368 294 -53 -83 201
2427 201 362 33 -97 83 -29 27 56 425 -126 -435 119 325 -407 -351 382 362 53 42 -72 28 -445 -260
2449 -260 157 -328 -176 174 119 -253 -34 229 229 -69 -159 271 -17 -312 58 241 -129 -313 370 71 -378
2470 -378 -186 99 -111 -365 91 -65 -316 -161 242 -27 -196 98 499 13 -361 -136 548 -108 -115 -24 245
2491 245 -57 -94 102 29 -100 -83 247 -155 -163 292 247 64 -349 44 207 -331 83 311 29 -375 330 641
2513 641 -63 -303 49 230 -406 8 224 200 8 54 -95 -190 -270 124 84 -225 44 -108 175 -28 145 258
2535 258 216 -238 -63 462 -157 -42 299 243 -205 1 253 28 -126 -16 229 1 32 140 -159 -119 -167 243
$$ packed form
2384A32l74J99L42k11l58M11l15N7p3N06k00m30J75M98k90k05K06K38o02K33K21
2405A60j55j68L54O9l87J05N9K14n24J47K16Nl74L43J13k93n5j97O62l47l0K84
2427B01J61l29j30J80j12N6K9L69n51l09N54K06p32N6P33k0l09j1j14J00m73J85
2449b60M17m85J52L50n5l72K19K63%k98r0M30k88k95L70J83l70j84O83k99m49
2470c78J92K85k10k54M56j56k51J55M03k69j69K94M01m86l74K25O84o56pR1K69
2491B45l02l7J96p3j29J7L30m02qM55m5j83m13L93J63n38M14K28k82m04P05L11
2513F41p04k40L52J81o36M14K16k4j92M6j49r5q0L94m0l09K69j52K83k03J73J13
2535B58m2m54J75N25o19J15L41n6m48K06K52k25j54J10K45k28L1J08k99M0m8M10
$$ plain form
2557 243 -46 -197 -166 108 91 61 315 231 -34 -20 83 -73 92 -61 148 -24 -399 -3 81 -214 -251 168
2579 168 278 -258 -111 151 67 -141 71 -129 -286 -79 -61 241 -219 5 58 -65 25 -80 -34 -107 -165 -20
2601 -20 -211 247 -120 -147 258 -244 -327 268 134 -160 -118 341 -94 -254 -8 -54 -586 -395 125 -135 -418 81
2623 81 524 25 -183 188 -225 36 86 190 78 -140 -273 -62 170 -30 134 5 86 -103 135 389 237
2644 237 -186 -104 127 -396 -328 459 168 -482 179 238 -271 -291 286 -38 -168 -166 280 143 -211 91 232 -158
2666 -158 57 183 83 117 111 197 18 -236 -297 194 119 137 214 167 -320 -171 284 295 -289 -95 276 -138 -222 38
2690 38 310 -180 -128 192 174 -122 -57 372 -413 -171 71 220 -250 -133 -150 383 -63 -94 10 45 -107 -154 24
2713 24 -11 -4 -137 247 57 -132 24 247 -13 -298 166 -100 24 88 6 -336 -162 56 123 8 -52 233 58
$$ packed form
2557B43k89j51L1K74j7l0K54q4k65J4J03j56J65j53K09j72l75L96Q4k95l7M19
2579A68J10n36J47K62q4k08K12k00j57K07J8L02m60K24N3j23R0j05M6p3n8J45
2601b0j91M58l67k7M05n02q3N95j34k94M2M59m35j60K46m6n32J91N20k60k83M99
2623H1M43m99k08L71m13K61N0J04j12k18j33K11K32k00J64j29Q1j89K38K54j52
2644B37m23Q2K31n23O8P87k91o50O61N9n09k0N77l24j30KM46j37l54L02J41l90
2666a58K15J26j00L4oQ6j79k54o1M91p5J8P7m7m87J49M55J1n84J94L71m14q4K60
2690C8K72m90N2L20j8k96O5M29p85K42K42J49m70J17j7N33m46l1J04L5j52m7J78
2713B4l5Pj33L84j90j89J56K23k60k85M64k66J24O4q2l42J74K18O7j15o0K85j75
$$ plain form
2736 58 -175 -100 250 178 -267 31 -61 -247 -190 -107 211 -190 -132 259 310 -302 115 170 -102 326 212 -6 132
2759 132 -240 61 124 120 -2 113 -52 -155 98 42 -74 14 9 -103 -241 -229 245 -164 -120 -59 139 -117 -48 192
2783 192 62 36 -231 153 -83 -178 146 408 -130 -96 51 273 31 11 263 31 -10 -206 97 -315 18 17
2805 17 162 -73 -212 252 490 112 -27 236 -359 75 -167 -86 164 -218 14 208 -29 29 89 35 -227 -22
2827 -22 68 52 -116 -88 265 -76 -219 31 65 -341 86 301 -3 -140 14 -42 52 -62 350 117 12 38 -90
2850 -90 89 -130 -30 214 220 -309 249 96 -149 -127 192 -203 -158 -365 195 -218 -141 -33 62 -70 48 96 91
2873 91 -156 -160 254 63 -360 -211 173 -222 134 77 -74 74 97 202 43 -42 125 28 153 -380 177 6
2895 6 112 161 -181 -9 -257 -196 150 -22 -481 -37 217 2 -172 218 67 -191 -108 406 307 -82 -157 662
$$ packed form
2736E8k33P5L50p2m45K98r2j86N7Q3L18m01N8L91N1o12M17N5k72M28j14k18J38
2759A32l72L01O3mj22J15j65j03K53n6j16Q8nj12j38J2M74m09M4O1J98k56O9K40
2783A92j30k6k67L84k36r5L24K62n38L4J47K22k42k0K52k32m1j96L03m12L33j
2805A7J45k35j39M64K38l78j39K63n95M34k42Q1K50l82K32J94k37N8O0n4k62K05
2827b2R0j6j68K8L53l41j43K50L4m06M27K15l04j37J54n6R4j14M12k33j05K6j28
2850i0J79k19J00K44On29N58j53k45K2L19l95M5k07N60m13P7J08R5j32J18M8n
2873I1k47mM14j91m23J49L84l95L56n7j51J48K3J05j59q5J67r7J25n33N57j71
2895FJ06M9l42J72k48O1L46j72m59M44K54k15j74L90j51k58Q3N14r9l89p5Q19
$$ plain form
2917 662 -108 114 165 -111 -214 58 218 108 -320 -75 167 32 -364 -61 166 -72 -132 62 153 -147 66
2938 66 84 133 163 -90 277 147 -336 266 229 -207 -201 -145 116 -416 -44 164 341 -343 147 67 -81 -42 366
2961 366 -92 -439 -306 86 243 -153 170 350 -100 -174 22 243 -127 -263 -128 99 -123 -27 136 9 -259
2982 -259 138 287 -148 -277 204 -128 -153 -91 216 -76 -62 77 -141 -229 -64 -99 208 143 69 51 90 -238 -14
3005 -14 78 97 122 -33 261 -229 -56 24 129 -265 -238 260 53 -303 -168 174 -114 -150 94 149 -169 169 253
3028 253 -218 37 -179 117 135 -429 261 -275 -351 101 113 -145 36 129 82 81 -309 41 460 28 28 203 281
3051 281 -33 85 217 216 -258 -44 92 77 -316 23 296 56 100 246 12 -340 -51 203 58 -98 -62 58
3073 58 24 -125 159 110 -97 -32 59 283 -103 201 16 -81 -291 288 142 -356 -34 148 181 -397 -65 -40 250
$$ packed form
2917F62p70K22N1k76j03K72J60j10m28K45K42j35l96L03K27k38o0J94R1l00K13
2938F6J8M9L0k53L67j30m83O02l7m36ON6K61n32L72K08J77o84M90q0j48L9M08
2961C66m58l47J33L92J57l96L23J80m50p4J96K21l70j36J35K27k22R6J63j27k68
2982b59L97J49m35j29M81l32k5O2L07k92J4J39k18q8J65l5L07o5p4j8L9l28K24
3005a4R2J9K5j55K94m90J73Q0J05l94K7M98k07l56J35L42k88l6K44N5l18L38Q4
3028B53m71K55k16K96J8n64O90n36p6M52J2k58J81R3m7jl90L50M19m32%J75P8
3051B81l14J18J32jm74K14J36j5l93L39K73k40M4J46k34l52K89K54j45j56L6J20
3073E8l4j49K84m9k07O5R1K24l86L04j85r7k10N79j46m98L22J82L3n78L32K5K90
$$ plain form
3096 250 -606 313 148 -75 -208 84 258 -281 -53 228 -180 -361 -191 -127 -108 40 -130 167 150 -80 39
3117 39 141 -140 -86 135 84 -335 29 145 -32 -186 139 -49 -139 -195 90 95 -366 -85 63 -401 -90 282
3139 282 24 -25 -50 11 32 -155 116 136 -32 -266 261 121 -31 -183 15 316 -169 94 60 -212 -80 -10
3161 -10 256 -12 102 224 261 -278 6 198 -6 -261 -154 177 23 136 210 -127 110 -72 61 38 9 177
3183 177 132 36 -465 -202 164 -134 -184 353 116 -309 -38 160 -130 -197 280 164 209 -117 7 -192 -286 -93
3205 -93 283 -34 -193 -23 319 67 -180 64 197 55 -66 249 167 -155 -75 120 37 171 43 290 58
3226 58 -57 361 256 172 58 352 -221 -352 -88 263 69 -182 273 -67 -299 -30 119 85 -208 229 122
3247 122 252 -200 223 202 -91 -330 60 16 -168 192 103 290 -238 38 169 61 37 92 86 -101 -225 99
$$ packed form
3096B50q56R19j65k23j33K92J74n39K28K81m08j81J70O4J9J48j70K97j7k30J19
3117C9J02k81N4K21n1m19L64J16j77j54L25j88r0n6K85Nm61K81J48m64L11L72
3139B82k58m9k5O1K1j87K71K0j68k34N27j40j52j52J98L01m85K63l4k72J32P0
3161a0K66k68J14J22L7n39K84J92k04k55J07L31j54J13P4l37K37j82J33k3k9J68
3183A77m5r6n01K63L66k98n0N37k37m25K71J98k90o7M77j16M5l26J24j99r4J93
3205i3L76l17j59J70L42k52k47K44J33j42j21L15q2l22Q0J95q3J34j28K47k32
3226E8j15M18j05q4j14K94n73j31K64L51j94k51M55l40k32K69J49l4k93M37j07
3247A22J30m52M23k1k93k39L90m4j84L60q9J87n28K76J31j08k4N5oj87j24L24
$$ plain form
3269 99 130 -204 -218 53 -234 -25 103 -159 -139 -306 -1 63 -95 -10 136 -49 -140 70 -71 135 -15 125
3291 125 288 -478 112 215 195 -219 132 103 -191 -315 151 291 -79 -273 -53 -93 44 -68 42 -59 -16
3312 -16 50 -49 147 -121 66 -148 -97 57 -49 -78 60 -73 151 -253 -15 207 181 -17 194 75 4 -48 181
3335 181 144 -106 -124 -203 83 -64 45 131 -90 23 110 -195 20 113 188 -298 -189 -56 246 282 -252 114 -6
3358 -6 71 -62 12 86 -332 -60 -50 89 120 -54 172 48 -407 -195 111 -169 -222 -306 192 71 -433 -38 178
3381 178 -105 -38 380 97 -70 86 137 12 -196 112 10 -174 297 -141 59 -63 68 174 -225 -77 -87
3402 -87 59 166 -413 -196 109 182 -129 43 -30 -363 185 -130 -74 -226 237 37 -28 161 415 240 -222 128
3424 128 225 168 -94 125 242 -100 -158 -123 -204 4 -184 145 -74 -303 206 -69 204 -108 145 157 152 -56 94
$$ packed form
3269I9L1l34j4K71k87K09J28k62K0j67L05O4j58Q5J46j85r1K10j41K06j50J40
3291A25J63p66N90J03k0m14L51k9k94j24M66J40l70j94K20m0J37j12J10j01M3
3312a6O6r9J96k68J87k14N1J54j06k9J38j33K24m04K38K22k6j98K11j19p1n2K29
3335A81l7k50j8p9K86j47J09Q6k21J13Q7l05K15R3P5m86J09J33L02L6n34L66j20
3358fP7j33P4P4m18K72J0J39L1j74K26j24m55K12L06k80n3q4M98j21n04L95K16
3381A78k83O7M18k83j67J56N1j25k08L08j02j84M71m38K00j22J31J06l99J48j0
3402h7J46J07n79K17L05P3l11J72p3l33N48l15N6j52M63k00o5J89K54j75m62L50
3424A28R7n7k62K19J17l42n8L5q1K08j88L29k19k29N09k75K73l12K53J2nk08J50
$$ plain form
3447 94 -176 -137 -55 108 104 -49 253 329 -266 -312 156 90 187 19 29 135 -274 50 89 10 32 175 27 -148
3471 -148 129 -34 200 -84 -211 38 38 42 66 73 -55 80 123 1 -203 -93 65 -125 24 -154 282 -79 -196
3494 -196 -63 75 -227 49 99 -36 -218 -240 161 63 -115 158 227 -93 -219 95 114 -95 -262 -9 -80 6
3516 6 -229 164 -172 -76 92 -196 -34 187 186 -38 -307 -177 103 -176 -190 -234 24 -55 -94 -90 -48 -220 -215 231 148
3541 148 -161 -105 -62 -76 134 -37 -194 143 26 -47 100 80 -431 200 -217 -429 -100 83 -320 -198 -74 -117
3563 -117 -154 -49 180 339 -56 5 81 -245 -169 85 -40 12 -111 147 -102 87 102 75 32 37 -48 -81 -22 -310
3587 -310 108 197 -92 -230 -267 280 204 139 69 -50 -170 -61 139 -198 63 230 53 -77 123 -85 -43 -286
3609 -286 270 36 128 -270 76 248 42 53 239 -17 -236 -30 99 -1 -102 243 134 18 -165 359 276
$$ packed form
3447I4k70L9Q2J63mj53L02P6n95m6M68o6R7j68J0J06m09L24L9p9K2J43j48j75
3471a48K77j63K34k84j27K49%MK4Pj28J35M3j22k04J10J58j90J49j78M36l61j17
3494a96J33J38l02K76N0j35j82k2M01r8j78K73O9l20j26L14J9k09j67K53p1Q6
3516Fk35L93l36R6J68k88J62K21jk24k69J30K80k79j4m4K58p9l9MM2j72NM46q3
3541A48l09N6M3j4K10j71j57L37j17p3J47k0n11O31m17k12L29J83m03J22J24m3
3563a17l7J05K29J59l95O1P6l26P6K54j25N2j23K58k49J89J5k7m3Nq5l3N9k88
3587c10M18Q9k89j38l7N47p6o5p0j19j20J09K00l37K61J67j77j30K00k08M2k43
3609b86N56k34R2l98L46J72k06J1J86k56k19K06J29j00j01L45j09j16j83N24q3
$$ plain form
3630 276 -236 32 30 -270 -333 -31 251 -111 -3 -53 221 -253 -72 172 123 110 56 122 -289 257 79 -5 82
3653 82 147 -20 249 14 -12 52 148 -184 60 181 -7 149 32 32 -129 -32 306 -289 -144 253 -61 -174 6
3676 6 209 -98 -76 -45 79 -221 -228 -38 213 84 -175 -135 228 -101 -154 -34 -67 -245 97 412 249 22 99
3699 99 -249 -123 -150 377 34 -290 34 305 24 -122 -14 10 -107 33 135 -297 -241 117 -222 -145 -176 -44
3721 -44 53 -189 -204 -188 98 -112 -136 7 229 -169 -6 114 -164 70 -266 149 68 142 218 -112 -147 106 9
3744 9 -62 -354 -197 20 -95 -67 -11 -219 -291 100 61 -232 -161 -126 -35 34 139 101 306 -247 -34 575 238 -220
3768 -220 -238 133 -153 -62 -57 47 23 -273 198 190 -64 -74 226 -138 2 111 155 -107 -120 -171 -51 -21 -76 215
3792 215 46 291 184 19 73 -97 70 -55 -53 26 123 250 -230 36 33 -168 -219 -201 46 -70 -92 413 -13
$$ packed form
3630B76n12K68kl00o3L02K82l62J08n0K74m74J81K44m9j3n4O6m11N46j78q4Q7
3653H2O5j67K69k35k6O4R6l32K44J21j88J56j17%j61R7L38n95J45L97l14j13J80
3676FK03l07K2L1J24l00pJ90K51j29k59M0L63l29n3J20l3j78L42L15j63k27P7
3699I9l48J26k7N27l43l24L24K71k81j46J08K4j17J40J02m32N6L58l39P7l1J32
3721d4R7k42j5J6K86k10k4J43K22l98J63J20k78K34l36M15q1P4P6l30l5K53r7
3744Ip1k92J57K17j15K8N6k08p2L91l9k93P1L5R1O9J05l8K05n53K13O09l37m58
3768b20j8L71k86R1NJ04k4k96M71qk54j0L00l64J40J09M4k62j3n1J20L0n5K91
3792B15j69K45j07j65N4j70J67j25KP9R7J27m80K66lk01n1J8K47j16k2N05m26
$$ plain form
3815 -13 60 46 350 221 38 132 51 -57 -195 198 262 143 103 -15 -26 59 -191 -62 -171 -192 -62 -93 -89 -43 149
3840 149 177 -124 -225 144 -5 -33 20 -330 -76 -337 242 64 -207 -74 -37 -231 264 73 85 88 -190 -272 -38
3863 -38 -84 76 -52 190 -110 -226 -17 -29 193 16 220 -220 -95 -42 202 2 55 180 50 -312 47 -156
3885 -156 153 0 151 337 -180 112 0 179 -233 -210 9 77 -41 72 -119 -36 2 -41 48 -111 79 69
3907 69 -115 -180 260 -42 -324 5 82 227 200 -243 27 157 -5 -54 -41 -182 -87 49 144 21 50 -116 12
3930 12 -165 243 16 211 -48 -251 63 -4 -258 105 -157 -15 259 106 50 -227 -81 67 140 -257 -8
3951 -8 58 -32 -179 72 37 -28 62 187 182 -148 56 -160 -130 -82 10 184 -30 -179 92 23 -116 25 71 -12 -50
3976 -50 -140 262 33 246 32 78 -43 -87 -193 39 80 -160 -134 173 70 12 -63 -177 -263 -44 85 -294 -241
$$ packed form
3815a3P3j4L04j29j83R4q1j08j38L93O4j19m0j18j1Q5k50J29j09k1J30l1MM6J92
3840A49K8l01j01L69j49k8N3l50K54k61N79j78k71J33L7j94M95j91J2Lk78q2K34
3863c8m6J60j28K42l00j16K09j2K22j77K04m40J25N3K44k00N3J25j30l62L59k03
3885a56L09j53J51J86n17K92j12J79m12K3K19O8j18J13j91Q3L8m3Q9j59J90j0
3907F9j84o5M40l02k82L29P7J45k7m43K70J30j62m9J3j41R5J36R5j23K9j66J28
3930A2j77M08k27J95k59k03L14o7k54L63k62J42K74j53n6k77J46J48P3l97K49
3951hO6r0j47K51l5o5R0J25nl30K04k16L0M8R2J74k14j49K71o9j39J41M6q3l8
3976e0r0M02k29K13k14M6j21m4j06K32M1k40K6L07j03n8p5j14q6K19J29l79N3
$$ plain form
3999 -241 179 -1 -231 -115 36 -246 -211 230 81 -94 66 76 80 132 47 197 -302 -260 197 185 57 -176 148
4022 148 -59 -50 43 203 -56 85 233 214 -53 77 124 138 -101 77 89 -18 10 -24 -161 -86 170 87 435 108
4046 108 -76 -246 64 62 -68 -49 0 -97 120 118 -146 -193 -9 219 64 163 -119 207 -32 37 -20 32 82 20 72
4071 72 27 125 226 250 -95 113 -241 35 -103 -159 111 -158 8 -6 95 71 12 -142 -99 -6 82 -122 -77 -169
4095 -169 -97 98 -374 116 318 98 71 -6 137 9 -116 28 373 -163 40 211 -262 -106 -134 -28 -64 -33
4117 -33 3 -9 -328 283 33 -78 129 218 -103 -28 130 86 -14 -9 -33 242 -90 98 29 -115 -272 128 144 50
4141 50 95 -233 144 -95 -338 73 194 59 -176 -141 -100 183 138 220 241 109 1 -37 277 -44 -330 106 77
4164 77 -171 193 258 -89 12 221 211 -90 -327 40 292 -186 35 29 -375 -42 271 17 33 -202 -38 14
$$ packed form
3999b41M20j80k30J16J51k82L5M41j49j75J60J0MN2q5J50m99M2M57j2j28k33L24
4022A48k07RR3J60k59J41J48j9k67J30M7J4k39J78J2j07K8l4j37P5K56q3L48l27
4046A08j84j70L10kj30J9M9r7K17kk64m7J84K28j55R9k82L26k39O9n7N2N0o2N2
4071G2m5R8J01K4l45K08l54K76j38n6K70k69J66j4J01k4n9j54M3R3Q8k04M5r2
4095a69P2J95m72M90K02k20k7p7J43j28j25J44L45n36K03J71m73J56k8J06l6L1
4117c3L6j2l19O11k50j11K07Q9l21P5J58m4j00Nk4K75l32J88o9j44j57M00J6r4
4141E0M5l28L77k39k43M11J21j35k35L5M1K83m5Q2K1j32j08l8L14l21k86M36k9
4164G7k48L64O5l47J01K09j0l01k37L67K52m78K21om04L33L13k54J6k35J64N2
$$ plain form
4186 14 -113 74 218 -164 -246 -318 201 129 -339 -99 -201 -237 -195 324 -211 -115 -325 -79 111 -32 -72 -57 74
4209 74 -48 162 -18 -157 158 -265 -97 51 370 70 -112 177 -82 20 -97 -151 170 -270 84 -60 -92
4230 -92 72 -151 -91 151 -176 -134 8 -1 3 101 336 -38 29 -120 174 209 -129 273 16 -349 107 -116 0
4253 0 97 60 266 -389 -252 435 127 -19 -13 111 -42 -131 59 -40 -154 -286 -92 105 51 -181 63 35 -77
4276 -77 81 26 56 -222 26 -60 68 -15 210 -5 83 -100 75 27 324 -90 81 -210 78 90 -160 -66 -10
4299 -10 21 -149 -10 20 181 -12 -299 -265 144 -24 41 -184 116 -186 -199 -70 353 -9 -96 236 -367 -105
4321 -105 172 42 9 -52 45 -22 329 186 144 -146 -159 135 349 -62 35 60 -26 -148 53 -53 -372 99 229
4344 229 127 -221 27 166 53 -108 -201 30 52 -76 -85 141 -127 -287 156 -54 28 -41 231 8 -207 -106
$$ packed form
4186A4j27J87J44l82q2p2N19p2m68K40j02l6M2N19n35R6k10K46J90j43m0J5J31
4209G4j22K10j80j39L15m23J68J48L19l00j82K89k59J02j17n4L21m40L54j44l2
4230i2J64k23O0K42l27M2J42rMR8K35l74O7j49K94L5l38M02k57l65M56k23J16
4253@R7l7K06o55J37O87l08j46OJ24j53q9J90r9j14j32J94J97n4k32K44k8j12
4276g7J58n5L0k78K48q6J28q3K25k15Q8j83J75m8K97m14J71k91K88J2k50R4N6
4299a0L1j70J39L0J61j93k87L4M09j68O5k25L00l02j3J29M23l62q7L32o03K62
4321a05K77j30l3o1R7o7L51j43m2k90j3K94K14m11R7K5q6j22K01j06l19M71J30
4344B29j02l48K48J39j13j61r3K31K2j28rK26k68j60M43k10Q2o9K72k23k15J01
$$ plain form
4366 -106 60 -38 -33 -27 17 209 -174 -103 158 -93 134 56 341 -100 102 52 -70 -51 -152 -68 87 -33 264 -112
4390 -112 -221 -140 -38 15 -42 42 48 -148 -95 -48 57 -71 130 242 -218 -229 70 98 56 -199 117 261 133 33
4414 33 -54 21 315 -91 -108 25 193 -183 77 203 82 15 69 -242 -237 36 131 183 -26 -13 -15 -145 -4 -74 -28
4439 -28 179 -84 -102 39 17 58 -182 -59 102 19 82 -60 120 17 -27 182 137 258 14 12 -84 -80 -41 356 -407
4464 -407 -42 95 -16 7 -294 -22 -79 23 -144 -189 18 -538 290 -81 -95 80 79 -173 22 -206 -35 -62
4486 -62 110 -275 -108 219 74 -85 -67 34 -61 -57 28 64 -55 -166 229 -341 331 21 66 -209 99 189 226
4509 226 130 227 -14 68 -129 190 116 -216 261 -67 -59 -41 39 39 -222 52 -12 126 -231 165 145 136 -71 54 -98
4534 -98 -25 10 125 246 -15 286 -215 -117 -69 -93 227 33 -39 -110 44 43 179 366 -110 171 -10 -19 124 -92
$$ packed form
4366a06J66r8NOM4J92l83P1K61k51K27p8K85m41K02n0j22J9j01Q4J55j20K97l76
4390a12j09Q1J02N3n7Q4Oj96N3M7J05j28K01J12m60j1K99K8m2k55L16J44j28j00
4414C3q7P5K94m06j7J33J68l76K60J26j21o7N4l11NK73R5N2k09J3kj30J41p0M6
4439b8K07k63j8J41k2M1k40J23J61q3O3j42J80j03m4K09m5J21k44kr6ML9L97p63
4464d07L65J37j11K3l01K72n7J02j67m5K07n56Q28l71j4J75jk52J95k28J71k7
4486f2J72l85J67L27j45j59J8J01r5MQ5L6j19j11L95n70O72l10M5k75L08R0L7
4509B26r6R7k41Q2j97L19p4l32M77l28QJ8Q0%k61K74o4J38l57L96k0rk07J25j52
4534i8P3L5J15J21k61L01n01R8M8k4L20j94p2p1J54jJ36J87m76K81j81rJ43k16
$$ plain form
4558 -92 162 189 -91 -294 64 60 4 22 -7 -117 -71 -138 -118 61 -132 256 63 26 -300 163 5 -129 -164 87
4582 87 188 -240 30 99 -69 -239 163 -107 271 134 118 62 -56 -2 150 65 241 -108 3 -51 19 -10 26
4605 26 -79 63 -114 -106 -138 -38 135 -68 291 -12 -25 -158 87 -101 243 30 -170 208 108 48 -53 165
4627 165 37 -319 69 57 -102 115 -117 -183 70 61 -116 -371 -312 106 -105 -115 -61 -5 -69 -150 -234 70 221 -156
4651 -156 -71 70 -62 -12 95 -2 -33 -135 -155 -41 42 298 133 46 65 161 130 -113 -93 138 21 -75 70 433
4675 433 -70 150 65 85 235 194 -11 230 -106 166 257 -76 109 261 66 -49 -104 -10 -183 -281 -97 160
4697 160 68 -208 23 41 -33 44 228 -112 34 -207 -54 -30 -80 -19 47 -51 119 -242 55 87 254 22 60 55
4721 55 -23 248 -139 -39 27 -71 32 -185 -332 -148 -38 43 -57 -189 126 71 -95 -59 107 -120 39 -40 222
$$ packed form
4558i2K54K7k80k03L58mn6J8k9j10M6o7K0J79j93L88j93l7l26M63j58j34l5K51
4582H7J01m28K70O9j68j70M02k70L78j37j6n6j18N4J52q5J76l49J11n4P0k9L6
4605B6j05J42j77Ql2J00J73k03L59l03j3j33K45j88L44k13k00L78j00o0j01K18
4627A65j28l56L88j2j59K17k32o6K53rj77k55N9M18k11j0N4N6o4q1q4L04J51l77
4651a56Q5J41j32N0J07r7l1j02k0J14Q3K56j65q7J9R6l1k43K0K31j17r6J45L63
4675D33n03K20q5K0J50m1k05K41l36K72R1l33J85J52j95j15n5R4j73r8J84K57
4697A60r2k76K31J8p4P7J84l40J46k41J53K4n0O1O6r8J70l61K97L2J67k32L8n
4721E5p8K71l87J00O6r8J03k17j47J84J10Q1j00j32L15n5j66L6J66k27J59p9K62
$$ plain form
4744 222 -3 -86 -3 -215 -20 43 -357 71 153 -108 106 -36 -170 21 187 -9 169 27 35 -177 -91 -138 113
4767 113 -18 106 25 184 49 -265 25 -62 11 -147 -177 -212 94 -132 -326 -243 -17 65 157 93 -7 76 -32
4790 -32 220 -365 170 -16 13 -151 137 55 -354 47 56 195 -277 128 75 -45 38 -61 -45 -83 112 229 98
4813 98 -145 -109 183 -33 -281 289 168 -99 82 17 -92 -168 -55 -152 -87 -11 24 -31 123 17 -231 -47 -106
4836 -106 -246 -83 -43 50 142 281 0 -50 138 165 -367 10 305 -188 120 4 -9 79 371 -11 -108 -62 -260
4859 -260 83 -95 183 50 22 117 101 118 -76 -78 -28 53 -25 -71 -70 168 -4 31 178 97 7 193 308 59 42
4884 42 68 -73 -128 25 -49 -166 133 -219 -45 -133 -251 17 114 -61 22 -61 71 -257 -158 153 136 -102 -58 -35
4908 -35 105 -65 115 160 -33 173 85 -11 23 -145 61 87 109 -88 116 235 -152 27 187 -281 11 -139
$$ packed form
4744B22k25q3Q3k12J95O3m00M28Q2k61K14j42j34J91J66j96J78j42Qk12Q6m7K51
4767A13j31J24q1J59j35l14K90q7P3j58l0l5L06k26j94Q3K26Q2R2o4j00Q3j08
4790c2K52n85N35j86K9j64K88q2m09M01RJ39m72M05n3j20Q3r9J6l8J95J17j31
4813I8k43L6K92k16k48N70j21k67J81o5j09p6J13r7O5P6L5n5J54j06k48J84n9
4836a06j40J63M0R3R2J39k81n0J88K7n32L77K95m93L08j16j3Q8K92l82r7M6j98
4859b60L43j78K78j33k8R5j6J7j94kN0Q1p8m6JK38j72L5J47q1r0J86J15k49j7
4884D2K6j41n5J53p4j17K99l52J74q8j18K68R7j75Q3q3J32l28R9L11j7k38M4K3
4908c5J40j70J80M5j93K06q8r6L4j68K06K6K2j97K04J19l87J79J60m68K92j50
$$ plain form
4930 -139 52 141 -213 54 -38 -139 -38 16 -6 -8 -16 -24 -77 -208 117 125 -115 7 101 129 -245 161 -77 171 64
4955 64 -234 94 -81 -116 109 240 66 42 -236 -41 -119 -56 152 32 -2 63 353 -331 -16 -17 -94 56 -160
4978 -160 -191 17 27 -216 -24 111 -193 -171 -161 56 53 97 -99 -19 70 76 15 -163 89 -41 118 93 -55 -81 -71
5003 -71 166 92 321 90 159 13 -24 26 -224 56 -165 57 -269 -139 -246 244 20 -67 19 252 150 -56
5025 -56 -9 73 166 49 101 -27 -69 65 -16 252 -44 177 100 -77 74 -156 -13 81 -11 148 139 -95 5 6 199
5050 199 -21 -232 224 -25 100 83 -101 81 118 -134 -39 -340 76 80 13 -205 -90 95 -193 112 173 152 -213
5073 -213 -86 48 92 -275 -33 136 -296 150 82 109 -61 -121 123 268 -5 -111 9 -21 189 -190 85 -253
5095 -253 -86 126 -313 -151 77 286 -223 67 263 115 -288 -185 -306 44 110 112 85 -117 -139 92 234 -75
$$ packed form
4930a39J91Q9l54K67r2j01J01N4k2kqqn3j31L25Qk40J22R4K8l74M06k38K48j07
4955F4k98L28j75l5K25J31j74k4k78J95p8O3K08j20l4O5K90o84L15jp7J50k16
4978a60l1K08J0k43J92J35l04K2J0K17lM4j96Q0Q9Oo1j78K52j30J59k5j48k6J0
5003g1K37p4K29k31O9j46l7N0k50K80k21K22l26J30j07M90k24q7Q6K33j02k06
5025e6M7Q2R3j17N2j28m2J34q1K68k96K21p7j77J51k30J43R4r2J59rk34J00JJ93
5050A99k20k11M56k49J25j7j84J82L7k52R5l01M16Mo7k18J15J85k88L05O1k1l65
5073b13J27J34M4l67K42J69m32M46o8K7j70o0K44J45k73j06J20l0K10l79K75l38
5095b53J67K12m39J62K28K09n09K90J96j48m03J03j21L50O6Kk7k02k2K31J42l09
$$ plain form
5117 -75 -198 118 19 78 -75 50 115 -67 182 114 -22 32 -204 112 73 -104 158 -49 -203 -32 41 -8 27
5140 27 116 41 -42 13 -92 72 -179 -152 64 157 14 -13 4 -18 -337 -131 313 6 27 -70 187 -153 -23 112
5164 112 86 -188 2 -25 -244 18 445 113 -125 -134 49 42 -228 -210 120 143 -88 1 -200 36 -65 -92 188
5187 188 -159 -208 -27 -113 137 -134 138 34 -206 34 45 -81 249 115 51 -161 183 -77 179 99 -373 -12
5209 -12 43 -321 -41 136 -54 -16 14 -148 -34 -125 -38 -28 162 74 105 -74 -138 227 -122 143 -138 97 -161
5232 -161 -275 -39 272 -127 -270 47 62 -386 -221 293 -38 139 183 82 -29 -95 -3 172 309 -97 61
5253 61 -192 -176 201 272 -144 90 -49 181 23 19 -25 -12 146 45 142 177 113 -117 -109 1 -236 -48 -4 103
5277 103 -147 -169 123 188 153 -367 -37 -2 74 -321 -31 -163 -307 -70 10 125 97 40 -187 128 366 -88 -17
$$ packed form
5117g5j23L16r9N9j53J25O5j82K49o8j36N4k36L16l9j77K62k07j54J71P3m9L5
5140B7Q9p5q3N5j05J64k51K7K16R3j43k7J7k2l19K06M44l07K1r7K57l40J30J35
5164A12k6k74J90k7k19K62M27l32k38rJ83pk70J8L30K3k31Q9k01K36j01k7K80
5187A88l47m9J81q6K50k71K72j04k40K40J1j26L30j34o4k12L44k60K56q0m72L61
5209a2N5l64K80J77j90L8L0j62J14r1Q7J0J90q8L1j79o4L65l49K65k81K35k58
5232a61j14K36L11l99j43L17J5m48J65N14l31J77M4j01j11o6R2J75J37m06J58
5253F1k53J6L77P1m16K34j39K30j58mm4J3J58j01R7L5o4k30QJ10k37J88M4J07
5277A03k50k2K92O5l5n20L30L5P6l95K90j32j44K37Q0J15k8n7k27L15K38m54P1
$$ plain form
5300 -17 34 -149 183 129 267 -77 -75 112 101 -74 16 -66 63 186 -284 157 209 -56 -33 205 -464 227 25
5323 25 -344 -200 -211 -256 -116 -94 -127 -100 -11 308 -51 -130 83 -41 -29 -51 118 -147 148 95 74 140 -80 225
5347 225 117 -63 -175 -84 -1 47 120 -214 242 32 -108 -112 -86 -109 85 -79 -159 237 133 -69 -62 -191 44 19
5371 19 96 31 -37 46 19 107 382 -2 206 167 -33 -21 -101 -7 74 56 -57 -281 64 14 37 -89 -59 61 263
5396 263 95 -72 114 187 -74 190 22 15 147 81 68 -108 -44 -42 25 173 150 17 -145 -103 -175 -96 110 -342
5420 -342 -30 -23 -159 9 1 -104 -31 -196 80 -143 73 68 -260 -2 -27 148 -60 -280 2 -56 -46 8 -38 128
5444 128 255 -18 11 36 86 -102 -247 -113 216 96 -42 -78 -98 -55 -128 -171 -71 147 -7 -155 77 -237 -61
5467 -61 126 241 -64 40 -95 -71 189 146 82 33 297 -109 -45 -76 -175 -83 135 -337 243 39 30 -115 53 29
$$ packed form
5300a7N1j83L32n4J38l44KJ87j1j75R0q2J29J23m70M41N2k65K3K38o69O91k02
5323B5l69J44j1m5J40K2l3K7Q9L19l59p9K13j24J2k2J69k65K95n3k1O6k20L05
5347B25j08j80j12R1Q3M8P3l34M56k10j40mK6k3J94j64q0L96j04k02Pj29K35k5
5371A9P7o5o8Q3k7Q8K75l84K08l9k00J2q0R4Q1j8j13k24L45n0K3j26L0J20K02
5396B63j68j67J86P3k61K64j68pJ32o6j3j76O4KO7J48k3j33j62M2p2P9K06m52
5420c42L12Pj36J68qj05P3j65K76k23K16nl28K58k5J75k08k20K82n8J0N4m6J66
5444A28J27k73K9K5N0j88j45J34L29j20j38l6k0M3p3m3J00K18j54j48K32l14J76
5467f1J87J15l05J04j35K4K60m3o4m9K64m06O4l1r9R2K18m72N80k04rj45J68k4
$$ plain form
5491 29 -71 -29 -85 32 -159 -121 -179 -72 -45 -120 38 164 57 -244 -12 29 -192 139 18 -34 256 -31 32
5514 32 343 154 -107 -145 325 -43 83 -207 0 312 -262 -103 -62 -248 -142 179 -9 -160 -246 100 -131
5535 -131 85 350 -124 17 13 157 -328 -166 -47 -40 97 -67 -143 41 -50 14 60 -35 206 120 -96 -62 213 77
5559 77 -257 80 12 -185 78 24 -30 -174 82 400 57 -196 52 -17 -141 251 -89 -24 -86 -46 -333 -72 124
5582 124 -428 237 -151 103 41 -31 228 29 -120 -25 -51 -24 22 142 149 182 309 -256 167 231 -51 -351 55
5605 55 113 139 -146 53 61 -262 -216 84 -150 112 69 -73 -83 -93 -99 -70 -204 180 -171 -85 137 58 -103 -84 102
5630 102 186 -108 -43 -131 16 -48 227 -111 81 -32 -90 368 80 204 62 -70 -149 -255 224 128 214 -12 41
5653 41 22 32 -86 -148 37 -226 -137 -47 183 -109 -50 30 -157 143 43 -47 180 415 133 75 -51 -327 -51
$$ packed form
5491B9j00M2n6J17j91L8n8J07K7p5J58J26j07l01K32M1k21L31j21n2K90k87O3
5514C2L11j89k61l8M70l68J26k90K07L12n74J59M1j86J06L21j88j51q6L46k31
5535a31K16K65m74J41mJ44m85J62J19PJ37j64p6J84r1O4M6r5K41q6k16L4K75j36
5559G7l34L37o8j97K63n4n4j44K56L18l43k53K48o9j24L92l40O5o2M0k87K61J96
5582A24n52O65l88K54o2p2K59j99j49R5k6K7M6J20PL3J27n65M23O4k82l00M06
5605E5N8K6k85J99Ql23M6L00k34K62m3j42j0j0oK9j34L84l51Q6K22p9j61J9J86
5630A02Q4k94O5q8J47o4K75l38J92j13n8M58k88J24j42j32p9j06M79r6Q6k26N3
5653D1j9J0j18o2J85k63Q9R0K30k92N9Q0j87L00j00r0K27K35k82n8j26k76K76
$$ plain form
5676 -51 297 -228 125 161 -56 74 77 115 40 209 329 -50 -12 -151 54 6 179 191 12 -194 108 -220 -64
5699 -64 -96 46 -49 214 134 82 237 -82 7 15 -80 -116 -114 -197 -56 -137 191 -83 -290 -93 65 79 155 164 67 -120
5725 -120 153 202 123 51 110 62 188 -316 -215 70 -181 72 -123 -171 144 -126 -138 205 141 160 170 65 -40
5748 -40 4 54 11 -119 -70 128 0 79 -170 69 -223 282 -39 -4 -175 17 42 233 -44 -39 199 -88 -49 -142
5772 -142 48 260 42 -205 141 -228 13 295 -230 169 98 35 7 -210 90 -134 -193 67 -56 106 99 -157
5794 -157 83 54 -151 -143 122 -11 -143 200 36 -45 114 -316 167 108 39 -36 -143 73 201 191 -64 104 125
5817 125 13 -146 -152 150 1 75 51 174 135 184 181 74 201 -8 364 -207 -176 269 178 -162 67 45 -56 371
5841 371 187 -53 60 8 202 209 -37 102 -2 23 67 -193 -46 -59 69 84 -376 -195 -223 -68 -119 -78 -152 -194
$$ packed form
5676e1L48n25L53L6k17J30LL8p5J69J20l79L8j39K05m8J73J2j79k06L02l28J56
5699f4l2J42r5K63q0n2J55l19Q9Qr5l6Kq3J41q1L28k74k07J97J58J4P6Rr7j87
5725a20K73M9p9p2N9m8J26n04J01K85k51K53j95m8L15k70j2L43o4J9J0j05j05
5748d0M4N0m3j30M9J98j28P9k49K39k92N05l21L5j71J92K5J91k77NK38k87L9r3
5772a42J90K12k18k47L46l69K41K82n25L99p1o3k8k17L00k24n9K60j23J62pk56
5794a57K40k9k05QK65j33j32L43j64q1J59m30M83n9o9p5j07K16J28j0k55J68K1
5817A25j12j59oL02j49P4k4J23l9M9lj07J27k09L72n71L1M45r1l40K29k2j01M27
5841C71j84k40J13n2J94Pk46J39j04K5M4k60J47j3J28J5m60J81k8J55n1M1p4m2
$$ plain form
5865 -194 -102 -73 21 -55 -220 167 -42 118 164 -89 -126 -3 -184 -264 -20 -299 -60 -31 -129 39 -45 -138 -94 68
5889 68 14 248 143 -3 84 -72 -37 113 -348 196 14 -266 163 3 -188 -41 172 61 -146 -32 -109 -168
5911 -168 -211 126 -98 133 137 -104 10 -132 -125 -30 198 -193 40 32 -265 287 -69 -40 76 30 98 55 48 279 15
5936 15 4 28 -178 -23 257 71 -124 -119 18 159 90 99 157 314 -109 292 -164 56 195 -20 158 -86 -205
5959 -205 154 132 -188 228 -48 -92 42 59 -418 -86 75 46 165 1 375 277 106 -71 -78 -9 -18 -137 -32
5982 -32 -7 -263 93 -258 -88 23 -67 -93 -211 35 97 -46 50 21 -35 70 -186 -112 -68 145 81 187 221 122
6006 122 42 249 -82 38 225 33 -440 91 3 79 -16 47 18 219 -21 148 -44 -43 -163 139 -176 65 -31
6029 -31 201 -56 182 -127 -47 -288 -380 57 -46 -40 -69 -69 -212 21 -43 -125 72 -98 -151 95 -166 256 247 77
$$ packed form
5865a94R2K9R4p6j65L87k09J60M6k53l7J23j81q0K44k79K39K9r8J68q4r3M4J62
5889F8n4K34j05j46Q7j56L5J50m61N44j82k80M29j60j91J47K13j11k07J14p7n9
5911a68m3L37k24K31Mk41J14j42PR5K28l91K33qk97N52l56K9J16m6O8m3pK31k64
5936A5j1K4k06J55K80j86j95NJ37J41o9RN8J57m23M01m56K20J39k15J78k44j19
5959b05L59k2l20M16k76m4J34J7m77L32J61k9J19j64L74r8j71j77pO9rj19J05
5982c2K5k56L56l51J70J11r0k6j18K46O2j43R6k9n6J05k56P4M4K13o4J06L4r9
6006A22q0K07l31J20J87j92m73N31q8P6r5O3k9K01k40J69j92Jj20L02l15K41r6
6029c1K32k57K38l09Q0k41r2M37j03Ok9%j43K33o4q2J97j70n3K46k61M22rj70
$$ plain form
6053 77 -125 -56 -152 -112 0 -119 65 20 -24 187 -7 61 65 33 -93 -18 -156 -42 -209 190 87 4 -171 -142
6077 -142 -45 310 111 -225 -25 59 -65 -4 5 -23 181 91 22 -277 -353 65 -55 -250 108 128 271 67 -138
6100 -138 53 -264 373 89 311 -125 52 7 64 147 1 187 -33 -187 -165 -56 71 -119 -282 -11 -190
6121 -190 80 74 -180 3 -58 -110 -73 -136 -160 63 14 -73 7 -45 227 56 122 81 153 -105 -71 -47 -72 128 -33 111
6147 111 80 10 -108 -157 -107 370 -187 60 -211 -165 -28 4 12 -315 177 305 -172 53 -67 -72 29 162 -38
6170 -38 147 -91 76 394 -1 42 -81 34 -283 -73 183 -267 29 3 127 7 47 -100 -39 -270 23 -79
6192 -79 141 215 -36 204 -19 80 102 -80 120 -27 -11 -223 -440 -224 -81 -227 10 36 -62 -29 -193 77 19
6215 19 -114 57 21 88 253 -91 -76 -144 61 92 -25 -164 101 14 -75 -135 -143 -40 -52 -19 -343 162 -53 12 -12
$$ packed form
6053G7k02O9r6M0J12j19J84m5m4K11j94O8Ml2j26P5j38J14j67L99j03q3j75K9
6077a42R7L55j99l36K00Q4j24O1Rk8K04r0o9k99p6M18j20j95L58K0J43k04k05
6100a38J91l17O37k84K22m36J77m5N7Q3j46J86k20j54K2J09J27j90j63K71j79
6121a90K70ok54J83o1n2L7o3k4K23m9q7Q0n2K72j71O6m1P2k58L4K4k5K00j61J44
6147A11l1p0j18m9N0M77n57K47k71M6J37L2Ql27M92J28m77K25j20nJ01J33k00
6170c8J85k38J67L18l95M3j23J15l17K10K56m50K96k6J24j20M0j47O1k31K93j02
6192g9K20P4k51K40k23R9K2j82K00j47J6k12k17K16J43j46K37K6r8L3j64K70n8
6215A9j33J71l6O7J65l44J5o8K05L1j17j39K65q7q9o0qJ03j2L3l24N05k15O5k4
$$ plain form
6240 -12 -196 -76 151 41 50 98 107 129 240 -108 29 210 70 154 119 139 -26 -305 -115 13 258 -134 37
6263 37 -32 -78 -120 196 69 313 -49 -10 10 94 -63 -203 -54 271 -67 -20 -25 88 108 -296 -247 -107 120 -121
6287 -121 -311 78 188 4 -62 -176 -79 -72 120 -262 39 -217 122 329 88 -67 -261 -245 -97 192 -241 -147
6309 -147 93 129 -133 6 230 5 -123 86 22 84 81 -184 7 -179 177 47 34 -42 -1 157 6 125 -56
6332 -56 39 -80 -77 80 -55 -79 72 -30 -218 154 117 63 -266 39 -61 -247 102 -140 -83 117 -254 107 46
6355 46 -104 -127 -80 109 222 280 8 -48 -17 -17 -260 -28 -75 -169 -123 -8 54 45 115 -66 85 -303 154 -355 37
6380 37 39 -145 -106 35 63 -76 271 206 156 -204 32 -156 -85 -88 -49 -14 131 79 -31 -45 -69 214 196 1 -101
6405 -101 -80 -404 195 -12 122 49 27 -98 -17 82 -183 65 125 -26 18 88 -224 65 12 -43 -63 64 -82 -115
$$ packed form
6240a2j84J20K27j10RM8RK2J11l48J37J81j40Q4l5K0j65k79J90J28K45l92J71
6263C7o9m6m2L16j27K44l62L9K0Q4j57j40J49L25l38M7nJ13K0m04M9J40K27k41
6287a21j90L89J10j84o6j14R7PJ92l82L01k56L39K07k41j55j94J6J48K89m33R4
6309a47K40L6k62J39K24k25j28K09o4O2lk65J91j86L56j30j3p6M1J58j51J19j81
6332e6R5j19LJ57j35k4J51j02j88L72l7n4l29L05j00j86L49k42N7K00l71L61o1
6355D6j50k3M7J89J13N8k72n6L1%k43K32m7r4M6J15O2rP0j81J51l88M57n09L92
6380C7Kj84L9J41K8j39L47o5n0l60K36j88P1lL9L5J45n2j10j4k4K83j8j95j02
6405a01K1l24N99k07J34p3k2j25Q1R9k65K48O0j51M4P0l12K89n3n5k0J27j46l3
$$ plain form
6429 -115 117 126 -214 65 17 34 -72 -114 -5 -71 48 -177 58 -112 188 -125 -22 -83 -214 -157 -38 -62 -186
6452 -186 -93 81 54 -70 -33 100 271 -72 -128 -349 -230 270 112 164 -199 -220 -129 15 -170 -3 24 98 -176
6475 -176 74 269 -102 273 -364 -16 -61 39 120 -19 -155 98 76 18 -85 78 34 343 91 -178 -11 -216
6497 -216 95 16 155 31 146 53 39 -189 -10 -26 154 -197 213 -108 54 348 -30 -5 -144 -48 51 -5 -115
6520 -115 -111 71 99 -133 89 -183 26 215 -9 146 -57 -26 38 -49 -18 43 65 -141 42 -49 68 -18 -272 312
6544 312 -134 -129 54 139 236 -90 -264 -267 35 137 226 -38 103 -165 149 -308 183 54 77 25 6 -149 203
6567 203 239 89 221 -4 58 -12 -6 -60 -143 -78 237 15 40 519 93 -14 92 54 -48 151 -7 141 141 -396
6591 -396 -245 -113 -142 79 28 -191 59 15 -20 160 347 126 106 32 -69 -200 -28 -132 76 155 1 -130
$$ packed form
6429a15K32Rl40K79m8J7j06m2J09o6J19k25K35j70L00l13J03o1j31N7J19k4j24
6452a86R3J74k7j24L7J33J71l43n6k21J19N00j58N2l63k1R1J44j85J67K7P4k74
6475a76K50J95l71L75o37L48m5J00Q1j39j36K53k2n8j03J63m4L09k52k69J67k05
6497b16L11p9J39j24J15r3j4k28J79j6J80l51M10l21J62K94l78K5j39R6R9n6j10
6520a15MJ82K8k32K22k72K09J89k24J55k03L1O4q7L1O1K2k06J83r1J17q6k54N84
6544C12m46NJ83Q5R7l26j74lL02J02Q9k64J41k68L14m57M91j29K3n2j9j55L52
6567B03L6j50J32k25O2p0On4q3O5L15k22K5M79m26j07J06l8j02J99j58J48%n37
6591c96J51J32k9K21n1k19K50m4l5J80J87k21k0p4j01j31J72j04K08P9j54j31
$$ plain form
6613 -130 -253 -73 82 -74 -6 -127 78 -109 62 60 -28 86 -115 -34 -196 -147 30 -25 176 208 -106 -63 32
6636 32 -83 -110 208 -161 -111 -64 81 -108 -12 122 35 -85 167 -93 52 -257 183 207 23 0 -74 -68 39 -223
6660 -223 119 -97 -33 -25 -37 -82 -114 -251 -106 -10 -50 -110 -70 83 -30 -52 -163 45 1 341 -78 158 -207 -111
6684 -111 157 -66 208 49 -26 -7 52 -123 94 137 -184 -22 248 32 59 47 167 -13 -52 -193 157 -97
6706 -97 26 -117 162 -12 -362 126 -170 -228 -77 57 -253 -172 36 14 131 86 76 -99 81 303 -153 -106
6728 -106 48 -43 19 91 128 161 -68 -145 -134 147 112 34 143 -35 -108 72 -76 90 -230 -244 176 -3 140 40
6752 40 -54 66 163 -124 -2 26 112 98 -162 -35 -21 -37 -340 -23 -20 7 -130 -48 100 109 -174 65 -193 52 -125
6777 -125 221 60 14 103 3 -64 75 160 -45 -43 -26 268 -88 85 -56 168 207 -131 -80 34 152 -79 27
$$ packed form
6613a30j23J80J55j56O8j21K05j87J71kq8J14k01Q1j62M9J77n5K01L2l14M3R5
6636C2j15k7L18l69N0M7J45j89R6J34q7j20K52k60J45l09M40K4j84k3p4OJ07k62
6660b23L42k16O4Qj2m5l2j37J45R6m0o0M0J53j13k2j11K08m4L40m19K36l65R6
6684a11K68k23K74j59p5J9N9j75K17M3l21J62K70k16K7j2J20j80l9j41L50k54
6706i7J23j43K79j74l50M88k96n8J51J34l10Q1K08k2J17m5j0j75J80K22m56M7
6728a06J54r1O2P2L7L3k29p7J1K81l5p8J09j78p3J80j48J66l20j4M20j79J43j00
6752D0r4J20R7k87J22K8Q6j4k60J27J4j6l03L17LK7j37Q2J48Rk83K39k58K45j77
6777a25L46j61m6Q9j00o7J39Q5k05KJ7K94l56J73j41K24L9l38N1J14J18k31J06
$$ plain form
6800 27 210 -18 77 -42 127 95 -173 -30 -29 3 78 -32 -78 -33 -105 1 139 108 -133 102 273 135 41 178
6824 178 -243 285 97 -142 154 -165 -253 30 48 46 17 161 101 91 314 -177 -314 57 -169 -264 87 76 -121
6847 -121 193 -346 -82 -149 3 -348 79 88 -98 -29 -16 1 -89 -56 120 -46 -217 241 324 -11 21 -11 -26 -60
6871 -60 26 -244 -102 -1 33 23 240 -6 84 -99 52 2 -40 2 -27 275 -42 -126 156 -57 -170 46 -101
6894 -101 49 197 289 -35 254 282 -19 -47 -289 -144 189 41 148 112 31 309 171 65 -83 -12 88 -14
6916 -14 50 -79 100 100 -43 90 -62 69 -105 170 -239 -147 135 -109 -112 -101 -75 -256 -195 108 -129 107 57 59
6940 59 95 -164 -110 -114 174 215 105 -256 -207 120 5 155 104 92 -104 -140 53 -4 -13 -73 86 88 -29 2 192 74
6966 74 25 -199 9 -49 -66 139 47 -107 -81 252 54 33 368 5 -68 -72 137 10 -154 36 -57 -67 67 -293
$$ packed form
6800B7J83k28R5j19J69l2k68J43JL2P5j10m6M5p2J06J38l1k41K35J71j38r4J37
6824A78m21N28j88k39K96l19q8K83J8kk9J44o0j0K23m91j37L71k26r5L51j1j97
6847a21L14n39K64o7J52l51M27Rj86O9J3J7r0L3J76j66j71M58Q3l35L2l2j5l4
6871f0Q6k70J42J01L4j0K17k46R0j83J51n0m2M2k9L02l17q4K82k13j13K16j47
6894a01J50J48R2l24K89K8l01k8k42J45L33j48J07l6q1K78j38j06j48P1J00j02
6916a4O4j29J79%j43J33j52J31j74K75m09R2K82k44lJ1K6j81O1L03k37K36n0K
6940E9L6k59N4mK88M1j10l61M9L27j15J50n1j2j96l6J93n7ro0J59Kj17L1J90j18
6966G4m9k24K08n8j7K05r2j54K6L33j98k1L35l63p3mK09j27j64J90r3j0J34l60
$$ plain form
6990 -293 -125 37 107 15 189 6 115 27 -188 -240 190 246 130 -110 252 -151 -118 -84 -320 -160 -264 -95
7012 -95 -13 -170 -68 -151 -28 144 -83 113 98 38 -242 175 -145 -15 -89 124 -165 -224 -46 254 16 68 210
7035 210 -20 -175 -115 -130 68 -90 -31 -39 -199 -151 54 -40 -142 57 41 -20 -230 89 -35 166 64 -136 133
7058 133 -93 48 -379 37 162 4 -6 2 -69 97 -70 -128 -24 -19 65 176 -102 32 144 291 150 -27 122
7081 122 -187 175 48 83 54 47 130 -216 -85 61 97 55 17 -142 -192 -110 -28 18 -84 -56 143 104 -258 58 167
7106 167 -101 239 21 244 -303 -72 40 154 -4 -53 34 -58 -10 293 9 -135 -7 31 -174 -3 -278 -64
7128 -64 39 125 -42 -90 65 -131 134 170 28 -115 -39 118 156 -2 -86 -183 64 158 145 166 156 -40 272 -114
7152 -114 124 303 93 -75 38 304 9 -7 -134 15 -94 -201 -143 133 77 -262 -8 39 84 112 -229 79
$$ packed form
6990b93J68J62P0r2J74j83J09q8k15n2M30N6j16k40L62m03L3L4k36J60j04J69
7012i5Q2j57J02q3J23J72k27J96j5o0k80M17l20J30p4K13k89n9J78L00k38N2J42
7035B10k30j55O0j5J98j58N9qj60M8K05r4j02J99j6o1k10L19j24K01j02k00K69
7058A33k26J41m27M16J25j58j0Qp1J66j67n8J04NQ4J11k78J34J12J47j41j77J49
7081A22l09L62j27L5k9pQ3l46J31J46L6m2l8j59n0Q2Q2M6j02K8J99l9l62L16J09
7106A67k68L40k18K23n47K31J12J14j58m9Q7r2M8L03k84j44J28L8k05J71k75K14
7128f4J03Q6j67m8J55j96K65L6j42j43P6J57L8j58q4r7K47R4j3K1j0j96L12l86
7152a14K38J79k10j68J13K66k95j6j27J49j09j07N8K76n6l39K54M7M5K8l41L08
$$ plain form
7174 79 -143 225 445 -178 99 29 -313 73 -8 58 62 -54 -266 -66 -4 -121 -78 -253 -80 -78 -33 -1 -37 -218
7198 -218 60 -31 -67 -123 -91 1 28 -120 96 115 12 -368 33 -163 -19 -114 -50 144 46 -132 -217 -41 -3 -344
7222 -344 -158 136 -88 -96 87 -125 -96 58 72 -30 -168 166 -64 62 -317 -213 -190 96 51 165 45 142
7244 142 42 -362 -10 299 -6 243 248 35 -77 106 -174 -15 81 -280 80 67 35 60 175 264 -122 -111 239
7267 239 211 -119 -134 234 247 267 -189 75 211 252 180 46 106 -84 -192 143 165 -31 -23 27 275 -78 -121 52
7291 52 270 219 100 15 -43 -86 253 52 -180 -145 198 -28 -321 -155 190 149 -117 -40 64 163 -116 -239 3
7314 3 -78 63 177 145 42 57 262 112 -9 -173 21 1 22 28 108 44 136 169 71 136 25 -249 -76 290 21
7339 21 -8 -194 -76 -27 113 199 37 5 88 81 -177 -124 161 190 191 194 -55 53 85 117 -70 -14 -118 -13 180 -115
$$ packed form
7174G9k22L68K20o23K77p0l42L86q1O6Mj16k12K00O2j17M3j75J73KM5L2l6j81
7198b18K78r1l6n6L2R2K7j48K16J9j03l80M01j96J44r5O4J94r8j78q5J76L8l41
7222c44J86K94k24qJ83k12K9J54J4j02j38L34k30J26l79J04K3K86m5J14j20R7
7244A42j00m04L52L09l05K49Nk13j12J83k80J59R6l61L60j3l2K5J15Q9l86J1L50
7267B39k8l30j5L68J3K0m56K64J36M1p2j34O0j90j08L35K2j96QN0K48l53m3J73
7291E2K18n1j19q5n8m3L39k01k32L5L43k26k93J66L45m1k66P7J04R9k79j23K42
7314Cq1J41J14l2j03J5K05j50j21j64J94k0K1OQ0o4R2L3r8O5j11k74J73L66k69
7339B1k9j86J18M9J40Q6j62l2Q3pk58N3K85K9JLk49J08L2L2j87N6j04J05J93k95
$$ plain form
7365 -115 -122 -183 102 -150 -133 -53 -8 -2 -246 -148 11 -95 -153 -92 3 -124 44 -205 -135 83 -184 -352 205 176 127
7390 127 70 68 52 -231 -49 25 -279 109 -26 -236 -69 78 -15 -82 -53 -88 70 -210 18 -27 -66 -173 -181 72
7414 72 122 139 -147 18 52 -72 60 -202 135 -7 -28 167 -188 230 -4 34 93 -249 -140 68 -158 45
7436 45 191 101 -227 -157 -212 -121 -124 108 -250 -103 -103 -224 -112 64 -252 -154 49 -240 400 -197 -74 272 -140
7459 -140 189 1 -104 18 -197 26 177 133 -271 59 -166 -140 124 -132 -109 59 -27 -333 -149 60 -261
7480 -261 217 100 236 10 105 32 8 -141 -44 -113 52 111 -70 17 102 6 -173 -16 188 -20 -63 -101 278 -44
7504 -44 -21 -191 1 201 -49 36 191 -96 265 4 -153 54 -37 -419 -147 -110 127 229 163 54 -10 -63 126
7527 126 7 -113 154 156 103 -217 -9 -106 -200 -24 -29 167 -15 -179 127 167 -2 -53 -60 35 145 -2 203 -138
$$ packed form
7365a15po1K85k52J7Q0M5Ok44R8J59j06n8O1R5j27J68k49P0K18k67j68N57k9m9
7390A27n7kj6k83J82P4l04L88j35k10J67J47r3o7K9l5J58k80K28m5l9j07qK53
7414G2N0J7k86J65L4j24J32k62L37j42k1J95l55M18k34L8N9l42J09K08k26K03
7436D5J46r0l28P0n5R1lK32l58J47%j21J12J76l16R8K03k89O40n97J23L46m12
7459a40L29j88j05J22k15K23J51m4m04L30k25K6K64k56K3J68q6l06J84K09l21
7480b61M78j17J36k26R5p3k4j49R7o9J65N9j81Q7Q5r6j79J57K04k08m3l8L79l22
7504d4K3j70J92K00k50Q5J55k87L61k61j57K07r1l82K72L7K37J02o6j09o4n3J89
7527A26j19j20K67Kn3l20K08r7r4J76nJ96j82j64L06M0j69n1pR5J10j47K05l41
$$ plain form
7551 -138 64 148 -46 201 101 -73 -252 101 37 47 144 45 99 73 114 27 -53 -222 11 -236 20 172 68
7574 68 20 -107 -167 -50 273 114 246 -56 -233 155 -53 -128 -179 -95 29 96 -115 -139 -162 171 98 110 -171 11
7598 11 -12 -77 21 238 -150 -2 -6 -170 92 -12 183 43 210 60 -174 -27 -3 -129 343 -30 -208 -69
7620 -69 -65 -154 24 -352 17 187 -208 -4 92 112 -52 27 -122 132 436 69 103 -41 -159 25 -140 -170 8
7643 8 126 -116 17 66 84 -51 180 -48 7 -102 -3 45 92 311 98 154 -535 -70 113 81 45 150 -178 -515
7667 -515 60 232 131 25 -218 11 90 44 -96 -53 -215 -47 28 252 169 -55 -95 182 58 -200 16 -219
7689 -219 280 -57 -171 -120 -242 88 27 68 111 -66 214 179 8 -57 -69 85 133 289 138 129 92 -3 93 -188
7713 -188 -102 220 390 -22 124 -84 -132 106 -95 80 -23 5 -221 42 -157 150 172 70 207 -200 -219 -235
$$ packed form
7551a38K02Q4j94K47j00j74j79L53o4J0R7r9N4k6M1q7q0j69K33k47K56J52j04
7574F8m8j27o0J17L23j59J32l02j77L88k08p5n1Q4J24O7k11k4k3L33p3J2k81J82
7598A1k3o5R8K17l88J48mj64K62j04J95j40J67j50k34J47K4j26M72l73j78J39
7620f9Mq9J78l76L69J70l95K04R6K0j64P9j49K54L04l67L4j44j18J84j65l0J78
7643HJ18k42J33M9J8j35K31k28N5j09R9M8M7K19k13N6o89M65J83l2l6J05l28l37
7667e15N75J72j01j06k43K29P9m6j40M3j62J68P5K24q3k24m0K77j24k58K16k35
7689b19M99l37j14N1j22L30o1M1M3j77K80l5j71o5j2J54M8J56j51rl7r5R6k81
7713a88Q6L22J70m12J46k08m8K38k01J75j03K8k26K63j99L07K2j02J37m07j9j6
$$ plain form
7735 -235 -49 78 5 -143 -257 -181 42 -185 -42 19 -2 74 149 160 169 -94 90 -35 -72 -27 -4 5 -108 95 -159
7760 -159 -16 38 -320 -190 114 -35 -155 -17 84 216 105 298 155 129 18 -57 154 77 93 -40 -85 5
7782 5 -16 -29 141 -12 30 63 -60 86 46 38 -94 -58 -167 21 117 -23 -141 -46 -188 327 65 79 -99 -46 -204
7807 -204 -167 11 -97 55 137 -32 -181 145 -72 -41 255 265 -10 30 8 -72 120 13 137 207 -3 96 25
7830 25 24 -53 -232 71 -74 -95 -203 308 39 -75 -17 -140 -122 -194 -39 -124 -64 20 -353 -26 -179 138 -186 -99
7854 -99 222 -190 255 -117 -336 85 -170 -48 -155 -7 -154 15 56 -119 -5 155 85 -184 112 61 -42
7875 -42 7 -159 60 -276 -142 32 -31 68 -92 124 -294 -86 -62 94 3 -217 205 -125 8 -77 -74 -329 338
7898 338 99 -106 113 281 121 213 -209 -190 60 -76 -163 -145 296 98 -196 -96 158 3 44 -153 -25 191
$$ packed form
7735b35J86J27p3j48j14P6K23k27J43O1k1P6P5J1Rk63J84j25l7M5K3Rj13K03k54
7760a59J43N4l58J30L04j49j20J38J01J32j11J93j43k6j11p5K11p7J6j33m5R0
7782Ek1j3J70j53M2L3j23J46m0qj32L6j09J88R6j40j18R5j42N15k62J4j78N3j58
7807b04L7J78j08J52Q2j69j49L26k17L1K96J0k75M0k2q0J92j07J24P0k10R9p1
7830B5jp7j79L03j45k1j08N11k69j14N8j23J8p2J55q5O0Q4l73L27j53L17l24Q7
7854i9L21m12M45l72k19M21k55J22j07J48j47J69M1j75J14J60p0k69K96n1j03
7875d2M9j66K19l36J34J74o3R9j60K16m18K08K4J56r1k20M22l30J33q5Lk55O67
7898C38k39k05K19J68j60R2m22J9K50j36q7J8M41j98k94J00K54j55M1j97J28K16
$$ plain form
7920 191 112 -69 185 88 307 78 140 -53 -76 41 -30 135 14 -143 -64 -80 -353 -15 -68 156 -29 -302 91
7943 91 328 79 -158 188 173 24 -96 306 159 -187 35 -17 114 -31 69 101 -27 -199 200 313 -265
7964 -265 -65 144 -11 333 -33 -44 134 31 -188 202 50 -72 -66 -212 140 -278 -233 -293 285 137 -323 -300
7986 -300 116 52 147 125 -90 -72 -70 -103 -49 135 216 150 104 -45 141 82 -89 49 -79 95 -17 -217 -155 187
8010 187 -178 -150 10 -21 30 82 175 114 44 17 -208 -14 -151 178 87 -108 -184 -38 43 -273 -23 68 -128 104
8034 104 -58 252 -143 -374 36 -94 54 -12 -38 68 75 -36 113 56 -251 -109 0 76 -8 261 232 25 60
8057 60 98 100 -173 -142 18 -102 206 170 -70 160 -153 -104 158 107 114 11 -217 107 99 222 20 94 -123 29
8081 29 -122 -10 5 -68 -18 -77 -43 226 -102 225 42 -50 21 -133 2 79 70 172 -6 107 234 -140 -39 93
$$ packed form
7920A91p9j81K54r7K19k29O2j93k3J17p1J65j21j57P9j6k73L38n3K24j85k73L93
7943I1K37k49k37L46j5j49j20M02j47l46K22n2J31j45J00L2j28j72L99J13n78
7964b65K00K09j55L44l66j1J78j03k19L90j52j22Oj46L52m18M5o0N78j48m60K3
7986c00M16o4R5k2k15J8Kl3N4J84Q1o6m6j49J86n9j71J38j28J74j12k00O2L42
8010A87l65K8J60l1N1N2R3o1p0k7k25J94j37L29r1j95p6J46Q1l16K50R1j96K32
8034A04j62L10l95k31M10j30J48o6k6J06Pj11J49n7l07J42J09P6q4K69k9k07L5
8057F0L8Kk73L1J60j20L08l6k40K30l13M9K62n1Pj03k28L24qJ23k02P4k17J52
8081B9j51J12J5p3N0n9L4K69l28L27j83r2P1j54J35P7rJ02j78J13J27l74J01J32
$$ plain form
8105 93 110 180 31 -45 -114 281 80 -220 -99 130 18 138 16 -128 56 -155 -146 14 -3 174 159 109 -116
8128 -116 -11 69 42 142 99 53 -70 -123 104 -170 -204 57 42 143 66 5 -141 97 -121 -124 63 188 -284 95
8152 95 67 22 149 -81 36 139 -20 -118 28 -110 -48 -182 -61 104 -15 208 -58 -51 382 3 159 -145
8174 -145 9 -107 29 149 -14 61 80 36 -269 110 105 63 37 -238 36 -118 16
$$ packed form
8105I3J7P0j49p6o9L95k01l00J21K29j12J20j22j44J84k11RJ60j7J77j5n0k25
8128a16J05Q0k7J00m3m6j23n3K27k74l4K61j5J01p7o1j46K38k18lJ87J25m72L79
8152I5k8m5J27k30J17J03j59r8J46j38O2j34J21J65j19K23k66PM33l79J56l04
8174a45J54j16J36J20j63P5J9m4l05L79nm2k6k75K74j54J34
8191A6
$$ Imaginary data points
##PAGE= N=2
##DATA TABLE= (X++(I..I)), XYDATA
$$ plain form
0 0 0 0 0 0 0 0 0 0 0 0 0 0 0 -8 8 -8 8 -8 16 -16 16 -24 24 -32 34 -40 48 -56 64 -72 83 -96 107 -123 138
35 138 -155 175 -195 219 -243 271 -299 334 -370 410 -451 499 -549 605 -666 733 -809 890 -982
54 -982 1085 -1203 1332 -1487 1662 -1873 2122 -2428 2815 -3322 4013 -5012 6608 -9540 16762
69 16762 -78308 -28602 127700 59815 -22928 -48671 -25691 -7517 39542 47934 1479 -49118
81 -49118 -38629 -6404 21718 31923 26615 -1993 -27637 -29960 -519 22641 16979 -3732 -11689
94 -11689 -15233 -9392 15537 37766 15208 -31563 -43998 -9981 27958 35876 8638 -24073 -25665
107 -25665 -1148 18776 21352 7110 -20561 -32797 -6057 26358 22697 3195 -3627 -13126 -24047
120 -24047 -2214 31771 21684 -21047 -31274 577 22698 11783 -372 1865 -4320 -23854
$$ packed form
0@%%%%%%%%%%%%%qJ6j6J6j6K4l2L2m0M8n6O6p4Q8j04J20j36J55j79K03k30K61
35A38k93L30l70M14m62N14n70O33p04P80q61R50j048J154j271J399j542J699j872
54i82K067k288K535k819L149l535L995m550N243o137P335r025J1620j6148K6302
69A6762r5070M9706J56302o7885q2743k5743K2980J8174M7059Q392m6455n0597
81d9118J0489L2225K8122J0205n308k8608k5644k323K9441K3160n662k0711p957
94a1689l544N841K4929K2229k2558m6771j2435L4017L7939P918k7238l2711j592
107b5665K4517J9924K576j4242k7671j2236K6740L2415l661j9502o822r499j0921
120b4047K1833L3985j0087m2731j0227L1851K2121j0915j2155K237o185j9534
$$ plain form
132 -23854 -18873 18950 36951 5586 -26172 -20418 992 15296 21004 3821 -26429 -25716 9936
145 9936 27184 8272 -6963 -2502 -4810 -13577 -4681 15019 16103 -4100 -16929 -5600 8538
158 8538 8194 3211 2026 -5653 -14972 -7428 10473 15503 7140 -4164 -14556 -13589 6914 21022
172 21022 6584 -14817 -15489 -396 11213 11475 1707 -7780 -6802 -2601 -3353 2185 13518 7508 -13304
187 -13304 -14939 5773 16400 4016 -9869 -9925 -1475 5497 5774 2204 -741 -1720 -2751 -1578 503
202 503 1316 3407 2589 -6516 -8898 5969 15525 444 -14369 -5028 6648 944 -1912 5954 4300
217 4300 -7783 -7255 3654 6289 2007 -139 -4739 -8623 288 13133 8422 -8150 -10115 1362
231 1362 4904 -1759 -1157 6465 2360 -9495 -6239 6784 8884 480 -5273 -6272 -3114 5334 8209
$$ packed form
132b3854M981L7823J8001l1365l1758N754K1410J4304N708j7183l0250P13L5652
145I936J7248j8912j5235M461k308q767Q896J9700J084k0203j2829J1329J4138
158H538l44m983j185p679r319P544J7901N030q363j1304j0392R67K0503J4108
172B1022j4438k1401o72J5093J1609K62r768r487R78M201p52N538J1333o010k0812
187a3304j635K0712J0627j2384j3885n6Q450O972K77l570k945r79j031J173K081
202E03Q13K091q18r105k382J4867R556j5081j4813R341J1676n704k856P866j654
217D300j2083N28J0909K635m282k146m600l884Q911J2845m711j6572j965J1477
231A362L542o663O02P622m105j1855L256J3023K100q404n753r99L158Q448K875
$$ plain form
246 8209 -1093 -6783 1672 3499 -5825 -4334 8616 6513 -7395 -8086 3090 5371 1591 546 -2709
261 -2709 -6242 70 7600 1233 -6325 -36 6085 -1412 -6796 2285 7625 -2125 -7972 71 6019
276 6019 1262 -2247 683 -310 -3708 545 4649 -649 -4436 2495 3550 -4959 -2993 7356 5177
291 5177 -8088 -6747 5370 5986 -1765 -2375 -293 -820 258 1783 408 -2122 347 1773 -1965
306 -1965 -3086 3355 5916 -2067 -7421 -243 6392 1625 -4341 -947 2701 -548 -1441 681 498 -191
322 -191 1272 -989 -4519 415 7082 1401 -7400 -2039 5682 1413 -3777 -252 2573 -636 -2445
337 -2445 708 1487 -385 197 -443 -2636 -815 3276 2551 -2432 -3422 1602 3443 -1205 -3223 1691
353 1691 2721 -2090 -2777 1573 2465 -544 -954 -231 -1260 -104 3113 97 -3683 -556 3574 402
$$ packed form
246H209r302n690Q455J827r324J491J2950k103j3908o91J1176K281l780j045l255
261b709l533O312P530o367p558O289O121p497n384R081N340r750n847Q043N948
276F019m757l509K930r93l398M253M104n298l787O931J055q509J966J0349k179
291E177j3265J341J2117O16p751o10K082n27J078J525j375k530K469J426l738
306a965j121O441K561p983n354P178O635m767n966L394L648l249q93K122j83o89
322a91J463k261l530M934O667n681q801N361P721m269n190L525K825l209j809
337b445L153P79j872N82o40k193J821M091p25m983r90N024J841m648k018M914
353A691J030m811o87M350Q92l009m10P23j029J156L217l016l780L127M130l172
$$ plain form
369 402 -3399 -440 2864 419 -2487 -962 1379 1613 -224 -1894 -838 1324 1461 -485 -1219 -834
385 -834 1110 1624 -1029 -1903 1046 2854 -1757 -3871 1593 4091 -1121 -3515 906 1797 -797 -28
401 -28 960 -1186 -1268 2206 998 -2832 -24 3130 -227 -4108 567 3989 360 -3482 -536 2821
417 2821 -181 -1743 484 1367 -1551 -660 1456 88 -1968 1164 2595 -2119 -3403 2507 3138 -2673
433 -2673 -2551 3258 1846 -3007 -1008 2746 259 -2026 1161 505 -2256 550 3441 -505 -3696 299
449 299 3526 138 -2734 128 1877 -807 -1674 992 1809 -1117 -1496 1162 1115 -1424 112 1550 -1212
466 -1212 -1987 2611 2429 -3293 -2451 3375 1985 -3306 -955 2937 -352 -2541 594 1536 -1241 -731
482 -731 1633 -413 -1945 1131 2892 -1263 -2593 918 2220 -532 -2114 958 2158 -1345 -2210 1561
$$ packed form
369D02l801K959L304k445k906J525K341K34j837j670J056K162J37j946p34L85
385h34J944N14k653q74K949J808m611k114N464K498n212k394M421Q91k594P69
401b8R88k146q2L474j208l830K808L154l357l881M675L422l629l842K946L357
417B821l002j562K227Q83k918Q91K116j368k056L132J431m714j284N910O31n811
433b673J22N809j412m853J999L754k487k285L187o56k761K806K891l946l191L995
449B99L227l388k872K862J749k684q67K666Q17k926l79K658m7k539J536J438k762
466a212p75M598j82n722Q42N826j390n291K351L892l289k189L135R42k777N10
482g31K364k046j532L076J761m155j330L511J302k752j582L072J200l503q65L771
$$ plain form
498 1561 1817 -1386 -1179 1573 17 -1770 964 2128 -2194 -1753 3069 769 -3521 373 3225 -949
514 -949 -2960 1116 2425 -1532 -671 1559 -26 -1997 1084 1581 -1218 -1547 821 1144 -76 -776 80
531 80 754 -371 -771 1115 696 -1936 -969 1805 668 -1421 495 510 -2205 -354 3195 320 -3252
548 -3252 -138 2293 -396 -1480 999 1046 -1331 -730 690 396 58 116 -482 -379 434 212 -113 -387
566 -387 -686 -20 592 82 -1169 741 1084 -1268 -1006 2030 764 -2100 177 1907 -510 -1699 1235
583 1235 815 -1450 -63 1456 -273 -1512 560 995 -328 -462 432 454 -402 -914 171 918 -94
600 -94 -379 212 216 -1816 -127 2276 278 -2583 197 1664 -1322 -826 2423 934 -2693 -503 2318
617 2318 336 -1364 930 566 -1397 -363 1332 133 -1160 187 915 -48 -778 95 761 -248 -891
$$ packed form
498A561K56l203K07K752j556j787K734J164m322M41M822k300m290L894K852m174
514i49k011M076J309l957Q61K230j585j971L081M97k799l29K368L23j220p00Q56
531H0O74j125m00J886m19k632R67K774j137k089J916J5k715J851L549k875l572
548c252L114K431k689j084K479M7k377O01J420k94l38N8n98J03Q13k22l25k74
566c87k99O66O12n10j251J910L43k352K62L036j266k864K277J730k417j189K934
583A235m20k265J387J519j729j239K072M35j323j34Q94K2q56n12J085P47j012
600i4k85N91Mk032J689K403j998k861K780J467k986M96L249j489l627K190K821
617B318j982j700K294l64j963J034J695j199j293J347P28r63p30Q73O66j009o43
$$ plain form
634 -891 590 1209 -782 -1741 1094 1454 -1075 -919 1476 -341 -2276 1339 2178 -1053 -1706 1181 711
651 711 -1563 610 1796 -1013 -2247 765 1543 -628 -713 1193 587 -1402 -193 1520 415 -1458
667 -1458 1 1434 -153 -1635 484 1841 -770 -1683 1204 972 -1503 -599 1871 155 -1912 647
683 647 1852 -1260 -1664 1680 914 -1638 -341 1696 -523 -1620 906 1244 -670 -1355 708 902 -798
700 -798 215 913 74 -1312 116 1376 -335 -844 568 709 -1274 -817 1423 650 -1607 -319 1264
717 1264 -195 -1345 642 1389 -1312 -1186 1231 323 -1248 26 1306 -383 -1278 570 1094 -593
733 -593 -602 706 614 -873 -19 1023 511 -932 -313 1293 -92 -1032 380 974 -269 -939 549 808
751 808 -726 -553 931 295 -1251 35 827 -659 -953 836 716 -1052 -427 1144 227 -766 271
$$ packed form
634h91J481O19j991r59K835L60k529J56K395j817j935L615Q39l231o53K887m70
651G11k274K173J186k809j234L012P78k171q5J906o06j989J209J713j105j873
667a458J459J433j587j482K119J357k611r13K887k32k475R04K470j716k067K559
683F47J205l112m04L344p66k552J297K037k219j097K526L38j914o85K063J94j700
700g98J013O98q39j386J428J260j711n09J412J41j983M57K240p73k257J288J583
717A264j459j150J987P47k701J26K417r08j571J274J280j689q95J848N24j687
733e93rJ308r2j487Q54J042n12j443O19J606j385r40J412N94j243o70J488K59
751H08j534J73J484o36j546J286P92j486k94J789j20j768O25J571r17r93J037
$$ plain form
768 271 1012 -386 -1034 392 717 -530 -467 604 310 -585 -447 1205 -31 -753 -99 667 -46 -672 750
787 750 754 -745 -439 1076 449 -912 -74 1374 -98 -1480 325 895 -835 -546 1109 70 -1053
804 -1053 -25 1107 -139 -964 280 862 -299 -517 565 592 -561 -771 668 426 -847 -487 910
821 910 158 -1062 73 984 -299 -1047 582 556 -1074 -788 1405 113 -1095 139 1438 -322 -1271
838 -1271 697 718 -917 -542 907 65 -1015 314 1044 -154 -878 505 783 -525 -579 851 840 -1044
856 -1044 -498 920 51 -1127 -103 1257 -575 -1351 975 545 -1109 -359 1298 41 -1544 453
872 453 1465 -672 -1208 858 809 -933 -236 811 307 -1071 -67 953 -312 -1054 500 753 -842
889 -842 -606 867 447 -889 -421 995 192 -1076 77 1138 -366 -1017 830 658 -1042 -453 1156
$$ packed form
768B71P41j398o48J426L25j247O3J071k94q95J38J652j236p22O54P66p13o26J422
787G50Mj499L06J515o27j361Q38J448j472j382J805N70j730K89J655j039j123
804a053J028J132j246q25J244N82j161k18J082K7j153k10J439k42j273L60J397
821I10p52j220J135R11j283p48J629k6j630K86K193j292j208J234J299j760r49
838a271J968K1j635L75J449q42j080J329P30j198p24J383K78j308n4J430j1j884
856a044N46J418q69j178J024J360j832p76K326m30j654P50J657j257j585J997
872D53J012k137n36K066m9j742O97J047n04j378J004J020j265p42J554K53j595
889h42K36J473m20j336M68J416q03j268J153J061j504o51J847j72j700N89J609
$$ plain form
906 1156 304 -1120 170 1130 -437 -892 884 744 -1054 -181 890 -107 -860 -45 650 -308 -572 -13
924 -13 665 -425 -429 684 665 -518 -381 671 143 -820 -157 984 -593 -988 333 814 -699 -315 841
943 841 325 -974 -53 1000 -363 -749 433 616 -841 -320 813 230 -922 -380 773 -134 -355 171
961 171 30 -181 -333 248 364 -370 -390 635 515 -789 -60 663 164 -970 300 900 -297 -976 710
980 710 551 -898 -138 599 187 -965 551 414 -573 -252 942 125 -758 -104 668 38 -676 77 48
999 48 -151 -308 76 355 -139 -597 -32 847 -522 -273 563 68 -1062 141 1178 -397 -985 425 910
1018 910 -853 -532 813 157 -1161 290 767 -225 -456 415 230 -728 -241 604 175 -1028 -434 848
1036 848 325 -621 -77 710 55 -839 367 766 -566 -639 800 365 -1025 37 1035 -473 -1325 991
$$ packed form
906A156q52j424J290R60j567m55J776j40j798Q73J071r97p53Q15O95r58k64N59
924a3O78j090mJ113j9j183J37J052n28r63O63J141j577l95J321M81j513L84J156
943H41n16j299R21J053j363l86J182J83j457N21J133n83j152N42J153r07k21N26
961A71j41k11j52N81J16p34k0J025j20j304P29P23m99j134J270O00j197o79J686
980G10j59j449P60P37m12j152J516j37r87L21J194q17q83O54P72o30p14P53k9
999D8j99j57L84K79m94m58N65Q79j369K49Q36m95j130J203J037j575n88J410M85
1018I10j763L21J345o56j318J451M77r92k31Q71j85r58M87Q45m29j203N94J282
1036H48n23r46N44P87o55q94J206L99j332p3J439m35j390J062R98j508q52K316
$$ plain form
1054 991 939 -876 -580 1020 80 -692 516 746 -589 -542 357 331 -291 -270 262 232 -788 -87 462 628
1074 628 -876 -210 955 257 -779 151 936 -809 -1020 1022 634 -1136 -198 1251 -368 -817 1116
1091 1116 860 -1061 -436 1448 274 -699 50 837 -406 -482 508 435 -545 -178 353 300 244 -225 414 18
1111 18 -846 -339 862 84 -867 190 511 -586 -705 687 38 -1358 -47 1128 -134 -746 606
1128 606 428 -1044 -354 1063 127 -775 124 621 -192 -334 589 243 -296 -506 132 422 -233 -389 101
1147 101 124 -491 -40 717 91 -1103 111 842 -422 -637 814 282 -1071 -64 1017 9 -640 590
1165 590 319 -512 -210 589 -110 -404 -95 662 -60 -419 -147 136 -128 -254 170 287 -79 -795 318 586
1185 586 -344 -206 743 -18 -831 37 708 -381 -801 671 466 -808 -66 962 85 -742 50 535 -228
$$ packed form
1054I91n2j815K96J600r40p72J208K30j335M7Q99k6o22K1N32l0j020P01N49J66
1074F28j504O66J165o98j036R30P85j745k11K042l88j770R38J449j619m49J933
1091A116k56j921O25J884j174r73P49P87j243p6R90p3r80L67N31n3n6m69O39l96
1111A8q64N07J201p78r51J057L21j097j19J392o49j396J311J175j262o12J352
1128F06j78j472O90J417r36r02Q99M97q13j42R23l46n39k10O38K90o55j56M90
1147A01K3o15M51P57o26j194J214P31j264k15J451n32j353J007J081j008o49J230
1165E90k71q31L02P99o99k94L09P57p22l59K72K83k64j26M24J17l66p16J113K68
1185E86r30J38R49p61q13Q68O71j089m20J472k05j274P42J028q77q27P92M85p63
$$ plain form
1204 -228 -407 388 106 -717 -213 396 285 -540 -28 347 -12 -386 155 452 -274 -572 244 737 -549 -563
1224 -563 801 206 -670 255 795 -412 -859 535 696 -889 -74 886 207 -559 7 725 -412 -422 536
1243 536 358 -279 -307 313 116 -286 -26 738 279 -438 -2 641 -213 -575 245 527 -164 -430 662 -43
1263 -43 -656 -38 858 -212 -829 314 657 -795 -738 722 104 -769 111 767 48 -424 477 717 -494
1282 -494 -460 260 380 -356 68 437 149 -572 -130 885 -51 -756 229 436 -340 -561 367 154 -858 -83
1302 -83 728 269 -901 727 509 -734 -553 462 282 -456 59 911 -92 -558 491 455 -616 -536 301
1321 301 345 -388 -364 548 0 -290 -222 717 -175 -412 2 391 -337 -469 751 356 -602 -189 736 36 -382
1342 -382 258 609 -333 -381 590 338 -486 -312 488 -155 -579 366 590 -118 -103 565 164 -411 -250 408 54
$$ packed form
1204b28j79P95k82q23N04O09j11q25N12L75l59l74N41K97p26k98Q16M93j286j4
1224e63J364n95q76R25N40j207m47J394J61j585Q15R60o79p66N66P18j137j0R58
1243E36j78o37k8O20j97m02K60P64m59p17M36O43q54l62Q20K82o91k66J092p05
1263d3o13O18Q96j070o17J143L43j452N7J460o18q73Q80O56p19m72R01K40j211
1282d94L4P20J20p36M24L69k88p21M42J015r36p05R85K07p76k21R28k13j012P75
1302h3Q11m59j170J628k18j243J81J015j80p38N15Q52j003m66J049l6j071Q0Q37
1321C01M4p33K4R12n48k90O8R39q92k37M14L89p28j32J220l95r58M13R25p00m18
1342c82O40L51r42m8R71k52q24J74Q00o43m24R45K24p08J5O68m01n75J61O58l54
$$ plain form
1363 54 50 -199 439 -130 -412 115 459 -35 -822 429 393 -635 -266 676 69 -528 186 485 50 -640 310
1384 310 80 -542 -139 449 27 -458 134 386 218 -263 300 103 -68 -277 10 -26 -249 -276 504 124 -578
1405 -578 -172 667 6 -769 254 366 -618 -276 621 125 -744 27 611 -223 -232 307 275 -580 -317 524 249
1426 249 -503 131 301 -113 -620 531 198 -271 -414 -12 195 -300 -3 692 374 -241 44 469 -12 -367
1446 -367 44 581 -274 -344 660 431 -753 329 840 121 -518 230 615 -543 -716 613 305 -621 -102
1465 -102 162 -22 -290 167 343 -332 -280 82 86 -111 -115 402 402 -224 -422 644 283 -703 -16 573 -166 -594
1487 -594 617 214 -578 109 799 4 -678 319 707 -331 -509 298 349 -1092 -249 494 -121 -237 175
1506 175 382 -367 -288 387 -25 -389 -217 84 223 -306 -47 422 234 -423 0 572 -291 -677 372 220
$$ packed form
1363E4mk49O38n69k82N27L44m94p87J251l6j028L69R42o07n97P14K99m35o90R50
1384C10k30o22M03N88m22m85N92K52j68m81N63j97j71k09K87l6k23k7P80l80p02
1405e78M06Q39o61p75J023J12r84L42Q97m96q69P71N84q34rN39l2q55K63Q41k75
1426B49p52O34J70m14n07J151l33m69j43M02K07m95K97O95l18o15K85M25m81l55
1446c67M11N37q55p0J004k29j184J082N11p19o39P48L85j158j73J329l08r26N19
1465a02K64j84k68M57J76o75N2L62Mj97mN17%o26j98J066l61r86O87N89p39m28
1487e94J211m03p92O87O90p95o82R97L88j038j78Q07N1j441Q43P43o15j16M12
1506A75K07p49P9O75m12l64J72L01J39n29K59M69j88o57M23N72q63l86J049j52
$$ plain form
1526 220 -500 -185 907 -179 -475 242 384 -413 -299 415 200 -420 198 363 -25 -116 -145 198 -36 35
1546 35 -57 191 -17 -274 424 577 -501 -407 426 283 -630 272 639 -134 -787 460 684 -556 -78 403
1566 403 -281 -465 336 665 -696 -528 599 220 -254 -79 476 -279 -387 -170 299 108 252 -115 218
1585 218 -3 -49 56 521 -219 -333 561 248 -318 -182 871 -112 -682 161 647 -427 -382 105 -11 -315
1605 -315 264 432 -464 -144 381 310 -200 -173 349 -10 -166 -177 282 350 -510 -234 334 234 -276 134 400
1626 400 -270 -369 620 444 -511 18 743 -328 -691 458 557 -468 -637 602 274 -139 -78 334 -199 -53
1646 -53 395 42 -527 -167 400 280 -88 -370 340 172 -254 -197 228 230 -537 9 447 -385 -427 402 418 -404
1668 -404 226 423 -233 -569 292 210 -607 -401 539 234 -560 31 179 -55 -173 87 56 -42 -84 26 350
$$ packed form
1526B20p20L15J092j086k96P17J42p97J14P14k15o20O18J65l88r1k9L43k34P1
1546C5r2K48k08k57O98J53j078R4Q33j43r13R02L67p73o53J247K24j240M78M81
1566D03o84j84Q01L29j361J68J127l79m74J75N55p55j08K17M69j91J44l67L33
1585B18k21m6J05M65p40j14Q94l13n66J36J053r83n70Q43M86j074M5M87j16l04
1605c15N79J68q96L20N25p1n10K7N22l59j56j1M59O8q60K76N68j00n10M10K66
1626D00o70r9R89j76r55N29P25j071l63J149R9j025j69J239l28m13O1M12n33J46
1646e3M48l53n69L60N67j20l68k82P10j68m26N7M25Kp67N46M38q32m2Q29J6q22
1668d04O30J97o56l36Q61q2q17K06R40l05p94N91J48k34j18K60l1r8m2J10L24
$$ plain form
1689 350 -227 -518 146 52 -383 -356 769 -140 -701 -145 752 144 -340 216 41 -343 53 565 -110 -321
1709 -321 330 242 -291 -450 493 345 -723 -319 374 146 -38 -306 92 17 -159 160 277 -84 -369 389
1729 389 341 -454 -295 646 0 -483 26 696 -305 -380 15 524 -226 -86 530 69 -133 116 452 -204
1749 -204 -112 548 392 -431 -161 428 256 -524 -223 414 375 -348 -75 305 -55 -414 214 13 -369 76 239
1770 239 -389 -731 202 322 -200 -184 210 600 -348 -302 256 307 -366 -97 260 -220 -606 455 341 -446 -388
1791 -388 337 -162 -481 -144 573 330 -393 111 381 96 -468 24 137 19 -120 36 104 -169 -319 456
1811 456 -315 -273 234 537 -379 -232 494 309 -504 -396 561 125 -250 28 26 -50 -193 377 35 -290 22
1832 22 564 -52 -553 -38 626 -108 -288 -125 516 364 -61 103 -179 -255 -189 -72 143 -246 2 215 -382
$$ packed form
1689C50n77k91O64r4m35K7J125r09n61N56Q97o08m84N56j75l84L96N12o75k11
1709c21O51q8n33j59R43j48j068M04O93k28j84k68L98p5j76L19J17l61k85P58
1729C89m8p95J59R41o46m83N09O70j001p5L95N09p50J40O16m61k02K49L36o56
1749b04R2O60j56q23K70N89j72p80L01O37l9p23K73L80l60l59O28k01l82M45J63
1770B39o28l42R33J20n22J6L94L90r48M6N58N1o73K69L57m80l86J061j14p87N8
1791c88P25m99l19L37P17k43p23N04K70k85n64M92J13j18j39J56O8k73j50P75
1811D56p71M2N07L03r16J47P26j85q13J08R57m36l75K78kp6j43N70l42l25L12
1832B2N42o16n01N15O64p34j80J63O41j52m25J64k82p6O6J17K15l89K48K13n97
$$ plain form
1853 -382 -115 316 452 -504 -375 523 -111 -501 -304 429 253 -90 -120 179 -403 136 241 157 -474 224 416
1874 416 -280 -249 153 662 -92 -271 132 413 -86 -669 35 41 -552 172 281 -528 -205 574 202 -468 -517
1895 -517 549 -81 -431 -242 578 56 -435 -101 -85 -186 -158 34 262 -462 196 492 60 -211 229 188 -120
1916 -120 -455 32 287 -204 -412 169 259 -221 -90 310 -422 -357 158 -15 -316 -418 744 -78 -472 31
1936 31 552 -314 -501 -23 476 -141 -356 -21 312 -126 -14 290 -93 -278 198 548 -123 -583 464 487
1956 487 -215 -582 331 367 -361 122 263 180 -199 43 258 -306 59 88 16 -356 -127 363 -308 -457 240
1977 240 530 -243 -287 3 185 -123 -129 201 -170 114 159 10 112 -311 181 150 -153 -464 264 367 -484 -312
1999 -312 464 400 -652 -158 488 -38 -486 -22 190 -578 -175 177 -294 -425 -269 314 -178 -305 266 326
$$ packed form
1853c82K67M31J36r56J29Q98o34l90J97P33j76l43l0K99n82N39J05q4o31O98J92
1874D16o96L1M02N09p54j79M03K81m99n83P04On93P24J09q09L23P79l72o70m9
1895e17J066o30l50J89Q20n22m91L34J6j01K8J92K28p24O58K96m32k71M40m1l08
1916a20l35M87K55m91k08N81R0m80J31M00p32O5N15j73l01j02J162q22l94N03
1936C1N21q66j87M78M99o17k15L35L33m38J12L04l83j85M76L50o71m60J047K3
1956D87p02l67R13L6p28M83J41q3l79K42K15n64L65K9p2l72K29M90o71j49O97
1977B40K90p73m4K90J82l08oL30l71K84M5j49J02m23M92l1l03l11P28J03q51J72
1999c12P76o4j052M94O46n26m48M64K12p68M03L52m71j31J56N83m92j27N71O0
$$ plain form
2019 326 -77 -253 -38 311 -28 -201 -111 82 -630 63 315 -287 -356 226 364 -590 -377 564 192 -527 24
2040 24 589 179 -485 -71 -93 -290 -113 266 -61 -174 23 170 -51 -440 260 323 -260 -441 100 437 -103
2061 -103 -249 -62 345 -99 -121 354 144 -418 250 152 -264 -271 838 208 -574 34 399 -129 -395 84 469
2082 469 -394 172 164 -147 -25 -234 299 -21 9 138 -38 -45 86 26 332 -217 -437 321 341 -407 -31 562
2104 562 -74 -394 230 399 -273 -250 369 -72 -223 196 485 -387 -478 41 353 -116 -348 132 142 -151 -189
2125 -189 208 26 -100 -142 206 -153 -269 182 362 19 -585 30 323 -576 -260 415 272 -532 322 635
2145 635 -90 -127 261 -13 -312 250 313 -41 -236 300 476 -132 -324 24 119 186 -286 -57 167 -263 -195 127
2167 127 50 -423 59 403 -75 -108 408 96 -454 -220 432 -66 -443 80 360 -227 -330 52 23 85 -73
$$ packed form
2019C26m03j76K15L49l39j73R0J93p12O93K52o02o9N82J38r54K13R41l72p19N51
2040B4N65m10o64M14k2j97J77L79l27j13J97J47k21l89P00O3n83j81N41L37n40
2061a03j46J87M07m44k2M75k10n62O68r8m16pJ109o30p82O08L65n28k66M79L85
2082D69q63N66ql11J22k09N33l20L0J29j76pJ31o0L06n49k20P58K0p48L76N93
2104E62o36l20O24J69o72K3O19m41j51M19K89q72r1N19L12m69k32M80J0k93l8
2125a89L97j82j26m2L48l59j16M51J80l43o04O15K93q99L16O75j43q04Q54L13
2145F35p25l7L88k74k99N62O3l54j95N36J76o08j92L48R5O7m72K29K24m30O8L22
2167A27p7m73M82L44m78l3N16l12n50K34O52m98l77N23K80n87j03L82k9O2j58
$$ plain form
2188 -73 -137 -103 -21 304 231 -104 -174 45 247 -92 -229 199 572 -203 -475 191 134 -198 -63 419 -16 -156
2210 -156 292 33 -210 -278 14 -77 -300 -42 334 -218 -115 230 473 -82 -24 -31 8 -50 24 -11 -236 -363 184
2233 184 336 -211 -159 190 400 -300 -399 124 203 -317 38 293 245 -26 -46 270 -408 -279 443 157 -320 216
2255 216 471 275 -319 307 310 -76 17 265 104 -185 -91 245 105 -319 23 324 -60 -217 47 132 -166 -293
2277 -293 -22 187 -469 -577 355 -69 -628 -98 -81 -89 45 392 125 -250 284 51 82 -346 403 530 -83
2298 -83 -163 491 134 -280 -127 332 138 -345 11 353 -11 0 -13 223 -138 -73 491 2 -118 -249 584 117
2320 117 -390 177 181 -92 -270 3 231 -9 -222 37 -169 -92 169 122 -123 -154 256 200 -339 -396 107 313
2342 313 -376 156 -99 179 -312 -145 112 -17 -140 314 445 -144 -204 -84 -14 -233 96 288 -167 -338 11
$$ packed form
2188g3o4L4Q2L25p3l35p0K19K02l39j37M28L73p75k72O66n7l32J35M82m35j40
2210a56M48k59k43o8K92r1k23K58L76n52J03L45K43n55N8pL9n8P4l5k25j27N47
2233A84J52n47N2L49K10p00r9N23P9n20L55K55m8k71k0L16o78J29P22k86m77N36
2255B16K55j96n94O26Ll86R3K48j61k89R4L36j40m24L42L01l84j57K64Q5k98j27
2277b93K71K09o56j08R32m24n59N30J7qJ34L47k67l75N34k33L1m28P49J27o13
2298h3q0O54l57m14J53M59j94m83L56L42l64J1j3K36l61O5N64m89j20j31Q33m67
2320A17n07N67Mk73j78K73K28k40k13K59k06P7K61m7k45l1M10n6n39n7N03K06
2342C13o89N32k55K78m91J67K57j29j23M54J31n89o0J20P0k19L29J92m55j71L49
$$ plain form
2363 11 91 -255 -167 159 31 -173 129 284 -354 -125 104 44 -326 -142 -2 137 -172 -263 41 -163 -105 -34
2385 -34 134 15 -136 190 79 -201 -376 164 195 -148 152 396 99 -548 71 160 -330 98 151 78 -204 -17
2407 -17 422 -70 -192 151 249 -34 -156 219 148 -32 33 231 -141 -232 61 233 -75 -289 -9 223 -333 -171
2429 -171 233 240 -248 78 177 -29 -380 301 181 -193 -223 288 -106 -301 -221 482 122 -166 95 200 -167 272
2451 272 401 -62 -48 -45 165 56 -89 150 243 -56 -375 152 453 -265 -247 87 227 -59 -52 343 -34 -355
2473 -355 245 141 -205 -178 164 70 -212 167 8 -229 -156 261 417 -245 59 138 80 17 17 71 84 -202 -85
2496 -85 20 221 -385 -280 113 -142 -305 251 144 -325 30 353 78 -314 62 213 -33 -265 238 111
2516 111 -321 -12 180 -89 -225 -59 208 56 -249 -102 329 -134 -293 144 201 -124 -308 360 211 -331
$$ packed form
2363A1Q0l46Q8L26j28k04L02J55o38K29K29o0l70J84J40J39l09r1L04k04N8P1
2385c4J68j19j51L26j11k80j75N40L1l43L00K44k97o47O19Q9m90M28N3p3k82J87
2407a7M39m92j22L43R8k83j22L75p1j80O5J98l72r1K93J72l08k14K80K32n56J62
2429a71M04Pm88L26R9k06l51O81j20l74l0N11l94j95Q0P03l60k88K61J05l67M39
2451B72J29m63J4LK10j09j45K39R3k99l19N27L01p18J8L34J40k86PL95l77l21
2473c55O00j04l46K7L42r4k82L79j59k37P3M17J56o62L04P9n8o3%N4J3k86J17
2496h5J05K01o06J05L93k55j63N56j07m69L55L23k75l92L76J51k46k32N03j27
2516A11m32L09J92k69j36J66K67j52l05J47M31m63j59M37N7l25j84O68j49n42
$$ plain form
2536 -331 153 254 -221 -335 131 78 -174 -122 274 30 -483 -1 197 6 -305 258 112 -38 -132 75 144
2557 144 -169 -100 399 47 -289 161 117 55 -95 151 150 -138 54 151 25 -421 -224 292 160 -246 -32 22
2579 22 -206 -84 284 340 -330 -41 320 11 -350 247 -23 -495 -105 274 -284 -47 146 104 86 -15 246
2600 246 188 163 -144 -10 137 90 -346 -42 26 -215 -190 90 128 -277 57 357 -364 -287 365 120 -165 -58
2622 -58 326 -71 -40 41 36 -70 -147 71 31 -401 -198 37 229 2 -230 17 137 -388 -37 138 48 -485 -25
2645 -25 32 -155 259 337 347 -449 242 249 -372 10 315 81 -213 215 344 -181 -430 20 -147 124 205 89
2667 89 -14 -234 130 261 -19 -290 118 87 28 44 102 147 16 -160 81 490 -185 -94 65 65 -470 308 225
2690 225 69 -439 278 312 -345 79 435 194 -463 274 35 -113 -273 173 258 -22 165 147 185 -175 113
$$ packed form
2536c31M84J01m75j14M66n3k52N2L96k44n13M82J98j91l11N63j46j50r4K07O9
2557A44l13O9M99l52l36M50m4o2j50K46jk88J92R7j26m46J97N16j32m06K14N4
2579B2k28J22L68N6o70K89L61l09l61N97k70m72L90L79n58K37J93m2j8j01K61
2600B46n8k5l07J34J47m7m36L04O8k41K5K80L8m05L34L00p21P7O52k45k85J07
2622e8L84l97L1Q1nj06p7K18m0m32K03K35J92k27k32K47J20n25L51J75r0n33M60
2645b5N7j87M14P8J0p96O91Po21L82L05k34k94M28J29n25k49M50j67K71Q1j16
2667H9j03k20L64J31k80k71M08l1n9J6N8M5j31j76K41M09o75R1J59%n35P78q3
2690B25j56n08P17L4o57M24L56k41o57P37k39j48j60M46Q5k80J87j8L8l60K88
$$ plain form
2711 113 -128 -150 -298 47 326 -115 -144 193 110 4 -143 166 232 -25 79 81 -17 -203 492 -53 -132 -55 82
2734 82 -62 -60 -221 300 85 -300 -46 90 -96 -112 -76 249 -17 -298 -71 11 -281 128 57 -96 -175 58 147
2757 147 -155 -291 157 51 122 191 50 97 -138 -84 63 -36 -40 -79 137 86 1 117 -155 -162 16 189 42 -64
2781 -64 147 3 -85 7 320 -83 -166 -25 59 176 -89 64 102 -8 14 55 -92 -176 -92 176 -137 -291 24
2804 24 362 62 -277 -115 186 -222 -128 85 75 -426 147 274 -57 132 50 101 -7 -448 69 62 -357 45
2826 45 308 24 -104 -31 264 -97 -208 50 38 -124 -28 264 -259 -333 95 -34 -197 -277 67 119 314 -75
2848 -75 333 -44 -152 80 86 92 -220 36 76 16 -133 106 41 16 -553 280 -136 -127 -52 293 106 -227 -97 28
2872 28 -51 -215 328 -6 -311 31 64 -4 -137 100 147 -71 -26 164 92 -84 -68 167 -92 -166 -17 99 -91
$$ packed form
2711A13k41k2j48L45K79m41k9L37q3j06j47L09O6k57J04Kr8j86O95n45p9P7J37
2734H2j44Kj61N21k15l85K54J36j86j6L6L25k66k81K27Q2k92M09p1j53p9K33Q9
2757A47l02j36M48j06P1O9j41M7k35N4J47r9ml9K16n1q5J16k72pJ78J73j47j06
2781f4K11j44q8R2L13m03q3J41Q4J17k65J53L8j10K2M1j47q4Q4K68l13j54L15
2804B4L38l00l39J62L01m08R4K13j0n01N73J27l31J89q2N1j08m41N17pm19M02
2826D5K63k84j28P3K95l61j11K58j2j62R6K92n23p4M28j29j63q0L44N2J95l89
2848g5M08l77j08K32OOl12K56M0o0j49K39o5k5n69Q33m16RP5L45j87l33J30J25
2872B8p9j64N43l34l05L42L3o8j33K37M7k18M5J90p2j76J6K35k59p4J49J16j90
$$ plain form
2895 -91 -72 318 -121 79 -20 16 158 -328 -46 -108 -232 -175 264 62 -139 -50 255 87 -383 -171 81 -28
2917 -28 -121 -208 207 -71 -282 204 -56 -123 -24 296 70 -27 168 108 -51 -263 61 131 -38 -221 241 -12 -399
2940 -399 -183 -30 -92 -392 -1 197 171 -71 106 20 -269 396 531 95 -74 -13 56 52 73 93 322 -47 -130
2963 -130 125 -133 -56 -20 7 -94 -168 31 98 36 -194 -154 -64 -183 -205 234 211 -174 -112 147 -131 -74 181 255
2987 255 63 142 143 65 -280 77 -36 60 -203 141 398 49 130 -83 -27 -487 -67 156 136 82 142 145 149 -229 -3
3012 -3 115 -14 -261 93 108 -151 167 185 66 21 67 227 -234 -261 61 6 -153 -200 183 252 -150 -8 77 -187
3036 -187 -192 287 -19 -229 -86 127 193 -147 -4 239 0 -134 -177 191 -67 -194 4 -269 -244 -228 70 -111
3058 -111 -138 270 273 -62 -283 6 275 -142 67 109 -321 -128 -11 25 -199 -207 69 -324 -89 68 330 127
$$ packed form
2895i1J9L90m39K00r9L6J42m86K82o2j24N7M39k02k01Q9L05j68m70K12K52j09
2917b8r3q7M15k78k11M86k60o7R9L20k26r7J95o0j59k12L24P0j69j83M62k53l87
2940c99K16J53o2l00L91J98k6k42J77q6k89O65J35m36j69O1O9mK1K0K29l69q3
2963a30K55k58P7L6K7j01p4J99O7o2k30M0R0j19k2M39k3l85O2K59k78N7K55P4
2987B55j92P9Jp8l45L57j13R6k63L44K57l49Q1k13N6m60M20K23k0n4O0LMl78K26
3012cJ18j29k47L54J5k59L18J8j19m5M6J60m61k7L22n5j59m7L83O9m02J42Q5k64
3036a87nM79l06k10J43K13O6l40J43K43k39j34m3L68k58j27J98k73K5J6K98j81
3058a11k7M08Ll35k21K89K69m17K09M2m30J93J17L6k24qK76l93K35J57K62k03
$$ plain form
3080 127 -219 -30 346 -160 108 16 215 -174 -122 155 386 -440 102 344 -69 -388 -133 465 -113 -81 152
3101 152 -420 -395 -72 337 -117 -206 194 -49 17 173 102 5 85 -311 -174 193 -111 58 340 -243 -109 72
3123 72 297 -349 -281 -10 184 -85 -79 106 -100 -181 -128 161 -139 -8 204 -204 -33 -303 2 161 -186 60
3145 60 17 220 11 15 36 22 -153 117 130 13 39 229 7 -417 -238 357 -45 -217 105 218 -213 -358 -150
3168 -150 -76 -143 133 224 10 37 -126 86 -31 -274 129 -124 148 -86 -213 195 -10 -225 -129 231 41 58
3190 58 0 -37 -458 -79 65 -472 -69 303 167 -178 199 296 -313 -82 191 231 -72 -260 222 -24 -148 64
3212 64 83 1 -6 -44 89 -175 -151 125 101 -177 -221 -187 149 7 -76 281 -61 -278 17 -27 163 -84 178 -179
3236 -179 -298 107 -98 -38 11 -162 -92 -55 78 3 164 -253 6 213 -44 -88 204 247 33 -276 125 184 -65
$$ packed form
3080A27l46J89L76n06K68r2J99l89N2K77K31q26N42K42m13l19K55N98n78L2K33
3101A52n72K5L23M09m54q9M00k43O6J56p1r7Q0l96J37L67l04J69K82n83J34J81
3123G2K25o46O8K71J94k69OJ85k06q1N3K89l00J31K12m08J71k70L05J59l47K46
3145F0m3K03k09MK1j4j75K70J3j17K6J90k22m24J79N95m02j72L22J13m31j45K08
3168a50P4o7K76R1k14K7j63K12j17k43M03k53K72k34j27M08k05k15R6L60j90J7
3190E8n8l7m21L79J44n37M03L72j36l45L77R7o09K31K73M0l03j88M82k46j24K12
3212F4J9q2pl8J33k64K4K76k4k78m4L4L36j42q3L57l42k17K95m4J90k47K62l57
3236a79j19M05k05O0M9j73P0L7J33p5J61m17K59K07k57m4K92M3k14l09M01N9k49
$$ plain form
3259 -65 43 168 50 -135 -86 244 -92 -402 50 75 18 102 144 -46 -153 133 -93 -99 -223 -29 -58 -279 48
3282 48 80 173 -132 -137 -54 332 177 20 113 -142 -151 272 323 30 69 145 0 -297 -45 120 86 -292 143 350
3306 350 -104 41 93 78 -214 37 114 -76 -112 115 134 -205 -356 -124 280 -153 54 89 -240 63 -176 274
3328 274 -198 -22 53 -88 7 -209 165 153 65 -16 168 -123 -134 32 83 -169 -166 -26 210 100 -138 6 -63
3351 -63 -214 132 176 -166 -157 127 -12 -58 399 62 -100 -108 119 150 154 -109 86 236 -64 -22 270 -134 -110 -179
3375 -179 198 87 -145 -238 7 -222 -216 -7 52 -111 168 -5 -89 -273 87 578 -148 -415 -88 -32 -210 -10
3397 -10 152 311 -80 -82 38 -205 -373 -202 13 21 -214 15 91 213 -111 88 17 31 -40 263 -206 -157 170
3420 170 -93 17 -181 14 -133 -183 41 51 93 119 223 255 -205 66 -97 54 -229 230 -111 -11 -10 46 333
$$ packed form
3259f5J08J25j18j85M9L30l36l10M52K5n7Q4M2j90j07K86k26oj24J94k9k21L27
3282D8L2R3l05nQ3L86j55j57R3k55rM23N1k93L9P6j45k97K52J65l4l78M35K07
3306C50m54J45N2j5k92K51P7j90l6K27J9l39j51K32M04m33K07L5l29L03k39M50
3328B74m72J76P5j41R5k16L74j2q8q1J84k91j1J66N1k52LJ40K36j10k38J44o9
3351f3j51L46M4l42RK84j39m6M57l37j62qK27L1Mk63J95J50l00M2K92m04K4o9
3375a79L77j11k32r3K45k29OK09N9j63K79j73q4j84L60M91p26k67L27N6j78K00
3397a0J62J59l91kJ20k43j68J71K15Qk35K29P6J22l24J99p1J4p1L03m69M9L27
3420A70k63J10j98J95j47n0K24J0M2K6J04L2m60K71j63J51k83M59l41J00JN6K87
$$ plain form
3443 333 63 -103 -265 98 -79 26 247 50 -116 130 -233 -113 -77 40 -71 60 -38 191 200 -188 238
3464 238 -102 -29 -155 210 -114 -107 -378 118 163 -117 -19 29 449 -273 21 74 -98 145 103 -223 -180 126 128 4
3488 4 -150 245 1 157 -1 113 40 -137 -177 -11 -113 -78 104 226 -104 -229 23 126 133 87 -133 55 6
3511 6 -27 442 99 -249 136 -246 157 -93 181 188 -75 -165 464 -42 -94 -148 228 -83 -120 230 218 133 -69 257
3535 257 168 -212 -53 119 -212 -504 0 273 -46 197 20 -45 -176 -103 287 26 41 28 -58 164 -54 -128
3557 -128 -26 -19 -173 216 42 52 139 54 -48 -92 80 -98 81 -215 -60 93 -78 287 -6 -40 150 89 171
3580 171 -217 29 -128 -158 326 -359 -11 228 -54 -166 5 44 100 -379 74 170 -34 143 146 -314 4 103
3602 103 -112 67 162 36 -39 114 315 79 -234 -126 -94 -73 -150 74 -55 -81 -162 24 204 -216 433 127
$$ packed form
3443C33k70j66j62L63j77J05K21j97j66K46l63J20L6J17j11J31r8K29Rl88M26
3464B38l40P3j26L65l24Pk71M96M5k80R8M8M20p22K94N3j72K43m2l26M3L06Kj24
3488Dj54L95k44J56j58J14p3j77m0J66j02L5J82J22l30j25K52J03Pm6k20J88m9
3511Fl3M69l43l48L85l82M03k50K74Pk63r0O29n06n2n4L76l11l7L50j2q5k02L26
3535B57q9l80J59J72l31k92N04K73l19K43j77o5j31P3L90k61J5j3q6K22k18p4
3557a28J02Pj54L89j74J0Q7q5j02m4J72j78J79k96J55J53j71L65k93l4J90o1Q2
3580A71l88K46j57l0M84o85L48K39k82j12J71L9N6m79M53R6k04J77Lm60L18R9
3602A03k15J79R5j26p5J53K01k36l13J08L2K1p7K24j29k6q1J86J80m20O49l06
$$ plain form
3624 127 213 -8 -116 216 -54 -196 -140 225 -194 -91 61 -72 -116 95 204 -239 -335 8 544 -178 -197 112
3646 112 150 107 64 174 220 -9 -307 -69 154 40 -61 46 -116 113 -3 361 -168 -122 290 105 -10 147
3668 147 12 144 -434 367 115 -85 76 151 -34 -164 -22 -130 71 -11 27 236 -225 -17 137 63 77 -16
3690 -16 107 -167 233 139 -55 198 40 -20 184 69 -315 141 34 -70 53 -34 -75 -20 148 -233 -314 -201
$$ packed form
3624A27Q6k21j08L32k70j42N6L65m19J03J52j33m4K11J09m43r6L43N36p22j9L09
3646A12L8m3m3J10M6k29k98K38K23j14j01J07j62K29j16L64n29M6M12j85j15J57
3668A47j35J32n78Q01k52k00J61P5j85j30J42j08K01q2L8K09m61K08J54p4J4r3
3690a6J23k74M00r4j94K53j58o0K04j15l84M56j07j04J23q7m1N5J68l81q1J13
$$ [...]
8191C18
##END NTUPLES=NMR FID
##END=
